##TITLE=1H_K-415/2
 CDCl3, 8 sc, 
 20.11.2020
##JCAMPDX= 6.0         $$ Bruker NMR JCAMP-DX V2.0
##DATA TYPE= NMR FID
##DATA CLASS= NTUPLES
##ORIGIN= UXNMR, Bruker Analytische Messtechnik GmbH
##OWNER= root
$$ XWIN-NMR		Version 3.5
$$ Fri Nov 20 12:21:16 2020 Russian Standard Time (UT+4h)  she@DPX200
##.OBSERVE FREQUENCY= 200.1315066352
##.OBSERVE NUCLEUS= ^1H
##.DELAY= (6, 6)
##.ACQUISITION MODE= SIMULTANEOUS
##.ACQUISITION SCHEME= undefined
##.AVERAGES= 8
##.DIGITISER RES= 18
##SPECTROMETER/DATA SYSTEM= spect
##.PULSE SEQUENCE= zg30
##.SOLVENT NAME= CDCl3
##.SHIFT REFERENCE= (INTERNAL, CDCl3, 0, 15.7039)
##AUDIT TRAIL= $$ (NUMBER, WHEN, WHO, WHERE, WHAT)
$$ ##TITLE= Audit trail, XWIN-NMR		Version 3.5
$$ ##JCAMPDX= 5.01
$$ ##ORIGIN= Bruker BioSpin GmbH
$$ ##OWNER= she
$$ F:/spectra/data/she/nmr/H-F/1/audita.txt
$$ ##AUDIT TRAIL=  $$ (NUMBER, WHEN, WHO, WHERE, WHAT)
(   1,<2020-11-20 12:20:24.56 +0400>,<she>,<DPX200>,
      <created by zg, POWCHK disabled, PULCHK disabled
       configuration hash MD5:
       00 E9 B6 7A A2 85 ED C7 34 08 36 98 17 FE 4E 26
       data hash MD5: 16K
       D4 1B 16 D6 97 5B 03 DF DC BB 02 C3 AE 89 51 E5>)
$$ ##END=
$$ 
$$ hash MD5
$$ FF 19 F6 59 34 DC BA 94 F4 19 AD 7F D3 F2 B8 DC
##$RELAX= 
##$RELAX= 
##$RELAX= 
##$RELAX= 
##$RELAX= 
##$RELAX= 
$$ Bruker specific parameters
$$ --------------------------
##$DU= <F:/spectra>
##$EXPNO= 1
##$NAME= <H-F>
##$PROCNO= 1
##$TYPE= <nmr>
##$USER= <she>
##$AMP= (0..31)
100 100 100 100 100 100 100 100 100 100 100 100 100 100 100 100 100 100 
100 100 100 100 100 100 100 100 100 100 100 100 100 100 
##$AQSEQ= 0
##$AQ_mod= 1
##$AUNM= <au_zg>
##$AUTOPOS= <>
##$BF1= 200.13
##$BF2= 200.13
##$BF3= 200.13
##$BF4= 200.13
##$BF5= 200.13
##$BF6= 200.13
##$BF7= 200.13
##$BF8= 200.13
##$BYTORDA= 1
##$CFDGTYP= 0
##$CFRGTYP= 5
##$CHEMSTR= <none>
##$CNST= (0..31)
1 1 145 1 1 1 1 1 1 1 1 1 1 1 1 1 1 1 1 1 1 1 1 1 1 1 1 1 1 1 1 1 
##$CPDPRG= <>
##$CPDPRG1= <>
##$CPDPRG2= <>
##$CPDPRG3= <>
##$CPDPRG4= <mlev>
##$CPDPRG5= <mlev>
##$CPDPRG6= <mlev>
##$CPDPRG7= <mlev>
##$CPDPRG8= <mlev>
##$CPDPRGB= <>
##$CPDPRGT= <>
##$D= (0..31)
0 1.2 0 0 0 0 0 0 0 0.06 0 0.03 0 0 0 0 0.0002 0 0 0 0 0 0 0 0 0 0 0 0 
0 0 0 
##$DATE= 1605860424
##$DBL= (0..7)
120 120 120 120 120 120 120 120 
##$DBP= (0..7)
150 150 150 150 150 150 150 150 
##$DBP07= 0
##$DBPNAM0= <>
##$DBPNAM1= <>
##$DBPNAM2= <>
##$DBPNAM3= <>
##$DBPNAM4= <>
##$DBPNAM5= <>
##$DBPNAM6= <>
##$DBPNAM7= <>
##$DBPOAL= (0..7)
0.5 0.5 0.5 0.5 0.5 0.5 0.5 0.5 
##$DBPOFFS= (0..7)
0 0 0 0 0 0 0 0 
##$DE= 6
##$DECBNUC= <off>
##$DECIM= 32
##$DECNUC= <off>
##$DECSTAT= 4
##$DIGMOD= 1
##$DIGTYP= 9
##$DL= (0..7)
0 120 120 120 120 120 120 120 
##$DP= (0..7)
150 150 150 150 150 150 150 150 
##$DP07= 0
##$DPNAME0= <>
##$DPNAME1= <>
##$DPNAME2= <>
##$DPNAME3= <>
##$DPNAME4= <>
##$DPNAME5= <>
##$DPNAME6= <>
##$DPNAME7= <>
##$DPOAL= (0..7)
0.5 0.5 0.5 0.5 0.5 0.5 0.5 0.5 
##$DPOFFS= (0..7)
0 0 0 0 0 0 0 0 
##$DQDMODE= 0
##$DR= 18
##$DS= 0
##$DSLIST= <SSSSSSSSSSSSSSS>
$$ [...]
##$SUBNAM2= <"">
##$SUBNAM3= <"">
##$SUBNAM4= <"">
##$SUBNAM5= <"">
##$SUBNAM6= <"">
##$SUBNAM7= <"">
##$SUBNAM8= <"">
##$SUBNAM9= <"">
##$SW= 16.9725356469052
##$SWIBOX= (0..15)
0 0 2 0 0 0 0 0 0 0 0 0 0 0 0 0 
##$SW_h= 3396.73913043478
##$TD= 16384
##$TD0= 1
##$TE= 0
##$TE2= 300
##$TE3= 300
##$TEG= 300
##$TL= (0..7)
0 120 120 120 120 120 120 120 
##$TP= (0..7)
150 150 150 150 150 150 150 150 
##$TP07= 0
##$TPNAME0= <>
##$TPNAME1= <>
##$TPNAME2= <>
##$TPNAME3= <>
##$TPNAME4= <>
##$TPNAME5= <>
##$TPNAME6= <>
##$TPNAME7= <>
##$TPOAL= (0..7)
0.5 0.5 0.5 0.5 0.5 0.5 0.5 0.5 
##$TPOFFS= (0..7)
0 0 0 0 0 0 0 0 
##$TUNHIN= 0
##$TUNHOUT= 0
##$TUNXOUT= 0
##$USERA1= <user>
##$USERA2= <user>
##$USERA3= <user>
##$USERA4= <user>
##$USERA5= <user>
##$V9= 5
##$VALIST= <valist>
##$VCLIST= <CCCCCCCCCCCCCCC>
##$VD= 0
##$VDLIST= <DDDDDDDDDDDDDDD>
##$VPLIST= <PPPPPPPPPPPPPPP>
##$VTLIST= <TTTTTTTTTTTTTTT>
##$WBST= 1024
##$WBSW= 4
##$XGAIN= (0..3)
0 0 0 0 
##$XL= 0
##$YL= 0
##$YMAX_a= 299278
##$YMIN_a= -182226
##$ZGOPTNS= <>
##$ZL1= 120
##$ZL2= 120
##$ZL3= 120
##$ZL4= 120
##$ABSF1= 10
##$ABSF2= 0
##$ABSG= 5
##$ABSL= 3
##$ALPHA= 0
##$AQORDER= 0
##$ASSFAC= 0
##$ASSFACI= 0
##$ASSFACX= 0
##$ASSWID= 0
##$AUNMP= <proc_1d>
##$AZFE= 0.1
##$AZFW= 0.1
##$BCFW= 1
##$BC_mod= 2
##$BYTORDP= 1
##$COROFFS= 0
##$CY= 11.3945322036743
##$DATMOD= 1
##$DC= 2
##$DFILT= <>
##$DTYPP= 0
##$F1P= 15.9154993809931
##$F2P= -4.1035820241983
##$FCOR= 0.5
##$FTSIZE= 0
##$FT_mod= 4
##$GAMMA= 1
##$GB= 0.15
##$INTBC= 1
##$INTSCL= 1
##$ISEN= 128
##$LB= 0.24
##$LEV0= 0
##$LPBIN= 0
##$MAXI= 10000
##$MC2= 0
##$MEAN= 0
##$ME_mod= 0
##$MI= 1.114404
##$NCOEF= 0
##$NC_proc= 0
##$NLEV= 6
##$NOISF1= 3.799351
##$NOISF2= 2.8
##$NSP= 1
##$NTH_PI= 0
##$NZP= 0
##$OFFSET= 15.70392
##$PC= 1
##$PHC0= -11049.19
##$PHC1= 13.60089
##$PH_mod= 1
##$PKNL= yes
##$PPARMOD= 0
##$PSCAL= 0
##$PSIGN= 0
##$REVERSE= no
##$SF= 200.130013532006
##$SI= 16384
##$SIGF1= 3
##$SIGF2= 2
##$SINO= 400
##$SIOLD= 16384
##$SREGLST= <1H.CDCl3>
##$SSB= 0
##$STSI= 0
##$STSR= 0
##$SW_p= 3612.71676300578
##$SYMM= 0
##$S_DEV= 0
##$TDeff= 0
##$TDoff= 0
##$TI= <>
##$TILT= no
##$TM1= 0
##$TM2= 0
##$TOPLEV= 0
##$USERP1= <user>
##$USERP2= <user>
##$USERP3= <user>
##$USERP4= <user>
##$USERP5= <user>
##$WDW= 1
##$XDIM= 8192
##$YMAX_p= 0
##$YMIN_p= 0
$$ End of Bruker specific parameters
$$ ---------------------------------
##NTUPLES= NMR FID
##VAR_NAME=  TIME,          FID/REAL,        FID/IMAG
##SYMBOL=    X,             R,               I
##VAR_TYPE=  INDEPENDENT,   DEPENDENT,       DEPENDENT
##VAR_FORM=  AFFN,          ASDF,            ASDF
##VAR_DIM=   8192,          8192,            8192
##UNITS=     SECONDS,       ARBITRARY UNITS, ARBITRARY UNITS
##FACTOR=    0.0002944,     1,               1
##FIRST=     0,             0,               0
##LAST=      2.4114304,     0,               0
##MIN=       0,             -182226,         0
##MAX=       2.4114304,     299278,          0
$$ Real data points
##PAGE= N=1
##DATA TABLE= (X++(R..R)), XYDATA
$$ plain form
0 0 0 0 0 0 0 0 0 0 0 0 0 0 2 -8 8 -8 8 -10 16 -16 23 -24 32 -36 40 -48 56 -65 78 -87 102 -115 131 -149 167
35 167 -189 213 -239 268 -299 333 -369 410 -456 503 -557 614 -678 748 -822 909 -1000 1101
53 1101 -1215 1341 -1485 1645 -1830 2044 -2296 2595 -2960 3415 -4002 4794 -5937 7727 -11020
68 -11020 19244 -91990 -165552 -182226 -138450 -85673 -172065 -97042 -75652 -71238 -53531 -96471
80 -96471 -74700 -33828 -89293 -64725 -79745 -74507 -25366 -68481 -88811 -51599 -50642 -42869 -47246
93 -47246 -71031 -25392 1853 -23478 -10112 -25328 -674 22789 -23786 -23494 -7994 -29424 -13659
106 -13659 -43934 -65428 -10946 -34605 -30962 -17280 -32507 25229 13897 -12618 9972 -8469
118 -8469 -5262 -8171 -64679 -51135 -37651 -54885 -31144 -45582 -21774 14904 -1113 5071 8428
$$ packed form
0@%%%%%%%%%%%%Kj0J6j6J6j8K6l2L9m7N6o8P6q8J04j21J43j65J89k17K46k80L16
35A67l56M02m52N07n67O32p02P79q66R59j060J171j292J426j570J731j909K101
53A101k316K556k826L130l475L874m340M891n555O375p417Q796j0731J3664j8747
68a1020L0264j11234p3562j6674M3776N2777q6392P5023K1390M414J7707m2940
80i6471K1771M0872n5465K4568j5020N238M9141m3115k0330L7212R57P773m377
93d7246k3785M5639K7245k5331J3366j5216K4654K3463m6575K92J5500k1430J5765
106a3659l0275k1494N4482k3659L643J3682j5227N7736j1332k6515K2590j8441
118h469L207k909n6508J3544J3484j7234K3741j4438K3808L6678j6017O184L357
$$ plain form
131 8428 4149 13105 -9526 -42244 -26803 -37927 -47353 -42917 -59171 -25719 -3453 -11793 4097
144 4097 14131 17833 34391 5083 -10450 -1394 -29277 -23643 -41542 -50413 -9594 -12973 -4475
157 -4475 18513 16068 36924 43596 13921 23220 14406 2025 1028 -33119 -22872 -16609 -27089 -12652
171 -12652 -13051 -6268 19824 12329 5477 20193 6931 10047 -1876 -24297 -14974 -22501 -26611 -20801
185 -20801 -25747 -11890 5464 -9432 485 7538 -77 18374 2880 2792 18690 10916 17948 16302
199 16302 9127 26401 20791 8784 19702 1936 6356 8914 -14018 -2352 -1534 -2706 3990 -2446
213 -2446 3520 15182 5006 8021 4812 -8856 2229 -17170 -28143 -19119 -25092 -18851 -11275 -13406
227 -13406 188 9796 4058 11818 4428 3903 7930 -12126 -8605 -11489 -17119 -4212 -6532 -5029
$$ packed form
131H428m279Q956k2631l2718J5441j1124r426M436j6254L3452K2266q340J5890
144D097J0034L702J6558k9308j5533R056k7883N634j7899q871M0819l379Q498
157d475K2988k445K0856O672k9675R299q814j2381r97l4147J0247O263j0480J4437
171a2652l99O783K6092p495o852J4716j3262L116j1923k2421R323p527m110N810
185b0801m946J3857J7354j4896R917P053p615J8451j5494q8J5898p774P032j646
199A6302p175J7274n610j2007J0918j7766M420K558k2932J1666Q18j172O696o436
213b446N966J1662j0176L015l209j3668J1085j9399j0973R024n973O241P576k131
227a3406J3594R608n738P760p390n25M027k0056L521k884n630J2907k320J503
$$ plain form
241 -5029 17245 17159 18090 28499 16584 24009 15993 1389 -1105 -13804 -13606 -13853 -21953 -11699 1104
256 1104 -1322 13408 12325 10510 22047 6316 1608 -3613 -15722 -17446 -25041 -31315 -23113 -20676
270 -20676 -15230 -1323 -6224 6941 10936 1720 6817 -1731 -5968 -6216 -15195 -18933 -13639 -15983 -7534
285 -7534 -3096 -3741 12442 6960 7987 10600 979 3664 2201 -8137 -6252 -4267 -8370 1512 -2945
300 -2945 3346 12028 7462 14850 9493 3913 9393 1055 -3977 1826 -3632 -846 4804 -1664 9539
315 9539 9116 8541 13073 4043 6710 5119 -3185 -2219 -277 -6019 2825 450 -1099 7944 3164 7722
331 7722 5614 2130 2699 -1267 -7329 -6320 -10830 -8793 -1490 -7006 3326 7249 4927 11348 6399
346 6399 3529 4048 -2062 -6883 -7537 -13412 -8164 -8167 -8162 3401 1034 7900 10756 6455 9728 8262 2147
$$ packed form
241e029K2274q6R31J0409j1915P425q016j4604k494j2699J98k47q100J0254J2803
256A104k426J4730j083j815J1537j5731m708n221j2109j724p595o274Q202K437
270b0676N446J3907m901J3165L995r216N097q548m237k48q979l738N294k344Q449
285g534M438o45J6183n482J027K613r621K685j463j0338J885J985m103R882m457
300b945O291Q682m566P388n357n580N480q338n032N803n458K786N650o468J1203
315I539m23n75M532r030K667j591q304R66J942n742Q844k375j549R043m780M558
331G722k108l484N69l966o062J009m510K037P303n516J0332L923k322O421m949
346F399k870N19o110m821o54n875N248lNJ1563k367O866K856m301L273j466o115
$$ plain form
363 2147 2109 -2277 -6922 -2588 -8814 -4022 433 698 10572 8942 10090 13840 9113 5752 6753 -342
379 -342 489 2452 -1894 5891 6490 12038 17729 15870 20604 19252 13993 13974 9328 2034 6994 835
395 835 884 5894 3515 10798 12640 15965 20527 19365 18672 18413 9741 7166 5648 -4049 -203 -2787
411 -2787 -3643 2670 2158 5113 8237 7982 7106 5139 -1163 -399 -7025 -9516 -6204 -11648 -5676 -2508
427 -2508 -4974 -746 1049 -1130 1838 -159 -4092 -3149 -10856 -9270 -12803 -14730 -7391 -8512 -3592
442 -3592 3128 4240 7916 12363 8480 10555 8631 3280 5168 -736 1341 3102 2604 7936 9599
457 9599 10335 14159 13401 10504 14296 9164 8800 8752 3766 5555 3333 2902 4941 4277 5501 6856 2590
474 2590 3355 1618 -6314 -3964 -10078 -13248 -11554 -14972 -12822 -10551 -9381 -6120 -4638 -6491 -4286
$$ packed form
363B147l8m386m645M334o226M792M455K65R874j630J148L750m727l361J001p095
379c42Q31J963m346P785N99N548N691j859M734j352n259j9m646p294M960o159
395H35M9N010k379P283J842L325M562j162o93k59q672k575j518r697L846k584
411b787q56O313n12K955L124k55q76j967o302P64o626k491L312n444N972L168
427b508k466M228J795k179K968j997l933R43p707J586l533j927P339j121M920
442c592O720J112L676M447l883K075j924n351J888n904K077J761m98N332J663
457I599P36L824p58k897L792n132l64m8m986J789k222m31K039o64J224J355m266
474B590P65j737p932K350o114l170J694l418K150K271J170L261J482j853K205
$$ plain form
489 -4286 -9894 -10914 -11202 -17639 -13850 -14563 -15021 -11135 -9740 -8436 -3817 -2873 -2346 190 -2326 -1047
505 -1047 -4953 -5861 -4399 -7665 -4246 -1378 -1374 2875 8435 6989 11625 12136 8590 8983 3944 2368 -681
522 -681 -1804 453 1429 3837 9419 10449 12306 16909 13255 15012 13628 8865 7285 2954 1671 -454
538 -454 -658 1314 4816 5264 9301 10754 10994 14201 10976 9869 6957 3527 -373 -2233 -2725 -1665
554 -1665 310 936 6199 4977 6504 8508 3891 4831 2477 -1507 -2881 -5508 -7708 -6670 -7957 -6474
570 -6474 -4859 -5709 -1421 -4034 -3609 -2709 -6719 -6409 -7359 -10023 -9500 -8547 -9174 -4438 -3202 -159 3259
587 3259 2728 5702 3922 2984 3335 1468 1477 3807 3002 4288 8923 7234 11774 13041 12375 14369 13262
604 13262 12750 10650 9653 8920 9001 7368 10256 9118 8263 12027 8889 10182 9445 6327 4655 2278 -1404
$$ packed form
489d286n608j020k88o437L789p13m58L886J395J304M619R44N27K536k516J279
505a047l906r08J462l266L419K868MM249N560j446M636N11l546L93n039j576l049
522f81j123K257R76K408N582J030J857M603l654J757j384m763j580m331j283k125
538d54k04J972L502M48M037J453K40L207l225j107k912l430l900j860m92J060
554a665J975O26N263j222J527K004m617R40k354l984j374k627k200J038j287J483
570f474J615q50M288k613M25R00m010L10r50k664N23R53o27M736J236L043L418
587C259n31K974j780r38L51j867RK330q05J286M635j689M540J267o66J994j107
604A3262n12k100r97p33Q1j633K888j138q55L764l138J293p37l118j672k377l682
$$ plain form
621 -1404 -2842 -3763 -3896 -1431 -2558 1893 2619 1805 4656 2266 1299 234 -2516 -5624 -5856 -8012 -7188
638 -7188 -5468 -4460 27 622 4303 6361 5526 7229 6614 3286 2350 930 -3504 -2601 -4118 -3011
654 -3011 -1251 38 3513 2996 4089 4887 2513 299 681 -4097 -4417 -4593 -7748 -4860 -4328 -2791 246
671 246 1899 3548 3366 3506 3531 2035 -489 602 -2487 -2141 -1982 -2448 -224 1633 3055 5363 6368
688 6368 5890 5969 4217 2384 2532 342 862 -105 -1109 -182 -580 -309 2233 1800 1054 1957 -1403 -138
706 -138 -1592 -3707 -1487 -3301 -2200 -1490 -2329 -722 -628 -1294 -711 -1790 -2909 -2579 -5715 -4492 -5009
723 -5009 -5498 -3065 -3002 -1635 -310 211 -4 1241 -410 -1477 -1110 -4510 -3475 -4720 -4126 -2688 -1989
740 -1989 353 1582 2188 2855 2981 1437 2115 -468 -1236 -1221 -3731 -2342 -1984 -698 2063 3492 4724
$$ packed form
621a404j438r21j33K465j127M451P26q14K851k390r67j065k750l108k32k156Q24
638g188J720J008M487N95L681K058q35J703o15l328r36j420m434R03j517J107
654c011J760J289L475n17J093P98k374k214L82m778l20j76l155K888N32J537L037
671B46J653J649j82J40K5j496k524J091l089L46J59m66K224J857J422K308J005
688F368m78P9j752j833J48k190N20r67j004R27l98K71K542m33p46R03l360J265
706a38j454k115K220j814J101P10q39J607R4o66N83j079j119L30l136J223n17
723e009m89K433O3J367J325N21k15J245j651j067L67l400J035j245N94J438O99
740a989K342J229O06O67J26j544O78k583p68J5k510J389L58J286K761J429J232
$$ plain form
757 4724 4880 5229 4813 3063 627 1306 -1604 -2909 -2077 -2735 -1898 449 1087 3358 5512 5604 5960 4313
775 4313 3314 2151 -1388 -1182 -3013 -4215 -3007 -2289 -1918 858 2392 2351 4394 2827 2469 988 -724
792 -724 -1118 -3267 -2942 -3439 -3482 -3056 -1082 -1548 158 1428 -588 410 -1552 -1657 -3980 -4151 -3612 -4090
810 -4090 -3508 -1775 -718 -96 1954 1186 2534 2165 192 379 -1174 -1860 -2157 -1761 -1711 -55 -273 1354
828 1354 2882 1550 3833 2232 2254 2622 462 189 83 -957 -772 721 20 1710 1308 2090 1822 10
846 10 792 -896 -1202 -1295 -2427 -2523 -700 454 904 3275 2820 4195 3708 2950 2879 760 931 -820 -1365
865 -1365 -1291 -615 -1432 816 2445 2259 4553 3994 3849 3059 1994 455 -814 -2207 -2816 -3567 -3637 -2046
883 -2046 -2786 -798 -323 -247 785 -1271 -1122 -2307 -3168 -3497 -2944 -3445 -2202 -1214 -1459 1433 1454 3388
$$ packed form
757D724J56L49m16j750k436O79k910j305Q32o58Q37K347O38K271K154R2L56j647
775D313r99j163l539K06j831j202J208P18L71K776J534m1K043j567l58j481j712
792g24l94k149L25m97m3M26J974m66J706J270k016R98j962j05k323j71N39m78
810d090N82J733J057O22K050p68J348l69j973J87j553o86k97L96N0J656k18J627
828A354J528j332K283j601K2L68k160k73j06j040J85J493p01J690m02P82k68j812
846A0P82j688l06r3j132r6J823J154M50K371m55J375m87p58p1k119J71j751n45
865a365P4O76q17K248J629j86K294n59j45p90j065j539j269j393o09p51p0J591
883b046p40J988M75P6J032k056J49j185q61l29N53n01J243R88k45K892K1J934
$$ plain form
901 3388 3406 3713 3042 2323 1238 898 1028 295 871 -304 2087 2416 3180 4402 3695 4202 3772 2563 754
920 754 547 -1055 -2417 -1645 -2004 -735 -1402 -338 283 -533 -71 -432 -681 -972 -1811 -2713 -1678 -2144 -1950
939 -1950 -378 -126 1110 760 2526 2063 1918 1779 1496 724 209 409 158 1334 2041 2032 4188 3799 4450
958 4450 4315 4262 3570 2522 1123 901 244 -435 187 -710 665 1385 1989 2926 2645 2269 1573 1787 -19
977 -19 100 -959 -137 -238 -930 1019 377 2223 3125 3937 2525 3798 1805 1577 1094 69 979 210
995 210 1624 2090 2154 3191 3525 3176 4538 3532 2762 2303 954 104 163 -459 199 462 983 1172 2286
1014 2286 2897 3379 2542 2437 2288 391 345 -942 -1126 122 -205 1001 734 2016 1912 2562 1371 2276
1032 2276 1549 616 512 -1216 166 -879 -361 711 1588 1172 1794 2109 1783 1504 376 979 -1025 -766
$$ packed form
901C388J8L07o71p19j085l40J30p33N76j175K391L29P64J222p07N07m30j209j809
920G54k07j602j362P72l59J269o67J064O21q16M62l61k49k91q39r02J035m66J94
939a950J572K52J236l50J766m63j45j39k83p72n15K00k51J176P07rK156l89O51
958D450j35n3o92j048j399k22o57o79O22q97J375P20O04R37k81l76o96K14j806
977a9J19j059Q22j01o92J949o42J846R02Q12j412J273j993k28m83j025R10p69
995B10J414M66O4J037L34l49J362j006p70m59j349q50N9o22O58K63N21J89J114
1014B286O11M82q37j05j49j897m6j287j84J248l27J206k67J282j04O50j191R05
1032B276p27r33j04j728J382j045N18J072Q77m16O22L15l26k79j128O03k004K59
$$ plain form
1050 -766 -797 -1232 -999 122 464 2387 2033 963 1597 1931 1403 951 -724 -504 -868 -535 -604 -1037 -59
1069 -59 1353 338 945 1619 715 1233 328 -34 -547 -171 -1188 -600 -565 -274 457 899 1753 2606 931
1088 931 2067 -157 -662 -1097 -1760 -823 -1395 274 -232 143 2093 1734 962 2897 1184 181 547 -478
1106 -478 -793 -747 -422 -1077 -738 69 -565 937 899 1712 136 842 433 -729 -1238 -680 -1570 -1220 -681 -515
1126 -515 3 941 739 1488 818 1095 168 -956 -525 -768 -2018 -536 -347 -323 1400 1252 2677 2587 1516
1145 1516 1185 102 791 -266 -752 -1104 -697 -1054 214 396 478 1993 1107 1682 1388 923 398 53 -446
1164 -446 -751 -1100 -1023 -269 -818 765 1005 668 1347 337 414 -180 -554 -861 -1077 -1145 -676 -444 -615 865
1184 865 470 1196 1513 970 1181 530 -616 -864 -686 -1297 -573 -512 -272 498 777 2080 1370 1239 1059 1266
$$ packed form
1050g66l1m35K33J121L42J923l54j070O34L34n28m52j675K20l64L33o9m33R78
1069e9J412j015O07O74r04N18r05l62n13L76j017N88L5K91P31M42Q54Q53j675
1088I31J136k224n05m35o63R37n72J669n06L75J950l59p72J935j713j003L66j025
1106d78l15M6L25o55L39Q07o34J502l8Q13j576P06m09j162n09N58q90L50N39J66
1126e15N18R38k02P49o70K77r27j124M31k43j250J482J89K4J723j48J425r0j071
1145A516l31j083O89j057m86l52M07l57J268J82Q2J515q86N75k94m65n25l45m99
1164d46l05l49P7P54n49J583K40l37O79j010P7n94l74l07k16o8M69K32j71J480
1184H65l95P26L17n43K11o51j146k48J78o11P24O1K40P70K79J303p10j31j80K07
$$ plain form
1204 1266 -302 287 -1164 -1473 -117 -1182 852 224 811 1380 1102 1142 728 648 384 -65 -539 -420 -640
1223 -640 -728 315 -4 671 855 1132 719 663 413 -55 -416 -1270 -1178 -1883 -1197 -1271 -977 -66 337 780 594
1244 594 456 144 -69 -477 -929 -1550 -2093 -1492 -1967 -852 -532 -39 559 277 176 303 267 -527 -58 -632
1264 -632 -677 -665 -566 327 173 782 1037 1099 975 1058 248 102 429 -463 -151 -392 231 151 228 1123 1140 1511 1553
1287 1553 1256 811 900 -320 -326 -183 -820 -171 -371 330 446 889 1053 1358 1294 1044 712 -171 433 -470 -220
1308 -220 -399 -137 846 418 1424 1170 1420 1217 634 -263 -376 -247 -1807 -555 -1200 -758 -458 265 419
1327 419 1013 681 523 1054 349 494 -1175 -1417 -1536 -959 -307 -718 -99 5 799 746 1126 782 656 618
1347 618 904 -114 -723 48 -627 -175 -751 783 -147 292 1151 -84 -111 170 -651 -97 -928 -1040 -962 -600
$$ packed form
1204A266j568N89j451l09J356j065K034o28N87N69k78M0m14q0k64m49m74J19k20
1223f40q8J043l19O75J84K77m13n6k50m68l61q54R2p05O86p4K94R11M03M43j86
1244E94j38l12k13m08m52o21n43O01m75J115L20M93N98k82j01J27l6p94M69n74
1264f32m5J2R9Q93j54O09K55O2j24Q3q10j46L27q92L12k41O23q0P7Q95J7L71M2
1287A553k97m45Q9j220oJ43o37O49k00P01J16M43J64L05o4k50l32q83O04r03K50
1308b20j79K62R83m28J006k54K50k03n83q97j13J29j560J252o45M42L00P23J54
1327D19N94l32j58N31p05J45j669k42j19N77O52m11O19J04P94n3L80l44j26l8
1347F18K86j018o09P71o75M52n76J534r30M39Q59j235k7K81q21N54q31j12P8L62
$$ plain form
1367 -600 -346 -724 -498 -267 -25 -420 320 -704 -300 -411 -993 -1340 -1099 -676 -581 -240 -156 -134 645 35 129
1388 129 -152 243 -595 -695 -218 -523 -248 -129 -500 167 -154 61 505 249 292 -583 -522 -301 -206 -316 577
1409 577 -424 317 333 1158 865 708 -270 867 33 -725 -248 -792 -908 -671 223 311 1776 932 1806 1515
1429 1515 885 1317 723 504 271 -254 -382 29 406 512 1021 1183 1162 1042 1362 1130 944 652 557 469 -473
1450 -473 -81 -187 -356 -262 243 393 1087 874 420 178 -98 -656 -1128 -445 -1161 -851 -1075 -725 -190 -68
1470 -68 535 675 -154 776 24 -474 -554 -468 -585 -216 -1039 -452 -585 -422 588 615 742 -36 401 -4 -38
1491 -38 -419 -715 -288 -333 -610 -352 -425 29 221 583 0 146 -28 -299 -523 -215 78 -980 -245 295 692
1512 692 592 6 575 242 313 129 294 -258 331 262 557 317 943 728 464 1131 843 1420 884 183 500
$$ packed form
1367f00K54l78K26K31K42l95P40j024M04j11n82l47K41M23R5L41Q4K2P79o10R4
1388A29k81L95q38j00M77l05K75J19l71O67l21K15M44k56M3q75O1K21R5j10Q93
1409E77j001P41J6Q25k93j57r78J137q34p58M77n44j16K37Q94Q8J465q44Q74k91
1429A515o30M32n94k19k33n25j28M11L77J06N09J62k1j20L20k32j86k92r5q8r42
1450d73L92j06j69R4N05J50O94k13m54k42k76n58m72O83p16L10k24L50N35J22
1470f8O03J40q29R30p52m98q0Q6j17L69q23N87j33J63J010K7J27p78M37m05l4
1491c8l81k96M27m5k77K58p3M54J92L62n83J46j74k71k24L08K93j058P35N40L97
1512F92j00n86N69l33P1j84J65n52N89o9K95k40O26k15k64O67k88N77n36p01L17
$$ plain form
1533 500 -379 -113 -730 193 17 456 465 377 670 698 281 448 500 -303 220 -1044 -1056 -882 -916 -320 -409 381
1555 381 81 126 231 148 -251 -857 -762 -1061 -503 -1177 -725 -1187 218 522 445 363 601 657 796 442 -482 -350
1577 -350 -193 -455 -513 -663 -468 19 549 142 213 777 857 630 -35 391 -34 7 -462 -1146 -348 197 117 471
1599 471 1097 357 487 1026 -391 -64 0 -1332 -155 -157 -77 -343 306 195 488 347 440 -88 -69 -153 -284
1620 -284 -411 -663 -191 -175 -187 -121 276 303 294 239 94 245 -458 41 -576 -374 -674 -105 190 -121 121 353
1642 353 169 -421 -39 37 52 231 -447 -461 -374 -329 -304 -47 -57 878 666 139 631 -166 125 -355 -57 -69 -186
1665 -186 -269 -466 571 -431 698 532 609 622 303 246 -172 -264 115 -259 -323 -122 -356 -203 370 283 349 474
1687 474 498 -39 -145 60 -232 12 -299 -247 -337 -51 51 51 537 -20 492 114 -167 -342 -552 -653 -718 -406
$$ packed form
1533E00q79K66o17R23j76M39Rq8K93K8m17J67N2q03N23j264j2J74l4N96q9P90
1555C81l00M5J05q3l99o06R5k99N58o74M52m62J405L04p7q2K38N6J39l54r24J32
1577c50J57k62n8j50J95M87N30m07P1N64Q0k27o65M26m25M1m69o84P98N45q0L54
1599D71O26p40J30N39j417L27O4j332J177kQ0k66O49j11K93j41R3n28J9q4j31
1620b84j27k52M72J6j2O6L97K7rn5j45J51p03M99o17K02l00N69K95l11K42K32
1642C53j84n90L82P6J5J79o78j4Q7M5K5K57j0R35k12n27M92p97K91m80K98j2j17
1665a86q3j97J037j002J129j66P7J3l19n7m18r2L79l74o4K01k34J53N73q7O6J25
1687D74K4n37j06K05k92K44l11N2r0K86J02%M86n57N12l78k81j75k10j01o5L12
$$ plain form
1709 -406 -416 -250 -279 -48 87 -63 31 67 -107 -313 -472 -390 -825 -495 -299 -236 6 282 -263 232 173 -122
1731 -122 89 -37 -206 -386 -222 -539 -467 -205 112 172 -72 399 9 209 -242 -507 -285 -172 -518 -481 -432
1752 -432 -136 50 385 219 275 215 100 -299 88 29 -297 -593 -353 -306 -432 26 -59 330 -100 552 219 107
1774 107 317 -235 -209 -174 -390 -209 392 249 258 662 560 756 358 812 279 329 235 -59 262 188 472 355
1796 355 638 572 864 895 867 567 377 514 120 -19 -187 41 -100 268 233 145 264 647 709 388 409 198
1818 198 187 -70 -334 -23 -142 11 -17 -61 162 10 387 236 361 18 233 -169 -331 -37 -458 -80 21
1839 21 -26 222 343 411 156 290 246 -244 -353 -61 -393 -104 -458 -124 249 59 405 241 183 100 81 80 178
1862 178 -74 -343 -184 -424 -187 -241 -20 507 212 207 158 269 43 11 -91 153 238 -87 402 319 369 579 730
$$ packed form
1709d06j0J66k9K31J35j50R4L6j74k06j59Q2m35L30J96O3K42K76n45M95n9k95
1731a22K11j26j69j80J64l17P2K62L17O0k44M71l90K00m51k65K22J13l46L7M9
1752d32K96J86L35j66N6o0j15l99L87n9l26k96K40M7j26M58q5L89m30O52l33j12
1774A07K10n52K6L5k16J81O01j43RM04j02J96l98M54n33N0r4k94L21p4K84j17
1796C55K83o6K92L1k8l00j90J37l94j39j68K28j41L68l5q8J19L83O2l21K1k11
1818A98j1k57k64L11j19J53k8m4K23j52L77j51J25l43K15m02j62K94m21L78J01
1839B1m7K48J21O8k55J34m4m90j09K92l32K89l54L34L73j90L46j64n8q3j9jR8
1862A78k52k69J59k40K37n4K21N27k95nm9J11k26l2j02K44Q5l25M89q3N0K10J51
$$ plain form
1885 730 461 713 511 303 269 83 350 45 648 749 353 642 734 562 816 903 737 572 517 30 274
1906 274 -19 368 167 474 374 329 502 389 383 109 646 325 248 58 195 -90 162 627 146 638 483
1927 483 172 680 471 547 199 207 241 35 116 -64 159 464 463 316 209 545 512 75 196 -211 -40 9 -416
1950 -416 -290 -535 134 -111 40 -32 10 -131 97 7 -326 -450 -566 -276 -56 -553 -163 -91 324 -88 41
1971 41 -48 55 -115 -217 -153 -442 -202 -320 -44 109 -56 18 101 414 164 190 292 95 -352 -126 -301 -362
1993 -362 -233 -203 61 -9 -96 -102 -195 374 -390 -96 -48 -299 -301 -386 -83 -315 -46 -121 -46 -187 1 -38 -139 127
2017 127 -191 -135 -280 -237 -240 2 -269 -1 8 -85 455 -153 -52 80 -52 58 168 -279 -170 70 -323 317
2039 317 201 427 131 40 340 -148 413 -125 356 -305 69 -273 -130 207 -193 35 -42 566 290 -70 383
$$ packed form
1885G30k69K52k02k08l4j86K67l05O03J01l96K89R2j72K54Q7j66j65n5m87K44
1906B74k93L87k01L07j00m5J73j13ok74N37l21p7j90J37k85K52M65m81M92j55
1927D83l11N08k09P6l48QL4k06Q1j80K23L05jj47j07L36l3m37J21m07J71M9m25
1950d16J26k45O69k45J51p2M2j41K28r0l33j24j16K90K20m97L90P2M15m12J29
1971D1q9J03j70j02O4k89K40j18K76J53j65P4Q3L13k50K6J02j97m47K26j75o1
1993c62J29L0K64p0q7or3N69p64K94M8k51kq5L03k32K69p5P5j41J88l9j01K66
2017A27l18N6j45M3lK42k71K68Rr3N40o08J01J32j32J10J10m47J09K40l93O40
2039C17j16K26k96r1L00m88N61n38M81o61L74l42J43L37m00K28p7O08k76l60M53
$$ plain form
2060 383 -171 -112 42 62 -607 147 -166 -31 165 2 291 186 153 -91 224 271 22 -761 -350 -215 -90
2081 -90 248 426 -242 -10 166 164 93 17 -246 -146 -56 -720 -18 -165 85 -106 -54 -245 207 162 40 -140 -402
2104 -402 220 -302 -514 -91 -280 -63 -142 33 -161 85 -205 -36 -110 -117 -235 24 537 169 115 370 339 -68
2126 -68 260 31 63 200 127 255 -116 -149 -250 -413 47 48 361 309 162 421 211 -123 89 171 -19 -19 -158
2149 -158 16 47 -53 -37 -204 -211 -23 285 -145 190 46 -31 208 404 -178 29 -11 -159 171 390 33 -259
2171 -259 37 -284 -63 -197 -161 79 -120 -375 -333 -271 10 -216 -161 -38 133 -134 -42 -62 -192 -407 211 101
2193 101 -139 -327 224 -5 -109 72 222 161 168 315 -256 -214 -345 -267 -470 121 -27 350 -155 -102 193 -146
2215 -146 -9 -106 -263 -443 -327 -490 -146 -351 -21 -3 -94 -114 111 12 -144 80 124 41 -114 -487 -160 -347
$$ packed form
2060C83n54N9J54K0o69P54l13J35J96j63K89j05l3k44L15M7k49p83M11J35J25
2081i0L38J78o68K32J76kp1p6k63J00R0o64P02j47K50j91N2j91M52m5j22j80k62
2104d02O22n22k12M23j89K17p9J75j94K46k90J69p4pj18K59N13l68n4K55l1m07
2126f8L28k29L2J37p3J28l71l3j01j63M60JL13n2j47K59k10l34K12Q2j90%j39
2149a58J74L1j00J6j67pJ88L08m30L35j44p7K39J96n82K07m0j48L30K19l57k92
2171b59K96l21K21j34L6K40j99k55M2O2K81k26N5J23J71k67R2k0j30k15O18j10
2193A01k40j88N51k29j04J81J50o1PJ47n71M2j31P8k03N91j48L77n05N3K95l39
2215a46J37r7j57j80J16j63L44k05L30J8r1k0K25r9j56K24M4q3j55l73L27j87
$$ plain form
2237 -347 65 -84 251 235 382 -83 20 -258 108 270 13 299 213 48 57 -99 -185 95 180 -59 106 -51
2259 -51 260 94 -419 263 -154 235 -177 151 366 476 469 326 761 704 707 520 306 752 631 359 549 507
2281 507 510 578 390 536 800 304 366 193 51 285 590 145 -425 797 -200 -59 -280 106 -27 312 403
2302 403 -116 -180 -6 -157 100 -22 -73 406 364 100 203 90 329 226 384 296 46 102 119 101 25 163 -29
2325 -29 75 94 190 130 275 310 -243 71 -19 -184 -245 -199 -182 -172 125 50 1 -102 137 -165 171 -131 -89 -159 -136
2350 -136 -354 -37 -28 -8 179 236 86 65 66 84 42 46 -30 -17 76 -95 -41 -98 -15 211 22 137 12 42 -68 -162
2376 -162 -284 -309 -161 -331 -52 -347 -188 -157 -111 68 -100 -175 -161 -110 -319 53 -18 -248 -21 100 322 140
2398 140 168 152 450 199 123 357 -57 39 28 258 414 280 143 370 241 117 427 150 251 -27 304 -152
$$ packed form
2237c47M12j49L35j6J47m65J03k78L66J62k57K86q6j65Rj56q6K80Q5k39J65j57
2259e1L11j66n13O82m17L89m12L28K15J10pj43M35n7Lj87k14M46j21k72J90m2
2281E07LO8j88J46K64m96O2j73j42K34L05m45n70J222r97J41k21L86j33L39R1
2302D03n19o4J74j51K57j22n1M79m2k64J03j13K39j03J58q8k50N6J7j8p6J38j92
2325b9J04J9R6o0J45L5n53L14r0j65o1M6J7J0K97p5m9j03K39l02L36l02M2p0K3
2350a36k18L17RK0J87N7j50k1JJ8m2Mp6J3R3j71N4n7Q3K26j89J15j25L0j10r4
2376a62j22k5J48j70K79k95J59L1M6J79j68p5J4N1k09L72p1k30K27J21K22j82
2398A40K8j6K98k51p6K34m14R6j1K30J56j34j37K27j29j24L10k77J01k78L31m56
$$ plain form
2420 -152 -245 370 -81 200 377 -32 102 42 -26 83 94 60 253 -19 204 -17 145 357 253 380 213 238
2442 238 138 47 276 350 136 -36 -156 110 274 236 392 329 296 268 140 305 314 196 162 292 59 25 -199
2465 -199 -221 663 33 242 -70 -67 111 102 190 216 297 72 314 64 198 288 92 306 359 131 40 131 275 87
2489 87 142 42 248 50 292 398 571 131 349 100 237 305 174 100 -7 -93 44 119 179 21 -4 8 110
2512 110 258 -81 97 -43 6 -56 -92 -244 30 -130 73 -24 177 228 61 205 -74 -53 119 -5 -1 -277 -44
2535 -44 -33 24 126 26 77 140 168 -20 338 -85 344 -291 -114 -149 -74 89 86 -51 349 175 -59 36 131 74
2559 74 20 56 31 52 1 -273 -152 225 98 -52 7 316 190 52 -87 23 268 -62 -11 74 -141 106 -242
2582 -242 -34 282 275 -3 37 -123 -89 98 -205 -97 -49 269 179 -80 138 197 120 -94 -26 47 284 -69 -382
$$ packed form
2420a52r3O15m51K81J77m09J34o0o8J09J1l4J93k72K23k21J62K12j04J27j67K5
2442B38j00r1K29P4k14j72j20K66J64l8J56o3l3k8j28J65Rj18l4J30k33l4k24
2465a99k2Q84o30K09l12LJ78rQ8K6Q1k25K42k50J34R0j96K14N3k28r1R1J44j88
2489H7N5j00K06j98K42J06J73m40K18k49J37O8j31p4j07q6J37P5O0j58k5J2J02
2512A10J48l39J78j40M9o2l6j52K74j60K03r7K01N1j67J44k79K1J72j24Mk76K33
2535d4J1N7J02j00N1O3K8j88L58m23M29o35J77l5P5J63lj37M00j74k34R5R5n7
2559G4n4L6k5K1n1k74J21L77j27j50N9L09j26j38j39J10K45l30N1Q5k15K47l48
2582b42K08L16pk78M0j60L4J87l03J08M8L18r0k59K18N9p7k14O8P3K37l53l13
$$ plain form
2605 -382 -211 -73 -55 82 -114 16 -21 80 -101 -183 4 -107 -217 -370 28 -76 67 -92 -48 -52 -206 -194
2627 -194 62 -51 65 -94 85 26 343 -78 87 48 114 171 50 34 279 101 359 139 101 63 145 83 -104
2650 -104 71 -30 31 -43 331 32 106 -82 15 154 -80 -89 -157 111 -238 77 45 42 96 -43 -92 -51 -64 -229 -205
2675 -205 -79 -94 -150 -14 197 -145 -161 -49 -2 -189 33 201 -34 64 -161 124 215 -255 -39 -212 -266 -6
2697 -6 72 -131 41 -206 4 256 58 122 -179 -56 7 118 -102 -79 180 -57 103 117 150 -60 213 98 57
2720 57 20 163 272 143 192 283 -130 57 2 178 -32 86 19 -94 115 142 39 153 -98 21 -147 -183 -108
2743 -108 -152 -77 -403 -298 -497 -145 -195 -307 -291 -338 -81 -206 -96 -166 -231 -219 -107 30 51 -153 105 101 -59 -77
2767 -77 -85 124 83 -36 101 187 141 -89 -210 -42 -116 -13 -1 -115 -31 -144 -159 -183 -55 -92 -61 56 -63 -98 187
$$ packed form
2605c82J71J38J8J37j96J30l7J01j81q2J87j11j10j53L98j04J43j59M4mj54J2
2627a94K56j13J16j59J79n9L17m21J65l9O6N7j21j6K45j78K58k20l8l8Q2o2j87
2650a04J75j01O1p4L74k99P4j88R7J39k34ro8K68l49L15l2lN4j39m9M1j3j65K4
2675b05J26j5n6J36K11l42j6J12M7j87K22J68k35R8k25K85R1m70K16j73n4K60
2697fP8k03J72k47K10K52j98O4l01J23O3J11k20K3K59k37J60J4L3k10K73j15m1
2720E7l7J43J09j29M9R1m13J87n5J76k10J18o7j13K09K7j03J14k51J19j68l6P5
2743a08m4P5l26J05j99L52n0j12J6m7K57j25J10p0o5J2J12J37K1k04K58mj60j8
2767g7qK09m1j19J37Q6m6k30j21J68p4J03J2j14Q4j13j5k4J28l7L1J17j19l5K85
$$ plain form
2792 187 35 80 9 20 83 224 414 59 332 200 68 205 -73 113 206 73 305 53 157 220 1 112
2814 112 -24 285 43 34 149 16 -252 210 -97 -284 124 113 -85 -96 126 -13 -195 109 -173 -38 -214
2835 -214 -233 -75 -134 94 57 -105 54 -134 65 28 -7 14 67 401 169 -261 134 28 -77 322 -64 100
2857 100 -31 -319 150 236 45 345 227 -100 -184 -29 4 78 40 -1 105 83 119 211 24 141 147 97 91 207 -13
2882 -13 80 88 85 411 -2 66 119 187 43 82 23 -12 -52 77 245 35 255 -41 -79 -63 29 24 -150 11 -10 -113
2908 -113 -63 14 81 -113 81 -178 80 -14 74 82 -155 -58 -48 -188 -29 -89 131 -70 -34 -55 117 -163 -29 -125
2932 -125 148 -61 -34 -65 -14 -69 -210 -34 43 -34 -116 182 75 -22 58 147 -92 109 297 74 -104 105 157 274
2956 274 -178 188 -230 98 74 125 31 -120 57 -21 10 55 126 159 -7 -85 108 -90 -80 -83 -187 99 -136 -107
$$ packed form
2792A87j52M5p1J1O3J41J90l55K73j32j32J37k78J86R3j33K32k52J04O3k19J11
2814A12j36L09k42rJ15j33k68M62l07j87M08j1j98j1K22j39j82L04k82J35j76
2835b14j9J58n9K28l7j62J59j88J99l7l5K1N3L34k32m30L95j06j05L99l86J64
2857A00j31k88M69Q6j91L00j18l27q4J55L3P4l8m1J06k2L6R2j87J17On0oJ16k20
2882a3R3QlL26m13O8N3O8j44L9n9l5m0J29J68k10K20k96l8J6R2nj74J61k1j03
2908a13N0P7O7j94J94k59K58r4Q8Qk37R7J0j40J59o0K20k01L6k1J72k80J34r6
2932a25K73k09K7l1N1n5j41J76P7p7q2K98j07r7Q0Q9k39K01J88k23j78K09N2J17
2956B74m52L66m18L28k4N1r4j51J77p8L1M5P1L3j66p8J93j98J0lj04K86k35K9
$$ plain form
2980 -107 -438 -174 -65 53 -109 -144 -203 67 -111 -136 23 17 115 -194 47 35 -57 -346 206 25 -66 -199 -7
3003 -7 -58 -92 140 -27 -48 -201 -674 -298 74 -190 70 138 -172 -72 185 58 -73 91 -17 -183 -4 -44
3025 -44 -171 -110 156 2 -105 44 62 157 -7 31 187 276 -41 233 144 -36 -400 -36 -26 -104 -49 27 -23 91
3049 91 254 106 42 20 138 -30 199 -11 291 15 13 -216 -131 -38 -134 -52 -171 -212 -132 -235 174 -129 -195 -224
3073 -224 -94 159 -136 -246 -75 38 44 115 59 148 34 227 98 -84 -56 130 -148 -14 20 58 -159 236 -124
3096 -124 -14 235 -16 194 -36 -24 23 -75 380 31 108 -125 -175 81 138 43 -10 -35 -215 -77 19 196 -114
3119 -114 -123 -132 174 -32 -19 -117 -330 113 -168 115 -11 86 6 -184 79 -19 -182 -156 -178 -65 10 76 -39 52 33
3144 33 99 -141 -14 -191 -239 92 -141 -8 41 5 -192 -305 314 237 179 7 38 319 98 116 14 158 42
$$ packed form
2980a07l31K64J09J18j62l5n9K70j78k5J59oR8l09K41j2r2k89N52j81r1j33J92
3003gn1l4K32j67k1j53m73L76L72k64K60O8l10J00K57j27j31J64j08j66J79m0
3025d4j27O1K66j54j07J49J8R5j64L8J56Q9l17K74q9j80l64L64J0p8N5P6n0J14
3049I1J63j48o4k2J18j68K29k10L02k76kk29Q5R3r6Q2j19m1Q0j03M09l03o6k9
3073b24J30K53k95j10J71J13OP1n6Q9j14J93j29j82K8J86k78J34L4L8k17L95l60
3096a24J10K49k51K10k30J2M7r8M55l49P7k33n0K56N7r5n3k5j80J38R6J77l10
3119a14rrL06k06J3r8k13M43k81K83j26R7q0j90K63r8j63K6k2J13P5O6j15R1j9
3144C3O6k40J27j77m8L31k33J33M9l6j97j13O19p7n8j72L1K81k21J8j02J44j16
$$ plain form
3167 42 47 141 186 116 107 -152 -8 156 15 -3 -246 -80 91 57 -29 110 181 18 235 -167 187 104 75 216 -229
3192 -229 -100 -56 8 65 -146 183 -65 110 125 -46 15 -44 -149 -70 92 -59 132 -243 3 -21 -305 3 -19
3215 -19 177 -111 -19 151 51 -87 -234 -33 -136 155 -43 61 -436 49 -124 -171 -87 152 202 -76 -51 -125
3237 -125 59 77 108 -144 -202 -162 -6 -212 45 1 -3 120 -18 61 163 83 -191 45 -114 -154 151 -286 -109
3260 -109 -12 -39 96 -153 -244 -24 127 126 -94 -1 40 -204 -144 -2 92 -45 201 -329 256 -87 70 82 -122
3283 -122 -22 18 59 -225 -4 -190 14 -115 5 205 -169 190 -29 -223 -242 -277 -78 35 -18 55 40 52 -20
3306 -20 -127 74 198 104 -33 -291 75 97 -7 144 21 -80 25 210 -68 -264 105 -82 147 -289 -143
3327 -143 13 -84 -73 2 -50 -51 285 150 41 22 60 -4 -24 -287 -149 57 -82 -43 186 101 -162 202 20 60
$$ packed form
3167D2NR4M5p0rk59J44J64j41j8k43J66J71l4q6J39P1j63K17m02L54q3k9J41m45
3192b29J29M4O4N7k11L29k48J75J5j71O1n9j05P9J62j51J91l75K46k4k84L08k2
3215a9J96k88R2J70j00j38j47K01j03K91j98J04m97M85j73m7Q4K39N0k78K5p4
3237a25J84J8L1k52n8M0J56k06K57m4mJ23j38P9J02q0k74K36j59m0L05m37J77
3260a09R7k7J35k49r1K20J51jk20R3M1k44O0J42R4j37K46n30N85l43J57J2k04
3283a22J00M0M1k84K21j86K04j29J20K00l74L59k19j94j9l5J99J13n3P3j5J2p2
3306b0j07K01J24r4j37k58L66K2j04J51j23j01J05J85k78j96L69j87K29m36J46
3327a43J56r7J1P5n2jL36j35j09j9L8o4k0k63J38K06j39L9K29q5k63L64j82M0
$$ plain form
3351 60 -57 -212 -176 -53 -93 -565 -90 -49 154 -149 -162 67 -245 -137 45 7 -89 -8 83 -332 190 -198 69
3374 69 -104 111 50 215 109 -218 -74 -159 -120 -36 -101 -142 -157 194 -41 153 -205 -122 -125 -102 -202 54 168 -76
3398 -76 -81 166 48 -151 72 43 38 219 91 121 -91 -68 -135 282 -251 76 -60 -38 194 98 -42 -177 195 247
3422 247 5 -117 -113 -322 -171 -141 -94 -102 167 93 -208 -160 192 -32 -146 147 17 -154 66 -206 -125 -134 -15 28
3446 28 43 -4 -95 -67 -183 -167 -170 203 -6 236 10 -41 48 4 176 116 -92 -175 -266 126 3 37 67 2 -296 150
3472 150 4 135 -81 -10 83 91 111 282 -39 -109 -67 -187 -165 -89 138 -216 -50 -73 -199 -90 -33 -80 -325 4
3496 4 -13 -182 148 171 -287 -29 31 -60 57 -5 -57 -17 -4 -115 -68 -128 -130 109 84 -10 10 84 165 13 -140 120
3522 120 -15 -24 186 -118 -134 77 148 -78 -151 54 108 -70 -43 -256 139 -35 208 -242 40 135 -91 -1 178
$$ packed form
3351F0j17j55L6J23m0m72M75M1K03l03j3K29l12J08J82l8r6Q1R1m15N22l88K67
3374F9j73K15o1J65j06l27J44q5L9Q4o5m1j5L51k35J94l58Q3lK3j00K56J14k44
3398g6nK47j18j99K23k9nJ81j28L0k12K3o7M17n33L27j36K2K32r6j40j35L72N2
3422B47k42j22Mk09J51L0M7qK69p4l01M8L52k24j14K93j30j71K20k72Q1rJ19M3
3446B8J5m7r1K8j16J6lL73k09K42k26n1Q9m4J72o0k08q3r1L92j23L4L0o5k98M46
3472A50j46J31k16P1R3QK0J71l21p0M2j20K2P6K27l54J66k3j26J09N7m7k45L29
3496Dj7j69L30K3m58K58O0r1J17o2n2M0J3j11M7o0kK39k5r4K0P4Q1j52j53K60
3522A20j35rK10l04j6K11P1k26p3K05N4j78K7k13L95j74K43m50K82R5k26R0J79
$$ plain form
3545 178 -35 -96 -4 -27 199 331 72 137 -65 354 251 -312 34 86 -152 -126 -75 107 -11 -91 82 -85 -50
3568 -50 127 281 -90 -411 -36 -71 -217 -163 135 -65 -17 69 116 241 -27 -166 147 39 -92 195 46 79
3590 79 -77 69 15 16 -28 242 -81 52 91 -40 -12 128 -81 -272 -123 72 65 -174 105 -169 -109 40 -226
3613 -226 118 -62 -109 265 204 -11 -171 114 -110 -87 -160 221 -292 96 -431 -110 533 -227 -74 16 134 25
3635 25 130 -112 -109 88 51 189 -96 -85 -60 -206 159 6 -40 -20 27 41 -115 -198 -43 18 264 -82 222 -20
3659 -20 -111 35 -106 -86 194 -219 -169 -197 -57 -149 -264 -106 -75 158 88 11 114 -103 -47 -19 -67 -159 -66 97 220
3684 220 -28 -71 170 169 -284 -21 219 78 191 44 100 -34 40 -35 3 -151 323 18 -41 33 113 23 26 -16 90
3709 90 -96 49 -205 38 -70 -16 -72 43 -231 -28 29 -135 38 10 -48 -3 -54 -414 -89 337 -32 35 -131
$$ packed form
3545A78k13o1R2k3K26J32k59O5k02M19j03n63L46N2k38K6N1J82j18q0J73j67L5
3568e0J77J54l71l21L75l5j46N4K98k00M8Q6M7J25k68j39L13j08j31K87j49L3
3590G9j56J46n4Jm4K70l23J33L9j31K8J40k09j91J49J95pk39K79k74O0J49k66
3613b26L44j80m7L74o1k15j60K85k24K3p3L81n13L88n27L21O43p60J53R0J18j09
3635B5J05k42LJ97l7J38k85J1K5j46L65j53m6K0M7J4j56q3J55O1K46l46L04k42
3659b0r1J46j41K0K80m13N0k8J40r2j15J58L1K33p0p7J03k17N6K8m8r2R3J63J23
3684B20k48m3K41jm53K63K40j41J13j47N6j34P4p5L8j54M74l05n9P4Q0r0Lm2J06
3709I0j86J45k54K43j08N4n6J15k74K03N7j64J73k8n8M5n1l60L25M26l69O7j66
$$ plain form
3732 -131 -27 -99 -48 54 75 246 50 -161 -34 104 75 -180 -22 -50 -79 -24 172 3 45 43 166 -38 -34 256
3756 256 -66 281 -17 -108 122 115 150 -296 26 -98 149 72 -107 148 5 20 129 191 -29 -14 -34 -6 21 -250
3780 -250 45 37 -205 200 -205 -375 1 -76 104 -3 31 -10 -6 24 -77 9 -286 137 422 56 -71 -127 -26
3803 -26 34 41 -153 -58 -135 23 82 -184 -3 43 108 -33 108 -33 -145 -55 -17 46 31 97 -91 -62 -59 -24 255 -39
3829 -39 84 254 -118 -36 171 109 121 -134 91 100 -42 -247 -192 109 49 5 86 76 61 -43 -34 -11 -182 109 -29
3854 -29 166 -4 -48 -126 -66 74 224 1 -57 163 25 -80 70 52 116 -47 69 -172 160 -29 -25 -162 -89
3877 -89 -29 72 64 -54 200 174 190 -123 -302 8 50 -50 26 62 -62 45 -62 93 102 96 -16 -35 -97 -126 95
3902 95 -154 -316 -26 5 -145 159 -170 8 16 -2 27 52 -93 -108 99 136 -32 -237 143 179 -40 95 -6
$$ packed form
3732a31J04p2N1J02K1J71j96k11J27J38k9k55J58k8k9N5J96j69M2kJ23k04MK90
3756B56l22L47k98r1K30pL5m46L22j24K47p7j79K55j43J5J09O2k20J5k0K8K7k71
3780b50K95qk42M05m05j70L76p7J80j07L4m1ML0j01Q6k95M23K85l66j27n6J01
3803b6O0Pj94R5p7J58N9k66J81M6O5j41J41j41j12R0L8O3j5O6j88K9LL5K79k94
3829c9J23J70l72Q2K07o2J2k55K25Rj42k05N5L01o0m4Q1j0j5j04RK3j71K91j38
3854b9J95j70m4p8O0J40J50k23n8K20j38j05J50j8O4j63J16k41L32j89Mj37P3
3877h9O0J01qj18K54k6J6l13j79L10M2j00P6L6j24J07j07J55Roj12j9o2k9K21
3902I5k49j62K90L1j50L04l29J78Qj8K9K5j45j5K07L7j68k05L80L6k19J35j01
$$ plain form
3925 -6 -169 27 176 49 -3 -136 84 201 -135 -218 121 118 48 50 4 138 -15 127 118 2 -28 -95 19 -146 98
3950 98 -198 -263 137 -64 0 12 -161 -300 -50 -72 -19 114 -60 -110 -183 44 -116 -104 -24 134 -42 -25 81 130
3974 130 -113 70 -27 -96 99 130 -155 88 123 186 152 -169 127 81 77 212 -150 94 18 123 95 -96 37 -96
3998 -96 42 -104 -6 102 -33 46 -187 9 -117 -133 -71 21 -144 125 11 -137 134 131 -241 -248 -67 -72 55 133
4022 133 -3 -7 176 -68 -248 -22 -85 38 -141 140 25 -189 -54 65 -141 35 -31 144 -53 -18 -77 124
4044 124 166 -10 -148 0 62 28 191 -185 108 143 50 -111 -95 115 -90 -170 194 -197 119 -3 175 -2
4066 -2 12 -453 135 -34 189 99 117 -60 -51 -6 62 162 -124 -197 -41 125 -86 -199 25 24 -12 16 42 -128 -199
4091 -199 24 -264 -23 -108 -50 -172 64 200 -155 55 8 -142 -33 -74 -207 -12 -188 150 -55 -128 -57 220
$$ packed form
3925fj63J96J49j27n2j33K20J17l36q3L39lp0Km6J34j53J42rj16l0o7J14j65K44
3950I8k96o5M00k01O4J2j73j39K50k2N3J33j74n0p3K27j60J2Q0J58j76J7J06M9
3974A30k43J83r7o9J95L1k85K43L5O3l4l21K96m6mJ35l62K44p6J05k8j91J33j33
3998i6J38j46R8J08j35P9k33J96j26j6O2R2j65K69j14j48K71ll72pJ81nJ27P8
4022A33j36mJ83k44j80K26o3J23j79K81j15k14J35J19k06J76o6J75j97L5n9K01
4044A24M2j76j38J48O2l4J63l76K93L5r3j61J6K10k05q0L64l91L16j22J78j77
4066bJ4m65N88j69K23r0J8j77RM5O8J00k86p3J56J66k11j13K24jl6K8K6j70p1
4091a99K23k88K41q5N8j22K36J36l55K10m7j50J09m1j33J95j76L38k05p3P1K77
$$ plain form
4113 220 -220 184 143 -37 160 -69 73 327 283 223 55 -57 116 -192 -80 24 -37 -278 151 67 116 38
4135 38 87 163 -106 94 45 -42 70 -220 -225 -39 48 29 119 -24 179 5 276 25 -49 -82 -220 136 164 75 7
4160 7 -72 64 55 -6 101 62 59 -156 29 -21 -6 -43 192 -94 136 17 10 -16 78 -5 341 -15 -101 83 26 98 -54
4187 -54 283 -8 191 57 -31 46 188 -144 11 -113 -131 -109 212 172 221 160 167 146 47 42 -157 21 22 -77 245 -162
4213 -162 84 -65 -91 -170 -176 20 -117 21 232 80 4 246 -44 -242 -244 13 -213 58 -31 101 119 -215 33
4236 33 -241 58 -16 205 -76 103 156 309 17 -171 -166 -265 82 -316 293 -115 41 129 -573 -139 83 -111
4258 -111 -81 129 -18 -90 -129 -155 142 283 -44 -150 119 172 -138 218 -32 69 275 -236 -152 76 4 -282
4280 -282 97 -65 36 323 -215 186 18 -24 148 116 -17 56 106 253 -2 -265 84 24 53 99 34 -169 -305
$$ packed form
4113B20m40M04m1j80J97k29J42K54m4o0j68j12J73l08J12J04o1k41M29q4M9p8
4135C8M9P6k69K00m9q7J12k90nJ86Q7j9R0j43K03j74K71k51p4l3j38L56K8q9o8
4160Gp9J36ro1J07l9lk15J85n0J5l7K35k86K30j19pk6R4q3L46l56q6J84n7P2j52
4187e4L37k91J99j34q8P7J42l32J55j24j8K2L21m0M9o1Pk1r9nj99J78Jr9L22m07
4213a62K46j49k6p9oJ96j37J38K11j52p6K42k90j98kK57k26K71q9J32J8l34K48
4236C3k74K99p4K21k81J79N3J53k92j88Nr9L47l98O09m08J56Q8p02M34K22j94
4258a11L0K10j47p2l9k6K97J41l27j06K69N3l10L56k50J01K06n11Q4K28p2k86
4280b82L79j62J01K87n38M01j68m2J72l2j33P3N0J47k55k63L49o0K9M6o5k03j36
$$ plain form
4303 -305 -2 -32 -113 -49 -27 60 9 -200 72 41 79 -11 58 59 53 190 -72 -75 -114 -45 132 153 76 193 48 -14 133
4330 133 20 -165 -140 117 144 -144 219 -253 -2 -104 121 85 -31 -43 48 -25 224 9 -227 250 -28 125
4352 125 85 129 -40 197 73 95 -57 91 -347 27 220 -152 -109 -70 -60 -47 111 -47 -228 -16 -31 -4 -172
4375 -172 245 120 -101 -44 189 76 -112 -14 -53 233 142 107 184 -91 183 49 -76 -262 40 92 -164 -49
4397 -49 100 -66 -98 88 80 56 37 -56 4 -114 -185 12 -51 61 85 -240 -319 253 -214 -112 -12 100 -81 37
4421 37 8 102 110 -141 154 -10 -185 3 173 155 -189 -93 207 123 -31 -144 -171 73 0 -218 -108 28 41 2
4445 2 41 163 -36 74 -8 37 -113 -109 -91 179 119 1 -87 58 -154 -290 20 -27 16 -145 128 -33 -282 23
4469 23 48 -121 25 -181 47 103 141 155 54 -211 13 99 -342 53 -185 -137 105 142 130 -265 148 -47 54
$$ packed form
4303c05L03l0q1O4K2Q7n1k09K72l1L8r0O9JoJ37k62ll9O9J77K1p7J17j45o2J47
4330A33j13j85K5K57K7k88L63m72K51j02K25l6j16j2R1p3K49k15k36M77k78J53
4352A25m0M4j69K37j24K2j52J48m38L74J93l72M3L9J0J3J58j58j81K12j5K7j68
4375a72M17j25k21N7K33j13j88R8l9K86r1l5P7k75K74j34j25j86L02N2k56J15
4397d9J49j66l2J86qk4j9r3O0j18p1J97o3J12K4l25p9N72m67J02J00J12j81J18
4421C7k9R4Qk51K95j64j75J88J70j8l44R6L00q4j54j13k7K44p3k18J10J36J3l9
4445BL9J22j99J10q2M5j50MJ8K70o0j18q8J45k12j36L10m7M3j61K73j61k49L05
4469B3K5j69J46k06K28N6L8J4j01k65K24Q6m41L95k38M8K42L7j2l95M13j95J01
$$ plain form
4492 54 63 14 -102 -152 58 173 162 103 -88 1 128 24 -284 270 2 -54 104 135 242 64 50 -132 27 39
4516 39 61 169 5 -308 -168 -189 93 -69 -221 54 -99 -28 -78 -51 144 -37 165 -155 14 17 161 -51 27
4539 27 32 42 276 -199 74 -41 -133 4 -178 254 -35 30 237 151 135 -70 -40 -122 -49 27 53 168 -33 -99 -270
4564 -270 -339 -231 -104 -68 -206 94 157 50 -202 224 38 -43 -75 -2 23 249 114 -117 245 -9 -81 -9 -8 -45
4588 -45 11 -62 149 2 221 -167 153 -116 -62 1 105 -65 -31 -264 137 145 -9 30 -163 -160 -311 110 23 -210
4612 -210 56 -141 -250 -16 64 80 -47 35 -50 8 -38 -8 13 -96 2 -184 -165 -48 -117 -79 -163 -44 42 -31 104
4637 104 -83 133 -21 -240 -30 14 -44 -89 112 -48 6 -54 190 125 260 -2 -130 -200 -33 -218 -229 -44 6
4660 6 71 -30 97 -66 49 -59 -40 -25 -93 -148 -214 17 218 -14 131 153 35 -60 43 -65 50 129 219 -77
$$ packed form
4492E4Rm9j16n0K10J15j1n9j91Q9J27j04l08N54k68n6J58L1J07j78j4j82J59J2
4516C9K2J08j64l13J40k1K82j62j52K75j53P1n0K7J95j81K02l20J69LJ44k12P8
4539B7NJ0K34m75K73j15r2J37j82M32k89O5K07q6j6k05L0q2P3P6K6J15k01o6j71
4564b70o9J08J27L6j38L00O3j07k52M26j86q1l2P3K5K26j35k31L62k54p2P2Jl7
4588d5N6p3K11j47K19l88L20k69N4O3J04j70L4k33M01Qj54L9j93Lj51M21q7k33
4612b10K66j97j09K34Q0J6j27Q2q5N8m6L0K1j09R8j86J9J17o9L8q4J19Q6p3J35
4637A04j87K16j54k19K10M4n8m5K01j60N4o0K44o5J35k62j28p0J67j85j1J85N0
4660FO5j01J27j63J15j08J9J5o8n5o6K31K01k32J45K2j18r5J03j08J15P9R0k96
$$ plain form
4684 -77 28 -8 34 282 -208 -49 -130 3 -51 129 -29 90 -95 -178 -131 49 250 43 -157 113 -111 -29 42
4707 42 -176 93 140 -69 -318 153 -147 -158 98 47 231 8 46 3 176 -96 -9 292 -81 20 173 -4
4729 -4 -183 15 38 32 -142 -56 19 -161 87 259 -57 105 22 -144 -2 -19 -152 74 189 14 -40 -210 3
4752 3 -48 228 -17 -214 -3 -27 36 56 -155 -141 -131 38 74 -182 -163 10 -58 103 -50 -20 -366 27 -34 -2 27
4777 27 -52 -237 -154 88 126 37 -41 82 -112 -8 -317 111 44 111 -88 -196 -83 -74 -157 -174 227 131 -64 -124 80
4802 80 -273 -163 118 -202 -78 145 80 -58 214 122 85 159 248 30 79 -21 -135 -96 82 7 -39 145 93 -75
4826 -75 -82 -3 25 62 235 -22 -99 -9 152 -11 40 -54 -118 26 -117 9 -120 -98 -110 -167 -225 14 -59 -1 -27 -21 -147
4853 -147 108 305 64 98 207 36 30 232 85 -88 75 -85 53 218 -116 -74 59 -69 5 5 -198 -191 -146
$$ packed form
4684g7J05l6M2K48m90J59q1J33n4J80j58J19j85q3M7J80K01k07k00K70k24Q2P1
4707D2k18K69M7k09k49M71l00j1K56n1J84k23L8m3J73k72Q7L01l73J01J53j77
4729dj79J98K3oj74Q6P5j80K48J72l16J62q3j66J42j7j33K26J15j75n4j70K13
4752Cn1K76k45j97K11k4O3K0k11J4J0J69L6k56J9J73o8J61j53L0l46L93o1L2K9
4777B7p9j85Q3K42L8q9p8J23j94J04l09M28o7O7j99j08J13Rq3j7M01r6j95o0K04
4802H0l53J10K81l20J24K23o5j38K72r2l7P4Q9k18M9j00j14L9J78p5m6J84n2j68
4826g5pP9K8L7J73k57p7R0J61j63N1r4o4J44j43J26j29K2j2n7n8K39p3N8k6Oj26
4853a47K55J97k41L4J09j71oK02j47j73J63j60J38J65l34M2J33j28P4%k03PM5
$$ plain form
4876 -146 182 152 98 -65 -16 -201 78 78 -121 -62 -111 -153 184 -2 -71 -4 47 -114 -245 3 -168 17 -259 -119
4900 -119 9 -345 130 129 -157 86 -127 -16 -158 -130 -48 -121 25 -228 43 132 350 135 -20 -143 -117 202
4922 202 80 -274 18 -32 86 99 -55 85 -76 -127 254 76 78 215 -7 -14 -157 278 -140 -54 100 -153 -115
4945 -115 -2 172 -123 92 49 153 -12 -12 10 -227 234 -53 98 -147 -63 -9 -161 5 320 -33 139 -284
4967 -284 153 -237 119 164 135 144 -42 -157 242 -148 -125 -80 126 45 160 64 -9 -96 83 42 -41 190 -14 -199
4991 -199 83 -127 -154 -159 -270 187 120 -189 194 -26 5 117 156 -38 -70 -54 -125 -98 -193 -84 -24 273 -239 -142
5015 -142 191 125 -66 -277 25 -447 263 115 75 86 -161 196 -65 81 207 -66 98 43 -207 -108 -13 166
5037 166 -95 71 29 31 -52 -114 -191 58 2 155 132 42 -44 0 136 209 92 -216 247 97 -51 -6 -46 37 -61
$$ packed form
4876a46L28l0n4j63M9j85K79%j99N9m9m2L37j86o9O7N1j61j31K48j71J85k76J40
4900a19J28l54M75jk86K43k13J11j42K8Q2p3J46k53K71Q9K18k15j55j23K6L19
4922B02j22l54K92n0J18J3j54J40j61n1L81j78KJ37k22pj43M35m18Q6J54k53L8
4945a15J13J74k95K15m3J04j65%K2k37M61k87J51k45Q4N4j52J66L15l53J72m23
4967b84M37l90L56M5k9Rj86j15L99l90K3M5K06q1J15r6p3q7J79m1q3K31k04j85
4991a99K82k10k7nj11M57o7l09L83k20L1J12L9j94l2J6p1K7r5J09O0K97n12R7
5015a42L33o6j91k11L02m72P10j48m0J1k47L57k61J46J26k73J64n5k50R9R5J79
5037A66k61J66m2Kq3o2p7K49n6J53k3r0q6M4J36P3j17l08M63j50j48M5m0Q3r8
$$ plain form
5062 -61 35 154 106 -49 -165 81 -105 150 -67 175 32 194 -172 24 -44 178 -18 -209 61 129 0 27
5084 27 6 164 -118 -79 97 -84 -169 76 -243 -9 229 -102 113 142 97 193 16 57 73 -244 205 -31 -293
5107 -293 -84 -207 85 86 -254 170 172 26 -41 58 116 -197 228 -111 -20 -144 -63 21 30 59 120 -120 -128 -40 -208 155
5133 155 -7 -24 459 -207 -67 -51 -126 186 -132 137 -217 -210 -78 118 -175 11 -108 -26 6 -52 162 33 -90
5156 -90 -196 -135 262 -80 -147 57 -117 80 -150 -18 -25 -80 166 77 -117 112 -55 -45 27 162 -56 -27 -1 51
5180 51 13 -138 -75 40 -290 -87 -92 -103 26 46 -200 -103 -108 123 -114 -92 -23 29 91 -191 -82 29 -30 47 88 150
5206 150 -135 3 -133 -42 -94 86 81 129 270 30 201 7 -16 93 94 99 37 -218 -123 -55 13 120 82 152 -80
5231 -80 8 -31 -218 -31 -7 -91 -452 196 -89 -21 24 79 103 -3 66 10 113 154 23 -36 100 -45 89 29 -55
$$ packed form
5062f1R6J19m8j55j16K46j86K55k17K42j43J62l66J96o8K22j96j91K70O8j29K7
5084B7k1J58k82L9J76j81q5K45l19K34K38l31K15K9m5R6j77M1J6l17M49k36k62
5107b93K09j23K92Jl40M24Kj46o7R9N8l13M25l39R1j24Q1Q4RK9O1k40qQ8j68L63
5133A55j62j7M83o66J40J6p5L12l18K69l54PJ32J96k93J86j19Q2L2n8K14j29j23
5156i0j06O1L97l42o7K04j74J97k30J32pn5K46q9j94K29j67J0P2J35k18K9K6N2
5180E1l8j51O3J15l30K03nj1J29K0k46R7nK31k37K2O9N2O2k82J09J11n9P7M1O2
5206A50k85J38j36R1n2J80nM8J41k40J71j94k3J09JNo2k55R5O8O8J07l8P0k32
5231h0Q8l9j87J87K4q4l61O48k85O8M5N5K4j06O9n6J03M1j31n9J36j45J34o0q4
$$ plain form
5256 -55 177 83 106 -63 -24 -58 171 95 -56 -21 -286 312 398 -256 80 -56 143 126 21 156 136 -34 -118 190
5280 190 45 -58 -57 -48 -67 -58 -108 -217 108 37 203 40 -41 218 185 116 41 -132 315 -279 -57 -64 -148 0 -104
5305 -104 -110 -151 82 -14 -108 -179 12 -9 42 -87 -42 80 25 -74 27 -240 26 9 -140 -180 -368 103 -307 121
5329 121 31 68 -121 -1 -16 71 32 -85 174 -35 8 9 40 -36 113 0 -86 -91 97 -29 -293 -80 -134 -87 202
5354 202 34 82 -31 141 -47 -40 -50 -15 -87 -30 106 51 231 226 19 -109 -51 337 -78 131 46 72 155 -135 69
5379 69 68 138 80 83 -13 214 -105 -123 -65 -158 -106 -159 -12 -100 230 19 -19 -115 -152 35 34 110 -8 73 93 -54 93
5406 93 -91 -133 -5 200 79 149 103 130 -21 -30 -161 -141 -51 43 226 14 -233 123 134 -76 -50 8 -130 66
5430 66 -20 -126 139 210 -170 -122 -4 -20 6 -70 -45 -138 145 130 -254 -125 86 66 224 -155 -20 9 324 112
$$ packed form
5256e5K32r4K3j69L9l4K29p6j51L5k65N98Q6o54L36j36J99j7j05J35k0j70q4L08
5280A90j45j03JRj9Rn0j09L25p1J66j63q1K59l3o9p5j73M47n94K22pq4J48j04
5305a04om1K33r6r4p1J91k1N1j29M5J22n5r9J01k67K66j7j49m0j88M71m10M28
5329A21r0L7j89J20j5Q7l9j17K59k09M3JL1p6J49j13q6nJ88j26k64K13n4M7K89
5354B02j68M8j13J72j88Pj0L5p2N7J36n5J80nk07j28N8L88m15K09q5K6Q3k90K04
5379F9jP0n8Lr6K27l19j8N8r3N2n3J47q8L30k11l8r6l7J87jP6j18Q1K0j47J47
5406I3j84m2J28K05j21P0m6K7j51rj31K0R0R4J83k12k47L56J1k10K6N8j38J96
5430F6q6j06K65P1l80M8J18j6K6p6K5r3K83j5l84J29K11k0J58l79J35K9L15k12
$$ plain form
5454 112 18 310 63 -53 -139 131 -37 -71 115 15 -72 -116 -5 29 101 -72 -132 -88 25 39 147 -35 80
5477 80 -102 95 -55 121 -26 93 14 -16 -168 96 109 242 139 -27 34 -21 -244 119 -59 -268 164 242
5499 242 -37 -214 10 -190 62 146 -137 39 -155 -280 -142 1 60 24 -87 -344 -178 -15 95 6 186
5520 186 -114 -5 -88 38 44 224 96 -11 -70 18 -23 197 28 -26 163 205 228 -65 -42 -52 -44 141 -28 47 109
5545 109 -150 87 159 -294 -28 -118 -56 -6 -185 -133 -72 -85 104 -148 -254 27 -233 -20 103 -32 -53 28 -55
5568 -55 8 -179 9 99 -211 -275 79 -35 -55 -70 -68 11 55 -348 76 32 -170 92 -154 -93 9 1 -95 81 39
5593 39 53 -135 -86 76 17 131 51 155 -13 73 13 34 -242 -63 -217 51 -72 38 -36 -105 173 -67 32 -24
5617 -24 142 45 135 206 -29 181 27 110 -25 89 15 -29 270 -250 62 182 43 48 17 -102 -26 -50 -95 53
$$ packed form
5454A12r4K92k47j16q6K70j68l4J86j00q7m4J11L4P2j73o0M4J13J4J08j82J15
5477H0j82J97j50J76j47J19p9l0j52K64J3J33j03j66O1n5k23L63j78k09M32P8
5499B42k79j77K24k00K52Q4k83J76j94j25J38J43N9l6j11k57J66J63J10q9J80
5520A86l00J09q3J26OJ80j28j07n9Q8m1K20j69n4J89M2K3k93K3j0QJ85j69P5O2
5545A09k59K37P2m53K66r0O2N0j79N2O1j3J89k52j06K81k60K13J23j35k1Q1q3
5568e5O3j87J88R0l10o4L54j14k0j5KP9M4m03M24m4k02K62k46O1J02qr6J76m2
5593C9J4j88M9J62n9J14q0J04j68Q6o0K1k76J79j54K68j23J10p4o9K78k40R9n6
5617b4J66r7R0P1k35K10j54Q3j35J14p4m4K99n20L12J20j39Nl1j19P6k4m5J48
$$ plain form
5641 53 20 300 -270 9 116 37 -216 26 -6 183 -66 132 144 -252 259 5 22 37 138 72 -54 -94 59
5664 59 85 -87 62 -43 91 -137 61 101 76 -21 -229 -70 -211 -191 42 -51 -43 2 -104 223 23 125 48 -9
5688 -9 102 -133 -132 -65 -255 55 -101 48 34 83 -145 -201 -40 42 259 131 110 286 -49 -60 -39 21 -204 172
5712 172 52 -261 90 35 -49 74 112 -65 39 -17 -89 -1 55 -134 -170 177 142 18 -237 34 19 156 -36
5735 -36 -90 -279 -31 -191 -64 109 25 -123 7 30 -19 -37 -64 174 -147 103 64 -194 80 -124 -6 111 107
5758 107 207 -28 -189 -94 33 79 154 265 -66 69 -205 -201 3 -183 101 34 -36 -121 305 -45 -10 76 -62
5781 -62 98 -314 97 -138 -57 231 -200 -1 206 7 107 -67 -283 -34 -85 -27 114 -97 -44 -128 -242 -357
5803 -357 195 -189 363 -408 340 298 323 -106 13 71 285 -257 -6 454 638 -56 -6 -567 -491 358 115 -342
$$ packed form
5641E3l3K80n70K79J07p9k53K42l2J89k49J98J2l96N11k54J7J5J01o6j26m0J53
5664E9K6j72J49j05J34k28J98M0k5r7k08J59j41K0K33r3QM5j06L27k00J02p7n7
5688iJ11k35JO7j90L10j56J49j4M9k28n6J61Q2K17j28k1J76l35j1K1O0k25L76
5712A72j20l13L51n5q4J23L8j77J04n6p2Q8N6j89l6L47l5j24k55K71j5J37j92
5735c6n4j89K48j60J27J73q4j48J30K3m9j8k7K38l21K50l9k58K74k04J18J17m
5758A07J00k35j61R5J27M6P5J11l31J35k74MK04j86K84o7p0q5M26l50L5Q6j38
5781f2J60m12M11k35Q1K88m31J99K07j99J00j74k16K49n1N8J41k11N3q4j14j15
5803c57N52l84N52p71P48m2K5m29J19N8K14n42K51M60J84o94N0n61P6Q49k43m57
$$ plain form
5825 -342 -3 -706 211 -100 89 -203 -127 -76 -376 -101 -416 -57 -123 -112 273 209 -300 -300 -139 -22 184 -80
5847 -80 -421 392 154 236 -48 127 636 -158 -368 211 92 -428 366 -348 275 136 -253 697 -62 373 -356
5868 -356 424 278 -75 -232 331 -107 723 231 65 528 390 -108 374 159 423 -8 83 148 256 -252 -448
5889 -448 -586 1059 418 -887 -469 -213 140 421 263 55 -202 -175 405 420 293 -171 50 -56 427 -484
5909 -484 -455 -57 -74 -803 38 367 162 -67 -273 253 263 339 -103 37 -163 243 147 -146 -191 -303 -264 -160
5931 -160 -40 29 68 -211 32 -11 -69 -138 -1 -151 30 -128 -81 16 -178 -24 79 -91 -55 31 -90 -95 -142 -52
5955 -52 -66 -99 -104 -262 347 -37 -115 14 -85 -23 -103 -40 -201 14 100 41 116 20 -226 -12 90 -52 44 37 197 -245
5981 -245 -84 -76 184 -132 176 -51 52 -186 -45 166 -263 -188 154 11 -210 -56 -7 -106 42 -124 229 -32
$$ packed form
5825c42L39p03R17l11J89k92P6N1l00K75l15L59o6J1L85o4n09%J61J17K06k64
5847h0l41Q13k38Q2k84J75N09p94k10N79j19n20P94p14O23j39l89R50p59M35p29
5868c56P80j46l53j57N63m38Q30m92j66M63j38m98M82k15K64m31R1O5J08n08j96
5889d48j38J645o41j305M18K56L53K81j58k08k57K7N80J5j27m64K21j06M83r11
5909d84K9L98j7p29Q41L29k05k29k06N26J0P6m42J40k00M06r6k93m5j12L9J04
5931a60J20O9L9k79K43m3n8o9J37j50J81j58M7R7j94J54J03j70L6Q6j21nm7R0
5955e2j4l3nj58O09l84p8J29r9O2q0O3j61K15Q6n9P5r6k46K14J02j42R6pJ60m42
5981b45J61QK60l16L08k27J03k38J41K11m29P5L42j43k21J54M9r9J48j66L53k61
$$ plain form
6003 -32 -81 -53 215 58 45 28 -118 148 158 53 134 -7 -128 38 -19 -15 151 17 -52 32 -1 35 21 205 -46
6028 -46 -161 -82 18 -246 193 -230 55 -136 303 44 33 -17 23 184 -181 86 297 -39 -171 131 -119 41
6050 41 29 320 76 -155 -78 -247 122 80 -11 -76 46 -45 -12 -97 -3 -80 -17 5 -65 266 213 101 209 66 -228
6075 -228 -41 -61 97 -110 102 -175 -101 -286 221 55 129 88 46 -22 8 -36 92 65 112 -12 115 111 -45 -98
6099 -98 230 143 -4 151 29 79 -12 -145 133 -145 -160 -94 -20 41 165 -49 -156 19 -155 -114 -277 -43 -15
6122 -15 -66 108 144 50 -74 133 50 -98 -58 -196 -52 -129 -34 134 164 -129 38 40 224 -290 183 93 -206 147
6146 147 56 158 -256 159 -45 154 -9 3 -121 43 -45 -39 7 196 200 -173 225 142 -96 32 72 -175 53
6169 53 -116 77 45 -70 -150 -180 21 -70 -12 121 2 -84 -137 256 -42 158 10 -27 213 154 53 -51 66
$$ packed form
6003c2m9K8K68j57j3j7j46K66J0j05Q1j41j21J66n7MJ66j34o9Q4l3L6j4J84k51
6028d6j15P9J00k64M39m23K85j91M39k59j1n0M0J61l65K67K11l36j32L02k50J60
6050D1j2K91k44k31P7j69L69m2r1o5J22r1L3q5R4p7O3K2p0L31n3j12J08j43k94
6075b28J87k0J58k07K12k77P4j85N07j66P4m1m2o8L0m4J28k7M7j24J27mj56n3
6099i8L28q7j47J55j22N0r1j33K78k78j5O6P4O1J24k14j07J75j74M1j63K34K8
6122a5n1J74L6r4j24K07q3j48M0j38J44p7R5J68L0k93J67KJ84n14M73r0k99L53
6146A47r1J02m14M15k04J99j63J2j24J64q8OM6J89Ml73L98q3k38J28M0k47K28
6169E3j69J93l2j15q0l0K01r1N8J33j19q6n3L93k98K00j48l7K40n9j01j04J17
$$ plain form
6192 66 -198 -198 64 191 41 -48 -65 186 -111 166 115 -30 -128 234 105 196 -7 105 203 -19 28 73 184 -312
6216 -312 -63 -169 -195 10 -140 95 113 -290 -75 49 0 15 219 -28 -3 -93 3 -50 -46 -146 245 -134 84
6239 84 98 108 -188 259 10 -274 108 209 163 -28 279 282 30 131 60 27 201 123 -41 -17 32 -14 -25 -62 -141
6264 -141 126 40 98 21 -36 -195 9 -98 -110 89 254 118 -392 211 3 -201 -96 -54 139 64 301 -81
6286 -81 160 75 168 45 -49 -170 -7 -99 -80 -42 -24 74 20 244 -82 87 193 24 150 112 -47 -71 44 99
6310 99 52 -195 142 97 182 15 71 111 148 -27 137 -30 77 67 -291 -174 -32 -215 308 58 -223 -115 199
6333 199 152 10 175 180 -28 152 117 -185 38 83 111 -30 -128 -141 13 -95 29 79 126 37 269 34 -82 -98
6357 -98 -6 121 -55 -95 29 91 -56 57 43 67 80 29 -10 -79 158 79 181 -30 66 92 197 -57 -86 124 -82
$$ packed form
6192F6k64%K62J27j50q9j7K51k97K77n1j45r8L62j29R1k03J12R8k22M7M5J11m96
6216c12K49j06k6K05j50K35J8m03K15J24m9J5K04k47K5r0R6n3Mj00L91l79K18
6239H4J4J0k96M47k49k84L82J01m6j91L07Lk52J01p1l3J74p8j64K4M9m6j1l7p9
6264a41K67q6N8p7n7j59K04j07j2J99J65j36n10O03k08k04J05M2J93p5K37l82
6286h1K41q5R3j23r4j21J63r2J9L8J8R8n4K24l26J69J06j69J26l8j59k4J15N5
6310I9m7k47L37m5Q5j67N6M0L7j75J64j67J07j0l58J17J42j83N23k50k81J08L14
6333A99m7j42J65Nk08J80l5l02K23M5K8j41r8j3J54j08J24N0M7q9K32k35j16j6
6357i8R2J27j76m0J24O2j47J13j4K4J3n1l9o9K37p9J02k11R6K6J05k54k9K10k06
$$ plain form
6382 -82 63 -76 -173 -238 -15 -224 47 -156 -61 134 -56 107 133 40 293 134 52 260 159 -27 -66 -18 -142
6405 -142 -135 14 73 192 242 -87 157 -252 254 86 22 -10 58 -47 17 201 -65 191 49 129 149 34 39 163
6429 163 -81 -93 231 -162 71 -77 -118 -249 -195 140 -45 -200 121 188 64 -18 -80 -79 46 -53 -74 36 -490
6452 -490 -18 -25 -8 -158 -364 -87 -65 148 56 -186 33 42 -222 48 101 -61 -219 -39 166 -37 65 -276 -262
6475 -262 -137 93 -130 40 -94 82 -145 -151 -13 -46 179 -110 26 66 -25 -202 -96 76 256 66 304 -262
6497 -262 13 -261 -19 -177 54 46 -18 74 78 203 22 289 122 -11 117 -153 57 141 -25 19 110 123 13
6520 13 209 -226 -34 215 114 -126 359 76 -388 -621 -182 168 277 126 -8 84 -285 -107 -58 -145 21
6541 21 72 57 -18 6 -156 109 76 -85 225 119 100 -154 131 112 127 -165 -114 -185 -220 45 -43 49 -16 -263 81
$$ packed form
6382h2J45j39r7o5K23k09K71k03R5J95j90J63K6r3K53j59q2K08j01j86l9M8j24
6405a42PJ49N9J19N0l29K44m09N06j68o4l2O8j05O4J84k66K56j42Q0K0j15NJ24
6429A63k44j2L24l93K33j48m1j31N4L35j85j55L21O7j24q2o2JJ25r9k1J10n26
6452d90M72pJ7j50k06K77K2K13r2k42K19Rk64K70N3j62j58J80K05k03J02l41J4
6475b62J25K30k23J70j34J76k27oJ38l3K25k89J36M0r1j77J06J72J80j90K38n66
6497b62K75k74K42j58K31qo4R2MJ25j81K67j67j33J28k70K10Q4j66M4R1J3j10
6520A3J96m35J92K49j01k40M85k83m64k33M39L50J09j51j34R2l69J78M9q7J66
6541B1N1j5p5K4j62K65l3j61L10j06j9k54K85j9J5k92N1p1l5K65q8R2o5k47L44
$$ plain form
6566 81 70 283 -49 -49 20 65 170 -108 -37 87 -57 92 219 -134 49 -100 335 -54 70 -179 100 -77
6588 -77 -73 66 244 66 135 111 -3 90 -10 -43 -89 234 -140 -68 114 205 11 123 -73 -37 -209 -16 44 17
6612 17 -88 139 195 86 13 18 -120 270 56 -20 7 -200 178 203 -2 -185 57 49 144 -145 -61 102 25 -90
6636 -90 126 78 174 -80 158 160 114 39 -124 -48 177 -31 84 20 -31 -118 -124 -82 -295 8 -46 128 -113 86 20
6661 20 -116 -155 43 -26 -36 6 153 113 236 101 -20 337 -121 -389 41 -129 34 32 -131 161 -11 -283 27
6684 27 83 -125 41 -158 -337 23 -174 20 65 -73 -64 11 -47 -49 -94 63 -32 -210 -72 129 114 -37 -106 -85 -20
6709 -20 127 7 -87 73 -81 185 -275 -195 -70 33 -61 211 -212 -19 115 -81 -109 49 88 113 -89 -66 -393
6732 -393 -56 93 85 111 -253 -41 -121 143 -22 -48 79 -107 -122 84 -5 -9 89 240 28 330 108 36 135 82
$$ packed form
6566H1j1K13l32%O9M5J05k78P1J24j44J49J27l53J83j49M35l89J24k49K79j77
6588g7MJ39J78j78O9k4j14R3j00l3m6L23l74P2J82R1j94J12j96L6j72J93O0k7
6612A7j05K27N6j09p3Nj38L90k14p6K7k07L78K5k05j83K42qR5k89Q4J63p7j15
6636i0K16m8R6k54K38Km6p5j63P6K25k08J15o4n1q7oM2k13L03n4J74k41J99o6
6661B0j36l9J98o9j0M2J47m0J23j35j21L57m58k68M30j70J63kj63K92j72k72L10
6684B7N6k08J66j99j79L60j97J94M5j38RP5n8km5J57r5j78J38K01j5j51o9K1O5
6709b0J47j20r4J60j54K66m60Q0J25J03r4K72m23J93J34j96k8J58L9K5k02K3l27
6732c93L37J49qK6l64K12q0K64j65k6J27j86j5K06q9mR8J51k12L02k22p2R9n3
$$ plain form
6756 82 -13 -49 -106 135 -55 -278 -117 237 26 -53 130 -34 -71 92 1 -60 76 244 -207 -130 27 -64 -16 -102
6780 -102 102 110 -56 -316 100 -35 2 28 50 2 -230 12 160 82 -128 -48 -215 163 -19 36 170 63 36
6803 36 -31 -220 -112 -185 67 -80 -18 -145 17 73 -10 -134 130 72 167 -9 -295 124 166 -93 50 -91 -30
6826 -30 113 -150 191 193 152 -64 27 -8 83 -65 205 -57 -25 2 -104 292 -229 -198 -122 84 17 46 20 -62 25
6851 25 162 -590 -78 -132 -100 267 -116 99 -143 -16 19 160 42 -198 77 -63 76 40 -20 77 63 -26 -7
6874 -7 255 -158 47 17 -86 1 -73 -173 187 -148 -6 -26 -151 -243 20 211 -19 306 183 122 111 267 -66
6897 -66 168 101 -66 188 368 -52 76 -108 112 -156 -75 95 32 145 -22 -271 41 -62 -94 59 95 -79
6919 -79 -182 -44 41 123 237 -206 163 -160 -111 -32 -69 45 185 6 228 -20 -224 235 -240 -229 96 -129
$$ packed form
6756H2r5l6n7K41j90k23J61L54k11p9J83j64l7J63r1o1J36J68m51P7J57r1M8q6
6780a02K04Qj66k60M16j35L7K6K2m8k32K42J48p8k10Q0j67L78j82N5J34j07k7
6803C6o7j89J08p3K52j47O2j27J62N6q3j24K64n8R5j76k86M19M2k59J43j41O1
6826c0J43k63L41Km1k16R1l5R1j48K70k62L2K7j06L96n21L1P6K06o7K9k6q2Q7
6851B5J37p52N12n4L2L67l83K15k42J27L5J41j18k40K75j40J39l6o0R7j4q9J9
6874gK62m13K05l0j03Q7p4j00L60l35J42k0j25r2K63J91k30L25j23o1j1J56l33
6897f6K34o7j67K54J80m20J28j84K20k68Q1J70o3J13j67k49L12j03l2J53L6j74
6919g9j03J38Q5Q2J14m43L69l23M9P9l7J14J40j79K22k48k04M59m75J1L25k25
$$ plain form
6941 -129 117 234 -75 94 -92 -82 135 -26 212 58 -323 -215 123 119 -93 125 101 -272 -69 139 407
6962 407 -29 42 298 -130 -81 -31 226 47 94 110 -162 -83 -151 -10 -10 -144 53 86 -374 -32 42 117 -168 65
6986 65 -189 17 120 80 43 67 203 -162 -11 -45 198 127 164 -13 72 31 93 52 138 -2 142 95 -151 -15
7010 -15 -144 -156 -32 69 51 -22 -70 66 114 40 46 -35 -58 -32 -37 187 50 -188 150 59 -187 115 -27 -96 -196
7035 -196 9 36 -58 -5 94 86 47 46 21 -27 -284 10 324 -184 82 249 153 -40 77 -264 -51 53 -140 111
7059 111 224 -236 280 71 84 15 -32 -330 142 -111 56 217 -101 -447 -2 149 -7 222 -216 -17 -110
7080 -110 151 134 -40 -54 -11 4 -448 -227 -173 90 227 -82 28 -90 -143 -36 25 71 77 -99 73 -177 -287
7103 -287 45 -76 -89 -127 -119 -74 182 -95 86 51 159 100 264 -97 27 -210 -341 7 -244 -185 327 -10 232
$$ packed form
6941a29K46J17l09J69j86J0K17j61K38j54l81J08L38mk12K18k4l73K03K08K68
6962D07m36P1K56m28M9N0K57j79M7J6k72P9o8J41%j34J97L3m60L42P4P5k85K33
6986F5k54K06J03m0l7K4J36l65J51l4K43p1L7j77Q5m1O2m1Q6j40J44m7k46J36
7010a5j29j2J24J01j8p3m8J36M8p4Oq1k3K6nK24j37k38L38r1k46L02j42o9j00
7035a96K05K7r4N3R9ql9jk5m8k57K94L14n08K66J67r6j93J17l41K13J04j93K51
7059A11J13m60N16k09J3o9m7k98M72k53J67J61l18l46M45J51j56K29m38J99r3
7080a10K61j7j74j4M3J5m52K21N4K63J37l09J10j18n3J07O1M6Oj76J72k50j10
7103b87L32j21j3l8QM5K56k77J81l5J08n9J64l61J24k37j31L48k51N9N12l37K42
$$ plain form
7126 232 186 22 106 -57 -97 88 -60 23 21 112 5 146 292 -17 -84 -80 36 -90 -47 56 182 122 218 -243
7150 -243 0 91 69 4 83 -143 103 64 65 -128 -56 262 -46 57 5 369 -292 181 -47 -88 62 -13 -268 -65
7174 -65 13 204 8 8 -76 140 227 -190 58 126 -35 -241 -166 -95 54 -37 157 -71 88 -123 -20 -114 163 -227
7198 -227 61 122 -111 53 -473 76 -122 74 42 -165 55 97 -356 -56 130 280 -196 -84 -149 -27 -107 -3
7220 -3 -97 153 -131 82 176 51 -109 -86 1 -71 -112 -104 -75 65 85 4 -60 44 -31 -66 -58 83 -140 -273 162 28
7246 28 295 109 -131 89 -148 -140 -132 11 -425 204 351 -149 -46 -145 31 51 -156 73 -17 -15 88 -73 -5 64
7270 64 152 -21 -69 39 -102 -157 -55 152 192 -13 29 192 25 43 20 -14 -106 -111 -115 -69 10 1 -307 48 10 -70 -245
7297 -245 116 462 -9 -72 -191 10 -36 136 -110 165 178 -82 -54 67 -63 -104 98 80 -140 -83 -54 184 -30
$$ packed form
7126B32m6j64Q4j63m0J85j48Q3kR1j07J41J46l09o7MJ16j26M3J03J26o0R6m61
7150b43K43R1k2o5P9k26K46l9Jj93P2L18l08J03n2L64o61M73k28m1J50p5k55K03
7174f5P8J91j96%q4K16Q7m17K48O8j61k06P5P1J49r1J94k28J59k11J03r4K77l90
7198b27K88O1k33J64n26N49j98J96l2k07K20M2m53L00J86J50m76J12o5J22q0J04
7220cr4K50k84K13R4j25j60K3Q7p2m1QK9J40K0q1o4J04p5l5QJ41k23j33M35j34
7246B8K67j86k40K20k37QQJ43m36O29J47n00J03r9J76K0k07K29r0KJ03j61O8O9
7270F4Q8j73m8J08j41n5J02K07M0k05M2J63j67J8k3l4r2nmM6P9rl08L55l8q0j75
7297b45L61L46m71o3j19K01m6J72k46K75J3k60K8J21j30m1K02j8k20N7K9K38k14
$$ plain form
7320 -30 139 -94 10 68 -26 107 43 -337 314 30 50 290 -107 205 17 -125 15 -148 -15 5 -41 92
7342 92 53 145 147 75 75 -8 -100 127 -82 -176 -228 -95 19 212 42 -90 -29 -197 -136 23 1 78 -258 135 -53
7367 -53 -243 92 53 36 -193 -30 16 133 -9 -218 -47 -67 -78 -97 -46 -176 -9 175 -127 114 -62 53 20
7390 20 -36 -213 -168 18 -87 135 -26 142 -128 -154 -164 -109 120 -182 9 -75 -307 193 -11 135 179 1 -131
7413 -131 150 -171 -37 -116 -31 -326 -161 -11 68 -13 19 -119 74 5 12 162 47 103 -237 -5 134 99 187 112
7437 112 -107 -39 39 52 -15 -58 103 144 59 81 27 66 -44 -81 393 -167 -90 -306 -162 -143 216 -157 -150 -2 -72
7462 -72 -66 268 -205 37 21 150 105 133 -129 -57 -70 152 -112 109 113 234 -170 -143 102 -69 -254 -72 241 8
7486 8 103 76 43 52 18 71 -125 113 143 74 -9 59 -63 -11 -65 -134 84 -72 58 24 -250 -32 41 -43 -34 -9 -104 -14
$$ packed form
7320c0J69k33J04N8r4J33o4l80O51k84K0K40l97L12j88j42J40j63J33K0m6J33
7342I2l9R2Kp2%q3r2K27k09r4n2J33J14J93j70j32O1j68O1J59k2P7l36L93j88
7367e3j90L35l9j7k29J63M6J17j42k09J71k0j1j9N1j30J67J84l02K41j76J15l3
7390B0n6j77M5J86j05K22j61J68k70k6j0N5K29l02J91q4k32N00k04J46M4j78j32
7413a31K81l21J34p9Q5k95J65J50P9q1L2j38J93o9PJ50j15N6l40K32J39l5Q8p5
7437A12k19O8P8J3o7m3J61M1q5K2n4L9j10l7M74n60P7k16J44J9L59l73PJ48p0
7462g2OL34m73K42j6J29m5K8k62P2j3K22k64K21MJ21m04K7K45j71j85J82L13k33
7486HR5k7l3Rl4N3j96K38L0o9q3O8j22N2n4o9K18j56J30l4k74K18P3q4RK5r5R0
$$ plain form
7514 -14 -198 -132 24 44 18 -16 -70 17 -94 -39 -15 162 -127 -310 159 18 58 156 -118 26 -3 -22 -43 -159 111
7539 111 183 60 19 9 -61 -388 -69 -17 68 8 90 -11 -42 108 -5 311 20 -95 -25 -18 118 102 -92 -57 -105
7564 -105 54 -108 -12 94 -138 -60 -131 -19 -80 123 278 54 -39 -138 -3 141 -216 92 127 84 -79 -218 65
7587 65 -127 -117 7 -29 54 91 -208 -253 208 -25 194 141 -219 -128 197 86 -146 -26 -19 -108 -29 -212 348 175
7611 175 305 100 -18 309 255 98 64 14 -1 -77 -174 299 -83 258 -58 -26 -58 -69 101 23 -29 -198 184 100
7635 100 -154 136 -312 6 43 214 142 -123 76 -87 -17 32 107 165 31 309 -250 -134 -66 118 11 33 -77
7658 -77 -251 49 112 -65 20 -71 220 106 74 106 -47 -299 6 153 -48 166 185 -74 167 27 169 -129
7680 -129 -68 46 -86 0 -13 147 31 -98 -22 -205 16 303 112 -4 44 25 216 34 -32 -7 64 131 92 105
$$ packed form
7514a4j84O6J56K0k6l4n4Q7j11N5K4J77k89j83M69j41M0R8k74J44k9j9k1j16K70
7539A11P2j23m1j0p0l27L19N2Q5o0Q2j01l1J50j13L16k91j15P0PJ36j6j94L5m8
7564a05J59j62R6J06k32P8p1J12o1K03J55k24r3r9J35J44l57L08L5m3j63j39K83
7587F5j92J0J24l6Q3L7k99m5M61k33K19n3l60R1L25j11k32J20Pq9P9j83N60j73
7611A75J30k05j18L27n4j57l4n0j5p6r7M73l82L41l16L2l2j1J70p8n2j69L82q4
7635A00k54K90m48L18L7J71p2k65J99j63P0M9P5N8j34K78n59J16O8J84j07K2j10
7658g7j74L00O3j77Q5r1K91j14l2L2j53k52L05J47k01K14J9k59K41j40J42k98
7680a29O1J14j32Q6j3J60j16j29P6j83K21K87j91j16M8j9J91j82o6K5P1O7l9J3
$$ plain form
7704 105 53 251 8 -58 -217 54 -128 -143 160 57 62 7 -133 291 138 -94 87 36 176 -105 -249 -64
7726 -64 125 -113 -328 185 84 -352 18 295 -135 -287 -74 -96 -167 32 11 252 62 73 223 -277 -20 -11
7748 -11 22 33 -186 -179 78 103 105 -45 184 -46 -36 28 80 -224 -195 -94 -126 84 84 86 -40 -79 -40 174 26 -96
7774 -96 44 -168 -11 27 -208 117 125 45 -229 -40 -108 189 -24 46 -127 -306 -126 384 -24 -42 58 120 -102
7797 -102 89 285 97 13 -10 87 -205 4 194 213 -111 -20 -115 -104 -9 -75 55 45 172 55 118 -70 -201 136
7821 136 -99 31 52 -207 137 41 0 -179 -12 314 85 124 -3 59 86 -303 13 -50 104 -34 238 -10
7843 -10 66 -57 -116 360 107 -67 74 -113 -42 13 44 -52 -89 -38 165 64 50 75 228 -112 -92 -112 -51 -48 -42 161
7869 161 -57 289 -16 15 -2 164 183 17 -129 109 -105 -101 -62 37 -110 -46 -63 -4 -61 -49 -193 -124 58 -142
$$ packed form
7704A05n2J98k43o6j59K71j82j5L03j03Nn5j40M24j53k32J81n1J40k81j44J85
7726f4J89k38k15N13j01m36L70K77m30j52K13k2p1J99k1K41j90J1J50n00K57R
7748a1L3J1k19PK57K5Kj50K29k30J0O4N2l04K9J01l2K10%Kj26l9L9K14j48j22
7774i6J40k12J57L8k35L25Qq0k74J89o8K97k13P0j73j79J80N10m08j8J00O2k22
7797a02J91J96j88q4k3R7k92K09J90J9l24R1r5J1R5o6J30j0J27j17O3j88j31L37
7821A36k35J30K1k59L44r6m1j79J67L26k29L9j27O2K7l89L16o3J54j38K72k48
7843a0P6j23n9M76k53j74J41j87P1N5L1r6l7N1K03j01j4K5J53l40K0k0O1LOK03
7869A61k18L46l05L1j7J66J9j66j46K38k14ML9R9j47O4j7N9n7J2j44O9J82k00
$$ plain form
7893 -142 192 -55 182 -135 88 151 -35 -15 4 39 23 124 -67 -254 -57 -11 -79 -248 57 -250 59 -47
7915 -47 -94 59 163 -135 21 154 145 62 -165 20 43 45 213 245 -138 -133 209 -198 -120 168 -57 -135 214 -27
7939 -27 -22 -104 40 -50 -83 60 3 -55 31 134 -31 258 73 -61 241 -301 132 34 -171 58 109 -141 -166 156
7963 156 -47 79 -53 94 69 -100 306 36 40 253 192 1 -297 73 84 -163 147 -87 167 92 -227 -22
7985 -22 -86 -140 13 72 266 -20 -58 137 -122 -200 -52 -16 175 -93 -71 67 176 -3 -233 63 -100 -61 -58 -307
8009 -307 140 -25 -49 -48 104 218 132 -106 -97 29 195 -33 -54 48 82 -89 -7 -101 -259 124 -220 260 17
8032 17 29 -265 -41 -38 8 362 -45 -5 -104 -246 93 -324 -234 44 -177 -235 -160 -48 -316 63 -33 134 60 62 36
8057 36 -187 -34 21 -76 -283 96 -188 -140 115 -235 88 42 -16 -96 187 62 -89 -121 100 182 215 281 54 100
$$ packed form
7893a42L34k47K37l17K23O3j86K0J9L5j6J01j91j87J97M6o8j69L05l07L09j06
7915d7m7J53J04k98J56J33rq3k27J85K3KJ68L2l83NL42m07P8K88k25p8L49k41
7939b7Nq2J44r0l3J43n7n8Q6J03j65K89j85j34L02n42M33r8k05K29N1k50k5L22
7963A56k03J26j32J47k5j69M06k70MK13o1j91k98L70J1k47L10k34K54p5l19K05
7985b2o4n4J53N9J94k86l8J95k59p8J48L6J91k68K2J38J09j79k30K96j63L9Lk49
8009c07M47j65k4JJ52J14q6k38RJ26J66k28k1J02L4j71Q2r4j58L83l44M80k43
8032A7J2k94K24LM6L54m07M0r9j42L39m17R0K78k21n8P5J12k68L79r6J67p4Kk6
8057C6k23J53N5r7k07L79k84M8K55l50L23m6n8q0K83j25j51l2K21Q2L3O6k27M6
$$ plain form
8081 100 94 -232 -75 -139 92 110 15 96 55 -154 -85 85 216 19 -4 274 157 -104 241 -122 -6 86 -32
8104 -32 119 1 -83 40 36 132 -92 -44 21 -132 154 -92 66 -21 -214 -92 -295 139 -141 29 -172 18 9
8127 9 153 -11 23 -265 17 81 140 248 105 107 155 65 177 -43 76 130 -72 -150 -29 -146 13 -85 -206 -22
8151 -22 40 -35 90 24 11 55 37 104 -77 31 -111 177 197 -152 189 -97 -65 97 143 76 63 135 277 13 -60
8176 -60 -53 31 -87 -255 -99 94 -173 -10 9 183 -101 -74 113 -32 111
$$ packed form
8081A00ol26J57o4K31J8r5Q1m1k09O9J70J31j97k3K78j17k61L45l63J16R2j18
8104c2J51j18q4J23mR6k24M8O5j53K86k46J58q7j93J22k03M34k80J70k01J90r
8127IJ44j64L4k88K82O4N9J08j43KM8r0J12k20J19N4k02p8J21j17J59r8j21J84
8151b2O2p5J25o6j3M4j8O7j81J08j42K88K0l49L41k86L2J62M6o7j3P2J42k64p3
8176f0PQ4j18j68J56J93k67J63J9J74k84K7J87j45J43
8191A11
$$ Imaginary data points
##PAGE= N=2
##DATA TABLE= (X++(I..I)), XYDATA
$$ plain form
0 0 0 0 0 0 0 0 0 0 0 0 -8 8 -8 8 -8 16 -16 23 -24 32 -39 47 -55 63 -72 87 -103 119 -135 153 -174 200 -229
33 -229 257 -292 327 -367 413 -462 513 -572 635 -703 780 -862 951 -1050 1158 -1275 1406
50 1406 -1547 1706 -1881 2075 -2293 2540 -2819 3141 -3516 3958 -4490 5143 -5968 7046 -8523
65 -8523 10680 -14141 20613 -36981 173134 299278 165681 268733 172977 166550 120736 59034
77 59034 95309 102072 53692 85469 55393 103087 115777 46963 64909 63301 24615 10894 -56674
90 -56674 -76827 -51245 -74214 -100802 -83637 -80634 -21091 -12590 -36252 732 823 778 -484 -56481
104 -56481 -48484 -26453 -65314 -47855 -49428 -41117 19053 -13167 -366 28660 20863 51266 19494
117 19494 -13101 15804 -7699 -27725 -28959 -62913 -29272 -19288 -42556 -17894 -18342 1981 15089
$$ packed form
0@%%%%%%%%%%qJ6j6J6j6K4l2L9m7N6p1Q6j02J18j35J59j90K22k54K88l27L74m29
33b29M86n49O19o94P80q75R75j085J207j338J483j642J813k001K208k433K681
50A406k953L253l587L956m368M833n359N960o657P474q448R633j1111J3014j5569
65h523J9203k4821L4754n7594K10115J26144j33597J03052r5756o427m5814o1702
77E9034L6275O763m8380L1777l0076M7694J2690o8814J7946j608l8686j3721o7568
90e6674k0153K5582k2969k6588J7165L003N9543Q501k3662L6984R1m5j262n5997
104e6481P997K2031l8861J7459j573Q311O0170l2220J2801K9026p797L0403l1772
117A9494l2595K8905k3503k0026j234l3954L3641R984k3268K4662m48K0323J3108
$$ plain form
130 15089 -11447 -8690 5033 -11347 -13700 -24823 -35283 -383 -10106 -18147 -3420 -6568 12267
143 12267 15873 -5414 11020 25169 17252 31908 12402 23449 47615 23099 36242 30479 24039
156 24039 44812 19596 2728 17826 2469 2458 -1135 -22466 2811 -966 -4474 4311 -11328
169 -11328 4794 3088 -24515 -26675 -32047 -46808 -37143 -51558 -51802 -24425 -27001 -13498 -7187 -4553
183 -4553 17309 14495 2099 7746 -2579 -6307 -1452 -26337 -12040 464 -2601 17969 18106 35056
197 35056 54133 49305 52384 52919 37303 41980 20399 -819 13330 -2257 3945 10521 6774 27195
211 27195 35010 34524 41640 38113 37998 41764 16196 15864 12087 -4081 5146 -5272 -5957 8435 8012
226 8012 7343 15272 11182 18716 17338 359 5955 -6192 -8098 -6878 -21694 -11901 -4207 -10697 -2039
$$ packed form
130A5089k6536K757J3723j6380k353j1123j0460L4900r723q041J4727l148J8835
143A2267L606k1287J6434J4149p917J4656j9506J1047K4166k4516J3143n763o440
156B4039K0773k5216j6868J5098j5357j1l593k1331K5277l777l508Q785j5639
169a1328J6122j706k7603k160n372j4761R665j4415k44K7377k576J3503O311K634
183d553K1862k814j2396N647j0325l728M855k4885J4297J2504l065K0570J37J6950
197C5056J9077m828L079N35j5616M677k1581k1218J4149j5587O202O576l747K0421
211B7195P815m86P116l527j15L766k5568l32l777j6168R227j0418o85J4392m23
226H012o69P929m090P534j378j6979N596j2147j906J220j4816R793P694o490Q658
$$ plain form
241 -2039 -1883 -7459 5140 -6114 -10892 -5582 -14995 -8055 -14569 -17750 -7239 -9624 -5660 917 -5968
256 -5968 241 4674 -10463 -3124 -6964 -11432 -3323 -11797 -10087 -3226 -4482 627 2424 -2016 8190
271 8190 945 -5553 -695 -12999 -5580 -5519 -11349 -2551 503 2520 9141 7383 8005 14868 1247
286 1247 2773 -3698 -12504 -5347 -13500 -12622 -2633 -1119 5607 14571 12492 20433 22318 15171 16885
301 16885 3094 3261 -375 -13222 -8984 -7007 -8137 3128 6908 7845 21295 18564 20354 20786 11433
316 11433 14135 4347 -1729 -2113 -7869 -5169 1225 -1203 6514 13273 8223 15844 9173 6387 7325
331 7325 -3354 -6341 -9923 -14414 -10603 -11175 -12145 -1198 -4072 -2038 4398 -6291 -1625 -5845 -14577
346 -14577 -14782 -20135 -24184 -22109 -24585 -21377 -13180 -13537 -2764 -3430 -4480 2195 -5083 -5904 -7044 -12504
$$ packed form
241b039J56n576J2599j1254m778N310r413O940o514l181J0511k385L964O577o885
256e968O209M433j5137P339l840m468Q109q474J710O861j256N109J797m440J0206
271H190p245o498M858j2304P419O1n830Q798L054K017O621j758O22O863j3621
286A247J526o471q806P157q153Q78R989J514O726Q964k079P941J885p147J714
301A6885j3791J67l636j2847M238J977j130J1265L780R37J3450k731J790M32r353
316A1433K702r788o076l84n756K700O394k428P717O759n050P621o671k786R38
331G325j0679k987l582m491L811n72r70J0947k874K034O436j0689M666m220q732
346a4577k05n353m049K075k476L208Q197l57J0773o66j050O675p278q21j140n460
$$ plain form
362 -12504 -11082 -9367 -12753 -4972 -2250 463 9504 5207 11346 11124 5516 7822 3219 -7 3950
377 3950 1396 -484 6559 3767 9411 12462 10677 16615 12218 11950 9609 1751 701 616 -6329 -1934
393 -1934 426 -1733 7410 5191 8414 11531 7798 9022 4028 -398 -319 -4616 -6607 -965 -4439 254
409 254 5879 1813 8557 8188 7710 9122 6474 3811 3252 -1477 -1586 -423 -3096 4972 3589 7437
425 7437 13718 10011 12489 12587 7717 7220 6823 1139 2973 1199 3333 9515 7302 15089 15701 14424
441 14424 17129 13358 9484 9818 5053 2273 3724 -1255 3497 3851 5109 12021 11790 16690 18705 15641
457 15641 15488 13487 6542 6692 3187 -521 3924 1004 5304 9427 10893 15861 15621 14665 14249 9435
473 9435 5681 5809 -1996 427 750 -3293 2569 1431 2945 5947 5192 4520 4150 -439 -2352 -7460
$$ packed form
362a2504J422J715l386P781K722K713R041m297O139k22n608K306m603l226L957
377C950k554j880P043k792N644L051j785N938m397k68k341p858j050q5o945M395
393a934K360k159R143k219L223L117l733J224m994m426P9m297j991N642l474M693
409B54N625m066O744l69m78J412k648k663n59m729j09J163k673Q068j383L848
425G437O281l707K478R8m870m97l97n684J834j774K134O182k213P787O12j277
441A4424K705l771l874L34m765k780J451m979M752L54J258O912k31M900K015l064
457A5641j53k001o945J50l505l708M445k920M300M123J466M968k40r56m16m814
473I435l754J28p805K423L23m043N862j138J514L002p55o72l70m589j913n108
$$ plain form
489 -7460 -13085 -10902 -16798 -15201 -11944 -12529 -6499 -2461 -1162 2464 4299 1534 2234 -2389 -3919 -4667
505 -4667 -7332 -3001 -4011 -865 4490 4700 7546 12264 11399 11877 15352 10777 11934 9733 7585 8135
521 8135 5873 8446 7658 7364 8439 8094 4502 6067 2135 -1112 -1224 -7591 -7235 -8363 -8557 -5555 -4517
538 -4517 -2755 -777 -840 -920 989 -4161 -1930 -3642 -5252 -2506 -3872 -1428 446 2563 5596 7424
554 7424 7622 10539 9624 7157 9441 5250 5152 5291 3770 4997 6240 6474 9011 10963 9865 11260 6807
571 6807 5791 2271 -4222 -3045 -7533 -7685 -5172 -5819 -3617 210 742 3183 4888 2415 3819 -877
587 -877 -2049 -4085 -7950 -6788 -7542 -7218 -4271 -1567 -797 4378 4483 6262 8344 4814 4432 1512 -988
604 -988 -2247 -2105 -2248 86 880 3589 6158 4200 8347 6492 4020 5399 1079 -699 -1740 -3207
$$ packed form
489g460n625K183n896J597L257n85O030M038J299L626J835k765P00m623j530p48
505d667k665M331j010L146N355K10K846M718q65M78L475m575J157k201k148N50
521H135k262K573p88k94J075l45l592J565l932l247j12o367L56j128j94L002J038
538d517J762J978o3q0J909n150K231j712j610K746j366K444J874K117L033J828
554G424J98K917r15k467K284m191r8J39j521J227J243K34K537J952j098J395m453
571F807j016l520o493J177m488j52K513o47K202L827N32K441J705k473J404m696
587h77j172k036l865J162p54L24K947K704P70N175J05J779K082l530l82k920k500
604i88j259J42j43K334P94K709K569j958M147j855k472J379m320j778j041j467
$$ plain form
620 -3207 -3190 -1072 -1129 2412 3108 5242 8058 5462 8768 7372 4793 4944 2855 723 969 1206 1571
637 1571 4522 4697 7729 7415 6971 8949 5616 5672 5550 3030 1888 3379 600 1911 3807 2337 4446
654 4446 3676 4396 2819 932 1473 -566 -1226 420 444 -765 3003 1866 3784 6204 5642 6125 5011
671 5011 3921 1147 -945 -1972 -2279 -3338 -1595 49 313 4506 3339 4114 6351 3736 2645 1012
687 1012 -1154 -3256 -3774 -5790 -4359 -3697 -1256 1281 970 3897 4324 3813 4286 2756 319 -960 -2090
704 -2090 -3319 -1404 -2218 1007 1953 3630 6716 5460 7108 5874 4703 2348 936 -2205 -3034 -3739
720 -3739 -4356 -1204 -1784 1786 3432 3956 5661 5049 3964 3303 1216 -1583 -2078 -5184 -4964 -4309 -4232 -1713
738 -1713 -713 1526 1963 2586 2731 2569 486 1420 68 -2621 -465 -2945 -1953 250 42 1887 1970
$$ packed form
620c207J7K118n7L541O96K134K816k596L306j396k579J51k089k132K46K37L65
637A571K951J75L032l14m44J978l333N6j22k520j142J491k779J311J896j470K109
654D446p70P20j577j887N41k039o60J646K4j209L768j137J918K420n62M83j114
671E011j090k774k092j027l07j059J743J644K64M193j167P75K237k615j091j633
687A012k166k102n18k016J431O62K441K537l11K927M27n11M73j530k437j279j130
704b090j229J915q14L225R46J677L086j256J648j234j171k355j412l141q29p05
720c739o17L152n80L570J646N24J705o12j085o61k087k799m95l106K20O55P7K519
738a713J000K239M37O23J45j62k083R34j352k689K156k480R92K203k08J845Q3
$$ plain form
755 1970 2698 1778 1306 42 746 -1703 -988 -531 -2178 146 1112 803 2455 2990 1078 2654 1457
772 1457 -63 -323 -1855 -1214 -2586 -1620 -408 -1421 114 571 649 823 1796 -781 -322 -1901 -3354
789 -3354 -3012 -4448 -2423 -2765 -1428 63 309 857 1854 705 194 341 -1940 -1512 -2838 -3170 -1589
806 -1589 -1156 1177 1606 4100 4337 5101 4380 4829 4106 1906 2201 -244 -470 -636 -507 438 2299 3377
824 3377 4546 5207 4659 4965 2543 2118 590 -2281 -2086 -4654 -4358 -2931 -2612 -1822 -29 182 353 386
842 386 -1044 -1183 -3039 -3340 -3823 -5216 -4298 -4487 -4033 -2017 -591 -889 1906 1049 816 1303 -526 -213
860 -213 -1852 -1580 -1606 -1464 -1059 681 629 2288 3424 2626 3663 1472 1080 591 -546 -754 -954 -289 -450
879 -450 775 856 2033 2250 2302 3715 1654 2017 1670 1094 418 571 820 1471 1772 2414 3540 2009 3748
$$ packed form
755A970P28r20m72j264P04k449P15M57j647K324R66l09J652N35j912J576j197
772A457j520k60j532O41j372R66J212j013J535M57P8J74R73k577M59j579j453
789c354L42j436K025l42J337J491K46N48R97j149n11J47k281M28j326l32J581
806a589M33K333M29K494K37P64p21M49p23k200K95k445k26j66J29R45J861J078
824C377J169O61n48L06k422m25j528k871J95k568K96J427L19P90J793K11J71L3
842C86j430j39j856l01m83j393R18j89M54K016J426k98K795q57k33M87j829L13
860b13j639K72k6J42M05J740n2J659J136p98J037k191l92m89j137k08k00O65j61
879d50J225Q1J177K17N2J413k061L63l47n76o76J53K49O51L01O42J126j531J739
$$ plain form
898 3748 3305 2101 1920 -729 -1303 -2327 -1785 -1856 -912 -1066 137 1127 518 1559 -899 -382 -1400 -3066
916 -3066 -3361 -4966 -5323 -4584 -4184 -4257 -1927 -1884 -600 374 142 881 -1086 -467 -1414 -2482 -3304 -3095 -3375
935 -3375 -2174 -280 -779 811 1305 1356 1209 24 223 -1574 -1198 -2144 -2009 -2579 -1150 -1377 511 2268
953 2268 1005 3084 2779 2241 735 -12 -868 -1527 -1453 -1720 -1342 -1288 626 534 2236 2970 2882 2820 2371 978
973 978 -160 478 -688 -957 -970 -1159 26 -874 823 412 331 821 -557 -1676 -1808 -3019 -4448 -2614
991 -2614 -3597 -2592 -2468 -1848 -1011 -1850 308 -1073 -1151 -960 -2025 -3059 -2783 -2908 -3078 -1749 -487 967
1009 967 792 2149 2855 3531 3237 2411 1971 1358 2191 14 948 1931 931 2208 2068 2934 3738 3091 2625
1028 2625 2937 1671 1059 340 -627 -215 -1169 -839 1027 329 1461 1528 1600 1462 823 50 -323 -1782 -1536
$$ packed form
898C748m43j204j81k649n74j024N42p1R44j54J203R90o09J041k458N17j018j666
916c066k95j605l57P39M00p3K330M3J284R74k32P39j967O19r47j068q22K09k80
935c375J201J894m99J590M94N1j47j185J99j797L76r46J35n70J429k27J888J757
953B268j263K079l05n38j506p47q56o59P4k67L78N4J914r2J702P34q8o2m49j393
973I78j138O38j166k69j3j89J185r00J697m11q1M90j378j119j32j211j429J834
991b614r83J005J24O20Q37q39K158j381p8J91j065j034K76j25j70J329J262J454
1009I67j75J357P06O76k94q26m40o13Q33k177R34R83j000J277j40Q66Q04o47m66
1028B625L12j266o12p19r67M12r54L30J866o98J132O7P2j38o39p73l73j459K46
$$ plain form
1047 -1536 -1438 -1901 -273 -753 582 1706 1504 1832 2388 1957 400 608 -480 -1136 -1288 -1215 -223 -963 406
1066 406 242 1474 1980 621 -56 1168 -162 -535 -670 -1385 -1226 -1261 -162 -490 -68 993 627 359
1084 359 142 731 -825 -289 -1858 -1647 -2053 -1098 -1095 -1054 880 453 1400 1270 1946 861 -217 330 -1032
1103 -1032 -1807 -927 -1846 -377 -147 640 1203 1583 976 1095 388 850 49 -1351 -64 -1041 -1057 -571 -785
1122 -785 676 968 571 988 597 812 939 -922 -967 -735 -1742 -979 -1728 -612 376 889 654 2354 1499
1141 1499 242 450 -242 123 -1747 -1847 -1406 -1641 -1030 -407 -180 701 1410 728 1342 787 -38 -197 -1094
1160 -1094 -867 -1260 -1087 -1048 -270 -512 551 336 747 1150 -10 281 -471 -1147 -974 -1099 -870 -782 160 -84
1180 -84 765 476 1650 970 802 1125 -369 -434 -640 -1400 -1402 -493 -475 -31 1182 529 1737 1152 1643 1082
$$ packed form
1047a536R8m63J628m80J335J124k02L28N56m31j557K08j088o56j52P3R92p40J369
1066D06j64J232N06j359o77J224j330l73j35p15J59l5J099l28M22J061l66k68
1084C59k17N89j556N36j569K11m06R55LM1J934m27R47j30O76j085j078N47j362
1103a032p75Q80r19J469K30P87N63L80o07J19p07M62q01j400J287r77j6M86k14
1122g85J461K92l97M17l91K15J27j861m5K32j007P63p49J116R88N13k35J700q55
1141A499j257K08o92L65j870j00M41k35O11O23K27Q81P09o82O14n55q25j59q97
1160a094K27l93J73L9P78k42J063k15M11M03j160K91p52o76J73j25K29Q8R42k44
1180h4Q49k89J174o80j68L23j494o5k06p60kR09J8M44J213o53J208n85M91n61
$$ plain form
1200 1082 235 943 -1039 -1017 -1166 -797 -788 112 661 195 1383 617 650 1417 801 430 -68 -629 -492 -621
1220 -621 -769 150 63 889 301 737 864 41 -172 -525 -492 -1175 -1002 -1110 -644 -655 -74 876 452 1330 710
1241 710 319 98 -210 -937 -985 -1052 -1251 -569 -995 186 42 687 1362 818 975 502 29 -225 -472 -934
1261 -934 -704 -521 -451 67 -68 1189 844 937 881 310 -105 -702 -796 -1477 -600 -1351 -532 -329 -197 531 337
1282 337 959 512 368 84 -566 -1121 -1378 -1374 -1786 -460 -904 -93 438 631 852 748 824 631 529 -247 -221
1303 -221 -1012 -912 -435 -815 671 175 484 1058 1177 1241 512 845 -220 -782 -719 36 -521 173 473 58
1323 58 1111 634 528 879 515 -307 605 -154 -674 -105 -502 831 -144 722 1113 1541 1147 1284 415 620
1343 620 1230 -606 173 -378 117 350 136 1250 220 1547 1661 1090 1179 1105 -115 -934 -51 -381 -170
$$ packed form
1200A082q47P08j982K2j49L69RR00N49m66J188p66L3P67o16l71m98n61J37j29
1220f21j48R19q7Q26n88M36J27q23k13l53L3o83J73j08M66j1N81R50m24Q78o20
1241G10l91k21l08p27m8o7j99O82m26J181j44O45O75n44J57m73m73k54k47m62
1261i34K30J83P0N18j35J257l45R3n6n71m15n97r4o81Q77p51Q19K03J32P28j94
1282C37O22m47j44k84o50n55k57Mm12J326m44Q11N31J93K21j04P6j93j02p76K6
1303b21p91J00M77l80J486m96L09N74J19O4p29L33j065n62O3P55n57O94L00m15
1323E8J053m77j06L51l64q22R12p59n20N69l97J333r75Q66L91M28l94J37q69K05
1343F20O10j836P79n51M95K33k14J114j030J327J14n71Q9p4j220q19Q83l30K11
$$ plain form
1362 -170 -885 350 443 718 967 1211 815 929 96 44 -274 -890 -1404 -575 -1303 241 -84 1056 552 1025
1382 1025 400 1138 923 -413 -180 -975 -732 -1296 -1393 -676 -775 -567 229 -179 -260 201 -79 -202 93 -1420
1402 -1420 -917 -1871 -1433 -1270 -1527 -215 97 320 -218 224 -175 49 -182 100 -1170 -1432 -728 -538 -426
1421 -426 -623 -1 -229 448 798 182 26 -55 154 -463 -481 -934 -701 -320 -869 -281 -526 245 -24 941 217
1442 217 323 433 -328 -317 -608 76 179 -100 280 490 1365 1076 1029 452 535 -219 -629 137 -142 691 453
1463 453 644 578 431 782 1096 -72 405 806 -633 227 -548 -924 -556 -337 -227 30 -73 505 934 670
1483 670 973 450 -202 68 -715 -493 -553 -588 -201 268 -106 691 921 649 990 190 700 144 -81 -528 -514
1504 -514 -435 -304 252 -335 404 383 332 724 444 68 -347 147 -1325 -810 -696 -902 -898 -482 -68 381 1375
$$ packed form
1362a70p15J235R3K75K49K44l96J14q33n2l18o16n14Q29p28J544l25J140n04M73
1382A025o25P38k15j336K33p95K43n64r7P17r9K08P96m08q1M61k80j23K95j513
1402a420N03r54M38J63k57J312L12K23n38M42l99K24k31K82j270k62P04J90J12
1421d26j97O22k28O77L50o16j56q1K09o17j8m53K33L81n49N88k45P71k69R65p24
1442B17J06J10p61J1k91O84J03k79L80K10Q75k89m7n77Q3p54m10P66k79Q33k38
1463D53J91o6j47L51L14j168M77M01j439Q60p75l76L68K19J10K57j03N78M29k64
1483F70L03n23o52K70p83K22o0l5L87M69l74P97K30k72L41q00N10n56k25m47J4
1504e14P9J31N56n87P39k1n1L92k80l76m15M94j472N15J14k06MM16M14M49R94
$$ plain form
1525 1375 834 592 276 347 -532 -597 -610 -973 -944 -694 -139 635 327 920 258 956 622 231 719 -147 144
1546 144 487 395 -140 269 299 785 694 734 720 193 53 -391 -115 -137 960 -73 165 282 226 584 298 749
1568 749 620 659 62 90 -685 -355 -81 -21 250 -173 -60 385 97 536 803 363 506 45 -27 -255 -362
1589 -362 -317 162 144 859 299 642 418 316 378 618 -340 -82 -386 -438 -421 -525 115 945 111 87 768 383
1611 383 473 249 -48 -403 -107 -854 -761 -866 -451 -822 10 400 335 692 530 387 -177 -87 -190 28 -459
1632 -459 -545 -671 -91 41 282 253 402 552 193 664 240 238 406 -300 -6 -329 653 134 29 635 876
1653 876 703 48 1156 421 249 96 -326 -285 -913 -10 -128 -340 174 349 850 518 583 -54 -274 -503
1673 -503 -560 -373 -697 -284 -553 15 -24 217 144 475 543 220 -376 -117 -388 -454 -160 -126 99 494 2 211
$$ packed form
1525A375n41k42l16P1q79o5j3l63K9K50N55P74l08N93o62O98l34l91M88q66K91
1546A44L43r2n35M09L0M86r1M0j4n27j40m44K76k2J097j033K38J17n6L58k86M51
1568G49j29L9n97K8p75L30K74O0K71m23J13M45k88M39K67m40J43m61p2k28j07
1589c62M5M79j8P15n60L43k24j02O2K40r58K58l04n2J7j04O40Q30q34k4O81l85
1611C83R0k24k97l55K96p47R3j05M15l71Q32L90o5L57j62j43n64R0j03K18m87
1632d59q6j26N80J32K41k9J49J50l59M71m24kJ68p06K94l23R82n19j05O06K41
1653H76j73o55J108p35j72j53m22M1o28R03j18k12N14J75N01l32O5o37k20k29
1673e03n7J87l24M13k69N68l9K41p3L31O8l23n96K59k71o6K94L4K25L95m92K09
$$ plain form
1695 211 448 432 202 451 55 -210 -403 -225 -74 -448 89 486 60 488 771 547 155 793 42 286
1715 286 -176 -127 -508 -384 -266 -154 333 387 416 512 280 269 100 287 -256 -114 356 -5 -296 338 -46 -86
1737 -86 665 163 115 -336 -9 19 -327 -763 -461 -141 -353 -245 -628 -207 -121 317 88 -72 234 -855 -212
1758 -212 -932 -854 -1024 -556 -674 -637 -179 -819 -309 -240 -383 -423 -523 -481 -824 -631 -883 -832 -734 -384 -636 -773
1780 -773 -271 -247 -274 45 -249 -528 -429 -566 -624 -281 -250 -61 -191 269 461 453 699 398 564 50 81 110 1
1803 1 97 -68 149 301 558 606 865 690 719 725 490 284 152 317 -201 -67 -197 -251 295 456 369 378 565 192
1827 192 227 -118 -192 -223 -74 -112 -329 92 -33 162 263 545 301 -119 154 -190 -412 -322 -59 -228 -52 -145
1849 -145 -54 279 173 450 391 414 84 -189 -7 -184 -116 -309 -233 -133 -129 -106 235 290 256 446 265 -154 -170 -138
$$ packed form
1695B11K37j6k30K49l96k65j93J78J51l74N37L97m26M28K83k24l92O38p51K44
1715B86m62M9l81J24J18J12M87N4K9R6k32j1j69J87n43J42M70l61k91O34l84m0
1737h6P51n02m8m51L27K8l46m36L02L20k12J08l83M21Q6M38k29j60L06j089O43
1758b12p20P8j70M68j18L7M58o40N10O9j43m0j00M2l43J93k52N1R8L50k52j37
1780g73N02K4k7L19k94k79R9j37n8L43L1J89j30M60J92qK46l01J66n14L1K9j09
1803AR6j65K17J52K57M8K59j75K9Ok35k06j32J65n18J34j30n4N46J61q7RJ87l73
1827A92L5l45p4l1J49l8k17M21j25J95J01K82k44m20K73l44k22R0K63j69J76r3
1849a45R1L33j06K77n9K3l30k73J82j77O8j93P6J00MK3L41N5l4J90j81m19j6L2
$$ plain form
1873 -138 -92 -181 26 -9 41 -213 290 249 235 307 22 244 -216 -67 -223 -267 -184 -212 -96 382 311 308 486 306
1897 306 384 171 193 94 46 -259 -151 -120 -51 28 -78 324 497 457 17 426 202 -79 -81 35 -61 201 22 171
1921 171 223 389 -1 605 359 564 548 310 578 379 435 222 399 486 387 1236 516 701 927 699 830 606
1943 606 409 230 384 303 448 507 571 680 919 812 649 869 692 810 601 546 383 384 668 401 595 292
1965 292 222 460 604 429 30 545 -75 -17 -43 31 68 199 3 -29 230 -72 244 -14 280 -99 -402 -176
1987 -176 -376 -312 -286 -193 -135 197 17 161 162 247 341 133 312 158 -79 -182 -140 68 126 410 353 58 386 409
2011 409 140 127 45 -132 154 103 353 -62 214 24 125 285 113 350 253 225 233 -95 16 -188 83 -56
2033 -56 -224 -100 167 6 192 150 554 273 -74 175 -10 90 -71 44 -244 101 233 158 23 49 267
$$ packed form
1873a38M6q9K07l5N0k54N03m1j4P2k85K22m60J49j56m4Q3k8J16M78p1lJ78j80
1897C06P8k13K2r9m8l05J08L1O9P9j06M02J73m0m40M09k24k81kJ16r6K62j79J49
1921A71N2J66l90O06k46K05j6k38K68j99N6k13J77Q7r9Q49p20J85K26k28J31k24
1943F06j97j79J54q1J45N9O4J09K39j07j63K20j77J18k09n5j63JK84k67J94l03
1965B92p0K38J44j75l99N15o20N8k6P4L7J31j96l2K59l02L16k58K94l79l03K26
1987a76k00O4K6R3N8L32j80J44JQ5R4k08J79j54k37j03M2K08N8K84n7k95L28K3
2011D09k69j3q2j77K86n1K50m15K76j90J01J60j72K37r7k8Ql28J11k04K71j39
2033e6j68J24K67j61J86m2M04k81l47K49j85J00j61J15k88L45J32p5j35K6K18
$$ plain form
2054 267 333 237 -297 -359 16 -288 225 -172 -234 -57 -147 40 250 -273 50 -320 -283 -335 -269 -347 -184 -147 -71 -44
2078 -44 361 -213 138 166 -90 191 68 116 229 -26 29 -243 98 270 362 338 433 38 447 553 228 197 -123
2101 -123 99 70 31 13 -2 -43 91 240 -35 94 227 -91 110 -113 239 133 -11 -272 -6 -42 -274 696
2123 696 -246 88 -126 -81 336 -48 118 99 -411 -453 -157 -288 -227 43 84 181 127 -86 163 245 -311 -40 41
2146 41 -26 -80 129 63 139 158 213 311 114 235 26 -41 26 -397 134 -105 -2 -60 -110 106 184 92 -15 10 -23
2171 -23 -218 -350 -321 20 331 -151 -106 182 204 286 480 43 392 325 158 -209 256 70 275 92 83 366 216
2194 216 586 -45 214 41 79 -16 296 -59 -204 -132 -418 -343 -309 90 36 -143 -269 -314 -590 -185 -13 -506
2216 -506 -119 -443 -404 -166 -329 -119 -143 -77 -196 -187 -146 -91 -11 -274 -93 -304 -128 -130 -325 68 -240 74 12 -152
$$ packed form
2054B67O6r6n34o2L75l04N13l97o2J77r0J87K10n23L23l70L7n2O6p8J63L7P6K7
2078d4M05n74L51K8k56K81j23M8J13k55N5k72L41J72R2k4R5l95M09J06l25l1l20
2101a23K22k9l9j8j5m1J34J49k75J29J33l18K01k23L52j06j44k61K66l6k32R70
2123F96r42L34k14M5M17l84J66j9n10m2K96j31O1K70M1R7n4k13K49Q2n56K71Q1
2146D1o7n4K09o6P6J9N5R8j97J21k09o7O7m23N31k39J03n8n0K16P8r2j07K5l3
2171b3j95j32K9L41L11m82M5K88K2Q2J94m37L49o7j67l67M65j86K05j83rK83j50
2194B16L70o31K59j73L8r5L12l55j45P2k86P5L4L99n4j79j26m5k76M05J72m93
2216e06L87l24L9K38j63K10k4O6j19RM1N5Q0k63J81k11J76kj95L93l08L14o2j64
$$ plain form
2240 -152 -559 -158 -338 124 -28 -147 -306 -498 -469 84 -130 -517 -307 -214 -581 -81 -155 -423 45 -421 -25
2261 -25 -903 56 235 -241 -235 -253 -26 118 565 -93 1 -298 -195 18 -37 -390 -253 206 115 251 -5 181
2283 181 90 -106 -314 -185 -51 -124 144 -180 300 -467 -235 708 -248 86 171 146 -6 321 61 279 180 332
2305 332 58 264 329 164 459 547 365 460 122 412 43 267 300 83 361 319 297 420 354 542 332 217
2327 217 294 411 116 37 3 163 262 -55 -35 65 213 40 237 98 344 -39 257 107 344 -211 92 131
2349 131 136 165 164 246 -43 67 91 142 -108 -183 63 68 53 -15 46 -338 -158 70 27 -35 -608 -121 -239 -312 -494 -350
2375 -350 -183 -139 18 -152 169 15 -194 -145 70 30 -127 -56 56 -368 -289 -78 -88 -43 275 -201 90 -57
2397 -57 -84 145 -374 59 31 -34 72 -239 -118 -210 -62 -44 -278 -143 45 -13 -54 -71 138 -238 -161 -389 -261
$$ packed form
2240a52m07M01j80M62j52j19j59j92K9N53k14l87K10R3l67N00p4k68M68m66L96
2261b5q78R59J79m76Oj8K27J44M47o58R4k99J03K13n5l53J37M59r1J36k56J86
2283A81r1j96k08J29J34p3K68l24M80p67K32R43r56L34Q5k5j52L27k60K18r9J52
2305C32k74K06O5j65K95Q8j82R5l38K90l69K24L3k17K78m2k2J23o6J88k10j15
2327B17P7J17k95p9l4J60R9l17K0J00J48j73J97j39K46l83K96j50K37n55L03L9
2349A31NK9jQ2k89J10K4N1k50p5K46Nj5o8O1l84J80K28m3o2n73M87j18p3j82J44
2375c50J67M4J57j70L21j54k09M9K15m0j57P1J12m24P9K11j0M5L18m76K91j47
2397e7k7K29n19M33k8o5J06l11J21r2J48J8k34J35J88n8m1j7K09l76P7k28J28
$$ plain form
2420 -261 103 -319 -327 86 -142 198 151 -270 58 -17 -322 -270 -32 -183 -59 -275 -2 -75 159 -249 -176 -436
2442 -436 -135 -346 -221 -41 -254 -116 -312 -158 -40 48 -76 17 -214 -93 -151 1 -146 -451 -70 -568 235
2463 235 -139 -32 60 728 109 12 58 -643 278 -11 -132 93 -32 -157 162 -142 116 16 185 78 186
2484 186 47 145 78 19 24 -217 176 52 265 166 291 289 -13 69 -31 139 -60 186 12 65 -32 17 190 268
2508 268 -73 145 288 92 -26 323 -19 -96 -15 -31 191 97 -56 -202 38 -216 131 -214 -146 -29 -15 -30
2530 -30 84 -203 -7 -146 -6 -14 76 -33 -171 16 -56 -90 61 116 -319 100 218 80 -128 317 -222 -249 140
2553 140 121 -89 40 26 38 82 250 -26 220 -63 101 122 -15 57 326 19 86 -56 -181 309 -112 143
2575 143 100 61 16 26 19 -141 198 -69 136 167 -48 91 84 -57 -222 -155 -62 39 83 143 -124 10 -54 110 -51
$$ packed form
2420b61L64m22qM13k28L40m7m21L28p5l05N2K38j51J24k16K73p3K34m08P3k60
2442d36L01k11J25J80k13J38j96J54J18Q8j24R3k31J21n8J52j47l05L81m98Q03
2463B35l74J07R2O68o19r7M6p01R21k89j21K25j25j25L19l04K58j00J69j07J08
2484A86j39R8o7n9Nk41L93j24K13r9J25kl02Q2j00J70j99K46j74N3r7M9J73P8
2508B68l41K18J43j96j18L49l42p7Q1j6K22r4j53j46K40k54L47l45O8J17J4j5
2530c0J14k87J96j39J40qR0j09j38J87p2l4J51N5m35M19J18j38k08M45n39k7L89
2553A40j9k10J29j4J2M4J68k76K46k83J64K1j37P2K69l07O7j42j25M90m21K55
2575A43m3l9m5J0pj60L39k67K05L1k15J39pj41j65O7R3J01M4O0k67J34o4J64j61
$$ plain form
2600 -51 -36 -269 -252 -196 -181 98 65 -79 -279 -28 -59 10 -116 -151 157 -188 -41 -71 -71 124 22 -11 -90 100 163
2625 163 -204 7 33 119 148 -48 -158 -32 60 170 127 3 223 117 119 113 -64 48 152 337 115 132 44 -35
2649 -35 126 -35 243 -17 -123 -31 -170 -146 -95 71 66 -70 -48 32 -51 -76 157 -145 113 -18 321 17 -149
2672 -149 6 -1 158 66 133 58 284 -314 -29 129 156 -174 -124 -45 -224 -34 -251 142 92 -309 -120 97 135
2695 135 188 83 -127 -43 -311 -209 -243 -357 -1 82 -110 33 231 -89 134 126 38 129 -7 399 238 46 225
2718 225 -131 -36 -28 -9 69 66 16 -197 90 -206 -60 80 148 -121 -70 198 -43 158 103 75 -288 -249 -50 80
2742 80 -5 121 -140 -96 -328 92 -15 213 16 45 -86 35 -112 -31 -52 -107 -47 -172 17 34 177 -178 -140
2765 -140 -153 -57 -83 -143 -79 -280 -446 -57 19 -155 119 -49 -1 -117 -26 -209 -195 -87 -66 -164 20 -180 27 -260
$$ packed form
2600e1J5k33J7N6J5K79l3j44k00K51l1O9j26l5L08l45J47l0%J95j02l3p9J90O3
2625A63l67K11K6Q6K9j96j10J26R2J10m3j24K20j06Koj77J12J04J85k22J7q8p9
2649c5J61j61K78k60j06R2j39K4N1J66nj36K2Q0q3k5K33l02K58j31L39l04j66
2672a49J55pJ59r2O7p5K26n98K85J58K7l30N0P9j79J90k17L93n0m01J89K17L8
2695A35N3j05k10Q4k68J02l4j14L56Q3j92J43J98l20K23qq8R1j36M06j61j92J79
2718B25l56R5QJ9P8ln0k13K87k96J46J40O8k69N1K68k41K01n5k8l63L9J99J30
2742H0q5J26k61M4k32M20j07K28j97K9j31J21j47Q1k1n5O0j25J89J7J43l55L8
2765a40j3R6k6o0O4k01j66L89P6j74K74j68M8j16R1j83J4J08K1r8J84k00K07k87
$$ plain form
2789 -260 -16 -54 -129 98 -296 -112 -61 40 -4 75 -99 -333 -213 -118 -244 -169 -296 -161 -327 -121 -240 -213 -78
2812 -78 -250 -252 -229 -107 -230 -360 -251 -256 -240 -235 -55 -273 -153 -54 -59 -178 10 -141 -215 -326 -135 -108 -96 90 256
2837 256 115 52 -32 63 -69 -200 -128 -217 84 -279 74 77 -303 72 -311 -111 -301 -207 -180 -282 -94 -405 -157
2860 -157 -138 -353 -223 -117 8 -5 -33 -270 213 65 -75 145 38 48 236 82 -58 120 -99 177 -185
2881 -185 43 143 14 -31 -99 -173 -148 -115 -128 35 -111 117 -259 -108 200 -58 -246 0 231 -265 -334 182
2903 182 42 -286 197 77 97 -277 -50 69 55 189 80 154 12 -54 -25 291 61 -7 -20 111 -171 -65
2925 -65 -115 -185 116 -1 -116 169 -74 5 55 0 26 8 43 -75 -44 -215 -13 -203 110 3 69 -18 179 -109
2949 -109 -265 -31 -218 13 68 -137 -14 -17 -8 -186 67 -14 142 -86 3 101 30 95 40 134 181 3 -340 -42
$$ packed form
2789b60K44l8p5K27l94J84N1J01m4P9j74k34J20R5j26P5j27J35j66K06j19K7J35
2812g8j72kK3J22j23j30J09nJ6NJ80k18J20R9nj19J88j51p4j11J91K7J2J86J66
2837B56j41o3q4R5j32j31P2q9L01l63L53Ll80L75l83K00j90R4K7j02J88l11K48
2860a57J9k15J30J06J25j3k8k37M83j48j40K20j07J0J88j54j40J78k19K76l62
2881a85K28J00j29m5o8p4K5L3j3J63j46K28l76J51L08k58j88K46K31m96o9N16
2903A82j40l28M83j20K0l74K27J19j4J34j09P4j42o6K9L16k30o8j3J31k82J06
2925f5n0p0L01j17j15K85k43P9N0n5K6j8L5j18L1j71K02j90L13j07O6q7J97k88
2949a09j56K34j87K31N5k05J23lRj78K53q1J56k28Q9R8p1O5n5R4M7j78l43K98
$$ plain form
2973 -42 -64 -211 -172 -97 124 -29 -34 -220 159 103 -86 -24 -94 10 -139 -84 4 149 61 -96 -39 174 185 151 -112
2998 -112 -120 -204 130 48 -138 166 152 -277 243 -153 222 36 68 616 -53 138 255 50 -111 44 -46 -108 -222
3021 -222 184 -28 -104 -92 -193 3 -248 -173 -276 -55 -24 -54 -82 -104 103 -42 107 193 -154 -188 -106 -222 152
3044 152 70 79 116 76 -44 -25 -146 -87 -25 35 -105 -58 5 -134 107 -67 126 98 -155 -29 -43 21 -40 161 -98
3069 -98 126 130 64 -40 -88 -49 231 -25 -50 125 120 164 61 -17 69 361 -61 24 -74 118 258 300 190 117 73 -94
3095 -94 -12 111 22 305 157 64 90 17 357 68 -221 785 131 31 -321 -23 -53 -83 42 83 3 -31 233
3118 233 13 17 16 -118 23 -35 90 202 117 -73 -263 41 -76 58 36 54 176 -119 -9 67 373 230 221 9
3142 9 -50 20 4 -48 -43 212 68 80 1 -58 32 -187 -53 -145 -24 -174 -1 -138 -116 -18 50 -31 46 -82 -91 -201 -176
$$ packed form
2973d2k2j47L9P5K21j53nj86L79n6j89O2p0J04j49N5Q8J45q8j57N7K13J1l4k63
2998a12qq4L34q2j86L04j4m29N20l96L75j86L2N48o69J91J17k05j61J55r0o2j14
3021b22M06k12p6J2j01J96k51P5j03K21L1l0k8k2K07j45J49Q6l47l4Q2j16L74
3044A52q2RL7m0j20J9j21N9O2O0j40M7O3j39K41j74J93k8k53J26j4O4o1K01k59
3069i8K24Mo6j04m8L9K80k56k5J75nM4j03p8Q6K92m22Q5r8J92J40M2j10p3m4j67
3095i4Q2J23q9K83j48r3K6p3L40k89k89J006o54j00l52K98l0l0J25M1q0l4K64
3118B33k20Mjj34J41n8J25J12q5j90j90L04j17J34k2J8J22k95J10P6L06j43rk12
3142In9P0j6n2NK55j44J2p9n9R0k19J34r2J21j50J73j37K2R8O8q1P7j28rj10K5
$$ plain form
3169 -176 60 142 -361 137 -109 -185 -80 -16 -251 31 101 66 40 -303 40 65 -253 49 -109 -118 86 -103 117
3192 117 -129 -15 -1 155 -2 -244 31 -62 11 6 68 32 -178 -51 28 209 237 -69 18 -94 -153 -68 -259 302
3216 302 -31 -53 -132 -58 -244 -8 9 -40 -49 64 -133 140 250 127 15 103 270 -63 11 -26 -124 -79 120 94
3240 94 -77 -200 -177 -67 -107 152 -301 99 -51 -208 105 -130 -90 -198 137 -161 16 -19 51 -228 113 85
3262 85 -165 69 67 -35 58 -188 118 -93 -148 -80 -278 -280 112 -53 112 29 58 110 -33 75 -24 -172 457 393
3286 393 -21 386 -154 128 -50 -122 155 290 24 -56 58 191 33 58 7 146 -169 -10 -124 -21 13 -50
3308 -50 -117 130 118 -77 146 0 80 30 -83 -17 35 59 -78 -31 77 192 52 68 42 -98 91 39 -242 -88
3332 -88 67 -142 212 -104 -68 -83 -47 -137 -124 28 106 18 -30 47 -29 -109 -168 -217 -80 -403 -17 -174 -477 178 -272
$$ packed form
3169a76K36Q2n03M98k46p6J05O4k35K82P0l5k6l43L43K5l18L02j58rK04j89K20
3192A17k46J14J4J56j57k42K75r3P3nO2l6k10J27P9J81K8l06Q7j12n9Q5j91N61
3216C02l33k2p9P4j86K36J7m9rJ13j97K73J10j23j12Q8J67l33P4l7r8M5J99k6
3240I4j71j23K3J10m0K59m53M00j50j57L13k35M0j08L35k98J77l5P0k79L41k8
3262H5k50K34kj02R3k46L06k11n5O8j98kL92j65J65q3K9N2j43J08r9j48O29o4
3286C93m14M07n40K82j78p2K77J35k66q0J14J33j58K5n1J39l15J59j14J03L4o3
3308e0o7K47j2j95K23j46Q0n0j13O6N2K4j37M7J08J15j40J6k6j40J89n2k81J54
3332h8J55k09L54l16L6j5L6r0J3J52P8q8m8P7p6q0n9m9J37l23L86j57l03O55m50
$$ plain form
3357 -272 355 356 -356 -67 341 -133 90 -20 29 282 53 151 85 -28 -121 -100 -15 165 22 -11 -146 -314 8
3380 8 -69 52 -13 83 265 138 -26 269 -7 -70 -119 -167 164 74 -143 -77 18 -82 -30 -44 -320 -112 -7 -18 403
3405 403 -212 52 -82 -244 -101 -118 4 340 -145 -124 17 -109 -197 177 -239 29 -122 -248 -43 -249 125
3426 125 -112 -28 -37 -130 -19 264 -113 103 4 350 72 -38 61 134 -91 108 -25 16 138 -137 161 -283 -167
3449 -167 125 -34 -76 58 -5 -11 118 32 137 6 27 -19 -32 84 107 -46 56 43 -23 204 1 68 136 -142
3473 -142 -202 115 123 70 24 -2 -65 154 42 26 -21 -145 2 35 -210 1 -135 -14 -79 -64 82 -31 28 -112
3497 -112 -267 123 -29 258 -185 -53 -127 41 -201 5 162 -24 153 87 172 -22 -63 155 127 -70 -256 -7
3519 -7 385 205 305 231 -41 173 121 -89 209 161 91 -167 163 -62 245 42 15 -91 124 70 -9 62 -183
$$ packed form
3357b72O27Jp12K89M08m74K23j10M9K53k29R8o6j13r3K1Q5J80j43l3j35j68L22
3380Hp7J21o5R6J82j27j64K95k76o3m9m8L31r0k17O6R5j00N2j4k76K08J05j1M21
3405D03o15K64j34j62J43j7J22L36m85K1J41j26q8L74m16K68j51j26K05k06L74
3426A25k37Q4rr3J11K83l77K16r9L46k78j10R9P3k25J99j33M1J22k75K98m44J16
3449a67K92j59m2J34o3oJ29q6J05j31K1m6j3J16K3j53J02j3o6K27k03O7O8k78
3473a42o0L17Qn3m6k6o3K19j12j6m7j24J47L3k45K11j36J21o5J5J46j13N9j40
3497a12j55L90j52K87m43J32p4J68k42K06J57j86J77o6Q5j94m1K18k8j97j86K49
3519gL92j80J00p4k72K14n2k10K98m8p0k58L30k25L07k03k7j06K15n4p9P1k45
$$ plain form
3542 -183 232 -24 218 -149 78 199 -143 -235 -61 -221 -97 -293 228 142 -106 -56 -21 -66 40 -141 -134 -187 8
3565 8 -70 -109 199 -144 53 -68 -200 -266 -204 90 -62 5 -3 38 -51 16 -30 -86 192 -107 -96 -62 -83 261 -103 31
3591 31 79 -215 103 -99 -181 -81 59 -381 197 -93 46 92 -24 273 136 -143 -143 330 65 -61 -230 164
3613 164 -52 -242 216 -263 95 -75 99 70 -6 -65 91 -140 -35 -36 -178 85 20 40 -62 296 -307 -212 175
3636 175 31 72 -38 -34 88 3 6 -6 -202 -61 -212 -172 298 54 -46 -195 72 31 -31 -119 -218 121 -49 -38
3660 -38 -5 150 64 -91 19 108 -17 215 110 103 101 227 -115 295 166 -393 -4 193 -57 105 4 23 39
3683 39 -100 165 3 148 148 -104 237 -26 281 40 -25 98 -150 -18 -217 29 56 46 317 198 123 -65
3705 -65 56 -45 -187 -149 -17 -162 20 281 -18 -189 -189 -24 143 -84 36 24 35 36 -1 62 -161 -99 13 155
$$ packed form
3542a83M15k56K42l67K27J21l42r2J74j60J24j96N21q6k48N0L5m5J06j81Pn3J95
3565Hp8l9L08l43J97j21j32o6O2K94j52O7qM1q9O7m6n6K78k99J1L4k1L44l64J34
3591C1M8k94L18k02q2J00J40m40N78k90J39M6j16K97j37k79%M73k65j26j69L94
3613A64k16j90M58m79L58j70J74k9p6n9J56k31J05jj42K63o5K0j02L58o03R5L87
3636A75j44M1j10MJ22q5Lj2j96J41j51M0M70k44j00j49K67m1o2q8r9L39j70J1
3660c8L3J55q6j55J10Q9j25K32j05pkJ26l42M10j29n59L89J97k50J62j01J9J6
3683C9j39K65j62J45%k52L41k63L07k41o5J23k48J32j99K46K7j0K71j19p5j88
3705f5J21j01j42L8J32j45J82K61k99j71%J65J67k27J20j2J1Jl7O3k23O2J12J42
$$ [...]
8191A24
##END NTUPLES=NMR FID
##END=
