##TITLE=1H_K-411/2_3
 CDCl3, 8 sc, 
 10.06.2021
##JCAMPDX= 6.0         $$ Bruker NMR JCAMP-DX V2.0
##DATA TYPE= NMR FID
##DATA CLASS= NTUPLES
##ORIGIN= UXNMR, Bruker Analytische Messtechnik GmbH
##OWNER= root
$$ XWIN-NMR		Version 3.5
$$ Thu Jun 10 11:28:13 2021 Russian Standard Time (UT+4h)  she@DPX200
##.OBSERVE FREQUENCY= 200.131506
##.OBSERVE NUCLEUS= ^1H
##.DELAY= (6, 6)
##.ACQUISITION MODE= SIMULTANEOUS
##.ACQUISITION SCHEME= undefined
##.AVERAGES= 8
##.DIGITISER RES= 18
##SPECTROMETER/DATA SYSTEM= spect
##.PULSE SEQUENCE= zg30
##.SOLVENT NAME= CDCl3
##.SHIFT REFERENCE= (INTERNAL, CDCl3, 0, 15.7039)
##AUDIT TRAIL= $$ (NUMBER, WHEN, WHO, WHERE, WHAT)
$$ ##TITLE= Audit trail, XWIN-NMR		Version 3.5
$$ ##JCAMPDX= 5.01
$$ ##ORIGIN= Bruker BioSpin GmbH
$$ ##OWNER= she
$$ F:/spectra/data/she/nmr/H-F/1/audita.txt
$$ ##AUDIT TRAIL=  $$ (NUMBER, WHEN, WHO, WHERE, WHAT)
(   1,<2021-06-10 11:26:56.60 +0400>,<she>,<DPX200>,
      <created by zg, POWCHK disabled, PULCHK disabled
       configuration hash MD5:
       00 E9 B6 7A A2 85 ED C7 34 08 36 98 17 FE 4E 26
       data hash MD5: 16K
       5F 00 2A BC 71 D7 19 08 4E 10 45 4A B3 7B 5E 22>)
$$ ##END=
$$ 
$$ hash MD5
$$ D2 1F 20 4B 7D AD 16 75 1E 30 00 33 80 75 69 0D
##$RELAX= 
##$RELAX= 
##$RELAX= 
##$RELAX= 
##$RELAX= 
##$RELAX= 
$$ Bruker specific parameters
$$ --------------------------
##$DU= <F:/spectra>
##$EXPNO= 1
##$NAME= <H-F>
##$PROCNO= 1
##$TYPE= <nmr>
##$USER= <she>
##$AMP= (0..31)
100 100 100 100 100 100 100 100 100 100 100 100 100 100 100 100 100 100 
100 100 100 100 100 100 100 100 100 100 100 100 100 100 
##$AQSEQ= 0
##$AQ_mod= 1
##$AUNM= <au_zg>
##$AUTOPOS= <>
##$BF1= 200.13
##$BF2= 200.13
##$BF3= 200.13
##$BF4= 200.13
##$BF5= 200.13
##$BF6= 200.13
##$BF7= 200.13
##$BF8= 200.13
##$BYTORDA= 1
##$CFDGTYP= 0
##$CFRGTYP= 5
##$CHEMSTR= <none>
##$CNST= (0..31)
1 1 145 1 1 1 1 1 1 1 1 1 1 1 1 1 1 1 1 1 1 1 1 1 1 1 1 1 1 1 1 1 
##$CPDPRG= <>
##$CPDPRG1= <>
##$CPDPRG2= <>
##$CPDPRG3= <>
##$CPDPRG4= <mlev>
##$CPDPRG5= <mlev>
##$CPDPRG6= <mlev>
##$CPDPRG7= <mlev>
##$CPDPRG8= <mlev>
##$CPDPRGB= <>
##$CPDPRGT= <>
##$D= (0..31)
0 1.2 0 0 0 0 0 0 0 0.06 0 0.03 0 0 0 0 0.0002 0 0 0 0 0 0 0 0 0 0 0 0 
0 0 0 
##$DATE= 1623310015
##$DBL= (0..7)
120 120 120 120 120 120 120 120 
##$DBP= (0..7)
150 150 150 150 150 150 150 150 
##$DBP07= 0
##$DBPNAM0= <>
##$DBPNAM1= <>
##$DBPNAM2= <>
##$DBPNAM3= <>
##$DBPNAM4= <>
##$DBPNAM5= <>
##$DBPNAM6= <>
##$DBPNAM7= <>
##$DBPOAL= (0..7)
0.5 0.5 0.5 0.5 0.5 0.5 0.5 0.5 
##$DBPOFFS= (0..7)
0 0 0 0 0 0 0 0 
##$DE= 6
##$DECBNUC= <off>
##$DECIM= 32
##$DECNUC= <off>
##$DECSTAT= 4
##$DIGMOD= 1
##$DIGTYP= 9
##$DL= (0..7)
0 120 120 120 120 120 120 120 
##$DP= (0..7)
150 150 150 150 150 150 150 150 
##$DP07= 0
##$DPNAME0= <>
##$DPNAME1= <>
##$DPNAME2= <>
##$DPNAME3= <>
##$DPNAME4= <>
##$DPNAME5= <>
##$DPNAME6= <>
##$DPNAME7= <>
##$DPOAL= (0..7)
0.5 0.5 0.5 0.5 0.5 0.5 0.5 0.5 
##$DPOFFS= (0..7)
0 0 0 0 0 0 0 0 
##$DQDMODE= 0
##$DR= 18
##$DS= 0
##$DSLIST= <SSSSSSSSSSSSSSS>
$$ [...]
##$SUBNAM2= <"">
##$SUBNAM3= <"">
##$SUBNAM4= <"">
##$SUBNAM5= <"">
##$SUBNAM6= <"">
##$SUBNAM7= <"">
##$SUBNAM8= <"">
##$SUBNAM9= <"">
##$SW= 20.0188882624521
##$SWIBOX= (0..15)
0 0 2 0 0 0 0 0 0 0 0 0 0 0 0 0 
##$SW_h= 4006.41025641026
##$TD= 16384
##$TD0= 1
##$TE= 0
##$TE2= 300
##$TE3= 300
##$TEG= 300
##$TL= (0..7)
0 120 120 120 120 120 120 120 
##$TP= (0..7)
150 150 150 150 150 150 150 150 
##$TP07= 0
##$TPNAME0= <>
##$TPNAME1= <>
##$TPNAME2= <>
##$TPNAME3= <>
##$TPNAME4= <>
##$TPNAME5= <>
##$TPNAME6= <>
##$TPNAME7= <>
##$TPOAL= (0..7)
0.5 0.5 0.5 0.5 0.5 0.5 0.5 0.5 
##$TPOFFS= (0..7)
0 0 0 0 0 0 0 0 
##$TUNHIN= 0
##$TUNHOUT= 0
##$TUNXOUT= 0
##$USERA1= <user>
##$USERA2= <user>
##$USERA3= <user>
##$USERA4= <user>
##$USERA5= <user>
##$V9= 5
##$VALIST= <valist>
##$VCLIST= <CCCCCCCCCCCCCCC>
##$VD= 0
##$VDLIST= <DDDDDDDDDDDDDDD>
##$VPLIST= <PPPPPPPPPPPPPPP>
##$VTLIST= <TTTTTTTTTTTTTTT>
##$WBST= 1024
##$WBSW= 4
##$XGAIN= (0..3)
0 0 0 0 
##$XL= 0
##$YL= 0
##$YMAX_a= 242061
##$YMIN_a= -29801
##$ZGOPTNS= <>
##$ZL1= 120
##$ZL2= 120
##$ZL3= 120
##$ZL4= 120
##$ABSF1= 10
##$ABSF2= 0
##$ABSG= 5
##$ABSL= 3
##$ALPHA= 0
##$AQORDER= 0
##$ASSFAC= 0
##$ASSFACI= 0
##$ASSFACX= 0
##$ASSWID= 0
##$AUNMP= <proc_1d>
##$AZFE= 0.1
##$AZFW= 0.1
##$BCFW= 1
##$BC_mod= 2
##$BYTORDP= 1
##$COROFFS= 0
##$CY= 11.3945322036743
##$DATMOD= 1
##$DC= 2
##$DFILT= <>
##$DTYPP= 0
##$F1P= 15.9154993809931
##$F2P= -4.1035820241983
##$FCOR= 0.5
##$FTSIZE= 0
##$FT_mod= 4
##$GAMMA= 1
##$GB= 0.15
##$INTBC= 1
##$INTSCL= 1
##$ISEN= 128
##$LB= 0.24
##$LEV0= 0
##$LPBIN= 0
##$MAXI= 10000
##$MC2= 0
##$MEAN= 0
##$ME_mod= 0
##$MI= 1.114404
##$NCOEF= 0
##$NC_proc= 0
##$NLEV= 6
##$NOISF1= 3.799351
##$NOISF2= 2.8
##$NSP= 1
##$NTH_PI= 0
##$NZP= 0
##$OFFSET= 15.70392
##$PC= 1
##$PHC0= -11483.6
##$PHC1= 11.00101
##$PH_mod= 1
##$PKNL= yes
##$PPARMOD= 0
##$PSCAL= 0
##$PSIGN= 0
##$REVERSE= no
##$SF= 200.130013532006
##$SI= 16384
##$SIGF1= 3
##$SIGF2= 2
##$SINO= 400
##$SIOLD= 16384
##$SREGLST= <1H.CDCl3>
##$SSB= 0
##$STSI= 0
##$STSR= 0
##$SW_p= 3612.71676300578
##$SYMM= 0
##$S_DEV= 0
##$TDeff= 0
##$TDoff= 0
##$TI= <>
##$TILT= no
##$TM1= 0
##$TM2= 0
##$TOPLEV= 0
##$USERP1= <user>
##$USERP2= <user>
##$USERP3= <user>
##$USERP4= <user>
##$USERP5= <user>
##$WDW= 1
##$XDIM= 8192
##$YMAX_p= 0
##$YMIN_p= 0
$$ End of Bruker specific parameters
$$ ---------------------------------
##NTUPLES= NMR FID
##VAR_NAME=  TIME,          FID/REAL,        FID/IMAG
##SYMBOL=    X,             R,               I
##VAR_TYPE=  INDEPENDENT,   DEPENDENT,       DEPENDENT
##VAR_FORM=  AFFN,          ASDF,            ASDF
##VAR_DIM=   8192,          8192,            8192
##UNITS=     SECONDS,       ARBITRARY UNITS, ARBITRARY UNITS
##FACTOR=    0.0002496,     1,               1
##FIRST=     0,             0,               0
##LAST=      2.0444736,     0,               0
##MIN=       0,             -29801,          0
##MAX=       2.0444736,     242061,          0
$$ Real data points
##PAGE= N=1
##DATA TABLE= (X++(R..R)), XYDATA
0 0 0 0 0 0 0 0 0 0 0 0 0 0 -8 8 -8 8 -8 16 -16 16 -24 24 -32 40 -47 52 -60 72 -80 92 -104 120 -136 154 -175
35 -175 196 -220 247 -276 308 -342 381 -422 469 -518 570 -630 696 -765 844 -930 1025 -1129
53 -1129 1246 -1379 1526 -1694 1887 -2112 2379 -2699 3092 -3592 4247 -5143 6463 -8599 12652
68 12652 -23163 113778 242061 164226 194807 158163 120752 105858 101725 57761 57447 62836 51100
81 51100 41602 67690 59236 50135 64507 60890 35498 36960 26476 5053 -7286 -11329 -22220
94 -22220 -29801 -25932 -18676 -21886 -9897 1114 782 9430 15148 7419 10085 8837 627 -2091 -1751
109 -1751 -5937 -5988 2510 5104 4458 19535 22534 15989 29168 27957 13259 21708 19753 4045 7249
124 7249 11000 672 462 10006 5982 217 10890 9953 -130 8473 9256 -165 7910 12725 10097
139 10097 16752 24288 27105 28676 33300 34910 27079 23742 19513 5367 -1713 -8104 -19621 -22198
153 -22198 -22971 -23654 -18101 -10636 -2642 4289 13772 20960 20472 24849 25143 15794 15729 12410 918 2578
169 2578 2867 -2942 1442 7196 6722 8838 14769 13614 7297 8770 4483 -8459 -9099 -12543 -23995
184 -23995 -22433 -20437 -24846 -20397 -14171 -11795 -8326 -2357 861 -384 2867 4609 -383 1645 3107
199 3107 -2039 808 1927 -1226 399 968 -1579 -4391 -5869 -8260 -14558 -15866 -15898 -22290 -19880 -15730
215 -15730 -18493 -13147 -7222 -7920 -4871 -1425 -3421 -6688 -7548 -9670 -16482 -16608 -15539 -19891 -14300 -6709
231 -6709 -6180 2229 11169 13203 17842 21669 21312 18172 16141 12796 5367 2517 1780 -4074 -2658 933
247 933 -382 4219 9227 9000 11109 12708 11119 7655 4694 2298 -3483 -5823 -5415 -10135 -8907 -4544
263 -4544 -6254 -2998 1514 1126 2160 3523 2991 958 -187 -70 -3511 -4160 -1551 -4336 -3290 -222
279 -222 -2899 -1970 -1181 -5079 -5958 -6903 -9499 -11040 -11377 -9846 -10081 -7258 -2347 -1812 2095 6787 5385
296 5385 6517 7487 2828 576 -1238 -5193 -8574 -8879 -8112 -9253 -6838 -1638 -1790 691 5362 3409
312 3409 2885 3421 -997 -4216 -6147 -8966 -11132 -11988 -9207 -8426 -6261 229 2133 4484 9572 8525
328 8525 8959 9124 5346 3494 848 -2121 -3649 -4940 -4258 -5084 -4099 -815 -1963 -1019 1653 -1623 -2074
345 -2074 -734 -3902 -4311 -3484 -3810 -3836 -1821 1098 1259 2325 6755 4831 3467 5268 1741 -1298 -976
362 -976 -3836 -5561 -5412 -4168 -3443 -2318 1136 2043 1841 4169 3069 576 502 -2446 -5139 -6148 -7562
379 -7562 -7534 -6329 -4750 -1742 264 3718 5902 6644 8194 6622 5221 5640 1537 -335 377 -1679
395 -1679 -1457 598 1648 3019 5191 7815 7266 6588 7991 4737 1337 1514 -1863 -4748 -4215 -5268
411 -5268 -5598 -4033 -1956 -589 92 2665 3368 1514 2598 1648 -503 -428 -1631 -2218 -1236 -1233 236 1358
429 1358 2189 3027 2485 2219 969 -1834 -3165 -5638 -8009 -7701 -9488 -9410 -6728 -5977 -4350 -845 410
446 410 1789 2606 3893 2723 943 1911 329 -1452 1115 547 445 3879 5329 6495 8012 9558
462 9558 9531 7896 8246 6907 3681 3512 3054 1231 2440 3475 4249 6192 7109 8883 9842 9378 9008 7627
480 7627 6111 4381 2231 1712 561 -125 1870 1726 2767 5306 5226 5632 6515 5455 3997 2161 810
497 810 -1278 -3870 -3326 -4139 -5960 -3683 -2991 -3629 -1922 -1429 -2397 -3219 -3806 -4790 -7405 -7773 -7705 -9890
515 -9890 -8100 -6449 -6107 -3465 -850 31 1816 2608 2951 2825 1343 772 -755 -2148 -2581 -3536 -2824
532 -2824 -2627 -2512 -595 -478 -801 450 -369 -1570 -1918 -3030 -3797 -4439 -4016 -3540 -3651 -1094 304 -108
550 -108 2325 2699 1174 1126 424 -1671 -3583 -4641 -6094 -7745 -7474 -6704 -7336 -5780 -3889 -4264 -2869
567 -2869 -2520 -3513 -4039 -4902 -5901 -7009 -8060 -7679 -7749 -7343 -5717 -5141 -3230 -1721 -1586 -381 -755 -2264
585 -2264 -2045 -3651 -5284 -5777 -6687 -6585 -6433 -5029 -3822 -3721 -1658 -415 -1242 -227 -90 -1942 -2135
602 -2135 -2671 -3539 -4100 -3631 -3053 -3248 -2360 -553 -924 66 1450 172 125 346 -1114 -1703 -2141 -2260 -1849
621 -1849 -1903 -1032 -206 15 645 196 -345 -953 -2924 -3936 -5375 -7618 -7822 -8809 -9468 -8536 -7876 -6843 -5940
640 -5940 -4444 -3433 -3870 -3292 -3007 -4836 -4855 -5218 -6675 -6522 -5671 -5403 -4819 -3133 -1333 -684 308 1710
658 1710 470 170 429 -1352 -2161 -2511 -3685 -3623 -3566 -3303 -1786 -1318 54 797 1302 1695 1228 1054 533
677 533 -840 -1066 -1235 -2271 -1894 -1621 -1908 -1029 -516 -588 -472 -448 -473 -1867 -2124 -1982 -3155 -2979 -2160 -2907
697 -2907 -1890 -297 -10 559 838 1093 578 -630 -427 -2070 -3533 -3355 -4234 -4663 -3810 -3600 -2915 -2110
715 -2110 -1614 -1211 -1783 -2012 -2552 -4183 -4755 -6195 -6983 -7168 -7864 -6715 -5506 -4978 -3583 -1999 -1552 -475
733 -475 189 -150 -677 -1261 -1398 -2538 -3081 -2468 -3400 -2835 -1675 -1482 -1012 195 223 -140 20 -304 -1483
752 -1483 -2418 -2141 -3252 -4063 -3321 -3684 -3619 -2428 -2342 -1714 -1607 -1821 -1657 -2343 -2459 -2577 -2795 -2408 -2160 -2253
772 -2253 -717 -408 723 1822 1349 1892 1922 589 498 -336 -1035 -1874 -2142 -1396 -1894 -1149 189 218 733
791 733 2080 1602 1637 1121 218 -1020 -1795 -2214 -2867 -3245 -2356 -1976 -1732 -338 273 1027 1782 1630 1643 1229
811 1229 -54 -259 -1697 -1960 -2300 -2927 -2643 -2406 -2201 -1439 -1323 -1127 -615 -1329 -1393 -1239 -2359 -2251 -2389
830 -2389 -2369 -1814 -1510 -855 -428 23 999 847 512 1006 -233 -532 -732 -1467 -1635 -1950 -1646 -1456 -1423 -753
850 -753 82 -503 145 -169 -1103 -1224 -1614 -2292 -2669 -2552 -2473 -2303 -1517 -161 321 1409 1943 2094 2457 2057
870 2057 1043 1025 4 -569 -775 -1429 -1385 -1150 -542 -282 395 1237 1287 1011 1524 597 -424 -224 -1263 -1822
890 -1822 -1777 -1711 -1462 -1306 -322 122 -56 599 710 261 352 2 -381 -699 -1000 -1138 -1202 -1105 -580 -286 -245 429
912 429 138 162 -218 -716 -450 -1449 -1770 -1559 -1944 -1654 -895 -986 -343 503 913 1046 1139 1342 969 -66 737
933 737 142 -1028 -226 -191 -62 633 873 1456 1447 1552 1719 736 600 104 -1069 -1309 -1935 -2445 -2275 -1650 -1502
954 -1502 -920 -695 -32 323 531 541 116 -190 -369 -1128 -1048 -1247 -1224 -721 -428 -228 225 315 591 977 286
975 286 -100 -682 -666 -1109 -2059 -1704 -1759 -1802 -1038 -832 -838 -133 -14 -4 -314 -97 -301 -918 -867 -452 -983 -423 204
998 204 403 1160 1518 1589 2009 2003 1815 1587 811 1032 -121 -91 -228 -114 171 438 525 1573 1391 1353 1709 1144
1020 1144 827 304 -23 -120 -779 -488 -670 -676 -2 451 357 953 954 271 980 193 -510 -952 -1265 -1490 -1924 -1898
1042 -1898 -1407 -1473 -730 -435 -747 169 404 34 354 -220 -116 -322 -481 -7 212 337 934 1064 1459 1735
1062 1735 1741 1986 1721 1277 939 469 -129 -16 -427 -313 -349 150 667 514 659 980 757 586 622 109 -403
1083 -403 -113 -311 -425 -202 143 454 879 1189 1296 1608 1838 1255 1354 876 669 487 40 -439 8 -353
1103 -353 46 -8 23 592 478 260 239 -40 -432 -717 -1426 -1265 -1361 -1341 -1055 -875 -236 -86 312 851 724 719
1125 719 832 254 516 312 -39 189 427 676 769 1134 1340 1262 1415 1393 952 698 467 -176 -196 -431 -613
1146 -613 -407 -462 -153 505 631 978 1266 1035 1158 956 832 688 133 298 23 -266 105 171 391 556 796
1167 796 685 401 399 513 -93 -415 -469 -1080 -772 -487 -629 -230 31 190 839 600 953 653 475 637 293
1188 293 -201 -261 -310 -397 -6 70 392 506 790 761 573 584 463 -58 24 -490 -930 -782 -749 -573 -243 -346 387
1211 387 681 735 744 700 512 405 303 162 -85 -86 371 276 531 925 1015 1223 1707 1501 1252 1079 879 553 -6
1234 -6 86 -219 -482 -240 22 156 477 482 944 653 688 339 418 120 64 -131 -163 148 41 410 559 916 1344
1257 1344 879 1246 1113 544 691 143 -304 -84 -698 -548 -502 -541 304 -258 107 256 59 264 365 -135
1277 -135 -353 -639 -564 -437 -830 -380 -359 -1 452 590 590 666 523 716 123 -36 -273 -465 -585 -622 -534 -12
1299 -12 -60 37 304 390 395 517 234 166 114 -285 -219 -128 114 83 370 753 820 943 1368 1075 1271 1136 655 420
1323 420 273 -23 -132 -255 56 21 153 400 644 681 921 591 375 327 54 138 -213 -341 -208 -236 7 384
1345 384 461 438 1090 525 749 327 184 459 -290 -320 -265 -222 -170 -8 -67 -111 288 391 238 134 169 -22 -370
1368 -370 -492 -618 -621 -198 -492 -380 194 179 457 485 620 692 360 127 -89 -86 -436 -491 -484 -420 -267 58 -225 41
1392 41 408 348 417 21 -607 -355 -937 -863 -696 -1205 -683 -229 -536 -173 117 358 450 592 492 241 -13 137
1414 137 -205 -387 -20 -54 103 251 151 284 342 413 227 83 -84 16 -499 -467 -221 -323 -358 -64 125 387
1436 387 527 816 826 643 566 392 283 42 -104 3 -113 20 133 56 121 432 369 198 263 -3 -283 -474
1458 -474 -737 -1005 -1045 -750 -987 -790 -435 -532 -417 -97 -163 -64 -12 -152 -114 -690 -488 -493 -674 -583 -230 -246 -203 -90
1482 -90 108 101 70 -195 -298 -483 -865 -768 -824 -756 -864 -511 -464 -539 -162 -358 81 -133 -44 -537 -362 -434 -482 -419
1506 -419 -219 -393 -71 258 282 332 429 278 104 30 -101 -117 -397 -573 -590 -892 -563 -617 -384 -482 26 -46 -109
1529 -109 -251 -438 -284 -962 -525 -706 -768 -534 -326 -366 -232 -136 365 318 233 313 201 275 39 -101 -120 -249 -467
1552 -467 -457 -287 23 -107 215 -60 112 -278 129 -194 -238 -257 -206 -468 -355 -234 -307 -204 -178 165 203 261 134
1575 134 69 78 349 -384 -140 -399 -194 -417 -249 -16 20 32 321 73 -48 415 -145 -102 -432 -513 -244 -380
1597 -380 -298 41 150 286 636 274 583 503 683 258 31 -9 160 -128 -274 147 -19 10 -63 290 183 252
1619 252 620 311 222 6 -279 -92 -457 -440 -95 -249 -101 15 108 190 171 440 29 126 118 58 -188 -324 -129
1642 -129 -303 -340 7 61 36 273 16 -18 170 -14 -451 -334 -347 -367 -577 -303 -131 167 82 -60 322 123
1664 123 453 190 -86 1 -441 -503 -136 -203 -351 -29 234 213 95 274 627 178 338 176 67 -224 -395
1685 -395 -384 -544 -294 -197 290 -99 609 237 400 418 43 200 163 -76 14 -264 -39 -69 -263 -267 39 59 199
1708 199 59 125 190 27 15 -147 -97 -131 -265 -165 -54 -78 -274 267 230 288 239 161 171 63 -226 -63 -372 -20
1732 -20 -2 -124 -66 -82 197 263 -56 173 152 -287 164 -303 -460 -444 -510 -534 -618 24 109 202 347 130 302 363
1756 363 216 126 38 -124 10 -67 86 216 293 173 535 530 265 577 530 276 37 -12 37 -113 35 98 -47
1779 -47 207 85 68 127 271 188 404 352 188 156 155 364 -129 158 84 138 127 170 244 506 289 143 141 -13 -358
1804 -358 -266 -512 -319 -370 -372 -252 -516 -69 -9 -240 -280 -278 -304 -436 -394 -602 -480 -412 -648 -585 -83 9 -14 234 155
1829 155 181 297 -171 7 -18 -240 -306 -349 -434 -54 -365 58 195 48 268 5 99 189 184 -190 -82 -143 -132 -100
1853 -100 -172 226 338 233 66 282 571 370 166 192 -10 -112 -1 6 -58 -119 -105 265 94 207 83 -13 84
1876 84 -46 -180 84 -13 -482 -227 -355 3 -90 106 78 209 220 -24 56 344 13 -36 22 -431 -311 -122 -3
1899 -3 34 -141 -153 340 123 48 65 18 -26 178 -150 -336 -220 -253 -424 -197 -21 -20 10 240 79 -74 100 -112
1923 -112 -249 -146 -221 -101 -454 -84 63 -16 -127 268 106 64 173 -1 -113 -208 -34 -187 -211 -148 -304 -56
1945 -56 -105 -41 -67 -164 299 157 75 -354 167 -94 -128 -184 61 -156 208 305 180 339 528 504 243 108 181 198
1969 198 196 83 12 32 -77 351 291 100 362 90 338 126 43 455 22 88 79 -33 122 -144 -292 346 194
1992 194 252 335 -8 259 47 -144 -176 -330 -432 -267 -248 -569 -100 -185 96 152 -68 -146 -15 -200 -114 -434 37
2015 37 -332 -349 -233 126 -141 -69 194 106 292 281 255 104 142 18 98 33 -194 142 51 -82 110 -18 358
2038 358 363 328 289 257 203 261 46 46 164 70 43 392 252 337 307 630 555 283 142 -5 -58 17 -166 -239 147 -76
2064 -76 130 131 -26 272 -13 -12 -3 105 -98 99 -382 -204 90 -189 -232 -83 -73 -86 -156 56 75 -23 -216 -241 84
2089 84 -332 -229 -316 -141 -327 -153 -203 -254 181 136 -109 151 -116 -103 10 -168 -492 -361 -415 -453 -139 161 168
2112 168 365 249 -28 82 347 25 153 -47 -109 -93 -285 -127 41 -33 -90 -123 -97 -18 -149 -1 -192 -176 -23
2135 -23 -78 -197 -217 -312 -119 -103 306 162 32 31 71 128 67 251 -3 -274 161 -14 -263 140 419 244 144
2158 144 143 388 143 -84 -195 -37 103 -31 -436 -244 272 281 375 -116 129 462 296 136 224 176 -115 167
2180 167 249 90 213 -28 67 -13 -54 99 34 173 258 28 -22 -174 -59 -156 76 -278 -98 87 -120 -50 270
2203 270 35 298 242 290 99 295 49 70 206 25 33 132 259 214 325 235 234 54 154 229 -8 -476 -33 -128
2227 -128 -133 130 -49 208 217 343 335 465 125 172 478 303 162 -9 293 173 137 182 120 280 354 557 401 132
2251 132 120 55 41 83 -9 26 -115 -85 -177 -40 94 114 174 52 29 -41 -256 32 -38 -40 -133 -105 -45 111 128 47 98
2278 98 63 302 103 31 -81 -135 25 20 -227 -66 -34 14 -51 294 97 -172 170 21 227 -109 142 -158 -65
2301 -65 -129 81 8 267 64 39 414 312 104 229 160 245 203 30 -92 -151 -182 -2 31 199 316 198 -44
2324 -44 134 428 -10 -34 -89 -129 -120 -41 -48 23 -52 -134 70 -108 45 179 247 282 -155 187 28 -22 -113 -331 163
2349 163 160 17 312 67 -3 344 88 32 -75 -74 -17 -91 98 -167 154 -175 38 -167 283 123 306 176 48
2372 48 384 48 13 47 167 130 30 -353 -22 -49 29 -160 140 36 181 82 -128 -110 -96 -214 97 108 260
2395 260 -46 -214 193 33 304 -74 -290 161 143 167 -151 -203 -255 -46 -224 -82 -11 36 -26 141 103 96 297
2418 297 9 71 75 -166 -416 -274 -30 -23 64 -91 -122 145 101 29 -69 56 -199 -110 -141 -69 -115 56 304 -157 133
2443 133 -10 54 -81 -218 54 -212 -94 -61 -19 -138 92 -56 -211 -45 -55 106 156 -70 -180 85 -137 15
2465 15 -327 11 148 -120 -12 77 282 241 144 67 162 118 208 266 -87 40 -143 -62 -10 350 130 -260 155 173
2489 173 1 240 2 392 -30 -172 89 41 -24 -210 146 136 98 270 132 73 -80 427 31 -79 16 73
2511 73 151 -176 51 -45 -225 -36 126 -146 238 241 -107 -159 -17 46 55 70 -3 12 -157 -206 23 121 163 68 -3 9
2537 9 3 120 -11 -71 146 51 3 31 18 158 -87 193 -144 98 29 -2 -172 -293 -197 -94 -102 -50 -168 164 17
2562 17 163 -16 -43 252 27 69 229 126 -189 71 -220 -49 308 78 -85 -156 44 -124 -68 198 68 12
2584 12 84 -280 -9 19 -234 -65 153 61 371 13 211 42 34 148 -33 110 -391 6 -275 4 37 174
2606 174 219 83 120 136 114 143 -88 -119 -85 -178 -267 163 -273 -197 23 -294 -37 -96 -134 -109 -63 62 75 38 -70
2631 -70 63 43 -114 45 57 -58 -157 193 67 445 40 102 -115 -19 -95 -180 -52 -234 -175 61 -62 73 -77
2654 -77 -30 16 -33 -4 30 -293 -86 166 -29 15 143 151 38 -193 110 38 -247 -146 184 57 287 162 247 133
2678 133 -17 110 194 217 169 174 358 29 135 -12 63 37 32 -56 -27 84 -71 -268 -34 -95 71 -26 24 26 0 -66
2704 -66 -6 46 150 -11 160 -174 -25 -77 -261 -18 18 251 -105 -140 -43 -119 -112 -168 72 -14 49 -225 385 -34
2728 -34 -31 -200 93 222 -142 -175 32 41 -26 93 -15 -253 75 -135 -122 159 96 -37 -51 138 -132 75 132 -300
2752 -300 -246 -15 -51 236 132 82 115 -8 -31 329 63 -58 -223 3 -48 61 146 146 145 -82 241 58 -1 102
2776 102 194 249 -77 2 99 35 -115 -188 213 -123 165 -171 -48 108 40 65 -36 -66 17 97 -220 -140 64 -94
2800 -94 -22 17 65 40 51 -223 -174 -91 79 -67 -396 -115 -19 54 13 132 22 -188 -133 -119 -112 -245 -121 -140 -133 11
2826 11 59 -313 19 44 -149 85 147 -19 -19 71 -40 -295 -164 36 -40 -105 -299 -104 18 31 -242 -53 -45 19
2850 19 180 135 58 68 -125 42 -5 48 172 132 33 -148 -125 -56 183 56 -166 88 -53 214 -33 -77 -290 -61
2874 -61 29 -230 -54 302 33 -49 -19 -186 155 26 -184 -156 10 10 12 -103 -35 -184 -68 -224 -142 -260 -46 -112
2898 -112 -192 155 -43 -29 -147 -65 -186 -66 59 84 234 155 -105 -87 128 -299 -181 -24 -278 -126 -188 42
2920 42 -38 260 -97 74 -15 29 -161 -146 -31 -245 -197 -97 -126 30 -184 -1 -27 -103 -296 94 0 -55 -148 -146 1
2945 1 -75 -13 34 -84 181 142 301 -43 -150 -68 94 -114 -19 26 -32 101 63 60 135 -159 231 95 113 -91 136
2970 136 204 -315 71 -256 79 -232 101 -85 -18 -17 -6 91 33 -16 -71 -148 -32 206 -82 10 -115 -92 15 -63
2994 -63 155 53 113 -234 -59 11 -7 55 -2 -85 76 158 -115 96 182 159 39 86 194 105 53 139 59 111 -35
3019 -35 33 -62 -9 -265 -53 -71 19 110 40 -14 170 100 44 -91 33 -232 100 162 -121 -43 37 183 -156 -154 8
3044 8 -172 -63 396 -220 -247 114 24 -226 90 -120 -230 70 85 112 159 -56 82 35 141 -36 -281 -54 -29
3067 -29 50 39 230 -6 -152 194 -39 195 -162 180 -74 25 140 -114 -66 -26 31 1 56 -108 250 109 36
3090 36 -190 130 -83 208 80 -122 14 1 88 222 41 -71 70 142 -70 -98 12 77 -54 165 132 -24
3112 -24 152 130 16 -171 -91 158 203 44 209 152 154 350 -144 25 -56 -85 78 92 277 110 45 137 -121 58
3136 58 -23 -33 140 61 -35 -106 109 -54 82 -104 -75 -28 -90 -4 247 119 220 30 210 -14 -163 51 74 -17
3160 -17 -146 35 133 352 110 144 89 -5 -94 7 126 93 -110 142 -3 -111 18 -64 -11 -1 -54 -217 -104 -6
3184 -6 -73 -191 -76 13 3 9 -93 -259 41 103 123 223 27 -83 -68 -82 49 74 6 145 -47 -38 103 85 -216
3209 -216 47 222 121 8 52 221 37 211 270 198 292 227 -108 55 -142 -46 -82 136 44 131 115 33 18 66
3233 66 139 121 -81 -47 258 172 32 69 -51 -98 -141 -22 -128 -79 -49 159 -190 66 64 302 -27 114 278 -79
3257 -79 51 221 60 51 -106 93 -116 142 72 147 118 17 48 73 243 89 -121 -61 -57 113 40 -68 47 114
3281 114 16 48 -16 -62 -445 78 28 107 -62 -64 113 191 24 93 14 127 236 190 78 -90 64 -30 134 245
3305 245 291 165 162 77 191 -42 -91 -176 -78 -9 268 -77 48 -176 -35 203 -21 -20 231 31 -96 80 183
3328 183 67 97 14 59 28 137 -196 -46 123 202 28 169 51 251 145 -109 84 -272 247 -61 -14 87
3350 87 -102 150 -203 47 117 194 82 292 219 30 -42 35 -21 -19 -116 -106 -64 -181 178 -245 2 150 143 -124 213
3375 213 -64 74 12 -44 171 194 42 -54 -231 -169 -17 -118 286 107 159 70 -59 -35 -39 -135 -25 -38 2 -13 172
3400 172 123 9 190 65 -66 -12 -4 -9 131 88 63 98 25 -179 -23 136 -192 29 181 -90 282 -167 167
3423 167 20 97 107 100 174 -181 -51 -133 40 134 10 -33 6 -13 -257 -326 276 139 -49 -233 -36 -104 -270 78
3447 78 -179 2 133 -52 60 259 200 195 120 -88 -52 -87 87 -149 19 89 -215 -53 -113 -50 234 173 56 -34
3471 -34 78 -28 -27 149 326 30 -57 199 -63 31 -17 23 45 -106 -10 1 142 -76 4 53 -90 103 -35 -81
3495 -81 -48 -55 138 61 -81 -169 -157 82 -16 -51 71 141 -8 -132 141 20 -50 57 -42 226 -154 22 -147 31
3519 31 -122 -54 -323 -64 74 80 192 -14 107 -13 201 24 -166 140 36 -210 -90 -160 -92 -260 -80 -13
3541 -13 149 -189 118 -167 20 -286 -174 318 -20 -2 34 24 91 193 -189 78 49 204 38 -90 -99 -120 -28
3564 -28 105 -27 185 -63 12 -22 -139 -73 -143 -1 161 47 -46 -36 -5 -24 80 23 156 339 215 203 26 -74
3588 -74 300 251 -133 155 -258 14 -137 -27 -27 -94 15 -175 105 116 124 364 -87 -27 -20 21 61 -182 29 -215
3612 -215 -71 124 64 -138 12 151 -52 111 21 -44 58 -111 55 -183 15 -201 -203 -351 -30 58 63 57 31 -23
3636 -23 -21 195 -63 -287 -42 -94 -69 -31 110 -55 61 233 102 213 50 52 5 -38 62 -52 -47 -16 -153 224
3660 224 24 -76 137 -54 -5 -49 -89 -17 -204 -321 -98 130 -87 8 312 332 -51 0 -35 -142 107 -95 151
3683 151 50 -10 8 -297 58 36 -23 126 84 220 2 85 -332 20 -15 51 35 -163 71 -73 -187 4 37
3706 37 -210 -44 -140 196 131 -25 120 60 124 -96 -37 94 6 -148 -304 116 86 -326 112 109 131 117 -154 80
3730 80 193 -44 -29 204 -58 -196 -22 -249 -321 -33 25 32 -86 3 229 -88 62 114 -22 53 -8 -108 38
3753 38 -54 130 41 -41 -63 94 117 -57 59 35 137 52 -39 49 12 -164 -16 -75 23 -243 46 -349 5 -201
3777 -201 57 36 -57 -127 60 -2 -59 11 -125 29 -179 -137 25 162 -49 -340 -136 -29 157 105 -27 -157 -307
3800 -307 170 177 -169 49 25 29 84 12 83 -128 -28 -113 130 -119 10 -102 -110 -271 141 -158 -280 51 128 15
3824 15 -47 -76 119 54 41 -210 159 -37 252 223 21 312 55 -12 -109 82 52 95 119 -38 -205 -105 89 230
3848 230 -99 -19 176 101 30 -1 -54 56 111 44 -222 0 -148 -251 171 -38 115 -212 85 -30 -23 -60 -52 64
3872 64 -9 -52 83 -82 -275 -14 284 140 -71 69 -117 273 -322 60 59 55 63 12 159 -7 161 -162 -113 -233
3896 -233 70 -240 35 133 -228 162 -191 -153 94 11 22 90 195 -102 76 -148 -95 -43 -116 136 97 -1 97 -189
3920 -189 30 54 16 -2 -10 -153 81 201 -19 36 58 -77 -53 166 132 307 50 -63 -150 -48 -14 -147 -238 63
3944 63 107 -39 107 10 186 -91 -25 -40 24 11 -22 -33 -209 185 20 -205 237 61 84 254 195 -59 96 -34
3968 -34 145 -160 -55 221 -134 144 65 -23 -172 -18 12 93 -73 -153 -10 -82 123 -54 -57 -176 133 46 97 -6
3992 -6 -12 -185 -125 56 -279 -302 223 -78 126 106 -435 87 47 142 -351 72 -13 48 -42 5 185 32 131 -158 -103
4017 -103 -86 244 43 -217 -12 90 -13 57 31 -51 62 269 -125 15 51 -273 261 75 -56 119 11 9
4039 9 -98 35 -97 -60 -185 58 67 -369 -213 27 17 80 149 -102 -52 -119 5 204 68 -34 -175 118 -5
4062 -5 282 8 -307 13 57 146 -126 -58 -137 109 34 -153 -176 82 121 94 131 268 95 47 139 -188 149 85 -80
4087 -80 66 254 214 -91 140 -30 -38 -145 -275 -51 147 161 231 133 -3 217 93 -10 -28 -130 177 47 0
4110 0 -65 -163 -73 56 42 -95 60 -163 -143 43 -26 -13 61 -433 14 50 -21 113 -36 183 -138 114 -13 -69
4134 -69 13 15 -283 -103 66 -100 169 -76 154 57 96 -167 152 -135 -143 110 163 245 -78 116 36 -77 -117 -55
4158 -55 203 -439 -79 0 -17 -132 26 4 -11 3 -16 98 14 137 -70 90 -82 -113 -405 -35 -47 173 90 166
4182 166 43 32 46 32 124 -79 77 49 33 159 -1 -126 423 -119 -212 -120 -20 132 183 -281 184 -7 55
4205 55 -165 -29 -8 -108 122 -150 1 113 239 -169 -118 -47 -72 51 131 125 -154 68 -6 -80 -181 53 223
4228 223 -81 -37 226 25 146 21 -56 -104 36 204 -304 52 53 -34 -134 -76 -175 -20 66 -225 32 9 103 -184
4252 -184 -44 116 32 -2 117 -327 97 233 318 26 50 -12 -12 -76 240 128 -155 -160 22 -118 155 122 -33 -121
4276 -121 82 98 120 -28 -2 -96 -28 71 197 114 -97 173 -154 111 202 -246 12 -61 -24 -23 -174 12 -174 56
4300 56 -209 15 -46 -139 109 -286 132 4 -82 -122 -154 -212 -61 -164 125 -156 -210 -13 -110 -88 15 293 -11
4323 -11 -26 -2 -74 70 -195 -321 -145 -191 -13 -16 251 -62 -298 127 130 155 -109 -56 -39 88 136 37 -119 269 146
4348 146 197 112 -11 92 -155 -256 16 157 -96 337 33 -35 8 33 203 -19 32 -52 342 -262 -4 82 -163
4371 -163 -137 317 -8 44 182 -143 184 85 31 132 85 -55 66 130 -219 -107 289 -102 -382 -35 67 114
4393 114 164 46 -39 177 159 -43 -82 -84 -60 -69 -189 -167 209 313 107 -31 91 123 -44 -266 -391 30 88 64
4417 64 -212 -101 176 76 -20 -15 53 158 -33 38 -50 -98 94 -41 -108 130 33 43 133 -38 -59 -143 -123 -177 132
4442 132 -157 150 -96 81 125 43 143 -56 -223 86 -110 -58 -142 111 -16 10 -5 79 0 -22 287 -157 32
4465 32 -195 136 145 141 291 -144 79 -49 17 -17 -204 9 35 28 -124 -35 -24 129 110 91 -120 -132 51 37 -62 -41
4491 -41 -121 -8 47 -10 133 -89 165 -133 258 99 -40 174 67 138 -61 -134 -31 96 54 75 -111 -65 -8
4514 -8 -32 -114 -21 -120 119 44 68 -67 -140 -133 117 107 96 128 215 48 -84 9 177 128 9 76 -233 43 312 18
4540 18 -62 -40 -240 -35 72 -33 230 245 195 -72 -38 39 22 -161 55 -149 311 -227 288 86 -55 69 -153
4563 -153 -145 34 -8 140 -20 25 39 -174 1 -30 -22 27 -62 182 233 -397 -23 184 181 -68 -90 109 48 -165 -409
4588 -409 53 193 -237 106 75 35 202 21 -72 25 -6 68 32 -52 -48 -91 42 -20 182 222 5 53 95 17 -69 51
4614 51 -84 -90 212 76 115 -80 174 182 43 34 56 88 15 -1 -133 73 144 -84 -50 -72 159 -100 7 172 137
4639 137 -179 47 258 -127 -138 -74 -79 237 -39 89 -132 169 -110 -154 130 -24 5 22 -40 -32 -114 -269 -71 -6
4663 -6 -141 -11 -57 -34 -65 -121 24 4 110 11 36 -62 135 -100 -101 54 14 -135 -93 48 13 49 -73 -211 51
4688 51 -37 26 -67 -47 -129 67 -59 -53 247 -154 -73 16 249 69 0 8 -24 -139 -221 92 203 112 -45 253 307 28
4714 28 -215 -174 -58 -33 -82 13 151 232 85 -139 69 142 -30 -176 -194 2 -292 -42 150 -364 66 -97 74
4737 74 -103 -48 -70 1 56 -202 105 -101 14 -44 11 -21 -175 -183 199 -13 237 125 241 20 -79 -75 85 119 -280
4762 -280 -163 169 -123 103 61 39 126 148 -23 -18 110 -190 193 -115 241 -161 143 -86 14 -59 253 195 4
4785 4 8 -319 -267 81 -183 140 -242 -103 -9 57 40 -167 -35 45 174 198 -104 -302 -80 -14 179 95 65 -125
4809 -125 113 49 39 -252 273 -11 -225 -115 -82 56 -31 -18 -90 116 146 26 -79 329 -53 94 93 -150 -95
4832 -95 -318 83 12 17 155 -195 -31 158 -118 24 201 -184 20 60 -50 32 -240 -162 -183 -69 31 -9 56
4855 56 53 -39 280 83 -46 125 111 105 115 -94 -46 -13 -112 28 17 243 21 -16 56 27 -78 -24 -94 -118 -102 -4 -20
4882 -20 9 4 -30 -41 206 -43 168 7 37 122 -80 133 31 102 142 -73 -35 135 176 -41 -150 -17 -47 2 -210
4907 -210 53 121 77 -231 -116 -130 143 274 120 -116 84 -50 206 104 -85 -125 50 -21 59 58 84 0 -126
4930 -126 -91 -29 14 26 57 -148 90 -273 -48 -7 153 111 16 215 -18 -121 160 83 114 -249 283 33 222
4953 222 120 35 204 83 201 -123 -71 82 68 -134 -121 -122 136 95 -64 106 180 5 13 -258 -323 -280 -92 -23
4977 -23 -16 -16 83 29 -26 -62 -144 -174 -169 3 145 130 -49 -82 19 97 -29 -33 -2 -180 -20 -61 259 147 125 26 -32 -87
5005 -87 263 104 -161 91 -195 234 52 229 32 -139 143 453 11 214 164 -293 -70 -25 90 77 -190
5026 -190 -95 -187 158 -182 -26 160 -5 -5 50 -20 -4 -157 152 -125 -89 -73 -52 140 -63 -171 34 -46 -4 -33
5050 -33 -7 193 171 -100 331 -107 -211 132 42 14 -200 -79 -46 151 -12 -36 -84 -140 -80 108 140 -78 190 -49
5074 -49 91 -123 -22 78 172 -150 -73 105 -103 112 36 -83 10 -47 246 317 16 122 90 127 348 89 -55
5097 -55 -76 42 313 -175 -34 76 -344 26 -86 -77 47 92 88 201 -32 136 66 41 -141 66 154 198 73 78
5121 78 -138 61 -51 -109 -199 134 -232 -117 73 104 43 -126 112 72 244 -131 -46 117 6 184 0 51 244
5144 244 44 3 17 -130 75 61 -193 68 54 73 -17 -6 -56 59 -180 37 4 102 110 45 126 -117 -172 161 -3
5169 -3 59 55 -1 -36 3 -53 -23 105 -67 -202 84 -108 -20 34 24 -60 136 -125 -34 133 -144 51 -88 -21 70 -177
5195 -177 -202 -127 139 -198 -28 -33 21 52 92 132 -237 12 126 70 217 -19 210 -24 -33 -247 16 -54 63 222
5219 222 -24 -54 34 -100 26 137 -63 -158 122 56 -112 -29 13 -82 -218 290 55 -72 -85 168 232 -57 54
5242 54 -117 22 50 -29 151 28 -233 132 32 37 94 157 -110 -2 -311 172 -82 7 -68 14 -56 66 74 55 71
5267 71 -29 41 298 -16 -32 -213 -203 350 23 -116 328 44 5 -9 -128 216 -128 -38 110 -133 -140 186 -54
5290 -54 -156 -130 21 -42 -269 184 86 40 -216 -51 43 -28 -60 129 -49 114 -26 17 149 247 116 27 -188 95
5314 95 -63 133 76 136 116 -34 -67 166 -27 93 67 180 281 -33 37 84 -8 -44 -25 131 155 -106 355 -8
5338 -8 -272 -99 78 71 180 77 -74 -62 214 146 -3 101 196 -204 -40 -179 97 27 -142 135 -80 -236 36
5361 36 241 -194 250 168 35 4 -266 204 -20 70 -78 261 192 -55 14 -91 -164 -188 -18 -142 -183 -146 67
5384 67 -290 36 -36 -126 88 -119 -207 -181 6 -52 73 153 65 54 344 -111 -162 27 179 -239 -79 39 90 -5
5408 -5 19 227 232 79 51 87 58 -180 73 75 -13 -224 15 -266 -93 -156 97 -14 -135 -27 19 132 76 121 50
5433 50 -147 -235 262 -180 -258 -183 -129 -183 131 133 6 -60 20 -17 -90 -59 48 -260 -257 -63 214 -158 -26 73 -67
5458 -67 -61 80 9 -319 -29 -146 113 22 -122 326 10 -8 9 -246 52 -3 -1 -24 -84 42 -44 33 0 -19 -25 -24 -19
5485 -19 -229 -135 256 172 -41 66 -75 -3 331 -218 -130 104 177 34 -78 232 45 -53 124 158 -11 -173 -19
5508 -19 -263 268 -14 182 106 112 7 209 76 -122 -165 -283 223 55 -171 65 -121 -42 54 242 -40 127
5530 127 83 -37 -12 22 12 168 179 -174 -5 -272 -183 77 70 -62 140 -83 -37 -242 48 -93 143 -180 164
5553 164 116 -265 -21 -134 -90 56 -30 -120 95 -159 81 -178 101 104 -72 -150 15 259 -15 25 158 59 -88
5576 -88 47 226 233 -247 -126 26 136 109 -152 -66 64 -183 40 111 -92 135 -53 -243 347 -291 105 -74
5598 -74 -11 -243 162 75 217 194 -98 2 202 53 71 -122 -357 -99 -5 -102 -175 -47 73 178 243 203 72
5621 72 132 -179 60 61 -170 35 153 -184 -179 -59 -89 -67 -63 -53 -126 197 -119 -126 38 67 -82 -38 -20 -12 26 108 223
5648 223 16 181 49 6 122 168 33 172 72 -137 -92 36 49 -125 -28 -36 65 -8 -44 -120 81 -84 -158 188
5672 188 -82 42 38 206 -290 -105 62 -87 -47 -117 159 88 143 -71 -27 12 -202 -143 -45 27 31 4 314 -149 -74
5697 -74 -53 -35 117 66 194 -37 -8 60 -126 105 77 -53 -148 99 55 -125 9 222 -13 187 183 41 45 72 10
5722 10 198 168 -60 93 144 -19 -183 -79 96 116 -118 156 -171 -110 -77 19 89 128 95 206 342 429 62 -33
5746 -33 21 184 -13 -48 83 -341 7 -77 167 264 60 57 12 191 75 113 143 116 -180 -15 -147 -90 -98 64 -194
5771 -194 -153 82 -136 47 105 181 -82 -296 131 -36 -5 119 91 89 243 -59 163 224 84 -114 90 32 -22
5794 -22 159 327 16 123 -68 21 157 41 82 133 112 -77 130 -109 -25 -112 -37 -229 236 86 0 -89 224
5817 224 -61 77 108 263 9 47 -141 25 -173 -201 227 -58 201 208 24 9 -166 26 150 -96 -166 44
5839 44 -276 9 -50 -23 -80 23 218 157 -9 26 -112 -316 -70 -99 142 161 -246 -110 -9 -257 -55 -2 -62
5862 -62 54 75 -120 175 119 192 -136 -2 29 151 359 53 -105 -142 46 206 13 -169 112 -235 78 54
5884 54 33 -68 35 266 -11 18 -120 -7 -260 60 20 -187 -138 -95 31 240 212 -253 114 -36 -28 -100 273
5907 273 93 179 13 -40 -12 -137 251 -249 96 80 -92 -22 -170 -63 -115 182 -91 67 92 -203 42 36 -226
5930 -226 -2 205 89 -296 9 -64 -46 -115 -175 162 -38 130 207 171 142 -106 82 -28 -98 9 255 80 -48
5953 -48 155 -39 -87 178 13 -3 37 3 -77 -44 142 -75 -254 -55 165 93 -167 185 -170 59 248 -203 220
5976 220 239 76 61 28 -144 -98 -148 51 -135 -100 118 -174 32 -155 88 -93 1 75 37 -69 73 -356 -21
5999 -21 -1 -99 -8 -115 17 -154 -57 -175 -32 -137 -7 -260 102 -43 -172 -61 133 105 67 175 -51 190
6021 190 60 -176 -139 75 -252 77 340 -20 16 108 -58 163 234 -101 277 -144 -332 -73 -202 -99 112
6042 112 148 -157 -69 96 -40 114 -95 64 159 250 28 27 1 -158 -110 -77 -140 -293 -33 -12 -127 -82 -107 -100 -176
6067 -176 -43 -37 -48 -51 -94 -35 100 87 112 -2 -143 143 -52 -48 127 -76 142 -402 55 41 -42 30 126 209 -38
6092 -38 197 44 -131 -174 -277 233 -231 26 -263 -293 251 100 -102 -29 29 60 -62 29 16 -49 74 62 -222
6115 -222 156 -166 88 -129 25 151 -66 -45 200 70 -51 -14 38 8 -135 38 -100 -164 96 125 -272 2
6137 2 -69 86 63 138 178 41 14 90 165 -107 -128 -108 -211 277 -211 -31 -46 -171 -211 96 -42 319 -133 -58 -27
6162 -27 -167 -50 -78 -142 185 -109 55 7 -182 -34 148 -117 50 161 -20 -15 153 62 -96 -13 -302 70 -18
6185 -18 30 -77 -22 210 100 -135 -206 -63 -174 -23 -97 2 151 -29 -218 -174 -160 85 -57 -140 -37 114 175
6208 175 41 -53 -125 73 36 -102 -133 91 40 -167 -113 136 54 -114 67 325 69 -104 54 31 18 -163 -172 147
6232 147 -156 -14 107 65 31 156 116 4 3 45 133 -102 70 97 2 -81 36 26 8 -85 331 -26 -174 38
6256 38 53 -178 -102 64 -40 -18 -110 -37 212 247 -170 -36 63 47 -57 -249 -217 -56 -315 -114 18 213 -49
6279 -49 -105 189 133 162 -24 0 68 64 -13 -130 118 144 -2 45 192 53 -188 -145 18 145 -36 -126 19 71 161
6304 161 70 -255 197 -279 -89 132 232 49 222 177 16 144 378 -11 -176 49 116 -121 46 -18 -200
6325 -200 93 203 148 22 187 195 159 -4 -18 137 119 -25 198 -58 -18 -66 108 -12 -373 -38 -154 -51 53
6348 53 -50 60 165 -11 75 206 -307 55 18 160 71 -45 -50 140 232 -146 -27 122 68 -121 -119 12 186
6371 186 -201 143 20 -179 111 87 127 -126 -33 -75 -101 32 105 38 -62 -186 -35 -95 71 -185 -144 57 69
6394 69 4 162 89 241 98 6 79 182 -10 62 -78 -12 -34 -461 -68 -95 -28 -134 2 -63 -14 2 -81 5 115
6419 115 35 -96 33 -1 291 -122 -187 -91 -107 19 -142 -66 -69 85 -170 56 -32 -271 53 145 96 202 -96 -157
6443 -157 488 90 262 34 114 201 -117 253 78 140 -44 -181 34 80 -87 13 -120 15 156 -317 -122
6464 -122 122 -21 50 -6 124 235 -195 -105 -108 -135 -163 69 28 -166 26 4 -207 -195 68 9 -128 150 -2 69
6488 69 -200 -135 -85 -145 -122 195 -213 -40 -127 60 -194 -192 -203 -119 96 -52 -134 -270 -37 -185 -266 7 -70 -46 270
6513 270 58 -1 -218 -167 -286 -15 23 106 -17 94 -110 39 -39 173 97 73 -20 -187 131 383 58 141 -321
6536 -321 115 -61 -82 33 -24 -109 73 -312 130 -208 52 -194 -184 156 -120 67 70 175 -149 65 -138 -205
6558 -205 101 -135 -132 -235 11 192 -151 98 -53 -110 -43 -7 -38 121 -95 129 -44 256 72 -25 237 117
6580 117 96 -135 57 30 -28 82 -37 60 -102 125 -7 107 22 91 -44 -76 -23 9 296 12 -135 69 67 20
6604 20 -74 160 88 128 39 -409 13 -24 -13 40 -212 57 209 -1 78 -165 15 -129 -23 49 82 3 134 -181
6628 -181 -276 -48 186 140 -25 -167 -118 -92 -194 -95 90 66 213 -289 124 144 -75 4 164 275 12 -54 155
6651 155 -1 -39 119 -2 -155 -13 88 -130 -129 -64 57 284 165 158 87 -106 116 -72 -46 103 -41 -229 -216
6674 -216 46 -98 83 27 168 -38 -109 10 -132 94 -68 168 -81 47 10 70 -118 -202 114 72 -148 38
6696 38 163 -14 -20 172 21 -196 -19 -76 -41 15 -192 20 10 -108 -160 -229 200 35 -72 -51 249 -39 -107 51
6720 51 -108 129 -147 9 -248 -21 -166 13 41 -115 -127 49 50 -187 -19 -26 146 45 2 -97 21 40 71 38
6744 38 -73 -122 5 -54 111 65 -35 -3 -36 55 139 -91 -72 198 -156 -79 -74 185 279 125 71 26 -34 176 -270
6769 -270 -134 207 -162 7 -176 7 -135 41 -184 -109 92 -33 -23 9 -119 -19 -85 -9 -16 103 -6 -77 -161
6792 -161 -171 -72 -11 1 -160 71 21 -119 -80 142 54 -10 47 78 152 41 122 -86 16 -9 -25 8 -137 112 56
6817 56 -139 -204 -58 44 163 -152 -371 81 153 -57 208 114 27 64 1 -83 -29 3 -54 429 62 266 -93 -225
6841 -225 145 182 -116 265 127 -318 13 -153 15 -39 -176 105 -122 163 -82 -22 105 -86 130 119 -70
6862 -70 -5 118 371 -78 150 208 86 193 172 80 147 -28 -7 97 31 -31 -146 -82 25 -126 -267 -108 163
6885 163 -172 377 123 -229 141 -250 -70 17 -22 -49 66 14 -78 -132 -54 413 53 -86 -13 -139 -86 -124 -89 -12
6909 -12 -98 44 -77 24 2 -119 -4 122 131 215 172 180 -133 141 -31 -92 117 162 -115 127 -21 263 -18 -19
6933 -19 -156 -44 276 -175 317 37 -159 -115 74 -95 76 -155 83 174 34 54 -89 -188 39 -108 6 88
6955 88 238 -316 71 73 -176 -59 49 -126 61 218 17 -3 -56 -36 122 175 -33 -135 -103 23 177 48 -84
6978 -84 342 -15 -26 -82 -85 -11 45 82 72 -84 -85 -123 38 -71 183 -229 7 69 34 -49 -57 116 13 -110 -71 -321
7004 -321 21 -221 1 461 -98 89 61 -189 -105 55 -273 280 -132 -233 0 -377 -232 -173 163 25 -85
7025 -85 162 -108 -175 340 1 -206 181 44 -3 91 149 140 -46 52 -240 115 -68 101 212 -102 -120 59 160
7048 160 96 -43 -72 322 -98 -302 -144 59 21 -2 -52 -78 -58 -148 -124 -73 25 6 9 -156 9 40 -168 -141 59
7073 59 -36 118 103 60 -229 -104 111 114 -126 252 -270 46 -149 9 119 164 8 172 143 -33 36 205 148
7096 148 18 88 100 -67 -92 -58 -325 -28 71 35 -162 -50 -121 -70 105 -30 -48 56 -23 91 -43 190 134 133
7120 133 69 116 -152 -117 97 -282 -46 -61 42 82 -1 83 166 50 -174 -64 168 -71 -18 63 154 6 -25 269
7144 269 -207 -31 85 -4 71 -134 109 151 -159 -171 -120 106 -32 203 -460 197 56 -223 13 92 -70 -264
7166 -264 -85 20 -95 -162 -52 -15 -157 100 -90 -209 -25 45 137 68 97 7 248 27 -242 25 -327 -32
7188 -32 73 14 -62 -166 -105 64 -105 5 45 -71 4 5 -152 -29 18 36 -92 163 -106 -53 49 179 112 -134
7212 -134 87 -221 212 -126 0 42 -13 60 167 -64 -196 -57 -225 170 26 -50 -50 32 85 -5 24 292 110
7235 110 215 -162 -94 -61 -117 24 28 124 131 152 225 192 27 -113 -231 -62 43 162 180 -31 18 -188 86 33 -70
7260 -70 -102 -244 34 -220 -35 -49 -39 96 -220 -202 132 39 -67 -369 53 -256 -77 34 -143 -92 67 152 -88
7283 -88 -41 53 -231 -63 -98 -34 -145 125 -39 145 -237 229 -185 -99 -386 -67 108 -76 21 -41 29 -100 21
7306 21 -2 125 -54 32 43 -33 -162 40 -54 -49 -71 -271 278 -7 -16 -196 -81 -127 95 157 108 -166 -4 309 126
7331 126 298 -128 -225 -245 166 148 328 -272 -9 11 -195 -16 -51 -60 -1 94 101 -49 -169 -9 27 -49 -131 65 -5
7356 -5 -228 -109 89 -284 -50 -28 -98 19 283 178 140 74 256 -51 -246 25 -90 -383 -300 145 143 73 -133
7379 -133 120 -14 37 61 94 -105 153 10 -41 58 -83 206 -32 105 386 265 -86 56 58 322 87 33 49
7402 49 47 -27 -56 213 121 -67 -48 13 80 -13 -123 -96 212 40 -150 140 -116 -50 209 -124 51 244 204 -301
7426 -301 13 12 242 80 -122 58 179 -22 73 -58 -73 -54 106 44 175 250 -107 -76 237 -217 90 -54 -67
7449 -67 180 30 0 -52 -99 77 139 133 -181 96 -4 204 26 144 116 -128 -8 182 82 -45 15 -45 75
7472 75 138 194 -163 153 -68 -92 183 -82 -185 -25 5 255 -82 -108 148 -283 -128 186 31 -119 -70 202
7494 202 312 48 -253 8 95 -43 -28 -91 -50 170 -192 25 -15 -149 -220 -172 -111 -125 17 -4 39 -54 -270 -65
7518 -65 -137 85 183 -205 -251 109 -44 -38 30 -81 -162 -169 -40 283 164 22 -87 -42 -1 128 -229 30 -87 -77
7542 -77 185 -42 -69 -11 101 107 -87 -163 167 -160 33 -254 123 89 56 255 -73 -4 30 -136 310 41 75 66
7566 66 -25 32 96 4 160 27 177 -9 -26 81 -175 -14 74 -35 -32 -46 56 219 153 119 42 -149 -106 75 117
7591 117 -115 -126 59 -23 -51 -31 -38 -37 -11 -104 259 -16 -230 -121 -154 -96 70 111 71 -70 -150 -205 81 -365 -139
7616 -139 49 23 -147 -22 -190 114 -123 -83 66 115 -128 -137 -152 13 -4 -191 193 -141 -86 52 -62 -136 -90
7639 -90 -213 -119 265 148 56 -49 72 -124 17 -122 107 -123 33 -33 -106 79 -6 -126 -73 -75 0 384 -147
7662 -147 72 126 136 369 47 -181 -15 -211 65 -134 -39 262 45 -22 -25 10 35 -41 -42 24 291 -256 -186 -129 20
7687 20 -74 -191 106 22 -31 -178 1 22 -35 184 85 -94 64 60 30 -156 -79 -94 22 -84 12 -183 -129 108 -113
7712 -113 -30 70 127 -76 184 76 -229 -108 -19 6 127 -265 211 -268 -101 -28 167 -197 147 16 -16 -39
7734 -39 -252 124 -84 -18 -193 -193 -123 -68 -56 -45 127 115 -218 -213 29 -121 85 -57 41 -87 6 -27 72 304 -56
7759 -56 112 78 43 -29 194 -143 64 -216 81 152 238 -109 -196 -166 74 35 -66 189 -175 -35 -37 -15 -80 -113 72
7784 72 3 -81 -45 95 111 -147 -26 -79 -11 -179 27 106 -33 -162 -94 -93 365 12 -137 -211 19 141 -167 145
7808 145 -42 -25 33 -73 -13 150 -213 -256 -20 -256 -132 79 -126 183 -71 49 -1 5 48 -339 -7 -4 -26 254
7832 254 -286 -121 -36 184 -36 149 349 -3 146 41 -37 39 45 55 -228 -72 106 -35 -16 33 -23 -236 38
7855 38 44 -2 58 10 -18 98 75 -325 -89 -43 -7 -76 175 -105 39 1 77 135 9 30 -188 -163 -255 -101 17 -68
7881 -68 125 -67 29 -10 -37 104 -52 130 -17 68 -59 39 72 -47 -119 93 152 25 -145 277 -200 82 234
7904 234 96 141 -178 24 9 86 -64 -237 -168 35 -96 23 -41 26 -135 -27 82 95 36 156 -114 -27 -17
7927 -17 -166 -64 16 45 -148 -40 0 -117 45 3 136 -125 32 154 77 -33 62 175 176 183 -113 134 21 92
7951 92 -40 101 -59 -64 -81 31 204 -22 -133 69 -117 -181 302 -330 -16 126 -34 6 -84 61 -82 -85 -45
7974 -45 -39 35 -43 -74 -195 29 125 -194 33 -314 -132 -67 -52 12 -205 250 78 60 74 -290 -307 146 253 3
7998 3 130 -25 -47 88 -241 -183 148 -174 -19 148 114 -64 100 -29 -77 136 126 225 207 106 62 -186 -139 77
8022 77 90 -68 -63 42 30 45 -133 55 41 -70 197 -208 -172 -18 -89 -104 -20 -92 -143 120 210 -184 16 -139 100
8047 100 129 -1 51 -1 262 14 118 115 226 -86 -42 77 -23 -34 211 4 -112 20 22 72 67 86 -4 75 136
8072 136 137 -136 20 -49 -63 -39 52 -191 20 -86 -62 134 -215 70 -152 -126 -17 211 4 -117 115 40 -51
8095 -51 71 150 73 -94 -97 119 -118 -97 93 -49 44 184 110 17 -256 -20 116 27 -44 77 53 -93 -63 -50 -36
8120 -36 -134 59 123 226 -252 89 -159 102 -83 144 35 -37 -293 348 43 82 -199 -273 260 -73 108 114 -44
8143 -44 69 173 -67 -244 -102 -234 -57 161 51 90 -13 -83 -261 57 -135 -103 44 44 -159 -132 93 0 90
8166 90 -94 106 96 -8 128 145 -69 -1 -166 -64 28 58 -193 27 -165 3 133 -151 -71 -11 44 -141 -151
8189 -151 30 57
8191E7
$$ Imaginary data points
##PAGE= N=2
##DATA TABLE= (X++(I..I)), XYDATA
0 0 0 0 0 0 0 0 0 0 0 0 0 0 -8 8 -8 8 -8 16 -16 16 -24 24 -32 40 -43 48 -57 68 -80 89 -104 119 -135 152 -171
35 -171 193 -217 243 -272 302 -338 374 -414 460 -508 563 -620 684 -753 831 -915 1009 -1110
53 -1110 1229 -1356 1501 -1667 1855 -2078 2338 -2651 3036 -3521 4155 -5025 6301 -8349 12224
68 12224 -22213 110427 225997 183418 212390 160153 149057 137916 120690 90484 94262 80172
80 80172 67717 62776 62512 45982 51358 44968 35598 40126 40160 32168 43781 44351 45587 55133 60380
95 60380 59117 61834 65331 61608 50035 52657 47203 29569 31833 34214 20358 22915 33091 27984
109 27984 23736 34456 33755 18369 21404 22079 -1610 -3477 2900 -14998 -13094 3205 940 8115
123 8115 29103 38303 42895 55446 62732 57020 56689 55637 41547 35425 30728 19434 19974 19768 17645
138 17645 28032 34804 38002 49249 55098 56131 57774 59005 54691 44959 43365 37748 23756 23347
152 23347 22124 10960 10895 14438 8030 3710 7112 5319 -5011 -4084 -374 -12084 -11983 -2364 -10037
167 -10037 -9210 2501 -415 -2108 5451 4964 -1584 -1003 571 -7300 -8891 -3683 -7804 -5805 3779
182 3779 4688 10828 19099 20356 24801 26434 23631 22303 18653 13195 9505 7600 6725 4957 10143 15890
198 15890 16496 25176 32542 30496 33719 35610 28447 21760 17151 9866 -1405 -6028 -6329 -14810 -15124
213 -15124 -6604 -9254 -6751 3930 4061 3233 8143 8248 3095 1143 1774 -4072 -8128 -4538 -7859 -9484
229 -9484 -4153 -5663 -5529 -2555 -4523 -4892 -5916 -8501 -9288 -10998 -11619 -10982 -10053 -7754 -7165 -3536 685
246 685 -1389 1310 3954 -1021 -1393 510 -3134 -4118 -2046 -40 -64 4087 10873 10013 12548 19358 15132
263 15132 12142 14647 8562 2195 1288 -1668 -5951 -6211 -1814 -1251 770 9142 11862 12830 18840 18593
279 18593 15818 15798 11789 7396 3747 441 -1358 -3140 -2611 -1126 -286 3491 4413 5323 7752 4661
295 4661 3001 3168 -2041 -4776 -4796 -8122 -9198 -7565 -5658 -5361 -3305 1398 919 861 5205 2759 -271
312 -271 2915 727 -1913 318 1539 909 2222 6105 6647 5130 8266 7407 2924 3555 1398 -3022
328 -3022 -3314 -4398 -5063 -3957 -2490 143 1262 3315 5037 4057 4574 2358 -975 -1962 -6141 -8375
344 -8375 -7454 -9578 -9074 -4971 -3180 -448 3600 6698 7901 8112 9966 7065 2907 3233 -645 -5336
360 -5336 -3855 -5461 -6968 -4609 -2782 -1879 -464 1736 2651 432 1687 568 -3376 -2903 -3916 -5952
376 -5952 -4229 -3005 -1736 851 2726 4888 5881 6799 7606 5951 5270 3397 930 962 -1021 -2516 -187
393 -187 -1002 -902 1772 1660 1342 1387 1021 -571 -2798 -2533 -4350 -6598 -3924 -3468 -3732 418 2521 3039
411 3039 5566 6948 6567 5183 5030 3487 -592 -1181 -1907 -4606 -3826 -2445 -2692 141 2096 3020 4367
428 4367 4573 4315 2729 781 -283 -3147 -4040 -4277 -6000 -4167 -3421 -2462 530 1314 1908 3711 3698 2551
446 2551 1612 914 -118 -2106 -1179 -1152 -2376 517 2260 1416 3995 5076 3682 3767 2949 922 -1502
463 -1502 -2732 -3303 -5748 -5072 -3377 -3688 -1290 1458 1862 3751 4955 4811 4824 3597 2868 1800 1083
480 1083 845 161 1003 2477 2501 4181 5337 4500 5552 4449 2320 1683 -526 -2413 -3118 -3403 -3387 -3609
498 -3609 -646 1356 1466 4814 6963 6251 7691 8235 6584 5912 5411 4672 3583 3769 5197 4481 5656
515 5656 8006 6978 7544 8562 6671 5688 4851 2808 1917 621 274 479 623 2635 3214 4510 6051
532 6051 6258 6856 6865 4539 4561 2965 367 -261 -1269 -2320 -1703 -1236 170 471 1913 3308 1926 1997
550 1997 2344 -595 -1800 -2404 -4733 -5846 -6079 -6156 -6392 -5633 -3781 -4288 -3760 -2161 -3471 -3715 -3682 -5220
568 -5220 -5699 -5852 -6382 -5782 -5013 -3685 -2165 -1161 490 1296 1409 1955 953 336 -410 -1949 -2488 -2681
586 -2681 -3797 -2552 -1963 -1600 -315 232 1411 732 963 1557 -183 -673 163 -1604 -525 928 1443
603 1443 3052 5252 6792 8430 9089 10242 9137 7927 7522 4932 2840 2047 -135 -1414 -1533 -1881
619 -1881 -1272 -992 -350 390 110 306 -565 -1834 -2201 -4434 -4876 -5253 -6674 -6051 -5236 -5016 -3448 -2604 -2110
638 -2110 -1440 -1188 -907 -1717 -2046 -1836 -3291 -3598 -2497 -3299 -2870 -1214 -765 -484 65 354 132 -604 -536
657 -536 -1657 -3043 -2167 -2669 -3064 -1804 -1464 -524 1037 1676 2020 2368 2494 2643 1469 977 430 -198 557
676 557 483 1399 3109 3651 5150 7024 7063 7641 7855 6892 5937 4816 3908 2094 1186 1469 486 728 2241
695 2241 2341 2835 4390 4447 4343 4284 3695 2720 1598 1012 182 -899 -739 -649 -859 343 342 823 1303 1153
715 1153 917 293 -164 -444 -1424 -1598 -1357 -1348 -177 -34 713 1886 1752 2612 3086 2041 2054 1940 1128 782
735 782 594 1245 1197 1449 2937 3063 3071 4143 3483 2803 2643 1233 -308 -1111 -2002 -2306 -3127 -2413 -1698 -1828
755 -1828 35 926 1209 2244 2335 2043 1302 695 -245 -1044 -1604 -1632 -1666 -1000 -86 337 1387 1714 2001 2603
775 2603 1842 976 1073 -523 -1366 -1820 -2273 -2314 -2013 -1671 -1196 -779 559 963 534 1678 1137 404 730 168
795 168 -269 -329 139 570 313 1460 1811 1473 2002 1952 1027 785 503 -628 -724 -1163 -844 -782 -317 637 1142
816 1142 1554 2101 1802 2098 1581 556 491 -622 -1468 -1105 -1622 -1384 -681 -231 289 1377 2102 2080 1781 2176
836 2176 1272 -414 -232 -1188 -2310 -2114 -2118 -2069 -1612 -910 150 -7 778 1420 708 695 518 -367 -953 -1122
856 -1122 -1484 -1207 -1292 -469 -218 350 1348 1713 1475 1892 1295 1105 960 201 150 -202 -874 -313 -186 -224 733
877 733 371 280 29 46 -401 -1500 -1380 -1487 -2306 -1624 -1162 -1292 -146 294 877 1433 1579 1723 1424 792
897 792 595 -564 -1265 -923 -1414 -1331 -887 -860 -170 286 798 1184 1093 1307 674 51 -363 -1189 -1310 -1303 -1684 -908
919 -908 -548 -214 994 1022 1315 2091 1947 1373 708 444 44 -962 -776 -607 -1385 -864 -600 -657 125 366
939 366 339 209 -90 -397 -851 -1228 -799 -1572 -1260 -771 -550 -157 324 538 1061 1228 797 543 -96 -100 -439
960 -439 -1017 -356 -475 -510 40 84 879 1302 902 1189 801 138 -401 -894 -1680 -1938 -1994 -1658 -2023 -1278 -631
981 -631 -531 264 769 358 676 519 -250 -369 -870 -1075 -1148 -1229 -1119 -1017 -691 265 -31 249 759 474 249
1002 249 6 -254 -689 -1310 -1045 -1096 -1127 -540 -230 -15 334 561 661 566 78 -72 -265 -884 -1044 -1591 -1263
1023 -1263 -1282 -561 -127 -420 -10 631 -323 -260 -191 -1163 -959 -1392 -1866 -1636 -1462 -993 -618 -322 361 766 881
1044 881 1342 1048 925 940 659 170 -94 -229 164 -108 661 916 1039 1515 1398 1479 1301 369 173 73 -775
1065 -775 -920 -955 -1479 -1333 -853 -649 -234 -63 286 276 380 462 -1 75 32 -587 -345 78 145 627 917 1048
1087 1048 1377 1602 1487 997 194 404 -262 -850 -1084 -1540 -1659 -1911 -1888 -1303 -1352 -1047 -616 -786 -683 -773 -1535
1108 -1535 -1395 -1908 -1572 -1108 -1473 -640 -367 -179 771 1117 1163 1219 1297 1305 794 343 463 -248 -315 -87 -351 -78
1130 -78 616 770 657 1323 1376 901 415 728 281 -321 -154 -240 -408 251 237 634 974 825 1494 1376 1443 980
1152 980 245 315 9 -373 -428 -381 -548 -199 -335 354 388 53 386 50 -140 -278 -753 -979 -1354 -1616 -1097
1173 -1097 -1092 -1117 -342 -274 -19 150 216 259 -206 -67 -415 -760 -344 -761 -1092 -535 -640 -539 -29 -29 280 66
1195 66 73 -80 -468 -715 -613 -945 -1057 -944 -1056 -296 -141 117 637 602 1055 1155 1049 895 614 220 4
1216 4 -109 -266 136 -50 353 458 505 842 547 250 387 -36 -404 -776 -738 -542 -1076 -866 -239 -299 -359 231
1238 231 240 611 769 357 222 -107 -223 -247 -207 -96 -376 -58 244 323 668 640 590 553 118 178 126 -580 -735
1261 -735 -789 -873 -609 -566 -18 319 463 609 781 297 1040 204 150 120 -97 -34 -205 -113 187 88 396 689 480
1284 480 692 451 207 197 -409 -457 -758 -879 -673 -809 -856 -699 -288 -107 136 235 246 167 -102 -15 -420 -565
1306 -565 -63 -391 -228 -64 67 455 472 827 970 639 498 414 -53 311 -285 -549 -584 -505 -286 26 307
1327 307 175 202 773 656 110 162 355 -153 -214 -274 -195 190 295 465 729 851 1083 1101 848 789 753 355 72
1350 72 -340 -350 -472 -563 139 -90 -8 151 56 134 108 34 128 -207 -225 -2 -594 47 -35 -201 415 453 716 837
1374 837 1172 950 932 654 678 148 62 135 93 42 138 138 794 575 529 685 472 469 350 80 50 -378 -163 -122 -93
1399 -93 459 549 583 1011 882 651 1077 583 681 313 58 175 -382 -193 -180 -261 74 346 74 389 310 381 224
1422 224 -311 -50 -502 -512 -426 -430 -682 -198 -136 236 279 428 543 480 586 402 212 53 71 17 -112 161 316
1445 316 174 471 636 567 763 967 441 367 335 -80 94 -283 34 193 42 368 530 222 676 593 614 686
1467 686 337 337 180 74 -79 0 51 167 30 86 323 41 420 429 208 -43 -157 -406 -723 -960 -666 -528
1489 -528 -431 -190 27 9 300 381 388 559 113 264 -135 -383 -216 -245 -253 47 -118 600 243 567 516 242 203
1512 203 522 -23 -302 -160 -523 -480 -511 -328 -319 -320 -4 -47 132 276 151 58 121 -161 -213 -391 -560 -287 -397
1535 -397 -294 -110 -76 58 -231 -265 -175 -218 -454 -738 -838 -608 -809 -611 -393 -633 -153 -264 -104 -2 -18 -160
1557 -160 -387 -371 -395 -570 -623 -622 -265 -260 -175 -25 7 259 -24 460 85 152 -69 -419 -434 -433 -671 -502 -500 -261 22
1582 22 105 284 539 230 567 211 -152 287 -53 -29 -72 19 99 127 270 331 358 503 383 484 295 128 -56
1605 -56 -34 -235 -421 -178 -271 -335 -172 -192 -177 -233 -47 -211 -408 -145 -501 -335 -257 -8 -133 -66 173 549 683
1628 683 443 671 373 336 186 97 -183 -175 -426 -299 -352 -103 115 -270 73 283 -30 174 183 -132 -315 -409 -202
1651 -202 -365 -549 -356 -195 -162 399 256 317 580 648 425 454 507 373 201 111 -102 404 351 146 39 174
1673 174 91 475 328 402 211 -152 -314 -56 111 -77 -84 -203 69 -32 341 322 310 354 260 295 102 118 62 -9
1697 -9 131 73 53 21 294 32 320 284 252 -25 -206 -213 -503 -534 -555 -560 -692 -643 -272 -201 -42 76 283 175 -42
1722 -42 290 -146 -206 -212 -135 -442 -161 -356 -76 -135 160 65 277 158 126 115 37 -341 -341 -336 -352 -424 -366 -256 -271 42
1748 42 -468 286 114 180 128 -159 -250 -288 -239 -262 -208 -233 6 -7 14 289 -58 186 151 11 221 -175 -397 -494
1772 -494 -291 87 -99 -94 198 -23 179 185 288 97 -269 128 -164 29 -10 -401 -117 130 194 293 246 397 460
1795 460 187 449 32 379 153 -72 -247 -33 118 -300 45 179 -25 298 381 244 231 234 42 -2 -381 -464
1817 -464 -239 -270 -308 -513 -141 -178 -35 195 8 215 -112 -76 -348 -289 -509 -186 -351 -432 -170 -147 -141 69 -47
1840 -47 33 19 187 28 -206 -28 -32 -215 -4 -189 22 170 298 373 347 370 127 33 36 87 -98 -299 -185 -141
1864 -141 -41 -90 165 311 143 437 392 77 145 175 73 -82 78 -174 -87 -59 -115 -89 269 304 310 523 79 158
1888 158 -163 -283 -274 -265 -436 -207 -143 -264 -403 -146 -1 216 -139 118 -175 -425 -144 -308 -446 -283 -270 -164
1910 -164 -9 63 270 20 313 266 45 149 115 -372 -167 -202 -323 -65 -55 117 -78 35 300 172 -49 171
1932 171 -73 -154 -95 -247 -188 -178 -50 -40 -38 72 59 138 258 215 213 349 1 -391 -108 -303 -69 -502 -50 78
1956 78 7 -6 74 -136 -45 -170 -72 -156 5 -197 -85 95 -105 3 78 -102 336 17 144 439 382 69 -109
1979 -109 419 62 70 -2 -107 279 -107 237 83 215 64 426 262 109 -8 -49 19 -122 -92 -251 -104 -194
2001 -194 -207 146 263 344 234 75 43 96 317 -170 -153 -190 -241 64 123 1 49 48 426 130 135 269 -111 46
2025 46 -351 -297 -164 -206 -424 23 56 208 35 222 24 81 235 -151 -14 30 -204 88 248 156 225 126 95
2048 95 516 426 693 460 163 204 87 89 24 20 57 280 199 -170 114 175 256 272 508 -1 141 -48 189 -20
2072 -20 120 130 219 171 168 577 346 431 167 -88 129 100 -33 -141 -4 59 -167 -109 131 30 -29 -34 -23 68 66 145
2098 145 -208 -86 -222 -389 -339 -326 -51 25 96 232 -189 65 131 46 -34 -81 -74 -11 -208 -35 -85 -62 -44 -38 29 -184
2124 -184 157 153 -9 -157 -15 177 -96 -10 -82 -184 -427 46 -185 -55 47 74 -45 82 -32 -204 -73 -241
2146 -241 -306 -317 -115 -311 -246 -98 -298 -221 -309 -258 -133 -172 -314 -259 -455 -444 -285 -402 -168 -155 -41 -10 -3 -158
2170 -158 -388 120 0 -194 -257 -54 -4 -176 -217 -471 -282 -69 -213 -105 83 15 -201 -154 -122 -103 -185 -402 -311
2193 -311 11 -142 48 33 108 152 234 286 155 134 301 107 -307 -151 165 -95 -97 6 -39 -160 -248 17 -147
2216 -147 23 190 103 -90 122 -315 -226 -38 -14 -10 40 38 416 19 92 366 24 -50 219 -47 4 123 79 -330
2240 -330 -23 -50 263 226 -132 263 358 -196 198 -103 -23 244 -15 140 85 149 0 80 52 440 97 51 -123
2263 -123 113 184 -13 80 400 15 194 15 -59 224 312 216 300 134 54 291 46 260 -89 -50 -88 -49 -68 -100
2287 -100 -3 32 158 52 145 112 331 -96 28 242 -117 -187 267 148 109 63 65 219 281 171 176 204 -69 241
2311 241 211 19 92 40 -53 111 183 359 415 291 313 130 -10 30 4 -68 -56 -180 -232 267 -111 253 293 -4
2335 -4 182 -7 0 -210 -141 -97 -233 -7 -69 95 -134 7 -137 83 156 225 49 76 -40 -6 -43 162 39 93
2359 93 21 -153 -41 -4 192 219 44 72 65 86 90 -69 34 -212 16 72 65 6 66 88 78 189 75 -16 100 147
2385 147 -220 123 -72 175 109 366 185 140 409 109 -61 215 125 99 -32 5 29 -82 -78 92 60 -59 -36
2408 -36 125 180 -125 142 96 -283 -95 66 64 -157 91 35 99 -75 -81 -256 -49 130 32 -30 33 -88 -37 -25 -185
2433 -185 54 29 -202 -62 -94 88 9 -22 -126 31 -162 109 -253 -300 129 -68 142 -143 -342 -5 73 14
2455 14 50 101 186 -100 8 110 -192 -39 -56 -91 128 -20 -257 -82 -110 -73 -131 -241 235 -146 -41 93 -50
2478 -50 -123 17 252 192 -119 -175 63 44 214 -113 48 25 -30 39 45 -213 -59 13 265 112 66 11 130 170 -45
2503 -45 -61 109 -310 -214 -26 -27 -113 -161 46 -85 -45 -82 -111 -16 -36 135 -139 -45 -98 -75 -62 -27 -149 141 -29 282
2529 282 214 122 83 47 -88 -69 -92 83 -178 -204 50 -88 -295 240 234 -205 -203 203 -12 71 -35 -254 -61 -146
2553 -146 47 -40 -74 -99 17 157 -60 29 319 -233 -81 -29 -37 -99 -42 29 -418 174 -92 -210 -162 102 102 -136
2577 -136 -15 -115 -131 -57 35 -53 11 174 -128 102 2 47 245 -117 -61 76 56 -56 142 -17 -125 -210 115
2600 115 93 -87 -124 -162 135 -69 -96 10 -49 -246 67 -256 82 -32 -26 154 -88 -44 241 -24 -89 80 176
2623 176 -21 -30 -229 4 -101 30 -2 -159 -55 111 -159 -145 257 -68 82 52 320 -100 -66 58 -23 -292
2645 -292 -40 47 54 -113 27 125 -138 -295 -22 -8 51 -27 78 74 70 68 114 -133 47 376 116 179 85 116 -5 104
2671 104 -141 -140 101 61 202 55 75 126 99 293 34 24 64 109 143 -235 234 -138 46 -90 104 -154 96
2694 96 185 -3 162 -67 14 55 -138 -362 -133 -30 -244 -19 105 -92 61 216 -43 89 -92 201 -60
2715 -60 -143 46 99 37 -212 -18 -8 -86 17 -32 -74 291 244 -11 -12 92 26 18 -178 -155 -8 111 9 46 -63
2740 -63 164 -31 -109 45 -11 1 148 17 -54 43 132 1 216 -60 66 229 -292 44 -110 -17 -66 128 -220
2763 -220 -122 -34 300 86 147 49 -4 -150 127 173 125 -115 96 128 134 123 88 40 14 -162 70 -129 -48 228 -11
2788 -11 190 -177 3 -31 77 123 -16 140 187 90 43 110 386 126 162 -109 -13 147 -39 -54 102 -86 277
2811 277 -13 181 -17 4 102 56 -140 -220 -208 -339 -167 -43 55 10 58 -50 40 -11 261 122 92 81 26 91 68
2836 68 8 -67 140 60 -65 19 -132 -70 -149 -95 -80 127 46 -94 213 -353 216 94 218 -112 237 -176 -135 29
2860 29 40 -134 63 -113 -11 124 196 30 -116 -130 89 244 11 -78 113 -66 -57 118 8 76 -183 128 -78
2883 -78 45 -130 -62 -98 -210 -44 -86 -105 -98 -118 -86 258 -2 -106 -16 -38 128 -177 124 -81 48 -57 -62 3 126
2908 126 -16 -195 -49 23 376 -134 -130 222 31 173 109 76 -19 -35 198 65 -88 -8 54 -11 -186 66 -35
2931 -35 8 30 141 129 166 -302 65 -35 218 38 -61 -126 -26 -163 62 -140 -191 -67 -202 33 -88 91 -278
2954 -278 -166 -35 128 98 -14 -113 -117 -29 -341 -12 -186 -52 67 -71 -203 -27 46 -7 17 -269 -153 -151 -129 -306
2978 -306 109 12 6 107 -145 109 185 -141 129 3 235 -32 -16 77 -110 -236 86 -139 297 -334 312 142
3000 142 -67 -85 -303 139 -37 310 -70 78 113 130 -232 126 222 -25 57 -49 -194 -150 65 -351 -159 101
3022 101 -177 -169 -98 -205 -120 -151 -67 49 -197 -63 -156 -155 0 -211 57 6 130 -22 -30 -108 29 -58 -133 -190 12
3047 12 165 32 44 -101 134 -44 -22 49 213 -155 -87 229 -136 -327 50 130 -61 -104 144 -6 88 27 -30
3070 -30 -32 140 80 -136 -20 -67 -178 -62 76 -78 -96 221 -212 184 -68 -84 7 -35 -248 3 -108 163 27
3093 27 27 -181 -108 27 16 133 -36 -222 0 234 47 31 -92 -77 -78 49 -216 21 77 1 -38 79 214 52
3117 52 99 74 -254 -7 105 124 -293 -157 64 187 200 161 -35 154 -178 44 66 15 81 104 -83 -72 211 -135
3141 -135 16 -43 -84 -45 -39 -246 72 -25 -61 111 -112 77 -42 13 -257 77 57 -212 6 -158 -147 103 27 -153
3165 -153 -147 -186 -36 56 58 -370 -69 62 211 19 9 -244 -107 52 -87 -256 85 -81 114 -310 71 -94
3187 -94 -99 196 56 24 -19 121 -123 -81 14 -35 13 -167 -116 5 74 -12 17 35 42 -208 103 146 -33 76 -147 -59
3213 -59 -20 257 295 -218 5 6 -157 101 219 395 64 71 86 72 -266 5 141 -255 -177 -101 105 30 39 -157 31
3238 31 85 -138 77 -275 208 -111 -240 -142 -144 60 147 0 -18 295 86 102 -105 159 220 -98 55 24 63 86
3262 86 72 231 192 133 202 -56 -212 366 26 34 17 -64 169 65 -115 338 70 53 -113 76 149 -19 225 -125
3286 -125 -118 29 -76 117 28 -129 -75 40 -161 56 7 -195 -8 71 -159 -42 -1 -8 -141 -188 3 -240 107
3309 107 110 164 -120 67 0 -57 20 5 -192 -148 49 -96 60 -24 32 276 -66 -291 -35 -150 28 160 300
3332 300 75 -169 -30 -79 -20 -84 160 -63 -100 -48 488 143 155 -158 42 -214 -165 -75 -16 62 -118 110 51 158
3356 158 92 3 106 -205 92 -2 -133 150 -93 101 -297 266 -120 -74 -49 9 79 64 -148 222 111 -253 -8
3379 -8 -38 -270 -172 17 -69 39 121 -15 -168 -19 42 123 239 -110 -152 68 -121 141 10 160 154 -76 276 -74
3403 -74 146 -13 147 68 186 -34 111 -93 -25 -165 89 20 -97 86 -118 -112 -41 0 -43 -55 -44 108 -9 1
3427 1 127 -169 -48 96 71 92 -116 -35 -178 -64 -105 222 38 -45 -51 -227 -18 -7 35 -6 15 148 -86 51
3451 51 20 275 204 229 85 3 -53 -69 -15 24 24 126 -374 -69 -64 -170 -72 -132 -11 21 38 -57 -11 66 99 -94 -66
3478 -66 -57 30 9 112 -72 -146 138 123 -59 -186 -60 158 58 136 -75 141 229 37 -158 -107 -249 -28 -309
3501 -309 58 -25 81 34 -20 80 26 -98 190 148 52 -101 -271 99 107 -130 -84 -45 -194 -3 -97 88 -216 109
3525 109 -88 -1 125 -73 25 -168 81 56 55 180 71 291 199 -204 171 75 159 8 -56 -11 126 45 75 15
3549 15 158 -60 -209 89 233 35 -188 89 64 157 46 10 0 159 178 -242 -253 -208 113 11 15 -62 -5 148
3573 148 -153 -153 27 -60 125 -32 57 205 179 220 116 215 -237 -180 91 88 74 138 232 112 -23 -138 82 273
3597 273 201 -205 -29 165 -222 203 -151 165 45 56 65 67 -189 -62 109 -81 -85 -116 -68 -19 99 -71 54 190
3621 190 -8 -121 78 4 -44 13 49 66 23 151 -160 13 136 -112 -46 -128 154 132 30 -83 -45 83 181 81
3645 81 87 -55 -50 -80 -61 -181 -139 161 105 -9 28 234 32 217 25 -58 78 162 -89 18 -9 -253 -143 65
3669 65 13 -92 -70 14 98 -267 -156 98 114 -71 -84 -197 -15 30 101 153 121 10 -113 -126 -10 52 152 -184
3693 -184 152 2 -140 114 -174 -19 1 -67 30 44 84 -299 -181 16 -42 150 -283 -14 2 -59 -54 340 -108
3716 -108 70 -55 188 -9 112 137 22 -305 -106 105 89 97 -226 170 119 -49 78 140 -152 -15 112 -13
3738 -13 35 65 -63 -82 200 35 -173 7 -306 107 -90 209 -61 -41 -65 -344 -95 175 69 51 227 27
3760 27 -31 -204 44 -162 -39 -54 -174 12 -153 151 368 15 -3 -3 25 200 64 97 -37 -159 -100 8 18
3783 18 70 130 110 221 -202 -85 -98 -11 24 -35 -151 -7 290 34 270 73 10 258 169 -108 137 87 -140 180
3807 180 -55 -174 -109 -64 160 47 -164 28 156 212 28 45 259 -134 -114 103 0 -8 30 -186 120 -9 -170
3830 -170 108 -285 -95 -39 -121 16 55 23 185 -262 -30 44 -56 -7 241 -49 -45 -62 -390 -228 79 3 -160
3853 -160 246 53 -145 -332 101 -24 -5 -137 87 -71 169 -186 97 -49 -75 -7 5 22 275 192 34 -70
3875 -70 -154 197 124 44 122 -35 -44 -13 40 -140 155 384 -97 -95 -283 46 11 65 26 177 -202 94 2 81 86 -87
3901 -87 -187 191 25 -127 69 111 71 193 -240 79 200 60 53 361 38 -33 105 87 -75 -260 -55 60
3923 60 -183 58 25 209 316 -94 -25 -127 -368 -22 21 -124 -66 -71 6 143 279 34 10 363 -37 -83 -30 -74
3947 -74 -37 -193 204 192 207 87 -174 -41 23 5 -1 2 -80 132 -90 -67 -22 -60 -29 -29 71 -139 -104 -267 -105 -66
3973 -66 146 -195 158 -91 209 -127 -36 277 -116 -221 -98 137 22 -139 -173 104 40 142 -136 29 -143
3994 -143 318 165 23 31 -86 26 88 169 -3 -31 132 -102 -93 -66 53 -39 -136 -6 3 140 30 175 51 282
4018 282 -168 -116 -84 76 -209 -155 34 -49 -160 -250 77 -141 93 87 -86 -128 -11 61 -66 -15 -57 12 228 185
4042 185 7 92 -289 -117 107 79 -123 119 129 22 89 -63 168 4 20 -54 -242 180 97 -120 169 -281
4064 -281 19 -137 2 -228 83 16 -285 168 59 217 51 102 76 -404 -34 -175 228 33 167 -29 -89
4085 -89 119 66 119 58 -104 246 -120 154 -43 -144 -85 77 152 157 6 -94 31 206 -93 100 12 -132 100
4108 100 114 26 -74 89 98 69 -92 -79 99 -63 -203 12 149 -18 -133 83 36 -86 -153 -31 46 264 87
4131 87 86 63 313 18 -133 19 -54 -125 -42 120 -223 -2 -100 -208 -25 64 153 185 47 -93 37 -189 -34 121
4155 121 152 36 -176 -105 -42 -72 -136 111 249 -37 73 244 -28 -148 64 16 97 107 -42 -249 -60 -37 52
4178 52 -208 -33 -93 -16 73 58 61 79 -31 -61 -286 14 75 85 88 71 -15 -64 -129 -90 -3 15 29 -66 -74 -159 44 -256
4206 -256 -10 -75 -89 -26 -77 -149 97 -72 -120 -28 -74 -329 -178 -29 119 57 -10 47 3 105 82 228 -112 24
4230 24 -87 37 -118 39 -365 -24 -93 -10 141 -181 124 55 90 -160 30 -168 -59 -99 -14 43 76 -102 -106 164
4254 164 11 -186 -13 -263 -110 -90 -29 -66 -147 214 22 -208 135 -39 -12 -80 -288 -117 78 -152 14 73
4276 73 -117 -227 94 112 -85 51 -126 74 81 -130 319 -38 -67 40 63 74 34 -150 -81 -62 63 74 -120 -138
4300 -138 91 -120 -48 -177 7 7 -64 -165 76 -7 6 -27 246 35 -33 -32 177 -128 -74 89 -153 83 125 -108
4324 -108 -218 -335 -281 154 23 123 154 376 70 -74 45 -114 -2 -184 195 -99 56 59 -85 -85 46 -77
4346 -77 149 164 109 -126 188 -6 -242 38 -54 99 -297 7 -78 336 -28 -80 66 -233 -50 207 40 173
4368 173 -35 95 -64 86 54 -94 158 -132 21 271 42 98 -112 29 -87 -106 21 226 -14 -171 34
4389 34 129 -17 125 170 122 -103 -110 -160 -64 17 -123 -231 13 -27 12 328 190 13 129 -33 -44 -178 -259 -149
4413 -149 147 199 -4 257 -95 21 -92 71 39 111 -46 199 295 -167 212 92 28 -85 151 -204 -20 61
4435 61 -241 267 -9 -119 71 -135 161 -213 -13 66 3 172 -73 -17 157 161 129 107 226 17 77 -70 -228
4458 -228 -144 -15 -69 -17 -30 72 108 28 -19 -15 138 -324 178 -235 -85 153 -159 60 -26 -99 -106 -10 120 -268 -191
4483 -191 271 92 2 12 -192 97 134 -15 -143 -49 337 -127 -65 -18 47 -34 397 -68 -52 82 -278 -15 85
4506 85 81 -101 38 12 -108 -88 -261 -267 -161 205 80 139 139 63 -236 -173 86 74 171 141 50 -89 -279 17 -108
4531 -108 -283 148 -61 88 -80 -68 8 -177 147 -13 53 -60 3 215 -102 -3 -39 -40 -84 -46 204 -247 113
4554 113 178 -11 67 132 -20 98 150 243 179 32 -15 177 95 -261 -383 249 -35 -210 -104 -53 85 188 -37
4577 -37 -43 142 -191 124 -65 -45 1 73 -4 -28 -85 -27 -7 76 -251 -31 0 60 -158 70 172 -350 87 90 -28
4602 -28 12 243 51 -28 44 -128 -237 33 -57 113 -8 -2 10 214 17 -92 123 5 -156 -95 -89 -12 332 201
4626 201 64 25 -34 142 142 263 44 60 -135 -148 -118 195 -191 363 -43 120 -15 178 -85 -282 -304 -86 94
4649 94 107 58 98 -21 158 -166 20 150 118 258 46 -184 -186 59 -171 211 -153 -118 -35 -103 -134 104 121 70
4673 70 229 -168 35 -36 57 73 -4 -121 -45 -202 -138 -114 -173 -237 90 -82 32 25 -134 -79 250 -125 -1 -71 -74
4698 -74 172 -28 97 215 116 -5 109 -28 18 -87 98 -82 142 23 -29 -84 55 20 82 70 68 -84 -19 48
4722 48 0 -134 331 110 -134 147 166 -27 24 -86 -103 63 -38 50 204 -206 105 -129 26 -326 52 11
4744 11 -8 466 -28 -41 180 119 163 -126 -6 94 120 -86 81 90 -165 -36 148 -10 159 166 -237 323 219
4767 219 -24 253 44 -126 68 -88 166 0 104 36 -219 -262 -104 -189 -49 -84 -185 244 -3 -38 43 368
4789 368 70 56 -177 -4 43 -38 -177 1 3 -162 3 184 -150 -47 -211 -16 -172 280 104 295 52 -155
4811 -155 186 89 83 -221 -51 -31 76 -178 -1 -210 174 8 -215 -21 33 -136 6 24 -213 80 -278 241
4833 241 202 -17 -159 -35 1 -50 -129 -175 139 -212 -34 123 42 9 59 157 -26 167 -106 -90 70 42 -66 65
4857 65 -49 22 15 58 -36 -248 -236 59 46 -42 5 -298 -23 -304 19 7 178 -112 40 -36 -154 -36 169 5
4881 5 161 285 -161 -90 61 183 -119 -152 -50 -77 -76 39 -62 -286 145 -81 -173 -103 -60 199 -111 -151 17 47
4905 47 -147 -106 -59 -228 -10 -215 -90 251 93 52 -95 43 -154 -178 -60 -21 88 -42 -17 143 42 -139
4927 -139 18 -46 146 -8 -345 38 -250 -39 -112 -101 -60 145 142 -55 202 208 -147 -139 319 143 -86 311 -1
4950 -1 135 -41 -26 168 -4 153 170 -186 16 186 43 52 -132 -8 82 -13 -107 -102 -85 -19 -272 19 223 -227
4974 -227 461 -102 357 -80 39 -112 -287 -112 49 142 28 -101 119 7 -142 57 -236 22 -51 -44 -8 152
4996 152 166 260 -89 -34 -8 -33 25 -233 -7 -48 -133 -36 -26 -63 100 57 -21 93 -309 27 145 70 -179 349 -112
5021 -112 287 86 -35 53 0 74 18 -8 -18 11 239 121 -256 8 332 61 -14 -24 -65 -306 -4 115 42 -80
5045 -80 179 -52 -1 129 21 -73 153 83 -79 -22 117 -40 -60 -8 -119 -213 -181 -67 -330 -115 177 -60 -1
5068 -1 -51 4 -158 83 6 -256 42 -162 -47 -217 -50 -207 -121 -34 80 77 -83 -57 -55 -45 -53 17 -189 82 2 102
5094 102 260 -85 -238 121 -48 54 189 40 -88 157 -32 -28 84 105 85 -34 -97 -154 86 110 -24 104
5116 104 -34 207 78 -85 -92 55 -89 50 -28 150 -183 234 22 -85 74 -12 -24 56 78 -110 133 -5
5138 -5 51 64 57 -29 68 -21 -10 -29 -222 104 -62 84 -81 -239 -5 -44 87 113 -98 35 230 266 -84 -416 13
5163 13 -11 57 -232 47 166 -42 -270 68 48 53 -135 3 -169 -142 -214 -47 41 2 195 -15 -146 22 182
5186 182 -130 -15 129 57 234 -62 -57 172 34 23 32 185 137 -122 -180 -237 -152 129 -196 -286 8 -32 -100 158
5210 158 197 240 234 193 48 -158 88 -133 -57 -15 -98 -25 -12 -195 100 60 59 -73 -58 -274 -206 54 110 388 -96
5235 -96 -76 -216 -262 121 94 178 207 45 164 65 -4 169 -143 111 -341 364 -93 -61 -24 -95 -32 -122 10 -38 -16
5260 -16 43 -56 -168 -107 -36 -162 -345 82 -70 -125 30 13 -126 89 272 58 -75 128 -38 109 214 -16
5282 -16 -197 -56 99 128 198 148 -223 86 11 17 175 -30 255 -330 18 252 7 49 -234 -4 40 156 38
5305 38 176 -204 137 263 -76 111 -179 317 35 -51 -52 165 52 293 -165 -203 257 -71 -200 -129 -131 -72 -67 49
5329 49 -60 4 196 24 67 59 -8 -15 158 143 -88 -8 10 -231 169 -27 -26 -330 -165 -35 73 40 -150 32 -88
5354 -88 92 53 134 -34 20 -66 89 -110 -343 29 77 71 79 46 -120 153 -29 -319 -45 -37 121 -11 72 30 133
5379 133 311 -42 165 -68 -132 -62 -102 -83 -131 -16 -12 32 -40 212 -152 13 173 213 269 -54 -19 110 60 203
5403 203 36 -40 83 -163 -24 174 59 -38 289 21 160 -173 260 -69 -88 153 -67 -216 0 -32 -184
5424 -184 136 530 42 -122 19 0 7 -26 -13 130 -36 207 -28 -28 -121 -111 11 92 -113 -152 -221 -24 197 -46
5448 -46 -16 -126 -7 305 213 104 147 240 357 19 43 20 41 104 -105 -178 199 -153 21 46 124 -95 -85 14 11
5473 11 211 -69 61 146 -31 173 -27 261 114 -158 -69 -10 149 139 -33 -23 -168 -89 45 -75 -167 -79 233
5496 233 -19 -22 -196 -181 35 -57 -6 -242 98 -112 165 -159 23 239 -291 -18 -322 18 -47 59 387 76
5518 76 74 130 315 220 84 141 -1 -78 -31 117 -156 152 66 -3 190 87 -225 110 -77 208 -197 -119 -107 -238
5542 -238 45 -195 123 -180 -168 189 -134 -200 9 -18 -172 -29 -190 -18 2 -119 57 -110 -33 291 121 -53
5564 -53 162 -146 -100 -36 59 13 -45 -117 209 131 -91 172 31 -98 -35 -194 -139 -84 96 -116 -37 -298 -54 137
5588 137 -9 -159 -255 -128 401 82 13 51 -145 11 -118 331 171 -361 137 -74 58 174 141 175 -85 -154
5610 -154 136 -52 32 -99 -129 191 218 -159 -88 183 114 -125 -240 -147 174 -226 -54 -77 106 87 -281 -12 33
5633 33 6 9 -76 -123 31 188 -20 145 -71 -139 -144 163 25 17 52 -65 -154 -170 -43 152 91 -18 264 115 44
5658 44 -72 -113 -199 -207 -74 150 235 107 31 217 -54 -13 91 196 87 -159 -144 -145 48 243 -30 -23 155 100 21
5683 21 -100 119 37 98 123 -1 186 27 -73 -135 -5 273 -5 103 39 -228 -11 -68 113 105 -103 99 -305
5706 -305 -69 79 65 112 -87 141 45 47 -151 -39 -120 310 118 -25 23 -105 150 -27 -365 -9 -105 -194 -220
5729 -220 -59 -26 -123 69 77 17 16 -204 0 -63 22 -85 2 -82 198 134 242 113 25 236 242 75 -216 116 16
5754 16 -40 -47 7 50 -182 -187 -334 28 -53 40 362 -95 -262 -57 124 -206 -30 -222 -159 -2 -24 37 -92 139
5778 139 138 -47 17 -216 -112 281 115 95 -114 140 -137 -120 150 169 -74 82 155 -154 55 -93 -73 134 152
5801 152 -136 -305 -173 -63 -92 -15 74 -7 149 45 218 152 87 269 143 -279 -6 93 -31 114 -173 -276
5823 -276 -173 148 148 -13 -182 -89 195 -132 -43 -17 124 -162 -109 -203 3 110 -46 -145 -345 -53 -31 -17 -147
5846 -147 100 25 55 -189 131 59 121 15 -66 93 -53 -23 -13 -38 -122 201 -25 -155 -218 -62 -73 -143 21 127
5870 127 111 -191 -32 10 -340 -182 94 291 -244 -149 199 109 13 -117 65 92 111 127 -75 -90 -84 157 80 -85
5894 -85 -166 -103 23 -66 110 -62 35 -61 -13 43 -104 113 170 -135 -122 20 -166 -73 -90 87 -236 12 -79 7 -62
5919 -62 -209 176 24 176 -126 67 -9 -201 5 -18 -221 -47 300 -180 -253 239 -34 52 -163 52 -63 17
5941 17 -134 60 160 -21 -74 -118 354 -210 12 171 -252 158 -102 -136 -19 48 182 189 -66 -136 -114 111 -37
5964 -37 181 -83 239 287 21 -96 46 145 69 -81 -180 -274 -49 -86 -175 -161 -318 -292 -7 -10 -335 73 -71 144
5988 144 64 2 -32 32 -217 136 131 8 60 -10 -145 32 46 7 22 90 55 215 56 -68 17 -209 -151 126 -83
6013 -83 -109 -33 -96 212 39 -410 -101 -124 -52 -55 -160 -66 -101 9 33 -124 54 176 259 29 145 124 57 78 -276
6038 -276 -229 -132 -67 -113 117 -206 -45 120 -60 35 79 -34 -125 63 62 -182 -84 -218 34 -31 -174 -132 -29 -167
6062 -167 50 136 -58 -64 14 188 75 13 52 191 2 18 -122 119 4 48 -19 153 92 67 -55 -241 131 40
6086 40 -87 -84 -10 -125 46 -79 -177 -6 113 -231 -191 88 45 16 -59 -46 -115 -134 -192 -227 -80 87 -310 -129 -73
6111 -73 36 236 183 108 -29 130 110 47 44 -49 -105 -83 -65 13 -10 3 -60 169 133 -279 140 35 -127 9 -200
6136 -200 88 133 42 -102 -370 -107 26 4 -108 -148 105 -32 133 -189 -218 132 220 214 -133 -15 71 -9 -52 50
6160 50 120 -119 -153 -185 -103 34 -23 150 244 179 -153 -106 -50 -21 -202 1 -97 -139 -110 -187 44 -124 8 -128 -137 224
6186 224 18 199 13 197 -234 72 70 -224 -162 -57 -191 134 -131 -122 -128 262 84 -178 98 -4 -74 -33 71
6209 71 -183 -14 -71 82 3 25 -71 12 -65 161 -74 -249 -11 -135 -152 151 27 -119 -194 -109 -131 -63 -17 -46 -47
6234 -47 -82 -19 97 -82 95 -3 58 41 94 76 215 -44 42 -26 10 -88 -73 199 -32 -1 -122 -42 -155 -52 88
6259 88 88 120 -16 -137 14 96 -174 184 185 86 -46 -93 77 -29 -93 -233 -74 -205 18 111 132 115 162 120 -190
6284 -190 4 -132 -46 -85 -99 -56 -52 -16 -18 180 106 -216 -45 -33 -99 -44 -44 -28 7 -255 188 226 9 237 156 42
6310 42 3 -46 -17 223 -12 205 -77 -133 39 92 -104 197 60 127 79 -79 -102 -246 -56 -20 -147 -164 53 311
6334 311 -306 7 49 209 -25 74 80 -107 -53 -202 -171 -90 73 -68 -114 -16 30 73 40 42 12 73 -108 14 235
6359 235 140 129 132 72 -113 208 -131 -147 -157 -79 -71 -124 141 38 -89 33 55 -262 90 72 194 -246 -124 -172 169
6384 169 -110 137 202 -84 17 84 136 206 -327 108 66 -64 -88 -309 -200 16 6 85 110 -63 -75 -7 172 -166
6408 -166 -103 -115 181 -121 110 -165 55 -66 -38 -9 -50 27 22 -18 145 68 -60 28 -38 -237 40 -130 168 167 88
6433 88 250 13 -229 150 -29 82 52 26 -16 -101 -147 13 -41 -159 121 44 243 -7 -281 69 -102 -78 -41
6456 -41 -132 84 102 -53 -34 -247 49 2 -252 43 99 -93 9 116 -131 52 238 96 -18 -184 -202 312
6478 312 -144 -41 -16 59 68 102 98 -253 -1 171 -31 63 171 -133 -90 10 -59 58 -119 76 -18 213 -33 -33
6502 -33 -96 -99 -32 -157 -221 24 -61 43 190 80 217 -115 5 -146 70 14 -128 -114 6 185 -37 -35 265 136
6526 136 -81 -165 -14 -147 -40 -119 255 -25 133 195 -165 30 24 -58 26 -13 -294 -194 21 -61 -13 -20 128 -32
6550 -32 172 -14 -41 50 -136 -142 -5 -160 -122 359 -39 48 115 -125 -164 -33 -93 -124 -20 40 110 -158 -185 -64 -93
6575 -93 -42 4 -279 90 -105 -31 59 -166 -75 156 -178 164 -205 70 216 152 22 -27 28 -174 197 216 -45
6598 -45 -102 -132 -38 7 145 1 54 -1 86 64 -190 283 -42 -50 76 -27 -118 123 -357 149 3 -27 29 197 -138
6623 -138 -2 74 44 27 -131 18 115 6 -24 183 -99 182 50 -212 -92 33 -14 125 -7 13 -255 85
6645 85 244 -50 -143 -15 -145 55 -122 43 -114 -223 207 142 -211 174 85 -75 -84 -92 51 -18 -71 162 -251
6668 -251 -158 -26 26 -12 162 -195 178 15 335 -28 65 -135 171 0 31 32 125 -227 -93 211 69 -160 14
6691 14 23 174 133 221 222 -90 183 203 245 -37 -23 -16 21 229 166 -101 152 157 -194 223 281 -35 145 -234 61 -185
6717 -185 17 -265 99 272 -41 65 -79 30 105 30 58 -14 29 -69 3 125 -70 100 48 -2 84 59 -2 60
6741 60 -163 -38 44 249 -204 55 -194 -278 -156 -65 -289 81 108 -222 -80 265 284 -292 148 -174 -89 283
6763 283 95 48 99 58 -72 -4 -86 216 20 -40 -47 8 -73 71 46 132 100 43 -63 -37 96 40 177 -339 108
6788 108 54 254 329 -25 -60 16 -259 -263 -91 -86 120 -14 -147 -7 -158 -148 -26 -44 34 -113 45 -94 -83 85
6812 85 7 -149 105 -134 -104 -136 169 94 99 55 119 -112 21 230 62 53 201 -7 57 -163 -110 174 -78 -364
6836 -364 75 89 -91 107 -51 24 7 101 27 -191 -40 -105 34 -113 -69 21 3 166 98 -91 -21 204 -92 -214
6860 -214 -175 -32 -24 326 -25 102 179 60 54 127 128 -138 221 117 105 -93 -7 -42 -66 165 10 -152 166 4
6884 4 -10 159 25 146 -136 -77 143 -8 211 -229 95 -68 -83 25 75 -101 223 -253 -121 -14 181 -55
6906 -55 -25 -15 -47 38 -2 47 -269 -176 -134 -61 54 217 57 39 0 20 156 24 27 68 64 29 172 -159 115 -54
6932 -54 -159 12 162 -175 -265 105 189 -21 187 50 -10 -156 -25 -9 126 44 51 -114 -277 -84 -116 63 -67
6955 -67 -159 74 -13 -30 87 15 -82 -254 -160 -223 -122 65 -57 274 116 85 -174 0 4 25 -21 -82 -95 21 -38
6980 -38 -204 184 98 -45 -65 -39 67 134 -99 32 59 15 -248 -83 -91 156 275 -139 -69 -53 -130 -35 -56 50 111
7005 111 96 69 103 153 54 -225 72 54 199 100 3 -43 -128 78 -201 -283 -468 -1 233 66 -265 140 125 214
7029 214 -115 -51 -33 -37 -42 -97 -180 99 -88 -11 -68 286 150 82 31 -62 -96 184 -93 -98 -131 -64 137 167 230 -8 -38
7056 -38 56 109 47 -124 -20 71 127 -56 -139 127 -163 241 -43 -13 -60 -15 -222 -27 -65 114 -106 271 6 19
7080 19 153 47 -109 2 27 99 -150 11 36 -80 -26 -91 -14 -395 139 -146 -33 184 49 53 136 -176 -100 -137
7104 -137 87 -242 42 188 -86 178 29 109 -2 -172 15 76 37 104 28 22 -187 -21 -144 -28 -232 64
7126 64 115 17 -60 -131 -109 30 0 86 -71 220 227 -195 108 -19 -58 -23 64 -46 -93 -72 -367 154 218 -361 71
7151 71 -55 -228 -50 -24 -324 -75 114 -169 -122 -264 310 38 -335 54 102 27 65 -56 -40 193 -11 64 -21
7174 -21 -178 328 -4 -101 -80 -67 85 -241 73 -43 408 2 -84 -47 -25 34 -21 -99 -72 -129 -202 -41 -50 -79 -44 57
7200 57 -33 40 35 50 104 97 -293 -82 236 91 -163 -128 -82 116 142 41 -55 -19 -70 -212 -48 -162 47 -160 -293
7225 -293 -1 -85 16 -24 84 -49 143 19 -111 -49 -131 -122 6 -33 42 -24 76 -70 89 -239 -78 190 55
7248 55 318 110 166 -162 100 -126 224 79 99 4 90 -270 133 -113 -134 54 255 143 146 -103 -28 156 -74
7271 -74 208 -31 -20 66 248 -54 85 -175 -321 -36 -267 -241 -50 -80 -34 -4 -46 -5 -138 142 35 0 -123
7294 -123 226 221 -174 89 -89 -56 52 -23 98 -173 19 -140 -127 -59 170 156 136 39 148 -131 188 -29 -223
7317 -223 -237 -71 61 129 -83 -39 49 -91 -90 -137 105 6 108 -44 -99 39 -35 43 244 -83 -43 -80 -264 -75
7341 -75 -220 232 -122 20 275 -77 31 -140 269 234 78 6 -131 185 105 240 71 -38 57 -73 -95 -61
7363 -61 -113 105 -54 -209 117 -97 -137 81 -103 -15 15 7 -136 -78 202 123 87 -52 -66 -162 58 74 180 -76
7387 -76 -159 10 131 172 190 -102 -180 213 54 -162 65 68 -84 16 9 44 119 48 3 -79 8 4 -198 -177 -199 139
7413 139 -25 -267 -110 72 47 -8 77 -197 -59 -75 51 74 -31 144 42 80 -68 -24 103 157 -98 -112 -28
7436 -28 -12 -264 54 -86 120 58 -105 92 129 -196 7 -76 222 332 -14 -31 -79 130 59 210 62 -30 32
7459 32 253 -31 -40 -131 126 -7 110 46 -365 9 136 -60 -38 -1 134 -239 31 31 213 147 314 37 233
7482 233 162 -220 35 90 98 32 109 35 -31 -92 1 -78 -24 -26 328 58 155 -187 17 159 -6 -213 28 -39 136
7507 136 5 267 15 -341 -51 -52 204 -24 -163 155 -92 34 -60 -84 -185 -37 242 -24 -221 153 -169
7528 -169 -185 -177 29 28 -105 -167 122 107 -39 -73 77 -93 41 224 -48 56 72 -54 -195 34 -67 105 32
7551 32 -45 -153 -97 -44 277 -43 97 -1 -101 -66 -118 -116 71 187 -34 -312 -64 -240 -377 192 151 329 -253
7574 -253 -45 84 58 -52 -15 27 -242 -6 129 -4 38 275 105 -238 -116 284 141 113 77 -166 205 -181
7596 -181 65 -9 9 -134 174 -79 169 181 -25 -121 -190 181 -192 -150 -64 -23 -100 7 79 -249 -140 -143 -282 109
7620 109 -112 -203 49 102 -8 6 7 104 209 28 14 -39 -212 186 -37 -38 197 105 -198 -123 -38 19 3 109 -200
7645 -200 -104 -312 -214 20 157 -276 -128 23 -402 60 127 131 172 -154 -71 -82 -197 155 -218 91 158 -232 -275
7668 -275 150 209 -53 38 108 -146 94 -72 -97 164 -44 339 112 54 -108 18 64 222 40 121 -114 -126 -122
7691 -122 -18 81 114 -132 45 72 -281 -157 -124 -30 183 29 115 -79 -73 160 -178 69 -5 78 49 -48 151 -136
7715 -136 -76 -37 158 106 -89 196 26 -149 -86 -63 144 -92 38 -64 -43 35 -11 35 -31 87 31 43 57 -33 -56
7740 -56 263 -73 101 40 -259 -96 3 195 47 -309 -117 49 84 82 -136 -102 185 -263 -43 30 -153 48 151
7763 151 97 77 40 179 49 203 176 26 293 -165 39 0 -38 -129 26 -33 -51 63 -122 -84 -134 74 -18 -176
7787 -176 -36 -76 151 116 124 124 -68 -203 81 148 -71 150 83 73 -30 186 146 -74 -133 -67 -10 -123 71 -161
7811 -161 -56 134 -67 -107 -34 83 80 -103 365 55 15 7 -30 51 -159 -68 -12 147 13 -46 -253 47 213 -13
7835 -13 -27 84 -84 -4 -30 67 -58 -324 126 -45 -44 179 -169 -52 81 118 97 16 121 -209 -41 94 2 -233
7859 -233 -30 150 11 -39 -59 117 3 -105 -189 -33 117 -26 -163 256 -72 -61 -15 330 -67 100 -194 210
7881 210 108 -148 417 -64 71 109 -11 35 -165 20 219 -35 -25 43 182 315 68 5 -42 -112 167 79 188
7904 188 -49 -62 -163 116 27 77 341 214 -224 170 66 -25 -72 -83 131 -50 -15 -106 -10 194 -100 163 142
7927 142 76 -97 -303 -230 185 -50 64 -28 -231 -55 224 -120 126 143 124 50 35 9 86 23 27 -118 -57 -132 31
7952 31 -62 22 -158 -92 -5 92 55 24 -43 -105 72 171 133 199 -21 -173 35 -70 90 -279 -169 32 102 -86 -144
7977 -144 154 -308 183 -80 -166 7 -170 -226 121 -167 -69 206 71 -140 -93 -179 89 52 298 -42 92 -92
7999 -92 216 -70 -214 31 -77 -90 -131 237 -77 -30 -48 112 -207 118 53 4 187 -139 118 401 -216 -26
8021 -26 -126 -3 -150 -76 -119 182 -64 162 186 -100 -165 -44 142 105 -50 -86 -32 -34 -9 136 -41 -73 -190 -19
8045 -19 -17 -265 -154 189 167 142 52 133 -29 -170 -18 -40 138 34 -200 -108 30 -21 92 266 111 75 189 5
8069 5 -122 -280 -51 -161 134 -14 128 60 13 45 74 6 142 158 -207 -50 -128 -91 -263 324 -74 -48 -53 96
8093 96 52 -12 -91 32 -95 -164 186 -116 -62 130 -46 -35 -35 -142 -235 173 112 -251 86 -117 -13 -259 186 -70
8117 -70 49 90 -230 249 129 128 194 -261 -58 136 -99 -195 55 -197 30 -85 159 -78 89 158 -185 23
8139 23 -198 118 -282 -14 -156 107 108 -147 120 -74 -246 -135 -39 -100 12 -28 179 90 -42 27 -108 24 -40
8162 -40 163 -64 147 68 -164 29 -162 3 -33 35 86 191 -238 108 -317 -100 -6 -105 18 161 -62 -11 210
8185 210 126 269 -129 -147 82 149
8191A49
##END NTUPLES=NMR FID
##END=
