##TITLE=1H_K-411/2_2
 CDCl3, 8 sc, 
 9.06.2021
##JCAMPDX= 6.0         $$ Bruker NMR JCAMP-DX V2.0
##DATA TYPE= NMR FID
##DATA CLASS= NTUPLES
##ORIGIN= UXNMR, Bruker Analytische Messtechnik GmbH
##OWNER= root
$$ XWIN-NMR		Version 3.5
$$ Wed Jun  9 12:52:14 2021 Russian Standard Time (UT+4h)  she@DPX200
##.OBSERVE FREQUENCY= 200.131506
##.OBSERVE NUCLEUS= ^1H
##.DELAY= (6, 6)
##.ACQUISITION MODE= SIMULTANEOUS
##.ACQUISITION SCHEME= undefined
##.AVERAGES= 8
##.DIGITISER RES= 18
##SPECTROMETER/DATA SYSTEM= spect
##.PULSE SEQUENCE= zg30
##.SOLVENT NAME= CDCl3
##.SHIFT REFERENCE= (INTERNAL, CDCl3, 0, 15.7039)
##AUDIT TRAIL= $$ (NUMBER, WHEN, WHO, WHERE, WHAT)
$$ ##TITLE= Audit trail, XWIN-NMR		Version 3.5
$$ ##JCAMPDX= 5.01
$$ ##ORIGIN= Bruker BioSpin GmbH
$$ ##OWNER= she
$$ F:/spectra/data/she/nmr/H-F/1/audita.txt
$$ ##AUDIT TRAIL=  $$ (NUMBER, WHEN, WHO, WHERE, WHAT)
(   1,<2021-06-09 12:50:48.48 +0400>,<she>,<DPX200>,
      <created by zg, POWCHK disabled, PULCHK disabled
       configuration hash MD5:
       00 E9 B6 7A A2 85 ED C7 34 08 36 98 17 FE 4E 26
       data hash MD5: 16K
       28 DF C0 CF 83 5E 86 2B 95 26 39 3A 6D 3C 91 82>)
$$ ##END=
$$ 
$$ hash MD5
$$ B3 DB 0F 6C 92 37 77 47 44 D8 54 D6 3D 69 85 94
##$RELAX= 
##$RELAX= 
##$RELAX= 
##$RELAX= 
##$RELAX= 
##$RELAX= 
$$ Bruker specific parameters
$$ --------------------------
##$DU= <F:/spectra>
##$EXPNO= 1
##$NAME= <H-F>
##$PROCNO= 1
##$TYPE= <nmr>
##$USER= <she>
##$AMP= (0..31)
100 100 100 100 100 100 100 100 100 100 100 100 100 100 100 100 100 100 
100 100 100 100 100 100 100 100 100 100 100 100 100 100 
##$AQSEQ= 0
##$AQ_mod= 1
##$AUNM= <au_zg>
##$AUTOPOS= <>
##$BF1= 200.13
##$BF2= 200.13
##$BF3= 200.13
##$BF4= 200.13
##$BF5= 200.13
##$BF6= 200.13
##$BF7= 200.13
##$BF8= 200.13
##$BYTORDA= 1
##$CFDGTYP= 0
##$CFRGTYP= 5
##$CHEMSTR= <none>
##$CNST= (0..31)
1 1 145 1 1 1 1 1 1 1 1 1 1 1 1 1 1 1 1 1 1 1 1 1 1 1 1 1 1 1 1 1 
##$CPDPRG= <>
##$CPDPRG1= <>
##$CPDPRG2= <>
##$CPDPRG3= <>
##$CPDPRG4= <mlev>
##$CPDPRG5= <mlev>
##$CPDPRG6= <mlev>
##$CPDPRG7= <mlev>
##$CPDPRG8= <mlev>
##$CPDPRGB= <>
##$CPDPRGT= <>
##$D= (0..31)
0 1.2 0 0 0 0 0 0 0 0.06 0 0.03 0 0 0 0 0.0002 0 0 0 0 0 0 0 0 0 0 0 0 
0 0 0 
##$DATE= 1623228647
##$DBL= (0..7)
120 120 120 120 120 120 120 120 
##$DBP= (0..7)
150 150 150 150 150 150 150 150 
##$DBP07= 0
##$DBPNAM0= <>
##$DBPNAM1= <>
##$DBPNAM2= <>
##$DBPNAM3= <>
##$DBPNAM4= <>
##$DBPNAM5= <>
##$DBPNAM6= <>
##$DBPNAM7= <>
##$DBPOAL= (0..7)
0.5 0.5 0.5 0.5 0.5 0.5 0.5 0.5 
##$DBPOFFS= (0..7)
0 0 0 0 0 0 0 0 
##$DE= 6
##$DECBNUC= <off>
##$DECIM= 32
##$DECNUC= <off>
##$DECSTAT= 4
##$DIGMOD= 1
##$DIGTYP= 9
##$DL= (0..7)
0 120 120 120 120 120 120 120 
##$DP= (0..7)
150 150 150 150 150 150 150 150 
##$DP07= 0
##$DPNAME0= <>
##$DPNAME1= <>
##$DPNAME2= <>
##$DPNAME3= <>
##$DPNAME4= <>
##$DPNAME5= <>
##$DPNAME6= <>
##$DPNAME7= <>
##$DPOAL= (0..7)
0.5 0.5 0.5 0.5 0.5 0.5 0.5 0.5 
##$DPOFFS= (0..7)
0 0 0 0 0 0 0 0 
##$DQDMODE= 0
##$DR= 18
##$DS= 0
##$DSLIST= <SSSSSSSSSSSSSSS>
$$ [...]
##$SUBNAM2= <"">
##$SUBNAM3= <"">
##$SUBNAM4= <"">
##$SUBNAM5= <"">
##$SUBNAM6= <"">
##$SUBNAM7= <"">
##$SUBNAM8= <"">
##$SUBNAM9= <"">
##$SW= 20.0188882624521
##$SWIBOX= (0..15)
0 0 2 0 0 0 0 0 0 0 0 0 0 0 0 0 
##$SW_h= 4006.41025641026
##$TD= 16384
##$TD0= 1
##$TE= 0
##$TE2= 300
##$TE3= 300
##$TEG= 300
##$TL= (0..7)
0 120 120 120 120 120 120 120 
##$TP= (0..7)
150 150 150 150 150 150 150 150 
##$TP07= 0
##$TPNAME0= <>
##$TPNAME1= <>
##$TPNAME2= <>
##$TPNAME3= <>
##$TPNAME4= <>
##$TPNAME5= <>
##$TPNAME6= <>
##$TPNAME7= <>
##$TPOAL= (0..7)
0.5 0.5 0.5 0.5 0.5 0.5 0.5 0.5 
##$TPOFFS= (0..7)
0 0 0 0 0 0 0 0 
##$TUNHIN= 0
##$TUNHOUT= 0
##$TUNXOUT= 0
##$USERA1= <user>
##$USERA2= <user>
##$USERA3= <user>
##$USERA4= <user>
##$USERA5= <user>
##$V9= 5
##$VALIST= <valist>
##$VCLIST= <CCCCCCCCCCCCCCC>
##$VD= 0
##$VDLIST= <DDDDDDDDDDDDDDD>
##$VPLIST= <PPPPPPPPPPPPPPP>
##$VTLIST= <TTTTTTTTTTTTTTT>
##$WBST= 1024
##$WBSW= 4
##$XGAIN= (0..3)
0 0 0 0 
##$XL= 0
##$YL= 0
##$YMAX_a= 187403
##$YMIN_a= -29896
##$ZGOPTNS= <>
##$ZL1= 120
##$ZL2= 120
##$ZL3= 120
##$ZL4= 120
##$ABSF1= 10
##$ABSF2= 0
##$ABSG= 5
##$ABSL= 3
##$ALPHA= 0
##$AQORDER= 0
##$ASSFAC= 0
##$ASSFACI= 0
##$ASSFACX= 0
##$ASSWID= 0
##$AUNMP= <proc_1d>
##$AZFE= 0.1
##$AZFW= 0.1
##$BCFW= 1
##$BC_mod= 2
##$BYTORDP= 1
##$COROFFS= 0
##$CY= 11.3945322036743
##$DATMOD= 1
##$DC= 2
##$DFILT= <>
##$DTYPP= 0
##$F1P= 15.9154993809931
##$F2P= -4.1035820241983
##$FCOR= 0.5
##$FTSIZE= 0
##$FT_mod= 4
##$GAMMA= 1
##$GB= 0.15
##$INTBC= 1
##$INTSCL= 1
##$ISEN= 128
##$LB= 0.24
##$LEV0= 0
##$LPBIN= 0
##$MAXI= 10000
##$MC2= 0
##$MEAN= 0
##$ME_mod= 0
##$MI= 1.114404
##$NCOEF= 0
##$NC_proc= 0
##$NLEV= 6
##$NOISF1= 3.799351
##$NOISF2= 2.8
##$NSP= 1
##$NTH_PI= 0
##$NZP= 0
##$OFFSET= 15.70392
##$PC= 1
##$PHC0= -11491.52
##$PHC1= 19.20101
##$PH_mod= 1
##$PKNL= yes
##$PPARMOD= 0
##$PSCAL= 0
##$PSIGN= 0
##$REVERSE= no
##$SF= 200.130013532006
##$SI= 16384
##$SIGF1= 3
##$SIGF2= 2
##$SINO= 400
##$SIOLD= 16384
##$SREGLST= <1H.CDCl3>
##$SSB= 0
##$STSI= 0
##$STSR= 0
##$SW_p= 3612.71676300578
##$SYMM= 0
##$S_DEV= 0
##$TDeff= 0
##$TDoff= 0
##$TI= <>
##$TILT= no
##$TM1= 0
##$TM2= 0
##$TOPLEV= 0
##$USERP1= <user>
##$USERP2= <user>
##$USERP3= <user>
##$USERP4= <user>
##$USERP5= <user>
##$WDW= 1
##$XDIM= 8192
##$YMAX_p= 0
##$YMIN_p= 0
$$ End of Bruker specific parameters
$$ ---------------------------------
##NTUPLES= NMR FID
##VAR_NAME=  TIME,          FID/REAL,        FID/IMAG
##SYMBOL=    X,             R,               I
##VAR_TYPE=  INDEPENDENT,   DEPENDENT,       DEPENDENT
##VAR_FORM=  AFFN,          ASDF,            ASDF
##VAR_DIM=   8192,          8192,            8192
##UNITS=     SECONDS,       ARBITRARY UNITS, ARBITRARY UNITS
##FACTOR=    0.0002496,     1,               1
##FIRST=     0,             0,               0
##LAST=      2.0444736,     0,               0
##MIN=       0,             -29896,          0
##MAX=       2.0444736,     187403,          0
$$ Real data points
##PAGE= N=1
##DATA TABLE= (X++(R..R)), XYDATA
$$ [...]
1870b90K20k76k47N64k88K9N26j29L27j4k10L28m16K01k58j75l77K19j60j91l9
1891f56O23j80j33L24j7j90K59j08k27k71j23J1j91K38kJ81L00j54m6N84l01m0
1913a19j2j21J97j71j17K5Q1j8K62J52k94M43m1K06j89r2j44P2m49J89j86L34
1935Hk50j19N43q7L55K00m07L50m58j09M11l87j27K13J37j53J19mM07l07O9J79
1957E83k88K33l75n5j8l34k59P1j9L24j7k46L84J39j81L14n41K27k45j43J86q0
1979c40J19m2RJ85M26l26J27M02j23j75l36k3L4M0n07K6j3O0n7J90k3J74K43O5
2003A35o1J65k73J94m01l6L09l03n3N37Nj22N92l19Q2o3o5J01k40j84J5k68J53
2026a00m6l9j0j22M07q0J7K11l07m12N17m97jJ45k4R7K24NN96l39J25J81k06N0
$$ y = [-290, -70, -346, -593, -29, -317, -288, 238, 109, 436, 422, 212, 540, 124, 325, 67, -108, -485, -266, -426, -617, -656, -33, -213, -346, -22, -39, -229, 30, -78, -305, -576, -699, -688, -879, -641, -643, -462, -162, -316, -362, 222, -79, -119, -131, -252, -55, -226, -343, -318, -237, -255, 7, 159, -135, 308, 267, 473, 284, 192, 48, 120, -329, -140, -326, 8, -242, -361, 182, 95, 450, 650, 243, 593, 135, 26, 437, 50, -77, 136, 273, 120, 239, 235, 642, 335, 404, 583, 295, 528, 153, 98, 80, -254, -513, -442, -461, -137, -154, -400, -16, 123, -58, 256, -285, -58, -303, -446, -260, -340, -221, -263, -254, -69, 357, 31, 158, 560, 437, 262, -74, -97, -63, -23, -530, -504, -517, -457, -514, -324, -347, -173, 70, 135, 74, 239, -34, 160, -241, -277, 32, -271, -324, 213, 218, 96, 688, 369, 451, 388, 323, 424, 184, 0, 15, -253, -100, -146, -185, -195, -317, 90, 10, 27, 238, -69, -481, 36, -461, -462, -317, -341, -244, -20, -15, 581, 242, 367, 548, 342, 392]
2050C92j29l12L37k85k54K73l71K95J40lrL24k93K8j10K48m59j87L99l72J30k23
2072d41L33N8J07k04M17l54M27N5l81l7K27j70mK4m4J5l12L21j8r9K37L3J31n00
2096a79kJ95r1k02L14l95J74K75L7L84k00Q4j0L15K2r4r7j14j72Q2K4J54J27Q0
2120G11J41n7J95m31J50K63j47k11l00J16j53o8j71K78j51L51m3l1J93k55R8J55
2142F33l63K84l45K56k26j14K43l13K92J35l61J94L70p47K85k03j57Q3k56K55
2162e5rl10L88q7P2J19J1M7J27l93J64j93k86M25j73L0Q7l82L28j2j27K01O1l7
2186dL8l85Q9l85P8K27l65j69P1J90J72N0Q8K78m24K51j78m77J64L13k77J66k05
2209f94K73J92k49J98j37j28K24j94n0J32k26k7j28J08n4J37j11k8j3L51k53j38
$$ y = [392, 263, -49, 288, 3, -251, 22, -349, -54, 86, 83, 74, 398, 105, 133, 23, 271, -188, -375, 24, -348, -218, -441, -108, -50, 57, -147, 270, -84, 343, 398, 17, -20, 207, 37, 33, 57, 13, 28, -284, 37, 19, -80, 157, 190, 321, -179, -181, 14, -77, -279, 35, -360, -186, 89, 126, 510, 310, 394, 384, 699, 721, 627, 530, 416, 244, 326, 350, 504, 631, 711, 852, 795, 990, 559, 709, 972, 825, 614, 314, 430, 277, 209, 38, 316, 165, 516, 473, 442, 635, 380, 478, 633, 270, 554, 209, 465, 239, 125, 368, 55, 347, 482, 121, 315, 685, -62, 223, 20, -137, -54, -310, -55, -64, -374, 14, -73, -1, 118, 129, 176, 303, -90, 74, -119, -405, 20, -153, -123, -36, -418, -90, -102, -229, -28, 33, -4, 34, -351, -262, -647, -569, -342, -707, -876, -805, -615, -443, -393, -305, -27, -451, -200, -378, -855, -691, -378, -655, -489, -694, -421, -229, -478, -280, -417, -545, -321, -515, -565, -433, -659, -686, -814, -706, -760, -623, -734, -762, -775, -424, -677, -815]
2231h15L20j08o1J01n37N3J84J79p7K65J7L8j55J59L05k02L00k28l11r5j39J82
2253f25k92J32K0q9K81k3oJ21j0j73J65J72k71j67k77J96N62n23M18r6J20P1j47
2276d41Rm6JJ30l24J31M0r6J01r8Q4j22K67kj19J26J63j77l64L50l84M35J13m39
2300f62K80n2J09K54J91o6J63l21K62j75j26o7o1K10l28K86L4l1l7N5j58K60J65
2323A85m52J58j9m78K69J67l9J02j41k3L07k10M32l57J13K83j86j42J24j88K51
2344A56l26L85J0l30K30Lk58K98Ql84K54l00J1K47m20j68J78M7j29M65j94k00
2366d17P3L75k46K33K37m44l3L22k94N73k46k94L61l02k48N81r2k0j70K90k82
2387d3k60L06k2j58J23K31J7R9l99L83k2r0K27k29l19J98m0P9K7J43m6J9l3J28
$$ y = [-815, -495, -603, -664, -563, -1100, -1047, -863, -684, -761, -496, -479, -441, -596, -437, -132, -334, -34, -262, -573, -668, -807, -625, -917, -785, -765, -854, -573, -596, -602, -481, -491, -664, -499, -327, -598, -765, -1042, -846, -284, -807, -389, -485, -365, -294, -441, -432, -478, -477, -347, -671, -540, -500, -596, -495, -593, -509, -631, -364, -366, -485, -359, -196, -373, -737, -387, -771, -336, -223, -662, -382, -434, -325, -71, 120, 54, 217, -104, 158, -17, -143, -210, -271, -61, -389, -103, -69, -100, -137, -82, -240, 20, 185, -267, -109, -128, -606, -337, -170, -209, -107, -248, -271, 36, -174, 258, -99, 14, 297, 111, -31, 93, -95, 156, -170, 215, 225, -105, 125, 128, -130, 168, 176, -208, 46, -254, -243, 4, -416, -584, -406, -359, -488, -23, -217, -417, -344, 31, -215, 18, 255, -189, -222, 100, -194, 379, 133, -161, 200, -102, -350, 231, 139, 119, -51, 239, -43, -303, 3, -19, -177, -54, 177, 194, 293, -106, 277, 255, 165, 392, 163, -156, 42, 2, 81, 108, 251, 205, 224, 191, 319]
2411C19j41L09k96O1k83K32k96M11n15J40N4k82N79n27L55q8J98j16L62l33K43
2432C86k51o8K12j46J15r2k54J71J71j48J03l5K50k85k34M00k80l52K15k56K38
2453a40L23k55J26J6k22K62j38k0J19l82R9j64J37K43l65L51p9J59J97k65p6M08
2475C34l79J34J38N9n80n0K18J34l66l6K97Q4J67k3j25J97K0k84J29j31j07M41
2497B71j92j54J53O3J58l66K25K55k8n6M4L3m41K06K94l32k0J85r9k00p4L3R4
2520E2K65k72N1R6j87J93n84N47m2j75Q1L47q4on0j13k31K89K4m30O1M0k19J82
2544a65Pl0J84J27k12O3k96K68m3j19K00l69k3K3N4N4mJ38l3P5k94K14k2o7N75
2569C05k74j00J63j1M5k37K4J77j89J96j17J87p8k61L48j45J07j32j23k9J93n2
$$ y = [319, 178, 487, 191, 252, -31, 201, -95, 316, -199, -59, -5, -287, 292, -235, 120, 32, 230, 114, 476, 143, 386, 135, 67, 279, 133, 248, 156, -98, 73, 244, 96, 199, 164, 414, 129, -105, 295, 15, -337, -122, -378, -140, 183, -72, 54, 70, -152, 110, -28, -48, 71, -311, -212, -376, -239, 4, -361, -10, -89, 70, 267, 2, -74, 334, -45, 89, 227, 286, -294, -344, -126, 8, -358, -394, -97, -13, 154, 131, 6, 203, 223, -61, 68, -63, -170, 271, 79, -75, 78, 141, 299, -67, 158, 413, 385, 329, 373, 406, -35, 171, 465, 133, 113, 298, 199, -1, -75, -42, 52, 317, 45, 96, 192, 5, 198, -386, 161, 119, -56, 25, 372, 288, 282, 232, 119, -112, 177, 201, -229, -168, -128, -347, -165, -158, -188, -4, 123, -89, -26, -322, -54, -97, -216, -16, -385, -408, -385, -331, -277, -281, -143, -176, -101, -395, -181, -203, -270, 305, 31, -69, 94, 83, 128, -109, -85, 92, -97, 99, -18, 169, 91, -170, 178, 33, 140, 8, -115, -144, 49, -3]
2591cj51rp3l6J08P8l2k05J23j4O8Q5j54KJ98k9J55J33j04k24J50l21J22j73J27
2616a79N0J24j4j74K9J98q9J48O6k97L10k31j83O12m62j40K36n06L23J29l6q3
2638a69R5j01J26j8o8j90r8K3M3J15J25j39Q8J37k59K94k52L1J24K35j86j27J84
2661A3j26M8J3L05l47J59J60j24O2p1j94K97N0j38M1l17K17o5o7M4M2j7K14k82
2685h3L75k22Qj80l4L03j10m57K14L09Q9PJ38l10M6K0J66j24P1lj35J70k07j02
2709e1J80K16k69J22n9j9K95k56J70j55p8Rk59L11l81RM10l47p7M56k22k20J53
2732f2r1J12J46k05Oj97P1J97j82K18k23K57j65q0M69k69K09r6j62J09L39m16
2754a5N6pk3J4K10J5q8j68R9l8l8R7k50O2J40k35J63M2k21K51l06M74q2J13l61
$$ y = [-3, -154, -163, -236, -272, -164, -86, -118, -323, -200, -214, -146, -61, -215, -213, -15, -44, 111, 244, 140, -84, 66, -255, -133, -306, -179, -129, -5, -19, -193, -164, 34, -55, 93, 159, -138, 172, -59, -242, 370, -92, -232, 4, -502, -179, -50, -86, -169, -74, -175, -49, -67, -135, -325, -423, -400, -357, -242, -117, -256, -168, -31, -290, 4, -248, -217, -93, 142, -44, -171, 13, -113, -65, -52, 253, -94, 65, 225, 101, 163, 92, -102, 195, 245, 107, 148, -169, 48, -17, -84, -40, 2, -15, 199, -83, 292, 70, 78, -102, -136, 167, 57, -400, -186, 123, 212, 219, 357, 47, 93, 113, 279, 155, 226, 223, 88, 258, 51, -51, 129, 345, 76, 198, 139, 120, 415, 159, 329, 174, 96, 105, -154, 157, -224, -215, 195, -152, -229, 227, 5, -215, -62, -153, -41, 105, -100, -94, -291, -220, -23, -205, 13, -210, 47, -118, -198, 271, 2, 211, 115, -47, 62, 401, -15, 41, 34, 11, 25, 235, 250, 162, -6, 93, 55, 17, 114, -136, -74, 66, -169, -6, 36, -185, 66, -240, 234, 152, 265, -96]
2779i6K53m53L36n3L3m8J30J19O0k83K88J73k82Lk6L69l68j94J28Qj97J91O3R8
2803B52M6l47p5J01J35j72j74J36K99j31P1k75K54K28l72K05l3j05J30Q8%k30
2825C1l9R6k2k37K70M3l00J29R6R0Km6n8M9J4J51k84J73p9j25N3J89j35J49l03
2850i3J87K60k80J43q1K28j79j77J24R3j35j17K32j94j08L51l2p6O3q8j80K60
2872B01j51J27j25M5l93J33J92j15K51j56J61l1j29Q9lJ54j24k55J7K11k2j6Q2
2895A43j09j15J64J01p8K2Q8l88K01j8Pk67J89R9j20K12j44L7j11Q9J17j14r4
2918h9K01k6j3k84K12J1Q1n7J88j65k4J60k30M37o00L09k09J57m2m3Q9q0o2L55
2942B76k34j39K73j94Q2k41K2J21K40j29J66l54N6n2P8J12L5k04M47m65j0K36
$$ y = [-96, 157, -296, 40, -13, 20, -28, 102, 221, 281, -2, 286, 459, 177, 180, 154, 523, 155, -39, 89, 97, -100, 91, 154, 252, 298, -49, -124, -23, 112, -60, -234, -98, 201, 70, 141, -134, 120, 348, -24, 181, 148, 43, 173, 261, 261, 31, -8, 88, 66, -171, 99, 142, -158, -29, 67, 157, 159, 113, 55, 104, 118, 269, -15, 158, 79, -46, 7, 196, 61, 210, -93, 94, 354, 74, 217, 136, 364, 185, 8, 132, 225, 90, -27, 205, 11, -97, 254, 222, 146, 209, 121, -59, 201, 50, 177, 52, 97, -296, -163, 29, -86, 165, 9, 170, 139, 10, 99, 96, 250, 126, -129, -112, 99, 77, 61, 143, 34, -81, 83, 184, 106, 128, 216, -172, 29, 11, 18, -249, -60, 39, -81, 131, -13, 24, -87, 2, 119, 5, -89, 112, 86, 73, -211, 1, 12, 93, 36, 224, 59, 35, 195, -35, 402, -198, 111, -98, 59, 17, -26, 63, -17, -79, 276, 42, -97, 176, -18, 64, -177, -155, -34, 206, 77, 243, -111, -55, -107, -29, 83, 118, -86, 361, -104, -114, 122]
2964A22j06J61j17k1j65N5J98R4k81J73Rj48M57o29M24j78J10q6p1q4J00P6k6
2987F7j8k3J74K22p6O4l39j45j5J16j40K9K12k45J31jJ44j11O8j19q6N9p7J66
3011E7j06Q0j88J49J47L2j91j52L14j02J04n1J27k72P7j57M91j42p5o5L8K4M2
3034A81j07o4q1J91j03j67J27K15j60p5L7j51J22J91jk17o7K60J23l18J07r2l34
3057c83K66K22l03K73j50P2J42p2Lj22J85j48J43j81k12J97k1k50M33j97k5K72
3079A44j45R7j51k2m2J62j95L04k86N3K42j91k1m2K2J64j43K01R3j12j32K29j13
3102A16K3j37k43J03J30N4j80K84j69J76j57J32j72J65k41K46j10m4%K10N0R2
3124C28k28K3Q8j5j02l2K07p7k09j06J05J76j15l0J23k2J25l66K56p1J4n3r6j62
$$ y = [122, 16, 177, 60, 39, -126, -71, 127, 221, -60, 113, 122, -26, 431, -198, 226, 48, 158, 72, 1, -83, 17, 93, 67, 49, 26, 200, 422, 346, 410, 71, -74, -89, 27, -113, -84, 128, -117, 14, 13, 157, 46, 114, -5, -91, -32, -109, 57, -49, 31, -157, -8, 139, 171, -20, -172, 142, 40, 144, 93, 220, -52, 25, -132, 359, 217, 142, 77, 115, 139, 181, 74, 10, -71, 120, 17, -150, -23, 192, 32, -43, -6, -157, -35, 156, 155, -62, -129, 131, 254, -64, 43, -49, -383, -117, 105, -198, 75, -75, -3, 139, 67, 70, -52, 133, -15, 128, -53, -265, -68, -89, -339, 94, -103, -128, 144, -1, 96, -55, -77, -119, 43, -152, 152, -134, -81, 161, -30, -51, -93, -71, 93, -50, 151, 244, 132, 0, 229, 116, 139, 2, -241, -138, -8, 46, -134, 150, -19, 157, 0, 132, -40, 125, -116, 130, 20, -24, -24, 186, 236, 328, 100, 123, 211, 196, 94, 62, 269, 192, -17, -123, -18, 158, 43, 13, 136, 114, 239, -127, 129, 58, 72, 19, -77, -239]
3148b39J57o6N1Ml0J53N6m3k33j5JQJ17P0l03J76o1L7j66Q1O1K13Q5l15o3L02
3174C8j2j38J42K70q8k07j13K35K00m41L30k7n13M09K02k21J14l66J94m6o6N5
3196d9J74p9j19K41l00J20J59j19K34l21Q4L00j95j08J11L6k5J79k95K7J58k9
3218A84j0m2m5j55K04J90Q1m17J70J36k40K34P7j65j26P5l08K30k45J25k1M4p4
3241i8r9O6K9K24j66N3N0j48K01j35n0M01n95Q3Q5J34R8o5j40K38j66K61k01k05
3265a45J30l4L24l3k80J67Pj05J56j31K20j16n2R8J70k70l5r4P2J49l12K69k70
3288a15J37r9K95k20R5K48j17k97L70k58J38n2n4O7R6p1J5m0j22NL57j54j32R6
3312A88J32j42l68K24K00j17J80j67k77K04J29j38J53k89j22J32J53l1k79J32
$$ y = [-239, -82, -148, -97, -93, -123, 30, 86, 43, -190, -205, -204, -196, -79, -9, -312, -136, -197, -160, -326, -245, -184, 29, 114, -201, -264, 38, 26, -112, 30, 300, 212, 5, -108, 127, 327, -114, 216, 189, -324, 85, 287, 66, 180, -186, 8, -38, -104, -49, 125, 46, -73, 168, -132, -12, 147, 28, 262, -59, 25, 325, 130, 22, 133, 169, 144, 323, 28, 55, 213, 184, 174, 132, 87, -68, 136, 326, 407, -10, 160, 296, 56, 290, 367, 202, 76, 151, -157, 73, -172, -47, -68, -24, -98, -197, -131, -102, 122, -44, 9, 59, -89, 112, -23, -73, 328, -267, -184, -99, 35, 133, 68, -72, 166, 0, 261, 60, -145, -15, -49, 275, 242, -38, 129, 136, 31, 187, 56, 276, 160, 108, 206, 376, 106, 71, -23, 49, 198, -114, 155, -115, 22, -77, 218, -2, 93, 341, 224, -73, 297, 39, 177, 125, 71, 138, 234, 163, 178, 138, 16, 21, 378, 224, 92, 188, 320, 178, -190, 34, 234, 117, 297, 130, -147, 57, 186, 48, 201, -88, -210, -78, 75, 44, -235, -103]
3332a03n6J11LJ37j18P5k7O4j26k08M13l50J71K08k1l41K20j09RJ54P9k18Pl38
3356c64K37K21k32L25j87Oj96k25K37J19J57k49J54J58k69K24j53k01l0N45j42
3377A35m9M2j30k87L09j77L1J98pM1q9P3J3J0L2k02M03j91r1R8j31J65r3j47J45
3402A01J19m52J40J22O6Q5k02L93l01j67J59l8q4K93l09J09K1r8j12k11K39J36
3424IJ15j23j39j40K28j96L73Q4n8k27K2j24K23j16N6R6k63p3M99k56J55j70J08
3447H3k50K34O1k53l9j22L83k36J34l8L56l71K29J7j44R0j29J45j10l2J62j98
3469b8J38O5j32j15K4M4o4K94k13L1L5K41k55j4j66K14o8QL9q3jj95L37J06m81
3494b39L87j50m0O8m0K72l26j27K71O2l43K57j65j05K01n8Nj02J51j7l4LO3j10
$$ y = [-103, -159, -48, -45, 92, -26, 49, 22, 86, -40, -248, 165, -185, -14, 194, 173, -168, 52, -57, -48, 106, 185, -33, -26, -364, -127, 94, -138, 187, 0, 6, -190, -415, -178, -59, 98, -151, 3, 161, -108, 116, -37, -238, -268, 277, 135, 86, 128, -2, -289, 20, -157, -126, 72, 65, 106, 17, 90, 103, 113, 145, -57, 346, 155, 64, 162, 31, 196, 103, -44, 101, 220, -232, -92, 30, 96, 181, -21, 372, 71, -96, 63, 25, -59, 234, -75, 34, 55, -43, -155, -366, -127, 9, 124, 1, -138, -278, -50, -246, 127, 211, 153, -74, -52, -176, 47, -69, -13, 83, -180, -253, 246, -10, 145, -25, 83, -167, 67, 128, -125, -164, -286, 97, -139, -5, -43, 313, -58, 171, 188, 44, 134, 5, 150, 40, 8, 170, -28, 110, 175, 43, -72, -48, -4, -68, 226, 13, 44, 79, 320, 65, 51, -115, 99, 31, 39, 78, -5, -6, -201, 136, 242, -239, 148, -2, -42, 26, -14, 258, -68, -195, 76, 138, -205, 52, -113, -218, -17, -75, -70, -172, -21, -38, -72, -69, -6, -116]
3518a16J33kk36J20p9L00jo9K44j41j81J12j88j37J18J5L08k7p3r5r5o9P9K12
3542A32r5l08K62J18p8J49oq6K6n4J03j64J65j02O7k63J17j24J28o6m7K18j13
3565b1J87j3j31R4m5j38N7j57K5L63l0j60j58K18M7k68J53j26J93j64PlR9n1J07
3590H5j68K72m61L52k53L43j39J51j81J21k85J88R4j62J1L4J84l68m7M02k0k92
3612a39L91l77P3J06R5K50m82j38K73L63m42j29j34N18k28k5J58j23J09j11l7
3633b9k2L3k06J40j8L18O2L1j68k00K20J1m3m4o7l5L9j69K24Nj70R3J32q4k2Q9
3659A20p9M6K85l34J74k47J44Q1j26J36k22l4J04q4J45j12j85K32l6Rr2J31k66
3682b10K15J93j48k35O5M1K75m72J29K69l70K18J73r8j77K7j0L59m91M3K10J99
$$ y = [-116, 17, 15, -221, -101, -180, 120, 119, 50, 294, 153, -28, 84, -104, -241, -123, -108, 200, 173, 100, 5, -90, -159, -80, 132, 37, -271, -9, 109, 31, 180, 174, 88, 114, 60, 163, -1, 164, 62, 129, -134, -17, -141, -13, -79, -126, 92, -21, 166, 153, 22, 116, 71, -67, -10, -167, -142, 221, 191, 31, -127, 91, 138, -130, 23, -103, 90, -74, -67, -70, 29, -22, 85, -83, 189, -272, 80, -173, 170, 31, 182, 1, 122, -163, 25, 119, -43, -32, 2, 186, -182, -229, 173, 153, -139, 252, -125, -52, 54, 149, 399, -83, -221, 52, 415, -27, -156, -290, 228, 0, -25, 133, 10, 119, 8, -29, -51, -18, -224, -84, -102, 216, 278, 309, 141, -59, 161, 172, 129, 85, 18, -17, 22, -147, 77, 82, -88, 5, 137, 53, 31, 120, 41, 87, 372, 38, 212, -35, 109, 190, 64, 200, -22, -56, 48, -36, 109, -3, -188, 44, 8, 17, -75, 56, -210, 5, 198, 50, -185, -120, -79, 196, -276, -147, 122, -248, -30, 143, 45, -132, -105, -115, 244, -247, -204, 6, 205]
3704B05l17Q7k14K54r3K3J53l04K53k03j7K47O1j58l1l96L87L3M9J0J43q8j22
3727c8J24l3P2m5P2o1l23Q9O2L9J84j8j74OM18n68j44M27K0Q4l61Q6O7o9K22l9
3753I9R6k76J26J7J4j16q0qJ89k20M9L0p2rR3j43K17J6l71J12L53k54J07L18m10
3778a23K60m25J68j75J39oJ90j49q0J87P5m0J79k25j45K37j92q9P8j6k40K25l6
3801b03J80j38OK0K24m24L66j72K9j37L01m21O8K55r3K02j25o3l6K09K53l90m9
3824a38K79n16N10j42L2J84k8j67K86l53M1j46J87j98k08K79m2kJ35N6j42K8n2
3847a17J19R3k04j0L2J07j64K17j78j05J59Jk58M18L2j90j67J47PJ20j6j86Q9
3870e4L3j55J22L0k5r8P9Q5j76Jl04L14p0j4K09kj01j22K21K11m35J20ro5J12
$$ y = [205, -112, -25, -239, 15, -78, -55, 98, -206, 47, -156, -173, 74, 135, -23, -54, -450, -63, -30, 19, 29, 172, 84, -38, 86, 53, 125, 80, 152, 91, -232, -143, -81, -42, 142, 124, -50, -44, 374, -194, -338, 89, 109, 193, -168, -82, -15, -84, 138, 99, 195, -81, 45, 62, 76, -40, -120, -128, 61, -159, -110, -80, -152, -161, -68, -211, 6, 22, -349, -237, 116, -138, -31, 287, -123, 137, -288, -120, -295, -156, -162, 28, -121, -201, -14, 61, 21, 200, -25, -170, 67, -125, -214, -136, -152, -392, -167, -203, -23, -161, -155, -135, 89, -335, 31, -141, -112, -249, 52, -369, -301, -46, -139, 63, -62, -125, -161, 48, 301, -89, -138, 141, -375, 135, -7, 25, 209, 181, 14, 300, -53, -12, -158, 29, -169, -377, -98, -140, -142, -7, 49, -93, -65, -117, 2, 95, -109, -119, -87, 20, -144, 73, -105, -210, -51, -50, -308, 110, 142, -48, -215, -68, -61, 59, 43, -143, -54, -21, -176, -54, -24, -49, -147, -68, 17, -159, -158, -462, -148, -218, -232, -23, -25, -126, -248, -27, 184, -251, -131, -140, -205, -93]
3895i3O0j26O1K2j36j54L20M4r4N2JK75m03l6L16l32LK11rl1o7J07l11o3K92p3
3921a64m3J97p6J00Nj35lK37l31J95p0j50J42J56q6j69J85Q1k61M2j32M6K0K23
3945IK2p3R0j52R6j22l7p2J66j9k1J96l15J94J9j46QN1l4L77k26k17J32J5L81
3970C22l61l8j6R3j85J39J71j51j49r5L70j90K89k76N1K44M4l48q0J13K72m9J05
3993B75j85m5L4J81m53K76p9j84J13K45p7j92j93K61j15J45M7jj19k8L56k24p5
4016c7J69j20k7n7n5M6KJ78L5J4m91L58j73J58m5J22J72m25J43P5k75J63pO1n9
4041g5J44Q1j65J44r8j73K64k94j16K81K0j9j26J08K15j4l89K25k13L1K28k16
4063a57M4J96j22k09L04k3p2O8Mk12J94Jr3k57M34r5j79M50m65J45L0m2P3j22
$$ y = [-93, -33, -159, -98, -76, -212, -366, -46, -2, -96, -44, -43, 232, -171, -207, 109, -223, -220, -9, -18, -49, -116, -9, -320, -383, -91, -164, -207, -10, -86, 14, 19, -116, -119, 118, -213, -18, -88, -238, -96, 60, -26, -195, -10, 71, -190, -148, -280, -234, -214, 9, 31, -42, 48, -104, -8, -130, -167, -239, -73, -92, -113, 83, -232, -38, -19, -165, -157, -106, -140, 237, 11, -206, -74, -59, 322, -39, -77, -93, 0, -185, -46, 125, -26, -175, -270, 100, -90, 199, -77, -26, 218, 262, -86, -166, -53, 219, 170, 275, 90, 45, 79, 260, -193, 83, 4, -180, -67, 178, 101, -91, -284, -23, -138, 7, 54, 53, -66, -94, 262, 38, -37, 132, 12, -15, -72, -127, -81, -79, 99, 134, 148, -343, 15, -158, 0, -45, 77, 249, -176, -33, 42, -233, -70, -77, -16, -75, 69, 150, -15, 129, 31, -142, 122, -172, -288, -7, 13, -6, -132, -24, 191, 177, -212, 13, -200, -169, 59, -157, -113, 83, -39, -248, 56, 33, -39, 29, 33, -179, 15, 16, -77, -334, 100, 5, -174, 276, -189, -44, -14, -56, 17, -105]
4087a05R5J65j92p7J97J61k51L85n84J87L7j17j29J05O1K17j6l56J28J69J4Q0
4109A74j23Q4p8J42j28J34o7k47j55K98R5nk58l4L66k83n6M5K51k52j51K93k14
4132a69M4N5K72m71kJ31L25k66R2j11J62J18j45J36m33K02O5j48K25j03J77j28
4154B8J15p5Pm1K2Qq7j14L02j32j43J28P9j24j04J60K17r3Lp0m6l2K2o2j45R4
4180h3M9Q1k03J11J58J03k9l70K90k06K11J49k36r3L9J8P0j59q3J62j15J57j65
4203a44J55M7j29p0L21m85kN61k95o5K41j89N3K80j79j30K36j90J58j53J00j60
4225c9n4K7K4j31K01Q5O8j71j65J25NK89l15M09k82J02k75K35J3k45J77Q6j1R2
4249B50r2j51q7J69Rk05j11L39o2oq3N4j90J81J0m2R5n7j61L05q2j32M71k06k86
$$ y = [-105, -10, 155, -37, -114, 83, 244, -7, 378, -206, -19, 18, -99, -228, -123, -62, 155, 139, -217, -89, 80, 94, 174, 51, 135, 57, 199, 71, 205, 138, -109, -264, 34, 129, 124, -134, -168, 198, -85, -141, -96, 155, -97, -248, 45, -169, -125, -70, 202, -269, -271, -140, 185, -81, 11, -100, 62, 180, 35, 171, -262, -60, 5, -143, 82, -21, 156, 28, 143, 68, 75, 34, 56, 64, -23, -137, 165, 33, -110, 18, 97, -27, -131, 29, 246, 153, 156, 86, 40, 8, 30, -32, -177, -83, -34, 47, -156, -45, 113, 216, 187, -183, 107, -99, 112, 261, 25, -68, -29, -11, 59, -100, -183, -21, -136, 21, -144, 11, 58, -71, -141, 180, -305, -307, 254, -41, -106, 135, -54, -1, 279, 100, -30, 206, 16, 174, 21, 121, -39, -93, -66, -42, -173, 28, 113, 181, 10, -155, -30, -25, 264, -51, 358, 76, 178, -97, 138, 151, -94, 83, 169, 158, 250, 158, 7, -80, 89, 98, -107, -218, 121, 59, 53, -30, 24, -166, 15, 25, -17, 78, 21, -140, 165, 83, -49, 422, 216, -70]
4274g0K54k60J8J49p5k01K51l30M77k27r0j5R0O0K27o47M11j7O9J31l87K43j73
4297a12J20k6K38m72O9K48l0J25l86K78j01K28k90K68l38J80M0j7J7r3J09r1O5
4320B9K59m40K52k9p3k9k22J67O4j16J26K5J68p2K2M6m85K93m9l3J70j21K42k60
4344f6J7p6J91J07q4K00l14O9L3jJj35q5K2j7L23m41J48K72j05k13M5M4l3l14
4369d12J23K2K66o4P3r7J4J16j95K09q1N2J13J1l50J94L3r1K75l16R6J12j10K03
4393A96j55j11R5M4J3j90M3L4j78L08m5k50J23L4m6L12l71Q7o9N5J45Q6m6n8Q
4418F4k5p9j24k3k2O7J99J02o9k31K70j16j58N1RJ82j36m5j8J08J39k69K06j77
4442i5K14Q5k2j48Or8K63l22J05lK19p3n8k3j87j68K23K3K45j78J5K10l00J51
$$ y = [-70, 184, -76, -58, 91, 16, -185, 66, -264, 213, -14, -104, -119, -29, 31, 258, -389, 22, 5, 74, 205, -182, 61, -112, 8, -18, 220, -252, -183, 65, 35, 160, -226, 52, -49, 179, -111, 157, -181, -1, 39, 22, 39, -54, 55, -36, 29, 288, -152, 100, 71, -2, -31, -253, -86, -22, -138, -12, 13, 181, 109, 131, 177, -308, -15, -64, -97, 73, -48, 194, -66, -49, -125, 66, 173, 89, 289, -25, 44, 77, 76, 77, -58, -143, -121, -138, 185, -256, -108, 164, 59, -154, -109, -65, -98, -412, -289, -267, -1, -65, 8, -89, -75, 41, -154, 55, -26, 26, 139, 150, -200, -6, 27, -64, 211, -105, -9, 103, -7, 196, 41, -70, 25, 69, 82, -108, -65, -31, -209, 99, 54, -196, -73, -39, -85, 227, -144, -57, -126, -71, 74, 160, 114, 56, 64, 39, -40, -164, -187, -209, -142, 57, 159, 90, -141, 129, 13, -145, -94, -85, 97, -39, -84, -102, 6, 145, -124, 82, -95, 119, 204, 182, 34, 40, -58, 205, -117, -12, -15, 204, 131, 73, 50, -137, -305, -82, -59, 186, 8, 23, 233, -67, 84]
4466H4K25k16r5K2M6n2j97L90k60m9K4J67L8J05j98rJ16p4J76k13N7k65K01p0
4490d7o2J43j61q8J78jq2L63l25J52R6Rj34q6R0n1j90K46J1j14L92l18L0r2p2
4515a13K1J34O4k43nJ89J08k55K45l2l2k65K54k30L50n06L39rJ36R2j30l5m3K
4539C6R9k02J50k82J32K05j02j03J35l93J85K45j24J05Q3j52R9q1k87L81j55J60
4561A34j32K95k91J7Kk16j09L36K34l00m1J58J7p1j44K18k18J56k2p5r3K56j08
4584CJ4M2p9p8J83q9j0r9M5M0J41J24k35m8K7K3R9j13j03N8K89k90P9o9K12l1
4610A35m7J0k26K11j68J30j77j83L92k31J40L17l69mJ07o0J06j27q3N4O7P8j16
4633d4L9P4k6n6k6J80o6m0j20M3L52k25J53j07r7k45K88k22L13ll63L17j74J76
$$ y = [84, 309, 93, -2, 20, 66, 14, -183, 207, -53, -102, -78, 89, 127, 232, 34, 25, 141, 67, 243, 30, 87, -178, 23, -47, -109, 34, -127, -215, -37, -38, -120, 243, -82, 70, 166, 175, 41, -45, 45, -6, -196, 50, 61, -53, 339, 21, 51, -41, -113, -92, 42, 106, -137, -142, 47, 155, -100, 145, 113, 81, -184, 70, -160, 190, -316, 23, 14, 150, 242, 112, 77, 34, 36, 135, -67, 83, -199, -67, 138, 36, -67, 68, -325, -140, 105, -19, 86, 169, 17, 116, 35, -252, 129, -26, 134, 2, 297, 6, 23, 25, -191, -300, 36, 270, -30, -71, 87, 104, 33, -111, 107, -111, 45, 23, -52, -145, 111, 3, 17, 59, -20, -98, 85, -4, -14, -113, -68, -28, 113, 237, 2, -46, -19, 4, 103, -10, -113, -55, 234, -56, 23, -46, 166, 135, 88, 98, -128, 83, -85, 45, -132, -315, 77, -154, -14, 303, -66, -70, 37, -23, 83, -44, -127, -73, -6, 72, -44, -5, 69, 43, -13, -39, 141, 75, 35, -85, -42, 310, 85, 238, 131, 34, -211, 77, -145, 168, 165, -198, 119, -55, 121]
4657A21k26J82j59J35KMj5n5J17j88N4J52k56K93j0k40J42o9K09m86J86J69m15
4680c53L03M1q6J90r2k01o6J10l6K83q8Qm7J99ok89P4R1k2n2j25J71p7L91l26
4705eJ58j12N7q1J92J5m40J47J28k2m6J87n26M46m0j08KJ41j85K75j96MN7J0k87
4730b29J85K20j89K07n3j34K37m93J92o0K57k30P3o0K9j52j1O1N9O8L0J31k59
4753a21J81J69j83N8R0l07K7M6K88k52q6m0Q1m2N0n9J21l8k80J50K71k90J99M7
4777H0m54M02J08n6j10L2j06n8J76M2j53L3J41j35lqJ77k72J19N5m7K8j64L14
4801A41j67j03P0o6J38l6J80k99K32r7j67J94k0P0r5k4K4k24L13n7j2K40j95l4
4825Fj99J13J84n4k6Q5j62n3M0k8K64n5k25J24k75N88j10j68J10l27m7K85m8j0
$$ y = [121, -105, 77, -82, 53, 55, 59, 44, -11, 106, -82, -28, 124, -132, 161, 151, -89, 53, -16, 193, -293, -107, 62, -353, -50, -9, -95, 95, 3, -198, -264, -154, -190, 93, 5, 13, -34, 165, 159, -130, -56, 35, 13, -39, -164, 7, -70, 321, -5, 153, 41, 98, 17, 209, 224, -216, -69, 59, 37, -9, 178, -348, 98, 58, -50, -48, 93, -92, 183, -13, -9, 48, 58, -229, -44, 176, -13, 194, 141, 7, 244, -249, -57, -117, 140, -90, -17, -77, -48, -200, -211, -150, -91, -23, 7, 138, -121, 60, 229, 46, 104, 194, -113, -86, -40, 248, -4, -90, -130, -49, -91, -41, -100, 21, -17, -297, -147, 124, -166, 33, 80, -374, 28, 136, 80, -30, 2, -104, -162, 14, 56, -97, -64, 77, -58, -61, -69, 108, -164, -45, 10, -37, -9, -173, 141, -26, -129, -59, -125, 13, -23, 157, -142, 90, -7, -174, 20, 0, 70, -25, -49, -25, -249, 64, 7, -5, 235, 40, 6, -193, -80, 104, 50, 24, 109, -53, -106, -66, -94, 170, 115, -110, 14, -261, 327, 217, 49, 159, -168, -215, 70, 22, 12]
4849A2j15L03j6l88J1N86m22j56Q2L09k06j20N2L5N4Q1j47J88j75N4O9j88J01
4872DJ68k68O7K51k38J11j03j60n7L62j94J49k58J70K2J94k69L23l92J99l74l2
4894c25L23R5l84J09K95j31J23l52L64k80J67J67j60l1J15r0J10q5J93Mj51j75
4916i9M7J21k17K36j78J55l39L01k9m9r3Q1K39n16J13N5K56k36J02q5l6J36K16
4939A81P7j20p4n1kj77J10k67N00q2l24J401n00p64L62j22j44j65L04j22K0j78
4961a37J86j76N9J53o8PJ9P9k22K52k74k05N90l49Q7K28j400J111M55m6R0n78
4983a39j40M96l29p45O80K57J26j96Q1p8l3k8N0O6j23JN2LNj12j52L23j29k5K31
5008A42r4j34N5j16M30o07K09J86o2j08K0M2r0O2K03j64K11k33q9O8l5P8n4p4
$$ y = [12, -103, 200, 184, -204, -193, 393, -29, -185, -103, 206, 0, -120, -68, -33, 21, 102, -45, 143, -32, 22, 91, -97, 4, 172, -96, -29, 222, -16, 95, -8, -168, -225, 137, -57, 92, -166, 4, 26, 220, -49, 274, -118, 81, -293, -325, -2, 93, -291, -182, 113, -18, 105, -247, 117, -163, 4, 171, 11, -20, 95, 5, 115, 30, 223, 227, 76, -99, -52, 69, -148, 88, -90, 65, -274, 27, -2, -51, -144, -63, 176, -340, -227, -172, 84, -152, -50, -135, -171, -35, 181, 258, 138, 64, 13, 11, -166, -56, -323, 177, 95, -229, 1172, 672, -92, 270, 148, 4, -161, 143, 21, 41, -137, 49, -127, -68, 85, 17, 24, 43, 122, -100, 152, -122, -327, 263, -86, 1, 229, -1171, -60, 395, 349, 439, -139, -279, 217, -112, -857, -177, 80, 206, 10, 91, 13, -20, -48, 2, 68, -55, -54, -2, 1, 6, -106, -258, 65, -64, -89, 142, 48, -86, -31, -147, 283, -324, -115, 71, 9, -99, -79, -37, -127, -65, 138, -26, 185, -48, -137, -69, -104, -26, -80, -154]
5032a54K00j2j02N5K7L2l1J3K5J83k58J84j58j76M53j94j20Q7pm0r4Q7R7l57K33
5057b7K45k79k38K53J29k8J17P9rk47N7k77K37q3K55l77l8K38J74k6l95M67j53
5080G4j4j85N7j11J48J24J2P4J33m32M66k14m7j47L2q6J43k8PJL1o5O5O7L7J34
5106B76j75k21J37j19lk9J17m4J59j1jJ35q0j74J15j48K20k56J31o2j39L12R2
5129B32j13r2j12K36k44r7L3J15N1L0Q4j80J5J92j30j34J32M6n9k5j50L01j75
5152d4L7J30j53m6Q9J95N1j52j39l7J90k71K98j87m3K16k56J56j6Q5j42K65k40
5175a4j49R8J27J16n1J7l05J31P5J42p7J19k52K11m51M4J18K15j35o8J58l5K5
5198E9J03j50Lj60j58L11J93k14J54j2j98j13L78k0jj66J2l21K63k23K66J46j66
$$ y = [-154, 46, 34, -68, -13, 14, 46, 15, 28, 53, 236, -22, 162, 4, -172, 281, 87, -33, 54, 47, 7, -87, 0, 97, -260, -27, 218, -61, -299, -46, 83, 55, 172, 251, 242, -5, 52, -225, 12, -71, 184, -193, -231, 7, 181, 155, -240, 227, 74, 60, -125, -68, -179, -31, 93, 105, 179, 312, -120, 346, 132, 85, -62, -30, -116, 27, -1, 6, 7, 38, -27, 38, 105, 142, 276, 101, -120, 17, -102, -105, -134, -17, -61, 98, 87, 86, 221, 141, -33, 82, -66, 154, -102, 29, -33, -172, 140, 232, 119, 27, -85, 151, -93, -190, -157, -42, 9, 39, 123, -57, -42, 150, 20, -114, 18, 64, 5, -20, -170, 131, -44, -7, 123, -30, -76, 13, 208, 259, 107, -32, -69, 121, -150, 148, -39, -82, 134, -122, 34, 18, 103, -39, 226, -14, -163, -65, 62, 178, 127, 144, -161, -30, 45, 187, 110, 229, -23, 188, -263, -219, -101, 114, -21, -89, 69, 34, 59, 162, 12, 15, -145, -303, 8, 201, -13, 141, 129, -69, -182, 196, 176, 175, 9, 21, -300, -37, -260, 6, 152, -14]
5221a4KL1P5o2j21P6O5k8j17j64L20l66N70m34J70j39M9K74m40L58P8o6p6M9k57
5246a67J24P5L1j55q6P5N2L6j36Q8P7L6j08p5L8k4K18j17J82k07k0J35k40J87
5270A9K39k26J99j32l17J25JK08j65M8k3O4K4k6j4j02j04Q7K52j98K87j39l17
5293b10J2l3J17K08j81N3j21L25l13J80n3r9J00J18j34j78J28J09J43nr7j57J60
5316G2rR4K0j01p2j77K32l5k16R0j52J63L3j3j04o4J84J93j47K9L2j2J55k16j24
5341a45K83k69m7L61l89K29Qp8j90Q3K3M9M6M3j07L18o6K3j63M7k73J97K59j98
5365D4J31j77O3K9k08J71j71J19O6k73M95m44M9K07j00J01Mj93N5j87M79j95j99
5388a34K72o3mrk72j72M05k03K32nj19J1J84l72J26J12J47j14j99L0j18K32M6
$$ y = [-14, -12, 19, 94, 32, -89, -13, 52, 24, -93, -257, 63, -303, 267, -167, 3, -136, -87, 187, -253, 105, 183, 117, 41, 90, -167, -43, 32, 63, -92, -178, -103, -51, -15, -151, -63, 14, 50, -58, -133, -95, -119, 99, -18, 164, -43, -63, 72, -168, 19, 258, 32, 231, 99, -218, -93, -92, 116, -49, -1, -24, 40, 64, 38, 24, -78, -182, -95, 157, -41, 246, 107, -210, -198, -231, -114, 94, -87, -34, -155, 170, -143, 37, -16, -115, -15, 103, -31, -209, -81, 28, 171, 166, 69, -88, 72, 63, 157, 177, 76, 4, -173, 59, 24, -192, -102, -254, -91, -58, -71, -175, -239, -55, 138, -9, 20, 52, 40, 195, -21, -145, 138, -131, -178, 183, -206, 23, 31, -47, -237, -154, -131, -82, -36, 7, -100, 218, 152, 175, 12, 59, -214, -17, 242, 44, 175, -2, 61, 90, -118, 53, -118, 1, 67, -206, 289, -155, -106, 101, 1, 102, 106, -87, -32, -219, 260, 65, -134, 138, 75, 71, 62, -210, -382, 23, -180, 52, 47, -72, -61, 123, -249, -123, -11, 136, 22, -177, -147, -265, -33, 13]
5411A3P6j60J47Pj98o9J23L2J92j48J02q7jNk16J43L7Q1m9k0j01K5J83j76N2n1
5437e8j56K5K2J56K34k93J33j46K32j37j11QK78j53j20J36q8KJ26j59L10p9M7
5460B09k04P0J9j6p6J35j10p2j1J55k3J27j87j1j85J10M7M6K07m51L82J65l27
5483aj12J2J03k15P6M44m27O5O9q1J47j59o5J70k6J5m0K73j85n1L0j28K56k02
5507c2J73l77J5K20n2L24k82J19l27L56l37J3K94j6j89K84k50L5l8l3O7po7J01
5531fR2j47O3j42M5O1J9QnJ43K5k48J49KM0j86K8o0P2k27L19k36J97K0o7K45K4
5558B28j54j00J25k78K25m3K27l75N5L8J11k44L24j72J29j51Q9Lj46Q2j08R6j54
5581a93j62K76L14l43K30rk80J40o8K8J29R7l27K14j43J22l0L6k32J35L06j82
$$ y = [13, 89, -71, 76, 83, -115, -184, -61, -29, 163, 15, 117, 30, 29, 34, -182, -39, -2, 79, 30, 10, -91, -66, 117, -59, -7, -58, -214, -189, -167, -11, 223, -70, 63, -83, 149, 12, -99, -91, 187, 34, -86, 50, -38, -36, 90, -69, 241, 162, 209, 5, 75, 94, 78, 2, 137, 27, -45, -56, 99, 76, 203, 16, 5, -180, -70, -23, 23, 230, -221, 161, 326, -1, -113, -101, 2, -213, -137, 307, -120, -55, 14, -67, 80, -79, -144, 26, 0, 15, -25, 248, 63, 12, 42, -86, 170, -32, 141, -236, -221, -1, -53, 271, -11, 108, -219, 137, -200, -187, 107, 91, -98, 186, -64, -29, -67, -100, -33, -40, -107, -6, 86, -61, 2, -140, -95, -34, -15, -7, -12, 131, 156, -92, 57, 59, 99, -87, -59, -119, -47, -274, 45, -191, 6, 26, -41, 204, 228, 74, -26, 99, -179, 46, 3, 230, -145, -90, -52, 59, -185, 139, -33, 96, -55, 34, 37, -109, -27, -135, -39, -193, -355, -79, 235, -108, 122, 113, -167, -27, -95, -67, 62, 159, -168, 46, -97, 25, -5, 31, -201, -66, 240, 58]
5603E8M5j08o3J76j27j02J34j09M7L1ro3j8K04K7k04R9r9j45K26K08r3j34j17
5627a36J84j13J75m1k76L55l8k33J82m24K12Q8L10l17j03P0ML16r8j4j32o8N2
5650d5J03J31l55J67J45n4l5J8P4j48J11p7j53l5q3K87qL3Q2j53K8J2m6m2Oj24
5676a61p1R2K45n7K0j10mN9q8j21K02KJ14j38q4K63j13n1k88L16j0k33N6K03j18
5701g5J23K8p4k14kK45m9k60J14J91q7J08k25K91r2L00m06K09k55l8J90R2j79
5724f5J98j28O5LJ5Mk08J51M9k66K45j93O4K53q6O9l0j96%J54q2j04K85k57Q9
5749B9m9Q6m5R1j75j48MJ53J25j47r0K78M9l14K59l0k56J58j97J90K28j40J1P6
5773A46nk27J24M6J72k74J04j22P0p1k21K25K6Q8l7K6n0k3j75K75k3J44k82K72
$$ y = [58, 103, -5, -68, 108, -19, -121, 13, -96, -49, -18, -27, -90, -108, 96, 123, -81, 18, -81, -226, 0, 208, 115, -19, -136, 48, -65, 110, 69, -207, 148, 110, -123, 59, -365, -153, -65, 245, -72, -175, -105, -101, 215, 117, 103, -29, -97, -45, 58, 189, -166, 1, 146, 92, 57, 75, 149, 1, 112, 35, -118, -153, -236, 51, 43, 76, 158, 5, 33, 45, -1, -43, -37, -161, -232, -140, 105, 48, 68, -42, -46, 13, -75, -196, 6, 8, 122, -16, -100, 163, 50, -1, -289, 27, 17, -216, -160, 43, -75, 48, 76, 2, -212, -214, 31, -18, -278, -164, 27, -60, 48, -177, 114, 22, 322, -84, 125, -130, -168, 22, 114, -65, 133, 5, 70, 73, 88, 92, -116, 35, 84, -182, 63, -130, -66, 187, 101, 170, 140, -56, -56, 98, 16, -88, 197, -60, 29, -20, 66, 21, 112, -63, -211, -207, -54, 71, -76, -166, 112, 161, -153, 106, 76, -180, -22, -219, -29, 199, 59, 70, 146, 141, -86, 38, 84, 256, -18, 86, -36, 34, -37, -258, -33, -7, 81, 44, 70, 20, -3, -178, 97, 74, 218, -64, 208]
5797B08j39l89K03j12l2J40n9K7K05j82l8J03J60k08N3J60q9k26J22K44j22l3
5819dK4K85k27q2J02j46J13k82J52k56N6J97qQ2j83n6L61k70J6M04j19k15q0J66
5843C0j64J99Q8l7o7j83M6j8K42mk26Ml1M3l2K65k23K03j47p4K05j1r8J07j26
5868iJ1O2P3m1j76J49l7j90L03J07k69k51J65j17J26N1K79n0l32J06J71j27k87
5891b83J89j76L98JM0q2L2p7l3q8j65J85j11K69p5k86M35j44M7K5m8NJ51j70l6
5916CK54m76M41l87j0O1J18ol0K58k65j43K53l06K82L35n05O4J64j53J11K9k56
5939a64P2N2L4M3j6J92j5m02K65J93l06J1J5O6j07K35j15m0N6k41j34K69O2n6
5963c1L07k82j79M44j35l88J85K34k86K61k38J26P1j77J74k44K00J7o2J03N5k66
$$ y = [208, 69, -320, -117, -229, -261, -121, -180, -153, 52, -130, -168, -65, 95, -113, -60, 100, 11, -215, -93, 151, 29, -4, 20, 305, 78, -4, 98, -48, 65, -217, -65, -321, -265, -68, -76, 6, -177, -233, 128, -142, -126, 278, 159, -56, -136, 30, -134, 65, 153, 116, 49, -134, -88, -106, 136, 132, -94, -90, -121, -78, -110, 155, -68, 135, -12, -86, 119, 108, 10, 117, -9, 2, 64, 137, 96, -80, 69, 32, -158, 145, 252, -17, -268, -103, -220, -94, -43, 236, 186, -146, -40, 131, 4, -283, -94, -270, 128, 129, 169, 87, 119, 42, 9, -79, -244, -59, -170, 99, 24, -262, 173, 29, 76, 101, 53, 58, 209, 39, 3, 257, -219, 222, -165, -175, -114, 4, -2, -32, 226, -39, -182, 71, -235, 47, 382, -123, -59, 105, -48, 63, 92, -164, -92, -40, -6, 37, 21, 213, 198, -204, 61, 254, -52, -41, -26, 40, -67, 168, 53, 13, 69, -172, -306, -37, 25, -31, 276, -6, -185, 259, 124, -264, -79, 155, -131, 130, -108, 18, 89, -88, 86, -158, 42, 59, -3, 100, 155, -111]
5985a11o5K44J93m10P6J33J61l29q5J68K00l71K29j4k5p8J3J67l73L41m04L07
6007c3O3P0J16j93j26j20K37Mj27K41k75N3J70j89K93k22o4k5Q1M49k40R1kk62
6031a0j01K62j94J16J63j83n8L3j52o4K25j70K17j66J88R3j60J53j68J20j83j35
6053a74n6K14L73n12L8N4j6k1P5q9J95O3MNp6q4O0p1N1j22J12l8J45j86O2k15
6079b09P0J96k35J10K2n1J00j56J53l18L06j3j33P8M5M3L4mJ06j06n2j18J71j41
6103a02J49R9k92J27K65l43m5J66J92r5k58L19K6j0k48N8O1J26m9j51j87K87J99
6126B94j17j89l0k21N29j04k31k7K72l36K66k55Q8l9R4L6k39j18M72j21j34R9
6148a1K10j70J8K9j90J64Q6J87m41mJ29l7K09k50j2m2J46M6j25O6k03J29k1j20
$$ y = [-111, -176, 68, 261, -149, -73, 60, 221, -108, -193, -25, 175, -196, 33, 19, -6, -84, -71, 96, -277, 64, -340, -33, 30, 100, 216, 23, -103, -223, 14, 18, -109, 132, -143, -90, 80, -109, 184, -38, -102, -127, -46, 403, 163, 254, 252, -10, -111, 151, -43, 73, 236, 53, -5, 28, -124, -188, 37, -133, 84, -82, 106, 199, 39, 192, 24, 144, -39, -174, -230, -16, 357, -155, -117, -63, -79, -100, -25, -114, 81, 144, 148, 153, 77, -7, 53, -18, 33, -89, 23, -15, 130, -56, 6, -209, -139, 57, -178, -68, -46, -97, 3, -153, 0, -318, -12, -25, -158, -80, -35, 8, 42, 38, 144, 38, -14, -132, 39, -102, 47, 146, -146, -19, 246, -97, -142, 24, 216, 121, -137, 182, 208, 198, -50, 8, 69, 195, 146, -5, -192, 95, 294, 177, -12, -42, -263, 266, 162, -69, -96, 176, -160, 106, -149, -61, -100, -6, 30, -209, -327, 145, 24, -110, -11, 199, 29, 47, 76, -114, 50, 136, 323, -118, -122, 7, -30, 179, -71, -83, -125, 21, 67, -58, 8, -195, -66, -87, -207]
6172b07N3K59j08L5O4J03k44J74j60j27J92M9P1p1k65P5N5R8n4q6K1J57k20L20
6196A84j94n6J87j44J79p6J83j57n3ol5J70j74M2j02J22o8K67k08k16K20k84K55
6219C6L3j28N4j19N19o90M97j73j57K19p2k5q6O5J19p8K4j48L6J43l38M77k06
6242Bl9p0mj27J69K75k54mK7o9J95l88M06j65qQ4KQ4o3l99K06L4J10N1m8j69J25
6269c7k4NJ45j14q3M0j05L10n2j3k58K67J03j13m62M16l77M21J73j11l96J68j
6292i8l8J4R9L38m49M20j57j95%M3K0l4K8J02N1l74K48k3J70J5k48J84j24J0L14
6317C16n47M0L84o20L02J30k26J63LN1J44l56K48R0l4j31O0Ll00j2K61P0k69J64
6341f6P4P5J1j54N4p7J13J7L9j5K8j62L61k33K65l84J61k69J89P4k62K10n3j15
$$ y = [-207, -154, 105, -3, 32, 96, 199, -45, 129, -31, -158, 34, 83, 154, 83, -182, -107, -52, 46, -8, -94, -73, 84, -136, 184, -10, -66, 121, -23, 156, 80, 263, 106, 53, 47, 12, 182, 8, 50, -52, 70, 2, 269, 61, -155, 65, -219, 36, 69, -59, -5, -124, 395, -295, 202, 29, -128, 91, 19, -6, -92, -27, 92, 14, 38, -110, -74, 69, -269, 208, 2, -37, -107, -111, -238, -69, 206, -48, -52, -25, -94, 101, -287, 119, -46, -54, 30, 32, 116, 53, -346, -140, -106, 4, 55, 7, -162, -37, -61, -56, 89, -25, -108, -68, -173, 137, 85, 72, -186, 81, 184, 71, -391, 25, -352, 69, 242, 131, -265, -97, -98, -136, -122, -23, 315, -134, 286, 129, -66, -66, -23, -3, -37, -9, 93, 144, -230, 18, -5, 165, 180, -68, 116, -8, 2, 316, -231, -191, 193, -427, -125, 5, -221, -58, -55, -4, 140, -216, 32, 122, 88, -43, 17, 20, -280, -292, -31, 39, -230, -66, 8, 83, 94, -60, -6, -83, 30, 47, 86, 71, 99, -63, 298, 65, 330, -54, 107, -162, 27, 101, -161, 49, -4, -119]
6365a19J01NJ32j10j95J41L5P4R2j80j44K83j62RNr3jJ37J04J98m80N20n18K98
6389A32k63j71L30J85l19J11K12M4j9k09J55j12P7k98K46LO5k08l9j25L35jl3
6412I8m3m3l8J17n0j32o6J12j3q8K08j64j9N3K25j34j12m2J11J07O1n5m2L6KN7
6438A46j53k4J3o2r6K3J51P7p4l32M54k86k2j2J72M8n5j52K5O2K10J15k00j10
6462h2J77q9j84l0K00K02j15Q5l93Q9L30L8j82Q4k25l2L49l24J2k6O2n7K73m10
6486b48K21J41Q6l25K54l5j67P2k3Q9L4N3K4m34N20m66K48n7j3P4j53K10j12Q
6510Am5o4P4P9j28J79k13R5j63M3K29o2R4j64L87k63o4K08j71l11L45Jk66K13
6534C4j10J79j88j6J18R8j37J45j60Nj70R4K12m0P3q3N4L3j18j5l50J81J30J32
$$ y = [-119, -18, -13, 119, 9, -186, -45, -10, 64, 156, -24, -168, 115, -47, -38, -33, -126, -127, 10, 114, 312, -168, 352, -166, 132, -131, -302, 28, 213, -106, 5, 217, 261, 242, 33, 188, 76, 153, -145, 101, 104, 169, -39, -78, -203, 132, 131, 98, 55, 12, -26, 91, 41, -91, -157, -45, -58, -146, 62, -102, -121, -68, 157, 23, -89, -131, -20, 87, 148, 93, 51, 87, 89, 146, -7, -31, -18, -80, -176, -153, -2, 75, 1, -331, 123, -163, -185, -197, -25, 23, -32, -184, -159, -97, 113, 228, 28, -82, 95, 6, -178, -208, -8, 194, 79, 164, -229, -140, 190, 228, 46, 130, -95, -127, 222, -102, -90, -116, -54, -111, 162, -248, -27, 114, 200, -125, 129, 94, -73, -1, -24, 65, 99, 152, 176, -258, 262, -204, 44, -13, -26, 48, -105, 105, -7, 1, -44, -108, -34, 45, -83, 96, -117, -22, -185, -142, 87, 25, 119, -45, 342, 79, 15, 223, 52, -259, 86, 87, -179, 34, -76, 103, -85, -101, 17, 115, -22, 123, -37, -32, -202, -108, 104, 64, 137, 54, 108, 141, 23, 8, -342, -161, -31, 101]
6558A01j87J53k56M93l43M0N7l98J49R3n3K1J92q9K65l0r6j60J71k6j03N4K5r8
6582b5O5q1J18k19J15qM6K1j37K82m01L54k97Q0j5J76q6M1m02K06J85j27j7l2
6606a58J14J41K40m3n44R3R1k1j93K67j2J12L3j14j88J96K17l20k7N32k15q7k33
6629a19J13L5p3Oj08K97k57L0J24q1R4j29J39p8J04Qk9k0K4J06j49L3L07m48K76
6654B05O7q4r2q4j4M5Q9Qj30J02l8q1J49o0m0LR6l14J82j05J75k23J36P8Q6o7
6680H9J2j00k33L35K1j28j6j9J34qn4LJ96m99M82j98k3j76J37N3J07M8k23j28
6704a88K23O9j85O1r4J06R0j01J26j01L2k2J01n1K85l13p3J06Pk13J80M9J10m43
6728b39J31N8r7L83j99P7k03k3J64j28j26K10p5J85l10K35k83L19k5o0j3j07M9
$$ y = [101, -86, 67, -189, 304, -39, 1, 58, -340, -191, -98, -151, -130, 62, -27, 238, 208, 112, -48, 123, 97, -6, 48, 73, -25, 40, -41, 77, -142, -27, -35, 11, 32, -105, 177, -224, 130, -167, -87, -102, 74, -12, 29, -373, -167, 18, -109, -126, -158, -44, 97, 337, 294, -250, -157, -66, -87, -280, -13, -25, 87, 120, 6, -182, 14, 231, -89, -116, 416, 201, 114, -119, -6, 29, -44, -38, -146, 151, -106, -76, 48, -33, 61, -68, 71, -7, 97, 105, 76, 56, 80, 186, 37, 70, 377, -71, 205, 272, 188, 96, 12, -2, 43, 132, 140, 10, 112, 74, -7, 142, 82, 42, 45, 141, -173, 9, -96, 79, -144, -8, 70, 156, 89, 101, 1, -232, 103, 124, -4, -20, -39, 95, 87, 33, 36, 232, -267, 215, 17, -6, -182, -45, 8, 115, 163, -60, -188, 35, 104, -81, -20, -114, -8, 82, -19, 107, 6, 38, 16, 117, 66, 351, 38, -35, 71, 78, -135, 45, 94, 204, -239, -108, -50, -147, 236, 37, 114, -89, -112, 52, -76, -202, 8, -67, 118, -192, 43, -240, 79, 54, -6, -19, -126, -77]
6751g7K05k81J15j61J4J74l8J22j90L5J06j20J72L18m00j18o8K36N7j32O6j54
6773a19J67P0k26q3K11rK06j53j11K4M8Q2k06o0J99j51M83n07J14m28J72J64L8
6796g5J06j47K23j32K8k2J52m68M24p7j63J72K10p8j40j1k56J69K00j1k07K14
6818A11k81J20j8kr1NJ10P2o0m0j04L36k89K21k32K01k00k8J41j39k0Q7L49m16
6842a67M2L09J33m39O2J42P8p1J76o5l30K66r3K12l68J43P4r4q4L08m30K03J56
6865A63k81K16n6K4j24L03k00J27k27Q7j30j45q6L85rrJ8j18L66n36L36j06J93
6888A91k70Q1P6j48n5K63k03J21M4j78L16j87M8m1j63M3nJ14k46K76J13j71o3
6911d4J34p7k43M11m97K36K11J9k5n7j43O4K9k49J29K5J39M8j00M6q9K13r6J3
$$ y = [-77, 128, -153, -38, -199, -185, -11, -49, 73, -117, -82, 24, -96, 76, 394, -6, -124, -192, 44, 101, -31, 35, -119, 48, 118, -108, -191, 20, 11, 217, 64, -47, -23, 25, 107, -99, -159, 40, -111, 372, -135, -21, -449, -277, -113, -75, 31, -116, 107, -25, 3, -19, 133, -335, 89, 12, -151, 21, 231, 153, 13, 2, -254, -85, 115, 104, -103, 111, -170, -50, -68, -70, -161, -156, -46, 26, -34, -74, -178, 158, -131, 90, -142, 59, -141, -169, -28, -167, -187, -100, 249, -167, -125, 184, 317, -122, -60, 82, 160, 89, 265, 200, -130, 136, 43, 255, -113, 30, 104, 10, -74, 234, -196, 7, 163, -118, 98, 42, 66, -58, 245, 45, 172, -55, 32, -98, -243, -329, 56, 47, 38, 56, -62, 304, -232, 104, -2, 191, -79, 2, 78, -70, -125, 138, -65, 56, 100, -78, 238, 51, 99, 58, -105, -62, -67, 47, -199, 77, 190, 19, -44, 90, 13, -230, 181, -316, -80, 131, 150, 125, 68, -75, -11, 18, -231, -102, -77, 62, 110, 10, 56, -33, 180, 84, 97]
6935I7J11k59J54qk38M60j87j28J4j39J45j02O7L6k10K2J95j60K04k66J83j06
6957a15J3N6j04K43p7J19j47j6O3K29k89j93N5J95k07J78q5K44k22k9J04j30K25
6980A10m6k25L40m20J72Oj02K8J46k7J21k1j47K9l7M5K14l65J60j31N2Q1m3l7
7004i7K10j08q7J97l02L20k22J18K4l08K14J0K1p6M0J22k85M63m29o0O09m79J43
7027C8k0n4J44j42J76j05r3K61j63P7L9M4l44K18%j20M8P1j75J74l30J83J55Q4
7051A66j14k18K24J5J02l04r6K99j29J8K10r7q4J32j70O0Nk5j0q0p0L26L7l49
7075a52l7J85J23k02J70j44K6P2L3k95J98kJ90n5J60l72J71L3k35K74k29j66L53
7098I9K4q8K50n1j01j43j26J14l9m1J94Q0m7j44K28l09j19L24k81M49j64K6r4
$$ y = [97, 208, -51, 103, 95, -143, 317, 130, 2, 16, -123, 22, -80, -13, 23, -187, -165, 30, -130, 74, -192, -9, -115, -102, -46, -150, 93, 16, 135, -12, -28, 35, 264, -25, -218, -163, 32, -175, 3, -82, 162, -60, -89, 15, -115, 110, 64, -161, 179, -241, -69, -63, -165, -137, 9, -18, 103, 82, -65, -36, -73, -28, 186, -179, -19, -150, -98, -17, -60, -97, 113, 5, -82, 115, -187, 133, -89, 29, 53, -255, -41, -31, -10, -86, -46, 76, -209, 254, -175, -235, 374, -105, 38, 18, -36, 108, -34, 142, 37, -56, 205, 42, 119, 158, 202, -142, 76, 76, -44, 4, 75, -100, 74, -256, -73, 82, 166, 52, -166, 58, 73, 175, -129, -225, 74, -55, -37, 173, 76, -8, 124, -46, 14, 19, -6, -16, -96, -166, 160, 197, -152, -189, -4, 119, -83, 87, -57, -31, 41, 74, -221, -23, -25, 165, 110, 270, -102, 69, 102, -133, 141, -88, -254, 99, 123, 35, 285, 234, 133, -10, -136, -22, -61, -102, 92, 172, 125, -19, 209, -100, -219, 105, -176, 273, 109, 135, 41]
7121D1q6j36K30R4k66L68l16Q4j51K42k61K6J3K13p6l93M17K30l65K48r5J4k8
7144D7Q0j2j72LKP6k22K36j95J49r1m1J4K2K52Q7k91Q2k34J40M1J25LJ65n0j70
7170D6JJ52M1k79j54M29l47J20J8p4J37j37Q3rN4Po7Jj02l1n0J62Q8l3J5j12P8
7197C7%P8j87JK60n9l87K46l3M6j23M3M9K93l84J73qj48J12J7q3j31L12o1J65
7222B28j92J16k21J62k06K62j25o5K82k98J07J38k65J01q7J3p0L20j88l2J32j66
7244e4K50j69P5k10K24q2l2j39J29j5J84j69J37j60o0J86k03K65k80J30j04J05
7266Hl3j1K51m55M07j47J81m17K11p5R4o4N4k8o7P0JJ89rn3j8j49J45j02%J4K15
7293B12J71k87P4k50L96l41P8l76J33Q5O4J41r8R5j2j17j33Q3J55j89L2m6J49
$$ y = [41, -45, -181, 49, 143, -123, 245, -71, 13, -138, 104, -157, -131, -118, 95, 19, -374, 43, 273, -92, 156, 61, 75, 47, 127, 115, -57, -54, -52, 24, -198, 38, -157, -8, -99, -140, -126, -104, 148, 235, -56, 26, -208, -68, -27, 98, 101, 266, 216, 46, 47, 199, 240, -39, -193, 236, -111, 9, 27, -47, 90, -47, 36, 27, 81, 88, 21, 22, -80, -111, -161, 1, 89, 56, 71, -41, 37, 37, 115, -72, -71, 189, 130, -257, -11, -44, 2, -121, -78, -29, 264, -120, 53, 45, -103, 9, 26, -57, -188, 124, 63, 228, 36, 152, -69, 93, -113, 149, 24, -41, 241, -57, 50, 188, -77, 24, -63, -50, -120, 200, 12, -20, 112, -54, 196, 27, 102, -108, 116, 34, 2, -137, -8, -23, 161, -8, 129, -31, -91, 95, -108, 157, -123, 7, -97, 8, -25, -36, 215, -240, 167, 20, 201, -216, -5, -80, 14, -50, 4, -24, -91, -21, -20, 169, 160, 107, 89, -60, 85, -17, -17, -3, 212, 383, 96, 170, -80, 316, -25, 53, -323, -190, -105, -41, 100, 2, 97, 85, -32, -165, -82, 73, -116, -84, -130, 19]
7316A9K5m2j96j3L45l80J64J68l0Q5l15J72J09M2m06J80N1o6J73Nj27J42k63J24
7340c4L8l6j02L06k63R2J50k76N08j30l93L47j84L14m02L5j9R5q1K75j2l75M2
7363a05J74K48l48K17j89J7N2j91L5J61j14j61J84J66r4N0l38J29L37n19M11l50
7385b28K7J11K09l21M61l06J28l02K31J82J19k77k26nJ90J37l17K90j99L61m51
7406a86J25m8K89l6%k11R4k53J90M5l2oj9l0L21l75L2P8l2J91j23R5J1L4j60m8
7432e4L2o5R9K45j41q4p8j71L92j35l38M64k22J86q8P3j56k62M04j31OK3j39J06
7456c4j17Q7k0%K61j80Q2r2j62K17l91N41j50O4p8j97K93J2j16N4p6J4j27J04
7480a1J72j71j29L8J50J23j26j59J13K6K1Q4l6j28OP4K5j57j86J64N4K2K66q1
$$ y = [19, 44, 2, -194, -207, 138, -242, -78, 90, 60, 145, -170, 2, 111, 153, -253, -73, -22, -88, 85, 90, -37, 105, -158, -34, 4, -32, -134, 172, -91, 1, 151, -125, 383, 253, -140, 207, 23, 337, -65, -30, -49, 46, -35, 240, 228, -147, -105, 69, 317, -31, 186, -3, 14, 66, -125, -90, 71, -43, -204, -20, 146, 52, 102, -236, -107, 230, -289, 122, -228, -201, -90, 119, -202, 259, -47, 81, -221, 10, 192, 311, 34, -192, -197, -7, 130, -187, 103, -96, 265, -186, -61, -109, 180, 144, 144, -67, 27, -226, -36, 9, -23, -29, -48, -78, 243, -132, -100, -22, -54, 137, 14, 109, 120, 154, -6, -54, -22, -87, 12, 257, 116, 32, -46, -217, 175, 40, -298, 166, -56, 130, 42, 115, -41, -303, 101, -30, -24, -1, -140, -34, -151, -64, -84, -84, 177, -3, 79, -13, -175, 42, -349, 192, 42, 106, 28, -169, 124, 136, 20, 74, -2, 12, -115, -11, 161, -10, -139, -101, 49, 172, 46, -113, 0, 26, 47, 131, 95, -33, -27, 47, 72, -85, -271, -107, -53, -31, 235, 154]
7504A54k07n4o6Q2L08k29N1k96L36K30k32o5J94k85l0K49j71J04q6K06k02k70
7526b79M66j80Nj59p0J80N9R0K2j72R6M6r1J35k95N1j73K48K9M2J73k98k40J73
7550a42O8J07N9r8M9j82J92J98j65K5L9l28L49m33K91Q4k02P3j18K11k15K21n5
7573B8N1nj21K05r7J20j22j05j11L6M16k65o7j23NK66N7l07L66k01K89pl04l2
7597b8j05K75j63J7m0m9J39p5k5M9nJ20k60L90j66j27K40j93PQ3j15K02j31j19
7621g9J17j18N5J02k46J08L8j12K84k15J12k77J35J01N0P7j81J11q2P2m2l06N48
7644B52l25J43j48N3R9J61m06J77p6n1K2J67k44J69Q8P8O9l07k26K42j16j72O23
7667B72k10k86K82j5P2k00J32j67l3L20K9k30q3J52j92K84p3m18N31r5k8q5J8
$$ y = [154, -53, -107, -173, -91, 217, -12, 39, -257, 79, 309, 77, 12, 206, -79, -109, 140, -31, 73, -13, 193, -9, -279, 187, 7, 12, -147, -217, -37, 22, 112, 134, -38, 58, 104, 13, 148, -147, -96, -269, -21, 8, 50, 223, -75, -315, -142, -74, 33, 92, -6, 43, -139, 53, 251, 86, 111, 150, -178, 171, -262, 29, 113, -89, -16, -134, 77, -138, 83, 28, 79, 74, -47, 158, 61, 181, 59, -46, -157, -121, 295, 30, -37, -160, -155, 111, 168, -139, 227, 26, 315, 308, 4, -28, -133, 142, -21, -4, -44, -93, 46, -29, -54, -5, -10, 110, -150, 240, 74, -53, 187, -6, 1, 84, -31, 171, 40, -79, 38, -80, -25, 77, -169, -61, -23, -135, 149, -66, 46, -231, -96, 5, 55, 132, -49, 62, -20, 52, 10, -296, 252, -73, 70, -78, -25, 74, 235, -171, 6, -70, -121, -99, 68, -176, -7, 81, 159, 228, -79, -305, -63, -179, -351, 272, 62, -224, 58, 43, 115, -85, 47, -120, -153, 167, 196, -34, -117, 35, -157, 127, 54, -364, 167, 72, 44, -41, -23]
7690b3K49j01j07r3J77r3j58J83q9j75M09k62j5K70k76j17N29k15Q4k12O3J32
7712A60Q6l06N2l5Rj25K51j35l7j99L54pk8J51r4O7k76J62j58Q5J39k56L09o4
7736A05M2l35J85k6l0K7J27k94L47m03K62j12P8J7J46k46j65OM76j46k63L44l47
7759b05J2K13n9k10L79j11j01L8K19l05P0j72K80q5J06j97J24j28j3J38o2m0J02
7782gR7J22k51J9j30R0k0M8O3L1m5J36o4p7L5m7oJ25nol8n5j95J72K9P1j55K70
7810B07j08p4r9K15k16J22l2m1k82L90k8M3q9lN7j93P2R1J4K26l44Q5O8j09J92
7835A64r0m7L6k32r5L36L8J85k76K90m02p4K8M06m00%K40k58J50j4nn4N5j49P4
7860i4r3L4L67r1m1q2JJ21k21K21k2P0n1J23k69q0J20j61KNL46j64j72K31j33
$$ y = [-23, 226, 125, 18, -75, 102, 9, -149, 34, -55, -230, 179, -83, -98, 172, -104, -221, 308, 93, 177, -35, 28, 160, 246, -60, -8, -43, -34, -159, 92, -43, -80, -279, 75, 68, 40, 191, 97, 164, -112, 50, -108, -23, 116, -140, 169, 105, 147, -188, -3, -29, -59, -32, 95, -199, 148, -255, 7, -105, -27, -10, 136, -110, -275, -269, 207, 61, -202, 142, -205, -193, 20, -39, -249, 130, 19, -82, -44, 175, -130, -60, -232, 48, -37, 69, -128, -4, -132, -145, -7, -69, -109, -7, 90, 212, -39, -20, -150, -60, -80, -32, 31, 62, 17, 153, 89, 12, 47, 0, -6, 119, 114, 108, 70, 15, -180, -8, 21, 92, -63, 207, 99, 25, -74, 141, -75, 47, 15, -26, -308, 82, 54, 97, 8, 5, 62, -131, -59, 32, 46, 272, -72, 13, 81, -28, 164, 74, 27, 63, -169, -264, 72, 110, 295, 19, 309, -93, -167, -139, 267, -133, -133, 107, -151, -1, -15, -20, -74, -19, -168, -94, -187, -153, 214, 123, 82, 0, 1, 122, -99, 122, 100, 170, 119, 242, -27, -107, 13, -148, -146, -141, 205, 41, -131, 100, -33]
7885c3j46K01j16J96L9j86K6j74M68k09J75m3N9k48L70n96L56l57K75j71Q9J81
7907A56k18J20j85M3j5M0J10n8J07j80j1K84k32J40p1j00q7R3j76L16j03n4M34
7930C53n38K48o7p2J16j02J61n7m1j51N07l85P9Mj64J16L8j50p5R5L1m8K3M29
7954C50l0n23j67K95q5J42J60l63J20Q8J44L4j26L32n05J11P1Q6L1k36R7J31o2
7977I5j95n0K96n2m1o6l4K86k50j1j08J85P8j01P8R4k33j01P8k85K95j44J48N5
8001A7j82L38k75Pk49M05k7j45q2L33j81p7J5K09l74J24m8K87J21j90l3k70L30
8024E3K56l83J33P3R9j71p3J71l32j0Q9L02l24K06L7m64N69l29K73k44J10J96
8046B37k26Qp3J73J29j83k70M33m09J72j00J39p9j0j65K58k12L70j33l18K8J23
$$ y = [-33, -179, 22, -94, 102, 141, -45, -19, -193, 275, 66, 241, 198, 257, 9, 379, -217, 139, -218, 57, -114, -25, 156, -62, 58, -127, -84, -99, -59, 51, -7, 100, -80, -91, 193, -39, 101, 30, -70, -157, -64, -240, 76, -27, -81, 353, -185, 63, -4, -76, 40, -62, 99, 42, 1, -150, 357, -28, 51, 55, -109, 7, 45, -105, -180, -85, -54, -102, -79, 350, 320, -203, -370, -75, -160, -18, 142, -221, -101, -13, 131, 165, 39, 371, -134, -23, 48, 134, 165, -71, 26, 157, 95, -100, -150, 146, 94, 53, -13, -47, 239, -11, -22, -130, 55, 133, 32, 110, 204, -29, -130, -52, -337, -42, -186, -38, 17, -165, 173, -102, -95, -344, 61, 34, -111, -193, 140, -41, -118, -103, 106, -268, -144, -192, 95, 216, 26, -7, -277, 53, 309, -74, 59, 132, 231, 60, -13, 158, -174, -184, -95, 207, -117, 89, 126, -338, 231, -98, 175, -69, 41, 237, 11, 19, -54, 119, 248, 65, -205, 228, -181, -9, -109, 30, -49, -59, -224, 34, -178, 192, 59, -259, -231, -108]
8068a08J36L2R8j54J48k59J18l7J73k9j2N8l63J52K73l35o1J14K24r0l8L4m6M5
8092G3m5j01J73k18L40k45Qj28K01j76J59K36l64K3K22j4k40K86j66P3rj62j41
8115b15L15j86J28l03L79n0RL1k0J08k29j52N19l37K13k26q5L88o74K65J57M5
8137H0J18l59L67l64K02k8J08l30mR3K38j84J40j23J95L4l11L19k12O5J7k29L73
8160B05j80r7n0r8J91j03n8K16K60k74l3K14j69M0k61J87RK65l12QK58k46q4R7
8184a5J91k77J66j78On0K80
$$ y = [-108, 28, 60, 158, 4, 152, -107, 11, -26, 147, 118, 106, 164, -199, -47, 226, -109, -170, -56, 168, 78, 40, 74, 28, 73, 28, -73, 100, -118, 222, -23, -15, -143, 58, -118, 41, 277, -87, -64, 158, 144, -96, 190, 24, 97, 88, -74, -215, 100, -86, 42, -261, 118, 68, 77, 108, 88, 196, -33, -185, 334, -3, 210, -16, -101, 287, -387, -122, 35, 80, 198, -161, 206, -158, 44, 16, 124, -206, -210, -117, 121, -63, 77, -46, 149, 183, -128, 191, -21, 44, 61, -168, 205, 25, -72, -122, -220, -29, -132, -190, 26, 286, 12, -21, 193, 24, 64, -197, -10, -1, 264, -48, -40, 218, -28, -112, -15, 176, -101, 65, -113, -107, -157, 123]
8191A23
$$ Imaginary data points
##PAGE= N=2
##DATA TABLE= (X++(I..I)), XYDATA
0@%%%%%%%%%%%%%%qJ6j6J6j6K4l2L3m1M9n7P2q5R3j04J23j44J65j89K13k39K70
36A43l05L43l84M29m78N29n85O50p21P96q79R71j069J179j299J429j576J738j918
55a007K122k354K620k926L283l709M230m878N711o837Q440j0926J5368k5801J01528
70H4864Q4650m3797P026l3187r932k0815l529j6493m842k63j170p820P622n099
84C7215K405k601l184J482k440m189O946n102K722O647n24J461L492q36m6o976
100C6472R78m005j0515J761j616q029M417J387r71J644J313K152o119l144P69
115A6494j1986l650J288r489K233O452N53Q836R025R386P842M346P837l72m335
130D4460K9q438p168m534q116R9j907n88R877L343N558J0816K856L925K785k308
$$ y = [0, 0, 0, 0, 0, 0, 0, 0, 0, 0, 0, 0, 0, 0, 0, -8, 8, -8, 8, -8, 16, -16, 17, -24, 25, -32, 40, -45, 48, -56, 67, -77, 88, -101, 112, -127, 143, -162, 181, -203, 226, -252, 277, -308, 342, -379, 417, -462, 509, -560, 619, -680, 749, -827, 911, -1007, 1115, -1239, 1381, -1545, 1738, -1971, 2259, -2619, 3092, -3745, 4695, -6231, 9137, -16664, 84864, 169514, 125717, 132743, 99556, 89624, 68809, 65280, 48787, 43945, 43682, 42512, 34692, 42314, 37215, 39620, 37019, 33835, 35317, 32877, 28688, 35634, 30532, 33254, 39901, 39377, 40838, 44330, 43494, 43448, 36472, 37450, 33445, 22930, 24691, 23075, 15046, 19463, 20850, 19879, 21523, 22836, 24988, 18869, 15725, 16494, 4508, 858, 2146, -7343, -5110, 1342, 1895, 10731, 19756, 29142, 36984, 41330, 49167, 48795, 44460, 44489, 36051, 28883, 24349, 16233, 16332, 14425, 13837, 23714, 27057, 32615, 43431, 46287, 50212, 52997, 50689]
146E0689k336p996n106o387j1992j408m413q358K848J87k278K392J149R90l067
161D914r79K062p754k235L116o872O18L850k512K635K943M56J084r62K455k781
177C8l232L295l629j112M988j369L244M390O00N029M12K31K200l688m93o91l500
194F713Q72r31J279M501L69N621M394n89M400j181m935j780o801o653o625p355
210h701k514n692r64L907j094M781P443L53M661K243o78k80m167j816l949n430
226a1897O50k440j354N591M98L680N990J457M450J010p22J296m217k334r26m661
242c929k46j012r0L190q4L464L987j147L793N80k063J765k330j733j09j545R23
259C414p42O58L375k412J377K252l873o1o31l558q27j797p8N58n66M402J368N68
$$ y = [50689, 48353, 40357, 35251, 28864, 16872, 15464, 11051, 2693, 5541, 5728, 3450, 5842, 6991, 7981, 4914, 3935, 5997, -1757, -3992, -876, -7748, -7130, -3280, -5792, -3157, -214, 242, 1326, 364, 2819, 38, -3194, 101, -3528, -4640, 348, -1021, 2223, 6613, 7213, 12242, 12654, 12885, 15085, 11397, 10904, 10213, 6713, 7585, 6654, 7933, 12434, 12803, 18424, 22818, 22229, 26629, 25448, 20513, 18733, 11932, 5279, -1346, -8701, -11215, -16907, -17871, -13964, -15058, -10277, -2834, -2481, 2180, 4423, 3745, 3465, -702, -2518, -6467, -11897, -11247, -13687, -15041, -9450, -8952, -5272, 718, 2175, 6625, 7635, 6913, 8209, 3992, 1658, 732, -3929, -4175, -5187, -5277, -2087, -2171, 1293, 5280, 4133, 7926, 8506, 6443, 8208, 5878, 4145, 4036, 2491, 3414, 2672, 3330, 6705, 4293, 5670, 7922, 4049, 3988, 3357, -201, -1028, -2825, -2903, -2345, -2911, 1491, 2859, 3427]
277C427N260q43J2J796m627j374k637m600j105k962j90J785l00M152K627J672
293B093M427o2N2M89m587j524k867n170p33k684q97K146O32M398L105K060N119
310E997K99P72J664m018j154j662m158r41k060k3J457J95L813K518M88M289l80
327G096n38J220l199j653j135l175j9j848o16J437j251J817J169j312K047j447
343a407j536L01k921J98R2j612K789J150J001L822M67K380J157j339Q24k555k792
360A9m31m370j035L57k445J925J462Q48L037K13K077J70j725P34k986k315L31
377d134k927l10J789k24L623K649K194M282R81J894J188k336K51k465l524k79
393B652l055q49P26r15L061J351P63K956j37R02k54k789J2k784k902J01k377l27
$$ y = [3427, 8687, 7844, 7856, 9652, 5025, 3651, 1014, -3586, -4691, -7653, -7843, -6058, -6358, -2206, 421, 2093, 6520, 6458, 6510, 6999, 2412, 888, -1979, -7149, -7882, -10566, -11463, -9317, -8685, -4287, -1182, 878, 5997, 6296, 7068, 8732, 4714, 3560, 1898, -2260, -3201, -5261, -5284, -3827, -3632, 181, 2699, 3187, 7476, 7096, 6558, 7778, 4579, 2926, 1791, -1384, -1403, -3251, -3867, -2430, -3681, -1864, -695, -2007, 40, -1407, -2943, -2642, -5563, -5365, -5273, -6885, -4096, -2946, -1945, 1877, 2344, 4724, 5881, 4542, 5366, 2811, 19, -412, -4782, -5817, -5460, -7905, -5980, -4518, -3670, -633, -420, 1657, 1827, 102, 836, -2150, -4465, -4134, -7061, -7371, -5582, -5806, -2183, 466, 2660, 6942, 7923, 9817, 11005, 8669, 8920, 6455, 2931, 2652, -403, -1252, -526, -1441, 1620, 2971, 3734, 6690, 6553, 7455, 7201, 4412, 4424, 1640, -1262, -1161, -3538, -3865]
411c865J564l26K276J690N00K383p80L16K02k545l02j806k255J320j491K14K097
428h08l90J842J008o57J276k263j300p51l855n91j147k239J503j44J419L150J010
445b937L075J795M62K163q89n64O15k777O65k67j012K199K90J064L036J03J605
462H626Q51j042O21k091j770o00k544j97J13p71K725L58J407K959J05J484M54
479A0688j999O6k572j911p50k760k67k81r59K115K45M94K687j117P93l40k190
496A942o21k401k027k94k530J08N97k23K247M99Q82J622p75J81m81k281n60j895
514f010j083J47j062Q40K319N55L031J059J211K154r29K3m81k718n13k352j363
531e172M53j942Q05J412p36K524N74j5J460j210o80o4k439O12j023n21J305l77
$$ y = [-3865, -2301, -2627, -351, 1339, 1839, 4222, 3442, 3758, 3960, 1415, 1113, -693, -2948, -1628, -3119, -2905, -808, -1198, 644, 1652, 995, 2271, 8, -1292, -2043, -5898, -6489, -7636, -9875, -8372, -8516, -7097, -3947, -2937, 138, 1933, 2395, 4558, 3669, 3105, 3720, 943, 1608, 1341, 329, 2528, 2818, 3882, 6918, 7021, 8626, 9477, 8435, 9056, 6965, 5195, 4595, 2051, 1854, 1967, 1196, 3921, 4279, 5686, 8645, 8750, 10234, 10688, 8689, 8755, 6183, 4272, 3522, 762, 495, 214, -745, 1370, 1615, 2109, 4796, 3679, 4472, 4132, 1942, 1321, -1080, -3107, -3401, -5931, -5823, -5226, -5449, -3202, -2703, -1821, -199, -974, -793, -1274, -3555, -4115, -6010, -7093, -6946, -8008, -7168, -4849, -4294, -1263, -204, 1007, 3161, 2232, 2255, 1774, -944, -1457, -3809, -5172, -4719, -6661, -5856, -4444, -5180, -2656, -2082, -2097, -637, -1847, -2527, -2591, -5030, -4418, -5441, -5962, -4657, -5034]
549e034J638J975l42J972n4o72J51k031j152j117k674j39j071o60J655J42J269
566f144J676J33J844L41q15R05j372o84L0j681J013N78k82K518P03J710J335l63
584A445R97k71k046n87k498j686o34j985L51m2M78K045N09J208J955q79O51k55
602a244k230l06k230j448l69j334Q59O26M27K557J039J403K254l63J233q03j483
619a412L30j810q80L06j241R00O88l15K089l22L25Q65j719l4r71j771p1j417q78
638g338J109m82J189Q35L91J930k97o0R35j150m30m75j216M85m60K86J160K36
656c352J576J445l40J501m06j035K51k284j104m52j951P55k33J45K037N12J767
673a168J652n0J633q80q79j89k742j169r11j971L01l44J73J854L68J685J329K45
$$ y = [-5034, -3396, -1421, -1763, 209, 155, -517, -366, -2397, -3549, -4666, -7340, -7479, -8550, -9210, -7555, -7413, -6144, -4468, -4335, -2491, -2150, -2965, -2060, -3432, -4116, -4086, -5767, -4754, -4176, -4458, -1940, -1237, 473, 1808, 1445, 2442, 2171, 125, -462, -2960, -4646, -5280, -7265, -6914, -6956, -6478, -4433, -3924, -2716, -761, -1640, -989, -1244, -3474, -3780, -6010, -7458, -7827, -9161, -8302, -7676, -7249, -4692, -3653, -2250, 4, -359, 874, 71, -1412, -1082, -2892, -3772, -3466, -4707, -3807, -3119, -3434, -1345, -1667, -1342, -477, -2196, -2230, -3201, -4972, -5043, -6460, -7338, -6229, -6711, -5522, -4687, -4296, -2366, -2663, -2723, -1788, -2938, -3368, -3843, -5059, -4574, -5034, -4748, -3588, -3352, -1776, -331, -671, 830, 424, -611, -360, -2644, -3748, -4200, -6151, -5396, -5629, -5484, -3447, -2935, -1168, 484, 434, 2067, 1187, 308, 119, -2623, -3792, -4703, -6674, -6373, -6717, -6544, -4690, -4322, -2637, -1308, -1063]
691a063J458n19r45j19j485r55j87j296M57K50o1K031L20J244R69l76J203p21
709B05j136M88k083m13l7j442O37j10j38J069o97K81K53j656J7j136j450n0j388
728h786J65O31m00J698R83O36J939J12K46O71j006L16r81o17K43n18L41J813n6
747b570J875J671M74J674m23J10m69j532n43j121j828K45r14O69J316J32J779
764E45J268M89J756l81o4k32j746p74r37j460K27r03K64J666r3J564R11O1J102
783C263o08j69l88j826l54p94j175L61m30M1R67k31J121O36p21J026r24l30l56
802h91j386J47j23o32O75M92L05J352l20P99M02j296K49r49q47l29j109q5K64
821c282l70J248M38N12J277l80M60K50j515K92j126n36L05q26Q04P39K53J814
$$ y = [-1063, 395, -124, -1069, -1188, -2673, -3628, -3815, -5111, -4654, -4404, -4465, -2434, -2114, -870, 99, -277, 926, 205, -931, -443, -2526, -2939, -2976, -4418, -3781, -3891, -4029, -2960, -3657, -3376, -3123, -4779, -4762, -5898, -7348, -7398, -8786, -8621, -7990, -8390, -6692, -5709, -5073, -3134, -3022, -2776, -2105, -3111, -2795, -3776, -4393, -4150, -4668, -4327, -2514, -2570, -695, 976, 1450, 3124, 2701, 2811, 2342, 810, 267, -854, -2682, -2437, -3351, -2682, -1366, -1234, 545, 1813, 2302, 4058, 3677, 3613, 3381, 1635, 861, -76, -1536, -1309, -2212, -1948, -282, -375, 1189, 2100, 2161, 3263, 2655, 2486, 2098, 272, -82, -876, -2051, -1690, -2120, -2079, -1112, -1343, -222, 414, -307, 719, -205, -535, -891, -2277, -2130, -2253, -2885, -2210, -1718, -1413, -61, -381, 418, 820, -476, -227, -1176, -2023, -2352, -3461, -3546, -3282, -3652, -2404, -1966, -1454, -177, -557, -97, 153, -1362, -1070, -2196, -2732, -2427, -3253, -2449, -1710, -1457, 357]
839C57J131P91J371j85K08k93j659j77j809j327N1j536L03N62j89J663L16M83
857F1J310k98L78M2j298J51j113n55J39m93L69Q16p7J892K44J33J130p06L96m15
877B106j181j32p15p84O35q17M77P14n82R21K5l87O66j060m05k42r73j14k90n28
897b666J468j09P10R52L3Q66m3o60K66j006p17m71j305J29j86n7J145l05J193
916g63Q41m6N03k81o99o8j317j073L19j577O29J62m0J394O92J110J289j36J065
935B004J99r53L82p58q97L43j128M10M12j02J519l27P18P35m31M49m00j310K71
954A136j085r23K57q61M90M02j42J092N34J76O21n06K68k73j161N03o52m07L91
973a40l70N49P47q3J003j32m6M68j078k84l81j472K90n62q43Q06N3K50J323k33
$$ y = [357, 1488, 2279, 3650, 3465, 3673, 3380, 1721, 1544, -265, -1592, -1541, -3077, -2774, -2212, -2401, -738, -422, 61, 1371, 1073, 1451, 1493, 195, 346, -767, -1322, -1183, -1676, -1307, -491, -568, 1324, 1568, 1701, 2831, 2125, 2521, 2106, 925, 793, 78, -706, -71, -888, -411, 303, -279, 642, 667, 280, 946, -114, -519, -761, -1734, -1848, -2138, -2666, -1198, -1307, -597, 355, 388, 1254, 1211, 551, 817, -189, -906, -1377, -2682, -2553, -2739, -2796, -1651, -1956, -763, 78, 32, 535, 254, -445, -513, -1830, -2903, -2584, -4161, -3532, -3370, -3410, -2016, -1324, -214, 1075, 939, 2004, 2203, 1250, 1632, 874, -23, 320, -808, -398, 14, -88, 1431, 1104, 1822, 2557, 2126, 2575, 2175, 865, 1136, 51, -872, -615, -1476, -986, -584, -726, 366, 900, 1076, 1697, 1191, 1459, 1186, 25, 528, -124, -531, -140, -510, 39, 786, 703, 1706, 1574, 1528, 1996, 918, 634, 253, -1219, -929, -1491, -2334, -1528, -1475, -1225, 98, -135]
993a35J314k73o6L29j289Jn00r06J76p30J27P53n01J213O43l61Q29j64o96k19
1013d55o51n09p45p74N23r8%J429L18J209J191J30R07k35p4M17j022k32l28q42
1033A59M34p3k38R69M08P5J34k3j16m24r23j10j361m29k52q88P86j98RJ231j78
1054a008K19N59n68N32m41q28M23p16j42O62o57J207M65J13J231p9K46R2k44j9
1074A047p95q72k3p33m09M93o11Q44K68Q8R78n34J02J45q21j52m40q17Q75q34
1094b201J09J084K28R56P17L13J083j38p5N06j201k67j72j072L36m26j94N80m62
1113b96O36K98k30P27n39k59J32j221n2m71k78O86l52M53N06K58O38N81m23P37
1133A531n72l50k03j236l4m8r74P62o4L92Q39m15O59M96o11P20p98o49M70j016
$$ y = [-135, 1179, 906, 840, 1169, -120, -119, -619, -1525, -1349, -2079, -1952, -1199, -1700, -487, 156, -205, 624, 460, -236, -455, -1106, -1615, -2360, -3134, -2611, -2709, -2709, -1280, -962, 247, 1438, 1568, 2475, 2240, 2166, 2583, 1561, 1329, 1001, 159, 593, 520, 282, 1251, 1659, 1734, 1868, 1845, 1729, 1305, 382, 272, -1089, -1518, -1770, -2658, -1872, -2070, -2061, -830, -1008, -789, -230, -798, -266, -707, -1535, -1112, -1828, -1970, -1308, -1965, -758, -293, -180, 1051, 972, 1218, 1310, 1066, 1047, 252, -620, -643, -1376, -1785, -1292, -1903, -1059, -791, -703, 275, -259, -157, -12, -833, -985, -1425, -2242, -1367, -2201, -2092, -1008, -780, 176, 893, 1206, 2289, 2151, 2076, 2582, 1381, 1114, 942, -130, 206, -220, -414, 166, -296, 340, 638, 408, 1135, 596, 337, 469, -752, -804, -1275, -1553, -867, -1219, -766, -260, -2, 636, 1217, 794, 1531, 959, 609, 406, -830, -864, -912, -1886, -1124, -1188, -796, 43, -372, 287, 783, 172, 892, 94, -555, -85, -1101]
1153a101M86n14K0R44J45K65J279l05O69N57q92O74q46m30J90j057J06J12n30
1172b28P71L62o8O57n67K26J87r19j34m68n45k43m97K91K00k60J028K67M06P48
1192A214j35L53J01o87N0n59r3L7p14N01L67J62M35l4K63N49r91k03k49j167K32
1213e68q16m52L37m13O32M01J0Q38L15q1J026q86K67n4r75J22m30J62J20J17K61
1234f7Q44l42P02J06k48O39j159o3k36j042M9q9o51J194l08N68L63K5N17q1k07
1255E14L58m75q8l50p30L35L46k76M61J74N32L49k81M24l27m34Q3q84p06J83j082
1276a874L80P9p7Q28j31N00K08N7M15j97m81J60n59m68N17p18Q64J43l43J165
1296D68K89M5P51o77N78p97q17J63m73o56L46p02M85K22j16R63k49K46M77o57
$$ y = [-1101, -615, -1129, -1109, -165, -20, 245, 1524, 1219, 1888, 2445, 1553, 2227, 1381, 951, 1141, 84, 190, 302, -228, 543, 905, 837, 1494, 927, 1153, 1340, 421, 287, -181, -726, -969, -1466, -1175, -975, -1235, -207, 60, 466, 1214, 1079, 1432, 1533, 846, 896, 337, 244, 281, -433, 68, 435, 597, 1032, 998, 1261, 1810, 819, 616, 367, -800, -568, -1384, -1836, -1499, -1912, -1280, -879, -869, -31, 284, 203, 1229, 343, 610, 556, -419, -297, -727, -565, -445, -328, -67, 777, 435, 1137, 1243, 995, 1634, 475, 412, 176, -866, -817, -906, -1557, -363, -671, -103, 260, 285, 802, 721, 514, 872, 397, 309, -41, -771, -436, -90, -366, 95, 269, 801, 1150, 869, 1293, 966, 532, 615, -269, -975, -792, -1874, -1494, -1415, -1492, -664, -795, -295, -87, -30, 385, 188, -293, -133, -692, -1160, -643, -1361, -497, -354, -697, 468, 757, 802, 1553, 876, 1454, 657, -160, 3, -470, -1126, -780, -1482, -997, -775, -891, 72, -177, 69, 546, -111]
1316a11M6j67p52K87m39k28P99m38M77K83L95Q61n81M2M16o84k18k37n99o7p59
1337a674k47Q31o06L94O14j61N17k27r3J33o07P4k57k85j07O2J49Q11l54P51Q00
1358E18l61P98k62k28L05n88k73J65q39L62k35l45R39n06O42J92k06K76m24l85
1378d55N14j282M0J81m56L94L96j39Q93j9K57O04j43M39n76n73K21n08m2j04k62
1399f20M29J2j63N77K0J80o2n15R9l72m62K38j099J88M00n42R46m1K05P66K60
1420D44m3K26m13K3k33l52j6l20J8J26N1O58J98j76N58l12J74j58n33j84j24q55
1442a243j03k75L11M06k25L89O15mL73P4r0J77o21K30k00l83L24n5n0N14j22Q32
1464H74N2j02K13l59j14k70m86q1j04n91M92k3K34K01q3O25L40m09M74l96r3R0
$$ y = [-111, -65, -232, -984, -697, -1136, -1364, -565, -1003, -526, -243, 152, 1013, 432, 474, 890, 206, -12, -249, -848, -915, -1674, -1921, -1090, -1696, -1302, -688, -849, -332, -559, -652, -519, -1126, -1052, -1309, -1594, -1701, -1639, -1490, -679, -1033, -282, 518, 157, 955, 693, 465, 770, 182, -91, 74, -765, -403, -638, -983, -44, -550, 92, 284, 78, 354, -70, -455, 59, -1223, -1183, -1002, -1458, -1064, -668, -807, 86, 67, 324, 928, 785, 1224, 648, 75, 296, -212, -254, -358, -620, -191, -179, -342, 235, 255, 435, 373, -142, -43, -415, -877, -639, -1738, -1550, -1150, -1692, -746, -787, -582, 184, 444, 401, 627, 214, 237, 4, -348, -364, -684, -666, -540, -489, 169, 367, 191, 749, 437, 611, 453, -80, -264, -388, -1243, -1346, -1621, -1310, -904, -1129, -740, -125, -129, 244, 318, 228, 405, -216, 14, -186, -569, -245, -300, -350, 164, 42, 874, 926, 824, 1037, 678, 564, 294, -192, -273, -377, -968, -476, -499, -265, -64, -147, 478, 818, 409, 883, 487, 394, 484]
1486D84q38N25J1n61P08L99N0M07J77J25J74n88j4l02l60j66n99l6q2j45N63M72
1508D04k06K83O3M15Ll86L7j38q17R6k87n9L58k76K85K42K76M55j57K63j43l02
1530D09l9l48m32O3o47L88Q4m12Q71n2nM44r5k54L99m58J40l58k14J03j34o9M92
1553a24rL21k2j45P37m55K3j42n01p5mjK47k45L65J99J45K90L8j70M73q82L79
1576D42k66r4J66m15K32L24jN51M45p2M15J7m13N23m85m32q1o15J27k03l53N83
1598C95R5P1L23k87K85L01m80J0n49j30j56o22O1K41k49M57L50j16P83k61K88
1619H10J77l55j8m09j16J84m47K3K6K37J34J74r3J30m29M17j5n54M56n91k99N50
1641hj25J23K14J7M50Nq6O48l07m6k31l49K81n34k17L01k65J76J03RL42m9k47
$$ y = [484, -354, 171, 182, -379, 329, 728, 778, 1185, 1362, 1487, 1661, 1073, 1059, 757, 397, 231, -368, -404, -486, -631, -68, 404, 198, 481, 544, 959, 962, 576, 613, 475, -342, -246, -533, -592, -234, -510, -225, 17, 293, 748, 591, 854, 711, 409, 370, 22, -410, -347, -994, -606, -522, -934, -63, -115, -120, 324, 229, -25, 374, -84, 56, -302, -516, -413, -547, -616, -124, -133, 188, 166, 21, 758, 303, 326, 184, -317, -392, -396, -397, -150, -395, -30, 169, 314, 604, 642, 472, 945, 63, 442, 176, 82, 248, -167, 65, 389, 388, 939, 1384, 1312, 1727, 1744, 1331, 1854, 1369, 937, 856, 241, 368, 165, -188, 395, 490, 561, 884, 597, 882, 1183, 703, 713, 164, 34, -122, -744, -683, -442, -691, -234, 116, 0, 783, 522, 810, 987, 632, 614, 205, 89, 273, -174, -151, -125, 112, 246, 420, 327, 457, 28, 445, 430, -124, 332, -259, -558, -8, -133, -10, 204, 221, 671, 676, 590, 1238, 931, 885, 654, 305, 586, 52, -165, 136, -129, 47, 150, 159, 501, 452, 205]
1664B05M28n36j39n8k65r0K0k59O36k02K72M99k02N15p3J88k08j15k67j71m61
1685b83o5k30K5K75j70M77N8K5K63j19r4j5k59j33op22L53j55l00N03j99N41L1
1708a99j21M85j19j53K02m63R5k22k05L21k64j57K03L49k05Oj38J73j68k94Q5
1729g89l46k38J35k66N51k57o2O49j98J87J07Q3N6l3m8J14j51k00L50m28N11N68
1751B95j97M35p1J33L74k18l46k75k68L2m48j64J66p5M09J95L07K94k3K5K63l82
1773D61K61l33l59K20M6k25k7J62L96L7j43N89l97k25j9l24J6n9o76L55l07j41
1795f92M02k99M51J86k33K54k26j0J39k73Km1j03L04m0K2K87k39N44P5l28J98
1817C80l92O8o4k76j20J82k77L2J2J33M26p8J33n7j05M6j02k27Nm03Q7J23J22
$$ y = [205, 633, 97, -42, -100, -365, -455, -435, -694, -58, -260, 12, 511, 309, 824, 751, 939, 731, 616, 349, 178, -283, -348, -578, -553, -278, -448, 29, 87, 112, 375, 256, 162, 147, -112, -245, -251, -973, -620, -775, -1075, -572, -771, -230, -199, -320, 165, 46, -107, 95, -368, -273, -495, -700, -379, -643, -800, -597, -248, -453, -447, -585, -412, -580, -874, -789, -1135, -1373, -1238, -1504, -953, -1210, -1272, -623, -821, -634, -527, -444, -388, -421, -469, -355, -506, -706, -356, -784, -273, 295, 98, 533, 462, 595, 969, 751, 405, 130, -138, -106, -554, -718, -552, -627, -218, -23, 284, 578, 555, 580, 843, 461, 722, 389, 30, 250, 296, 71, 44, 206, 602, 639, 496, 1085, 688, 463, 444, 120, 136, 77, -599, -244, -551, -692, -290, -589, -138, 48, -185, 69, -157, -167, -28, -301, -299, -340, -443, -139, -179, -157, 130, -109, 435, 510, 182, 380, -12, 56, -8, -284, -404, -222, -499, -467, -455, -322, 104, 26, 159, 102, -3, 43, -59, -286, -281, -684, -597, -474, -352]
1840c52K18P0Q5L9K94LL98l49P2O2j91j69m13J41j6J06j82K74N1K30k90J72J62
1863D15l46J36m39q0J76m81K15O9O7N82j98K39K65l25J43M05o46K43j30p1l68
1884a29R9j22K18j10N49l25J17k2k4j51k41j89j5l23j73L82j96M7J99j46O30l46
1906b71J7M79k53J80l98q0M1j58k65N35n00K68K57rJ92K44n32L03k38k29J8k35
1928f34J53l9k17M09j44L25O1K7K32J73l8J70l08J66k28j48K64nj65L55m25L77
1950C61K93k49L64j02k84J59k99j6m9k51j12M5j27L86j81MN53k74R0O2k68j3k56
1973a64J43k99j00J12M11k64K86n1p5K36r6j44j87Q0k59m04N0L90m97N60j29Q1
1995c20K46j22J36j64O4N8N5k89K22o6l18K49J98N2LO8N57l15j34L09P6m7l18
$$ y = [-352, -134, -64, 21, 60, 354, 357, 755, 406, 478, 540, 349, 180, -233, -92, -108, -2, -184, 90, 141, 371, 81, 253, 415, 69, 205, -234, -314, -138, -619, -404, -335, -268, 314, 116, 355, 620, 295, 438, 843, 197, 440, 310, 239, -129, -30, -152, 66, -44, 505, 180, 297, 275, 251, 100, -141, -330, -345, -668, -841, -459, -655, -608, -409, -555, 75, -271, -254, 225, -28, 152, -246, -326, -285, -443, -708, -173, -673, -405, -148, -157, 35, 279, -253, 50, -188, -417, -399, -634, -481, -520, -737, -328, -472, -147, -86, -59, 173, 346, 308, 478, 170, 336, 108, -40, 224, 219, 54, 409, -16, 361, 654, 405, 769, 667, 383, 542, 243, 227, 178, -73, -185, -140, -267, 119, -62, -58, 495, 221, 311, 373, 105, 92, -164, -21, -320, -420, -308, 103, -161, 125, 74, -1, 235, 139, -5, -192, -112, -371, -775, -725, -335, -832, -272, -401, -320, -74, -196, -60, -224, -160, -102, -47, -336, -114, -180, -498, -249, -51, 1, 4, 72, 629, 314, 180, 489, 565, 518, 200]
2018B00k54K11k05j42M2KM19j41J49J37M1Nk5n41L59j67k29K77k53L18J9k43L28
2041C07l8J29K11j87l77M50m23n6n3k18J10j10k5L08m76N72Q3l11M55l18o3j23
2063a53k26J21l7m96O18J0k35M22q7K96k20k3K22k81r6j84J09k17J99k66J42J70
2085b12j57J57j88Q1L11l57J44j07MJ5l28k51N23k08J04K21K17K63l54M3J18O
2107D5q9n9m3R1n83J35K93k0M43p0m3L84k91j36J8L0J83k56j75M10l12j67K08
2130dQ0K76K55m6p9J59k8P7j62N7j59k66J44j90J11J37q5j1K77k37J28O3k90J36
2154C43j61o9o2K6J62j76J56K22j5k57J62K5Q7j32P3J00l55M42l01o4K16j16J29
2177D35K61j92J08Q4l87L31l09J26m74J44Q1J23l46L30J07J27J5j70M79Q2k88
$$ y = [200, -54, 157, -48, -190, -148, -146, 273, 132, 281, 418, 459, 464, 439, -102, 257, 90, -139, 138, -115, 203, 222, -21, 307, 269, 398, 609, 422, 45, 495, 72, 16, -37, -255, -145, -255, -280, 28, -448, 124, 207, -104, 351, 33, -30, -153, -379, -258, -295, -791, -173, -163, -398, 24, -63, 233, 13, -10, 212, -69, -165, -349, -240, -457, -258, -524, -382, -212, -369, -212, -400, -319, -8, -365, -221, -328, -324, -309, -637, -888, -365, -573, -469, -248, -31, 232, -122, -79, 39, 45, -44, -103, -146, -55, -638, -503, -210, -230, 213, 143, 100, 484, 193, 57, 75, 105, 288, 32, -143, 267, -45, -212, -4, 76, 352, 607, 561, 482, 641, 613, 690, 528, 585, 426, 160, 304, 114, 225, 362, 277, 266, 543, 306, 434, 497, 207, 343, 182, 113, 51, 77, 239, 63, 219, 441, 426, 169, 331, 356, 443, 311, 384, 484, 129, 571, 270, 206, 422, 306, 435, 696, 504, 612, 696, 309, 640, 331, 457, -17, 127, 208, 331, -15, 315, 422, 549, 564, 394, 873, 955, 667]
2198F67J07j08m3J70m39K14j78J34K11M7k5m7n3J48j28j52L4j54j85N6k13J76
2220B39o3J34N2o7J06J93m91K02J37j09k06J37k56p5J67r6J46J03j10P6J9J36
2242C74k08L6Q6n09Jk3L4J64l07J28j20K47J35p9p9L12l76J92j90k01L52k26l6
2265b93P4J70k16M06l12K21K67l21O2j94j00J01l37K10L4q0K02k42L76j04K2j53
2287b07M35k69J41k58j2p3J5J86N2j66L55m32L51j04K99Q5j61l3J91l72j57n6
2309a90j86J31O2p0L49m09J59N5j36J80j25nJ11l12N0O8l50L84j46L88j65J97
2331D0o1K42l29j7K66l61J8J5Rp2r3L67Lk58K88K6p3J77k60k8J07j92J18l25j47
2356e40L67j95J40L36m85K84J35O6J44k01O4l35l4kK9J26P5j54L76p5n2p3J76
$$ y = [667, 774, 666, 623, 793, 354, 568, 390, 524, 735, 782, 757, 710, 657, 805, 677, 525, 559, 405, 220, 276, 63, 239, 176, 310, 362, 295, 401, 594, 103, 305, 442, 333, 127, 264, 8, -67, 100, 4, 150, 253, 143, 219, 238, 374, 166, 202, 288, -221, -220, -243, -209, -45, -352, -224, -344, -97, 38, -41, -120, 192, -184, 8, -182, -383, -31, -257, -293, -219, -49, -265, 141, -171, 50, 317, -4, 58, -136, -236, -135, -472, -262, -228, -308, -106, -348, 28, -76, -54, -207, 228, -41, 100, -158, -170, -243, -228, -42, 10, -156, 199, -233, 118, 14, 313, 398, 237, 204, 395, 23, -134, -190, -376, -245, -183, -253, 96, -313, -154, -99, -235, -55, -180, -185, -74, -386, -336, -268, -618, -234, -380, 8, -157, 40, -21, 221, -108, -125, 141, -220, -202, -187, -178, -250, -343, 24, 27, -231, 57, 83, 10, 187, -73, -101, 6, -186, -68, -393, -540, -173, -368, -228, 108, -377, -93, 42, 108, 252, 51, 115, -220, -254, -256, -227, -101, -26, -180, 196, 121, 69, -4, 172]
2379A72j35K21k14K8J15l98L69k02k72M92j40l8L51m89M63l87Q0L5k29K26k26
2400a78j39O2L02p3K58l45J48K29l18J72p2N3l25L79m30M01l58J31R5j80K19J9
2422E0O3J05j66J55j52j58P3j35J94o0m6J87o0j29J40n1P9O6M5r1J99m61n5J51
2446e7r1kk3J54P9m7K67m01L61n7J53j88J88j81P6j48RR8j53K81r1K38L2l17j63
2471A7J81k05J15n8K80j43k28L3P9j11J51R6J48o8m09J47J09j89K9M8l02L01M9
2494G0k07m4J4J47J62q3O4l6j64p8m9j17On8J14m2L5K73j76L88p1m07L61l35L84
2519A51j48j15J2O4o3J38M5K79M4l13k4K01j17J19j61qQ5j16K69k34P9J07k05
2542H9P8L4J64L9j42k8Q8l01J6K06k00o4n8K23O0j4k52M23J11Q6m17j09K16O1
$$ y = [172, 37, 258, 44, 72, 187, -211, 158, -44, -316, 176, 36, -2, 349, -140, 323, -64, 16, 51, -178, 48, -178, -317, -255, 47, -26, 232, -113, 35, 264, -54, 118, 46, 99, -226, 153, -277, 124, -234, -103, -8, -188, 31, 50, 113, 218, 52, 207, 55, -103, -30, -165, 29, -31, -77, 110, 50, -79, 61, 10, 89, 155, 200, 109, 308, -153, -208, -57, -148, -150, -173, -19, 60, 13, 280, -121, 240, 183, 336, 148, 336, 155, 231, 83, 92, 190, 37, 318, 227, 465, 497, 180, 17, 198, -7, 108, 50, 330, 187, -41, -8, 71, -40, 111, 207, 355, 287, -122, 25, 134, -55, -26, 22, -280, 21, 70, -137, -181, -167, -20, 142, 59, 123, 87, -77, -155, -204, -321, -315, -373, -259, -301, -266, 7, -169, 219, 148, -259, 102, -233, 151, 3, -112, -100, -36, -99, 39, 84, 363, 407, 94, 70, 271, 154, 273, 112, 104, 189, 73, 342, 108, 187, 294, 89, 167, 201, 365, 404, 262, 234, 322, 21, 37, 243, 43, -21, -79, 144, 204, 190, -62, 361, 472, 558, 141, 32, 248, 309]
2566C09k61K53L3j86Q0j13J5NJ6Rj49J66j49j36p3L2R6O4j72O9r0J30J42j71K6
2591e5j46J08O2n7J63j90l1M9k97K33j96N08l43K76m9j79J64L7k58K16n4k85J03
2614b21j17K75L9J41j48L7O7k27R1M47l67j74M55n62M42j97QJ19o1j13P8j83L7
2637a34Kj78K74J65n29Q4L29l9O4j22Q2R8j09J03J32k49J61m4o1j62J52Q8j79
2660g2j49L97k17J41j53o0J33j75L34Jn44K17j33K5j78n2J62RJ04k3P2J24P5j44
2684a06N2j60L08n00N12k30K87l24J42M1j25O5J8jM8J21J01m18M28J40l37J75
2706B37m4j27P8k43J86J74p8k64L54l39L14k33lk04R0J24qL60j36k33j6J98j29
2729E8K41j29p0j71K0P4J30j50J57L9M8n2j54J53K03l59l9K14k15J82j28O2k14
$$ y = [309, 48, 301, 334, 148, 228, 115, 130, 135, 151, 160, 11, 177, 28, -108, -181, -149, -53, 11, -161, -92, -182, -52, 90, -81, -55, -201, -93, -31, -88, 75, -115, -146, -97, -394, -161, -357, 151, -192, 84, 35, -144, 20, 57, -201, 15, -39, -324, -221, -338, -63, -24, 117, -31, 6, 73, -154, -63, 384, 17, -157, 298, -264, 178, -19, -11, 108, 47, -66, 12, -171, -134, -132, -310, -36, 129, -400, -316, 13, -26, 38, -84, -2, 96, -13, 90, 222, -27, 134, 90, 29, -133, 19, 107, -72, -221, 176, -41, 100, -53, -113, 20, -155, 179, 180, -364, -147, -280, -255, -433, -485, -323, -314, -210, -233, -161, -37, 38, -106, -54, -214, 94, -406, 106, -124, 163, -161, -19, 22, -103, -38, -20, -21, 27, 148, 249, -169, 259, 399, 62, 237, 193, 66, 144, -99, 87, 261, 183, -81, 273, -66, 248, 15, 12, -192, -102, 22, 14, 374, 238, 5, -11, 187, 58, 299, 170, 100, -71, -51, 23, 153, 3, 160, 199, 247, 195, 41, 194, 397, 38, -1, 213, -2, 180, 52, 114, -100]
2752a00k16N6K20r8K61Q3k12M5j49j51K69k20N1K64j41O9r9p1R8n1K20J39j83
2775H4k60K33M3J06m25j61N56l4m04K54L7o2J87k20K7j2K13k6p0j35k5n6j00K12
2799c8n7q7K09k60J19m8L12k78J09K07k87J0n6rJ09o4K89k74J33O5k4Q8j28K0
2823F0O5j55L18m3j57J08j4k56M75j16m43J84J94o9J5k14J2J29r5J41k44L06j38
2846F3k97L17%j41P0j1L0k49J14K48m27j17N84k72j24J48l39J13K76l46J94L73
2868B07k26j4j93K08O6l14M9O5J46J17R2q7m01L18p4j07q6No2K68P9k04K73r7
2892B8j15K78m7N6l33p0K21J4j56j14J58l00M22pJ81j33O2q5j45Q9O5q9n9L19
2916B40k40M5n9P1K03k33J30k02J74J58nm01J90k43J23j13K25k18j21J93L17j20
$$ y = [-100, -316, -260, -40, -138, 123, 206, -6, 39, -110, -261, 8, -212, -161, 103, -38, 31, -68, -139, -41, -92, 128, 267, 84, -176, 57, 100, 206, -219, -380, 176, 142, -262, -8, 29, -33, 154, -66, -39, -51, 162, 136, 66, -69, -94, -150, -250, -38, -95, -182, 27, -233, -114, -162, 150, -128, -19, 188, -99, -89, -145, -154, -45, -109, 180, -94, 39, 104, 80, 168, 40, 60, 125, -30, 288, 245, 88, 196, 182, -74, 401, 285, -158, 26, 220, 151, 166, -48, -36, 93, -2, 139, -105, 201, 63, -234, 83, 83, -58, 12, 1, 31, -218, -104, 144, -283, -400, 184, -88, -212, -64, -403, -290, -14, -360, -166, 207, -19, -33, -226, -18, 48, -266, -217, -152, -6, 111, 203, 116, -285, 33, -41, -148, -234, -229, -291, -23, 56, -148, 125, 28, -87, 191, 144, 200, -133, -203, 18, 32, -124, -238, -80, -380, 42, 35, 216, 83, 145, 60, -85, 4, 69, -20, -79, 240, 0, 45, -14, 57, 260, 27, 157, -45, 129, 287, 282, -119, 71, -172, -49, -162, 63, -155, -276, -83, 234, 114]
2938A14p5J2K34j91k20j7Mm1L44j86j02k6Q7K56l79L13J06l39m4L10j54J6j42
2961a20PR3O1j99J12j99M17o0k55K33Q3j76J88m39J85M6j72J87l70N42k15J29
2983G8j44P1J33m2j85K13J17n00K03j62j2K83k4J23p3l45L50k14R6K0q7Nj27L57
3007A34k69J55M8j69K20N7K2J18m79K50j31J07J3r2J6j88N8K33J4j02N9n6K34
3030B52m47M72k43J54k47J69k66J33Q8J30m8k05K71L2j96j69Pj56K29j82K02n0
3052g0rJ20L1n8j54qJ25L4j92J22j58J81q4k02L15P1m78K88p6J9J70l4j97K32
3076a2l73M19o8q3K72m23J84K28k25K01q2n5j76J07K7J96l18K34l49K04Nr6J01
3099h2O6j36Q1J44J6J75k60M0J14k19K05O3j13j39k27L93N0j22j09Q0k40N06l37
$$ y = [114, 39, 51, 285, 94, -126, -143, -139, -180, 164, -22, -124, -150, -63, 193, -186, 127, 233, -106, -150, 160, 6, 22, -120, -113, -20, 41, -158, -46, -245, 172, 112, -143, 90, 173, -3, 185, -254, -69, -23, -195, -8, -378, 164, -51, 78, -66, 5, 138, 96, -89, 124, 241, -259, -56, -218, -230, 53, 29, 152, 79, -266, 84, -130, -34, -14, -101, -96, -223, 134, -135, 20, 68, -101, 119, 176, 198, 316, -163, 87, -44, 63, 76, -16, 0, -188, -130, 103, 117, 15, 74, 18, 252, -195, 277, 34, 188, -59, 110, -156, -23, 65, 195, 147, -58, 213, 245, 49, -120, -113, -269, -40, -222, -20, -70, -79, 41, 72, 14, -140, -148, -23, 11, -181, -59, -217, -36, -120, -322, -7, 64, -414, -126, -202, -183, -13, -47, -244, -12, -385, 34, -34, -117, 155, -268, -84, 144, -81, 120, 38, -17, -193, -86, -59, 137, -181, 53, -296, -92, -87, -183, -82, -16, -152, -71, 73, 89, 264, 4, 44, 158, -61, 144, 207, 94, -45, -272, 121, 171, 49, -60, 20, -220, 286, -51]
3122e1O1K01k55O4J3q6n4J07k71J78K6j45K12lk5Q4L6k51J76j79J8q9Q7o4R9k8
3148a39j24J21l39L34M41l62o8K00m06N23k58J06p3l60L26K51k92RJ62j68K68
3169A52j15Q5R6k50j20m8q7L77J7j49K50m65K58O3m73J52J24L05j47m50N13j17
3191b9j95K4R3K43K16k68j09j8PRJ05j48j58J6K82j18J24o7J05j39j98k7K36j36
3215a50Q7K48k64q0K03q8j4J25k72R7J11j14J57j73Ol8l5K70l04J00J15jp6J9
3239g1j58J18j01L84j56r2j9k00K48o8J41oL35k27j0%m8l00J21Q2J82m18L66q6
3263A7j44M4j49J15L9mQ6J92j31j94Q9q1q2k7M5j5m3p3L22k33L81m59J27J54j05
3288a29K28j78J56j47k3J63o6J42j38J26M8j5Q1o4m3J5n1jo0M7j7Jk8r0N6k54
$$ y = [-51, 10, 211, -44, 20, 33, -53, -107, 0, -271, -93, -67, -212, 0, -3, -28, 56, 92, -159, 17, -162, -144, -233, -146, -210, -111, -139, -263, -142, -481, -147, 294, -68, -136, 64, -342, 181, -77, 29, -44, -404, -78, 173, -119, -110, 52, -116, 152, 37, 122, 218, -32, -152, -200, -287, 90, 107, -42, 208, -257, 1, 64, -409, -257, -133, 172, 25, -425, 88, -29, -224, -200, -107, 136, 352, 84, -25, -43, -36, -27, 78, -70, -228, -212, 70, -48, 76, 9, 114, -25, -223, -250, -14, -150, -63, 185, -79, -159, 44, -44, -58, 67, -205, -108, 3, -111, 46, -127, -121, -159, -194, 76, -228, -128, -13, -14, -90, -71, -229, -111, -212, 172, 16, -76, -95, -295, -47, -115, 26, 20, 355, 128, 118, 118, 70, -230, -109, -27, 155, -263, 103, 17, -127, -83, -232, -117, -78, -82, 4, 196, 65, -129, -40, -121, -203, -230, -185, -200, -243, -316, 6, -227, 154, -305, -178, -24, -129, 99, -79, 77, -70, -93, 70, 4, 146, 8, 134, 182, 167, 248, 184, 141, 156, 105, 104, 44, 91, 74, 75, 47, -43, 13, -241]
3314b41K4K09k32J95j95J66%kj2J6Rl9L2P9K09l3k08L51l66J27R1k84J74L02l21
3339E1J6l3K6J06l55J99O1k41j34N56r6j33oN1j66o1J90l16L20Jj7J73l48L15
3363A59j57J39j55R9q9j32J96m22L65K10k34K97l65j9J18k33K53%k45K29k21K01
3385fj5j73J88P6k04m9J91k18K67J32k95n0O8R6j71L6j00k6J54M7O8k43K2K46
3409D1kj44J93j66q0J36q8L1qL1J97k11L7n9p8O0K51l08K1M12k67P7L2K2k09K49
3435A70k04M8J00o5k05J12O0K9l1l36M39p8k18L34r2k45J32K07j64k1k22J65K04
3458A19l0q3j62k61L16J62k34J14j63M08n1j8j52k93K58L2M8L2m01J26J05m9J73
3481dK0j5J57k50J45lK6K5j20J06l47K44K03k85n7K12J15k63K08j03O6N7J06l69
$$ y = [-241, -217, -8, -240, -45, -240, -74, -74, -76, -88, -72, -63, -102, -70, 9, 218, 185, -23, 328, -38, 89, 180, -104, 70, 372, 51, 67, 34, 60, 166, -189, 10, 71, -170, -304, 252, 156, 23, 17, 68, -98, -159, 31, -285, 35, 36, 19, 192, -156, 159, 2, 141, -14, 85, -4, -136, 60, -362, 3, 213, -21, 276, -89, -108, 10, -223, 30, 30, -215, 14, -207, -6, -21, -194, -6, 70, -134, -183, 8, -210, 57, 189, -106, -156, -88, 8, -163, -127, -227, -253, -99, -52, 16, -227, -205, 41, 39, -105, 88, -78, -158, -22, -110, -79, -87, -56, 141, -70, -33, -92, -170, -110, 141, -167, -146, 266, -1, 76, 108, 130, -79, 170, -34, 14, 114, 49, -156, -44, 16, 45, 14, -322, 117, 39, -179, 155, 63, -182, -50, 157, -7, -28, -250, -85, 119, 89, 6, -156, -417, -101, 61, -173, -59, -222, 186, 135, 117, -35, -328, -70, -38, 10, 42, -359, -233, -128, -177, -4, 16, 1, 158, -92, 53, 50, 76, 101, -19, 87, -260, -16, 187, -98, -155, 57, 172, -91, 117, 14, 80, 137, 243, -126]
3505a26m9L42j54r4J53J34k17J35p6K15L2l61J00K1j18n7q4J52j95N08k53J11
3527A19j25O8j53R6J19p6R3l3j78k3M1j21K26j18R6k06K76n6j34j00m3J33J02
3550CK15k04j4J05j49l9k8J22K59q6k93R6J1J92j70P8k09j17K50r7P3K17J21l66
3574c0L58l9m55K64j55J52J68l8o4k06N5m3J36P8k71J27R4k5o8K26j42Pj23RK70
3599B85k25L3K5j39K41L1k96Q1L9oj30Q4L33l31J48rj3j50r1n0O5J72O3n3lj00
3625DJ47N3m64L93j81NLj50M65l21J04o7j41L79k96K27l12L05j48J15k15j7Q7
3648b5J06J41l92M22r5l44L21J3L5n7P6j65j3q5P0K33l30O0K22j1r6p4M06l46
3672G2k7j14O8J33k39J09l1J88l5K03j32l37J29k33N69j24l00P4N0K8k0L05j29
$$ y = [-126, -175, 167, 13, -81, 72, 206, -11, 124, 48, 263, 295, -66, 34, 55, -63, -120, -204, -52, -247, 261, 8, 119, -6, 62, -91, 5, 124, 48, 141, 108, -70, -93, -52, -173, 53, -65, 31, -175, 101, 45, -89, -189, -232, -99, 3, 218, 14, 0, 105, -44, -83, -111, 11, 270, 184, -109, -13, -2, 190, 20, 98, -111, -228, 22, -75, -2, 215, 336, -30, 328, 289, -166, 98, -57, 95, 263, 225, 161, -45, 10, -33, 103, 181, -90, 37, 131, 106, 38, 264, 122, 129, 6, 15, 285, 60, 93, 118, -21, 220, 251, -45, 36, 75, 69, -61, 23, 356, 25, 173, 164, 151, 1, -90, -140, -75, 97, 160, 107, 104, 4, 151, 204, -260, 133, -48, -43, -40, -190, 275, -46, 58, -9, -150, 229, -67, 160, -152, 153, 5, 120, -95, -112, -25, 81, 222, -170, 252, 157, -187, 134, 147, 182, 125, 201, 36, 23, -62, 8, 241, -89, -29, 193, 182, 86, 12, 418, 72, 45, -69, -1, 132, -107, 2, -29, 159, 124, 327, 195, -142, -13, -246, 323, 199, -101, -27, 23, 51, 31, 336, 207]
3695B07j66J42n1J16q5j40j60J39P1lq9j89K75l6j52k7J83K3K3J05k5k20P6r3
3719g6j13L05Lm27L76J67l87K47K2j86j50K45m9P6O8o8R5l20J26j1M0m3Q6L11
3743C37q2n5N0m18K93l6j48J90J2k65K04L4j1J44r0kr1LJ28n2j0rJ7j20P9j73
3769g1K17k28K8K24l8j66K01P8m1j20m1J3j91j2K11M0j73L44o9M5j90q0J56j34
3793Co2L38k18K05r7pL61n93m0K83k64K53l50L81m5L1j22R6l9k28J15J7m3K2M2
3818C9l18N33m59K97J39o2k97R7j98L94j30qj52l2J1M60k05j20K60k28J9j70J38
3841HJ16j47j40J09L83j65M3l8k13J20J12o5k03k68K47K18N6k87J98N2l07M72
3863C01j99N0M2j96K72k92j46K36n8l05K17P4m6K50m91N27j79k94L74K7M8j09
$$ y = [207, 41, 183, 132, 248, 163, 23, -137, 2, 73, 70, -19, -208, 67, 31, -121, -148, 35, 58, 81, 186, 161, -59, 17, -76, -189, 116, 119, -308, 68, 235, -152, 95, 117, -69, -219, 26, -23, 53, 121, 53, 148, -172, -46, -57, -17, -60, 26, 337, 255, 200, 250, -168, 125, 89, -59, 131, 143, -122, 82, 116, 105, 249, 159, 157, 66, 69, 197, 145, 135, 126, 143, 23, 102, -71, 146, -82, -54, 170, 132, -34, 167, 245, 204, 84, 43, 56, -135, -147, 64, 104, -69, 275, 206, 251, 61, -19, 137, 3, -59, 279, 61, 266, 169, 162, 523, -70, -110, 173, -91, 162, -188, 193, 148, 179, 57, 153, 114, -114, 1, 18, -25, -3, 39, -279, 254, -205, 92, 231, 169, -128, -31, -229, 165, 35, 27, -125, -157, -146, 314, 109, -11, 249, 21, 40, -130, 8, 124, -23, -163, -54, 329, 164, 207, 169, -44, 76, 188, 123, -80, -348, -101, 117, 173, -114, 84, 136, -171, 301, 102, 152, 194, -2, 270, -22, -168, 68, 10, -295, -78, -4, -50, 200, -291, 236, 57, -237, 137, 164, 212, 103]
3885A03o4j59k3K59J20j34j94r9K12Q5j07L0O5j18K8K40j36j60j7P7J03r8K57
3908B70k71O4n9P5q1P8j33k61N50k07M9j45r0L30k24k26K57Q8k29M59l35L7j30
3931a34m4l5P5K29J7K1K5nk42K35o15M12j44M44l37o3K81J15n30L71j89k30L33
3954a0j84K24j59j71L57J0r5j3J45k57J97k57J93L8R1j86R2m1K70j96p6K61k36
3977cQ3k85M73j84n1J8j43J49mj33J40j66M12m00K66r5J00m37L15l0j91o0K37
4000A1j76N5J20R9o1P8k96j9M0j3J54%l9j02J38Q7O8j73J0j14P7K19k27l9j29
4025b32P0J1J29o1p0M10j56n3l17M69r7j00j36L24k4k45J03p4P0k01K12j14j34
4048b16j35L38J5l3J33q5L1Q0r6k9J81j42O8n2n4p9N7R1J00K48k76J1pj96j23
$$ y = [103, 39, -120, -143, 116, 236, 102, -92, -191, 21, 106, -1, 29, 94, -24, 4, 244, 108, -52, -69, 8, 111, 13, 270, -1, 63, 4, 79, -2, 76, -57, -318, 232, 25, 74, -71, -161, 169, -55, -281, -24, 64, -165, 294, -41, -4, -134, -178, -213, -138, 91, 108, 129, 154, 149, -93, 142, -473, -61, -205, 239, -98, -161, 120, 235, -295, 76, -113, -343, -10, -194, 30, -129, -300, 57, 67, -28, -41, 104, -153, 44, -213, -20, 18, 109, -77, 15, -26, 244, 48, -28, 233, -3, 80, -205, 268, 84, 33, 51, -92, 57, 53, -80, 60, -106, 306, -94, 172, 77, 177, -260, 55, 25, -166, -226, 11, -165, -110, 10, 109, 48, 126, -170, -189, -149, -162, -8, -8, -47, -149, -11, 76, 144, -29, -19, -133, -56, 163, -64, -103, -232, -162, -151, -22, -83, -153, 257, 101, 48, -269, 200, 103, 3, -133, 191, 167, -78, 25, -49, 21, -180, 32, -82, -216, -351, -13, 2, -31, 102, 17, 48, 128, 32, 3, 184, 42, 110, 58, 4, -75, -18, 73, 173, 421, 145, 156, 149, -47, -170]
4073a70Q2j44m5J16J59J5r3r2J75Qq1L7K52l32K35k47J07P5J29l21l7K12j99K17
4097E8j21P5j46k5J98j26N8o9l5J66Q4j29oJ9l3o1J28k50O9k7K92%q7J10j74m2
4123g4orp0K17l09M11O9l33J67o1K2j28O2q3J3R8J44k4k22K33J13k66K6k4j34
4148a68K24o1j31K05k9j41J00k2N9j58J50pj20J80k88L48j46j82L11r6J60j12
4170G6M3p5p2L87o45M52k93j13K12%J53O8k9j87m0j28L72l13n4J88o5j18K72j74
4194h3J93j93N2J0N7N1m58L28K77l02rk02K08p5j6J7J29J69k8j64K3%j8M4k85
4219b75K29j13J23J07j72n4q8L01l60M39k4m14K87q9J6j55L50R3j21j17j75L49
4241A37N9l25K3J83m7l15O8O3J12L53l58p1K1R4Mj87j06K31L18k91J30l4K5j13
$$ y = [-170, -88, -232, -277, -161, -2, 13, -80, -172, 3, 11, -70, -33, 219, -113, 122, -125, -18, 57, 186, -135, -172, 40, -159, 58, -63, 12, -134, -159, 39, -87, -29, -98, -133, 33, 117, -12, -18, 1, -32, -93, 35, -215, -146, -173, 119, 119, 32, 142, -32, -74, -80, -89, -159, 58, -251, 160, 229, -104, 63, 2, 24, -104, -42, -125, -112, -14, 130, 106, -116, 117, 230, -36, -10, -34, -168, 56, -5, -136, 69, 40, -101, -1, -23, 36, -122, 28, 21, -99, 81, -207, 141, -5, -187, 124, 28, 188, 76, 119, 44, -28, 359, -286, 166, -127, -240, -28, -28, 125, 193, 164, -23, -63, -191, 181, -132, -186, 2, -63, -181, 91, -83, 110, -83, -31, -21, 36, 87, -371, -43, 234, -68, -77, -279, -71, -146, -162, -145, -16, 153, 125, -39, -16, -16, -34, 10, -275, -46, -159, -36, 71, -101, -155, -243, 58, -302, 137, 113, -301, -14, -103, -87, -242, 108, 201, 80, -37, -212, 137, 196, -129, -106, 77, 30, -285, -217, -154, -42, 311, -47, -118, -97, -3, 1, -186, -292, -61, 257, -34, 96, 62, 87, -26]
4265b6J59j22K60m38N7Nq7L37p0k3j3j2j0j66J37rj48J28k52N03k59k07L00n2
4289hP6o7K28m16k6K10j06p2J78R9k40N1J20J62k64M6P6r9J4j26l4p0L54k81L49
4314A54j96O1j18L7R7p4J57n4J82m15J73k18K79l79M18j46k15R9J22LJl7P0j55
4338a54M16l59q8J69QJ37k31K10l22J4L99L7l39J12R4Qj2k19J96j64n7O0N4j22
4362a53K00k18R1l0o4R7J39k1j25L01l5k37q5J58j22p9K15J46l15L3P1L4R0k09
4386a18J53N7n8P1j62j09J51l1k8o6K65j26P0RN6l32K67k88L65j23q3j70J21k30
4410c39L12k01M32k57o1J92Nm17N07j12j31K86k40M0k24L51j00j13J53j51oR6
4432B2Q7L5L6j54k62N63l15k17L9L11m15J85P7J4N2M5N1k64J74r4n1k24M79j08
$$ y = [-26, 133, 11, 271, -167, -110, -105, -192, 145, 75, 52, 39, 27, 17, -149, -12, -21, -169, -41, -293, 210, -49, -256, 44, -8, 68, 1, 229, -187, -213, -3, -109, -181, -3, 96, -144, -93, 27, 189, -75, -29, 47, -52, -38, -164, -198, -268, 86, -195, 154, -42, 19, -99, -62, 35, -39, 118, 64, 246, -169, 4, -214, 65, -314, 104, -42, -257, -158, -36, -33, -32, -69, 1, -154, 262, -97, -185, -16, -8, 129, -102, 108, -214, -200, 199, 236, -103, 9, 103, 111, 99, -120, 76, -88, -145, -85, -31, -153, 47, -171, -80, -110, -174, -77, 62, 41, -84, 217, 182, -55, -140, 18, -104, -183, 32, 178, -137, -104, -33, 1, 91, -118, 35, 92, 34, 105, -57, -166, -15, -46, -74, -140, 125, -1, 69, 78, 134, -198, 69, -219, 146, 23, -60, -230, -109, -339, -27, -228, 204, -53, -114, 78, 83, -334, 173, 61, -70, 216, -24, 16, -208, 143, 43, -70, 83, -68, -74, 22, 109, 144, 180, 26, -236, 327, 12, -205, -166, 145, -270, -85, -8, 6, 58, 103, 154, -110, 64, -30, -81, -305, 174, 66]
4456F6n0j35R2OJK5j97o8L06j87j29K02j31P5k1J62j33K43j33q3K88k47J36l69
4480b81L21J00j65R9l94K75j65kK38j00L0J33j1k46K36k37J21o1J50j11K2K34
4502A86n15L93Rp7k12L14mr3n6K03j17M7r9K5P8J9k44j03K56P4L08l33l2L4k45
4527a84J91r5K63n4J92k80o7Mn1J70ll8j58O2J79n0j98K42k17RO0j93K22k85O9
4552b10L01R8k48K09J5l31J99K1j45jM9P7j55R9M7K4Q0j10L0o8k04K21p9J45L
4577F7q8n9P9k16J72K42k10K6J8R6o5k36K48k75K07J73j45j82J70n9J36J00k91
4600i2O4K48r5k94L01j18j01K10o6j85K37p9n3J09o7Ok18R4K71k51j2l8J82O5
4624A18l3R8k55o4J66R8j81l5K10n70M15J56K00m16K00p1m01m7K89j67M76r1j47
$$ y = [66, 16, -119, -27, -21, -20, 5, -192, -260, 46, -141, -270, -68, -199, -124, -145, 17, -116, 127, -6, -89, 199, -48, 88, -281, 40, 140, -25, 74, -320, -45, -210, -212, 26, -74, -44, 89, 78, -168, 68, -169, -48, -109, 41, -70, -48, 186, -329, 64, 73, -4, -216, 98, 94, 1, -55, 148, 31, 78, -21, 4, 82, 101, -143, -246, 10, 84, 392, 59, 27, 61, -184, 7, -88, 175, 121, 313, 33, -34, -30, -81, 89, 86, 48, -110, -48, 131, 81, -117, 125, -92, -83, -23, -216, 6, -279, -210, 91, 189, -59, 150, 165, -166, 33, 54, -91, -92, -43, 34, -121, -22, 25, 49, 129, 19, 49, -19, -223, -2, -81, 64, 67, -21, -80, -1, -217, -45, 197, -13, 13, 31, 127, 62, -174, 74, -201, 6, 179, 34, -148, 22, -37, 99, 199, -92, -28, 220, 125, -169, 132, 14, -87, 123, 57, -128, 109, 30, -23, 86, 19, 25, -193, -99, 172, -79, -91, -129, 53, 118, 85, 183, -72, -136, 30, 128, -53, -88, 122, -448, -33, 123, 323, -93, 107, 36, -365, -412, -123, -290, 186, 95, -52]
4647e2Q8Q0j13j09J33j95M13j30j22K29k2l30O6Q7r2k0R0J19j14p2R3J10k09J13
4671D1J52Q0r4k04j27K02k4k30K83k64q5K23K73j98j58K6n0L88m69J73j71J23
4693a10J59k38J24J78J18j42j16J15k27Q3K70l55LJ14J86j45J64j93j38N0N9j69
4715b10J79j58K32Q1q4k3K1N4k5j89K95j09k58M42k21J35l81K69M7j88J16m2j44
4738a61r2L4J06J01J70k57K66j62p2L05l43K37j72o9O7J3m0K10N0n1k06P7q1L1
4762c9l4J6j1Q5k51L34j12r4P5M39m50J56j60K09j11j86K38k42%J45J64k05J3
4785b1J07J6p9N0J01j38j21J32j27J73j07L54m64J70P4J58l98O1l3L9k1K45k84
4808a13j22L87l4j4j81o0J57j38J11m9l6n2m4K07l5J71k91J32k27J05L19l18L35
$$ y = [-52, 36, 116, 3, -106, 27, -168, 245, 115, -7, 222, 200, -130, -64, 23, -69, -89, 1, 120, 6, -66, 27, 137, -72, 41, 193, 273, 179, -25, -152, 50, 26, -204, 79, -185, -270, -47, 226, 28, -130, -104, -154, 234, -235, -62, -233, -110, 49, -189, -65, 113, 231, 89, -27, 88, -139, -56, 214, -141, -138, -24, 162, 17, 181, -12, -150, -100, -41, -210, -31, -189, 43, 124, 40, 17, 38, 92, 67, -122, 173, 64, -194, 248, 27, 162, -219, 50, 97, -91, 25, -17, -161, -253, -219, -113, -12, 158, -99, 167, 5, -67, 238, -105, 132, -40, -109, -42, -29, -69, 141, 191, 140, -66, 11, -70, -39, -73, -57, -68, 17, -234, 100, -12, -106, -31, 408, -42, 114, -46, 163, 52, -134, 104, -138, -138, 7, 171, -34, -21, 86, 102, 23, 73, 174, 36, -85, 47, -80, 93, -14, 340, -124, 46, 120, 278, -120, -59, -92, -53, -74, 171, -113, -235, 152, 118, 104, -77, -137, 20, -118, -7, -56, -92, -144, -188, 19, -16, 155, -136, -4, -231, -126, 193, -125, 210]
4831B10j86j67K02K1j25k8n6K56o78L29L96m08L66J1j63l3m2J60j43J7Q5j13k9
4854a18K31O8o4r8Q2m2k4k04J42n2m1L23k80j06O2K67l26Q5K16j82k07K31J33
4877I6l50M62j51K0Jn6l2J9j99l1J10M54l26K29k79k2j1Q3L5o5Mj56j9J17j15
4902a82o2J84L6Q0l84L05k05J40M8k9J39j89R4J43j56l0K14j12k75K65l93L97
4924B8J18j52r8j2J87j28j66M34j96J99l60L2j7J92R3N5m38K79m7K64p53O93o43
4947d36M37K42r22k65P65l5l5K59l67P54j22o3k68K39k95J22j72R0J00K4k50K70
4969G2j72l2O74r64O88j1j68J02l94L74l35M2J29k1pj10M79l58L53K29k64m40
4991a34L97j24l71N0P8O0O8m0j02PK97k60n0l5N5j07J63J10k33K05k53K31K20
$$ y = [210, 24, -143, 59, 80, -45, -73, -129, 127, -551, -222, 174, -234, 132, 143, -20, -53, -95, 65, -78, -61, 24, -89, -118, 113, 181, 117, 19, 101, 59, 35, -169, -27, -79, -120, 203, -77, -183, -121, 146, -180, -95, 121, -61, -268, -37, 96, -254, 208, 57, 77, 78, 22, -10, 9, -190, -221, -111, 343, 17, 246, -33, -55, -66, 17, 52, -13, -9, -165, -184, -67, -182, -244, -60, -24, 56, -328, -23, -228, -88, -40, -69, 70, -119, -25, 118, -38, -68, 146, 34, -241, 24, -369, 28, 146, -6, -104, -116, 71, -57, -223, 211, 15, 214, -146, -114, -131, 61, 154, 209, -229, 50, 3, 267, -486, 207, -436, 1, 243, -679, -944, -179, -214, -249, 10, -357, 397, 275, 212, -56, 183, -112, 10, -162, -72, 28, 52, -198, 72, -100, -132, 542, -422, 266, 255, 87, 189, -205, 169, -166, -124, 5, -16, -23, -133, 346, -12, 341, 570, 306, -134, 263, 139, -232, -182, -104, -44, 24, -16, -118, -111, 186, -74, -124, -159, -104, -211, -48, 62, -171, 34, -219, 12, 232]
5014B32k67J62j27K8j71J39k21N57l18Q3k81K36j37P1j69J42K75k48l4M1K7j53
5036a33j5qO7M8p6L2K12k99L17q9J53k02K2K07k26P2k73J84r7N8j6L0J13J48Q6
5061C15k97n9N4k22O2K7K75j29k78Q1K95ll20K33r0q6L42n8k91J58pR2p8J66j18
5086F4r2Q2p8J28p9j41J72Lj07Q3j71r6K55j93K95j69o8p3K87l3p4j45M3K00j23
5111c0j2K01j32p9J81L83n69J36J1q3l1j76K04K20j79p5k5M0J7%L9j58J29j55
5135a43J37q9R3R8o9J03J15m13J94P0l8J32j24q3J8L7K51o35K75J72j28O7K09
5158B49l17M41k50j28n6L02j78M5N6l00K28j03N4P3k37J00J93l1k41p1J88j16
5180i9K43Ql10M00k40J04j73k32K88k43N6K07P3r7q4K36l9M0j23j8r9K58j39o0
$$ y = [232, -35, 127, 0, 28, -143, -4, -225, 332, 14, 97, -184, 52, -85, -14, -183, -41, 234, -14, -48, -7, 20, -133, -148, -156, -89, -41, -117, -85, 127, -172, 145, 56, 209, 7, 29, 236, 10, 82, -191, -7, -104, -46, -62, -32, 81, 229, 315, 18, -41, 13, -209, -147, -120, 155, 26, -252, -171, 124, 121, -199, 34, -56, -142, 200, 142, -149, 9, 2, 94, 16, 182, 64, -28, 54, -24, 104, 25, -116, 56, 59, -48, 35, -136, -232, 23, -170, 125, -44, -112, -185, 102, 69, -5, -150, -107, 93, -30, -42, 159, 27, -52, 129, 512, -57, 79, 90, 7, -24, -200, 4, 224, 45, -30, -55, -15, 2, 2, 41, -117, 12, -143, -6, -95, -2, 96, 27, 130, 245, -168, 26, 96, 58, 190, 66, -17, 1, 38, 289, -346, -71, 101, -27, 40, 249, -68, 373, 123, -5, -61, 241, 63, 108, 164, -136, 92, -11, 43, 116, -121, -21, 172, 141, -100, -171, 17, -99, 144, 152, -158, 242, 2, 106, -67, -299, -11, -254, -198, 9, 82, -15, -99, 137, 98, 138, 15, -3, -102, 156, 17, -43]
5204d3J37O0j24K11J35l90q6R3J94j84M1k19K81nl4J03j61j53J51J13q1J09J11
5227B59k44J15k42L32m30J79J8J1J41N7l73P8J6N46o16J70R5j13j8J3R6J49j06
5250A33j38N8j22j52L89m3j50M9K2K0k10K21L1j63J50M3p0o3o5J96k18k2l3J05
5274c2P2j2j02k6L03l26J68j47M8J7J05l3r4o6j9j12J18J01K08l3m51L13%K1J9
5299D0J09k17K06j51j57M59l21K31k24K30k76K07nj90j03J40J96j70o8J31j18
5320e1J99k95J59k06K44r4L0NO2j00J58K07k81k85J07n4J12R6m5J01L28m73k2
5343i8km7K37l35L47j98O9n2l2p4J39K17k45nJ8M7K23j7l0n4o6p4j50K22n0j01
5369a11K37l44Q2J27rK78k23p9Q5k5j92K04k27K86N4m17N14m24L10j49j10J84
$$ y = [-43, 94, 154, 30, 241, 376, -14, -100, -7, 187, 3, 44, -175, 106, 101, 67, 170, 9, -144, 7, 120, 39, 148, 259, 15, 130, -112, 220, -210, -31, -13, -2, 139, 196, -177, -99, -83, 463, -153, 17, 112, -1, -19, -6, 90, 239, 133, -5, 53, -69, -221, 168, 125, -25, 24, 46, 66, -144, 77, 108, -55, 95, 138, 68, 5, -60, 136, -82, -104, -137, -32, 40, 28, -74, -100, 203, -123, 45, -102, -54, -37, 68, 35, -59, -125, -144, -256, -138, -37, 171, 138, -313, 0, 0, 21, 40, 149, -68, 138, -13, -170, 289, -32, 199, -25, 205, -71, 136, 131, -59, -162, -22, 174, 4, -64, 67, -51, 148, -147, 12, -194, 50, -44, -14, -9, 53, -47, 111, 318, 37, -248, -141, -195, -83, 13, -32, 69, 397, -76, -98, -100, -147, 90, -245, 102, -96, -27, -79, -111, -185, -46, 171, -74, -79, -61, -14, 209, 192, 162, 108, 42, -32, -182, 40, -10, -111, 126, -218, -136, -9, -18, 260, 37, -42, 43, 18, -174, 30, -197, 89, 143, -274, 240, -184, 126, -23, -133, 51]
5391E1M5k07L62l23J77j95K79r8L9m12N27k25J21Q4k24j05L40l17K20k72Q4j12
5413a61O9L32l96Q3K30n7j53K16R2j98j12j51K32L02l05k0K2J04J01j43K0k69
5435a62J64O3k0J06j15O4q5O2k8l7K18p9k46J02k23M09k77J8J18N8O0k88J32N0
5459F4l1Q8p6N8l36L99J7k43q0n7k8K05k2J27j32J7J00n5J5N6j72N4j46pK68J19
5485B02l02L9j92M0J19K07Kj36j8J46j56J07j55J23oJ52l44J59j8j25K31l15K90
5508E0P4n7N6kk03J06j0m4p4J78j77J28k68K36j8M4l46L23j58K85o1k82R3K56
5532A29j17m1L7r1k1k8J30k5k28J96L20l27J06k1J5J0J97k77M5o1r1Q7N6N3j72
5557a19K02l1n4O6Mk12L21l24J40J09j99M42k97k72L65j39N8%j66J62j32M4J98
$$ y = [51, 96, -111, 251, -72, 105, -90, 189, 91, 130, -282, 245, 20, 141, 225, 1, -104, 236, -81, 139, -133, -49, -161, -92, 240, -156, -73, 157, 100, -53, 163, 255, 57, -55, -206, 26, 328, 23, 3, 25, 129, 230, 87, 107, -162, 2, 65, 45, 151, 36, 100, 15, 77, 49, 12, 230, 151, -95, 7, -216, 193, -84, -66, 52, 110, 170, -118, 14, 64, 33, 121, 45, 103, -233, 166, 183, -60, -140, -197, -225, -20, -42, 85, -47, -30, 70, 15, 30, 86, -86, -32, -178, -185, 83, 202, -100, -61, -253, -213, -94, 113, 115, -21, -39, 107, -49, 58, -97, 26, 20, 172, -172, -13, -31, -156, 75, -240, 50, 124, 67, 123, 121, -82, 24, 14, -30, -104, 74, -103, 25, -243, -7, -25, 19, -327, -4, -162, 123, 62, -220, -127, 129, 12, -29, 8, -83, -104, -132, -2, -27, -255, -59, 261, -66, 40, 19, 34, 44, 241, -36, 9, -52, -143, -56, 0, 53, -119, 83, 52, -2, 64, 68, -144, 177, -147, -7, 102, -97, 345, 48, -224, 141, 2, 60, 60, -106, 56, -76, -32, 166]
5580A66j57j65O7K40Oj70L3K1j06m0K2K21n5J1QJ9K22k21o3M3k19R2O4j69Q0K38
5606A88j54j7J7Nj61q8L48j94L26k48j45K81j47NM2o2l2J14k48J98p4K0K75j16
5630A33k56N2M47k26J83l17k10K8k3P1K73l5j89p3K21N6j20J33N2k63O7o3L7n
5654b7m1J51r1R2J33k87K65k11m2J74Q0nm1N3q9j68k3kj8K2j67L69l15L86m3j47
5680HJ21p7K5l8K81n21K09j88K63p9PM4r6P6J36j22k5Q9l84L78K2k58o6L97k27
5705b5K38l2k32j26L16K9j22j0j20J32k5N1l0K4J2j11J99j40j82J67N3KL0N2j67
5730a7N8J67j23j76J28P4j34j62J81J00r2L87j65k73j65J59J77k64K11k73J49
5751e3q9K55Q4j72j95L66j89k8J06J41k76pn4J18l1p1J07K8n9O0K7m7j30j02K17
$$ y = [166, 9, -156, -89, 151, 157, -13, 20, 41, -65, -105, -83, 138, 83, 94, 102, 121, 343, 122, 59, 102, -117, -25, 39, -130, -50, 188, 34, 17, 34, 39, -122, -210, 138, -56, 270, 22, -123, 158, 11, 16, 58, -4, -36, 78, -170, 28, -46, -26, 249, 133, -123, -71, 376, 150, 333, 16, -194, -166, -189, -118, 155, 120, -69, -142, 79, 135, 15, 148, 200, -63, 4, -59, -22, -27, -68, 83, -8, 84, 217, -70, 195, -16, -58, 116, 196, 191, 150, 203, 114, -54, -77, -79, -97, -75, -242, 127, -188, 198, 155, 8, 129, 52, 77, 39, 320, -201, 8, -180, 83, 4, 11, 55, -41, 35, 171, 49, 24, 113, -271, 107, 129, -129, -195, 202, -25, 213, 181, -51, -177, 139, 168, 46, 36, -84, 48, 23, 74, 44, 68, 80, -31, 168, 28, -154, 13, 66, 68, 98, 150, -17, 41, 208, 85, -91, 37, 111, -23, -185, -4, 96, 4, 391, 226, -47, -212, -53, 124, -140, 71, -202, -53, -142, 113, 197, 25, -170, 196, 7, -21, 85, 226, -50, -57, -111, 7, -24, -95, 12, 40, -19, 41, 68, 21, -109, -211, 6]
5776FMj23j17J90Q5J51j85J8j72J15j11j12L03M4m04K04K96j78M7j10J71j10k54
5799b42L40J97n2l47J75p6M4r2l2K94j65j79N6k25M68j31Q5j84N1J0m8Oj5q9J41
5824a0m5L7P1k46L52j32r6r3J17K60k16O0j19l0m8N7J24j98J51R2j13J28j60K28
5848A71Pk85J12q1J5Oj3j19L00j02m4j78K92k99K67O8j95J03J08j49J17N8j79
5871b0q3O4q3j29J70p0J20K98m74L43J16N7j06k13m0k02K14J85q1l4M2k45k1K35
5895D3k2p0J02J4K08m82K27k09J64K96l61p9oM95m12QK02r3K23m38R8n7L01k72
5919a20p4K14j06j7J48L6k71L05N0j02J94l36M1J32o0J6J99l26K05Jqk28PL56
5943B56Pj29l80k9K28p2j56M28j8k23J30l87J73K79M9m38N35j15j80O2K9J86m6
$$ y = [6, 10, -113, -230, -40, 45, 196, 11, 29, -143, -28, -139, -251, 52, 96, -308, -104, 192, 14, 61, -49, 122, 12, -242, 98, 295, 243, -104, 71, -5, 39, -53, -85, 209, 44, -135, -79, -304, 164, 33, 118, -66, -15, -5, -53, -47, -62, -151, -10, -55, -18, 53, -193, 159, 27, -69, -162, -45, 215, -1, 59, -60, -90, -138, -81, 43, -155, -4, 88, -25, 103, -57, 171, 178, -107, 5, -76, -61, -55, -68, -187, 113, 11, -33, -211, 81, -218, 49, 117, -78, 25, 133, -16, 101, 159, -20, -103, -39, -122, -251, -81, -151, -31, 267, -207, 136, 252, 309, 203, -10, -50, -252, -38, 147, 66, 32, 74, -171, -192, 43, 21, -49, 53, 67, 275, -207, 20, -189, -25, 271, -90, -169, -175, 320, -92, -84, 118, 25, 248, -190, -92, -149, 152, -120, -194, 20, -86, -103, 45, 81, -190, 115, 165, 63, 257, -79, -38, 94, 34, 50, 249, -77, 128, 129, 121, -107, -100, 256, 263, 134, -246, -275, -47, -119, -275, 153, 135, -88, 42, -345, -172, 107, 156, -282, 253, 138, -42, 20, 49, 235, 189]
5966A89k14m4o8Q5K44m14L72l78M95r8m89J59J89j29l0J29k14J72j7K77l44j69
5988b97K07pO9j10N8RJ70k7j06J2M26l99R5Q4k93K27M9l74L29j95j34L66j22K50
6012B87m72J10J60n6N7R7j7k11J98o4Q9j35o5r6J91j1j78L4m1L95k23N4k03J86
6036H6L1j41J1m7j4N3J54K5j80K5Q7q2r3J31r9j67L16l56K72j23J38m9o6j99J20
6061a67L50j35l8j13J69k03O5M35m13K66k42k79K38J7O1J16k74K24J34k68J02
6082D5j42J71J00j20lj97Q4Q1q1L7J56j52O3l5j13J5K8K35lk62N9J72k7L09m22
6107bj51N8K08r8j56K15rp3M7K05l83L09J75l17o0mJ37K32m78P8J10J44m01J68
6131d6K0N7j56M39m63J21r1L5R6O3N8j24M6j15JK26r4k94jK44K0M0m4J23j98K7
$$ y = [189, -25, -69, -137, -52, 192, -222, 150, -228, 267, 169, -320, -161, 28, -101, -131, -2, -216, -44, -61, 216, -128, -297, -90, -97, -28, -138, -80, -71, 99, 72, -34, -22, 404, 5, 100, 184, -109, 118, 167, -207, 122, -73, -207, 159, 37, 287, -185, -75, 85, 29, 86, 183, 166, -45, 153, 89, 178, 43, -22, -118, 73, 62, -116, -82, -123, 272, 49, 103, -100, 86, 117, -24, -13, -60, -74, -21, 133, 158, -22, 3, 90, 8, -85, 46, -53, -220, 96, -260, 12, -111, 27, -22, -88, -287, -167, 183, 48, 10, -103, 66, -137, -72, 363, -50, 216, -26, -305, -67, -50, 11, 127, -147, 77, 211, -57, 45, -97, 74, 174, 54, 51, -146, -62, 19, -62, -25, 131, -21, 42, 7, -106, -91, -63, 172, 169, -93, -34, 138, 111, 420, -2, -153, -95, 113, 15, -141, 74, 65, -8, 39, 244, -139, 170, 345, 28, -32, -36, 101, 333, -145, -67, 43, 187, -214, -46, -26, 31, -125, 314, -149, -28, -119, -84, 12, 75, 133, 9, 55, -60, -59, 167, 73, -221, -222, 22, 42, 82, 38, 161, -37, -10]
6157a0N4R7J9j64J46k59K19n3J54r1l5k58J21K76j93o1O3K17j43K4j3j58n0n9
6181a57L19k41l4j7J03O6n1J79J03j67j0j53K4J05J17p3J6R0k87Om6K66k72K99
$$ y = [-10, 44, 141, 160, -4, 142, -117, 102, 49, 203, 112, 77, -181, -60, 216, 23, -38, 25, 242, 99, 123, 110, -48, -98, -157, 162, -79, -113, -130, -27, 39, -12, 167, 270, 103, 93, -60, -36, 69, 186, 113, 129, 219, -68, -62, -108, 158, -114, 185]
$$ [...]
8191A46
##END NTUPLES=NMR FID
##END=
