##TITLE=1H_K-411/2_1
 CDCl3, 8 sc, 
 9.06.2021
##JCAMPDX= 6.0         $$ Bruker NMR JCAMP-DX V2.0
##DATA TYPE= NMR FID
##DATA CLASS= NTUPLES
##ORIGIN= UXNMR, Bruker Analytische Messtechnik GmbH
##OWNER= root
$$ XWIN-NMR		Version 3.5
$$ Wed Jun  9 12:12:29 2021 Russian Standard Time (UT+4h)  she@DPX200
##.OBSERVE FREQUENCY= 200.131506
##.OBSERVE NUCLEUS= ^1H
##.DELAY= (6, 6)
##.ACQUISITION MODE= SIMULTANEOUS
##.ACQUISITION SCHEME= undefined
##.AVERAGES= 8
##.DIGITISER RES= 18
##SPECTROMETER/DATA SYSTEM= spect
##.PULSE SEQUENCE= zg30
##.SOLVENT NAME= CDCl3
##.SHIFT REFERENCE= (INTERNAL, CDCl3, 0, 15.7039)
##AUDIT TRAIL= $$ (NUMBER, WHEN, WHO, WHERE, WHAT)
$$ ##TITLE= Audit trail, XWIN-NMR		Version 3.5
$$ ##JCAMPDX= 5.01
$$ ##ORIGIN= Bruker BioSpin GmbH
$$ ##OWNER= she
$$ F:/spectra/data/she/nmr/H-F/1/audita.txt
$$ ##AUDIT TRAIL=  $$ (NUMBER, WHEN, WHO, WHERE, WHAT)
(   1,<2021-06-09 12:07:46.37 +0400>,<she>,<DPX200>,
      <created by zg, POWCHK disabled, PULCHK disabled
       configuration hash MD5:
       00 E9 B6 7A A2 85 ED C7 34 08 36 98 17 FE 4E 26
       data hash MD5: 16K
       6D B1 E4 B0 B2 22 BA 53 81 9F F5 C7 90 CD F5 02>)
$$ ##END=
$$ 
$$ hash MD5
$$ F5 E4 97 AE 97 FC C9 E1 61 6A 75 3A 0E 6A 2A 14
##$RELAX= 
##$RELAX= 
##$RELAX= 
##$RELAX= 
##$RELAX= 
##$RELAX= 
$$ Bruker specific parameters
$$ --------------------------
##$DU= <F:/spectra>
##$EXPNO= 1
##$NAME= <H-F>
##$PROCNO= 1
##$TYPE= <nmr>
##$USER= <she>
##$AMP= (0..31)
100 100 100 100 100 100 100 100 100 100 100 100 100 100 100 100 100 100 
100 100 100 100 100 100 100 100 100 100 100 100 100 100 
##$AQSEQ= 0
##$AQ_mod= 1
##$AUNM= <au_zg>
##$AUTOPOS= <>
##$BF1= 200.13
##$BF2= 200.13
##$BF3= 200.13
##$BF4= 200.13
##$BF5= 200.13
##$BF6= 200.13
##$BF7= 200.13
##$BF8= 200.13
##$BYTORDA= 1
##$CFDGTYP= 0
##$CFRGTYP= 5
##$CHEMSTR= <none>
##$CNST= (0..31)
1 1 145 1 1 1 1 1 1 1 1 1 1 1 1 1 1 1 1 1 1 1 1 1 1 1 1 1 1 1 1 1 
##$CPDPRG= <>
##$CPDPRG1= <>
##$CPDPRG2= <>
##$CPDPRG3= <>
##$CPDPRG4= <mlev>
##$CPDPRG5= <mlev>
##$CPDPRG6= <mlev>
##$CPDPRG7= <mlev>
##$CPDPRG8= <mlev>
##$CPDPRGB= <>
##$CPDPRGT= <>
##$D= (0..31)
0 1.2 0 0 0 0 0 0 0 0.06 0 0.03 0 0 0 0 0.0002 0 0 0 0 0 0 0 0 0 0 0 0 
0 0 0 
##$DATE= 1623226065
##$DBL= (0..7)
120 120 120 120 120 120 120 120 
##$DBP= (0..7)
150 150 150 150 150 150 150 150 
##$DBP07= 0
##$DBPNAM0= <>
##$DBPNAM1= <>
##$DBPNAM2= <>
##$DBPNAM3= <>
##$DBPNAM4= <>
##$DBPNAM5= <>
##$DBPNAM6= <>
##$DBPNAM7= <>
##$DBPOAL= (0..7)
0.5 0.5 0.5 0.5 0.5 0.5 0.5 0.5 
##$DBPOFFS= (0..7)
0 0 0 0 0 0 0 0 
##$DE= 6
##$DECBNUC= <off>
##$DECIM= 32
##$DECNUC= <off>
##$DECSTAT= 4
##$DIGMOD= 1
##$DIGTYP= 9
##$DL= (0..7)
0 120 120 120 120 120 120 120 
##$DP= (0..7)
150 150 150 150 150 150 150 150 
##$DP07= 0
##$DPNAME0= <>
##$DPNAME1= <>
##$DPNAME2= <>
##$DPNAME3= <>
##$DPNAME4= <>
##$DPNAME5= <>
##$DPNAME6= <>
##$DPNAME7= <>
##$DPOAL= (0..7)
0.5 0.5 0.5 0.5 0.5 0.5 0.5 0.5 
##$DPOFFS= (0..7)
0 0 0 0 0 0 0 0 
##$DQDMODE= 0
##$DR= 18
##$DS= 0
##$DSLIST= <SSSSSSSSSSSSSSS>
$$ [...]
##$SUBNAM2= <"">
##$SUBNAM3= <"">
##$SUBNAM4= <"">
##$SUBNAM5= <"">
##$SUBNAM6= <"">
##$SUBNAM7= <"">
##$SUBNAM8= <"">
##$SUBNAM9= <"">
##$SW= 20.0188882624521
##$SWIBOX= (0..15)
0 0 2 0 0 0 0 0 0 0 0 0 0 0 0 0 
##$SW_h= 4006.41025641026
##$TD= 16384
##$TD0= 1
##$TE= 0
##$TE2= 300
##$TE3= 300
##$TEG= 300
##$TL= (0..7)
0 120 120 120 120 120 120 120 
##$TP= (0..7)
150 150 150 150 150 150 150 150 
##$TP07= 0
##$TPNAME0= <>
##$TPNAME1= <>
##$TPNAME2= <>
##$TPNAME3= <>
##$TPNAME4= <>
##$TPNAME5= <>
##$TPNAME6= <>
##$TPNAME7= <>
##$TPOAL= (0..7)
0.5 0.5 0.5 0.5 0.5 0.5 0.5 0.5 
##$TPOFFS= (0..7)
0 0 0 0 0 0 0 0 
##$TUNHIN= 0
##$TUNHOUT= 0
##$TUNXOUT= 0
##$USERA1= <user>
##$USERA2= <user>
##$USERA3= <user>
##$USERA4= <user>
##$USERA5= <user>
##$V9= 5
##$VALIST= <valist>
##$VCLIST= <CCCCCCCCCCCCCCC>
##$VD= 0
##$VDLIST= <DDDDDDDDDDDDDDD>
##$VPLIST= <PPPPPPPPPPPPPPP>
##$VTLIST= <TTTTTTTTTTTTTTT>
##$WBST= 1024
##$WBSW= 4
##$XGAIN= (0..3)
0 0 0 0 
##$XL= 0
##$YL= 0
##$YMAX_a= 438182
##$YMIN_a= -112148
##$ZGOPTNS= <>
##$ZL1= 120
##$ZL2= 120
##$ZL3= 120
##$ZL4= 120
##$ABSF1= 10
##$ABSF2= 0
##$ABSG= 5
##$ABSL= 3
##$ALPHA= 0
##$AQORDER= 0
##$ASSFAC= 0
##$ASSFACI= 0
##$ASSFACX= 0
##$ASSWID= 0
##$AUNMP= <proc_1d>
##$AZFE= 0.1
##$AZFW= 0.1
##$BCFW= 1
##$BC_mod= 2
##$BYTORDP= 1
##$COROFFS= 0
##$CY= 11.3945322036743
##$DATMOD= 1
##$DC= 2
##$DFILT= <>
##$DTYPP= 0
##$F1P= 15.9154993809931
##$F2P= -4.1035820241983
##$FCOR= 0.5
##$FTSIZE= 0
##$FT_mod= 4
##$GAMMA= 1
##$GB= 0.15
##$INTBC= 1
##$INTSCL= 1
##$ISEN= 128
##$LB= 0.24
##$LEV0= 0
##$LPBIN= 0
##$MAXI= 10000
##$MC2= 0
##$MEAN= 0
##$ME_mod= 0
##$MI= 1.114404
##$NCOEF= 0
##$NC_proc= 0
##$NLEV= 6
##$NOISF1= 3.799351
##$NOISF2= 2.8
##$NSP= 1
##$NTH_PI= 0
##$NZP= 0
##$OFFSET= 15.70392
##$PC= 1
##$PHC0= -11486.42
##$PHC1= 18.00101
##$PH_mod= 1
##$PKNL= yes
##$PPARMOD= 0
##$PSCAL= 0
##$PSIGN= 0
##$REVERSE= no
##$SF= 200.130013532006
##$SI= 16384
##$SIGF1= 3
##$SIGF2= 2
##$SINO= 400
##$SIOLD= 16384
##$SREGLST= <1H.CDCl3>
##$SSB= 0
##$STSI= 0
##$STSR= 0
##$SW_p= 3612.71676300578
##$SYMM= 0
##$S_DEV= 0
##$TDeff= 0
##$TDoff= 0
##$TI= <>
##$TILT= no
##$TM1= 0
##$TM2= 0
##$TOPLEV= 0
##$USERP1= <user>
##$USERP2= <user>
##$USERP3= <user>
##$USERP4= <user>
##$USERP5= <user>
##$WDW= 1
##$XDIM= 8192
##$YMAX_p= 0
##$YMIN_p= 0
$$ End of Bruker specific parameters
$$ ---------------------------------
##NTUPLES= NMR FID
##VAR_NAME=  TIME,          FID/REAL,        FID/IMAG
##SYMBOL=    X,             R,               I
##VAR_TYPE=  INDEPENDENT,   DEPENDENT,       DEPENDENT
##VAR_FORM=  AFFN,          ASDF,            ASDF
##VAR_DIM=   8192,          8192,            8192
##UNITS=     SECONDS,       ARBITRARY UNITS, ARBITRARY UNITS
##FACTOR=    0.0002496,     1,               1
##FIRST=     0,             0,               0
##LAST=      2.0444736,     0,               0
##MIN=       0,             -112148,         0
##MAX=       2.0444736,     438182,          0
$$ Real data points
##PAGE= N=1
##DATA TABLE= (X++(R..R)), XYDATA
0@%%%%%%%%%%qJ6j6J6k4L2l9M7n6P1q6J02j18J38j62J90k21K55k95L39l87M41
$$ 0 0 0 0 0 0 0 0 0 0 0 -8 8 -8 8 -16 16 -23 24 -32 39 -47 55 -63 75 -87 103 -118 137 -158 181 -206 235
32B35n01N68o44P25q13R11j019J137j266J407j560J728j911K112k334K574k835
$$ 235 -266 302 -342 383 -430 481 -538 599 -667 740 -820 908 -1003 1109 -1225 1349 -1486
49a486L123l441L792m179M611n093N637o257O965p787Q754r912J1327j3100J5400
$$ -1486 1637 -1804 1988 -2191 2420 -2673 2964 -3293 3672 -4115 4639 -5273 6054 -7046 8354
64H354j8517K2997l0011M2595p1967K61590J59736l81603K81805K8818l29827
$$ 8354 -10163 12834 -17177 25418 -46549 215041 374777 -6826 274979 303797 -26030
75b6030J17923J60281l12890M8506K06588k02988m8963K45143j29943j06952K01664
$$ -26030 91893 252174 -60716 -12210 194378 -8610 -57573 187570 57627 -49325 152339
86A52339m8903j69176J37884M499j70610N8064O8531j41467Q469J14726q0963
$$ 152339 103436 -65740 72144 76643 -93967 -35903 32628 -108839 -100370 14356 -66607
97f6607m5541J43657k4961r3694J26127K5440j40315Q3535P0895j50781K5609
$$ -66607 -112148 31509 6548 -87146 38981 64421 -75894 7641 78536 -72245 -46636
108d6636J21851j29819k9763J63926q2302q9069J78498l1164j42362J57815K1874
$$ -46636 75215 -54604 -84367 79559 -2743 -91812 86686 55522 -86840 70975 92849
119I2849j77668J12938P7724j76933N7453J24088j46373j395J49114j04273o0666
$$ 92849 -84819 28119 105843 -71090 -13637 110451 -35922 -37317 111797 7524 -53142
130e3142J45493n7872j04494J22549q276j19388R2681M3268j06010N7765Q2251
$$ -53142 92351 34479 -70015 52534 44258 -75130 17551 60819 -45191 12574 94825
141I4825q1207R293R6525n7814m6407Q4698l1670r0886O4069Q038j04933M1837
$$ 94825 13618 22911 119436 61622 15215 99913 68243 -22643 41426 49464 -55469 -13632
153a3632N7820q7042J4678R6645n8451k6351J08171l2327p6255R3195n459j14086
$$ -13632 44188 -42854 -28176 68469 10018 -16333 91838 59511 -16744 76451 70992 -43094
165d3094O7371L1161j22772M1062P3398j04873R121J03290p6081l1239J08325
$$ -43094 24277 55438 -67334 -26272 47126 -57747 -48626 54664 -21417 -52656 55669
176E5669m6276p1645R5326j4972r6195P5674K2240r8399N1877N5951q3320K0354
$$ 55669 9393 -62252 33074 18102 -78093 -2419 19821 -78578 -26701 29250 -54070 -33716
188c3716P6237o3346j7043P9637l7588m9733P2838n688o6546O1067K8498o9362
$$ -33716 42521 -20825 -37868 41769 4181 -45552 27286 21598 -44948 16119 44617 -24745
200b4745L7763N4480o4514K62O4224n2105m2327O2729k7872p0226N7839R928p7178
$$ -24745 13018 67498 2984 3246 67470 15365 -26962 35767 7895 -62331 -4492 5436 -71742
213g1742M9189M8186o9799K7460P0379o0240r462P2589m7158m8007O4461k2555
$$ -71742 -22553 25633 -44166 -16706 53673 -6567 -16029 56560 9402 -38605 25856 3301
225C301o9711N7884J0869p0499N0768M3309o1487L0982O0474n3667j583O0751
$$ 3301 -66410 -8526 2343 -68156 -17388 25921 -35566 -4584 55890 2223 640 61391
237F1391m2803l5095N5634k2342n4209M9438N716n8228L8970L2911n6122J9996
$$ 61391 18588 -16507 39127 16785 -37424 12014 17730 -40498 -1528 31383 -24739 -4743
249d743M7941m8201j0572N3232l1536l7041N2527o313n2313M6053K2910n8646
$$ -4743 43198 -5003 -15575 37657 6121 -30920 21607 15294 -37019 9034 31944 -26702
261b6702L0530M3342n6878M834N0330m6312k1914N1918k3099m1304N1511N860
$$ -26702 3828 47170 -9708 -4874 45456 -856 -22770 29148 6049 -35255 16256 22116
273B2116m8363M2827K8985n1639K5018L9612n3914j338M1564m7490k5114M4033
$$ 22116 -26247 16580 45565 -6074 18944 58556 4642 3304 44868 -2622 -27736 16297
285A6297k5800l6581M6534N261m3461M3727K8593m8732K4852L9474n2686k562
$$ 16297 -9503 -46084 450 5711 -37750 5977 34570 -14162 10690 50164 -2522 -5084
297e084M1966m4442k6229M3798k0322l9191M4092J1048m5612L4915L3386m8459
$$ -5084 36882 -7560 -33789 10009 -10313 -49504 -5412 5636 -39976 -5061 28325 -20134
309b0134J4122M2000m6165j0201M3525l2410k7403M2244p976l5820L8069J5880
$$ -20134 -6012 35988 -10177 -20378 23147 -9263 -36666 5578 -2398 -38218 -149 15731
321A5731m0791K5210L0842m3708O485L6459m0321r584L9761k6365k0461M1654
$$ 15731 -25060 150 30992 -12716 -6231 30228 -10093 -19677 20084 -6281 -26742 14912
333A4912n624l0630L6153J2436m0699K1041K3957m7410K941L3044m2613j0655
$$ 14912 9288 -21342 14811 27247 -13452 7589 31546 -15864 -12923 20121 -22492 -33147
345c3147M2484k3606k0029M6310o83l0357L7764J7101m2032J7295K7275m7097
$$ -33147 9337 -14269 -34298 12012 11329 -19028 18736 35837 -6195 11100 38375 -8722
357h722l743L3948l7363j6480M0753j6980k3007M0461M789k9509K8638J7455l6491
$$ -8722 -12465 21483 -15880 -32360 8393 -8587 -31594 8867 13656 -15853 12785 30240 -6251
370f251J0016K4512l8505n579L1159k9214j3046L6441j2181j9342L6093L560k8194
$$ -6251 3765 28277 -10228 -15807 15352 -13862 -26908 9533 -2648 -21990 14103 17663 -10531
383a0531K5269J5206l6922R483K4861l6842m059L4845k6890j3921M0196j0985
$$ -10531 14738 29944 -6978 2505 27366 -9476 -13535 21310 -5580 -19501 20695 9710
395I710k4265L5025M143l5545J9947J6332m0708M037K8179l4750p487L7552j9417
$$ 9710 -14555 20470 24613 -10932 9015 25347 -15361 -11324 16855 -17895 -25382 12170 -7247
408g247j5701L8156m417k4727K8514O220l2957J2653J5384l3991L83K5336k5199
$$ -7247 -22948 15208 10791 -13936 14578 20798 -12159 494 15878 -18113 -17730 7606 -17593
421a7593n650L3125j2783j1498L2680k816k1672K2529L696l1246J0012J2824l2862
$$ -17593 -23243 9882 -2901 -14399 18281 15465 -6207 16322 20018 -11228 -1216 11608 -21254
434b1254Q05K5669k5021n588L5191j3227j4494L4108k730k6006K3186P762l3086
$$ -21254 -20449 5220 -19801 -25389 9802 -3425 -17919 16189 13459 -12547 10639 18401 -14685
447a4685R573K0661l0390l5L1859k0817q057L5534r707j8345K8102j341k7257
$$ -14685 -5112 15549 -14841 -14876 16983 -3834 -11891 23643 13936 -4409 23693 22352 -4905
460d905J6032O709k9590N797J8156k4033l16K7894j5333o455K9668r493j5555
$$ -4905 11127 17836 -11754 -5957 12199 -11834 -12150 15744 411 -6044 23624 14131 -1424
473a424K3221l982k4131J3983N274k6107P089J8252k1765J284K8655j5654r006
$$ -1424 21797 17815 -6316 7667 12941 -13166 -6077 12175 -9590 -8306 20349 4695 -4311
486d311L0439j0022j9951K2333k835k7330J3719J1000k6547N482K4976k0504l918
$$ -4311 26128 16106 -3845 18488 15653 -11677 2042 13042 -13505 -8023 16953 -3551 -7469
499g469L1664j2921j5379K8643o889k3805J8907J517k6304J0420J3556k1241M287
$$ -7469 24195 11274 -4105 24538 17649 -6156 12751 14268 -12036 -1616 11940 -9301 -5014
512e014K3159j4010l470K6112j1066j2920K1788p872j9479J6068k141k1017J2233
$$ -5014 18145 4135 665 26777 15711 2791 24579 16707 -2772 13296 11155 -9862 2371
525B371J0553j8457O266K0750j4916m463K3361j4221j5890J9871r271k3586J5642
$$ 2371 12924 -5533 733 21483 6567 2104 25465 11244 -4646 15225 5954 -17632 -1990
538a990J377k3289J1510J4814j8220L483K3778j4173q725K4396r990k0055J9943
$$ -1990 -613 -23902 -12392 2422 -15798 -12315 11463 -2710 -11435 12961 2971 -17084 2859
551B859l572k3581J4959O567k0770Q958J6346j4984L41J9919j2219r812J9874
$$ 2859 -713 -24294 -9335 -2768 -23538 -14580 1766 -13218 -12877 7042 -5177 -14989 4885
564D885r339j7352J7933l252j7417J6554O446j5664J3048J3644j4758L210J7326
$$ 4885 -4454 -21806 -3873 -7125 -24542 -7988 -1542 -17206 -4158 9486 -5272 -2062 15264
577A5264j5288q810J7449j1569j6701J8626k339j7551J7775Q268j6009J1102J6513
$$ 15264 -24 -8834 8615 -2954 -19655 -1029 -3368 -20919 -3144 5124 -10885 217 16730
590A6730j5171j807J7453j3028j3680J6809o488j8418J6864M177j7544J4366J3480
$$ 16730 1559 -248 17205 4177 -9503 7306 818 -17600 -736 3441 -14103 263 13743
603A3743j3988O700J6706j3369m640J5537j1622j3604J4185o220j6366J5171J442
$$ 13743 -245 6455 23161 9792 5152 20689 9067 -4537 9648 3428 -12938 2233 3675
616C675j6036J3711Q406j4699O639J1640j5869l816J4282j3271j1043J6564o034
$$ 3675 -12361 1350 9756 -4943 1696 13336 -2533 -6349 7933 -5338 -16381 183 -5851
629e851j4412J7329L621j5643J3228R354j5422L528J1877j4158n987J4407p016
$$ -5851 -20263 -2934 687 -14956 -1728 7626 -7796 -4268 7609 -6549 -12536 1871 -5145
642e145j1655J6965J819j2808J5548Q236j3524Q123R701j4430k054R997j3048
$$ -5145 -16800 165 1984 -10824 4724 12960 -564 7559 17260 2830 776 10773 -2275
655b275r285J1915o519j1099J4979J460j0871J4908O074j3094R629P764j6609
$$ -2275 -11560 355 -6164 -17263 -2284 -824 -11695 3213 9287 -3807 5822 13586 -3023
668c023J131R768j4444n625J4298p731q580J8537O03j0701J6703O645j4771R125
$$ -3023 -1892 7876 -6568 -12193 2105 -5626 -14206 4331 4934 -5767 10936 17581 2810 11935
682A1935Q682j5143j194J1577j1540o907J4025l626j0583J4657L635j3454J0422
$$ 11935 20617 5474 4280 15857 4317 -2590 11435 7809 -2774 11883 15518 2064 12486
695A2486O708j4791K869Q392j2499l751J0801o605p432J4047q80r932J3114K571
$$ 12486 19194 4403 7272 15664 3165 -586 10215 3610 -3822 10225 9345 -587 12527 15098
709A5098j3591Q878L780j6193L449O757j4398o74J2407p954l957J6678j594q942
$$ 15098 1507 10385 14165 -2028 1421 8178 -6220 -6894 5513 -2441 -6398 10280 8686 -256
723b56J5551J606j4834R386L273j7148K869P349j3236k141J2733n401n209J4169
$$ -256 15295 16901 2067 11453 14726 -2422 447 7796 -5440 -7581 5152 -249 -5458 8711
737H711J733j0098J0602L747j4091L836M623j4312r78O291r033l650J0109k413
$$ 8711 10444 346 10948 14695 604 4440 9063 -5249 -6227 64 -8969 -12619 -2510 -4923
751d923n897J1256J661r591R189L488j3302N951N464j2656L169R319q687n8J2875
$$ -4923 -10820 436 2097 -7494 1695 5183 -8119 -2168 3296 -9360 -6191 3128 -5559 -5617 7258
766G258m304n241J2899j523j1586R418J988j5323O504N856j3832M155J0852q513
$$ 7258 2954 -2287 10612 9089 -2497 6921 8909 -6414 90 5946 -7886 -3731 7121 -1392
780a392l79J2310m428o696R897j186j2696N369K333j3130L002P184r245K777R934
$$ -1392 -1771 10539 6111 -585 9312 8126 -4570 799 3132 -9998 -6996 188 -9057 -6280 3654
795C654l653m02J0238j157n846O648M2j1153L977K405j2281L721P005r720L048
$$ 3654 1 -401 9837 8680 2834 9482 9524 -1629 2348 4753 -7528 -3807 3198 -6522 -3474
810c474J1153o349j250J1301l949q131Q666p11j3671O424M156j3845M482R179
$$ -3474 7679 1330 80 11381 7432 -699 7967 7256 -6415 9 4165 -9680 -5198 3981
824C981j0523J926J1584o912l411J0207l414q999P593P43j0519N014N396r126
$$ 3981 -6542 -4616 6968 56 -3355 6852 3438 -5561 2032 2775 -7744 -2730 2666 -6460
838f460L493R038o786Q55P938n062l749N465l287p367M087K82p974M263N746o615
$$ -6460 -2967 6071 -715 140 8078 3016 -733 4732 1445 -5922 -1835 -1553 -9527 -5264 482 -6133
854f133M387Q422o204R41Q299o323m441O198l924q912O144J402r848O524P667
$$ -6133 -1746 6676 472 1413 9712 3389 -1052 5146 1222 -7690 -1546 -144 -9992 -3468 4199
869D199q491L844J0476p511j077Q432o452o762O510l178r584N353K671q223M478
$$ 4199 -4292 -448 10028 2517 1440 9872 3420 -3342 3168 -10 -9594 -4241 -1570 -9793 -5315
884e315P069o545K923P765o048r96O563n235m571M967k055n309N406K088n835
$$ -5315 1754 -4791 -1868 5897 -151 -1147 5416 181 -4390 577 -1478 -6787 -1381 707 -5128
899e128N119N404o490K239O441p490j566O393o190m724O637j066o432P334M115
$$ -5128 -9 5395 -1095 1144 7585 95 -1471 4922 -1268 -5992 645 -421 -6853 481 4596
914D596p386N327O773q147K19O900q120m439O678m442o215O884J065n723O188
$$ 4596 -2790 2537 9310 1163 1382 8282 162 -4277 2401 -2041 -8256 -1372 -307 -6030 158
929A58O008o656L025O636p184j407N334p008l986M612l725l978N468J243l781
$$ 158 6166 -490 2535 9171 1987 580 5914 -1094 -5080 -468 -4193 -8171 -2703 -1460 -5241
944e241N399M150n026L167M821p253j40M371o607k467N436l523l168O485J287
$$ -5241 158 4308 -718 2449 7270 17 -123 4248 -2359 -4826 610 -2913 -6081 404 1691
959A691n040N393M337p383J523N633q066j968N974o353l664O693j022m308O018
$$ 1691 -3349 2044 6381 -1002 521 6154 -1912 -3880 2094 -4259 -7923 -1230 -2252 -6560 -542
974e42K707n207L130M366o870j94M646o357k273N319l564j771O555m16j745O015
$$ -542 2165 -3042 88 4454 -2416 -2610 2036 -4321 -6594 -1275 -4839 -6610 -55 -471 -2216 3799
990C799J668l726K773K475o793L74K866o973r51N684n025j171P001j381k349N616
$$ 3799 5467 1741 4514 6989 196 570 3436 -3537 -4488 1196 -3829 -5000 2001 620 -1729 3887
1006C887R00n792K347K586q251q83N107p275k537P310l003k658P164M33l914M408
$$ 3887 4787 -1005 1342 3928 -4323 -5206 -99 -7374 -9911 -2601 -5604 -8262 -1098 -665 -4579 -171
1022a71K670n627N31L495n875j637N604m152k014P195j798k072N894p0l466L133
$$ -171 2499 -3128 -2597 898 -4977 -6614 -1010 -5162 -7176 19 -1779 -3851 2043 1973 -1493 1640
1038A640R34n238O03K067n573k64N662m421k62P426k610j955O668j470m602L536
$$ 1640 2574 -2664 -2061 6 -5567 -5831 -169 -4590 -4852 2574 -36 -1991 4677 3207 -1395 2141
1054B141N24o320Q75L142n292n77P009l272j542P712j265l432M889O2m925J406
$$ 2141 2665 -3655 -2780 362 -4930 -5507 1502 -1770 -3312 4400 3135 -297 4592 4654 -271 1135
1070A135J445n220p32M118l297j126O082j146j360O143j352k842L894j411m903
$$ 1135 2580 -2640 -3372 746 -2551 -3677 2405 1259 -101 6042 4690 1848 5742 4331 -572
1085e72J874k59m694P18K979m256M16N419l493j335N964l458m289M437k226n786
$$ -572 1302 1043 -3651 -2933 46 -4210 -3794 1625 -1868 -3203 2761 -697 -4986 -549 -2775 -8561
1101h561L001J091m956J679M978l347M17O895k282k356N941j923m613L722l65
$$ -8561 -5560 -4469 -9425 -7746 -2768 -6115 -5698 1197 -1085 -3441 2500 577 -4036 -314 -679
1116f79m297J337K778l004J013M786j650m53M950j495k823L644k115m496K383
$$ -679 -4976 -3639 -861 -3865 -2852 1934 284 -169 4781 3286 463 4107 1992 -2504 -121
1131a21p40m149K330J900k974J577M959l026j93N659l838k810M734k659m726M006
$$ -121 -861 -5010 -2680 -780 -3754 -2177 2782 -244 -437 5222 1384 -1426 3308 649 -4077 -71
1147g1L15m714L701L454l555J670N538l173j783N327l326m483M194k011m714K860
$$ -71 244 -4470 -769 2685 -870 800 6338 3165 1382 6709 3383 -1100 3094 1083 -3631 -771
1163g71O42l071J772L121j920l52L699k095k277K596k321l277K367j201k861L022
$$ -771 -129 -3200 -1428 1693 -227 -579 3120 1025 -1252 1344 -977 -4254 -1887 -3088 -5949 -2927
1179b927N92j234K074K981j654K07L296k919k153L643l258l341M241j599l584
$$ -2927 -2335 -3569 -1495 1486 -168 39 3335 416 -1737 1906 -1352 -4693 -452 -2051 -5635
1194e635M558J668l280K792L575l432m82M037l752l048M198k321l908M479n24
$$ -5635 -1077 591 -2689 103 3678 246 -236 3801 49 -2999 1199 -1122 -5030 -551 -1075
1209a075k689L911J905k453J876K350k380j189K164k773k724K651j583k475L213
$$ -1075 -3764 147 2052 -401 1475 3825 1445 256 2420 -353 -3077 -426 -2009 -4484 -1271
1224a271Q4j598L525O42j442J467J084k806j163K035k937k338L653j400k429M811
$$ -1271 -1187 -2785 740 1382 -60 1407 2491 -315 -1478 557 -2380 -4718 -1065 -2465 -4894 -83
1240h3L33k546M135K045l834J076K591l509k556L336k431l271M431n5l209M306
$$ -83 250 -2296 1839 3884 50 1126 3717 208 -2348 988 -1443 -4714 -283 -338 -3547 759
1256G59J680l142K717J608k829k30J468k481j646J684q96j584L362J47j498L923
$$ 759 2439 -703 2014 3622 793 563 2031 -450 -2096 -412 -1308 -2892 470 617 -881 3042
1272C042J74j412K002K13k485J09L56k227j045K110j037j710L914k09j884L444
$$ 3042 3216 1804 3806 4019 1534 1643 1999 -228 -1273 837 -200 -1910 2004 1795 -89 3355
1288C355Q34l543J495R31m135k19J526k858j635L449j5k565M182J067l206L125
$$ 3355 4189 646 2141 3072 -1063 -1282 244 -2614 -4249 -800 -815 -3380 802 1869 -1337 1788
1304A788J302l603O66Q36l177j74J373j435j008L218l00j240L031K28k137K023
$$ 1788 3090 -513 153 989 -2188 -2362 -989 -2424 -3432 -214 -514 -1754 1277 1505 -632 1391
1320A391j95l587J601m66k667N58J420j248J32L444n75o08L492n44k881K783n4
$$ 1391 1196 -2391 -790 -1256 -3923 -3365 -1945 -3193 -3061 383 -192 -800 2692 2148 -733 2050 1996
1337A996l807J389J300l211O75L026q60q15L501L91k478K418P25m101J074J067
$$ 1996 -1811 -422 878 -2333 -1658 1368 508 -307 3194 3585 1107 3525 4250 149 1223 2290
1353B290m083L96J583k200O8K715n67j045K867L10j644J779k94k740O00K98l285
$$ 2290 -1793 -1397 186 -2014 -1946 769 202 -843 2024 2334 690 2469 2175 -565 35 333 -2952
1370b952J863J406k168J666K091p88n43L109j561j958J810l95m313K192k2k800
$$ -2952 -1089 317 -1851 -185 1906 1118 575 3684 2123 165 1975 1580 -2733 -541 -563 -3363
1386c363J217K453p98K68K958j157j339J857j10k986R61P42l439Q92K023k521
$$ -3363 -2146 307 -491 -223 2735 1578 239 2096 1986 -1000 -39 703 -2736 -1844 179 -2342
1402b342J678K028l16j19K463j6j854J308m83k689J355M07l419J307J088k306
$$ -2342 -664 1364 1048 929 3392 3376 1522 2830 2347 -342 1013 1420 -1999 -692 396 -1910
1418a910K008J251r62M57K219j666j251J173j118k345J563K40k753J642K757k448
$$ -1910 98 1349 387 844 3063 1397 146 1319 201 -2144 -581 -341 -3094 -1452 1305 -1143
1434a143J177K687j937m54J144N10l049J922K3l462J628J976l120J645K378j973
$$ -1143 34 2721 784 330 1474 1984 -1065 857 880 -2582 -954 1022 -2098 -453 1925 -48
1450d8L86K543k172q42J251q55j826N93L19j812J227J363j881K209J923j987J372
$$ -48 338 2881 709 -133 1118 263 -1563 -970 -651 -2463 -1236 127 -1754 455 2378 391 1763
1467A763J484j558j160J750k320j562J606J8k280K891J563k019J502K293k549
$$ 1763 3247 1689 529 2279 -41 -1603 3 21 -2259 632 2195 176 1678 3971 1422
1482A422M47J744j929j486Q83o21k581J828N83j470J491J438n78M63J783j385
$$ 1422 1869 3613 1684 198 1081 460 -2121 -293 290 -1180 311 1749 1171 1634 3417 2032
1498B032l61Q49j360j496J122n09j237J906N30j630J127J883k403J669J411l485
$$ 2032 1671 2520 1160 -336 786 277 -960 946 1476 -154 973 2856 453 2122 3533 48
1514D8J43J285j914r74J756r25p85K197Q28j682K251J396k909O88J281k703n43
$$ 48 191 1476 -438 -1412 344 -581 -1366 831 1659 -23 2228 3624 715 1403 2684 -19 -562
1531e62J381j755q31J275R8r28J870J758j621P83J260k141j82j6j780m08R14j612
$$ -562 819 -936 -1767 -492 -394 -1322 548 2306 685 1468 2728 587 405 389 -1391 -1799 -885 -2497
1549b497K18J126J95l06J476Q98n97N83N43k204K70J630l071Q74N91j070l50K144
$$ -2497 -2279 -1153 -958 -1264 212 1110 513 1096 1639 -565 -295 1335 -1736 -862 -271 -1341 -1691 453
1567D53J78p77J073J178j980N33J291l411J11J655k193o40K479o50k61J818M16
$$ 453 631 -146 927 2105 125 658 1949 -1462 -1351 304 -1889 -2529 -50 -700 -961 857 1273
1584A273j331P22J037k279j95J177k185j47J349j348M49J922m20r3J667k53n26
$$ 1273 -58 664 1701 -578 -773 404 -1781 -1928 -579 -1927 -1478 444 24 -69 1598 1345 819
1601H19R86l45j760J3p4k100O53J106j335J38K132n59j01K059n51j196J308n52
$$ 819 1805 1460 -300 -287 -361 -2461 -1808 -702 -2037 -1899 233 -326 -427 1632 1081 -115 1193 641
1619F41j967j42J873k378n09K427q31k25K117k74m45J750l94j789L37O91j597
$$ 641 -1326 -1468 405 -1973 -2482 -55 -886 -1111 1006 732 287 2037 1643 -146 191 882 -715
1636g15k78Q41r25J82J029l20L11J876r31r74J231p08r98J19K87j574J031J862
$$ -715 -993 -152 -1077 -895 134 -186 125 2001 1070 96 1327 619 -379 -260 27 -1547 -516 1346
1654A346k015J733Q72o61Q7J693q39j581J637j517j466L70O71j400J95J989j170
$$ 1346 -669 1064 1936 1275 1362 3055 2216 635 2272 755 -711 -341 330 -1070 -875 1114 -56
1671e6k80K242j019l60O16M47k246J182r0k243M53J310p65p3J737m09K3J376n81
$$ -56 -336 1906 887 527 1143 1590 -656 526 436 -1807 -1354 -44 -809 -882 855 446 469 1845 1264
1690A264N80O01o96o21J28p28j39j18J310j309O63J256j261K79J273j045n60O48
$$ 1264 1844 2445 1749 1128 1256 528 389 271 1581 272 935 2191 930 1209 2482 1437 877 1525
1708A525o44j220P74L46j765J482O73m24L85J667j334K56J032p90j571Q00m47
$$ 1525 881 -339 435 781 -984 498 1171 747 1132 2799 1465 1721 2753 1963 392 1192 745
1725G45j030L48J071m96j94J753m59J78J234j189m20N72j665j83O1j133o96J119
$$ 745 -285 63 1134 638 444 2197 1738 1916 3150 1961 1541 2113 448 265 326 -807 -1503 -384
1743c84o1n07J190R86j316Q53N47m79j361J731k390n9J642j663n68J121J166j137
$$ -384 -445 -952 238 1224 -92 761 1308 829 -532 1199 -1191 -1250 392 -1271 -1839 -718 448 -689
1761f89O40J411j223n74K086j728j066J262l33j133N79P80j049L95P48k14M10
$$ -689 -49 1362 139 -435 1651 -77 -1143 119 -214 -1347 -768 12 -1037 -642 106 -108 302
1778C02O71l40p50P24j082q77Q67k58l91Q47N93p34J475O85p62K87K56j183o15
$$ 302 973 633 -117 607 -475 -1352 -485 -743 -1134 -287 306 -428 1047 1732 970 1257 1513 330 -285
1797b85P55j217p04J292j271K30J834j82j68M09J304p63q47J395j123j400R66
$$ -285 470 -747 -1451 -159 -1430 -1200 634 452 284 693 1997 1234 387 1782 659 -741 225
1814B25o04j345J520j91l37J066J51l7m83J343o79o17J122j006j271M66j18l08
$$ 225 -379 -1724 -204 -395 -732 334 485 448 -35 1308 629 12 1134 128 -1143 -677 -795 -1103
1832a103J003N3r38J465l11K7L96M09j502L49J58r64K32R32n12q48K152j299M63
$$ -1103 -100 -47 -985 480 169 196 592 1001 -501 -152 6 -958 -726 206 -306 -1154 998 -301 162
1851A62R59R0j218R88l70j276J03K82k11j250K050k17n82J219J08k58P17K61j213
$$ 162 1121 1211 -7 981 611 -665 -562 -280 -491 -1741 309 92 -490 729 837 579 1296 1557 344
1870C44j11L9k91j069P33j37j157K010o1j99J369m58j55j61k9q83M78k91j392
$$ 344 233 272 -19 -1088 -355 -492 -1649 361 300 101 1470 1012 857 696 667 -216 262 -29 -1421
1889a421N32P54j195J13R40J89m77R71k43j086J374n64r36L67j59q27K93J239
$$ -1421 -889 -135 -1330 -1217 -277 -88 -565 406 163 -923 451 -113 -1049 -682 -841 -1668 -1375 -136
1907a36m29m07J631O3j253R63J03q71L83J02o44l55M93m74O51J186p91M03L7N58
$$ -136 -565 -972 659 722 -531 432 535 -336 47 149 -495 -850 -357 -831 -180 1006 215 618 655 1213
1927A213n40N54q59o41J61j70l33n2M50k96Q36J149p10J62J398j126n82J460q74
$$ 1213 673 1227 368 -273 -112 -282 -615 -667 -217 -513 323 1472 762 924 2322 1196 614 2074 1200
1946A200j119N33l46j404Q02J354q90k44J175r68k80J440n23p70J57k92q20j80
$$ 1200 81 614 268 -1136 -334 1020 130 -114 1061 93 -187 1253 730 -40 117 -175 -995 -1175
1964a175L24p59L23Q99O19q23N50K85m00R8p50L32M03p99K8r6K72k7L5N89K94
$$ -1175 -851 -1610 -1287 -388 231 -592 -42 243 -157 -59 -809 -477 -74 -873 -845 -941 -669 -696 -661 -72 222
1985B22k22P63k51j748J736q74o79Q36J74j628J182P8J71K13J287p66j93Q93j95
$$ 222 0 763 512 -1236 500 -374 -1053 -217 -43 -1671 -489 -411 -240 -27 1260 494 301 1194 999
2004I99r34k84L04p41J065L71j279O74R04k2K14r8n9K43p63l00j73j81j26j208
$$ 999 65 -219 85 -656 409 780 -499 175 1079 1057 1271 1173 1114 1357 594 294 121 -60 -186 -1394
2024a394J499l76k67M99J190j323J096n12k30p01L36m64J25l50J66k05k04J086
$$ -1394 105 -271 -538 -39 1151 -172 924 412 182 -519 -183 -647 -522 -872 -706 -911 -1115 -29
2042b9q72J111N73j177K19N82n78j089Q11o49j003K077o17l74L94P76l74K34N00
$$ -29 -901 210 783 -394 -175 407 -171 -1260 -449 -1098 -2101 -24 -641 -1015 -621 155 -219 15 515
2061E15r37Q51m15l26j338R75r8j093J174L6K45J679j518K52J712m96j450L97
$$ 515 -422 429 14 -312 -1650 -675 -773 -1866 -692 -656 -411 1268 -250 2 1714 1218 -232 165
2079A65j10j332J071O10p83o06Q68j35P8M52M89m10J93Q85j568j94P94l11j277
$$ 165 55 -1277 -206 404 -379 -985 -117 -252 -174 278 767 357 550 1435 -133 -327 467 156 -1121
2098a121Q04P41p55J437j44j96r2J140j408J86n97k11N49n81J153j747Q81K76
$$ -1121 -317 424 -331 1106 962 766 674 1814 406 592 -5 -216 333 -248 905 -842 39 315
2116C15j72N06M74j547J301J103j138o39L14j328M68R73j754K274K61n81o32J411
$$ 315 143 649 1123 -424 877 1980 842 203 517 -811 -343 630 -1124 1150 1411 830 198 1609
2134A609J56o05o36J183j746L53J5O1j11L90M75q59O89L32m36O02J033j449m38
$$ 1609 1765 1160 524 1707 -39 314 329 390 279 669 1144 285 974 1306 870 1472 2505 1056 618
2153F18Q86j406N28K59m95L26P59Mn83R04P63j469k6j55o28M57M24j043L14N45
$$ 618 1504 98 626 885 390 716 1475 1479 896 1800 2563 1094 1068 913 285 742 1166 123 437 982
2173I82j251J273k86J41j0P65q01n91J69j23q98n31J893j241k98O47J273j728
$$ 982 -269 1004 718 859 849 1614 813 222 391 268 -630 -1161 732 -509 -807 -160 1113 -615
2191f15J847K57m74k34P14p41m65R91j070k95K02N20L44L67j76P93o65l22K53
$$ -615 1232 1489 1015 781 1495 754 289 1280 210 -85 117 637 981 1348 1172 1965 1300 978 1231
2210A231m14R3o22L58J78k43O26j46j485J064L40L0j37R52j072k38o1r7j59N00
$$ 1231 817 910 288 646 824 581 1207 1061 -424 640 980 1010 873 1825 753 515 454 357 198 698
2230F98J046j978O37N73k38O6N98n53L98n65N60j645R83J053j503j066J819o97
$$ 698 1744 -234 403 976 738 804 1402 849 1247 682 1242 -403 580 1633 130 -936 883 186
2248A86K92l45J59J48o61J060k04n64M11l80Lm81n23P39K01m47L46Q62p23k82
$$ 186 478 133 292 440 -221 839 635 71 482 102 105 -376 -899 -160 41 -406 -60 802 79 -203
2268b03J559q36M41k24j217P7J26k5k4N84o38lJ418o51n2K80K18l04p71N53M05
$$ -203 1356 520 961 737 -480 -403 -277 -302 -326 258 -380 -383 1035 384 332 612 830 526 -245 308 713
2289G13j112L16L04j3Q94P8m05m9M71q10k74O62K78o56m28M90l64N92J2m81N60
$$ 713 -399 -83 221 208 1102 1180 775 726 1197 387 113 775 1053 397 -31 459 95 687 699 218 778
2310G78O58j520Q13P18j705P67K31r5n54j36L25L94N82n72m52K53L74K8o43K81
$$ 778 1436 -84 729 1447 -258 509 740 645 91 -45 280 674 1256 684 232 485 859 887 244 525
2330E25p34M74j62M40j078J721q53m57O84j82k55q05J139k9Qj111n2J175m0r52
$$ 525 -209 265 103 543 -535 1186 333 -124 560 378 123 -682 457 428 436 -675 -727 448 408 -544
2350e44P47p54J025o09l91J373o42m80J087K54o60N85r21R6km2J59P83n87l44
$$ -544 203 -551 474 -135 -526 847 205 -275 812 1066 406 991 70 166 164 122 281 1064 477 133
2370A33J67N81k02l40K45j48k088K110q61K04Q2N10k77Q33K33j112N23j27m2J94
$$ 133 300 881 679 339 584 436 -1652 458 -403 -199 -117 393 116 949 1182 70 593 466 424 618
2390F18m45m60J485j817J27J199q13n88M03J260j816Q97L27l66q41N45K85J8K01
$$ 618 173 -287 1198 -619 -492 707 -106 -694 -291 969 -847 50 377 11 -830 -285 0 18 219
2409B19m88j46J95L88p9r89J160k05p05J015j5j088N27N91p23o2O17Q48j345O86
$$ 219 -269 -415 -220 168 89 -900 260 55 -650 365 350 -738 -211 380 -343 -405 212 1060 -285 401
2429D01l5o07n53K29J35l79J369j177O05k79k17R24l76N86k73K46M34j623Q64
$$ 401 366 -241 -794 -565 -430 -809 560 -617 -12 -291 -508 416 40 626 353 599 1033 -590 274
2448B74K05o69J87k52J96l71J133j231J231N64j675N10P16o85l14k92J72M36j120
$$ 274 479 -190 -3 -255 -59 -430 703 -528 703 1267 -408 102 818 133 -181 -473 -301 135 -985
2467i85Q06N01r62N62q96J391Q90Or04q71M22k19M57j101N13k4K6O1N45L18P69
$$ -985 -179 322 -640 -78 -974 417 1307 1313 409 -462 -40 -259 198 -903 -390 -414 -388 -327 218 536 1305
2488A305r91k92R77j1o64q60N27O17p24J25J83r52Q24m52M25R42j121J76o7m41
$$ 1305 314 22 999 988 324 -536 -9 608 -116 9 192 -760 64 -388 37 979 -142 34 -33 -474
2508d74P19l64m12J3j13L15K33M84l96M20k01K20p04R55q17M58p55N20m07n74
$$ -474 245 -119 -531 -518 -631 -316 -83 401 5 425 224 444 -260 695 -122 336 -419 101 -306 -880
2528h80J76J32O26Q5L16n17m64Q52j07n46J27K61j73m14l43R81K10p37P00n67
$$ -880 -704 -572 54 139 455 -62 -526 326 219 -327 -200 61 -112 -526 -869 112 322 -415 285 -282
2548b82N56L49O4p61O32K85j009K10l66N08Q1K43m10k59J93L07k08q8J35k77m7
$$ -282 274 623 687 -74 558 843 -166 44 -322 186 267 510 100 -159 34 341 133 45 180 -97 -144
2569a44N74N1j773R94O75L94r77R99p61J042q44o80K63l52O32J06j93Q93n54K07
$$ -144 430 481 -1292 -298 377 771 -206 793 32 1074 230 -450 -187 -539 93 199 6 899 345 552
2589E52R64j037M42o48K93j24k51L47j062M34j89n32J70L40L84r07P50j09m2N48
$$ 552 1516 479 921 273 566 442 191 538 -524 -90 -279 -811 -641 -301 83 -824 -74 -183 -225 323
2609C23k03j84j64j05q9J13l21J0k56J439p89P45m72O30p78O43L93j042O57m98
$$ 323 120 -64 -228 -333 -422 -309 -630 -620 -876 563 -226 519 47 677 -101 542 935 -107 550 52
2629E2o33R23J9j56R18j078M67j051J647l26n74L28j71n46J5k00Q61q10j20l23
$$ 52 -581 342 361 205 1123 45 512 -539 1108 782 208 536 365 -181 -166 -366 495 -315 -435 -758
2649g58J309J54j013L52L37k04k64L25j81j17J81N37j294J891m97n86M47j54N
$$ -758 551 705 -308 44 381 177 -87 238 57 -60 121 658 -636 1255 758 172 619 465 470
2668D70L32N16q58M4O5m50j5jO14l86J13j4l41K01j29P1n09K19L95n62q0o89L44
$$ 470 802 1318 460 504 569 119 104 103 717 331 444 430 89 290 161 232 -277 -58 337 -225 -305 -994 -650
2691f50O87p60P02N27j504Q49l3N05p92L25N80j299N41j97k31M47J189j838K45
$$ -650 37 -723 -21 506 -998 -149 -182 323 -469 -144 436 -863 -322 -519 -750 -303 886 -952 -707
2710g07R20L5o03K43p73R65o11N44k27N2n84K51n19J278j50p33J96k11K00k29
$$ -707 213 248 -355 -112 -885 80 -531 13 -214 -162 -746 -495 -1014 264 114 -619 -423 -634 -434 -663
2730f63J01J04q7J28L6m48j67j67J459k6kp29R01p96N23j44p4M43L00p30K84o43
$$ -663 -562 -458 -545 -417 -381 -829 -996 -1163 296 270 268 -461 440 -356 167 23 -51 392 692 -38 246 -397
2752c97L50J197p46J248n72p89K24P24j232N92j1j151J294j060l84P29N79k74
$$ -397 -47 1150 404 1652 1080 291 515 1239 7 599 588 -563 731 -329 -713 16 595 321
2770C21R52j443k01M24l24R78k086J270o5Q2k75N20k77K23l13o7Q48Kl42N57K0
$$ 321 1273 -170 -371 53 -271 707 -1379 -109 -174 -92 -367 153 -124 99 -214 -281 567 569 227 784 804
2791H04p60p29M44P20k21j060J839j624R08K97M65o06k1Q71p33J41j922Q32L41
$$ 804 44 -685 -241 479 258 -802 1037 -587 321 618 1083 477 456 1327 594 735 -1187 -355 -14
2810a4k5K9J22o97N66j85N35n46O75L6o82l3Q40j22k76L07m55k20M86J47K99j021
$$ -14 -39 -10 112 -585 -19 -204 331 -215 460 496 -186 -219 621 499 223 530 75 -145 341 488 787 -234
2832b34O72l3n7L93p12O95k10r69M78l9O57n53k17L40O64n83q1m00N61k49n55
$$ -234 438 405 348 741 29 724 514 -455 23 -16 641 88 -129 211 875 292 211 -189 372 123 -432
2853d32m46J765q39L78m42J15J38M7K73k10Q26r15j34O46j50o17l96j33R00L54
$$ -432 -878 887 48 426 -16 99 237 284 557 347 1173 258 124 770 620 3 -393 -526 374 728
2873G28k41M14j49m06K38l24O96r02rm79O08k61J48P58m7j170R02l74P88m14q9
$$ 728 487 901 752 346 584 260 956 54 45 -434 174 -87 61 819 772 -398 504 130 918 504 415
2894D15k95RJ14J69J66l98M94j3m96j42K32k25o6j11M28j041KK45K11J063j530
$$ 415 120 129 243 412 578 180 674 661 165 23 255 30 -36 -147 281 -760 -758 -513 -302 761 -769
2915g69J389l45j011O59j16Q37o49q9N03J29k69q54P13k38n13K41O85J235r83
$$ -769 620 275 -736 -77 -193 644 -5 -94 409 538 269 -585 128 -110 -623 -382 303 1538 555
2934E55o12k94Q19p61Q81o66M59l04m42K45j37J037j006R08j12K41o31n99J316
$$ 555 -57 -351 468 -293 588 -78 381 77 -365 -120 -257 780 -226 682 570 811 180 -419 897
2953H97j334O48j20J53m06L01O95l57l22K15j7L74q96K38O68j99j51N87m23j108
$$ 897 -437 211 91 244 -162 139 834 477 155 370 353 727 -169 69 737 538 387 974 551 -557
2973e57M55M23J40M26n08q00O68Q2J4l51J35l01o14R36m00r34J700J18m89m34
$$ -557 -102 321 461 887 379 -421 247 329 343 -8 127 -174 -788 148 -252 -1186 514 632 143 -291
2993b91R11j148Q75l78n5K2p21O16M54k6p18M31N06r24M50J12k40L04m09p2o01
$$ -291 620 -528 347 -31 -86 -64 -785 -169 285 259 -459 -28 478 -446 4 116 -124 180 -229 -301 -902
3014i02J233R9r8m3P64k11j038J002k65M44j132M10j90o33J750j235LR2j7k87
$$ -902 331 430 332 289 1053 842 -196 806 541 985 -147 263 73 -560 1190 -45 -42 50 33 -254
3034b54O05p52Q61m46M44n18K44J99n73P5K14n46L35o77O15n07Q94l05N0N65l19
$$ -254 351 -401 460 14 458 -60 184 383 -190 -115 99 -447 -112 -789 -174 -681 213 -92 -42 523 204
3055B04p04O8Q70k81L76j571L50n64N78P88j079Q41j61M98j69j03k17M75k10m69
$$ 204 -500 -432 438 157 533 -1038 -688 -1252 -674 114 -965 -124 -285 213 44 -59 -276 199 -11 -480
3075d80k40O27L2J75p7J52M14K93L43j363N23j78J59j45m53k71K20J76k55J32
$$ -480 -720 -93 -61 114 37 189 603 896 1239 -124 399 221 380 235 -218 -489 -269 -93 -348 -216
3095b16K70J137n43O0o89n9j20O6Q65n70m42N55R0j002J423j005N15J20m63M82
$$ -216 54 1191 648 708 19 -40 -160 -94 771 201 -241 314 404 -598 825 -180 335 455 -8 474
3115D74k34pM60o52m05Q59k75q61N64M78l48J36J0o1k29Q46j463O78J84l19m18
$$ 474 240 233 693 41 -364 495 220 -641 -77 401 53 189 199 138 -91 755 -708 -30 154 -165 -583
3136e83K91n39K37L97L20o60m0L32L51M86r35K68q08N31M42R5J01k28l64n64O56
$$ -583 -292 -831 -594 -197 123 -537 -577 -245 106 592 -343 -75 -883 -352 90 185 286 58 -306 -870 -214
3157b14R58P05j406r42J346J29j554N23N12n76R40L40O5r68J15L80o39n74J590
$$ -214 744 1449 43 -899 447 576 -978 -455 57 -519 421 761 826 -142 -27 353 -286 -860 730
3176G30p37k74Q68j258j94M97n97N03k22J4L84K41R14r62k4m13R58p81L39k05
$$ 730 -7 -281 587 -671 -865 -368 -965 -462 -684 -670 -286 -45 869 -93 -117 -530 428 -353 -14 -219
3196b19J44L99m10N00r28L14Q9K59Q53m01J02r18q6q01J551j069N57q2j28M62
$$ -219 -75 324 -86 414 -514 -200 -111 148 1001 600 702 -216 -302 -1103 448 -621 -64 -146 -274 188
3216A88r27n9K28P7O49J90Nl56n01N69M54o16o71J146j335Q23L75q04jN93m85
$$ 188 -739 -798 -570 -493 156 346 351 -5 -506 63 517 -99 -770 376 -959 -136 239 -565 -566 27 -458
3237d58J146j499K433k126Q47j081O92O04o82j58J299p11k96P80j669J394j350
$$ -458 688 -811 1622 -504 343 -738 -46 558 -124 -282 1017 306 10 790 -879 515 -835
3254h35J15J29M70m63N11o49k43o3L01J155r95p25N82m04R98n44K29M21l20K93
$$ -835 -720 -591 -121 -584 -73 -722 -965 -1028 -727 428 -567 -1292 -710 -1114 -116 -660 -431 -10 -330 -37
3274c7l31M67L65j050P63K51r61P83M3j020J363q17J53K25k2p60O53q23O65P66
$$ -37 -368 99 464 -586 177 428 -533 250 293 -727 636 -181 -28 197 175 -585 68 -755 -90 676
3294F76j174j55J5k10L51K37N73j459Q62j86J70M48p88L98p4P18p45n64O18l21
$$ 676 -498 -653 -638 -848 -497 -260 313 -1146 -284 -470 -300 148 -640 -242 -316 402 -343 -907 -289 -610
3314f10M51M32m22L33N73K66l55j28j333P76J30O70j003R45j426R01l85L25m20
$$ -610 -159 273 -149 184 757 1023 668 540 -793 -17 113 783 -220 725 -701 200 -185 140 -280
3333b80Q73n49j6q33J178o02m9L81r58Q55n16p2j96r3K88N96N8r10P72m49M05
$$ -280 593 44 28 -805 373 -229 -278 103 -855 0 -516 -588 -784 -877 -589 7 65 -845 -73 -522 -117
3354a17m01j18K94m51M55rm4M80n41J566j332k16M88r5M08N69r54L24o35K50q6
$$ -117 -518 -636 -342 -793 -338 -347 -391 89 -452 1114 -218 -434 54 -41 367 936 -18 306 -329 -79 -165
3375a65o68J158k13K27j260O02n1j38J34O79j357M08M55k12M8M73r92P69M57r08
$$ -165 -833 325 112 339 -921 -319 -370 -508 -374 305 -1052 -644 -189 -401 -353 120 -872 -103 354 -554
3395e54J192o09k56m63P50k67O15j2k5j120J226K27j109P83j53n71K62K81M9K76
$$ -554 638 29 -227 -690 60 -207 408 396 371 -749 477 704 -405 378 225 -346 -84 197 246 522
3415E22kk90j100Q97j16J48Mj8J61M12p09m80L40M6K04qj9O2O6p94l20J303l51
$$ 522 520 230 -870 27 -89 59 63 45 206 618 -91 -571 -231 -185 19 11 -8 54 120 -674 -994 309 -42
3438d2p49R34K83p07n99L94O75k1q71j51Q20L56k99p1p22J124p7n29j75O87l47
$$ -42 -791 143 426 -281 -880 -486 189 168 -703 -854 -34 322 23 -48 -770 354 277 -252 -427 260 -87
3459h7J76k27L92q72Q02p36N09k27O37j40j66L40m11j53k09P8J18N96R2k77n1
$$ -87 89 -138 254 -618 184 -552 -43 -270 367 227 61 401 -10 -163 -372 -294 -176 420 512 235 184
3480A84J75j62K5n92O00N44q00m88J243r07M38l39n6Q5k05j33R78n36K66q98Q95
$$ 184 359 197 222 -370 230 774 -26 -514 729 -178 260 -79 -135 -50 -255 -388 590 54 320 -578 317
3501C17m04k2k19K5J24jqM47k74j78M18O17j082N28Q9n65q2l61M2P12L76p3q19
$$ 317 -87 -109 -328 -303 -179 -180 -188 259 -15 -193 225 842 -240 288 377 -188 -270 -631 -589 123 499 426 -393
3524c93J01L60m31j29P7O04j28k46k66j89M52N4L54k11l41J034j001M89m3K18
$$ -393 -292 68 -363 -492 -415 189 61 -185 -451 -640 -188 -134 220 9 -332 702 -299 190 147 365
3544C65o46j84N87no3O51p36O7P01P4o81n7J96L5k40pl78M30n03M16m8M81j46
$$ 365 -281 -465 122 117 54 705 -31 36 737 811 130 73 269 304 64 57 -321 109 -394 22 -26 455 309
3567C09j178P67l77L41k08J93j40K18m82K20k75M55L27q45L34l14K54J01K38P7
$$ 309 -869 -102 -479 -138 -346 -153 -293 -75 -557 -337 -612 -157 170 -675 -341 -655 -401 -300 -62 15
3587A5r6p9L2j78M89j37m37O32l68n59M55J53k2m39O75l63M30k15l23O17j21j55
$$ 15 -81 -160 -128 -306 183 46 -391 241 -127 -686 -231 -78 -100 -539 136 -227 203 -12 -335 282 161 6
3609FN5L7l56K22P6l20Q33j26Jk37k0j58L50j27p0kk84N82o04K16l2K03j94J64
$$ 6 61 98 -258 -36 40 -280 553 427 428 191 171 13 363 236 166 164 -120 462 -142 74 42 245 51 215
3633B15M8k42j50Q9JJ96j33n2k40n5K77j98k29K98L30m07k71j72L16p6K50l75
$$ 215 263 21 -129 -40 -39 157 24 -28 -268 -323 -46 -244 -473 -175 155 -252 -523 -695 -379 -455 -205 -580
3655e80O13k77J67j49q7K71L9o46M85k01R2m0R4K98m71L1k91L07k41R73l13J08
$$ -580 33 -244 -77 -226 -313 -42 -3 -649 -164 -365 -273 -313 -219 79 -392 -361 -652 -345 -586 387 74 182
3677A82j65J94o00N15l12k26M52Q0O9l62K1J34J61J0L0j46J54K91k91J50n22L21
$$ 182 17 211 -389 126 -186 -412 40 120 189 -173 -152 -18 143 153 183 37 191 482 191 341 -181 140
3699A40R3O8k41k14K61M3J18M9j60M9j26m59M20j58j45R3K7PK88j29l17L68j4
$$ 140 233 301 60 -154 107 150 268 317 157 206 80 -379 41 -117 -262 -169 -142 -135 153 24 -293 75 61
3722F1j25m43K54K4J1l45K5J92l3k3L7J03j15J29lJ14k24j27K27m9j09L41k25
$$ 61 -64 -507 -253 -229 -218 -563 -538 -346 -379 -402 -365 -262 -377 -248 -251 -137 -361 -488 -261 -310 -419 -78 -303
3745c03J08j29L94l13K89j49L8J54m76N10l82K27J4o5j32L63n8pK1j06O3j76K42
$$ -303 -195 -324 70 -243 46 -103 -65 89 -387 123 -259 -32 -18 -83 -215 148 90 83 104 -2 61 -115 127
3768A27k25r6K66l88K40J37j06k0j07P3K16l82K25J12k57M4J38k14j1R9K4R8j84
$$ 127 -98 -194 72 -316 -76 61 -45 -65 -172 -99 117 -265 -40 72 -185 -141 -3 -217 -228 -129 -105 -7 -191
3791a91K26m6j68K35l42K3L7j7J2K23j64j03J53J18k13k7K85K96m59J36O9m09
$$ -191 35 -11 -179 56 -286 -263 -226 -243 -231 -8 -172 -275 -122 -4 -217 -244 41 337 -122 14 83 -326
3813c26L23l41K76l23J81LK64j21oK98k77N8J22r5l1m71K93p4M34j31j67o6J02
$$ -326 -3 -344 -68 -391 -210 -207 57 -64 -70 228 -49 9 131 36 5 -466 -173 -247 187 56 -111 -177 -75
3836g5m2Q9j01q4jJ03O0P8k29R6l9K13k56N7K64j09k0n8J41l55L60q2K09k78j52
$$ -75 -117 -28 -129 -213 -214 -111 -51 27 -202 -106 -145 68 -188 -131 133 24 4 -54 87 -268 92 10 219 -59 -211
3861b11k80K51K44k56J26J60k53l4QP2k40L51k47j20J6R3R9q4L9M8p2k27N04l8
$$ -211 -491 -240 4 -252 -126 34 -219 -253 -245 -173 -413 -62 -309 -429 -413 -320 -221 -305 -266 -218 -290 -517 -13 -51
3885e1n6j52MJ50j74K22k4J45k32K76l27K7M82p6l08K16N3l70n1J56j72L88l31
$$ -51 -107 -259 -255 -105 -279 -57 -81 64 -168 108 -219 -192 290 214 -94 122 175 -195 -246 -90 -262 126 -205
3908b05k49N0K63m2n5J04J59Rl48p1M62l58J56J78R8k84l01K52M44l85J2L77o95
$$ -205 -454 -404 -141 -183 -238 -134 25 34 -314 -385 77 -281 -125 53 151 -133 -434 -182 262 -123 -111 266 -429
3931d29M07K83o21K95L2J65j95K5l08L25N2N08o10J02q6j96M97m53P0l6J72k87
$$ -429 -22 261 -360 -65 -33 132 -63 -38 -346 -21 31 539 -71 31 -55 -251 246 -207 -137 -173 -1 -288
3953b88L43m2L1m80M26N1l80J52k56K21L11n63K91j83J77m9K86l63L56l01M83
$$ -288 55 13 44 -436 -10 41 -339 -187 -443 -222 89 -474 -183 -366 -189 -238 48 -315 41 -260 223
3974B23M6k82m14k38N01L47j01k01L78j53K69j68m09N81l33k22N94n22K51m52
$$ 223 269 -13 -427 -665 -164 183 82 -119 259 106 375 207 -202 379 46 -176 418 -104 147 -305
3994c05M47k7m88O36k63j0M1n86M54k82K16j00k16L90N57n45j91L62o30R17k15
$$ -305 142 115 -373 263 0 -10 31 -555 -101 -383 -167 -267 -483 -93 464 -81 -272 90 -540 377 162
4015A62j98J91l89L45p9r8J17j39k32O43k16j16m75M40L11n49M90n14r5K40M11
$$ 162 -36 155 -234 111 32 -66 51 -88 -320 323 107 -9 -484 -44 267 -282 208 -306 -401 -161 250
4036B50m80j37J44j08J81o70P47j51j21J40L86l39L19j17MK6l98K30l27J05K42
$$ 250 -230 -367 -223 -331 -150 -820 -73 -224 -345 -205 181 -158 161 44 48 74 -324 -94 -421 -316 -74
4057g4l36L26k33K70K08k18j72O42l07J87n24J25K48k09J30J40j26J30P3l36J44
$$ -74 -410 -84 -317 -47 161 -57 -229 413 106 293 -231 -106 142 -67 63 203 77 207 280 -56 88
4078H8n9J04j17qr8K37l28oK65j63N82K3m94J91o24Q96o74k55J94J23k74N41p04
$$ 88 29 133 16 8 -90 147 -181 -187 78 -85 497 520 26 217 -407 489 -185 -440 -246 -123 -397 144 -560
4101e60N8J116j049M94m21L90M20m72k98M73o56O81N3r92Q18m74O37J76n13k11
$$ -560 -502 614 -435 59 -362 28 448 -24 -322 151 -505 176 229 -763 55 -419 218 394 -119 -330
4121c30M74j32L18M6n54N82m44K60j24r14Q96m48J50k24m52N64K01K75k13k53
$$ -330 144 12 330 376 -178 404 -40 220 96 -818 78 -370 -220 -444 -896 -332 -131 144 -69 -322
4141c22J223j166J50O54k26O36j166Q38p85P77l13m7m22K55k40J16j38J437j455
$$ -322 901 -265 -115 539 313 949 -217 621 -164 613 300 253 -169 86 -154 -38 -176 1261 -194
4160a94n15R17K34K33j14n52M81l24j32n7j51p46J65M60l30P2P35n0r05R34l61
$$ -194 -709 208 442 675 561 9 490 166 34 -23 -174 -920 -755 -295 -625 -553 182 132 -773 161 -200
4181b00p11J221j376J457j352J144M16q49o14L52R57K73r08J108o21n94P88p53
$$ -200 -911 310 -1066 391 -961 183 599 -250 -864 -512 445 718 -190 918 297 -297 491 -262
4199b62N28j18l85L31n47O79j29J86m4l36P09q18J161n96r22j25P95K86l86n30
$$ -262 266 148 -237 94 -453 226 97 283 239 -97 612 -206 955 359 -563 -688 107 393 7 -523
4219e23P4O84m50k46K17J40k29j49o9P5J27J91l52K68k71N25K17k89K58J73k61
$$ -523 -449 235 -215 -461 -244 -104 -333 -482 -551 -476 -349 -158 -510 -242 -513 12 229 -60 198 371 110
4240A10J75L73r15N09Q19r88j16j118J211l6O21o49Q3N2K28r3M28K85m4n27j052
$$ 110 285 658 -257 252 1071 83 -33 -1151 60 24 645 -4 79 131 359 266 694 979 935 408 -644
4261f44M77M45m70K79q40J132k71m19J01m58J158q08N54j14k8J40m24K86K89l74
$$ -644 -167 278 -192 87 -753 379 108 -311 -210 -668 490 -318 236 122 94 234 -190 96 385 11
4281A1j14j41N18J70o68m2N74O94n86p98N78N14j93J74J75o52j85Nl63N60K73
$$ 11 -103 -244 274 444 -224 -266 308 1002 416 -382 196 710 517 691 866 214 29 34 -329 231 504
4302E04k53m60O06j49k04l4j36R83m48l53J90k50p2K54O7K65o89j39O97j188P71
$$ 504 251 -209 397 248 44 10 -126 857 409 56 246 -4 -76 178 245 510 -179 -318 379 -809 -38
4323c8m23Q34o71J25N40j68m05L59M53n61M6K54n27M81m75L02o8r31J027R9n03
$$ -38 -461 373 -298 -173 367 199 -206 153 606 45 91 345 -182 299 -176 126 58 -873 154 253 -250
4344b50J19N57j062Q37p11R5N28l29J237j376Q87n76K96m63K64J68o4k89K6R1
$$ -250 -131 426 -636 201 -510 -415 113 -216 1021 -355 532 -44 252 -211 53 221 157 -132 -106 -15
4364a5r5N75k82J05L59j00n65J93M19k99O8j59j38M73p23N25o30l13N44K73n92
$$ -15 -110 465 183 288 647 547 -18 175 594 295 363 204 66 539 -184 341 -289 -602 -58 215 -377
4385c77J31k42P71j85K81o99M87k38M32m77L47k44J0L76n57j0L5r7R77j194K7
$$ -377 -246 -488 283 98 379 -320 167 -71 361 -116 231 -13 -3 373 -184 -194 -159 -256 721 -473 -446
4406d46K75K03n3k02P97k50n74N36M74j322L70N16K4k32K87l18L2m31N5L73M31
$$ -446 -171 32 -21 -223 574 324 -250 286 760 -562 -192 324 348 116 403 85 117 -314 -259 114 545
4427E45o78K6K02l54M71m06J69P09p99m87P40m12K84qR50n47o75J071q47k20N78
$$ 545 -133 -107 95 -259 212 -194 -25 684 -115 -602 138 -274 10 2 952 405 -270 801 -46 -266 312
4448C12M22p54M89n49M60l06p4N04n47J33K61l75P5n4L52m44M35j68j29m5J11
$$ 312 734 -20 469 -80 380 74 0 504 -43 90 351 -24 51 -3 349 -95 340 172 43 -2 109
4469A09l95q9O76o6l6j91n57R50k58r7L9R1J71m7j36q57O61o3K66R5J55p23P9
$$ 109 -286 -375 301 235 199 8 -549 401 143 46 85 176 347 300 164 -693 -32 -95 171 266 421 -302 -223
4492b23M27k49M65k08K10p59J59J20J77m82J33J87O20o11j19M54n33q6P0K25k37
$$ -223 204 -45 420 212 422 -337 -178 -58 119 -363 -230 -43 577 -34 -153 301 -232 -318 -248 -23 -260
4513b60L58o13J03P65m33J9N75m19p6l37J18K50m55J85O69j012R12o49L69m31
$$ -260 98 -515 -412 353 -80 -61 514 95 19 -318 -200 50 -405 -220 449 -563 349 -300 69 -362
4533c62j05N27n04R7q4M01k3L39n88q8N78l69J37L92n64K16oj05M87K0j7l55K68
$$ -362 -467 60 -444 -347 -431 -30 -53 286 -302 -390 188 -181 -44 348 -216 0 -6 -111 376 396 379 24 292
4556B92m68K74L29m90L65j54l26N6o2L90j68m81M42m85N3L03M52j58k95k99Q80
$$ 292 -176 98 427 -63 302 148 -178 -122 -184 206 38 -443 -1 -486 -433 -130 322 164 -131 -430 450
4577D50j89n25M40l1n63j35M58L60o11O00l50j7J72j85P58o73N44j34r3pm79N17
$$ 450 261 -264 176 145 -418 -553 -95 265 -346 254 -96 -113 59 -126 632 -41 503 369 276 269 -210 307
4599C07r5K2R7n73K8M32q2j71J03L14j98l22K77J50p05K51M48k89K19p6K51k03
$$ 307 212 234 331 -242 -214 218 136 -35 68 382 184 -138 139 289 -416 -165 283 -6 213 137 388 185
4621A85k89K22j91K52J15k05j9l21j13Q38m81l41N96l52J31m34K69l7K36m31L61
$$ 185 -104 118 -73 179 294 89 70 -251 -364 474 -7 -348 248 -104 27 -407 -138 -175 61 -370 -9
4642ij09P98j380R33j95l45K66L13m96O7J21m25M2N84k36J14l74K15j32K99J05
$$ -9 -118 680 -700 233 38 -307 -41 272 -224 -157 -36 -461 -419 165 -71 43 -331 -116 -248 51 156
4663A56n20P80l26l81M90j58n4k99j53N56l52R5J53q4K80J55k42k97K09l06m3
$$ 156 -364 416 90 -291 199 41 -13 -312 -465 91 -261 -166 -13 -97 183 338 96 -201 8 -298 -341
4684c41J82M38n96J031n46m26L74K2J85o9l99J73j20L40k18m82J108o93N13q35
$$ -341 -159 279 -317 714 168 -258 116 138 323 254 -145 28 -92 248 30 -452 656 -37 476 -359
4704c59j38k0J047l43q89O44m21L10M88n28L34k09R5L45l23L02J4o14L9L14JK43
$$ -359 -497 -517 530 187 -702 -58 -479 -169 319 -209 125 -84 11 356 33 335 349 -265 -226 88 89 332
4726C32r7Q9L10k42o16L07K62l47L19j28j1L6J39l80L2j68J65k6L2j63N51n29
$$ 332 235 324 634 392 -224 83 345 -2 317 189 178 214 353 -27 5 -163 2 -24 8 -155 396 -133
4748a33k78P11n06N04m94k5M64l2K45j002N61J53J19o55P21j44n02N37L05O4n12
$$ -133 -411 300 -206 298 -196 -221 243 211 456 -546 15 168 287 -368 353 209 -293 244 549 613 101
4769A01j99r0J20J77k78P55q69N0K12L49J95r03J64M47m52M18j26R3n19J059o21
$$ 101 -98 -188 -68 109 -169 586 -283 -233 -21 328 523 -380 -216 231 -221 197 71 164 -355 704 83
4790H3K05J18m41L34n03N99k36k02J02k63M96n96J10N05l44K70k73K31n58M56
$$ 83 288 406 -35 299 -204 395 159 -43 59 -204 292 -304 -194 311 -33 237 -36 195 -363 93
4810I3j03L84l23Q3k85k08Q73l08p09L02ll0L16J80o15M9j47P04r1n23M17l74
$$ 93 -10 374 51 134 -151 -359 514 206 -503 -201 -204 -234 82 262 -353 -304 -451 253 162 -361 56 -318
4832c18L49L78j13j32J60m1J17o94J18M0j7J26J22m26N01n11o3M90MM38j012J118
$$ -318 31 409 296 164 324 283 400 -294 -176 -136 -153 -27 95 -331 170 -341 -404 86 90 528 -484 634
4854F34p20J02J78l49k00N60r5k14l61M29k17K38o4K26R3l93J44l76k39N17k4
$$ 634 -86 16 194 -155 -355 205 110 -104 -465 -36 -253 -15 -79 147 240 -153 -9 -385 -624 -107 -131
4875a31N5k17j2Q50n40l10J39O94k70k34J40j13J54l55n81M29O17k27k69K56m30
$$ -131 -76 -293 -305 545 5 -305 -166 528 258 24 164 51 205 -150 -731 -302 315 88 -181 75 -355
4896c55L2Q95n44k81L16L6j03J00o2o8O53m99j03J08k23L78o00J51l46M95k48
$$ -355 -323 572 28 -253 63 99 -4 96 34 -34 619 120 17 125 -98 280 -320 -169 -515 -20 -268
4917b68L45k02L58k59k04K68j95J2k40O49j94k9k02Q49n94k42L27n60L0M91k37
$$ -268 77 -125 233 -26 -230 38 -157 -145 -385 264 70 41 -161 688 94 -148 179 -381 -351 140 -97
4938i7l63O64l10N3q7L61m23M71n20Ok70Q31O2j37L71r09O5j34J41m5M32m52L48
$$ -97 -460 204 -106 -53 -140 221 -202 269 -251 -245 -515 316 378 241 612 -297 -232 -366 -225 -270 162 -290 58
4961E8j83R2l49J18R6J9l9M19K56K8r40M96M86q59j49P41k40Mo52J18J13O70m54
$$ 58 -125 -33 -382 -264 -168 -149 -188 231 487 515 -425 71 557 -302 -451 290 50 54 -598 -480 -367 303 -151
4984a51J36j21N62L81n51j06j00K68K97n62j39m61L09P77o00J25R6l5J06o9j57
$$ -151 -15 -136 426 807 256 150 50 318 615 53 -86 -547 -238 539 -61 64 160 125 231 162 5
5005Ej5q3K33p4O86q34K76m5M77o50K78m54K07l74o5K94N1k38M38k33K52J97l68
$$ 5 -10 -93 140 66 752 -82 194 149 626 -24 254 -200 7 -367 -432 -138 -87 -325 113 -120 132 329 -39
5028c9K69K36m85N7J4J79l44J9j53M29n07M61j85k01J46l03L21k30M29R2J4l1
$$ -39 230 466 -19 38 52 231 -113 -94 -247 182 -325 136 -49 -250 -104 -407 -86 -316 113 205 219 188
5050A88m4n17N50L32r23o6M78j91J52N37l01j91N9N10q20R94j063O93k15r2N00
$$ 188 144 -373 177 509 -414 -480 -2 -193 -41 496 195 4 63 573 -247 747 -316 377 162 70 570
5071E70j65J29q66pN37m23K7k6R3k89k20L58M34K98q47L44M69n08L73j073J018
$$ 570 405 534 -332 -339 198 -225 -198 -224 -131 -420 -640 -282 152 450 -397 -53 416 -92 281 -792 226
5092B26o44j01M49m41K23M2l90R54j37m15Q97q01L75j48N6O41o79K07l91M33k37
$$ 226 -418 -519 -70 -511 -288 -246 -636 318 181 -234 663 -138 237 89 145 786 107 314 -77 356 119
5113A19K64o16P71k49j07n05Q96o25O17r45Q70N17j725R41q85J577o41m95N61
$$ 119 383 -233 538 289 182 -323 573 -52 565 -380 490 1007 -718 223 -662 915 274 -221 340
5132C40n9L46Q8n65k08R17j250O11n81L04K0M54n26l67P41m35j65K71J81J27m08
$$ 340 281 627 715 150 -58 859 -391 220 -361 -57 -37 417 -109 -476 265 -170 -335 -64 117 244 -164
5153a64L18m33R8Q01l34j144L09Q07l05l53R61q76L54L49n68K24j63L9m38N47
$$ -164 154 -279 -181 620 286 -858 -549 258 -47 -400 561 -315 39 388 -180 44 -119 -80 -518 29
5173B9k64j77J36K53K28R9k84Q83j82n60J10o92Q68K51q2k37n28k51M94P99q34
$$ 29 -235 -412 -276 -23 205 304 20 903 721 161 271 -421 447 698 616 379 -149 -400 94 893 59
5194E9K91q84K46Q93K0q05L58m95N3j87K74K06M31n16L00O80q35K73m59R79p81
$$ 59 350 -534 -288 605 625 -180 178 -317 -264 -451 -177 29 460 -56 244 924 89 362 -97 882 101
5215A01q26P72J91M07j251J461j097j96R78L8l08k95j02Q01j206R53j100N85M25
$$ 101 -725 47 238 645 -606 855 -242 -438 540 578 270 -25 -127 674 -532 421 -679 -94 331
5234C31r6o15J113r37q9K84qM6j97k44M42L34n75J20J94n22O25l67p44O29O72
$$ 331 235 -380 733 -204 -293 -9 -17 29 -168 -412 30 364 -211 -91 103 -419 206 -161 -905 -276 396
5255C96k32K62l16p8J97j48P18m41j8r6l98j65L52K5K19J84j03j53K30q29J356
$$ 396 164 426 110 32 229 81 799 358 340 244 -154 -319 33 58 277 461 358 205 435 -394 962
5276I62m58r1k83M34r27M79m85P20q0O16j107K14L14o01j24J072j237j10q0K22
$$ 962 504 413 130 564 -363 116 -369 351 271 887 -220 -6 308 -293 -417 655 -582 -692 -772 -550
5296e50J359q09J08j467R25qQ97n47N34K35j195j61J166q24K32l48j16M44M37
$$ -550 809 0 108 -1359 -434 -442 455 -92 442 677 -518 -679 487 -337 -105 -453 -569 -125 312
5315C12o99N29r58J013N8n14m42J091l49m07Q34m97P8P10m23J54j186R55p79N37
$$ 312 -387 142 -816 197 255 -259 -701 390 41 -366 468 -29 49 759 336 490 -696 259 -520 17
5335A7K39o15J91J29j99R6j70N21l78K57N01r62l50O19M68N94j092M10J85n54
$$ 17 256 -359 -168 -39 -238 -142 -312 209 -169 88 589 -373 -723 -104 364 958 -134 276 461 -93
5355i3M48l50J45J7k19K60k79N26l54J52m40K59L77k87p1j27K85LK35L03p74J14
$$ -93 355 5 150 167 -52 208 -71 455 101 253 -187 72 449 162 91 -36 249 252 487 790 16 130
5377A30R05j378J17p63J261O55j013M67N5m29j18j031J285M22k73M54r28k61O6
$$ 130 1035 -343 -226 -989 272 927 -86 381 436 7 -111 -1142 143 565 292 746 -182 -443 -377
5396c77N36L0K7n80Q09p91M82J05jo34M23o18Q34O98j334K82J084j047L5K89J5
$$ -377 159 189 216 -364 445 -346 136 241 240 -394 29 -589 245 943 -391 -109 975 -72 -37 252 267
5417B67n21M0J019o63r1k27J91P91r38M25q7p6l45J89L96k36j28J59m44k80R40
$$ 267 -254 -214 805 142 51 -176 15 806 -132 293 206 130 -215 -26 370 134 6 165 -279 -559 381
5438C81m36l82M53k31Q13m39l30L32m85M96K51o93Q87l6j071O09o4l06n69P55
$$ 381 -55 -437 16 -215 598 159 -171 161 -324 172 423 -270 617 581 -490 119 55 -251 -820 -65
5458f5L01k86M5M82k69m20p6L68L06q45Q52k57q34O83m20N12P9J27k18j67J08
$$ -65 236 -50 -5 477 208 -212 -288 80 386 -459 393 136 -698 -15 -435 77 156 283 65 -102 6
5479FL27k18q5k67K04p8L74K69p24P37p25L14L80r38L54l49N34K63j34K11q10
$$ 6 333 115 30 -237 -33 -111 263 532 -192 545 -180 134 514 -424 -70 -419 115 378 244 455 -355
5500c55L12K98J93j089P26M73m90j83l12P12o71k49J04K97O9n23J041m23J99K3
$$ -355 -43 255 448 -641 85 558 68 -115 -427 285 -386 -635 -531 -234 -165 -688 353 -70 129 152
5520A52J71j60m7k77J41L95o55K52q5J60n77L27QJ24N83k58j81l83K10Q8J12J82
$$ 152 323 163 116 -161 -20 375 -280 -28 -113 47 -530 -203 -195 -71 512 254 73 -310 -100 -12 100 282
5542B82m8o00Q39m90L48q12R44j064P85j44q8N23q25r3J274n11j83l48M06j65
$$ 282 234 -366 473 -17 331 -481 463 -601 184 40 -48 475 -350 -443 831 320 137 -211 195 30
5562C0j46N79l44K23j3m02K22M79p59N35k87j8j36K7K22l78L65P5Q9j23K69m72
$$ 30 -116 463 119 342 329 -73 149 628 -131 404 117 99 -37 -10 212 -166 199 274 363 240 509 37
5584C7m82L14P01j061N18N07m23O09m03m04k53J3K83M36p62J95M53P1j49j98L29
$$ 37 -445 -131 570 -491 27 534 111 720 317 -87 -340 -327 -44 392 -370 -175 278 349 200 2 331
5605C31R8l5l66k06J28l0P94j335K98l42J69Q37m9PJ25m68J54o41O68p04J359
$$ 331 429 394 28 -178 -50 -80 714 -621 -323 -665 -496 341 292 299 424 -44 110 -531 137 -567 792
5626G92m98l56J86m77J51J78M78L1k04j60K96j62L64p00M72m23K63l4j10j20l9
$$ 792 294 -62 124 -353 -202 -24 454 485 281 121 417 255 619 -81 391 -32 231 197 87 -33 -72
5647g2J18K43m23om29k4O49J73n93J14K31J63k12J25l52L22p7J86j92k05o9j60
$$ -72 46 289 -134 -140 -569 -593 56 229 -364 -250 -19 144 -68 57 -295 27 -50 136 -56 -261 -330 -490
5669d90N18J95l68PN95q49P0K00K5L46k40M9l52K73k57M33k96L9R4O8J05q8j2
$$ -490 28 223 -145 -138 457 -392 -322 -122 -97 249 9 58 -294 -21 -278 155 -141 -102 -8 60 165 77 65
5692F5P2k49K31j05r0K65r37J072l10n57Q24j35j92m51K09M44m78N1O08M54j411
$$ 65 137 -112 119 14 -76 189 -748 324 14 -543 281 146 -46 -497 -288 156 -322 -271 337 791 -620
5713f20O85L09j030K91L47N66m98m33L30j55N14m22j65J92j20l92Q03n58O31j30
$$ -620 65 374 -656 -365 -18 548 50 -383 -53 -208 306 -116 -281 -89 -209 -601 202 -356 275 145
5733A45n74L78k10N93o44K75l26J015p89K80l22k01K73o9k77M60k20l7K42k19
$$ 145 -429 -51 -261 332 -312 -37 -363 652 -137 143 -179 -380 -107 -176 -453 7 -213 -250 -8 -227
5753b27m56N33K63l35L26R5p62R94m84m78R78n14o0l07L30LM62m22L03J96m25
$$ -227 -683 -150 113 -222 104 199 -563 431 -53 -531 447 -67 -127 -434 -104 -101 361 -61 242 438 13
5774A3j78N2p0j14O21J79k30j32n70M61q7j93O79j22k55k39L00m53M00K23m26
$$ 13 -165 -113 -183 -297 324 503 273 141 -429 32 -55 -248 431 309 54 -185 115 -338 62 285 -141
5795a41p6K59l0j39J98j91K2L83j29J73m86j13q6K96L25J91r02O44j07L31k66
$$ -141 -217 42 12 -127 71 -120 -98 285 156 329 -157 -270 -356 -60 265 456 -446 198 91 422 156
5816A56J6j12Q6l13L53k85nJ9L9k5L26n5l60J40mj74M58J11k69j12j16qo7L96
$$ 156 172 60 146 -167 186 -99 -104 -85 -46 -71 255 200 -160 -20 -24 -198 260 371 102 -10 -126 -134 -201 195
5840A95K20l7o5n44K34k12L28j07L2n33N6O08j03O97n29m33L23J4j45m1K9k36
$$ 195 415 378 313 -231 3 -209 119 12 44 -489 -433 175 72 769 240 -193 130 144 -1 -42 -13 -249
5862b49J10k2k29L82k94K52J02l34L02k66L84k48Q0L24k64L63o6l50L47j9l88
$$ -249 -139 -161 -390 -8 -302 -50 52 -282 20 -246 138 -110 -30 294 30 393 327 -23 324 305 -83
5883h3K88j46Pl11K38n6L43J21m5k40J6j91K57r3j41Q5k8n7rK85m69K82o41O91
$$ -83 205 59 66 -245 -7 -63 280 401 356 116 132 -59 198 105 -36 49 21 -36 -45 240 -229 53 -588 103
5907A03J90l95K31L9N81l85n08K31k27Rr9Q5j37L21K05m30J9Q0J23p0j05Q1J23
$$ 103 293 -102 129 168 749 364 -144 87 -140 -131 -230 -145 -282 39 244 -186 -167 -87 36 -34 -139 -58 65
5930F5j42rL08m0k44l18N64M53q13k29K07R5k7m95N78K18o13M31M5J89m89L19
$$ 65 -77 -86 222 182 -62 -380 184 637 -176 -405 -198 -103 -130 -625 -47 171 -442 -11 34 223 -266 53
5952E3K02k98k17M17k59k18J47n0K23m1j7M8K02k80j78L61O2J36q77L56L56K28
$$ 53 255 -43 -260 157 -102 -320 -173 -223 0 -41 -58 -10 192 -88 -266 95 157 293 -584 -228 128 356
5974C56j71o18O85m06j8K31L89o99L89M29p66K94o8j12J89j21j50m5K04K76j23
$$ 356 185 -433 252 -154 -172 59 448 -251 138 567 -199 95 27 -85 104 -17 -167 -212 -8 268 145
5995A45k59L19QJ74k35K6l6l6j40J36jl26K91K36j76l15k20N21j4l08J50k28N80
$$ 145 -114 205 213 387 152 178 142 106 -34 102 101 -225 66 302 126 -189 -409 112 98 -210 -60 -288 292
6018B92K7m14j01L03K93k38J90j54j88j41M7K86O3K5o00N35O8l93L2L73m39J02
$$ 292 319 -95 -196 107 400 162 352 198 10 -131 -84 202 265 290 -310 225 293 -100 -68 305 -134 -32
6040c2N1r1rp8O7J42j53p5J23o1K68j4k60k22M24j84J02k09p0L98k33k4L46q1
$$ -32 19 -72 -81 -159 -92 50 -103 -178 -55 -116 152 138 -122 -344 80 -104 -2 -211 -281 117 -116 -140 206 125
6064A25k30J52j9nJ23m16N66j81J24k32L43m09J67k1J27o6KJ64k17j25J59m3r8
$$ 125 -105 47 28 23 146 -270 296 115 239 7 350 -59 108 87 214 148 150 314 97 -28 131 88 -10
6087a0J53l12J36J40L5N3n48M21J18m52K74M1l6K17m72L46Jk41K2O35m73K43l03
$$ -10 143 -169 -33 107 142 195 -353 68 186 -266 8 49 13 230 -242 104 105 -136 -114 521 48 291 -12
6110a2L73K55p95L27k26K25o9L3j41j15J83J8k5j5K0m5j03J99q4l53M93o4j33
$$ -12 361 616 -179 148 -78 147 78 111 -30 -145 38 56 31 16 36 -9 -112 87 3 -350 143 79 -54
6133e4J6j22L32J3n21K65K17m28K05J04k40J11j77L07M5j57r8j65K94m2J66j99
$$ -54 -38 -160 172 185 -336 -71 146 -282 -77 27 -213 -102 -279 28 73 -84 -182 -347 -53 -95 71 -128
6155a28J06j53O03n6l41k38L33k2k71J76J9nJ41l52M79j65j9N3k54J12L24o02
$$ -128 -22 -175 428 372 31 -207 126 104 -167 9 28 23 164 -188 291 126 107 160 -94 18 342 -260
6177b60J78J53Q2j94Lo0L42m20M57k4j17r0j85p4J89k5oQ6J31o5k0KJ97M0k19
$$ -260 -82 71 153 -41 -38 -98 244 -176 281 257 140 50 -135 -209 -20 -45 -51 35 166 101 81 83 280 320 101
6202A01j9k94J49j11R6K39l3k5K10k25j6L3J14k16j58N9K1L20l04k76L76N8J9
$$ 101 82 -212 -63 -174 -78 161 128 103 313 88 72 105 219 3 -155 -96 -75 245 -59 -335 41 99 118
6225A18p7on1K09o4n57n4L86J00N2k79K63Q7n16Q50l37J00J71k2q3O9l71K55k74
$$ 118 41 35 -16 193 129 -428 -482 -96 4 56 -223 40 127 -389 461 124 224 395 373 290 359 -12 243 -31
6249c1K45k40o6M53j95O2k79j03N58p48J62K55j47M94q09J24K54o4J25J74k09
$$ -31 214 -26 -92 361 166 228 -51 -154 404 -344 -182 73 -74 420 -389 -265 -11 -75 50 224 15
6270A5J37l04M97m65M7j23K58r74Q65M46p04P63m62j004J660n40J36R0k20m49
$$ 15 152 -152 345 -120 -73 -196 62 -912 -47 399 -305 458 -4 -1008 652 112 248 338 118 -331
6290c31O15k15M08r38L55L24r55K87K8Q92j31j044Q97k87k33k3l08O76q62J147
$$ -331 284 69 477 -461 -106 218 -737 -450 -422 470 339 -705 192 -95 -328 -351 -659 17 -845 302
6310C02k81N0l08L68j36N37p80L57o4M94l08J88l36k41m30P42l36J87q19J388
$$ 302 21 71 -237 131 -5 532 -248 109 45 539 231 419 83 -158 -588 154 -182 5 -814 574
6330E74n01p51O36n55O63o6L27j27j22l46N78j74k36n13J285j19K46l33j600R89
$$ 574 73 -678 -42 -597 66 0 327 200 78 -268 310 136 -100 -613 672 553 799 466 -1134 -145
6350a45k08Q95k03r24J318r60Qk96J648r14K71m66n08L88j1N68k23L96l32j5j005
$$ -145 -353 542 339 -585 733 -227 -219 -515 1133 219 490 24 -484 -96 -107 461 238 634 302 287 -718
6371g18J59J001l41m23M24k96M77j108J012k79o06O99o06N59L34L12j183P97J44
$$ -718 -559 442 101 -322 102 -194 283 -825 187 -92 -698 1 -605 -46 288 600 -583 214 358
6390C58J33k44m4M9m81Q38l57n29O42j065J635j738J707j045O16j227M92J43N34
$$ 358 491 247 203 252 -229 609 252 -277 365 -700 935 -803 904 -141 475 -752 -260 -117 417
6409D17K88k02M74j563J013o89L84o86J166k32l19j32n60M14N87r62P87r40Q16
$$ 417 705 503 977 -586 427 -262 122 -564 602 370 51 -81 -641 -227 360 -602 185 -755 61
6428F1L70n97M41M81o02L73j174J199m15O13p78L92m42M61m2j25l55Q3l04R02
$$ 61 431 -166 275 756 154 527 -647 552 137 750 -28 364 -78 383 341 216 -139 -56 -360 542
6448E42j211J59M34K05J42o48j1m54R29O23m50J73K35o83N96o80j71L20N62q04
$$ 542 -669 -510 -76 129 271 -377 -388 -842 87 710 260 433 668 -15 581 -99 -270 50 612 -192
6468a92K84j52K82k11J95rm02N00k74J15j30R7L20o93J11n4J75n0j79O45l54l43
$$ -192 92 -60 222 11 206 197 -205 295 21 136 6 103 423 -270 -159 -213 -38 -88 -267 378 24 -319
6490c19L19N48p35L29n46O79n50K30rl24L29L87k24j58L18r5m1l1K39o91K72m1
$$ -319 0 548 -187 142 -404 275 -275 -45 -54 -378 -49 338 114 -44 274 179 138 107 346 -345 -73 -114
6512a14j06k9L23qm9Q1Q2O7n35L96L01P4n36j11L62j60J72m02N61k82n17L59j68
$$ -114 -220 -249 74 66 17 98 180 247 -288 108 409 483 -53 -164 198 38 210 -192 369 87 -430 -71 -239
6535b39M61j67Q7k6NLll5P4k01J47p0J50qj64K77o33N05r1K63M6l62N7j56Q5j6
$$ -239 222 55 142 116 121 124 121 86 160 -41 106 36 186 178 14 291 -342 163 72 335 381 19 76 -80 5 -11
6561a1l16K37J41J0j47J76o3k46N04m56qK41j98j02J45K22J79j44l81J50J60p5
$$ -11 -327 -90 51 61 -86 90 27 -219 285 -171 -179 62 -136 -238 -93 129 308 164 -217 -67 93 18
6583A8K56n10K65j02j77M37o8j82O2k17K81k11j2K42L8k49j56L25P7m1j73j4j07
$$ 18 274 -236 29 -73 -250 187 119 -63 -1 -218 63 -148 -160 82 120 -129 -285 40 117 76 -97 -111 -218
6606b18K67o6P9O6k06Kj37J28q8K02J21k10J56k32K45m1R8j79J42J5j81K0r2J54
$$ -218 49 -17 62 128 -78 -76 -213 -85 -173 29 150 -60 96 -136 109 68 166 -13 129 144 -37 -17 -109 45
6630D5M3k48J86n3J37k50p7R5q1L30m7j96K07j9j80q3K14j07M2M1J1rN1J6R4q1
$$ 45 88 -160 26 -27 110 -140 -217 -122 -203 127 80 -116 91 72 -108 -191 23 -84 -42 -1 10 1 52 68 162 81
6656H1jJ19k99j9O4N9p1J16K52l00o1QK01j40j91J41k7K10k72jP3J77j37j25o6
$$ 81 80 199 -100 -119 -55 4 -67 49 301 1 -60 -52 149 9 -182 -41 -68 142 -130 -131 -58 119 -18 -143 -209
6681b09R9l8N0M2J83l63K95n4J50j23J29lj72J15o0q4lJ1l8K40L6j79j71K12J87
$$ -209 -110 -148 -98 -56 127 -236 59 5 155 32 161 158 -14 101 41 -43 -46 -35 -73 167 203 24 -147 65 252
6706B52l27nM36k28j54K89l47k54N15k84m4J88n9KJ50m0mk0j40J31j43j28K46
$$ 252 -75 -80 356 128 -26 263 -84 -338 177 -107 -151 37 -22 -20 130 90 86 66 -74 57 -86 -214 32
6729C2Q1q5n2R0k69L35l37J97jq9R2oP6k18rN1J89j36J07M3k55K38m9k39K76J32
$$ 32 113 28 -24 66 -203 132 -205 -8 -9 -98 -6 -12 64 -154 -163 -112 77 -59 48 91 -164 74 25 -214 62 194
6755A94j22j3m0k00r2L81j92P3J13k32J68mj67j08J50n8M36m04K16j54L5J06j49
$$ 194 72 59 19 -181 -273 108 -84 -11 102 -130 38 34 -133 -241 -91 -149 287 -117 99 -55 -20 86 -63
6778f3jj21J96J01j92J19J71k91R4p6J52j45K61M9l30K52k13j35K85J08p4j7K
$$ -63 -64 -185 11 112 -80 39 210 -81 13 -63 89 -56 205 254 -76 176 -37 -172 113 221 147 130 132
6801A32J95l44J07k47J06o6L1J24J58k3n8k2q6J49k35J13j03K87k86J62j1l45
$$ 132 327 -17 90 -157 -51 -117 -86 38 196 173 115 93 7 156 -79 34 -69 218 -68 94 83 -262
6823b62L58p8J60k43%l8K09k71J57R5p4j99R2j6K17k24K47m88M71N7m09J55P5
$$ -262 96 18 178 -65 -65 -103 106 -165 -8 87 13 -186 -94 -110 107 -117 130 -358 113 170 -239 -84 -9
6846iK55l09J15k0J99k09O1j47K13q7P5q1N7l25M69l65J12P7p2j50J05Q6Q5J9
$$ -9 246 -63 52 32 231 22 83 -64 149 62 137 56 113 -212 257 -108 4 81 9 -141 -36 50 135 154
6870A54j72M5J02m56K48k3kJ68j4k72P7K68m5l76O85l05k7J55l55J22J0j24K20
$$ 154 -18 27 129 -327 -79 -102 -104 64 50 -222 -145 123 78 -298 387 82 55 210 -145 -23 -13 -137 83
6893H3j10m5p2N7R8n1J04k74j0j0q8J72L98l75K02j97L08j23j02j0j68J89o9O7
$$ 83 -27 -72 -144 -87 11 -40 64 -210 -220 -230 -318 -146 252 -123 79 -118 190 67 -35 -45 -213 -24 -93 -26
6917b6N6k30J08J98j99K3J29J11j35K80k91Q2n6j74Q9o5J22j20J74P9l25L31J27
$$ -26 30 -200 -92 106 -93 -70 59 170 35 315 24 106 50 -124 -35 -100 22 -98 76 155 -170 161 288
6940B88k85l0k0MJ7k65M58l13L03j40q4nM7rk24J63J74j96O2K73k65n6M2J01M0
$$ 288 3 -27 -47 -43 -26 -291 167 -146 157 17 -67 -72 -25 -34 -258 -95 79 -117 -55 218 -47 -103 -61 40 80
6965H0k46J13P7j55J10J96n0k62J70M8j96K05k90K33k52K17Q8Pj62k8K24o3j02
$$ 80 -166 -53 24 -131 -21 175 125 -137 33 81 -115 90 -200 33 -219 -2 86 93 -69 -97 127 64 -38
6988c8J01L7J60k08J83k93j94K25kO9K5p5m9j03K30l2j02O3j78N5L49m18K07N11
$$ -38 63 100 260 52 235 -58 -252 -27 -29 40 65 -10 -59 -162 68 36 -66 -3 -181 -126 223 -195 12 523
7012E23m58k30K00R5j98J00QL32l17j91J32J83l47Q2O5j4LJ20M3k81J47k73L07
$$ 523 65 -165 35 130 -68 32 40 372 55 -136 -4 179 -168 -86 -21 -35 -32 88 131 -150 -3 -276 31
7035C1m4j27K37k14lP5J82m3k46J88o0K7j72j64M49J03l1j16k41L38k11m4o9L32
$$ 31 -13 -140 97 -117 -120 -45 137 94 -152 36 -24 3 -169 -333 116 219 188 72 -169 169 -42 -86 -155 177
7059A77l61Q9l7j33J47K59j25k36L98k72m5J66J6k01K30qk07M06m54R9R1J4K6
$$ 177 -184 -95 -132 -265 -118 141 16 -220 178 -94 -139 27 43 -158 72 64 -143 263 -191 -92 -1 13 39
7082C9l5j7l06J33K77j61L49n10K10K53o45O20k08j12K68k75J73J13j70J27m5
$$ 39 4 -13 -319 -186 91 -70 279 -231 -21 232 -413 207 -1 -113 155 -120 53 166 -4 123 78
7103G8p6j60K54j45R8L0qo4J04k21K30j29P4K5j66K85j36o9j69R9k7j2M84m36
$$ 78 2 -158 96 -49 49 79 71 7 111 -110 120 -9 65 90 -76 209 73 4 -165 -66 -93 -105 379 -57
7127e7L8J88k46M8J35J35j96J27j53r7K44j31Q3k74P1l7N8P1k05M66j50k50K75
$$ -57 -19 169 -77 -29 106 241 45 172 19 -78 166 35 118 -156 -85 -122 -64 7 -198 268 118 -132 143
7150A43m28L55J26N4m34J34n4M9J21j28o1N4N3k54K87Q2J39j86J40l00K04j09
$$ 143 -285 70 196 250 -184 -50 -104 -55 66 -62 -123 -69 -16 -270 17 99 238 52 192 -108 96 -13
7172a3J29M4j95L2L9K29m40N20l13k77K19J39nJ08J83j82k73r0K43j44j37K62
$$ -13 116 160 -35 -3 36 265 -175 345 32 -245 -26 113 108 216 399 217 -56 -146 97 -47 -184 78
7194G8j47k3K63m11n0L19J31k0j08n4O8k50J92j4k72L82k72J01L1j7j37K14o0
$$ 78 -69 -92 171 -240 -290 29 160 140 32 -22 46 -204 -12 -26 -298 84 -188 -87 -56 -73 -210 4 -56
7217e6m9K77l17j01J51jn5R9R6k14n4J20l9M75l85j45K01j15J71M7j6j86J84q6
$$ -56 -105 172 -145 -246 -95 -96 -151 -52 44 -170 -224 -104 -143 332 -53 -198 3 -112 59 106 90 -96 88 2
7241BQ5mk34K36rj67Q0P4J88n29L33j42J49k51M36k97K16l13K38P1l24M12l32
$$ 2 87 83 -151 85 76 -91 -11 63 251 -278 55 -87 62 -189 247 -50 166 -147 91 162 -162 250 -82
7264h2N8J18j01n5J27j61K11k96K04j14l3J85j97O0J14k59L11j87L14n0k48N2
$$ -82 -24 94 -7 -62 65 -96 115 -181 23 -91 -124 61 -136 -76 38 -221 90 -97 217 167 -81 -29
7286b9J58k20O9j06M8j88M61l55K27J28k97K14p5K02l15L6k8J17O4j40R2k06J40
$$ -29 129 -91 -22 -128 -80 -268 193 -162 65 193 -104 110 35 237 -78 -42 -70 47 111 -29 63 -143 -3
7309cJ45l1j92M2K6O6j81J95m2r5J55k66K77l35K80l6m6J86k4k35J4J30K1m1j29
$$ -3 142 111 -81 -39 -13 53 -128 67 25 -70 85 -181 96 -239 41 5 -41 145 121 -114 -100 30 51 10 -119
7334a19P6Nk29M54k6l01K15l2l19J46J64J6J05J29j23k3j52J36k51L24j96R2k18
$$ -119 -43 -38 -267 187 161 -140 75 43 -276 -130 34 50 155 284 161 138 -14 122 -129 195 -1 91 -127
7357a27K00j98M0K7J15j51J4n2Q7j29K62p8Q7k86K79m22J10L32j60j08K91K9j90
$$ -127 73 -125 -85 -58 57 -94 -80 -132 -45 -174 88 10 97 -189 90 -332 -222 110 -50 -158 133 162 -28
7380b8L7l34L57n47N05L42k05k01j62O6L70j84k19N68k89j17J17j6L8m10K98M19
$$ -28 9 -325 32 -515 -10 332 127 -74 -236 -170 200 16 -203 365 76 -41 76 60 98 -312 -14 405
7402D05q40M51m09N73l76O5M01l27l01K13J92lN23m37M14k86n16N68p8m13J81
$$ 405 -435 16 -393 180 -196 -131 270 -57 -358 -145 47 44 567 130 544 258 -258 310 232 -181 0
7423@K41J01j92J87l67O09q72j39N74k86k97Q47l82j52N12m66M87l28K06l55K49
$$ 0 241 342 150 337 -30 579 -293 -432 142 -144 -441 406 24 -128 384 -82 405 77 283 -72 177
7444A77j29L97k26l17K90o1l51K17L14o54L82o2L15k95K88l9l08j69N49k0m17
$$ 177 48 445 219 -98 192 131 -220 -3 311 -343 39 -23 292 -3 285 246 -62 -231 318 298 -119
7465a19L51l08O40q13k23J82P0O94n89M40l49m8K84q34K82P28j73m86j91K70j41
$$ -119 232 -76 564 -249 -472 -290 -220 474 -115 325 -24 -72 212 -622 -340 388 215 -271 -462 -192 -333
7486c33M84Jj89M40k94l51N41l55K16k31p5K32k59N1N13l50J38p9k44p0M29k45
$$ -333 151 152 -37 403 109 -242 299 -56 160 -71 -146 86 -173 -122 391 41 179 100 -144 -214 215 -30
7508c0k0r2L0J50M4m07L21J82l29N86p19N52J82l95O5K06K33m29L91l40L35k62
$$ -30 -50 -142 -112 38 82 -325 -4 178 -151 435 -284 268 450 55 120 326 559 130 521 181 516 254
7530B54O6q49P76k14M5j25m45M68M55p34N97m43k1L24o67M54n14N46o3k8K72o2
$$ 254 320 -529 247 33 78 -47 -492 -24 431 -303 294 -149 -170 154 -513 -59 -573 -27 -90 -118 154 92
7552I2l82l77J065k84j85K00l86r6L79K40o84Q48n60K02j60J37L20l88K96j48
$$ 92 -290 -667 398 114 -71 129 -257 -353 26 266 -418 430 -130 72 -88 49 369 -19 277 129
7572A29o3Q7l09k56K66N92o67%k95J093m02J21p81M9N71k26n29O77l63M9L49l89
$$ 129 66 153 -156 -412 -146 446 -221 -221 -516 577 175 296 -485 -436 135 -91 -620 57 -306 -257 92 -297
7594b97N00K56l30l58Q25r2m4n3l38L70j87m39J64k83P5J93R00r98L79l97L45
$$ -297 203 459 129 -229 596 504 460 407 69 439 252 -187 -23 -306 -231 -38 862 -136 243 -154 191
7615A91L97l38O44j435J111j81m21j90J44O77k11k03p94J469p15j31j60Q54n42
$$ 191 588 250 894 -541 570 389 -32 -222 -78 599 388 185 -609 860 145 14 -146 708 166
7634A66p6P4p1M69m93N48k63l59M16o49J4L10L42j47l65L03j04L5L02m20Q7k01
$$ 166 90 164 93 562 69 617 354 -5 411 -238 -224 86 428 281 -84 219 115 150 452 32 119 -82
7656h2J26o31J510q37K24J65m62l59L60N9J5j91l9J05j45K96Q1j18l32K24J25
$$ -82 44 -587 923 86 310 475 13 -346 14 73 88 -103 -142 -37 -182 114 195 77 -255 -31 94
7677I4k11K61q6J9pj37L63m33n1K85Q7J41l14k2K26j07p2r5J10J4k55L49j62O2
$$ 94 -117 144 58 77 70 -67 296 -137 -188 97 184 325 11 -11 215 108 36 -59 51 65 -190 159 -3 59
7701E9K5p7m7M3K72l80J29J53l64K89k20N9J3j19O5K36k38K83q5p6om1l7n7J14
$$ 59 84 7 -40 3 275 -105 24 177 -187 102 -118 -59 -46 -165 -100 136 -102 181 96 20 14 -27 -64 -121 -7
7726gj08N9k23K19Q3J50l09K7L43k21l2Pn3P9q3K37j97K3k83J83rK86mK6k03L51
$$ -7 -115 -56 -279 -60 23 173 -136 -109 234 13 -19 -12 -65 14 -69 168 -29 -6 -289 -106 -115 171 167 193 -10 341
7752C41l44m7J34j97MO5J37J6k74J00j00J97M3N7j65j20J42r2k35N73j11L9mo7
$$ 341 -3 -50 84 -113 -109 -44 93 109 -165 -65 -165 32 75 132 -33 -153 -11 -103 -338 235 124 163 159 92
7776I2m4m74M53J35k94J48L08o35L03m1l9j0K45k94J1M4n3K67l19K67j58N8J1
$$ 92 48 -426 27 162 -132 16 324 -311 -8 -49 -88 -98 147 -147 -136 -92 -145 122 -197 70 -88 -30 -19
7799a9J87j11K16l70K83k27P4J68m88J79K36l45J48q3j15L46j59J85k06o6j72
$$ -19 168 57 273 -97 186 -41 33 201 -287 -108 128 -217 -69 -152 -267 79 -80 105 -101 -167 -339
7820c39L47jo7J37j20m2j46J90J47K5k17J09N1M9L72n18j9J47l2o2r2Q3j26J16
$$ -339 8 7 -60 77 -43 -85 -231 -41 106 131 -86 23 74 123 495 -23 -42 105 73 11 -81 2 -124 -8
7844hk62M2L09q0m9o6M9k8L6J64k13N0p1P4J09j64J11k97N12j59M5n4J56j52L28
$$ -8 -270 -228 81 1 -48 -114 -65 -93 -57 107 -106 -56 -127 -53 56 -108 3 -294 218 59 104 50 206 54 382
7869C82k68m95P03m65j7K10l93M27Q2j01J79m52j38N52j73K65n03J16L82k67J27
$$ 382 114 -381 322 -143 -160 50 -343 84 166 65 244 -208 -346 206 33 298 -205 -89 293 26 153
7890A53p0n0M4j16M6J8J11K32k03j72R5l54J94J70M5J43l68n00P03k74j56L52
$$ 153 83 33 77 -39 7 25 136 368 165 -7 88 -266 -72 98 143 286 -82 -582 121 -153 -309 43
7912D3M05p28K39R3K61l73J07k99M32K73n30j2L53L67q15L05m34O18j88j58J03
$$ 43 448 -280 -41 52 313 -60 47 -252 180 453 -77 -89 264 631 -184 121 -313 305 117 -41 62
7933F2K71J32l29J92k77O5j49K85m8k57J72O6q7j11k47Q8L37m04K51l45N5j37
$$ 62 333 465 136 328 51 116 -33 252 204 -53 119 185 98 -13 -260 -172 165 -239 12 -333 -278 -415
7955d15O61l61L07N42p34J19K64n0j60n22j73O98k57K92m47M34n77O77o23M19
$$ -415 246 -115 192 734 0 119 383 333 173 -349 -522 176 -81 211 -236 198 -379 298 -325 94
7975I4j92l12Q22m75M74p92L84L76m64j100J112j67O13l10o59J171L0n09k88N40
$$ 94 -98 -410 412 -63 411 -381 3 379 -85 -1185 -73 -240 373 63 -596 575 605 96 -192 348
7995C48l2j09K10q28K70M40q01M02M00K75o83M50n15K47M30r9m93k16O3J89K69
$$ 348 316 207 417 -411 -141 299 -502 -100 300 575 -108 342 -173 74 504 405 -88 -304 -241 -52 217
8016B17q33P65j29p5M88m77j62m6L79m64L37j6%K53j40j11J00pj79PL00n94K19
$$ 217 -616 149 20 -55 433 -44 -206 -252 127 -337 0 -16 -16 237 97 -14 86 79 -100 -93 207 -387 -168
8039a68J89J21M8o08M14j71M2m56L13N11L47l42k60l42O81l89n0J34k31J40N00
$$ -168 21 142 190 -418 -4 -175 -133 -589 -276 235 582 240 -20 -362 319 -70 -120 14 -217 -77 423
8060D23k24l74j95P4O52l97J59L88o83J53p9n15Q59l04o47K74Q49k10L88q11P46
$$ 423 199 -175 -370 -296 356 -41 118 506 -177 -24 -103 -618 241 -63 -710 -436 413 203 591 -220 526
8081E26l52k43m19N40l82K48n89J203r8O9m99k76J080L12j189k29R79k26k75j239
$$ 526 174 -69 -488 52 -330 -82 -671 532 434 503 4 -272 808 1120 -69 -298 681 455 180 -1059
8101a059M94R20n36M10J50m79L45k31o95O47j21J005o50m00N35N29p89l16o6K84
$$ -1059 -565 355 -181 229 379 -100 245 14 -681 -34 -155 850 200 -200 335 864 75 -241 -307 -23
8121b3j81j66L55j98L89j29K49Pn17L55n50M44P8k93J173j079j79M23J429r46
$$ -23 -204 -370 -15 -213 176 47 296 303 -214 141 -409 35 113 -180 993 -86 -265 158 1587 641
8141F41j43q7j18k85j76j81P04M45q94M21k22l46M81j89O66k93m86L35m03R8P30
$$ 641 498 411 293 8 -168 -349 355 800 -94 327 105 -241 240 51 717 424 -62 273 -130 -32 698
8162F98k78l31L12o92P04K14q01N15n67K47l7N7J141r98j20M62n24l67J24M47
$$ 698 420 89 401 -291 413 627 -174 341 -226 21 -16 41 1182 184 64 526 2 -365 -241 206
8182B06J78r01j22K77N68l47K54q15N30
$$ 206 384 -517 -639 -362 206 -141 113 -702 -172
8191a72
$$ Imaginary data points
##PAGE= N=2
##DATA TABLE= (X++(I..I)), XYDATA
0@%%%%%%%%%%qJ6j6J6k4L2l2M0n5O7p9R4j14J34j58J86k14K49k89L32l80M35m96
$$ 0 0 0 0 0 0 0 0 0 0 0 -8 8 -8 8 -16 16 -16 24 -31 36 -43 51 -63 71 -87 99 -115 134 -155 177 -203 232 -264
33b64N61o34P17q08R05j012J131j261J404j559J728j915K117k336K577k841L131
$$ -264 297 -337 380 -428 477 -535 596 -665 739 -820 908 -1007 1110 -1226 1351 -1490 1641
50A641l451L802m188M617n095N633o242O937p733Q662r766J1099j2747J4844j7621
$$ 1641 -1810 1992 -2196 2421 -2674 2959 -3283 3654 -4079 4583 -5183 5916 -6831 8013 -9608
65i608K1493k7319L7234n8723J92536m0744P9022K44291l67527M3476K23248k36820
$$ -9608 11885 -15434 21800 -36923 155613 114869 193891 438182 70655 114131 337379 100559
77A00559r4043K63701j57901j37247K15871m6516j94132J77159J8260j89286R8664
$$ 100559 6516 270217 112316 -24931 190940 144424 -49708 127451 145711 -43575 55089
88E5089Q6629j64035M2200J18454j07492k5806J33663n8177q4354J13132m73j35209
$$ 55089 141718 -22317 19883 138337 30845 5039 138702 80525 -3829 109303 108830 -26379
100b6379P9489N7180j47450L4104J17330j25760j6522J55179p9295q2558J61684
$$ -26379 53110 110290 -37160 -3056 114274 -11486 -28008 127171 47876 -34682 127002
111A27002l1194j48618J31752K3120j92574Q9291Q5422j89108M6022J45167j47233
$$ 127002 95808 -52810 78942 102062 -90512 -1221 84201 -104907 -58885 86282 -60951
122f0951K25J77506r2991n4666J67745m7812j08664J29970o205j40490Q7399L8998
$$ -60951 -60726 116780 23789 -30877 136868 89056 -19608 110362 104157 -36333 51066 90064
134I0064j36348N3380Q0901j05780J9662J05654o8150k3275J03126l2544o7818
$$ 90064 -46284 7096 87997 -17783 1879 107533 39383 16108 119234 86690 18872
145A8872Q1510M554r7788N0631M6015j01143J3620Q0779q1999k9724R4736m8526
$$ 18872 100382 104936 7148 57779 103794 2651 16271 97050 15051 -14673 80063 31537
157C1537p4436Q7966o103j06235O8975M3298j14344M2012Q7536j01497N832J12339
$$ 31537 -42899 45067 38964 -67271 1704 45002 -69342 -27330 60206 -41291 -35459 76880
169G6880p8560m0413J10134m8857q1476R1758j0030j00983P3934L5079r6930N4806
$$ 76880 -1680 -42093 68041 19184 -62292 29466 19436 -81547 -7613 27466 -69464 -14658
181a4658P3543q2177K5852Q9043o7237j5452Q2068n0499n4110O6449k0854p4417
$$ -14658 58885 -23292 2560 91603 24366 8914 90982 40483 -13627 52822 31968 -42449
193d2449N4494J9318p3360M1278N5529o3337J5117P3768n1383k4780P0233l1537
$$ -42449 12045 31363 -41997 -719 54810 -8527 6590 80358 28975 4195 74428 42891
205D2891o1723N6218N25p9942L9754L9707p8091J9225O9785o3958r534P9626m3958
$$ 42891 -18832 37386 37911 -42031 -2277 37430 -40661 -21436 48349 -15609 -25143 54483 10525
218A0525m1759P3788j6938o4115N9203J5925p2455M1458M2774p0378J7546N6975
$$ 10525 -31234 42554 25616 -38499 20704 36629 -35826 5632 48406 -21972 -4426 52549
230E2549o4519j0951N9280n0553l5232N7191k4006m7371N4233R185n2451M4774
$$ 52549 -11970 -22921 36359 -14194 -49426 7765 -16241 -63612 -9379 -194 -52645 -7871
242g871L4078n4965K1711M8269n7474q878N0930m3997l5259N3060j4842m7037
$$ -7871 26207 -28758 -7047 41222 -16252 -25130 25800 -18197 -53456 -396 -15238 -62275
254f2275N1015K1419n0218L7839M9464n3164R967N8097m9890k3581N6023l3463
$$ -62275 -11260 10159 -40059 -2220 47244 -5920 4047 62144 12254 -11327 44696 11233
266A1233m6308M9787k903n2372M1642K8321n0299K3567M9030m7632J681N1886
$$ 11233 -35075 14712 11809 -40563 1079 29400 -20899 2668 51698 4066 5747 57633
278E7633m1102k1995N0825k6786l7529M5821k382m4592L6706K1664m8937J8988
$$ 57633 16531 -5464 45361 18575 -18954 26867 24485 -20107 16599 38263 -10674 8314
290H314L7423n0649l302M6787m3124k2344N1373k2821l4505M9691M177m3112L5700
$$ 8314 45737 -4912 -8214 38573 -4551 -26895 24478 1657 -32848 16843 21020 -22092 13608
303A3608K6975m9983J0589M0337m9049j4320M6972l5495k8819N0543j0240l4505
$$ 13608 40583 -9400 1189 41526 -7523 -21843 25129 -10366 -39185 11358 1118 -33387
315c3387M5064J5009l8233K6831K9349m3342J190L4971m2006j9608L8756k8908
$$ -33387 11677 26686 -11547 15284 44633 1291 2481 37452 -4554 -24162 14594 -14314
327a4314k7001M2571p109k9247M0114J2263l3668K4992K4810l9785K987L1858
$$ -14314 -41315 1256 -5853 -35100 5014 17277 -16391 8601 33411 -6374 -3387 28471
339B8471l9300j4991M0341k7416k4760M5574p197l1377M0389J1760l8781K3020
$$ 28471 -10829 -25820 14521 -12895 -37655 7919 722 -30655 9734 21494 -17287 5733
351E733K5891m2716L81L6855l5470j7234M4764j9353k6848M4468p45l4106L1601
$$ 5733 31624 -11092 -10711 26144 -9326 -26560 18204 -1149 -27997 16471 15726 -18380 13221
364A3221J3652l8818J1422K3673l7229n621L3166k5751j5074M0714j0129k1209
$$ 13221 26873 -11945 -523 23150 -14079 -19700 13466 -12285 -27359 13355 3226 -17983
376a7983L8861K550k8925K6134J0812l6473Q378K0195l5946n601L2109k4792j4721
$$ -17983 20878 23428 -5497 20637 31449 -5024 3354 23549 -12397 -17998 14111 -10681 -25402
389b5402M0975r830k3692L8574K538l4723K3943J2836m0848N629K4024l5143q426
$$ -25402 15573 5743 -17949 20625 23163 -11560 12383 25219 -15629 -10000 14024 -21119 -29545
402b9545L6995k0109j7981M1893l619k6458L4052P314l4393J7758J4842l5307
$$ -29545 7450 -12659 -30640 11253 7634 -18824 15228 22542 -11851 5907 20749 -14558
414a4558J209K3987k6498r287L2846j3254j6371L3757k499k3884K5276M578k9878
$$ -14558 -13349 10638 -15860 -25147 7699 -5555 -21926 11831 9332 -14552 10724 15302 -14576
427a4576J2775J2500k9537K618K4027k1502n326L3426j1079j5312L3757l043k6336
$$ -14576 -1801 10699 -18838 -16220 7807 -13695 -19021 14405 3326 -11986 21771 18728 -7608
440g608K4330M854l3402J2142J6631l0532J401K9384j9775q923L5947r337k0353
$$ -7608 16722 21576 -11826 316 16947 -13585 -12184 17200 -2575 -11498 24449 15112 -5241
453e241L1155j569l0648J8707N769l2928P305J5794k5822n02K5877j5442q793
$$ -5241 25914 24345 -6303 12404 18173 -14755 -7450 8344 -17478 -17980 7897 -7545 -16338
466a6338K9277p359j9268K4194k913k6941J5875M114k7266Q555J5690k0780K105
$$ -16338 12939 5580 -13688 10506 7593 -19348 -3473 641 -26625 -18070 -2380 -23160 -21055
479b1055K5947j3695q217K8804r402k0263K2935l347k9410J5855P825k6679P900
$$ -21055 4892 -8803 -17020 11784 2382 -17881 5054 1707 -27703 -11848 -4023 -30702 -22802
492b2802K0837k0327L05L1273j1223j2108L0179m520k4860K3475M422k8385J4444
$$ -22802 -1965 -22292 -21987 9286 -1937 -14045 16134 11614 -13246 10229 14651 -13734 710
505G10J5016k3071Q120K3801j4917j278K6458q961j3500K2569n565k2273J6661
$$ 710 15726 -7345 775 24576 9659 8381 34839 25878 12378 34947 29382 7109 23770
518B3770R51k4207J2419J0196j9951Q100J7990j4046j440K1409j1001j4805J9995
$$ 23770 24721 514 12933 23129 3178 11278 29268 15222 13782 35191 24190 9385 29380
531B9380o853k3109J6280K696k4442J2895J3787k0270N799J9873j5537p043K0189
$$ 29380 22527 -582 15698 18394 -6048 6847 20634 364 6163 26036 10499 3456 23645
544B3645j0765k0681J7641l144k6672J5211Q113k3642J0960J7581j7574K808K0287
$$ 23645 12880 -7801 9840 6696 -19976 -4765 3348 -20294 -9334 8247 -9327 -6519 13768
557A3768j2847r334J7796r171j8528J4953k112k1149J4822Q211j8164J3367J5786
$$ 13768 921 -8413 9383 212 -18316 -3363 -5475 -26624 -11802 -3591 -21755 -8388 7398
570G398j4795O544J7586j2983n587J7082r815j5104J7096j318j8767J7225R034
$$ 7398 -7397 -853 16733 3750 -1837 15245 5430 -9674 7422 6104 -12663 4562 13596
583A3596j8679J3360J6018j6621K452J7593j3731r870J6998n925j7904J5997M362
$$ 13596 -5083 8277 24295 7674 10126 27719 13988 4118 21116 15191 -2713 13284 17646
596A7646j9331J4039J3376j8115O652J5886j5831l861J4647j2250j3099J3779
$$ 17646 -1685 12354 25730 7615 14267 30153 14322 10461 25108 12858 -241 13538
608A3538m842j6614J3872M431j6810J2438R937j7682N571J1388j8181l787J2044
$$ 13538 8696 -7918 5954 10385 -6425 6013 15950 -1732 3839 15227 -2954 -6741 5303
621E303j4396j0623J4862n109j3192J7567O435j4854J5738J3054j6805O738J3582
$$ 5303 -9093 -19716 -4854 -9963 -23155 -5588 847 -14007 1731 14785 -2020 4718 18300
634A8300j6282m286J3240j0415j1568J4791l39j3306J3859R352j4533R746J2796
$$ 18300 2018 -2268 10972 557 -11011 3780 3441 -9865 3994 13346 -1187 8559 21355
647B1355j4380j41J3035j3165p500J1709p103j0587J2719P29j1704J2020P112
$$ 21355 6975 6834 19869 6704 -796 10913 3810 -6777 5942 6671 -5033 6987 14099
660A4099j3412P783J0029j6366K402J0824j4040l959J3783p404p780J6562l82
$$ 14099 687 8470 18499 2133 4535 15359 1319 -2640 11143 3739 -4041 12521 12139
673A2139j1893J4452N041j7058P645P851j8760l74J0260j3494n186J4103m769
$$ 12139 246 14698 19739 2681 10326 18177 -583 -957 9303 -4191 -9377 4726 -43
686d3q673J5305L004j2537R528P074j6222J576Q427j5911m066J0502q815o284
$$ -43 -8716 6589 9593 -2944 6584 13658 -2564 -988 7439 -8472 -12538 -2036 -10851 -17135
700a7135J3663J68o846J3346O295j0095R255P831j4468L722Q830j4661j146J1849
$$ -17135 -3472 -3304 -10150 3196 9491 -604 8651 16482 2014 5736 14566 -95 -1241 10608
714A0608r014l485J5164k211p176J4533L418j2665R923O317j7101M021R348j5490
$$ 10608 1594 -1891 13273 11062 3886 18419 21837 9172 19095 25412 8311 12332 21680 6190
728F190j089J3150r040n108J3137j536r753R271K641j3872L520O399j4499j50
$$ 6190 5101 18251 9211 4103 17240 15704 5951 15222 17863 3991 7511 13910 -589 -739
742g39R582r399k084J2188l180m473J0459J025q979N847K994j3067J990N340j3131
$$ -739 8843 -556 -2640 9548 6368 1895 12354 13379 4400 10247 13241 174 2164 7504 -5627
757e627O80J0282r191k56J3902m696l440J2663j920j0411Q294J052j6046L726
$$ -5627 -4947 5335 -3856 -4112 9790 5094 1654 14317 12397 1986 10280 11332 -4714 -988
771i88N577j5348J610J1616j1116j53J4647n785m177J2164j275j0061P035K623
$$ -988 4589 -10759 -9149 2467 -8649 -8802 5845 60 -4117 8047 6772 -3289 3746 6369
785F369j2096K854P530j0572O37J1558o055j445J1368l112m671P681m85q241L838
$$ 6369 -5727 -2873 4657 -5915 -5278 6280 225 -1220 10148 7036 2365 10046 9561 1320 5158
800E158L270r894K129P886q311O17J0628p023k784J1000o194p590P728k281j1312
$$ 5158 8428 -1466 663 8549 238 855 11483 4460 1676 12676 6482 -1108 6620 4339 -6973
815f973N615M071j1579M740J0851q923J427J4136p374l685J1558n711j0024P565
$$ -6973 -1358 2713 -8866 -4126 6725 -2198 -771 13365 5991 2306 13864 8153 -1871 5694
829E694k100j1646M558M920r808L081J0274o171O5J1554m765l771P815l867o823
$$ 5694 3594 -8052 -3494 1426 -8382 -5301 4973 -1198 -1133 10421 5656 1885 9700 5833 -990
844i90L997r10q073L122L832o089K468Q285n150L08R347n511l993P610m384p345
$$ -990 3007 2097 -5976 -2854 978 -5111 -2643 5642 492 800 10147 4636 643 8253 3869 -3476
860c476O083k50q256M853N743q084K696R232p924k069R900o596p091Q633l597
$$ -3476 2607 2357 -5899 -1046 4697 -3387 -691 8541 617 -1452 8448 1852 -5239 3394 -203
875b03q613P168K442p752N229P688o479J675Q320o225l061O983o016n903O019
$$ -203 -8816 -1648 794 -6958 -1729 5959 -520 1155 9475 3250 189 7172 1156 -4747 1272
890A272k764n837N641K230m136N411N583m970K008O480o621k480N663o969n548
$$ 1272 -1492 -7329 -1688 542 -3594 1817 7400 2430 4438 10918 4297 1817 7480 511 -5037
905e037O298l315o072P193K443o093N619O345o582Q09P775p541m363P485n526
$$ -5037 1261 -2054 -8126 -933 1510 -4583 1036 7381 799 1608 9383 1842 -2521 4964 -562
920e62p019P734p58p177O474M053o499L239O172o512j566O695o379m841O411l356
$$ -562 -7581 153 -605 -7782 -1308 2745 -3754 -515 5657 -855 -2421 4274 -2105 -6946 -535 -3891
936c891m588O761O32m013N649L049m133K344M270o168r65M741o215k999O590l432
$$ -3891 -8479 -1718 -1086 -5099 550 3599 -534 1810 6080 -88 -1053 3688 -2527 -5526 1064 -2368
952b368k878P619J90l595N804L059n849J694L965p663k473N662o108m641P891
$$ -2368 -5246 2373 2563 -1032 4772 7831 1982 3676 7641 -22 -2495 3167 -2941 -7582 309
967C09j638m473P993K496m400M605M244n240l64M739o049l160N548l660l528O443
$$ 309 -1329 -5802 2191 4687 287 4892 9136 3896 3532 8271 2222 -938 4610 950 -2578 3865
983C865o28l035O008J199l830K887J753n653o74K585o549k529M787m531k622P026
$$ 3865 3237 202 6210 7409 3579 6466 8219 2566 1892 4477 -2072 -4601 186 -4345 -6967 59
999E9k560l161O462k34n212L405J447o790L65M002n608k350P562k209l302Q892
$$ 59 -2501 -5662 800 566 -4646 -1241 206 -6584 -6219 -2217 -7825 -10175 -2613 -4822 -8124 768
1015G68M25m529O068J541o377J894K712n846j930N077l295l047P135m71l576P348
$$ 768 1193 -3336 2732 4273 -2104 -210 2502 -3344 -5274 -197 -3492 -6539 596 125 -3451 3897
1031C897O86m474M688k02n175J049J347n360l10L688k918r95O616j603k577P205
$$ 3897 4583 109 4797 4595 -580 469 1816 -3544 -3854 -166 -3084 -4079 2537 934 -1643 5562
1047E562j015m746M267l44o784J972J926n677jN339k942j828P109p04l942N680
$$ 5562 4547 -199 4068 3724 -3060 -1088 838 -4839 -4840 499 -2443 -4271 2838 2134 -1808 3872
1063C872K05o037K856P43n978K89L102l194j344N454p74k694N690J43m429M005
$$ 3872 4077 -1960 896 1639 -4339 -4050 -948 -4142 -5486 -32 -806 -3500 2190 2333 -2096 1909
1079A909l54n798K144M89n334J305K734l317J069M969k164j210N768k018l847
$$ 1909 1555 -4243 -2099 -1610 -6944 -5639 -2905 -6222 -5153 -184 -2348 -3558 2210 192 -3655
1094c655M618j674o083M203K85n476L276M233l424J240O440j781k087N720j297
$$ -3655 963 -711 -6794 -2591 -2306 -7782 -4506 -273 -3697 -2457 3983 2202 115 5835 4538
1109D538n133M029l07n856K466J391l944J470L983j964p76M236r90l663L359j442
$$ 4538 -595 3434 3127 -2729 -263 1128 -2816 -1346 2637 673 -103 4133 3143 -520 2839 1397
1125A397n536J924n7m872J956J917l134K269L955k142j51M780k231k995M464j895
$$ 1397 -4139 -2215 -2272 -7144 -5188 -3271 -6405 -4136 -181 -2323 -2474 2306 75 -2920 1544 -351
1141c51n342M713l03n359M200K825m020K617M589l682q32N071l167m497L907j555
$$ -351 -5693 -980 -1283 -6642 -2442 383 -3637 -1020 3569 -113 -945 4126 959 -3538 369 -1186
1157a186n452L765J050m402L378L063k402J189L152j478j414K640j510l590K202
$$ -1186 -6638 -2873 -1823 -6225 -2847 216 -2186 -997 2155 677 -737 1903 393 -3197 -995
1172i95k85l761K978J611j972K809K324j621J299K547k552j261K020k340l855
$$ -995 -1280 -5041 -2063 -452 -2424 385 2709 1088 2387 4934 2382 1121 3141 801 -3054
1187c054L278m97l827M011J435l843L875K881l758O01L281l556k882L661k458
$$ -3054 224 -273 -4100 -89 1346 -2497 1378 4259 501 1102 4383 827 -2055 1606 -852
1202h52m285M017O11m007M174K428l767L158K320l008k96J866k457k545J884j046
$$ -852 -5137 -1120 -509 -4516 -342 2086 -1681 1477 3797 789 493 2359 -98 -2643 -759 -1805
1218a805l112K996J007k490L490J686k474K145J232k961l7J040k327j674K103
$$ -1805 -4917 -1921 -914 -3404 86 1772 -702 1443 2675 -286 -323 717 -1610 -3284 -1181
1233a181p08k229L929J328k733L570K516m254J417K287m250j322K810l015k994
$$ -1181 -1889 -4118 -189 1139 -1594 1976 4492 238 1655 3942 -308 -1630 1180 -1835 -4829
1248d829L841k02l490M109K177l797K870K520m290N31K115l930j149K117j503
$$ -4829 -988 -1190 -4680 -571 1606 -2191 679 3199 -1091 -560 1555 -2375 -3524 -1407 -2910
1263b910j610K707R48j632K893J915k259J946J074l115N97N54l262j2J417j426
$$ -2910 -4520 -1813 -865 -2497 396 2311 52 1998 3072 -43 554 1108 -2154 -2166 -749 -2175
1279b175m30K969O15j691K873J079l150J815J104m484Q85J770l387p73L575j433
$$ -2175 -2605 364 979 -712 2161 3240 90 1905 3009 -1475 -590 1180 -2207 -2980 595 -838
1295h38r50L723J621k900K290K331m318Q69J850m088m30K067k489q43K938K14
$$ -838 -1788 1935 3556 656 2946 5277 959 1828 3678 -410 -840 1227 -1262 -2105 833 1047
1311A047j587L209M45k332J744M13l529N18O49l615P94J571k486Q27K756q26o44
$$ 1047 -540 2669 3114 782 2526 2939 -590 -72 577 -3038 -2244 -673 -3159 -2332 424 -402 -1046
1328a046L079m04k279K046n6l721J026J208l671N49L103k352K87L217j74j940
$$ -1046 2033 1629 -650 1396 1340 -2381 -1355 -147 -3818 -3269 -166 -2518 -2231 986 812 -1128
1344a128K424P63l733J079J123l718j24K399k803J62L415p72l59L100M3k104K003
$$ -1128 1296 2059 -1674 -595 528 -3190 -3314 -915 -3718 -3556 -141 -913 -1272 1828 1871 -233 1770
1361A770R5l279R50J022l283Q11J667j969J202L021j430l27K953j056j512J440
$$ 1770 1865 -1414 -464 558 -2725 -1914 -247 -2216 -1014 2007 577 250 3203 2147 635 2075
1377B075r53l201J560O5k877P77K649k413Q16K880q25p52K601j059k416J502M74
$$ 2075 1122 -2079 -519 -454 -3331 -2554 95 -2318 -1502 1378 553 -199 2402 1343 -1073 429 903
1394I03l581J160J579k727J298K227j663Q96K063o29j646J769l23k478J200j09
$$ 903 -2678 -1518 61 -2666 -1368 859 -804 92 2155 1526 -120 1649 1326 -1152 48 -61
1410f1k492J051J275j597J250K346j619Q74J798j859M8Q82j205k327J907K30k172
$$ -61 -2553 -1502 -227 -1824 -574 1772 153 1027 2825 966 1014 1896 691 -1636 271 501 -1671
1427a671J768J948k766J202L092k579O29J840j737k219J102j086j924L24J343
$$ -1671 97 2045 -721 481 3573 994 1623 3463 1726 -493 609 -477 -2401 -2077 -734
1442g34j962Q73K610k089P58J962q86j049J797j390j607Q26j274j315R70J234
$$ -734 -2696 -1823 787 -1302 -544 1418 532 -517 1280 -110 -1717 -891 -2165 -3480 -2510 -1276
1458a276j832J108K995j836R10J405j576n56J224k377j092J423o41r96J284J308
$$ -1276 -3108 -2000 995 -841 69 1474 -102 -658 566 -1811 -2903 -1480 -2121 -3117 -1833 -525
1474e25j680J809K226k576M94K160k614m45J148r97j565K046L76q64J665J787
$$ -525 -2205 -396 1830 -746 -252 1908 -706 -1151 -3 -1000 -2565 -519 -143 -1007 658 2445
1490B445j304K97K603j498j373J782k317j663J455p30q56R17J040r63J578J455
$$ 2445 1141 1438 4041 2543 1170 2952 635 -1028 427 -303 -1159 -242 798 -165 1413 2868
1506B868q37L18M76j537l39O57j893o07J650j005j146K371k17OJ532J149k044
$$ 2868 2031 2349 2825 1288 949 1606 -287 -894 756 -249 -1395 976 759 765 2297 3446 1402
1523A402J48K242k607r20K244k816j162K094o32j083J838J90r33N37J472j244
$$ 1402 1550 3792 1185 265 2509 -307 -1469 625 -7 -1090 748 938 5 542 2014 770
1539G70l36J121k007j282K206k053j59J876j23k99J432N38J20K0N16j413q3N79
$$ 770 434 1555 -452 -1734 472 -1581 -1740 136 13 -286 1146 1684 1804 1824 2340 927 844 1423
1557A423j502j12J560j113l29K451p27j51J374k0j810J509N60k892m43J621k711
$$ 1423 -79 -191 1369 256 -73 2378 1651 1500 2874 2854 1044 2553 3113 221 -222 1399 -1312
1574a312p78K507m27j715L229n0o74J727Q08j882n46J560j743p46J140j464o90
$$ -1312 -2090 417 -10 -1725 1504 1454 780 2507 3315 1433 887 2447 704 -42 1098 -366 -1056
1591a056K454p55n1J511J25n59R26m45j179J1o03j253K76N78m84l05J223l00j53
$$ -1056 1398 643 592 2103 2228 1669 2595 2150 971 982 379 -874 -598 -20 -504 -809 414 114 -39
1610c9J815j60j778R67l60k355P19J143j953P0J736o91o11K501q2j621K124q64
$$ -39 1776 1616 -162 805 445 -1910 -1191 -48 -2001 -1931 -195 -886 -1497 1004 922 -699 1425 561
1628E61j051L40n89j665j97J678r76Q8K151o73L47J694j64j066Q77q9j191j00
$$ 561 -490 -150 -739 -2404 -2601 -923 -1899 -1811 340 -333 14 1708 1544 478 1355 1266 75 -25
1646b5j43j103L35K30n23L94J718p64M0K292j457l35J267j025j802O15l5j017
$$ -25 -168 -1271 -936 -706 -1229 -835 883 119 159 2451 994 659 1926 901 -901 -286 -321 -1338
1664a338N65R27o18r71K963q25j376K479j451o46J159p14j728R58P46j232N84
$$ -1338 -773 154 -464 -1435 1528 703 -673 1806 355 -291 868 154 -1574 -616 130 -1102 -518
1681e18J621k07q58R64k67k36P16m15k109P89o23o45P20p2J90M69J251n76L45
$$ -518 1103 896 38 1002 735 499 1215 800 -1309 -520 -1143 -1788 -1068 -1140 -950 -481 770 194 539
1700E39Q41j290p53J322j249k069K047q89j000J016Q68k76M22J780o13L87J320
$$ 539 1380 90 -663 659 -590 -2659 -612 -1501 -2501 -1485 -617 -893 -471 1309 696 1083 2403
1717B403j149j235J539j679r71N53O67j713J309Q24k73m0J739m49j030O87j49
$$ 2403 1254 19 1558 -121 -1092 -539 128 -1585 -276 548 275 235 1974 1525 495 1182 1033
1734A033j141K92L02r23O96N42p61J346N59m01N60j32n00k04M61r41j005J779
$$ 1033 -108 184 486 -437 259 801 40 1386 1945 1544 2104 1972 1472 1268 1729 788 -217 1562
1752A562j250j133J425Q51r06J336J026j584J21P35j356j075R27k78j760J460
$$ 1562 312 -821 604 1455 549 1885 2911 1327 1448 2183 827 -248 679 401 -1359 101
1768A01k13q60J546P01m05N75R61j378L27L96k62k318J103q66j168J293k1l04
$$ 101 -112 -972 574 1275 870 1445 2406 1028 1355 1751 1489 -829 274 -592 -1760 -467 -488 -792
1786g92M70J169j111J107j12k57q62L17l61q83N39n82o09J136J1m03J317P90j204
$$ -792 -322 847 -264 843 731 474 -388 -71 -432 -1315 -776 -1358 -1967 -831 -820 -1223 94 884 -320
1805c20J28J575j032n41O43j078r04J386M32j976J874J397j366P69N53j837m0
$$ -320 -192 1383 351 -190 453 -625 -1529 -143 289 -1687 187 1584 218 987 1540 -297 -337
1822c37Q76j010k28J41O4o58O91P34j135J832L63o10P97l29j182j1N50j151m95
$$ -337 539 -471 -699 -558 -494 -1152 -461 273 -862 970 1333 723 1520 1191 9 -2 548 -603 -1098
1841a098Q80n80m65K206k58o97J486l31j067J573q05r62P42o63p12o40J916q57
$$ -1098 -218 -798 -1263 943 685 -12 1474 1143 76 1649 844 -118 624 -39 -751 -1391 525 -332
1859c32j089K026M06j696J482M81j478M05M65r01k97K93K95m87O49M81l88N49
$$ -332 -1421 605 1011 -685 797 1278 -200 205 670 -231 -528 -235 60 -427 222 703 315 864
1877H64Q67j304M56k96n69j49M00j234k1P82o18O28L30p3n62J283J90j108M69
$$ 864 1731 427 883 587 18 -131 269 -965 -986 -204 -822 -194 136 63 -499 784 974 -134 335
1896C35j6j341K85M31j124l08J703p12k67J228O92q20M57P39j984O42L34j577
$$ 335 319 -1022 -737 -306 -1430 -1738 -35 -747 -1014 214 906 86 543 1282 -702 -60 274 -1303
1914a303n1N79m26m73J313Jk45M98Q34j317J093l72n07N32k84r34N61p9o2L85
$$ -1303 -1354 -775 -1201 -1674 -361 -360 -605 -107 727 -590 503 131 -376 156 -128 -1062 -501 -580 -642 -257
1934b57O21J88NQ95K11j181O83N5j664Q94O91j803J083M39j08j62J173r5j027
$$ -257 364 552 557 1452 1663 482 1165 1220 -444 450 1141 -662 421 860 752 590 1763 1668 641
1953F41N76M65j497R86k30j243N33P31p86o0J218m58K94j09L88n67j44N35j277
$$ 641 1217 1682 185 1171 941 -302 231 962 176 116 1334 876 1170 1061 1449 882 738 1273 -4
1972dK21n40p90M8J072o48PR71r03O66L30k63p82L74p3j409N66P93k125J358P76
$$ -4 217 -323 -1113 -1065 7 -641 -634 337 -566 100 430 167 -615 -241 -314 -1723 -1157 -364 -2489 -1131 -355
1993c55m27J5J378j123N19M75j62r64K90j44j116K89O31n37J095Q95k57q63J677
$$ -355 -782 -767 611 -512 7 482 320 -644 -354 -498 -1614 -1325 -694 -1231 -136 759 502 -361 1316
2012A316J36q87L69p06j75l26L16j106R36M52l20Q44j65m30Q17M53j068N25r36
$$ 1316 1452 565 934 228 53 -273 43 -1063 -127 325 5 849 684 254 1071 1524 456 981 45
2031D5k14L02P99j086l83R84L33l11l98R35m46K86J67j13j400Q41j094k26O65
$$ 45 -169 133 932 -154 -537 447 780 469 71 1006 560 846 1013 900 -500 341 -753 -979 -314
2050c14J134j837J110K28k78j05Q32m19k54P58j201k42j5q17O51l25Q34o54R13
$$ -314 820 -1017 93 321 43 -62 770 351 97 855 -346 -588 -603 -1420 -769 -1094 -260 -914 -1
2069ao53j57J885j772l58R20j68q01p30N87o90O83L68L01j060J767j1j433N57
$$ -1 -654 -811 1074 -698 -1056 -136 -304 -1105 -1835 -1248 -1938 -1255 -887 -586 -1646 121 110 -1323 -766
2088g66P93r63o58O71q05M91n7J67K69K78N13m43L89L73o50j9P19q70o06Q54p38
$$ -766 27 -936 -1594 -923 -1728 -1237 -1294 -1127 -858 -580 -67 -510 -121 252 -398 -417 302 -568 -1174 -320 -1058
2109a058M25M07l52K24l62J289p81k37M43m63M39p64Pq30J761j391Q82J180j056
$$ -1058 -633 -226 -578 -354 -716 573 -208 -445 -2 -465 -26 -790 -783 -1613 148 -1243 -361 819 -237
2128b37K42J29O51q41O86k64j557j05J203j858J244O01m48p11J068r1j76M56O77
$$ -237 5 134 785 -56 630 366 -1191 -1296 -93 -1951 -707 -106 -554 -1265 -197 -288 -464 -8 669
2147F69j155L66O64j483k52J126J88J31R8j99O0j17J184o84N12j37m98K74N24
$$ 669 -486 -120 544 -939 -1191 -65 123 254 352 153 213 96 1280 596 1108 971 473 747 1271
2166A271j634Q62l33o24J423p7m57k1L67J180j182J37J70o80kP23j301J43J584
$$ 1271 -363 499 166 -458 965 888 431 410 777 1957 775 912 1082 402 400 1123 -178 -35 1549
2185A549q51m72J155n50L27q94J163l13L33o02K39j197K11O38R1k85J49Q53P88
$$ 1549 698 226 1381 831 1158 264 1427 1114 1447 845 1084 -113 98 736 827 542 691 1544 2332
2204B332q38j191N47J35p86k11M08m93J63J287j515M98K03P41o07J531p39j180
$$ 2332 1494 303 850 985 199 -12 396 -97 66 1353 -162 336 539 1280 673 2204 1465 285
2222B85O95O21m40n2m98K87n28J115o98N27P49q15J3N50j178N37j31q72J008j48
$$ 285 980 1601 1161 1109 611 898 370 1485 787 1314 2063 1248 1261 1811 633 1170 1039 167 1175 1027
2242A027Q65q36J1j08q06N95J172l13J18K79p84J1j176M22j30O29j91K64o24J208
$$ 1027 1892 1056 1067 959 153 748 1920 1607 1725 2004 1220 1231 55 477 347 976 785 1049 425 1633
2262A633j437M47J502j319m76L78o06n28P81J4l71Q01O69r47l99J666o71o37Q54
$$ 1633 196 643 2145 826 350 728 122 -406 375 389 18 819 1488 541 142 1808 1137 500 1354
2281A354m73p13J037r06j99K5J009j008k4j45L74m40Q49M82o06L49q92l41J248
$$ 1354 881 168 1205 299 100 125 1134 126 102 -43 331 -109 740 1222 616 965 73 -268 980
2300I80p98R5p99R07K91Q40p9l91l30K85J5J65ml78j02M01r79Q18P69l85k4K4
$$ 980 182 277 -522 385 676 1516 1437 1046 716 1001 1016 1181 1177 799 697 1098 119 937 1706 1321 1297 1321
2322A321mk76J56O53j282M14J40m15r69j3P64K70q40J629q35J13K27k34n80Ln6
$$ 1321 1317 1041 1197 1850 568 982 1122 707 -262 -275 489 759 -81 1548 713 826 1053 819 239 242 186
2343A86j482K078R9j166R31l64K79J065j310M03J06m00n34N59P89m89n93J07R1
$$ 186 -1296 782 881 -285 646 282 561 1626 316 719 825 425 -109 450 1239 750 157 264 355
2362C55L26QL12p19O9L83q74Q50K15o5J9k19J85j281O10m92J71M36O44L4N5J05
$$ 355 681 689 1001 282 351 734 -140 710 925 860 879 660 845 -436 174 -318 -147 289 933 967 1022 1127
$$ [...]
8191a10
##END NTUPLES=NMR FID
##END=
