##TITLE=1H_K-410
 CDCl3, 8 sc, 
 20.10.2020
##JCAMPDX= 6.0         $$ Bruker NMR JCAMP-DX V2.0
##DATA TYPE= NMR FID
##DATA CLASS= NTUPLES
##ORIGIN= UXNMR, Bruker Analytische Messtechnik GmbH
##OWNER= root
$$ XWIN-NMR		Version 3.5
$$ Tue Oct 20 12:14:29 2020 Russian Standard Time (UT+4h)  she@DPX200
##.OBSERVE FREQUENCY= 200.1315066352
##.OBSERVE NUCLEUS= ^1H
##.DELAY= (6, 6)
##.ACQUISITION MODE= SIMULTANEOUS
##.ACQUISITION SCHEME= undefined
##.AVERAGES= 8
##.DIGITISER RES= 18
##SPECTROMETER/DATA SYSTEM= spect
##.PULSE SEQUENCE= zg30
##.SOLVENT NAME= CDCl3
##.SHIFT REFERENCE= (INTERNAL, CDCl3, 0, 15.7039)
##AUDIT TRAIL= $$ (NUMBER, WHEN, WHO, WHERE, WHAT)
$$ ##TITLE= Audit trail, XWIN-NMR		Version 3.5
$$ ##JCAMPDX= 5.01
$$ ##ORIGIN= Bruker BioSpin GmbH
$$ ##OWNER= she
$$ F:/spectra/data/she/nmr/H-F/1/audita.txt
$$ ##AUDIT TRAIL=  $$ (NUMBER, WHEN, WHO, WHERE, WHAT)
(   1,<2020-10-20 12:13:24.09 +0400>,<she>,<DPX200>,
      <created by zg, POWCHK disabled, PULCHK disabled
       configuration hash MD5:
       00 E9 B6 7A A2 85 ED C7 34 08 36 98 17 FE 4E 26
       data hash MD5: 16K
       2B 8A F0 B6 6F C2 33 CE 4D CB FE CB 21 53 4D 88>)
$$ ##END=
$$ 
$$ hash MD5
$$ 22 58 A5 AC DF 13 7F E4 E1 16 E6 AD 6B D2 59 20
##$RELAX= 
##$RELAX= 
##$RELAX= 
##$RELAX= 
##$RELAX= 
##$RELAX= 
$$ Bruker specific parameters
$$ --------------------------
##$DU= <F:/spectra>
##$EXPNO= 1
##$NAME= <H-F>
##$PROCNO= 1
##$TYPE= <nmr>
##$USER= <she>
##$AMP= (0..31)
100 100 100 100 100 100 100 100 100 100 100 100 100 100 100 100 100 100 
100 100 100 100 100 100 100 100 100 100 100 100 100 100 
##$AQSEQ= 0
##$AQ_mod= 1
##$AUNM= <au_zg>
##$AUTOPOS= <>
##$BF1= 200.13
##$BF2= 200.13
##$BF3= 200.13
##$BF4= 200.13
##$BF5= 200.13
##$BF6= 200.13
##$BF7= 200.13
##$BF8= 200.13
##$BYTORDA= 1
##$CFDGTYP= 0
##$CFRGTYP= 5
##$CHEMSTR= <none>
##$CNST= (0..31)
1 1 145 1 1 1 1 1 1 1 1 1 1 1 1 1 1 1 1 1 1 1 1 1 1 1 1 1 1 1 1 1 
##$CPDPRG= <>
##$CPDPRG1= <>
##$CPDPRG2= <>
##$CPDPRG3= <>
##$CPDPRG4= <mlev>
##$CPDPRG5= <mlev>
##$CPDPRG6= <mlev>
##$CPDPRG7= <mlev>
##$CPDPRG8= <mlev>
##$CPDPRGB= <>
##$CPDPRGT= <>
##$D= (0..31)
0 1.2 0 0 0 0 0 0 0 0.06 0 0.03 0 0 0 0 0.0002 0 0 0 0 0 0 0 0 0 0 0 0 
0 0 0 
##$DATE= 1603181603
##$DBL= (0..7)
120 120 120 120 120 120 120 120 
##$DBP= (0..7)
150 150 150 150 150 150 150 150 
##$DBP07= 0
##$DBPNAM0= <>
##$DBPNAM1= <>
##$DBPNAM2= <>
##$DBPNAM3= <>
##$DBPNAM4= <>
##$DBPNAM5= <>
##$DBPNAM6= <>
##$DBPNAM7= <>
##$DBPOAL= (0..7)
0.5 0.5 0.5 0.5 0.5 0.5 0.5 0.5 
##$DBPOFFS= (0..7)
0 0 0 0 0 0 0 0 
##$DE= 6
##$DECBNUC= <off>
##$DECIM= 32
##$DECNUC= <off>
##$DECSTAT= 4
##$DIGMOD= 1
##$DIGTYP= 9
##$DL= (0..7)
0 120 120 120 120 120 120 120 
##$DP= (0..7)
150 150 150 150 150 150 150 150 
##$DP07= 0
##$DPNAME0= <>
##$DPNAME1= <>
##$DPNAME2= <>
##$DPNAME3= <>
##$DPNAME4= <>
##$DPNAME5= <>
##$DPNAME6= <>
##$DPNAME7= <>
##$DPOAL= (0..7)
0.5 0.5 0.5 0.5 0.5 0.5 0.5 0.5 
##$DPOFFS= (0..7)
0 0 0 0 0 0 0 0 
##$DQDMODE= 0
##$DR= 18
##$DS= 0
##$DSLIST= <SSSSSSSSSSSSSSS>
$$ [...]
##$SUBNAM2= <"">
##$SUBNAM3= <"">
##$SUBNAM4= <"">
##$SUBNAM5= <"">
##$SUBNAM6= <"">
##$SUBNAM7= <"">
##$SUBNAM8= <"">
##$SUBNAM9= <"">
##$SW= 16.880792210976
##$SWIBOX= (0..15)
0 0 2 0 0 0 0 0 0 0 0 0 0 0 0 0 
##$SW_h= 3378.37837837838
##$TD= 16384
##$TD0= 1
##$TE= 0
##$TE2= 300
##$TE3= 300
##$TEG= 300
##$TL= (0..7)
0 120 120 120 120 120 120 120 
##$TP= (0..7)
150 150 150 150 150 150 150 150 
##$TP07= 0
##$TPNAME0= <>
##$TPNAME1= <>
##$TPNAME2= <>
##$TPNAME3= <>
##$TPNAME4= <>
##$TPNAME5= <>
##$TPNAME6= <>
##$TPNAME7= <>
##$TPOAL= (0..7)
0.5 0.5 0.5 0.5 0.5 0.5 0.5 0.5 
##$TPOFFS= (0..7)
0 0 0 0 0 0 0 0 
##$TUNHIN= 0
##$TUNHOUT= 0
##$TUNXOUT= 0
##$USERA1= <user>
##$USERA2= <user>
##$USERA3= <user>
##$USERA4= <user>
##$USERA5= <user>
##$V9= 5
##$VALIST= <valist>
##$VCLIST= <CCCCCCCCCCCCCCC>
##$VD= 0
##$VDLIST= <DDDDDDDDDDDDDDD>
##$VPLIST= <PPPPPPPPPPPPPPP>
##$VTLIST= <TTTTTTTTTTTTTTT>
##$WBST= 1024
##$WBSW= 4
##$XGAIN= (0..3)
0 0 0 0 
##$XL= 0
##$YL= 0
##$YMAX_a= 30855
##$YMIN_a= -21099
##$ZGOPTNS= <>
##$ZL1= 120
##$ZL2= 120
##$ZL3= 120
##$ZL4= 120
##$ABSF1= 10
##$ABSF2= 0
##$ABSG= 5
##$ABSL= 3
##$ALPHA= 0
##$AQORDER= 0
##$ASSFAC= 0
##$ASSFACI= 0
##$ASSFACX= 0
##$ASSWID= 0
##$AUNMP= <proc_1d>
##$AZFE= 0.1
##$AZFW= 0.1
##$BCFW= 1
##$BC_mod= 2
##$BYTORDP= 1
##$COROFFS= 0
##$CY= 11.3945322036743
##$DATMOD= 1
##$DC= 2
##$DFILT= <>
##$DTYPP= 0
##$F1P= 16.9975609425685
##$F2P= -3.02152046262296
##$FCOR= 0.5
##$FTSIZE= 0
##$FT_mod= 4
##$GAMMA= 1
##$GB= 0.15
##$INTBC= 1
##$INTSCL= 1
##$ISEN= 128
##$LB= 0.24
##$LEV0= 0
##$LPBIN= 0
##$MAXI= 10000
##$MC2= 0
##$MEAN= 0
##$ME_mod= 0
##$MI= 1.114404
##$NCOEF= 0
##$NC_proc= 0
##$NLEV= 6
##$NOISF1= 3.799351
##$NOISF2= 2.8
##$NSP= 1
##$NTH_PI= 0
##$NZP= 0
##$OFFSET= 15.70392
##$PC= 1
##$PHC0= -10482.53
##$PHC1= 4.600892
##$PH_mod= 1
##$PKNL= yes
##$PPARMOD= 0
##$PSCAL= 0
##$PSIGN= 0
##$REVERSE= no
##$SF= 200.130013532006
##$SI= 16384
##$SIGF1= 3
##$SIGF2= 2
##$SINO= 400
##$SIOLD= 16384
##$SREGLST= <1H.CDCl3>
##$SSB= 0
##$STSI= 0
##$STSR= 0
##$SW_p= 3612.71676300578
##$SYMM= 0
##$S_DEV= 0
##$TDeff= 0
##$TDoff= 0
##$TI= <>
##$TILT= no
##$TM1= 0
##$TM2= 0
##$TOPLEV= 0
##$USERP1= <user>
##$USERP2= <user>
##$USERP3= <user>
##$USERP4= <user>
##$USERP5= <user>
##$WDW= 1
##$XDIM= 8192
##$YMAX_p= 0
##$YMIN_p= 0
$$ End of Bruker specific parameters
$$ ---------------------------------
##NTUPLES= NMR FID
##VAR_NAME=  TIME,          FID/REAL,        FID/IMAG
##SYMBOL=    X,             R,               I
##VAR_TYPE=  INDEPENDENT,   DEPENDENT,       DEPENDENT
##VAR_FORM=  AFFN,          ASDF,            ASDF
##VAR_DIM=   8192,          8192,            8192
##UNITS=     SECONDS,       ARBITRARY UNITS, ARBITRARY UNITS
##FACTOR=    0.000296,      1,               1
##FIRST=     0,             0,               0
##LAST=      2.424536,      0,               0
##MIN=       0,             -21099,          0
##MAX=       2.424536,      30855,           0
$$ Real data points
##PAGE= N=1
##DATA TABLE= (X++(R..R)), XYDATA
0 0 0 0 0 0 0 0 0 0 0 0 0 0 0 0 0 0 0 0 0 0 0 1 -8 8 -8 8 -8 8 -9 16 -16 16 -18 24 -24 28 -32 34 -40 44 -49 56 -61
43 -61 66 -74 82 -90 99 -111 122 -135 147 -163 180 -198 220 -244 272 -303 341 -388 444 -512 602
64 602 -728 911 -1200 1752 -3163 16229 30855 22564 21313 18539 22276 15433 9604 10225 15072
79 15072 13312 13106 9767 14046 16674 14060 8080 6951 8406 5038 1068 -3557 -2917 158 -1337 -4435
95 -4435 -2590 2132 1935 2812 -572 1063 4467 1769 -1986 -1480 -157 367 861 -2998 700 4306 3144
112 3144 2633 2340 4334 5096 3950 204 1654 3154 2045 225 -465 1311 1939 2084 -1556 17 1949
129 1949 367 -463 -1410 -501 1193 1297 -1691 1138 2653 2151 2557 635 1848 3486 2403 94 2024
146 2024 2681 3464 4019 2801 5355 6764 6700 4842 5405 5239 4255 3054 185 308 858 135 -1691 11
164 11 409 1228 1935 -606 587 567 -1557 -3873 -4726 -6380 -6087 -6757 -8700 -6005 -4895 -3665 -2877 -1766
182 -1766 -847 526 -181 -2362 -1736 -2687 -3214 -4317 -3988 -3161 -1039 713 881 4191 5626 6501 6717 5872
200 5872 4988 5126 3052 526 1421 269 1231 1858 2101 4089 6140 6310 6097 6800 5208 4925 2549 218
218 218 -722 -1440 -2133 -2778 -1340 -870 1306 2153 2304 3343 3758 2616 836 301 -2336 -2255 -3684 -4820
236 -4820 -3528 -2755 -1789 -488 965 1275 3241 2084 1179 954 -800 -1690 -3142 -3828 -4309 -2944 -2952 -2066
254 -2066 -331 498 1626 1656 1794 774 1014 -910 -2210 -2344 -3407 -2989 -2733 -2259 -1306 807 653 1599
272 1599 2276 1414 1941 628 -445 -1057 -1226 -2180 -1665 -1292 -941 851 869 1699 2044 2590 1769 1461 903
291 903 -203 -3 -1079 -1195 -1014 -145 -200 901 1288 1180 2534 1349 1188 886 289 -491 -458 -1159 -1163 -30
311 -30 -816 468 724 1091 1239 1153 675 168 197 -1138 -1014 -1471 -1334 -1095 -648 -403 -54 1020 246 771
331 771 334 -231 -519 -911 -1675 -1673 -1132 -1823 -379 -484 204 1117 989 1040 1125 843 -52 161 -931 -749 -546
352 -546 -603 57 558 1533 1572 2626 2227 2412 2310 1487 915 351 167 -614 235 -280 626 1518 1431 2324 2491
373 2491 2419 2008 1860 411 423 -274 -1133 -784 -1046 -390 80 949 1031 1939 2006 1708 1813 980 608 -160 -283
394 -283 -1072 -594 -390 -184 1068 1259 2056 2483 2623 2025 2243 1338 519 485 -740 -496 -679 -477 -225 664
414 664 817 1229 1548 871 1041 146 -407 -1358 -1692 -2276 -2516 -2110 -2423 -1478 -1222 -678 -489 -56 -516 -697
434 -697 -804 -2013 -1673 -2396 -2498 -2291 -1933 -1614 -741 -149 -100 841 342 454 35 -546 -987 -1405 -1572 -2058
454 -2058 -1426 -1581 -978 -580 -317 -121 -108 -227 -1049 -980 -2135 -2478 -2725 -3161 -2968 -2653 -2288 -1918 -825 -1063
474 -1063 -334 -283 -664 -496 -1069 -1382 -1574 -1309 -1563 -558 -131 546 1543 2049 2682 2794 3114 2385 2404 1706
494 1706 1137 944 587 761 892 1510 1456 2292 2224 2077 2214 1218 681 -187 -1090 -2092 -2266 -3030 -2933 -2556 -2703
515 -2703 -1899 -1816 -1318 -1460 -1394 -2011 -2385 -2811 -3650 -3684 -4079 -3704 -3535 -2553 -2113 -1198 -211 -106 671 423 300
536 300 -146 -345 -1108 -1131 -1209 -1450 -568 -501 336 962 1462 1484 1649 1387 765 539 -547 -808 -1373 -1509 -1518 -1182
558 -1182 -649 -347 568 626 1081 1093 980 539 313 -200 -725 -374 -945 -295 45 527 1147 1712 1984 2104 2273
579 2273 1528 1630 828 318 -70 -502 -584 -738 -363 -564 -42 -116 -173 -342 -754 -1233 -1906 -2248 -3211 -3182 -3683
600 -3683 -3769 -3587 -3534 -3211 -3010 -2603 -2792 -2275 -2730 -2753 -2759 -3082 -2843 -2921 -2567 -2389 -1653 -1473 -747 -302 -148 230
622 230 110 292 -97 151 -187 -55 143 53 517 563 883 841 1212 684 731 415 -190 -138 -703 -734 -930 -688
644 -688 -899 -408 -354 -399 1 -385 -248 -678 -783 -1147 -1213 -1356 -1387 -945 -913 -290 -25 454 477 768 666 318
666 318 432 -284 -212 -533 -550 -482 -140 10 353 931 767 1261 945 768 326 -104 -539 -904 -1016 -1367 -953
687 -953 -968 -395 -164 289 580 598 770 132 100 -483 -735 -1085 -1153 -1190 -905 -411 -213 785 844 1275 1411 1237
709 1237 1031 645 234 -328 -332 -835 -508 -393 -41 535 817 1310 1298 1569 1089 947 470 -48 -375 -817 -785
730 -785 -914 -348 -354 308 635 881 1232 1093 950 520 317 -450 -453 -881 -1000 -640 -723 -191 115 624 688 1023
752 1023 793 620 466 -178 -307 -834 -805 -1038 -704 -562 -247 264 331 788 683 747 367 282 -206 -484 -530 -939
774 -939 -681 -662 -295 -137 374 425 632 718 349 418 -167 -274 -675 -742 -878 -797 -546 -524 44 62 367 298 374 156
798 156 -44 -165 -716 -459 -809 -551 -479 -229 59 374 669 574 958 497 642 396 181 91 -20 85 59 447
820 447 421 824 756 948 929 759 621 184 176 -362 -295 -542 -509 -383 -324 -172 -34 230 -125 117 -245 -471 -680
843 -680 -1013 -1043 -1131 -973 -1029 -549 -441 -173 161 202 368 185 233 -177 -126 -327 -358 -281 -200 127 295 708 727 1140
867 1140 920 896 845 372 274 -140 -199 -428 -245 -387 -76 191 171 518 376 542 234 134 -313 -522 -741 -944
889 -944 -784 -879 -440 -411 42 150 485 545 441 510 168 153 -198 -244 -488 -311 -171 -39 374 351 811 824 837
912 837 635 579 232 -182 -239 -641 -485 -732 -519 -393 -185 88 121 310 -35 59 -351 -491 -754 -895 -1040 -1065
934 -1065 -807 -883 -304 -264 91 274 323 275 181 172 -222 -146 -477 -320 -239 -186 137 343 735 723 1018 854 905 644
958 644 440 259 17 18 -211 89 38 370 577 695 889 851 902 561 611 137 191 -13 -138 58 8 350 431
981 431 869 831 1049 1015 991 1013 621 576 230 307 204 349 482 617 931 985 1225 1057 1177 800 782 473 152
1004 152 161 -172 31 -55 199 163 467 493 554 640 337 326 -48 -147 -450 -456 -538 -538 -279 -228 144 203 410 360 505 319
1030 319 101 84 -262 -120 -355 -223 -189 93 164 437 695 568 816 554 544 303 235 17 -160 -21 -143 203
1052 203 99 515 503 645 636 557 556 201 206 -111 -171 -414 -326 -295 -214 77 75 366 305 450 272 150 23 -138 -292
1077 -292 -500 -374 -545 -317 -183 5 242 242 392 251 314 16 -36 -283 -394 -416 -480 -247 -273 117 119 407 436
1100 436 446 429 256 155 -82 -91 -336 -192 -269 -134 52 71 426 467 623 466 519 274 159 -3 -212 -148 -271
1123 -271 -52 -54 206 305 492 610 553 646 350 353 -8 -11 -190 -241 -152 -170 138 123 341 362 536 361 367 236 -47
1148 -47 -45 -368 -289 -418 -285 -251 -123 150 164 411 189 358 77 105 -188 -254 -318 -461 -301 -384 -101 -54 221 248
1172 248 383 342 294 299 -56 1 -340 -228 -277 -292 -119 -56 183 198 440 337 419 286 144 78 -168 -162 -351 -212
1196 -212 -214 -68 -9 142 281 206 434 110 220 -16 -117 -275 -353 -352 -351 -190 -212 107 71 242 267 206 167 -50 -27
1221 -27 -276 -227 -372 -268 -271 -158 46 56 286 196 325 186 109 -7 -134 -154 -276 -130 -238 -9 -25 204 301
1244 301 254 441 258 316 17 106 -189 -85 -278 -253 -77 -135 153 46 294 228 238 123 10 -40 -305 -347 -499
1267 -499 -314 -423 -244 -227 -49 157 27 200 -36 10 -206 -268 -405 -475 -443 -482 -219 -297 -42 38 179 229 183
1290 183 186 -33 -53 -282 -319 -460 -372 -303 -260 45 -15 310 273 374 347 253 49 -83 -157 -355 -297 -384 -146 -116 110
1315 110 275 367 493 431 474 284 293 38 -53 -75 -195 -32 -71 259 249 462 467 621 574 506 498 179 171 -137 -49 -193
1341 -193 -157 -32 25 225 257 454 260 369 182 96 -59 -238 -312 -474 -327 -455 -271 -236 -49 52 105 160 54
1364 54 83 -175 -153 -345 -385 -436 -484 -355 -325 -135 -132 122 63 112 87 -95 -70 -304 -272 -408 -396 -411 -319 -201 -241 16
1390 16 -8 105 -9 -5 -159 -183 -225 -320 -257 -364 -124 -193 24 54 123 237 178 295 32 207 -1 69 -43 28 141
1415 141 33 295 269 401 345 371 327 334 325 119 174 3 89 40 125 134 186 338 185 363 153 224 59 -53 -105 -158
1441 -158 -86 -139 -37 -64 135 109 176 177 41 130 -57 -7 -247 -186 -273 -231 -170 -124 50 40 146 64 178 -30 -26 -102
1467 -102 -260 -328 -403 -343 -455 -197 -207 -99 24 -61 104 -31 35 -166 -197 -322 -349 -392 -364 -179 -235 -2 -6 223
1491 223 243 297 258 175 131 15 -55 -240 -119 -161 15 72 211 341 377 490 348 448 210 190 45 -126 -68 -165
1515 -165 -116 -114 51 71 221 254 291 347 178 202 -29 -67 -207 -202 -198 -200 13 -25 205 215 332 298 331 228 72 71 -142
1542 -142 -63 -128 -82 -79 55 68 186 266 265 419 288 220 127 17 -39 -86 -153 -165 -23 -65 147 171 237 236 223 226 102 138
1570 138 -41 -40 -110 -119 -52 -53 97 90 260 225 288 202 97 142 -18 30 -118 -89 -209 -3 -61 51 120 37 194 52
1596 52 180 -34 -14 -116 -197 -189 -257 -192 -240 -53 -78 26 -24 19 62 -105 -44 -259 -170 -228 -156 -161 -137 -38 -86 104 -6
1623 -6 173 73 90 -39 -66 -70 -150 -34 -109 41 -3 119 153 191 241 128 174 77 72 -51 -60 -133 -140 -48 -71 76 34 160
1651 160 81 113 37 16 -31 -145 -120 -305 -203 -239 -159 -109 -113 19 -2 90 1 41 -95 -163 -221 -275 -227 -346 -180 -228 -18
1678 -18 -58 21 59 19 80 -18 9 -146 -144 -285 -235 -182 -208 -72 -71 106 -34 133 100 133 108 -35 -98 -182 -108 -213 -72
1705 -72 -70 69 109 104 263 248 245 190 214 95 82 35 -24 10 14 122 156 275 297 313 353 314 269 201 217 -36 66 43 -19
1734 -19 58 118 176 161 297 197 198 150 97 16 -111 -99 -190 -62 -190 -92 -40 23 70 30 85 -15 -20 -137 -156 -255 -250 -248 -337
1763 -337 -237 -265 -114 -115 -54 -57 -85 -65 -120 -118 -283 -188 -296 -240 -221 -168 -137 -76 41 -18 102 -36 -2 -20 -57 -97 -143 -77
1791 -77 -172 -30 -18 62 73 153 145 102 212 50 154 36 121 45 40 132 96 229 220 328 292 375 329 315 256 237 291 171
1819 171 238 180 295 280 389 441 374 522 370 482 356 334 246 218 192 187 199 146 265 220 298 275 310 240 183 192 57
1846 57 56 -73 -51 -58 -44 23 -13 57 -23 147 -3 111 -32 -42 -70 -240 -151 -245 -178 -265 -69 -115 -36 -70 -21 -32 -104 -81
1874 -81 -220 -232 -312 -371 -293 -424 -212 -358 -220 -283 -235 -279 -315 -274 -427 -381 -547 -460 -587 -481 -474 -462 -396 -337 -310 -398
1900 -398 -308 -388 -345 -422 -438 -390 -485 -342 -355 -264 -239 -181 -121 -30 -52 -103 -54 -112 -78 -236 -131 -158 -144 -34 -107 -34 8 86
1928 86 73 95 -32 16 -37 -108 -73 -207 -107 -150 -41 0 -19 37 39 93 -15 20 -96 -27 -61 -121 -68 -101 -29 -65 62
1955 62 22 41 95 95 86 6 42 -82 -98 -101 -77 -123 -119 -2 -15 32 -33 37 -38 -68 -83 -130 -135 -210 -151 -189 -119 -186 -118 -94 -55 24
1987 24 -54 31 -96 -64 -124 -124 -86 -102 -25 -85 23 20 94 92 191 120 13 141 -3 5 -52 -1 -22 13 16 37 135 68 161 79
2017 79 63 -7 -36 -90 -161 -143 -207 -107 -222 -107 -63 -70 -70 -74 -20 -172 -81 -233 -167 -247 -289 -203 -237 -129 -80 -69 -86 8 -65
2046 -65 -36 -57 -123 -82 -205 -69 -100 -63 -56 -45 41 51 64 1 127 22 71 -2 -17 -18 -45 15 -22 55 45 114 45 99 70
2075 70 56 97 18 52 -120 -70 -62 -19 35 40 100 23 118 102 107 85 -14 2 -47 -16 -63 44 -78 84 88 34 165 110 168 116
2105 116 143 -54 49 -12 -9 2 -84 22 4 67 37 126 62 64 8 3 77 -97 -42 -99 -87 -114 -98 -26 -48 104 -23 122
2133 122 21 34 -16 -19 25 -131 24 -86 41 22 66 85 128 125 132 190 105 184 60 51 76 33 73 42 94 -7 101 59
2161 59 67 22 -55 -26 -189 -71 -179 -157 -167 -179 -193 -171 -144 -271 -99 -214 -153 -181 -198 -200 -246 -155 -235 -173 -183 -98 -84 -75 -72
2190 -72 -39 18 -40 -46 -95 -8 -86 -90 -65 -30 -28 -53 58 -42 18 -62 -35 -35 -65 -107 -145 -95 -171 -68 -128 -50 -39 1 8 -87 56
2221 56 37 16 -17 11 36 28 77 109 224 218 267 221 269 249 215 225 187 168 112 167 163 163 125 163 191 135 166 23 103 0 -51
2252 -51 -18 -123 -93 -160 -115 -218 -79 -95 -106 -71 -90 -79 -184 -96 -185 -147 -146 -180 -93 -145 13 -28 38 64 128 73 140 126
2280 126 52 110 -60 43 -32 3 -11 77 69 59 152 95 135 31 64 0 -8 -32 -74 -38 -47 45 -38 26 -23 91 79 31 160
2309 160 63 102 8 28 23 50 75 75 204 154 181 178 254 220 114 164 147 151 33 67 20 54 46 46 95 38 108 10 14 -55 -42 -116
2341 -116 -91 -105 -118 -154 -168 -69 -157 -22 -13 -63 6 -67 -66 -115 -36 -117 -86 -29 -42 11 -75 65 40 130 66 109 30 6 56 -20
2371 -20 5 -30 26 -61 22 12 -48 31 -19 -20 -32 -2 -26 50 -38 -59 26 -64 24 8 132 59 119 148 83 124 72 173 155 143
2401 143 120 140 175 255 214 209 283 273 256 221 277 248 159 178 156 230 154 175 189 223 209 193 194 153 197 132 191 140 139 157 80
2432 80 163 122 173 196 281 155 159 206 119 98 107 83 81 179 168 117 103 113 183 152 156 141 144 45 92 90 65 29 -17 102 78 57
2464 57 61 50 81 43 61 39 50 -1 33 20 84 72 26 98 97 128 100 232 78 107 131 58 85 25 71 59 89 143 91 140
2494 140 105 147 79 76 48 -1 17 -56 -48 41 8 -44 -10 -25 -12 -68 -33 -55 -52 -12 -81 -72 -110 -97 -23 -88 -37 -72 -11 -104 -12 22
2526 22 -10 -28 -23 23 -111 -50 -27 -2 0 36 3 20 74 -1 34 -32 31 -31 -4 -54 -16 27 -4 76 -14 69 -64 64 46 10
2556 10 15 -28 39 -54 5 21 29 25 -12 55 82 116 51 70 50 52 2 8 19 -26 3 -57 26 -21 83 -55 59 31 -46 -2 -60
2587 -60 -96 -117 -113 -128 -60 -79 -101 -87 -119 -43 -86 -105 -138 -60 -101 -109 -119 -189 -95 -123 -1 -67 -67 8 -45 36 -10 25 -7 14 62
2618 62 -2 60 17 91 29 117 105 169 90 94 147 13 130 1 57 70 27 17 41 33 41 104 52 34 6 -16 -22 -39 -16 -63 24
2649 24 -50 -19 -79 -34 -16 -34 23 -14 35 -22 2 -51 11 -24 -5 24 8 62 -23 56 11 16 16 -33 -14 -100 -18 -68 -90 -48 -112
2680 -112 -39 -107 -52 -56 -72 -85 -86 -72 -94 -72 -53 -62 -52 42 -21 15 19 51 121 47 102 85 159 78 149 210 140 207 185 218 152 198
2712 198 175 227 81 166 160 129 67 24 99 64 74 62 29 64 -10 72 4 26 -27 0 -33 -13 -50 -43 5 -54 -3 -3 54 6 56
2743 56 64 60 94 108 78 35 106 34 100 113 56 122 89 98 61 104 129 24 108 -11 25 -25 17 -39 3 -50 -42 -5 -83 -3 -57
2774 -57 -67 -80 -74 -121 -95 -65 -98 -20 -51 -39 -90 -55 -10 -54 -35 -88 6 -89 -77 -85 -33 -1 -53 -66 -132 -30 -96 -91 -145 -153 -119 -165
2806 -165 -184 -225 -183 -257 -206 -237 -244 -186 -222 -180 -231 -237 -264 -199 -232 -163 -184 -137 -126 -139 -90 -158 -70 -47 5 -56 -45 37 -29 58 28
2837 28 46 49 62 26 29 45 -22 41 -8 13 0 14 -33 -97 -43 -37 -26 -57 -79 -126 -57 -93 -80 -130 -132 -51 -120 -111 -180 -125 -86 -60 -34
2870 -34 -126 -89 -102 -11 -71 -32 -2 -78 -2 -75 -65 -44 -8 -7 -59 4 -75 7 -23 -40 3 -71 -42 13 -59 -78 -20 -85 -20 -66 -2
2901 -2 -76 -33 -60 -31 10 -25 7 6 44 9 29 33 22 101 70 96 22 78 80 40 59 -5 48 25 8 4 -8 -23 8 -41 -57 0 -44
2934 -44 -77 -129 -153 -114 -195 -130 -239 -150 -196 -147 -165 -98 -161 -135 -104 -122 -75 -161 -87 -152 -155 -162 -137 -37 -94 -117 -72 -69 -53 -39 -63
2965 -63 -36 -29 -68 -6 -46 21 -65 9 23 0 38 22 63 11 28 15 70 -2 44 68 34 68 57 39 113 59 65 93 102 23 148
2996 148 40 83 23 43 17 70 46 -34 81 -10 69 -103 50 -38 -31 -85 -51 -91 -70 -85 -104 -62 -109 -58 -113 -160 -101 -32
3024 -32 -100 -81 -73 -97 -101 -48 -86 -31 -111 -57 -80 -76 -58 -34 -28 -60 -29 -2 35 -11 65 22 6 13 25 61 20 61 17 69 39 8 55
3057 55 46 109 41 116 84 65 60 24 87 68 86 35 141 128 87 94 66 97 68 135 38 66 28 13 37 31 50 -27 50 -27 34 -32
3089 -32 25 -7 -82 -70 -105 -96 -118 -55 -161 -85 -73 -185 -123 -119 -91 -134 -70 -88 -14 -83 -88 -27 -99 -37 -105 -29 -87 -58 -37 -54 22
3120 22 22 48 6 -1 25 20 5 72 36 -13 40 -37 60 23 61 -27 17 80 -13 35 -43 57 3 24 6 -41 -11 -53 -2 13 -15
3151 -15 -42 37 -57 -48 17 -39 -17 4 26 -43 -3 -9 -49 -49 32 -5 12 -1 26 -45 24 -21 0 -21 15 -15 7 -18 -24 7 -40 -10
3183 -10 -50 -24 2 2 18 14 7 74 46 13 66 33 75 78 55 133 84 80 57 137 86 76 70 102 113 105 90 58 129 58 64 47 23 65
3217 65 32 38 5 15 0 -18 -15 -24 -43 -55 -33 -39 -30 -18 -86 -76 -89 -98 -52 -38 -109 -29 -71 -26 -104 -44 -57 -86 -22 -59 -33 -36 -77 -32
3251 -32 7 18 24 -27 -22 34 1 10 -19 -17 47 -6 34 -3 46 51 62 60 -9 52 31 18 24 117 -37 29 40 -21 57 12 50 -36 75
3284 75 38 29 6 -28 26 -27 -19 -12 32 -22 20 13 13 38 16 31 -24 102 -27 -1 87 13 58 -2 52 53 69 -30 30 42 20 38
3316 38 74 94 65 55 81 96 121 8 46 51 105 49 65 80 32 89 73 114 70 154 54 85 49 58 93 57 117 120 109 103 186
3347 186 78 113 61 118 92 72 60 -2 57 32 61 -4 -4 59 43 14 -4 -8 -14 -7 -25 -6 -45 -72 -61 -23 -25 -55 15 -46 -58 11
3379 11 -39 -11 -8 -2 -17 -21 14 -17 -23 -22 39 -77 -1 46 41 33 -18 34 29 42 32 79 18 -25 55 6 45 5 43 45 69 52 43 30 49
3414 49 64 -4 57 23 54 14 -20 -16 -47 76 33 40 9 46 -9 -22 -20 5 -6 34 -11 -26 -20 -32 -14 18 20 5 -9 16 1 -61
3446 -61 36 10 14 -74 -21 -34 -62 5 -6 6 -25 24 29 60 25 62 32 15 -44 -9 72 62 40 18 63 44 20 59 36 50 84
3477 84 29 89 64 8 38 17 38 37 11 48 -10 60 57 43 32 45 14 27 41 -1 49 2 -4 47 57 41 -39 22 85 55 12 -6
3509 -6 17 35 -25 31 11 -35 -32 -21 -9 -11 21 -75 -72 -44 -95 -42 -112 -95 -134 -150 -111 -98 -68 -93 -32 -77 -80 -57 -54 -30 -106 -14 -33
3542 -33 -38 -21 -39 46 -22 48 39 53 53 97 70 13 61 36 103 26 45 49 50 -15 -3 9 48 4 52 18 4 18 7 -8 54 -5 54
3575 54 -35 53 47 6 -25 48 35 37 78 42 67 20 90 14 44 41 -6 62 -15 75 0 74 2 -18 43 -42 22 24 -2 -71 -49 -12
3607 -12 -61 -136 -42 -19 -117 -42 -66 -37 -39 -38 -31 -28 -77 -36 -49 -59 -68 -47 -21 -47 -62 45 5 11 -5 51 0 2 22 -7 50 15 -26
3640 -26 -41 -5 -35 13 43 25 43 -22 0 -56 -34 -14 -54 -8 -112 -16 -92 -6 -35 -103 -91 -27 -54 -52 -6 -69 -15 -14 25 -7 35
3671 35 34 0 68 -19 21 12 -27 52 16 112 61 60 27 -36 11 60 34 6 -18 -11 -8 -18 -36 19 10 -47 -42 19 -56 -20 -48 -53 -28 -64
3705 -64 -31 -21 -63 -27 60 -69 -37 -87 27 -8 -13 17 -28 29 -1 45 22 17 40 42 52 20 3 -10 -7 24 -10 -4 27 -5 35 -34
3737 -34 -17 26 -81 44 46 11 4 16 39 -34 30 -10 65 37 -8 4 -37 -24 30 45 17 0 -38 -46 10 -53 -40 5 14 -38 9
3768 9 23 17 11 -36 12 2 -44 -37 -60 -58 -81 -19 -65 7 -36 1 -102 -25 -23 -26 30 -63 -12 -44 -44 -73 -28 -62 -72 -71 -80 -28 -28 12 -15
3803 -15 -12 22 20 -64 4 30 5 12 4 -9 58 -17 6 6 -6 -49 -9 27 7 57 4 67 16 63 -11 39 -26 -12 -30 14 60 22 10
3836 10 -24 -71 2 -40 3 -25 27 2 -39 -34 -31 -28 -24 -20 -68 -19 -81 -8 -44 -92 0 -84 -12 -75 -42 1 -50 -40 -17 -22 -75 -3 -2 -22
3870 -22 -61 -36 12 -7 34 -14 29 36 7 -50 10 42 13 -25 15 13 -49 -11 -54 -6 -12 -23 25 8 -3 21 60 -24 19 -13 27 34
3902 34 37 34 -44 -3 -25 68 1 -30 6 27 28 -24 -12 -5 1 0 19 13 -21 -30 -18 51 28 33 -68 -36 -54 -62 -31 -27 -24 -97 -37 -79 16 -58
3938 -58 -66 -51 -78 -50 -55 -43 -29 -21 -33 -4 -48 -2 11 -46 14 14 40 -10 7 30 15 54 -7 14 42 55 54 9 23 33 30 27 52 22
3972 22 59 9 2 24 -23 56 -2 26 -43 -5 42 22 59 32 49 -39 39 -30 -22 -32 -34 -29 -47 16 -27 18 11 -33 -10 59 -31 -17 21
4005 21 -32 -63 -20 -3 -42 -25 -7 -52 26 -69 -9 8 -39 -6 -41 26 -28 5 13 -42 -9 13 26 -22 19 23 56 25 -17 36 4
4036 4 -24 -54 -27 -11 6 -19 -27 14 -16 -5 -1 -1 -24 21 -24 39 -23 -3 31 -30 -17 -52 35 -1 79 -21 35 30 -16 -12 61 -17 0
4069 0 7 39 -58 -32 30 1 21 20 -25 -25 -5 -31 -21 1 -21 -37 -14 -14 -21 20 64 17 16 -15 -28 32 0 13 -9 -16 -23 -43 12 0 -2
4104 -2 9 69 16 26 36 19 20 23 13 13 47 -30 -8 29 29 14 40 29 0 -14 41 47 24 31 -17 -19 -33 -54 -20 0 1 -6 -25 -33 0 3
4140 3 -76 -5 56 -19 -34 -19 -29 23 54 38 4 56 -6 45 -3 10 15 31 69 25 32 51 22 -29 4 18 -3 2 9 25 -12 -7 -23
4173 -23 1 -23 -35 18 -16 19 -29 6 -47 -21 -46 -37 -14 -2 23 -7 23 -45 3 -6 -19 -22 20 42 29 11 25 8 17 20 6 59 -3
4206 -3 7 60 8 29 -4 38 -20 32 16 23 38 -3 2 -65 37 -14 -21 -16 -13 -4 21 -17 -1 -71 -48 -17 -16 -2 17 -30 2 -22 -3 12
4240 12 19 -76 24 21 44 32 -16 -40 1 -11 9 -2 3 13 29 -4 3 34 -45 -20 -15 -53 -35 14 -28 -20 -43 18 -50 -17 -12 -25 1
4273 1 -32 40 -41 -7 1 -33 -25 5 27 -44 21 -53 -13 -11 -28 49 -29 -15 -22 38 -10 -10 -20 -1 39 -43 18 -8 -26 -7 32 9 0 -35
4307 -35 -56 -15 -26 -34 14 -64 -14 17 -42 -32 -30 -20 -16 -55 -35 -17 15 22 -8 37 -19 -23 21 -26 21 20 79 9 -9 13 9 40 0 11
4341 11 18 12 -29 49 43 21 80 3 34 56 65 7 -4 -16 68 15 -52 -26 -30 -37 -19 -39 9 22 14 -29 35 -43 -31 -44 -5 -8 -7 -34 -35
4376 -35 -3 28 -15 18 -40 16 9 -25 -16 33 -38 -16 -2 9 -7 15 -18 0 11 -34 -10 10 17 -17 62 27 2 -37 -64 35 -37 -37
4408 -37 6 15 -31 27 -1 -10 -2 -3 15 14 28 -60 -9 -23 11 61 36 75 27 -21 70 25 44 26 2 66 19 -18 37 24 -15 27 33
4441 33 42 14 7 -52 41 7 -9 1 -50 -16 4 -9 18 -17 -18 5 -33 -48 18 7 21 13 -37 2 -56 -2 -23 -19 -39 -5 -11 -10 -3 -9 60
4476 60 -43 16 -49 64 -42 4 -26 -53 33 -27 19 -18 18 -48 -7 -11 -22 18 5 -2 9 2 -5 -27 16 -2 17 -22 -3 12 -37
4507 -37 15 -7 -23 4 -21 -25 19 -79 -24 -19 -2 -25 12 -1 -56 11 -36 56 -24 -19 -52 -19 -7 17 -29 -11 12 -32 -61 -28 5 -22
4539 -22 -59 10 -31 -27 -45 -21 -30 -11 7 -5 -38 25 26 -25 -24 -25 21 -67 -14 -64 -52 -64 -7 -29 20 30 2 -46 19 0 -22 -20 -28 -6
4573 -6 -9 43 16 0 0 21 -14 16 26 -2 9 0 13 43 6 -1 26 39 20 32 -7 21 51 16 7 34 -13 -29 -28 -70 25 -25 18 -43
4607 -43 -20 -39 -45 27 -4 -16 -9 18 -24 -11 10 -58 76 -10 26 32 45 9 50 78 49 15 2 26 10 -37 45 29 6 37 68
4638 68 36 1 44 56 4 -15 22 -44 -9 29 -8 23 15 -7 12 15 24 -6 15 4 -2 -28 -19 2 23 17 19 53 36 27 13 16 9 60 -5
4673 -5 -9 38 -58 10 12 -56 -27 -5 -4 21 -41 -15 21 23 -2 -50 -2 -26 -38 -44 -27 -20 31 -11 -11 -36 -92 6 -21 -52 -12 -46 -29 -2
4707 -2 30 0 -18 24 24 32 21 30 9 46 26 57 -19 -2 35 7 16 -37 69 43 -6 14 -3 3 -15 34 -29 -41 -38 -22 -42 -29 -20 -58
4741 -58 34 -70 38 -43 -49 10 -53 6 4 18 3 -25 21 70 56 -13 9 40 16 -5 8 3 6 -4 8 12 0 -13 34 2 -20 15
4773 15 83 -24 8 -12 -3 -11 15 24 20 23 -18 22 -29 14 64 8 -20 55 -11 -27 -20 51 58 -19 29 49 29 -41 17 16 -22 33 -51 31
4807 31 7 1 53 -11 -51 53 -31 -10 -8 -36 -24 24 -49 -10 8 -31 -33 6 -51 33 45 -24 -29 -47 -12 -48 -73 -16 -30 0 30 -20
4839 -20 -4 -9 33 48 22 -7 -24 -32 16 30 25 -24 17 4 42 10 2 -5 1 -1 28 60 30 12 6 4 4 -7 55 -38 1 26 18 27 12 4 -25
4876 -25 -25 13 -5 12 -3 -6 -42 1 9 37 6 10 4 27 -33 -63 35 -19 -2 -13 8 -65 21 21 27 -18 -11 33 29 -45 -36 -27 -11 -57 -23 28
4912 28 -59 -6 -4 59 4 -19 23 44 -14 25 -12 10 -19 -27 13 -14 24 -31 -20 6 41 44 34 -18 -21 48 15 39 -9 -8 21 91 39
4945 39 28 -30 18 -2 -10 24 -5 23 2 40 10 -7 40 6 1 4 15 31 19 9 11 9 -8 54 -21 -9 -22 4 -9 -50 -8 -22 -9
4978 -9 -16 -53 -58 -38 35 -19 -16 -16 -13 -42 -33 22 14 -24 -53 15 20 -45 -19 12 21 -15 20 14 -9 -2 2 -42 -49 33 -24 -10 4 32 -12 -15 -4 -59
5016 -59 -4 -15 -23 12 -14 -10 32 -4 -30 -6 52 -37 -1 -17 -41 1 -29 13 -48 8 10 -27 -54 18 25 -9 1 -35 17 -4 -57 15
5048 15 -11 33 -1 -45 -36 -9 0 -46 49 -3 24 -41 0 -43 74 -18 -14 23 14 -39 23 -4 -35 37 9 19 5 -16 51 -5 10 0
5080 0 14 6 -3 17 36 -9 -14 2 -2 47 -34 80 7 49 28 -12 39 26 48 0 -24 -7 -34 25 -11 0 -13 -28 -17 -10 -14 -43 -29
5113 -29 -104 -13 18 13 -36 -48 -42 -25 -22 -66 -28 -57 -24 -19 16 -10 -27 2 -48 -30 -40 -80 3 -4 -53 -42 -3 -30 21 30 -23 9 -14
5146 -14 7 7 -10 19 7 -37 -3 -11 -23 -3 -50 29 5 -10 -75 -74 -25 -40 -14 -9 -85 -71 -37 -28 -51 12 -49 4 -58 -14 -72 -20 -26
5179 -26 -41 7 -28 2 29 -12 9 -16 -13 -8 -25 8 -29 35 -1 8 -7 19 8 54 -1 45 5 -4 -6 30 -54 -7 -12 -14 31 -74 -30
5212 -30 8 13 -23 -44 -14 -44 11 -1 -13 -2 -42 66 10 14 73 -34 25 -11 53 10 -18 -24 11 -21 33 34 -40 -54 11 57 -20
5243 -20 -5 25 -7 70 -45 46 -16 -70 17 49 33 4 -62 23 -48 -22 15 -29 -3 22 16 3 9 -1 -2 22 -4 7 17 43 -52
5274 -52 -31 -65 2 -21 -1 13 -16 31 -18 -12 1 32 29 -15 -21 -21 -19 1 -13 -10 -15 -2 6 11 -45 -13 37 23 23 4 5 -5 42 44 -14 -19 22
5311 22 111 -6 7 33 55 57 6 -41 8 50 47 -5 26 -20 38 -42 39 16 16 32 0 -1 52 9 6 38 -52 -51 12 29 -47 -47 -22
5344 -22 3 1 27 -16 -29 -24 -11 -10 -41 -17 -38 7 -58 -88 -26 -29 28 -2 71 40 10 -9 4 28 7 -21 -37 28 27 -52 -7 3 -3
5377 -3 -17 11 27 14 5 19 35 -1 17 3 29 23 4 21 -3 -22 -24 41 4 -38 -12 -12 -11 14 20 -7 23 -75 23 -1 -8 45 -57 -5
5411 -5 6 51 -19 30 -37 3 -19 -74 5 5 -38 -40 -59 5 23 -41 18 -9 -81 -5 25 24 -13 -2 -12 -1 51 18 27 -5 -42 28 -17
5444 -17 13 -22 -28 13 18 -2 -10 56 -12 -10 12 23 -13 -67 0 -22 -4 -4 -6 31 -53 27 37 3 -1 2 36 -11 16 -54 11 -12 -21 -28 -35 -61
5480 -61 -51 36 -10 -35 19 -24 36 8 -41 25 3 -6 -27 36 -37 5 17 -14 -8 -23 3 10 86 -35 23 -22 -17 2 0 3 -29 -6 -36
5513 -36 -2 -22 52 13 -20 31 31 32 -13 -47 13 43 -20 -4 -5 13 9 7 30 -12 -4 20 26 11 -28 -9 -5 8 -26 47 38 -12 -10 -13 56 -9
5549 -9 10 43 -5 -8 44 -36 -4 7 -18 10 -52 -22 -5 -30 -11 3 42 17 16 11 -12 -20 22 -6 15 -1 38 44 -22 -24 33 -30 -7 8
5583 8 -16 -17 0 -2 31 10 29 -15 19 -4 2 -2 -21 28 34 44 -17 -31 -7 55 19 43 -15 68 13 18 8 -11 -39 -26 -8 0 25 23 22
5618 22 24 18 45 -1 -34 24 -8 4 -18 -15 0 -5 -23 1 -10 -5 27 16 13 40 -6 5 -38 32 28 -13 2 5 -38 1 23 -38 -10 -41
5652 -41 -19 29 1 18 41 -5 -32 -23 -10 -27 57 101 20 48 24 8 -3 60 46 36 13 -3 8 39 31 -6 -5 4 -25 39 -18 -48
5684 -48 56 -10 49 17 24 8 13 -23 0 29 23 48 15 -26 -7 56 40 -17 2 20 -37 -19 -34 -35 -2 36 6 23 37 39 -10 35
5716 35 -35 -33 1 17 2 -73 -27 -36 19 20 7 51 -63 -3 -43 -17 -22 -18 6 4 -4 -5 67 9 -4 -74 19 -24 33 -6 6 27 46 10
5750 10 -32 4 40 10 29 15 1 49 -31 47 -2 -29 3 34 26 -21 9 13 -10 48 22 4 37 45 -21 -33 6 -22 -15 12 -31 -22 -29
5783 -29 -28 6 17 -30 -16 21 47 -30 -56 0 -18 32 -23 34 -15 12 -30 36 -44 10 -11 -10 22 47 41 15 15 15 24 -3 24 17 7 -13
5817 -13 27 5 26 8 8 20 -28 -24 -38 25 23 20 -8 -10 22 24 40 31 3 -24 -13 -9 -5 25 36 24 11 -16 -22 -15 -16 -2 34 -9 14 36
5853 36 -19 -3 20 2 -28 20 -2 -38 12 -11 -2 -6 -9 47 4 28 13 -17 20 34 10 -16 -51 -4 17 3 29 26 15 -24 46 -26
5885 -26 -54 -13 -9 -33 -9 -13 -11 -32 10 -9 20 -66 -38 30 -3 20 -12 4 -13 23 20 42 11 61 3 28 -11 -4 30 20 27 -20 -4
5918 -4 -63 -15 -42 32 -28 -53 -44 -31 -14 17 18 1 13 -21 14 16 -49 -36 -8 23 -82 17 36 23 -28 15 4 -18 52 -7 25 9
5950 9 -23 32 13 19 37 16 -3 15 -26 11 -11 72 27 -26 39 -31 70 6 -18 -26 -29 -7 19 2 -4 -55 -3 -24 10 23 30 6 13
5983 13 -26 23 18 -52 -29 -10 23 19 14 14 -11 -18 29 4 17 26 8 7 -10 0 -32 7 -16 -41 5 -3 -17 -47 26 -10 37 11 -2 -20
6017 -20 38 15 -46 11 -39 20 -30 33 5 21 14 4 -5 26 55 26 22 22 -19 45 43 0 8 5 -37 -33 46 11 -14 24 -4 -25 20 -12
6051 -12 -32 -19 -52 32 17 41 -9 29 -14 7 39 11 -5 35 -39 28 -25 55 -24 14 -20 -2 8 10 21 -39 42 5 -40 -59 64
6082 64 -19 -22 -77 5 -42 -8 -11 -1 -29 -9 54 -30 14 -22 -15 6 33 45 18 61 -2 59 32 -12 -35 0 22 2 72 10 -15 -6
6114 -6 5 22 -5 3 -39 -29 9 -44 48 -29 24 11 -5 -18 12 30 11 52 0 20 49 43 -79 -13 -3 -15 -26 7 14 18 13 -1 44
6147 44 -11 16 18 -32 39 40 36 33 -19 32 -25 -57 -33 -14 18 25 -15 3 -46 -47 -12 -5 2 -22 27 52 16 0 68 -30 2 13 -3 21
6181 21 -11 -2 -21 14 -16 63 25 -10 47 15 2 14 -13 11 -33 45 -21 -35 54 -49 29 1 -45 43 31 -22 -34 -28 -21 3 -40
6212 -40 50 4 -42 -11 -74 23 8 -51 27 30 26 16 -16 25 -13 7 -14 -18 33 25 0 1 4 -12 79 24 2 20 8 57 2 -55 -18
6245 -18 -36 -7 -5 20 -1 -19 -8 27 26 7 15 -36 13 -67 -19 31 -8 24 -28 9 -1 -19 -5 -4 8 36 59 14 -12 -29 -23 -12 43
6278 43 44 -56 22 -36 6 15 22 28 17 42 -1 34 -5 -38 -23 62 -25 44 -8 37 -13 28 -37 11 11 5 27 26 -3 38 47 23 48 -6
6312 -6 12 -29 -18 7 -33 -37 45 -17 35 0 -9 20 -11 10 17 12 -13 -17 36 34 23 0 11 32 18 -23 -22 -27 22 -3 12 3 -10 -21 -42
6347 -42 26 -26 -12 -51 -30 36 21 14 -25 30 -15 -17 31 25 -32 -45 42 43 -9 60 3 -56 -49 -8 69 33 -22 40 46 42 32 24 13 84
6381 84 22 -10 -5 22 18 -5 -5 -11 57 54 69 3 -14 78 -18 2 -27 75 21 51 15 11 -49 -23 34 -18 -17 -43 9 -7 25 -46 -1
6414 -1 2 -6 -5 -8 -33 17 -23 2 -15 13 56 -9 -11 10 -19 0 -11 -11 -3 33 -32 11 -55 10 -23 -16 37 -61 -52 -2 5 19 -14 19 -39 0
6450 0 22 11 33 -40 35 -18 -25 44 3 28 -28 -21 -38 -22 5 21 -4 -44 3 32 -7 39 -5 20 4 4 -39 21 -20 -18 4 2 20
6483 20 -36 14 -22 4 5 -13 -18 -8 -17 -1 -13 49 -14 -29 45 -10 -12 10 -26 5 24 23 11 36 2 -4 63 23 16 23 -22 -11 -10 -65 -6
6518 -6 -10 -16 7 62 -22 6 -16 -37 25 40 2 -9 -5 35 42 -1 15 -9 1 7 -9 24 74 -15 35 39 -40 17 -55 29 18 -65 -2 12
6552 12 -29 1 39 -11 -43 1 32 -3 4 27 2 -33 -20 1 -35 -25 -3 -9 22 -27 27 -34 -3 -18 68 -1 50 8 10 41 -29 -43
6584 -43 -83 -30 39 29 -24 -9 -5 -7 8 -16 1 29 13 24 -49 31 1 -6 31 8 -20 25 34 18 -39 38 16 -14 -54 -15 13 -34
6616 -34 8 -8 -27 -38 23 -43 -46 -3 -6 2 33 11 33 59 -50 -6 -16 -4 -21 -7 -6 -44 -5 -54 1 -1 31 -79 -45 36 17 28
6648 28 -6 42 -47 -31 8 3 -14 -9 7 -19 15 -1 -14 -34 63 -12 17 37 -9 18 11 -6 25 39 -13 8 25 20 -15 -24 -27 -44 -21
6681 -21 -20 3 24 -14 44 -52 -38 3 28 -8 -28 -12 -13 24 42 17 12 -14 30 81 -8 30 4 -32 -8 -22 49 36 11 77 13 -12
6713 -12 47 43 -30 36 -4 -49 -16 -49 51 -56 -50 -20 -30 9 3 21 -50 6 -14 6 -32 33 -1 -18 18 -23 13 18 -57 5 -16
6744 -16 29 46 -12 -57 7 16 20 8 32 14 35 24 6 -8 40 -37 21 -19 -19 50 23 0 40 -33 -37 11 -27 -9 5 -5 -37 1
6776 1 -23 28 36 6 12 4 24 -47 -55 -10 19 -52 -12 34 2 4 -4 -15 3 0 -26 61 2 14 -2 -33 -7 -11 43 4 -8 1 -12 -5 10 -7
6812 -7 20 -9 -15 -15 8 26 -13 -12 -46 29 63 31 -3 10 -4 -16 -65 11 11 -13 8 -9 -2 15 -13 -22 10 -2 42 28 -4 30 -32 -11
6846 -11 -12 -14 1 -52 23 16 -15 -16 20 19 -8 -5 -3 37 18 20 -39 -10 29 13 16 28 11 24 -10 -32 -1 21 -18 -3 18 -16 -5 -17 -8
6881 -8 -3 0 -48 20 -36 3 47 10 -13 -17 -17 -26 -67 -25 -9 20 -38 -32 -9 -32 -4 -55 -24 11 -10 17 5 12 -32 -18 9 -22 7 30
6915 30 9 14 -58 -21 21 45 -38 -17 -15 11 -14 -15 34 -38 -3 -5 12 5 -25 -22 -17 -12 2 -25 51 -30 71 28 35 -25 17 38 -5 33
6949 33 18 -4 -11 -29 18 -29 8 9 28 15 -36 40 -17 -3 16 26 17 1 47 -11 -41 26 -16 -33 -7 24 5 -9 -4 37 23 6
6981 6 10 49 -40 3 8 10 -13 26 -43 52 11 30 -5 -24 7 -66 -39 -27 25 -9 61 14 22 -3 4 7 -14 -40 -40 -58 59 -42 50
7014 50 15 17 25 0 6 51 -70 8 17 -14 25 -29 -6 35 65 -4 14 -48 -26 48 0 6 -16 45 28 12 14 11 14 65 5 -37 9 3
7048 3 37 -63 -39 16 14 -6 2 3 3 -41 -7 75 37 39 41 -17 2 14 -6 38 3 1 -5 15 17 1 12 -18 1 -3 0 -12 -37 17 7 -18
7084 -18 -46 -3 17 -35 9 20 -33 32 -5 2 0 14 11 20 -50 4 25 43 33 0 14 17 -34 21 38 -8 8 -51 27 -29 0 -55 24
7117 24 -13 -11 6 -21 32 45 -10 15 33 -24 -7 40 -42 49 37 0 -30 -32 8 12 -2 11 84 -14 3 3 -65 -14 -6 -9 15 5 -30
7150 -30 14 18 -19 -17 -54 -29 11 10 56 0 -29 -7 -36 -49 -48 -19 -23 -16 45 -41 13 -13 -32 9 -53 3 -16 -47 46 -33 10 -4 7
7183 7 61 -24 0 23 8 -17 21 -12 -14 21 33 38 -4 -3 2 -24 -3 -36 -68 2 19 13 -31 -17 -22 9 32 33 42 -5 40 -40 -18 -10 -20
7218 -20 30 4 -9 -40 -48 54 -13 3 9 11 10 6 -3 38 1 -3 -4 -37 -18 -5 15 -24 14 -2 -19 54 25 -7 35 33 -9 16 -13 4
7252 4 -9 -10 -6 -1 -39 10 10 46 18 14 9 -23 -13 -5 15 23 5 18 -40 -42 -1 42 15 7 6 -9 6 -13 16 19 -1 -28 -25 6 -41 -35 -16 -46
7290 -46 4 -11 42 19 -54 53 -19 -9 -26 -38 -38 25 18 7 -29 -43 -1 -30 6 20 -6 -36 5 -22 41 2 -6 11 -6 -28 10
7321 10 36 -28 -28 47 -6 2 -44 47 61 26 -40 38 -37 37 2 6 -21 5 -29 39 11 -20 -9 -23 -11 -43 12 7 -61 -33 36 -19
7353 -19 -11 -33 9 7 -33 16 2 15 5 -21 -29 8 -15 33 -11 -42 9 -27 -53 -20 -24 7 12 2 -7 -4 -12 11 17 0 -11 -2 -10 18 -39 -19
7389 -19 26 24 10 2 -8 12 28 -28 7 18 26 -45 -19 -7 3 27 -29 -36 6 -12 -24 33 13 -20 -8 26 20 36 20 22 -4 36 4
7422 4 -5 8 47 -10 38 56 -31 7 4 8 9 -15 62 21 -8 3 0 39 14 12 -1 -45 -13 34 -47 16 -30 -18 28 -7 0 9 -18 27 41
7457 41 -81 -39 14 -39 -67 11 0 14 28 52 7 15 -11 -23 0 -57 23 -7 0 -17 -37 4 0 -12 46 -5 -9 -48 55 55 -38 -50
7489 -50 -40 -59 8 -4 3 -73 -44 -8 9 -11 12 19 31 -4 -3 15 10 21 -3 11 18 23 30 -3 51 31 5 -11 -44 17 9 -32 -34 5 8
7524 8 -38 -21 15 -25 19 -2 -17 -9 16 2 23 6 -2 -52 -42 4 19 -31 -32 -36 36 31 -11 -1 -31 27 22 53 16 25 -6 0 45 19 -67
7559 -67 0 3 -58 16 -22 -21 21 -20 -11 9 -28 -26 6 -7 -53 14 -45 6 -23 28 17 -22 1 -39 -11 34 -54 -11 3 25 31 -8 6
7592 6 -26 38 18 38 20 -3 -14 54 -14 -49 -44 -39 -18 -9 -3 -15 -2 -2 -40 29 -4 -4 -28 -26 4 -4 -11 -55 21 -27 33 -14 2 -6 -21 7
7628 7 8 9 0 10 -6 12 -19 -5 -34 -52 5 -1 -61 -63 18 12 69 6 14 -19 -23 -2 -21 -2 -56 55 18 14 21 -32 -15 -10 -14 -20 -58 -31 -31
7665 -31 -45 -5 -8 -29 -2 -38 -33 -21 -16 -6 -39 36 -16 27 48 -13 3 41 1 -39 20 -27 3 1 10 -17 -10 20 15 38 58 -19 -13 22
7699 22 -11 -2 -42 15 25 -15 2 -10 -10 -40 9 -20 -25 -18 31 -20 7 16 -27 -8 7 -34 25 3 16 32 15 -31 -16 -7 -16 -21 2 -43
7733 -43 -22 12 20 15 -12 -1 -4 -20 46 2 -11 7 -48 -33 0 38 -7 -43 32 31 -11 10 -8 58 -33 -74 -61 -19 -30 -4 -41 34
7765 34 -5 -50 20 -5 38 -28 23 26 24 3 53 -16 -1 43 33 -23 -11 -11 10 -43 20 -13 45 -16 10 -24 27 45 15 -22 -29 1
7797 1 -18 11 -1 -7 18 -29 20 3 -69 54 -27 -10 -2 15 3 9 3 -1 29 -13 -7 17 32 13 -36 17 13 -21 11 -25 -12 -18 -9 33 38
7832 38 -6 -30 30 -23 6 -31 -2 -23 -40 -2 46 -2 23 16 10 -33 7 58 14 57 -2 -9 -8 -15 35 -37 1 -28 -15 0 -39 11 16
7865 16 -46 4 30 -27 -27 49 61 6 6 4 -12 -19 -58 38 0 1 19 24 37 -8 -37 43 12 11 32 -11 65 51 6 -38 -10 20 -38 -1
7899 -1 28 26 -47 2 -15 70 -10 -31 25 -22 52 -11 1 15 28 -9 -44 29 4 -9 -68 -4 -26 0 26 -50 -10 27 -16 -24 78
7930 78 -27 -12 2 -10 3 39 5 -1 8 30 56 -28 -3 30 5 16 31 29 39 5 -49 -5 7 -39 60 9 29 22 -33 -68 -33 3
7962 3 32 -5 -40 -40 -14 -11 -72 37 17 -16 9 39 5 27 -23 -7 41 -3 21 6 16 10 13 -17 39 -13 -21 -20 -25 -31 -16 -31 41 8
7996 8 37 30 -19 -22 3 53 -10 -27 3 20 3 -71 -4 -38 12 33 -2 30 51 -49 -1 -21 -11 -23 -28 5 -69 -41 -3 -26 36 44
8028 44 -33 10 -53 56 -14 12 -23 18 -4 25 -20 15 -33 -35 -36 -41 16 8 15 -16 -53 -31 -9 -21 15 8 20 -48 26 -3 73 -11 45
8061 45 -2 -1 -24 -17 -58 -12 -11 -24 7 42 -27 27 -21 18 -26 -25 20 64 -26 -27 -76 -17 -43 -69 4 -5 -3 1 -48 -10 -28 -54 27 -48
8095 -48 -44 21 -7 32 13 -24 -16 5 0 -20 7 51 -38 36 15 -19 -40 -22 62 76 21 -2 -39 5 -9 -12 -25 -32 7 -5 39 -15 -9
8128 -9 -4 -2 -19 25 23 -14 -3 26 -37 1 1 -4 -17 48 27 1 -2 16 3 2 24 -12 -69 -13 -11 -19 -45 -24 -22 -7 42 5 -1 -41 11 36
8164 36 0 2 -24 5 2 -2 15 6 -5 -17 -61 -46 -2 34 -15 16 11 -15 51 -9 -36 31 43 -3 -6 -58 -9
8191i
$$ Imaginary data points
##PAGE= N=2
##DATA TABLE= (X++(I..I)), XYDATA
0 0 0 0 0 0 0 0 0 0 0 0 0 0 0 0 0 0 0 0 0 0 0 0 0 -8 8 -8 8 -8 8 -8 12 -16 16 -16 19 -24 24 -28 32 -34 40 -43 48 -53
44 -53 58 -64 72 -77 85 -94 106 -116 127 -140 156 -173 192 -214 239 -267 306 -349 406 -477 577
65 577 -724 960 -1404 2522 -11763 -21099 -12131 -19556 -15794 -10670 -4685 -4719 -5642 -7693 -1455 -1295
81 -1295 -6592 -8564 -6688 -2710 -2690 -3205 -1581 5835 11053 9046 9951 12106 14659 12402 8554 3663
97 3663 6053 6009 831 770 2024 5700 8389 7532 6930 12279 12472 8725 6874 2975 3781 1317 -3478
114 -3478 -5224 -2418 -584 -193 1444 3162 8213 9597 8234 6221 7633 6529 2819 860 -2186
129 -2186 -34 740 -632 169 4458 6569 7856 8443 6400 8999 7153 2734 57 -1464 -2981 -4008
145 -4008 -5742 -6754 -2544 -1776 -1186 -334 793 1909 1018 -1224 -4177 -3633 -5462 -7640 -8538 -7911 -6262
162 -6262 -4263 -3159 -2731 2019 2463 2644 2651 1488 1790 1164 -1364 -2695 -751 -1611 -300 243 968 3975
180 3975 4757 4537 4181 5034 3597 2766 619 -1036 -705 -1414 -2186 -2671 -615 -585 619 698 147 1665 1184
199 1184 -371 -1234 -972 -2304 -1441 -2515 -2727 -236 -337 370 969 1820 2115 3087 1670 1465 2407 1445
217 1445 1549 955 1543 1822 2778 2122 2114 3300 2521 2417 1642 1235 667 1141 -374 -597 652 -326 532 106
237 106 -100 258 398 -1228 -1291 -1322 -2553 -1625 -2757 -2413 -1402 -716 -738 -44 635 369 1046 -236 -475 -710
257 -710 -874 -1723 -1618 -916 -1053 712 424 1273 2394 2523 2001 1913 1195 67 416 -1788 -1573 -1357 -1557
276 -1557 -761 -57 571 1442 2540 1537 2133 1481 551 -276 -1469 -2001 -2503 -1850 -2390 -1144 -174 665 1633
295 1633 2117 2126 1965 2082 3 -113 -1197 -2136 -1854 -2338 -1824 -704 363 536 2314 2178 2432 2703 1213
314 1213 793 -144 -872 -2005 -1724 -2032 -1289 -213 148 1402 2015 2734 2120 2424 1095 297 -208 -1874
332 -1874 -2126 -2322 -2288 -2166 -952 -981 283 1038 263 1004 71 -634 -1592 -2391 -3592 -3532 -3778 -4022 -2816 -2624
352 -2624 -1423 -955 -219 -294 35 -187 -1226 -1108 -2138 -2285 -2375 -2000 -1849 -475 347 740 2424 2172 2795
371 2795 2773 2258 1654 1570 757 362 974 362 1561 1935 2443 3176 3512 3595 3268 3326 2094 2015 1092 606 289
392 289 413 547 769 1832 1592 2725 2613 2394 2368 1874 1091 664 321 -659 252 -127 264 1125 1430 2040
412 2040 2371 2471 1879 2109 916 555 7 -720 -712 -895 -494 -457 606 651 1114 1414 1104 925 364 -228 -1192
433 -1192 -990 -1966 -1674 -1226 -1262 -210 322 974 1454 2124 1563 1853 1309 656 789 34 249 312 956 1212
453 1212 2249 2771 3195 3862 3644 3690 3051 2734 1676 1424 844 252 821 623 1078 1451 1824 1686 2222 1641
473 1641 1023 894 -437 -724 -1571 -2036 -2231 -1954 -2034 -1532 -905 -1006 -178 -397 -302 -692 -889 -1455 -1911 -1839 -2415
494 -2415 -1783 -1677 -1108 -543 181 474 894 1286 698 1146 424 171 52 -145 -218 184 557 542 1651 1451
514 1451 1963 2077 1824 1692 1344 1076 504 645 130 371 485 699 1079 1338 1668 1343 1789 1046 997 643
534 643 111 -5 -186 -257 -262 475 149 918 919 839 1102 679 484 -51 -213 -888 -591 -863 -796 -255 -238 304 452
557 452 870 486 575 136 -332 -408 -984 -1017 -1188 -771 -866 -1 240 534 1201 922 1173 940 609 44 16 -634
579 -634 -531 -300 -289 517 776 1469 1656 2129 2028 1934 1822 1066 844 174 82 -245 141 266 746 1413 1507 2211
601 2211 2092 2092 1720 1403 578 167 -393 -1070 -739 -1055 -589 -139 252 596 985 1040 718 685 -232 -578 -1388
622 -1388 -1742 -2089 -2112 -1855 -1720 -785 -630 58 334 461 320 158 -352 -1000 -1111 -1906 -1682 -1761 -1594 -1000 -446
643 -446 45 517 1048 686 1040 464 73 -365 -950 -1181 -1471 -1293 -1314 -644 -460 170 447 587 611 291 193
664 193 -653 -794 -1390 -1681 -1696 -1833 -1466 -1182 -671 -538 188 -21 198 71 -495 -530 -1088 -1130 -1495 -1234 -1335
685 -1335 -849 -554 -318 251 301 576 324 452 -106 -194 -435 -800 -675 -810 -522 -450 107 71 537 630 344 588
707 588 156 36 -274 -267 -557 -372 -347 -217 275 217 702 549 756 594 503 274 -50 22 -329 -29 -128 162 233
730 233 587 710 627 887 437 514 190 -44 -275 -345 -450 -374 -49 -206 346 214 357 418 275 42 -233 -356
752 -356 -877 -725 -998 -774 -630 -440 -120 26 389 246 392 -52 -165 -431 -709 -906 -1018 -857 -1080 -364
772 -364 -388 51 278 368 488 289 231 -232 -210 -843 -771 -879 -809 -446 -260 257 403 939 919 1082 913 679 424
795 424 86 -53 -419 -113 -194 276 545 865 1305 1396 1601 1340 1346 767 645 125 -161 -209 -465 -203 -146 238
817 238 392 746 685 741 639 127 29 -607 -750 -1263 -1216 -1281 -1199 -789 -722 -263 -161 159 3 24 -335 -583 -759
840 -759 -1215 -1118 -1343 -1172 -986 -562 -402 55 310 194 442 129 14 -350 -577 -812 -901 -812 -890 -365 -399 66
862 66 194 481 531 443 448 -7 111 -421 -375 -457 -301 -132 189 533 686 1198 1034 1300 1172 1014 796 478 466
885 466 123 415 212 656 620 890 1080 1067 1172 783 793 224 92 -239 -522 -734 -796 -732 -741 -488 -590 -276 -436
908 -436 -542 -595 -968 -1114 -1450 -1505 -1783 -1527 -1627 -1318 -1032 -937 -524 -516 -209 -439 -371 -596 -676 -774 -852 -753 -768 -375
932 -375 -349 163 221 471 629 421 537 204 91 -226 -203 -563 -432 -363 -354 -12 -19 327 324 393 110 50 -173 -525
956 -525 -585 -848 -764 -798 -571 -473 -217 100 116 331 157 241 -58 -185 -564 -615 -693 -758 -443 -562 -216 -184 103 69
980 69 190 45 -113 -267 -728 -698 -1055 -960 -996 -918 -706 -635 -240 -320 -37 -130 -147 -327 -513 -588 -868 -702 -840 -437
1004 -437 -378 -94 131 457 628 624 843 515 698 317 291 187 126 275 252 633 609 1054 1032 1086 1026 942 825 473
1028 473 443 13 68 -122 -29 71 171 288 361 531 366 509 91 120 -159 -412 -398 -630 -454 -461 -197 -186 155
1051 155 249 312 377 126 162 -167 -150 -417 -429 -414 -427 -207 -112 176 198 456 307 431 280 46 -6 -317 -329 -535
1075 -535 -358 -395 -70 -105 124 334 252 434 267 227 -84 -103 -336 -442 -343 -402 -81 -113 211 298 445 494 424 441
1099 441 131 126 -215 -150 -339 -257 -224 -112 131 132 444 299 411 256 134 20 -211 -306 -571 -351 -545 -258 -225
1122 -225 10 90 165 376 143 168 -86 -122 -333 -353 -414 -455 -257 -315 72 41 325 369 348 357 155 184 -103 -97 -370
1147 -370 -229 -289 -51 88 103 385 329 559 337 432 192 100 -33 -225 -204 -270 -55 -151 142 245 396 471 316
1170 316 412 222 219 -130 -58 -278 -272 -143 -221 72 73 360 271 476 349 262 189 -67 -73 -366 -273 -401 -282 -279 -53 176
1196 176 169 401 257 328 97 -43 -221 -370 -366 -530 -284 -392 -91 -49 151 213 354 326 106 179 -123 -115 -377 -341
1220 -341 -428 -298 -111 -69 248 250 456 428 502 329 176 49 -154 -169 -277 -132 -166 32 132 325 458 498 636
1243 636 408 438 114 76 -111 -179 -150 -215 -30 -31 278 189 421 432 365 332 111 73 -242 -212 -368 -275 -243 -203 -80
1268 -80 46 245 165 311 149 179 1 -175 -253 -356 -366 -475 -239 -275 -38 -15 79 259 72 196 -46 -28 -316
1291 -316 -322 -356 -416 -337 -339 -104 -193 159 -5 181 122 7 -10 -173 -151 -402 -204 -376 -213 -108 -60 121 29 273
1315 273 153 216 34 12 -105 -152 -78 -220 34 -52 124 176 297 305 253 263 116 178 -3 -39 -182 -109 -99 -31 107
1340 107 62 279 161 308 127 158 39 -122 -66 -267 -133 -227 -50 -61 115 235 216 357 211 281 86 64 -46
1363 -46 -63 -150 -125 40 -16 262 258 369 382 424 401 283 222 -51 -33 -285 -157 -222 -83 -18 39 205 212 310 178 239
1389 239 -49 -116 -223 -412 -451 -493 -310 -362 -119 -69 10 132 118 166 -17 -13 -309 -305 -467 -524 -473 -415 -198 -206 74 105
1415 105 253 213 195 73 -133 -96 -316 -352 -463 -331 -312 -159 -31 32 231 156 316 204 159 -69 -119 -247 -348
1438 -348 -309 -349 -98 -133 86 239 306 397 266 378 221 238 46 -4 -68 -29 3 9 227 288 508 426 565 478 409
1463 409 335 133 155 -32 46 -20 44 47 109 220 190 403 200 214 44 -21 -131 -257 -282 -408 -277 -341 -214 -217 -54
1488 -54 -68 -90 -67 -136 -130 -277 -310 -382 -406 -403 -390 -250 -247 -95 -143 37 -55 -38 -73 -156 -167 -248 -199 -285 -130 -170 -68 -21 -19
1517 -19 103 37 104 -62 9 -112 -143 -182 -200 -167 -171 76 -12 162 110 222 166 72 100 -43 5 -175 4 -88 52 106
1543 106 78 291 277 311 218 308 184 103 28 20 -18 0 75 31 289 184 240 277 212 168 72 163 -68 -27 -190 -179 -138
1570 -138 -127 -48 -3 155 121 208 150 101 21 -89 -123 -255 -166 -254 -160 -116 45 99 194 291 239 302 119 132 32 44 -60
1597 -60 -141 -24 -84 107 92 312 341 329 330 293 258 38 60 -19 -101 -140 -106 -31 14 188 186 338 189 254 190 96 23 -128
1625 -128 -80 -233 -80 -165 41 22 78 129 187 244 109 208 37 22 -133 -164 -167 -187 -67 -92 58 27 226 196 204 178
1651 178 68 62 -99 -75 -214 -121 -238 -155 -16 -61 55 50 202 92 90 -13 -25 -71 -162 -132 -207 -89 -184 -8 -37 52
1677 52 166 75 155 -40 61 -100 -121 -194 -153 -182 -124 -37 -67 130 51 145 85 45 38 -103 -125 -182 -204 -209 -137 -104 -35 -14
1705 -14 8 143 20 41 -67 -26 -176 -165 -207 -307 -169 -227 -138 -160 -13 53 -18 11 -28 -4 -151 -155 -238 -206 -203 -118 -64
1732 -64 -38 98 49 213 151 167 107 81 59 -83 67 -50 43 62 165 218 201 345 289 330 213 219 93 157 51 22
1758 22 96 15 222 163 293 261 294 196 216 105 31 40 -149 -44 -190 -109 -45 -83 -37 43 76 -2 53 -85 -30 -94 -203
1785 -203 -200 -329 -255 -292 -197 -235 -141 -142 -134 -97 -167 -126 -311 -258 -385 -382 -367 -399 -283 -312 -211 -214 -136 -170 -171 -193 -212 -208 -292 -215 -289
1816 -289 -171 -203 -132 -25 16 119 91 188 128 204 123 67 90 57 146 101 199 245 382 334 385 427 457 497 391 441 339
1843 339 359 247 316 301 351 471 420 550 514 570 492 468 476 385 408 301 334 280 339 361 407 397 430 444 347 461 306
1870 306 271 212 220 125 67 133 67 235 162 289 269 223 210 188 137 0 52 -51 -18 -2 -28 62 15 101 60 148 35 83
1898 83 21 -66 -98 -132 -108 -152 -77 -174 -55 34 -38 -17 -38 -11 -64 -37 -192 -176 -208 -250 -206 -293 -201 -226 -99 -103 -46 -14 -55
1927 -55 -87 -116 -99 -236 -189 -195 -126 -124 -68 20 28 110 42 124 68 39 -41 -79 -47 -123 -60 -130 -32 -62 30 3 14 69 -81 15 -160
1958 -160 -91 -189 -200 -227 -196 -133 -158 -77 -31 72 -32 -9 -49 -93 -88 -142 -78 -186 -58 -81 -19 -6 55 137 88 183 24 138
1986 138 42 46 -12 1 19 -83 25 9 76 69 148 163 115 112 3 95 -103 -54 -104 -129 -50 -91 27 -14 82 60 108 74 53
2015 53 -4 -33 -22 -77 -10 -30 54 2 64 103 146 139 78 95 22 23 -63 -70 -107 -104 -91 -149 -32 -84 22 -42 -14 -6 -118 -97 -197
2046 -197 -145 -268 -145 -268 -217 -208 -134 -36 -89 63 -67 -34 -78 -54 -88 -157 -17 -127 -9 -79 22 52 39 107 106 128
2072 128 65 106 -12 18 -33 6 -43 -7 40 -8 105 -1 60 -26 -9 38 -47 -50 -198 -52 -148 -64 -71 -118 -4 -47 19 -65
2100 -65 36 -96 -70 -99 -82 -118 -152 -66 -134 -16 -82 37 -16 -43 -5 -52 -15 -93 -91 -106 -75 -65 -38 -21 -61 56 61 81 23
2129 23 65 39 54 93 -11 36 23 123 13 117 123 202 161 145 257 180 239 142 154 123 111 112 55 172 110 182 107 156
2157 156 157 149 93 41 99 -60 -12 -50 -35 -40 -8 78 11 92 41 107 -13 -3 -78 -79 -39 -125 -103 -93 -36 -83 7 11 -21 -10 -15 11
2189 11 -123 -90 -178 -143 -163 -154 -167 -130 -86 -163 -41 -89 -49 -80 -182 -134 -224 -139 -283 -240 -226 -155 -127 -118 -57 -65 0 -26 77
2218 77 -48 -13 -19 -48 -19 -60 -38 0 50 35 69 145 113 109 57 66 -19 33 -67 -43 -94 -117 -4 -148 14 -84 -10 -55 -17
2247 -17 -81 -123 -146 -204 -139 -208 -145 -186 -122 -83 -79 -21 -41 24 -92 59 -12 2 -52 -55 -2 -74 22 -23 52 48 2 26 29 41 -24
2278 -24 -15 -90 -56 -58 -104 -41 -60 -14 -51 -2 -114 -58 -64 -59 -46 -108 -73 -86 -69 -103 -56 -52 -23 30 32 50 -19 37 -33 7 -48 -16 14
2311 14 14 34 -12 54 11 125 38 29 54 -71 2 -124 -12 -172 -62 -83 -92 -41 -66 -90 -107 -86 -119 -56 -121 -130 -142 -141 -89 -125
2341 -125 -87 -88 -23 -7 12 8 -7 56 -92 24 -93 22 -40 -35 38 43 96 16 111 41 123 7 29 5 -19 -16 -147 -60 -108
2370 -108 4 9 -55 -6 -30 36 -115 -39 -185 -147 -177 -166 -181 -264 -149 -242 -153 -231 -151 -206 -155 -152 -184 -170 -253 -240 -249 -209 -234
2399 -234 -256 -196 -258 -99 -171 -126 -188 -110 -178 -165 -141 -198 -166 -177 -116 -168 -70 -54 -85 -19 -63 -21 -73 -28 -101 -67 -40 -115 -67
2428 -67 -51 40 -12 24 11 41 67 14 65 11 78 24 52 61 61 116 80 132 86 172 135 173 121 140 131 96 140 63 107 78 130 114
2460 114 88 115 99 123 124 171 40 109 30 78 25 -46 23 -31 71 -61 74 29 20 11 -10 -30 -25 3 -40 20 51 79 42 59
2490 59 136 82 94 61 98 52 96 114 41 107 55 101 59 133 110 151 107 98 127 113 50 66 43 -9 -20 51 -10 24 -21 57 27
2521 27 30 49 32 -5 -58 49 -35 -8 -27 21 -20 0 80 20 67 62 73 -21 90 -20 3 24 -18 92 1 46 40 86 77 87
2551 87 103 50 38 -10 31 -18 26 -4 -36 14 -15 91 -17 73 29 14 23 -32 59 -66 5 -24 22 28 51 1 51 58 75 122
2581 122 3 58 17 52 -42 18 8 -12 119 -21 3 -21 -37 -23 23 39 -75 -37 -89 -12 -105 -59 -78 -8 -81 -57 -106 -47
2609 -47 9 -104 -11 -30 -35 -30 -67 17 15 40 4 73 36 22 88 0 2 -25 22 -42 22 -6 1 44 -7 2 10 27 -49 -47 -31 -95 -46 -49
2643 -49 31 -30 34 -14 39 47 38 118 26 104 51 69 27 73 41 53 48 74 100 31 78 55 103 89 57 14 -40 -16 -69 -23 -96 -102
2675 -102 -96 -142 -41 -121 -79 -157 -114 -174 -130 -156 -155 -181 -196 -129 -156 -72 -102 -50 -27 -39 -23 -21 79 -2 67 55 -34 86 26 126
2705 126 42 43 92 127 98 68 91 66 80 8 14 -38 12 -7 -6 -20 18 -43 -10 8 -27 27 -36 -37 -67 -61 -6 -28 52 66 46 118
2737 118 67 96 95 156 101 155 120 188 142 133 174 55 177 117 146 162 140 123 115 137 29 110 34 25 10 23 -28 -36 55 -62
2767 -62 81 12 72 -39 98 34 40 48 49 110 99 121 149 189 170 212 197 241 278 197 219 206 295 285 233 248 216 249 179 267
2797 267 176 207 108 93 54 37 77 22 49 4 38 -52 -103 -70 -33 -55 -2 -102 -105 -28 -110 -109 -50 -70 14 -46 59 -38 24 32
2827 32 3 18 46 0 8 19 -12 50 20 36 62 -34 33 -16 23 -35 11 -15 -59 -106 -114 -27 -88 -29 -86 -63 -82 -102 -76 -56 -78
2858 -78 -127 -68 -128 -80 -22 -97 -7 -17 30 -13 71 36 90 51 46 23 58 81 38 45 73 92 46 36 90 19 34 50 39 85 45
2889 45 55 -36 58 -92 5 3 51 7 -48 60 -17 5 -36 9 -3 40 -42 -14 -67 27 8 -4 39 22 53 40 43 20 21 30 -29
2920 -29 43 -2 59 36 47 66 29 66 106 53 -14 43 -36 3 -7 25 67 -79 -17 -59 -24 -53 -5 -29 -58 -38 -108 -28 -40 -45
2950 -45 -78 -27 -60 -52 -36 -79 -14 -39 14 -49 -27 -17 -12 -38 -74 52 -27 19 56 54 99 2 123 9 29 -53 7 25 47 -32
2980 -32 -8 21 -28 0 -26 20 -48 -14 -5 -97 -63 -155 -53 -49 -55 -54 -91 -69 -121 -32 -26 -43 -120 -49 -107 -110 -77 -85 -85 -119 -14 -76 -5
3013 -5 -36 -45 -37 -3 40 -38 13 -13 -4 7 23 27 -10 39 -42 24 8 -45 -15 26 -7 -51 -4 -10 29 -54 -43 -38 -7 24 -33 1 -81 41
3047 41 -8 -9 10 6 11 24 40 -6 5 21 7 1 -32 1 28 69 49 90 -2 -31 -19 -9 40 -37 -7 -53 14 -26 -3 -51 -46 -28 -46
3080 -46 -86 -37 -33 -41 6 -51 -33 -23 -80 -13 10 -32 -44 -4 -20 -38 12 -36 7 14 6 16 41 31 75 32 -42 54 65 46 16 14 26
3113 26 15 30 4 63 -39 62 -41 13 26 36 38 13 87 -32 26 22 10 19 -9 4 0 16 42 -3 -21 -17 32 43 21 -17 -16
3144 -16 3 -42 -31 47 -42 -26 -72 -53 -45 -81 -26 -95 -67 -69 -136 -143 -117 -118 -151 -78 -128 -85 -102 -149 -74 -73 -55 -100 -67 -86 -47 -64 -55
3177 -55 -7 -62 -1 -81 -11 -42 1 -17 -32 26 -5 35 -33 7 -5 -33 55 -1 -4 -39 23 -24 11 19 -23 23 -26 67 -8 39 19
3208 19 74 72 70 111 43 114 59 70 153 98 108 83 116 126 41 42 83 26 28 39 26 -1 -2 6 -40 -36 -60 -41 -39 -112 -100 -118 -92 -135
3242 -135 -78 -100 -115 -88 -161 -121 -126 -48 -59 -42 -93 -29 -45 -44 -54 -29 40 -5 0 44 26 3 12 89 44 27 7 16 9 -10 -29 -25 6
3275 6 -34 -69 -40 -19 -53 -58 -60 -74 -38 -98 -6 -68 -59 -85 34 -78 -57 -51 -35 -79 -68 -15 6 16 -55 -16 17 -21 34 10 13 -24
3307 -24 -19 -64 -49 -54 -65 -34 -42 -60 -106 -39 -91 -97 -76 -81 -88 -126 -75 -63 -89 -27 -72 -76 -89 -10 -36 -26 -23 37 66 20 -11 36 52 35
3341 35 74 62 39 34 62 80 95 93 53 124 54 71 102 102 54 22 84 33 13 16 69 64 33 42 2 45 18 3 20 5 7 25 -21 2
3375 2 -1 -58 -7 -5 -6 -9 -49 5 22 33 12 -5 -10 21 -40 7 36 -14 15 26 -4 20 35 -7 -22 19 -59 32 -27 37 -5 -3 -66 -69
3409 -69 22 -2 -34 -7 2 -36 11 -36 11 -3 -6 -23 -27 63 -17 -45 15 -46 -24 -22 4 -29 22 -28 -56 -58 27 -44 -64 -18 -28 -31 -40 -18
3443 -18 17 49 -51 -19 11 -49 -28 29 9 -16 -7 -29 -30 34 0 46 -12 -2 12 13 14 -32 18 -42 -39 -22 -40 -5 -47 1 -37 40
3475 40 -47 -31 61 -24 58 -9 -13 -24 -23 -37 2 30 30 99 21 27 50 61 56 88 40 71 154 44 85 64 60 37 98 47 29 53 71
3508 71 91 23 56 32 -11 7 4 -9 -19 32 -42 17 -43 -40 -52 -12 -37 4 21 -17 -26 -25 42 1 -36 21 -7 37 18 84 47 -13
3540 -13 10 -5 48 -36 61 -18 35 -17 -46 22 -30 -40 -43 9 -56 -10 -22 -7 -39 -70 -62 -49 -62 -89 -12 -62 -61 -30 -36 17 32 4
3572 4 -20 47 57 -5 70 30 37 62 33 -24 31 57 20 40 42 -1 43 86 27 36 37 47 23 64 39 -8 -3 -50 -3 -54 -55 53 -28
3605 -28 -44 -4 -16 -30 -31 -18 -37 14 4 -6 12 19 -20 69 48 28 20 25 65 11 25 52 47 19 61 30 -3 48 71 41 -25 66 -2
3638 -2 -36 -36 6 -14 3 5 -43 44 5 -17 38 -63 -9 -79 27 -23 20 -17 17 -50 31 16 2 6 19 74 -14 -27 -38 46 21
3669 21 -6 2 -39 -25 -47 -12 -22 -15 -32 -48 17 -47 95 -15 -88 -3 -14 -18 -61 -51 -19 -9 -61 -39 3 -26 -32 -10 16 -46 67
3700 67 23 53 50 31 -21 30 21 -31 49 -8 88 51 49 23 50 8 0 77 59 47 -17 -33 39 -4 12 -54 11 -16 12 6 -34 -23 12
3733 12 23 -50 8 35 -10 47 0 0 -4 38 14 15 31 43 32 38 63 28 66 -2 4 16 22 -34 -26 -26 7 -48 -2 17 31 8 0 -31 14
3768 14 -59 -19 -26 4 -10 -46 29 -29 62 15 -2 37 103 -7 23 50 47 50 20 49 8 -21 18 14 24 105 55 -9 -17 -9 -13 -19 0 34
3802 34 -18 -1 -23 -12 -16 -59 -34 -27 -24 13 20 14 -8 -30 -28 -4 9 -11 -31 -10 -23 -3 -5 -10 -10 -40 9 -21 -43 0 50 9 -35 -18 -37
3837 -37 -20 -35 -27 -19 13 -3 7 -38 5 -20 -21 -20 -9 8 23 -68 -16 -14 -9 30 -30 11 -15 -37 27 17 49 11 -40 77 2 4 38
3870 38 57 44 -10 63 -6 53 -6 16 25 -15 50 18 53 27 33 22 5 46 -3 -14 16 13 -42 28 -37 -7 -29 39 9 -6 14 -49
3902 -49 -11 -43 -38 -35 -20 36 -28 -25 -87 -30 74 6 -18 -32 -15 -28 -22 -21 -24 -7 -44 -4 5 29 12 39 15 19 35 -23 27 -33 39 -32
3936 -32 33 -8 -20 -5 -17 -15 -7 46 13 4 -22 12 -10 -2 29 -88 -17 -17 4 -36 -43 6 -16 -22 -31 20 -48 -19 -38 -52 -68 -72 0 -40
3970 -40 26 -11 19 -11 -16 49 -28 28 -32 -2 33 14 9 20 -27 10 1 -16 -14 -31 31 -16 4 -40 -18 -47 -42 23 2 19 20 -57 -5
4003 -5 73 58 -67 24 -13 72 45 64 -28 59 63 -27 63 8 64 38 96 4 13 77 42 22 25 11 58 -4 -12 26 56 53 62 -43 -31
4036 -31 -19 -34 -19 -33 -10 -80 -18 10 1 -46 9 -10 16 -27 -13 -24 -64 13 26 39 -48 -8 -20 -28 -4 2 -62 24 38 -47 29 -57
4068 -57 -46 -27 33 29 -66 79 -62 -17 2 -51 -33 -4 -13 -8 -19 -34 19 -16 -10 -35 27 15 -59 8 -39 16 69 -8 27 25 17 -4
4100 -4 29 -16 9 6 -29 41 3 -38 26 -12 22 6 -2 5 59 -3 -21 -10 27 -21 0 38 -58 1 -74 16 -1 -49 -28 -19 1 -68 11
4133 11 -57 4 -26 -17 -9 -65 30 19 6 -39 -19 -34 -47 17 -64 9 -19 9 -25 9 -27 -16 -47 -13 19 -30 16 4 -28 -74 -1
4164 -1 -18 36 66 18 31 -3 -26 75 9 21 20 -6 33 10 11 69 -7 51 36 47 3 6 -32 26 -40 27 -65 9 -33 -76 -44 -52
4196 -52 1 2 -62 -48 -50 -74 3 -26 -2 -23 -18 -45 -14 -58 -13 46 4 9 -52 45 22 58 30 -15 18 26 46 55 46 5 55 22 -1 -6
4230 -6 33 -21 -17 -8 27 -59 3 9 76 -25 -2 6 -8 6 -24 2 -9 -14 9 51 50 15 55 -35 35 74 67 0 64 50 36 -26 6 30
4264 30 6 -9 20 37 -21 -21 -24 -44 -4 5 -8 -43 -29 -48 -3 -56 -47 -44 -54 -89 -9 5 -93 -56 -73 -56 -72 -38 -14 -29 2 -10 11
4297 11 31 27 41 5 68 22 18 -60 -12 8 -6 15 26 25 -12 25 35 40 26 12 24 -66 -19 19 -40 -42 -42 -43 -54 -30 -44 -58 -74 -27
4331 -27 -54 -11 -35 45 -20 -20 -18 -16 -30 9 0 -41 14 -4 -67 -42 6 -3 44 -3 -21 -22 15 -21 -61 29 -8 -12 29 10 -46 -32 -27 -19 -39
4366 -39 -86 -20 -48 -24 -36 -27 -56 -8 -60 8 15 -1 -35 -22 31 0 -13 5 18 8 16 83 -5 28 23 15 42 43 56 -9 17 -16 17
4399 17 0 -31 42 27 16 26 -1 -16 -23 -19 -15 34 15 -38 19 -49 -16 26 -4 44 -19 -18 -58 4 -12 -38 -35 -15 -12 -13 -33 -34 -38 -17 0
4434 0 28 -2 -27 -31 -27 -24 -12 0 -7 -3 4 -18 -28 -60 -13 -5 17 -4 -3 26 -31 7 -12 20 6 53 14 -14 28 38 8 24 11 36 -23
4469 -23 -10 31 36 -8 -21 11 16 -9 28 12 -12 -6 -16 -12 6 -7 -17 -31 12 2 -19 35 -38 31 19 28 7 -11 31 -4 23 -4 -8
4502 -8 -25 9 -8 -41 29 8 -2 -65 -7 2 5 1 -37 -30 -80 -36 -29 -32 8 -25 -41 -85 -7 -17 1 -4 18 38 7 42 63 44 22 -21
4536 -21 15 4 -5 34 32 32 -14 16 40 21 -16 8 -5 43 8 1 -23 27 -21 -6 -63 -43 -42 -61 -43 -76 -16 -11 -99 -52 -39 17 -53
4569 -53 -23 -32 -8 10 -57 -17 -29 -41 -39 -31 -41 -63 -8 -20 -21 19 26 -13 12 -27 -28 -64 -12 -70 -13 -49 -19 71 -78 -18 -19 10 4 -32
4603 -32 16 -4 14 -40 20 -8 17 24 -29 5 7 3 -53 6 -65 -45 35 1 -66 -7 -32 -47 -14 -16 18 -12 8 15 -68 -64 35 -7 12
4636 12 -32 38 32 -9 37 2 -15 -9 -25 34 -47 -27 0 -59 -9 -66 8 10 12 -11 -41 67 -14 7 -44 1 -38 26 2 -11 51 -17
4668 -17 9 -8 -42 -36 -33 -42 2 -29 -23 52 -1 16 -2 -21 25 28 21 6 0 35 16 48 6 31 2 -17 8 26 0 57 -8 0 -85 3
4702 3 -25 19 -18 -37 -46 19 -48 -61 -9 19 -54 -34 -74 -24 -10 5 -25 39 3 -39 -13 41 51 -24 57 -14 28 13 15 -29 66 17
4734 17 15 -5 26 29 -9 1 4 9 54 -4 28 59 3 -43 -7 -34 1 -3 -34 -52 -18 -31 -20 -66 -3 -62 -25 4 -30 -2 2 64 -50
4767 -50 31 39 5 31 65 -23 13 63 9 18 15 95 16 5 -26 63 8 37 29 -30 0 -6 22 23 13 -35 -6 -16 -65 -12 -27 -7 20
4800 20 -14 -4 -36 -58 8 -29 -7 34 12 -22 -55 12 5 37 61 42 10 16 73 7 86 56 2 29 40 -5 -1 9 50 30 50 -10
4832 -10 16 -2 10 5 -19 -21 -17 5 -27 4 -50 -45 -13 17 -12 10 27 -1 57 28 -13 69 -24 23 76 59 34 -29 53 -9 50 36
4864 36 1 16 33 29 -20 -21 -8 21 -4 2 -13 9 33 -3 -27 -9 -16 -48 -8 -6 -29 -38 -6 38 -22 -54 23 -27 -57 -23 -6 -18 -4
4897 -4 56 -23 -40 10 -11 15 -2 34 0 -11 -26 17 -8 -39 -15 6 -42 -8 -48 -30 13 13 -18 -44 0 -38 -28 47 -3 4 11 -6
4929 -6 -64 -25 -14 -16 12 2 -19 28 17 11 -34 30 68 -5 44 33 -16 -19 -95 13 33 -31 -10 32 -18 -13 6 -30 72 8 4 -2 39
4962 39 15 30 11 21 -13 70 11 37 77 -37 23 6 -19 6 19 -39 -10 -13 0 -14 -32 -28 -16 -5 -14 -48 -18 -5 -66 -57 -72 -26
4994 -26 -27 -1 10 39 -9 -21 -18 -22 -2 17 31 -39 40 -46 18 21 25 41 -19 41 68 60 -31 44 -36 23 -1 36 56 14 -7 -38 -21
5027 -21 16 -30 -14 6 -52 16 -22 -50 -32 -39 4 -27 -63 -39 -42 1 2 22 -68 7 -26 -34 4 47 -9 20 16 -24 -10 16 72 9 29
5060 29 37 -53 16 -10 16 5 -5 31 -10 53 -22 -34 -13 -69 -33 -46 36 29 7 -30 20 25 -7 -32 3 49 7 56 2 35 8 26
5092 26 49 -10 42 32 26 6 -18 18 -19 55 30 57 -3 67 14 46 -4 18 47 -2 33 -20 -11 -25 -2 42 0 -29 18 -42 -19
5123 -19 23 21 1 1 14 -36 -33 -41 -16 51 51 37 49 53 21 4 38 21 82 -2 26 57 40 -46 59 67 -29 -37 23 56 40 2 0 44
5157 44 37 -47 -3 22 30 -14 -4 -62 -58 1 -52 11 -14 54 -2 -2 15 -39 47 -2 -21 51 -25 -34 -16 -43 11 -13 -45 -12 -72 1 -14
5190 -14 -33 -22 -36 15 16 -57 -22 -38 -61 -58 29 -11 14 -33 28 10 11 38 6 4 45 70 14 27 23 -7 -46 -2 -11 25 -31 30 -31
5223 -31 8 40 -35 -17 -46 16 8 -22 -15 21 -21 15 42 39 -40 0 -29 -17 29 -33 -23 34 1 -9 26 -11 6 49 22 25 8 14 74
5256 74 25 20 -7 46 25 11 14 -21 -28 53 12 45 -12 -18 -49 -42 -20 33 37 -51 2 -21 7 -8 18 -3 -1 13 -4 -36 37 26 20 24 4
5291 4 -26 30 20 -2 32 58 -39 40 -22 -36 55 -19 -2 50 32 -75 -26 -49 -12 -64 -25 -14 -35 -67 -8 -34 12 -19 -19 -35 -4
5322 -4 -22 -60 -3 -18 18 8 14 -40 -24 67 -35 2 25 28 -14 44 -26 -2 12 2 40 -2 -8 -17 4 47 34 40 -13 0 -44 13 -67
5355 -67 9 -5 -33 -17 52 -2 -40 2 -36 26 -27 -23 -8 41 5 75 45 28 35 23 -2 11 16 81 3 18 1 -2 -7 4 -12 -20 26
5388 26 54 -81 -22 -30 21 17 -34 16 20 -2 -14 -13 14 -18 -74 53 -6 13 1 -33 -24 -23 6 -35 4 31 -30 13 -4 -4 -49 -42 22
5421 22 15 -12 -16 37 -1 8 46 38 -28 23 -38 12 24 -1 -5 -7 -49 3 -47 12 14 22 16 -5 6 -11 -54 -10 -8 -24 -29 -2 8 13 33 11
5457 11 22 74 -15 -9 18 41 24 91 52 -69 -14 -6 -26 -5 14 7 -17 -2 23 -31 27 -1 15 -55 -37 -37 34 17 -30 -24 -56 13
5489 13 32 22 22 -10 11 -31 62 58 -32 -5 -4 -47 33 -42 -5 22 -6 -20 8 23 23 23 -36 -31 -25 29 30 3 -11 24 48 2 -29 17
5523 17 16 -20 -38 -27 26 -1 28 14 4 -42 52 22 -9 11 6 -40 -1 -33 60 -10 20 -7 -9 -7 6 -27 -31 -41 -47 -81 -35 -18 -3
5556 -3 25 -68 -18 -30 23 -1 -40 -26 7 7 -39 18 -44 -29 62 63 46 20 6 33 -37 -27 -14 -28 55 -28 -1 -22 68 -8 -5 -7 -11
5589 -11 -30 -56 -8 -3 2 -12 -33 -41 -15 -17 0 -4 37 4 34 5 19 13 6 22 -4 29 54 27 45 -27 1 -44 17 -15 -17 30 20 -50
5623 -50 33 29 31 -6 -12 -2 -38 52 1 19 1 -11 -7 -36 19 -9 33 21 1 -2 17 31 -7 -24 13 -8 24 11 -1 16 -52 -7 12
5656 12 53 -21 20 0 -26 1 -3 82 -28 -31 -4 -8 57 25 -42 4 36 -28 2 15 -1 37 -11 -44 6 3 3 -9 -62 0 26 -27
5688 -27 21 36 8 29 3 -19 38 7 -26 48 -9 56 44 22 -24 -15 -2 -48 -15 -10 11 13 -10 -7 6 -38 -6 -26 -13 -19 16 35 13
5721 13 -90 -10 33 -7 19 37 -12 16 11 -39 40 1 20 -20 19 9 45 -33 13 31 13 -26 -29 30 -17 22 46 17 -8 24 -1
5752 -1 -21 13 -3 -38 -10 -53 -41 -13 7 14 -35 6 -18 46 -4 0 17 -30 35 -27 14 54 17 -29 -17 25 3 19 -16 32 -17 1
5784 1 -40 -42 14 -37 -30 -33 -57 -20 -3 -31 -23 13 17 -15 4 -58 -12 -52 -20 -5 -2 34 5 -21 -5 -15 57 20 -6 2 18 57 7 -34
5818 -34 18 52 -29 -27 24 34 -5 19 -51 -41 -12 22 -59 11 -7 -28 -12 4 -16 -22 39 -4 -68 6 -40 -38 -9 7 -8 9 31 -45
5850 -45 39 11 23 38 19 34 -2 -40 -5 18 5 -7 -33 23 -34 -3 -45 -11 9 32 -18 5 -49 23 -3 -24 -15 -22 -25 34 20 57
5882 57 3 -30 46 -54 -20 -16 -23 -9 -5 16 32 14 1 -1 39 11 29 9 17 27 40 46 0 -47 -56 -35 -16 -5 -39 37 1 -35 -8
5915 -8 -33 -21 -31 -30 -20 20 -5 12 -41 -5 49 -5 11 -8 -49 5 -20 -12 71 -17 -6 -12 16 -28 12 -53 -3 -23 -5 -25 -14 30
5947 30 -2 26 -65 -35 12 -11 -2 -19 -1 8 -30 -13 18 -21 -20 -22 -23 -53 -12 14 24 -5 -22 12 -4 -3 65 -18 20 47 15 -36 33
5980 33 20 0 28 62 7 36 41 19 -14 6 -29 -19 -40 -41 12 -30 -5 40 -34 -24 4 30 -14 72 36 -6 -4 -35 7 -39 19 -6
6012 -6 15 -10 -3 -30 -15 56 15 -12 -11 28 12 26 30 12 56 -21 -30 0 -7 -25 -10 -48 -10 -26 -11 48 -98 53 9 -45 22 -29
6044 -29 -33 52 14 -59 -29 -27 38 -9 -22 31 -2 -29 -10 11 40 0 0 -10 2 -19 8 25 -57 -12 -6 12 24 -1 -5 -16 1 28 1
6077 1 -28 40 -45 0 30 -16 -3 -3 18 3 -11 -14 -20 19 0 3 -41 -21 15 -17 -6 16 0 27 -3 40 -6 -38 -24 -50 40 14 -54
6110 -54 50 -32 5 65 -22 -45 -22 3 -15 -39 -55 9 30 -1 -36 38 6 4 48 25 9 -9 -21 18 -24 15 -44 -14 -43 35
6140 35 24 -24 28 -9 -28 -47 9 -9 26 13 -7 -12 -18 -7 5 -18 -45 64 -22 16 18 -33 -25 -52 -33 -34 -22 -26 -45 -43 31 -23 -27 22
6174 22 66 20 14 37 -23 -16 11 62 -20 5 28 4 -20 -10 -38 -11 -8 -11 -50 -5 -7 -26 -10 -1 17 -37 -27 40 -36 -47 22 14 -5 -53
6208 -53 24 -4 -29 23 11 -29 8 -5 4 10 -23 41 21 -25 -30 -32 6 -54 -12 -8 -16 -21 -52 17 19 -16 -50 -7 -5 2 4 14 -10 5 -47 2
6244 2 -41 -55 56 21 -46 -56 -9 -44 47 -13 11 -55 11 -36 26 4 -89 27 77 -26 -47 -34 36 -21 2 -10 -25 -18 -20 -49
6274 -49 33 -28 -17 42 -29 20 -46 -20 -12 2 -64 24 -21 -21 27 16 15 -30 -20 -28 1 13 42 -7 3 3 23 25 13 -28 -1 -50 -6
6307 -6 -19 -17 -67 -21 26 -17 40 -35 -89 -6 -33 18 38 24 31 -7 25 -9 -27 -8 37 -2 23 49 9 66 -14 1 27 42 1 0
6339 0 -19 19 7 39 -41 -1 -18 -24 -42 -10 -9 3 -17 -49 18 -11 -29 -15 -27 12 3 -28 13 -52 -6 -9 -4 -22 -19 29 5 24 55 -28
6373 -28 40 -1 53 26 46 21 16 -45 15 -11 -21 6 23 -3 -23 -11 -44 -45 55 -50 -12 -43 -12 -1 -1 -24 -29 10 -29 -16 5
6404 5 -15 46 15 28 8 -15 34 15 39 9 32 -23 -2 -1 46 -30 26 11 -35 18 -31 8 23 3 29 1 58 29 9 -10 35
6435 35 -21 -37 15 -59 -23 11 2 8 -28 -92 -53 45 -36 -21 -27 -37 51 32 -7 36 -24 10 -52 -20 -45 8 -5 -31 -15 -25 -1 -20
6467 -20 2 -3 25 20 -11 -45 -20 -50 33 -12 -39 -44 -19 -30 -27 24 -14 12 14 19 -37 2 -9 -8 21 -7 20 30 28 2 -3 -9 -9 62 2 -1
6503 -1 18 40 -25 -3 -33 -18 -23 -19 -31 -17 -23 -69 31 -42 21 -51 48 -26 25 -8 -40 51 1 37 -23 -19 37 -6 -3 16 18 5 -8
6536 -8 24 35 8 16 78 -3 -4 -3 69 15 7 -26 3 -24 -59 -5 6 3 10 -8 0 -2 26 10 -17 -20 -26 -15 -28 6 -36 -12 46 4 24 9
6572 9 39 -17 68 -34 -35 49 -35 -9 38 8 -6 28 59 -12 -26 -2 -53 -18 -8 -10 50 -10 12 2 0 37 -7 -8 37 26 21 -12 -45
6605 -45 9 23 -34 -17 73 -18 15 31 11 -17 10 4 -59 28 9 -8 -42 18 55 11 -35 -7 6 5 -46 28 -22 23 -42 12 21 -3
6637 -3 -47 5 -23 -2 -9 -12 2 26 7 -15 13 17 -18 -39 16 -6 52 24 36 -7 21 -22 -7 11 6 -31 -34 -17 39 19 26 -8 10 2
6671 2 -21 -43 -16 5 0 5 -13 -4 0 -22 -38 -9 -4 -44 -4 -26 -10 14 23 31 8 1 -31 7 19 -28 33 30 -16 5 -4 25 -19 -9 14 32
6707 32 32 -19 0 -18 -11 26 12 2 -17 -15 -14 -30 -16 -10 -22 0 -1 5 37 -26 28 -28 -5 -3 18 -36 22 22 -9 0 18 -17 -13 -20 -6 -25
6743 -25 -36 6 -13 -30 -32 -36 -37 -4 -47 -51 -42 3 28 25 -29 -24 0 0 -42 -15 15 -12 -49 26 -9 -12 13 -14 -7 -40 -4 -17 26 -27 -56
6778 -56 3 1 6 2 24 -9 25 10 -31 -22 -23 -37 5 -77 5 -71 -38 -5 -25 -36 27 -5 18 24 -9 -36 -76 -32 -4 -59 20 -15 -8 -18
6812 -18 7 -15 -5 48 16 -26 6 -16 2 55 -40 -1 2 17 35 -31 -29 -26 -54 -12 -14 -3 1 20 14 -6 -5 -39 -48 11 15 9 16 -40 -15 -11
6848 -11 -18 -45 19 15 3 -7 4 31 5 53 15 -22 -6 38 24 -18 0 -40 -22 -6 -46 18 29 -25 -42 -26 0 12 -34 50 0
6879 0 -8 3 -28 -15 51 8 17 -89 5 -26 7 -56 12 5 22 -6 -23 -3 -48 62 -35 -11 4 44 17 -11 21 -20 -15 17 -67 34
6911 34 -46 12 -22 7 1 -68 -20 -58 3 -39 -36 -28 -4 -2 -11 -15 11 -8 51 -9 5 -1 -44 20 1 27 9 6 0 62 42 -28 5 8 5 -3
6947 -3 -10 -19 28 10 -63 -10 14 -12 -27 -13 -36 -6 -19 47 -19 -1 -12 -12 3 -22 56 -38 -11 -12 11 -40 -24 19 11 -5 -26 24 0
6980 0 -37 -67 -7 8 5 7 -4 -41 -14 -51 -26 -10 -66 -30 -32 -34 3 -6 4 -4 -68 6 -8 -1 2 -17 -9 61 10 7 3 26 20 5 16 -25 -6
7017 -6 27 -2 34 12 -27 -27 -44 -20 -1 -30 -1 -11 -9 -19 -32 -26 -1 17 -14 -65 -43 -3 -37 -67 0 33 13 -42 -5 32 -43 -12
7049 -12 27 55 60 39 34 18 21 -30 -48 -2 18 42 -8 -9 -18 1 -22 -48 -5 -56 -2 2 -42 8 14 -1 10 -19 4 -24 27 -6 51 -30
7083 -30 1 21 -8 -19 -4 -30 18 -14 -26 7 17 15 -24 -8 14 -31 24 -34 48 7 21 29 4 8 2 -15 -38 6 -10 -2 1 -4 1 -3 10
7118 10 25 -3 -17 -12 -23 -49 -9 48 6 6 -2 5 32 -19 9 -40 -26 8 -2 15 24 -7 -1 -13 -19 -15 16 -42 25 22 1 -26 -59 0 4
7153 4 -9 -63 -10 -14 38 -3 44 -19 23 -31 30 55 18 -15 28 2 20 12 -14 -42 39 -18 21 23 -14 40 27 5 -30 8 -3 21
7185 21 -1 -15 -31 28 -12 -62 -41 -23 -8 -24 -19 11 -62 0 -24 8 13 3 10 -28 -4 0 38 40 0 12 16 -38 31 -26 49 13 -7
7218 -7 -9 -4 -3 -21 44 -4 -36 -28 -13 -21 14 24 0 4 -31 -30 17 -49 -56 -32 -16 16 18 29 40 -6 13 -13 73 -22 -2 20 -21 44 12
7253 12 31 -38 -21 24 14 -20 12 12 -18 12 -1 13 12 33 -22 -43 -31 -35 -1 -14 -39 -23 -15 -39 7 -16 18 5 -3 -30 36 19 -35
7286 -35 21 -5 -22 18 33 18 47 1 31 -9 23 35 20 2 40 10 -19 -35 36 74 12 46 -16 -36 -10 20 56 20 -44 -46 8
7317 8 6 44 2 17 14 28 -92 35 -22 -28 -5 -1 -40 -11 65 40 30 -50 -2 -40 9 17 9 -1 13 -40 8 59 23 -9 -16 -10 -18 -23 -33
7352 -33 11 -16 -12 4 -5 -38 -6 -37 -4 26 7 108 23 16 15 -33 4 29 -8 -11 1 42 13 51 26 51 -20 46 13 -30 29 -33
7384 -33 9 -35 -10 56 -18 -40 -26 7 8 4 23 -52 -34 -45 -22 -26 -26 14 -28 -31 -4 21 19 -10 -32 13 -7 -42 -33 12 29 -33 -15 18
7418 18 8 27 -62 -22 54 -8 44 37 -15 38 -17 28 -5 22 11 -24 -39 17 -11 12 27 -15 42 26 -85 34 17 -16 -13 -43
7448 -43 19 -20 20 9 13 -22 -20 16 2 2 -3 13 -19 25 -48 -35 -80 16 -8 7 25 -26 -8 -13 -34 -12 20 -45 11 8 45 -59 -12
7481 -12 -22 16 -10 -35 -65 -5 -16 -60 -18 1 26 35 1 39 11 5 -25 -23 -36 19 22 28 72 -12 7 -10 -35 8 -4 25 2 -7 -16 -28
7515 -28 -36 1 -28 -25 -9 -4 22 -35 -26 -25 45 -20 12 6 35 -10 -4 1 -18 35 10 15 -42 -33 8 8 13 -25 -11 1 23 16 -37 -34 4 8 -10 -13
7553 -13 5 -24 4 -64 -3 27 -30 -10 -9 8 -26 -38 11 39 37 21 -23 -7 26 49 47 -50 6 -34 53 -22 0 -34 -40 4 -24 4
7585 4 -51 24 -10 10 38 21 25 7 -6 11 30 -11 12 18 30 50 -2 -25 42 -16 -21 46 -12 -5 -8 -36 18 -4 24 10 -12 -3 -33 34
7619 34 53 -17 -12 -20 25 -25 -68 17 -30 -18 -27 -53 -3 -33 -36 -7 14 -9 -2 0 6 20 -69 -32 42 -26 -16 -17 20 -7 34 14 41 25
7653 25 -19 -27 -39 23 33 -3 -17 -7 11 21 -14 -9 -52 31 -26 -61 -13 -54 -39 16 9 -17 -93 -16 11 -11 -29 11 0 2 12 -35
7685 -35 -23 7 19 -20 -8 -42 -10 4 -9 7 14 15 -43 -7 9 -13 -12 34 -27 11 5 -55 16 -26 4 -1 -14 24 -7 21 -2 -10 12
7718 12 0 10 34 -8 39 9 31 -22 35 -58 10 -6 -38 -15 2 6 -50 -13 41 31 -52 -33 -40 -58 -16 -13 -28 10 2 22 -29 -60
7750 -60 18 -15 -33 -22 33 23 -63 4 -15 -33 30 3 -19 8 10 0 -51 17 1 2 31 28 42 5 18 10 21 -1 -34 -22 0 8 -8
7783 -8 -27 25 -7 24 -17 13 -47 11 22 -9 19 -40 -36 1 -23 -9 0 47 -1 -13 -6 -58 23 62 -3 -87 -7 49 -1 5 -59 14 61
7816 61 -7 40 -22 23 -42 -23 -9 -16 -24 -6 -14 -6 -24 -9 -69 -15 3 -31 -26 0 -8 -1 32 56 21 -32 -3 49 -44 34 -52 6 1 -15
7850 -15 14 15 -29 35 -1 2 51 40 8 38 -11 -25 -6 -52 42 -11 17 34 -3 -13 -17 -35 -4 17 51 57 -10 -33 1 3 28 -5 -17
7883 -17 6 -27 48 -3 17 53 9 -12 36 -33 47 32 14 6 12 14 -23 -13 38 14 11 -12 -3 -57 -18 4 -38 0 -31 -7 -6 -14 1 -7
7917 -7 -2 6 -20 2 -9 -5 16 -7 -37 15 0 -10 29 -25 53 -38 -16 6 -16 -33 16 -2 -3 3 1 19 2 -7 15 -2 -11 -4 -27 -8 -32
7952 -32 -25 -55 -4 12 -19 -26 -26 -50 30 -42 -42 10 -18 6 9 26 53 10 68 -33 31 9 -44 -10 50 -21 32 -13 -14 19 -15 12 -53
7985 -53 -36 -65 -38 6 -3 -51 -20 -13 48 -4 -5 27 -17 4 6 -15 -8 49 8 22 -19 4 23 -22 21 53 1 2 -28 23 20 -59 -35 12
8019 12 -31 46 23 -28 60 12 -21 -35 -24 -24 47 -57 25 29 7 17 3 -16 5 -17 -8 -16 31 -65 31 44 -41 -2 -9 -42 36 4
8051 4 51 34 -62 -57 -25 7 -33 16 68 -41 -31 10 -8 1 2 21 13 -5 -50 30 -6 -31 9 33 -20 5 19 10 -10 -59 1 -28 -47
8084 -47 -25 -50 -10 35 3 1 42 39 -48 32 -39 14 21 30 -22 17 36 3 26 0 4 -21 -15 -8 -6 -14 0 -18 -40 13 -16 -16 -31 26 -3
8119 -3 -5 5 -2 -39 -6 1 -16 7 -4 32 39 46 8 -13 -20 -4 -43 14 19 -30 -10 -15 -13 -24 -8 -10 -29 -14 14 -48 -38 35 -39 -27 -15 -18
8155 -18 -12 -19 24 -47 -5 -7 18 9 4 6 21 -58 15 48 13 -20 -53 -17 40 -8 -46 -15 -1 5 -14 -4 -14 22 -1 -2 -25 3 -6 -42 6
8190FK7
8191C3
##END NTUPLES=NMR FID
##END=
