##TITLE=1H_K-406/2
 CDCl3
 8 sc, 
 29.07.2022
##JCAMPDX= 6.0         $$ Bruker NMR JCAMP-DX V2.0
##DATA TYPE= NMR FID
##DATA CLASS= NTUPLES
##ORIGIN= UXNMR, Bruker Analytische Messtechnik GmbH
##OWNER= root
$$ XWIN-NMR		Version 3.5
$$ Fri Jul 29 16:10:33 2022 Russian Standard Time (UT+4h)  she@DPX200
##.OBSERVE FREQUENCY= 200.1313499994
##.OBSERVE NUCLEUS= ^1H
##.DELAY= (6, 6)
##.ACQUISITION MODE= SIMULTANEOUS
##.ACQUISITION SCHEME= undefined
##.AVERAGES= 8
##.DIGITISER RES= 18
##SPECTROMETER/DATA SYSTEM= spect
##.PULSE SEQUENCE= zg30
##.SOLVENT NAME= CDCl3
##.SHIFT REFERENCE= (INTERNAL, CDCl3, 0, 15.7039)
##AUDIT TRAIL= $$ (NUMBER, WHEN, WHO, WHERE, WHAT)
$$ ##TITLE= Audit trail, XWIN-NMR		Version 3.5
$$ ##JCAMPDX= 5.01
$$ ##ORIGIN= Bruker BioSpin GmbH
$$ ##OWNER= she
$$ F:/spectra/data/she/nmr/H-F/1/audita.txt
$$ ##AUDIT TRAIL=  $$ (NUMBER, WHEN, WHO, WHERE, WHAT)
(   1,<2022-07-29 16:09:16.06 +0400>,<she>,<DPX200>,
      <created by zg, POWCHK disabled, PULCHK disabled
       configuration hash MD5:
       00 E9 B6 7A A2 85 ED C7 34 08 36 98 17 FE 4E 26
       data hash MD5: 16K
       8B 46 DC 9F C0 BE 49 A4 9C 3F 77 86 50 6B C2 A6>)
$$ ##END=
$$ 
$$ hash MD5
$$ 9E B1 F9 66 E8 58 01 48 24 CF F9 B1 B4 74 1C 54
##$RELAX= 
##$RELAX= 
##$RELAX= 
##$RELAX= 
##$RELAX= 
##$RELAX= 
$$ Bruker specific parameters
$$ --------------------------
##$DU= <F:/spectra>
##$EXPNO= 1
##$NAME= <H-F>
##$PROCNO= 1
##$TYPE= <nmr>
##$USER= <she>
##$AMP= (0..31)
100 100 100 100 100 100 100 100 100 100 100 100 100 100 100 100 100 100 
100 100 100 100 100 100 100 100 100 100 100 100 100 100 
##$AQSEQ= 0
##$AQ_mod= 1
##$AUNM= <au_zg>
##$AUTOPOS= <>
##$BF1= 200.13
##$BF2= 200.13
##$BF3= 200.13
##$BF4= 200.13
##$BF5= 200.13
##$BF6= 200.13
##$BF7= 200.13
##$BF8= 200.13
##$BYTORDA= 1
##$CFDGTYP= 0
##$CFRGTYP= 5
##$CHEMSTR= <none>
##$CNST= (0..31)
1 1 145 1 1 1 1 1 1 1 1 1 1 1 1 1 1 1 1 1 1 1 1 1 1 1 1 1 1 1 1 1 
##$CPDPRG= <>
##$CPDPRG1= <>
##$CPDPRG2= <>
##$CPDPRG3= <>
##$CPDPRG4= <mlev>
##$CPDPRG5= <mlev>
##$CPDPRG6= <mlev>
##$CPDPRG7= <mlev>
##$CPDPRG8= <mlev>
##$CPDPRGB= <>
##$CPDPRGT= <>
##$D= (0..31)
0 1.2 0 0 0 0 0 0 0 0.06 0 0.03 0 0 0 0 0.0002 0 0 0 0 0 0 0 0 0 0 0 0 
0 0 0 
##$DATE= 1659096555
##$DBL= (0..7)
120 120 120 120 120 120 120 120 
##$DBP= (0..7)
150 150 150 150 150 150 150 150 
##$DBP07= 0
##$DBPNAM0= <>
##$DBPNAM1= <>
##$DBPNAM2= <>
##$DBPNAM3= <>
##$DBPNAM4= <>
##$DBPNAM5= <>
##$DBPNAM6= <>
##$DBPNAM7= <>
##$DBPOAL= (0..7)
0.5 0.5 0.5 0.5 0.5 0.5 0.5 0.5 
##$DBPOFFS= (0..7)
0 0 0 0 0 0 0 0 
##$DE= 6
##$DECBNUC= <off>
##$DECIM= 32
##$DECNUC= <off>
##$DECSTAT= 4
##$DIGMOD= 1
##$DIGTYP= 9
##$DL= (0..7)
0 120 120 120 120 120 120 120 
##$DP= (0..7)
150 150 150 150 150 150 150 150 
##$DP07= 0
##$DPNAME0= <>
##$DPNAME1= <>
##$DPNAME2= <>
##$DPNAME3= <>
##$DPNAME4= <>
##$DPNAME5= <>
##$DPNAME6= <>
##$DPNAME7= <>
##$DPOAL= (0..7)
0.5 0.5 0.5 0.5 0.5 0.5 0.5 0.5 
##$DPOFFS= (0..7)
0 0 0 0 0 0 0 0 
##$DQDMODE= 0
##$DR= 18
##$DS= 0
##$DSLIST= <SSSSSSSSSSSSSSS>
$$ [...]
##$SUBNAM2= <"">
##$SUBNAM3= <"">
##$SUBNAM4= <"">
##$SUBNAM5= <"">
##$SUBNAM6= <"">
##$SUBNAM7= <"">
##$SUBNAM8= <"">
##$SUBNAM9= <"">
##$SW= 18.0517283424941
##$SWIBOX= (0..15)
0 0 2 0 0 0 0 0 0 0 0 0 0 0 0 0 
##$SW_h= 3612.71676300578
##$TD= 16384
##$TD0= 1
##$TE= 0
##$TE2= 300
##$TE3= 300
##$TEG= 300
##$TL= (0..7)
0 120 120 120 120 120 120 120 
##$TP= (0..7)
150 150 150 150 150 150 150 150 
##$TP07= 0
##$TPNAME0= <>
##$TPNAME1= <>
##$TPNAME2= <>
##$TPNAME3= <>
##$TPNAME4= <>
##$TPNAME5= <>
##$TPNAME6= <>
##$TPNAME7= <>
##$TPOAL= (0..7)
0.5 0.5 0.5 0.5 0.5 0.5 0.5 0.5 
##$TPOFFS= (0..7)
0 0 0 0 0 0 0 0 
##$TUNHIN= 0
##$TUNHOUT= 0
##$TUNXOUT= 0
##$USERA1= <user>
##$USERA2= <user>
##$USERA3= <user>
##$USERA4= <user>
##$USERA5= <user>
##$V9= 5
##$VALIST= <valist>
##$VCLIST= <CCCCCCCCCCCCCCC>
##$VD= 0
##$VDLIST= <DDDDDDDDDDDDDDD>
##$VPLIST= <PPPPPPPPPPPPPPP>
##$VTLIST= <TTTTTTTTTTTTTTT>
##$WBST= 1024
##$WBSW= 4
##$XGAIN= (0..3)
0 0 0 0 
##$XL= 0
##$YL= 0
##$YMAX_a= 277634
##$YMIN_a= -122865
##$ZGOPTNS= <>
##$ZL1= 120
##$ZL2= 120
##$ZL3= 120
##$ZL4= 120
##$ABSF1= 10
##$ABSF2= 0
##$ABSG= 5
##$ABSL= 3
##$ALPHA= 0
##$AQORDER= 0
##$ASSFAC= 0
##$ASSFACI= 0
##$ASSFACX= 0
##$ASSWID= 0
##$AUNMP= <proc_1d>
##$AZFE= 0.1
##$AZFW= 0.1
##$BCFW= 1
##$BC_mod= 2
##$BYTORDP= 1
##$COROFFS= 0
##$CY= 11.3945322036743
##$DATMOD= 1
##$DC= 2
##$DFILT= <>
##$DTYPP= 0
##$F1P= 2.36226072786647
##$F2P= -0.459571619588291
##$FCOR= 0.5
##$FTSIZE= 0
##$FT_mod= 4
##$GAMMA= 1
##$GB= 0.15
##$INTBC= 1
##$INTSCL= 1
##$ISEN= 128
##$LB= 0.24
##$LEV0= 0
##$LPBIN= 0
##$MAXI= 10000
##$MC2= 0
##$MEAN= 0
##$ME_mod= 0
##$MI= 1.114404
##$NCOEF= 0
##$NC_proc= 0
##$NLEV= 6
##$NOISF1= 3.799351
##$NOISF2= 2.8
##$NSP= 1
##$NTH_PI= 0
##$NZP= 0
##$OFFSET= 15.70392
##$PC= 1
##$PHC0= -18040.99
##$PHC1= 13.20068
##$PH_mod= 1
##$PKNL= yes
##$PPARMOD= 0
##$PSCAL= 0
##$PSIGN= 0
##$REVERSE= no
##$SF= 200.130013532006
##$SI= 16384
##$SIGF1= 3
##$SIGF2= 2
##$SINO= 400
##$SIOLD= 16384
##$SREGLST= <1H.CDCl3>
##$SSB= 0
##$STSI= 0
##$STSR= 0
##$SW_p= 3612.71676300578
##$SYMM= 0
##$S_DEV= 0
##$TDeff= 0
##$TDoff= 0
##$TI= <>
##$TILT= no
##$TM1= 0
##$TM2= 0
##$TOPLEV= 0
##$USERP1= <user>
##$USERP2= <user>
##$USERP3= <user>
##$USERP4= <user>
##$USERP5= <user>
##$WDW= 1
##$XDIM= 8192
##$YMAX_p= 0
##$YMIN_p= 0
$$ End of Bruker specific parameters
$$ ---------------------------------
##NTUPLES= NMR FID
##VAR_NAME=  TIME,          FID/REAL,        FID/IMAG
##SYMBOL=    X,             R,               I
##VAR_TYPE=  INDEPENDENT,   DEPENDENT,       DEPENDENT
##VAR_FORM=  AFFN,          ASDF,            ASDF
##VAR_DIM=   8192,          8192,            8192
##UNITS=     SECONDS,       ARBITRARY UNITS, ARBITRARY UNITS
##FACTOR=    0.0002768,     1,               1
##FIRST=     0,             0,               0
##LAST=      2.2672688,     0,               0
##MIN=       0,             -122865,         0
##MAX=       2.2672688,     277634,          0
$$ Real data points
##PAGE= N=1
##DATA TABLE= (X++(R..R)), XYDATA
$$ [...]
1835c71N23l55J30q7O0L9l1J27L79m57K82q1k29M03l59O05j80n42J48N44n98K78
1857B28j57k15J77l64M6K09n07O09j26m40L13j09L66K15n17L67M2j00L16m97M09
1878B65P8l66L69J28m93K27p9k74M06k30Kk26j67N78n97K22J98k95J38K1m52P03
1900A56n75P6M58m03L06n4j54M90R5m06L59l69K15j67k9K3L21m39L83k00k3J69
1922B32k77L79n70o8K8j94R7K00l22K29L55n94M06k1J67K33m76P23m31k69L01
1943A28k55K77J83qP2j40j53N17q55K04K41n49j37M77l79RJ1NL47m47L61J85l01
1966b07M76k14m26P02m24m14O85J19l93k59N53M03p18K60M26n82l1M37l48K7K48
1987C20k35j00m02N28j94k03O34l03m32M99l31R3K80l40L43k51j44N49l92J16
$$ y = [-371, 152, -203, -73, -160, -100, -61, -92, 35, 414, -43, 239, 158, -71, 332, -27, 578, 398, -144, 4, 548, -50, 228, 71, -144, 33, -331, -285, -76, -583, 26, -100, -540, -227, -336, 30, 245, -272, 95, 137, 37, 353, -144, 265, 343, -23, 346, 474, -19, 208, 129, -145, 261, 31, 33, -193, -360, 218, -379, -157, 41, -254, -116, -95, -547, 156, -419, -343, 115, -288, 18, -36, -190, 300, 395, -11, 348, -21, 194, 27, -2, 21, 342, -97, 286, 86, 63, 232, -45, 334, -236, -304, -276, -470, -373, -173, -495, -266, 89, -505, -99, -120, 47, 280, -196, 527, 96, -173, 128, -127, 150, 333, 325, 397, 257, 104, 621, -234, -30, 211, -338, -475, 2, -377, -368, -357, -352, -5, -452, -91, 94, -207, 269, 55, -371, 331, -93, -507, 178, 297, -96, -355, 198, 601, -117, 143, 569, -13, -44, 393, 45, 72, 320, 85, -15, -417, 111, -83, -286, 348, 45, -387, 112, -219, -126, 154, -186, 157, -94, -238, 311, -81, 35]
2007C5K90k47J79l7L6m6m41J27N87p39M43r8m03K30P3n44K20K14M00m58k4L42
2029A39m65j71O95n02K76L30j30N4o18N75K54q44N86M78o04K46p4l85L45L0J16
2050C31l71j70M19o62j58N73J54l86N04k38m42J01J06M70m63J13M48o56L11K74
2070B58m71J73M46k02L2j9N4j61o62Q84p9m94N78k34n49K20k85K64j59O69J26
2091C89q20n4O35p48J29N07Q9J69k35k0j38l9N25J17n61P07l03m17K15n3P8Ok96
2114a18O31n91K0K20n16n4N91l64J96k34K71k7p13P14N5m84N83M02p66J32Q0K53
2136B81l81J30O44o36N8N23n81l16O35k50j34L57k39k47k73M75j77m24M32L34
2156B11n89K55j30Rj14K21K32Rl35P46n69l00Q61m15J89j36J23N9l82J90K64n78
$$ y = [35, 325, 78, 257, 220, 256, 210, -231, -104, 483, -256, 187, 89, -314, -84, -11, -555, -335, -121, 279, -179, -203, 139, -326, -497, 198, -304, -28, 302, 172, 226, -392, 183, 437, -407, 179, 657, 53, 299, 225, -160, 185, 215, 331, -40, -210, 209, -453, -611, -38, 116, -270, 234, -4, -446, -345, -239, 231, -232, -119, 329, -327, -16, 258, -213, -40, 406, 204, 236, 217, 271, 110, -552, 332, 253, -241, 337, 103, -446, -226, -511, -247, -406, 263, 389, -431, -485, 150, -598, -469, 38, 127, 296, 61, 41, -97, -136, 389, 506, -55, 652, 349, -68, 147, 94, 172, 178, -118, 513, -78, -58, 162, -354, -408, 183, -181, 15, -219, 52, 25, -688, 26, 81, -403, 180, 582, -184, -52, 28, 281, -100, 30, 674, 38, 96, 619, 38, -278, 357, 107, -27, 330, 91, -156, -429, 46, -131, -555, -123, 211, -378, -123, -253, -244, -358, -137, 95, 104, -231, 515, -54, -354, 507, 92, 281, 145, 268, 327, -55, 135, 399, -179]
2178a79N07L4l53J2R6l48k3J55K92j94j87K00M5n86O24j15l07L50j05J07J23j68
2200b0L37l75J43L93m15K25q2l07J17M38q6k52j56q5K68m60K88q9k74J51N9Q1
2222a01R1j35K09k05l9K92k30K34K14m02J54Nj17L77k05J37j55j24J6P3o03R89
2244D75k96n14N78n25L16j23j42L31l61j85K07J33J34p2j56K57l18J70K75l54
2264a70K05L0j13L24m1k01M60l73n9O3n7J89P8n03L53r3m03N38l89M7L5k41L09
2287a2Oj14Q0k61N17k19P9K00k23o7N5L05l10J60l07L35kk51L12k03k77K94j89
2310i2J73l26O5Q1j88J35L0J32k5o1m00M62j66p5K91l32L29J08k52L99J44q12
2332c80O42k14j26K31k54M58k16l10K82k19K7k4j59K56n2nl6K2j16K53l41K28
$$ y = [-179, 328, 362, 9, 21, 117, -231, -254, -99, 193, -1, -188, 12, 57, -529, 95, -20, -327, 23, -82, 25, 148, -20, 317, -58, 85, 478, 63, 288, 206, -101, 16, 454, 368, 116, -40, -125, 143, -317, -29, -118, -392, -241, -182, -101, -10, -145, 64, -141, -180, 112, -118, 116, 330, -72, 82, 87, -30, 347, 142, 279, 124, 0, 16, 89, -514, 475, 179, -335, 243, -282, 34, -89, -231, 100, -261, -446, -239, -106, 28, -44, -200, 57, -261, -91, 184, -170, 35, 65, -48, 276, 235, 34, 494, 121, 62, 125, 68, 257, 335, -168, 185, 92, -311, 227, -162, -115, -80, -321, -12, -6, -120, -40, -301, 216, -3, 76, 276, 53, -14, 41, 346, 36, 196, -111, 224, 222, -29, 283, 80, -197, 97, -92, 81, -245, -180, -99, -287, -152, -122, 10, -15, -76, -476, -14, -180, -255, 36, -296, 33, 141, -111, 288, 432, -380, 262, 48, -78, 153, -101, 357, 141, -169, 113, -106, -79, -103, -262, -6, -58, -63, -99, -77, -193, 60, -281, -53]
2354e3j14j81M47m52J73K67q4j24J85k51N14k53p5N70k78l11J36j1N4R9m92K89
2376E5k08L3K0K6L8j0k38K48k6O3j3r5K45l34K8L21k76K20J35j95J88M4j23K12
2400C58j96l9j07j37J30o8L5L1k75K51M4n69M10n0k09N43m04J59M06j74j26P0
2422H3m93M13J69q5K35m18J10K91l25K51R5m59L63l99K73R0l08J98o3j92K78j90
2444h3P1L87o22J55j68K18j01k48L41Q6k36l1M10k95Q6L15k74L16o01N79Q4k80
2466A09J60j1l08K29k15Q9K3k50J83M6j22j4j54o3O32m62k05L42k78L56j68J42
2488F1m9k0M43l72n1L6J96n65Q02l48L8j9k00J77k05l5J4k73N31k91L3j01o1K76
2512A7j54N0J55J67m85K95r4o3J03m5J24J22j48J53k73o8M55j53l43N92n79K94
$$ y = [-53, -167, -348, 99, -353, -180, 87, 3, -121, 64, -187, 327, 74, -1, 569, 291, -20, 116, 105, 159, 258, -234, 55, -153, -120, -100, -74, -36, -46, -284, -36, -62, 1, -12, -107, 138, -196, -168, 153, -123, 97, 232, 37, 225, 269, 146, 358, 162, 123, 16, -121, 9, -59, -24, 7, -268, -17, 27, -542, -132, -182, -391, 152, -252, -93, 313, 139, 13, 83, -410, 3, 172, 87, 322, -96, 14, 305, -20, 231, 326, -133, 230, -169, 104, 194, -114, 84, 21, -171, 107, -83, -12, 375, -247, -92, -260, -42, -143, -391, -50, 36, -200, -231, 179, -116, -30, 285, 11, 327, -274, 305, 389, 109, 269, 258, -50, 179, -36, 53, 76, -174, 9, 55, -67, -81, -235, -298, 334, -128, -333, 9, -269, 87, -81, 61, 12, -8, 435, 63, 12, 48, 244, -321, 481, 133, 171, 152, -48, 129, -76, -111, -97, -370, 161, -130, -97, -198, -259, 17, -137, -87, 68, 235, -250, 45, -49, -112, -9, -54, 70, 192, 44, 197, -76, -144, 311, 158, -185, 407, -172, 122]
2534A22P6m17M95k06J79m3n43j9N98o17K74J93j60j53K07j41P9k88L93K45j96
2555G8K4r8r5M32m25R2q5RK38j8p7J6l72N09q7k42k48L50K33n13K9L25l3k51O09
2580D00k2p43M41l99L42L32k12N1k42K38R4l04L7K0P4j23N1r1J74k05m5N3j27
2603b06K12p2k07J60J6j39j5K85K35l41j00K55r0o07R03m33K33M25l08j55j67
2624a16L11j72k02J77L23j39K1j29n14L96K49k83K09n22M40l69L41L5k11kM28
2645B71l01l10N37n25O06l31J78J54m93L37J8j20K02j63p9K77k28P0k37Q4J44
2666I1l2k66N16o10O6J58mk7lO9J16n13N58o1j35m9L02j57J64j76K40m9m72L49
2690G5q7K2M7J44l04j05L84o9k14P7J24k92K26j53k99M26o7q2j03K25m1N5pkJ12
$$ y = [122, 198, -219, 276, 70, 249, 206, -337, -356, 242, -375, -101, 92, -68, -221, -14, -155, -76, -364, 29, 274, 78, 102, 4, -91, 341, -84, 8, -77, -68, 170, 152, 75, 91, -281, 228, 141, -101, -349, 1, 234, -279, -250, 75, 42, -209, 400, 378, -365, 76, -323, 19, 351, 139, 190, -52, 186, 280, -24, 13, 33, 107, -16, 35, -56, 118, -87, -132, -79, -206, 6, -66, -273, -113, -97, -236, -251, 34, 269, -72, -172, 83, -7, -614, 289, -144, 89, 514, 206, 51, -116, 195, 23, -179, -2, 321, 182, 203, 74, -440, -44, 205, -78, 131, -391, 49, -320, 21, 56, -155, -157, 271, -30, -340, 197, -328, 278, -53, 125, 279, -214, 123, 141, 21, 223, 60, -19, 258, 30, 100, -137, -53, 91, 59, -207, 309, -301, -235, -77, -81, -108, -111, -42, 74, -439, 119, 58, -77, -126, 176, 19, 183, 7, 247, 198, -274, 75, -12, 10, 57, 201, -103, -208, 176, 107, -107, -30, 94, -198, 28, -125, -424, 2, -65, -147, -250, -25, -66, -11, -18, -20, 92]
2715I2N6q6J29k33L03j99L1J40k56L40k82ml7j4l27M31k12O1p3j73J60K9K96l25
2739a53l07Q01m37M3J98l58N2K28k4K2K09j47O1m39L28P5j75j1J91r7K7Q2m12
2762b43K53l35J94R9j7N0j77p5L81l78p5L26o0K8L9l04K89J05k10K77j64j59M60
2785C04k8J5m16j51M2K33O6j8m1%k33K62p3l93N38q2j61P3r7J30l8j49J23P2J5
2810gj43L6m7K10l5J86k4n9K60n1l68K66o5j40j88P8J22N5j32K18k45J9j12K8
2834a38Q7K24l77K15p6nJ50k80N5L13k63K19K13k20J42m86M09J9m67L86l8mJ33
2857B11k08q7r3j27K56R3q3K09m13M01l19J12P1N5J27k25J74r1l5o7K09K2j10
2880H2L6Q9k47p7R5L12m7l75J64n3n8M71m13J12k29j25M59j81k18m4K58j55K71
$$ y = [92, 148, 62, 191, -42, 261, 62, 93, 233, -23, 317, 35, 31, -6, -20, -347, 84, -128, -67, -140, -313, -153, -124, 172, -153, -460, 341, -96, -53, 145, -213, -161, 67, 43, 65, 274, 127, 188, -251, 77, 152, -23, -34, 157, 60, 87, 169, -243, 10, -325, -131, -32, -49, 1, -176, -251, 130, -248, -323, 3, -57, -29, 10, -294, -5, 100, -110, 167, 3, -156, 304, 276, 291, -125, -276, -234, -1, 65, 47, 6, 6, -227, 35, -38, -431, 107, 25, -136, -63, -160, -30, -68, -217, -94, -22, -7, -150, -114, -161, 49, 14, 200, 176, 117, 377, 326, -42, 224, 159, 19, -169, -91, 31, 86, -46, 172, -73, -54, -166, -138, -51, 173, -204, 11, -65, -70, 80, -200, -145, 168, -95, 124, 337, 117, 259, -227, 182, 201, -266, 120, 82, 78, 211, 3, -84, -177, -304, -48, 45, -38, 171, -242, 159, -160, -48, 23, 78, 205, -20, 154, 63, 28, -39, 170, 192, 82, 118, 207, -40, -117, -22, 290, 243, -132, 32, -21, -79, 392, -21, 91, -138, -263, 196, 15, -203, -247, 11, -144, 127]
2903A27j70J3l4j44J92O3j58K23k2K40j28l83M73j34j78K93J01o18N31l21k4J29
2925G1J88l07r6J13P5j88J85O2J7k87J32K47k98j5R0OK08p6M5j01j65K9J13j84
2949a36Q8j4Lm9R0nj19K84k58J71j20j9k02%l7Q6q0M28P8m07M74m72K71K8j24
2974d1K23j08l22L99j86J54J71K07m14j55K98p6K7j78J98m82N38j7m04J22J34
2995H8N0j34r8J51j69j79M06M9k10K17m78L61P1j10m6J18mM7q2j9K8l03J37K54
3019A45r3L3p0k7M4j79r0O5J05j43J93l00J14J83k95J15L94m40K80J73j31q8K6
3042A4L68m52L61j90k00K12l00M04K4m05K17q0j91K43m9k31m1L80j50O1R6N9k74
3065a24K53j2k88J99n4J43J29k13K01k9j74k0N6k77L41j72J24j88J45j04j54K20
$$ y = [127, -43, -30, -64, -208, -16, 47, -111, 112, 90, 330, 202, -181, 292, 158, -20, 273, 374, -244, 287, -34, -58, 71, 259, -48, -144, -31, 44, -144, 41, 103, 120, -167, -35, 212, -86, -101, -11, -5, 203, 127, 172, 71, -94, -65, 48, -136, -48, -62, -59, -108, -18, -23, -142, 142, -116, 55, -65, -84, -286, -286, -323, -237, -317, 111, 189, -218, 256, -216, 55, 83, -41, 182, 74, -248, 151, -35, 119, 290, 497, 83, -72, 226, 150, 177, -1, 197, -285, 253, 236, -168, -46, 88, 138, 4, -94, 57, -112, -291, 115, 164, -46, 171, -307, 54, 125, 15, -31, 87, 83, 130, 48, 29, 57, -246, -109, 145, 52, 85, 15, -12, 32, -147, -237, -172, -67, -210, -17, -317, -203, -20, -315, -200, 194, -246, 34, 207, 76, -12, 14, 382, -70, 291, 101, -99, 113, -187, 217, 241, -164, 53, -27, -218, 25, -24, -255, -296, 84, -66, -5, 91, 150, -124, 129, 117, -171, 28, -26, 117, 246, 33, 234, 205, 31, 11, 67, -210, 131, -41, 83, -105, 40, -64, -218, 2]
3087BJ30k46j18J53l18M18J92j93l57j8M99l4l87L78M0J9k48L82m48K78K02m47
3109a21J37J5K34k88j38K53j50q4L41j19r0O3k62l72M08P0K74j69m8r0r2K00N5
3132B7K25k03m8J43qk40K06j41K9L19N9l33j75L02k4k50j52L51j49J59j72j90
3154b65K58q9K6j10K07O8k06o0L9K26m68N87q9j35K20m29M16k5j22K4q8k82L01
3177Dp1lJ54j77Q2r8J09J28k20q0N2K3L01k93j61M52m45j0J18J7P8L19k75j7P3
3202F0k59K67l64L25k64J00p1k4J10J00K24m55L89j92K28o5o6n5J2N5n8l74K62
3225a15K17k49J42K58k06L73l94M7r0K0L38n79L39k54J78J21K5p4L3J14j56j53
3247f5J05k62K80j90N4n4N4J66k81J59J43m12J38K16O7k68L44j64J95o31M56J35
$$ y = [2, 132, -114, -232, -79, -397, 21, 213, 20, -337, -355, 144, 110, -277, 101, 141, 160, -88, 294, -154, 124, 326, -121, 16, 31, 265, -23, -161, 92, -58, -142, 199, 80, -10, 53, -209, -581, -173, -103, 171, 2, -46, -136, -228, -28, 27, 252, 49, 1, 144, 136, -104, 102, -39, -10, 309, 368, 35, -140, 162, 138, -112, -264, 87, -62, 97, -75, -265, -7, -96, -70, -180, 27, 95, -111, -171, -132, 94, -374, 213, 124, -11, 209, -220, 196, 171, 49, 73, -15, -297, 4, -67, -70, 84, -93, -11, -109, 0, 128, -92, -172, -120, -97, 204, -89, -250, 202, -243, -253, -135, -118, -40, 279, 4, -13, 60, -199, 68, -296, 29, -235, -135, -206, -230, -120, -20, 204, -251, 138, -54, 174, 109, 43, -12, 0, 55, -3, -377, -115, 102, -147, -5, 253, 47, 420, 26, 73, -17, 3, 341, -238, 101, -153, 25, 146, 171, 97, 130, 244, 88, -65, 40, -222, 58, -132, -78, -132, -78, 88, -193, -34, 109, -303, -165, 51, 118, -150, 194, 30, 225, -406, 50, 185]
3269A85l08L28j15K4J57l10M5j86J07K39P7l00j50M1M15k60j75J28p2J33O0j4
3291D9l04K06L7K56k69K3R0J88j32j9j12j06J5K22j17j27Q8J34O3O8j56k23K26
3314A00N1j00J22r3j25l1r7Q0K27j36j7K07K24l81p2LJ64j50M21j61j36k31J19
3337a2L72l87N8k1j23J46r1p5Q8J33l06K85j01l8J96j54J65j64Q0n9n8K17J0k42
3361h1l1K8J08j09J64pK1r8P3J29k91J06j25O6J91P7l10K28l49L63Ol43J15k71
3385c40M33kj73m8J29N6O1j3j37O2l22M25j75L0m0Q8n3J42j78J38k43j0K58j10
3409b2M6ll7j55K20j15J6k0K34j69J13j14k8K19k15j26J14K4j4O5j71J93K7j58
3433g6J65L28k76j78K9J73k64r2R0J22j69K2Q5M8j91l6L46j05j7j73J01j6L6q2
$$ y = [185, -123, 205, 90, 114, 271, -39, 6, -180, -73, 166, 243, -57, -207, -166, 249, -11, -186, -58, -130, 3, 63, 49, -255, -49, -12, 244, -25, -2, 88, 276, 144, 125, 13, -93, -78, 144, 27, -100, -12, 122, 185, 253, 97, -126, 100, 151, 51, 173, 80, -45, -76, -173, -93, 134, -2, -19, 188, 412, 31, -41, -38, 126, -24, 397, 236, 100, -131, -12, 360, -27, 31, 10, -113, 33, -58, -133, -45, 88, -218, 67, -34, -72, 124, -30, 135, -29, 51, -8, -66, 151, 161, -81, -112, -84, 24, -85, 79, 72, 93, -5, 68, 197, -94, 12, -113, -47, 144, 221, -89, 139, -210, 153, 159, -184, -69, -340, 93, 91, -82, -130, -1, 55, 116, 103, -34, 28, -294, 131, -44, -14, -54, 34, -19, 123, -55, 83, -160, -170, 88, -22, 24, 21, -16, -171, 49, -66, -50, -70, 164, -5, 108, -6, -34, 185, -30, -156, -42, -18, -32, 33, -138, 55, 82, -76, 89, 417, 141, -37, -8, 165, -99, -191, -101, 21, -148, -126, -41, 7, -184, -220, 126, 21, 4, -169, -68, -84, -48, -130]
3457a30K38j30J94j39j33K27m0J03m42L15l9K13r3r0j21j7J87M0j98l22L13J51
3479H7j64j10J42k1L66j96k0k6j26Q6j15K16O0m15K08P7Qj83J02M4K1J25J99m45
3503h0Lr0j75L80J00j00j55L61m01N7J77k71Lj19J82J47J80o7J9r5j49J18O3J82
3527B70l21J11J21k67R3J56l38K79n8Rk23p7M17k52J46l1L7r0kO7N3l46L70j59
3551c5p4L22r3n0j11K31R9k35qj20R2R9j75N2l9J5j73L53k54J18k60k9K97Q5k77
3576a70K99k13LQ0k73J89j09L13j68K32k46Kk05K17N0Jk61L95k52j1L11k63Q6
3599Gk33L23j00j44J33j58J49K57k07K0m7lQ6Mj45K73j09K0j82O0qQ1O6p2K8n5
3625D4J32k46K85k55j83K3L69j97N7o8o9N3J1J08r5J3o2Nr5N48m96J59J00K9k42
$$ y = [-130, 108, -22, 172, 33, -100, 127, 87, 190, -252, 63, 24, 237, 144, 54, -67, -84, 103, 143, -55, -377, -64, 87, -77, -187, -45, -66, 300, 104, 84, 58, -68, 18, -97, 119, 179, -236, -28, 49, 57, -126, -24, 20, 41, 166, 365, -80, -77, -167, -342, 38, 138, 38, -117, 244, -157, -100, 77, -194, -191, -310, -128, 19, 199, 132, 151, 56, -93, 25, 88, 270, -51, 60, 181, -86, 7, 163, -175, 104, 46, 55, -168, -245, 172, -80, 66, 35, 72, -18, -20, 47, 100, -246, 124, -35, -109, 213, 120, 70, -41, 190, 289, 54, 46, -74, 18, 117, -58, -6, -45, -30, -203, 150, -104, 14, -246, -275, 22, 107, -170, 129, -84, -81, -1, -274, -85, -194, 119, -49, 183, -63, -61, -266, -49, 1, 2, -259, 136, -116, -127, 184, -79, 7, -226, 97, -3, -147, -14, -172, -23, 234, 27, 47, 0, -3, 83, 87, -58, 215, 106, 126, -56, 4, -4, 77, 143, 71, 99, 44, 176, -70, 215, -40, -223, -200, 169, -28, 29, -39, -108, -55, -44, 64, -31, -18, -80, -75, -170, 378, -118, 41, 141, 170, -72]
3650g2J9J21o1n5J2K24M2n5j1k2j15L0j95K51k09K16k52K05j51K38m51K96j53
3673a48J20p6J08j26r6J20m0J39K40m18K82l41K92O2j16QP8J01k50J22k95M43
3695B09j76l3j10o9K5J24J79l15J2j61N4k8L61j70p3K73j6r9k9K38m10L64J44
3718B94j95k20K74L1j07J91l40L0J44o7k80J4J29J05L41m48m3K27l2j4P6l08L99
3741B01m4j98K43k37J71J88k89j7k46L2J73J0%O9o0p7Q1l4O8K73n03K10j87Q1
3765i2K38j39j16rP1J85j59j0r2N3K73m77M09P7m2ln1n3p3J0J75l3l43K70j38
3790f9j4L36j60l40L96k70p4J14L30k65j24K93k13O1m36M65r8N5j58J47J84k37
3812g7j0k0J72J7j75N9qJ46j51J47j13J27l28J28P1L1j3j61R4J55k71J96L3j23
$$ y = [-72, -53, 68, 7, -48, -36, 188, 230, 175, 164, 142, 27, 57, -138, 113, -96, 120, -132, 73, -78, 160, -291, 5, -148, -28, -104, 4, -122, -218, -98, -138, 1, 241, -177, 105, -236, 56, 118, 2, 10, 88, 189, -61, 61, -234, 209, 33, 0, -110, -179, -154, -30, 149, -166, -154, -315, -261, -289, 72, -98, -171, 102, 86, -13, -42, 196, -214, 150, 294, 99, -121, 153, 184, 77, 268, -72, -42, 102, 35, -245, -231, -102, 3, 344, -104, -147, 80, 48, 34, 110, -198, 201, 157, -41, 202, -35, 136, 324, 35, 18, -228, -196, -23, -13, -13, 56, -4, -81, 0, -34, 34, 307, -196, 14, -173, -92, 146, 7, -109, -118, -47, 138, -21, -31, -123, -70, 203, -274, 135, 212, 170, 167, 116, 63, -10, 0, 175, 142, -201, 69, -69, -83, 253, 93, -247, 149, -121, -195, -81, 249, -16, -140, 153, -60, 1, -435, 30, -68, -13, -171, -24, 160, -77, -87, -107, 65, 82, -93, -34, -42, 104, -47, 100, -13, 114, -214, -86, -15, 16, 3, -158, -64, 91, -180, 16, 49, -74]
3836g4J65k55J59j8J73P2k15K6j5m3J75j57J70j22j89Q2j67P3J36J84l56m6K51
3859IR4O4j11j15Q3J5J00j23O5k77R7J55Ok93L26j52k2K56rq4k03P3K3n7L68j72
3885A16l12J13L08q9j35j91k3J32k6K07l27J73K46k44M5j32L68j54Q6j36r2J2
3907e5K57m09J86J85k2l5Qk2k07L6o6K80j57J15O1l55K50j7j28J27O1j50k15M49
3931A77l01J58K07j67k78J82j06K0K18j52K49l40K67k10O22n15k15l9O7P2J45
3952F1l5M2lk0r6R4j52K80j45J06m51L93K7j24J14j2k1J61j90L4p7QK03j05J42
3977B34L5m57K97K3Kj17j01J29k7J45j62l9j45K57kr3j08M9k11J86J61n4R1p7
4001A6o5K11k41q0j02K29o9O1J34R1J38k61k67K02P0j02N7l76J36J35R9l03K38
$$ y = [-74, 91, -164, -5, -23, 150, 222, 7, 33, 18, -25, 150, -7, 163, 41, -148, -66, -233, -160, -24, 160, -196, -242, 9, 103, 167, 56, -59, 24, 39, 139, 16, 81, -196, -99, 56, 62, -231, 95, -57, -79, 177, 168, 84, -119, -46, -23, -80, 288, 116, -196, -83, 225, 136, 1, -190, -213, -81, -107, 100, -227, -54, 192, -52, -7, -139, 229, 75, 161, 25, -67, -55, 202, -207, -21, 164, 142, 107, 115, 93, -114, -78, -144, 136, -21, 94, 155, -200, 50, 33, -95, 32, 93, -57, -272, 177, -124, 34, 241, 74, -204, -22, -128, -108, 110, -42, 207, -133, 134, -76, 546, 31, -184, -223, -156, -84, 61, 26, 68, 65, 45, -51, 43, -109, 171, 26, 132, -319, 74, 101, -23, 91, 79, 58, 219, 29, 63, -14, -6, 197, 92, 234, 269, -188, 109, 132, 134, 17, -84, 45, 18, 163, 1, -38, -183, 74, 72, -21, -129, -80, -291, -105, 56, 2, 93, 16, -49, 162, -79, -159, -261, -32, -101, -40, 94, 185, 323, 62, -205, -3, 67, -35, 22, -354, -218, -83, 16, -287, -49]
4024d9q1M9j03J53L0n6K19r7j02J43j47OJ64p9nK19l52j9N4Q6m9k77L86n8rO9
4050I5n7j22k4J15k87J45L6Q9K2m2J20l29K48o1M5rJ79j73j1n9L00J9j8k08q4
4075g1lK58o2k09K3n0J17K8k65J64Q3N6J80p3j21j07j38M08j72K8mr9q8K73j62
4100fj90O5J06kJ02r2KK77k8k51p5K97j96O8R9j12k42N98m32m6r8L44J2Q8k78
4125A0j56K6r2L41j81l0l5K46j59M9j45j37M44l04K08j4j31j57L18k48L0J06L3
4148B2k78J82r0R7K51k52L32k57O9j14J20j65L21n08K73j4mj64K3K26o6j08p1
4171a75m8R9J50j14J14K07k67j24K71J71l13n6O2L1Q6k33jM8J27J40oR0j97j02
4195d0j5k16K63L31n95L08r2nK87l30J69m7j33jJ75M1n1Nm29L63R1j29j26L9K21
$$ y = [-49, -130, -81, -184, -31, -1, -57, 162, 65, -37, 106, -41, -35, 129, 50, 45, 264, -88, -107, -53, 33, -16, -293, 93, 35, 26, 95, 38, -84, -108, 7, -280, -135, -99, -10, 12, -30, 90, -239, 9, -52, -7, -16, 163, -10, -21, -80, 220, 239, 221, 13, -71, -74, 184, 122, -87, -64, -114, 3, 31, -234, -70, 13, 69, 249, 176, 55, -52, -190, 218, 46, 74, 70, -29, -117, 156, -6, -196, -131, -25, -27, 75, -17, -15, 262, 234, -17, -92, 205, 9, 77, 176, 64, -178, 420, -12, -58, -156, 188, 200, 288, 10, -146, -120, -212, 129, -52, -82, -117, 129, -30, 19, -126, -263, 181, -123, 85, 71, -60, -217, 101, -147, -117, -11, 22, -256, -74, -164, -67, 184, -68, 264, 7, 76, -38, 82, -83, 238, -270, 3, -11, -15, -179, -156, 70, 4, -104, -175, -223, -124, 26, -88, 26, 233, -34, -158, 113, 284, -29, -85, -23, 8, 94, -139, -140, -92, 35, 175, 169, 259, 62, -40, -55, -271, -8, 323, -272, 36, -56, -61, 226, -104, 65, 18, -115, -116, 59, 100, 49, 54, -375, -12, 79, -50, -176, -137, 84]
4220H4j36j70K79J10j06j13J06MJJ0l39J42K45k36L95j35j88N3K0k87K14P5o5
4243c7RJ96Nl32K31K15r5j43m80L79p0J24J01Q2m6j10K2j28j32J49k10K27R9j69
4267a13j9K05k65Q1J65q6j4q8J54J6l81M71p9k36K58j5mj11L6P2J60j18j20m1
4291g2j37L7J91R3j32n2J73r9J45j04NR1l04n7K48J74m53M36o5q8j2j61K86j63
4315b0q9R9j86K52o8j02K91j7j26j16P4m6n0J67m3j82J54O2p3P5K74l61J4ML35
4340C22k56j36n0L07j48k18K23l88J86J49j42P9Q5K50k1j30l12O9J38p1L58m21
4362a27j27K04M5J11N2k14j42K30j13j76L20r5j36m6O0QL97k94j59J46R0k47J37
4385g6j10K15q9K61l14J3K30k62J64q7J29k45K68o1j57L6m0M2k6J76j28n0k0J35
$$ y = [84, -52, -222, 57, 167, 61, -52, 54, 58, 59, 69, -270, -128, 117, -119, 276, 141, -47, 6, 26, -261, -47, 28, -37, -28, 168, 173, -159, 72, 287, 192, 49, -431, -52, -122, 2, 103, 185, 139, 29, 51, -77, -209, -60, -270, -43, 56, -113, -132, 73, -192, -111, 54, -32, -46, -134, 20, 36, -345, 126, 47, -189, 69, 54, 50, -61, -25, 47, 207, 89, -31, -72, -209, -172, 19, 112, -20, -72, 101, 2, 147, 43, 48, 139, -165, -222, 26, 200, -253, 183, 118, 30, 18, -143, 143, -20, -109, -10, -196, 56, -12, -114, 177, 160, 34, -82, -8, -54, -104, 63, 20, -162, -8, 54, -19, 56, 330, -31, -17, -13, 322, 66, -70, -120, 187, 39, -179, 44, -344, -158, -9, -151, -72, 13, 263, 242, 112, -200, -131, 7, -64, 294, -127, -254, -50, -5, 106, 158, -56, -198, 32, -81, -257, 63, -32, -168, -214, -154, -146, 251, -43, -202, -56, 34, -213, -76, -186, 29, -60, 201, -113, -100, 130, -132, 32, -55, 74, -171, 97, 36, -121, -85, -125, -83, -109, 67, -61, -111, -131, 4]
4409Dj21J41j92L6M18j67m0J08l30J29K4n3J94Pk26K6J85N4j12j44J35k67K03
4432A2j37J26J11k19L10N9l00J42j56K54j69K46m65J30L1k43J75r9L66k85q0K27
4454C6J43L8j40J8q2J42k79K00o9K8J40l40L40J8j73l0K16k69j62K77l21Q0j90
4477c79O50k03J05o1j54K25l45L53l63K92k96P1j07L99j51R1K6j48j14K15k34
4498a28J86Lj08P1q0r6K20l0j62J01k01J47P8J7j16R4j54L83m4k51K39q5lk80
4522a99M04j93j71J8j7J0K36n1Q3J8O6k83j14l8J6K30q4L17k69j75J79O4J14l1
4546A30m9O1l30M51k13L3j2l27K61J61l80k10O27R7k65J95j81p7j01kJ75%L2k42
4570a66K12N1j5Q1p4k05J60j74R6j2R4j65Q5j17L60l73Q5K10l5j27l0j75K81L2
$$ y = [4, -117, 24, -168, -132, 286, 119, 79, 187, -143, -14, 10, -43, 151, 158, -68, -42, 143, 197, 85, -59, 76, -191, 12, -125, 1, 112, -107, 203, 262, -38, 104, -52, 202, 33, 279, -186, -56, -25, -268, -93, -192, 174, -111, -191, 36, 179, 217, 77, 95, 13, 155, -124, 76, 7, 35, 175, -165, 175, 193, 20, -10, 206, -63, -225, 52, -269, -189, -379, 271, 68, 173, 112, -42, 183, -162, 191, -172, 120, -176, -105, -212, 187, 36, 127, 153, 5, -109, 106, -128, 58, 61, -47, 24, -56, -152, 68, 38, -124, -23, -224, -77, 1, 18, -98, -4, -158, 225, 181, -70, 169, 84, 81, -199, 205, 12, -159, -141, -158, -148, 88, 37, 120, 138, 204, -79, -193, -231, -215, 15, -69, 248, -21, -196, -17, 47, 161, 130, 81, 142, -188, 263, 50, 83, 71, -256, 5, 166, -214, -424, 203, 300, 35, 230, 49, -28, -129, -131, 44, 44, 76, -166, 46, 97, 82, 163, 89, -116, 44, -130, -34, -46, 48, -117, -32, -149, 211, -162, -77, 133, 98, -29, -59, -234, 47, 79]
4594G9N7J26m35L14k14Jj23J41J08j7P6j54p6j9J64j73K0K26j9j64l3J95k8J43
4618A95j20j66J98j19J71Q8j08j95J19p1P5j00K53l22J87J27j94j76J66m6K74
4639B36l64J72j2j31K13j99K47l56J42j12J49K0K2J88j36n8k1r3j27M44j01j84
4661f1l7J46J18l08L39r8j70lk6J65j36M3M1J43k37K65l25K42k45L8l5K05p9O6
4685E1n1K01l9Jj66L79k18k29K05j23j27M4L0Q4P6k13L1L0K5j37N4J93k5j50j2
4710h6l3K66j55N3qm14Q2K09J37k2r2J51j20K46l32K52k90j09K73q3OO6J5k26
4734b14J94N9l8j65L97k27j53J40J42j80Q7j1j32J62k4n2J04k19K58j48J94j41
4756C3j71p0lK50N3j41L51l21k9j11J57O2j44j09K58m5q4m4l6M7J20j29J93J73
$$ y = [79, 136, 262, -173, 141, -73, -72, -195, -54, 54, 37, 113, -41, -117, -136, 28, -145, -125, 101, 82, -82, -115, 80, 52, 195, 75, -91, 107, -12, 159, 247, 139, -56, 63, -8, 67, -33, 220, -102, 85, 212, 18, -158, 8, -38, 236, -128, 44, 32, -99, 114, -85, 162, -194, -52, -164, -15, 5, 27, 215, 79, 21, 0, -93, -220, 224, 123, -61, -98, 48, 166, -142, 197, 99, -71, -74, -100, 65, -71, -28, 13, 156, -81, 184, -141, 101, -144, -106, -141, 64, -15, 51, 0, 201, 162, 163, -3, 376, 158, -71, 134, 11, -116, -72, -42, 42, 118, -95, -64, -34, -9, -146, -92, 101, 76, -74, -86, -119, 147, -8, 45, 37, -377, -295, -86, 51, 29, -63, 88, -32, 214, -118, 134, -156, -265, 8, -75, -69, -3, 12, -214, -20, 39, 1, -164, 233, 6, -147, -7, 135, -45, 42, 31, -101, 61, 37, -15, 89, -130, 128, -20, 174, 33, -138, -208, -211, 39, 92, -49, 302, -19, -48, -159, -2, 60, -84, -193, 65, 20, -64, -108, -144, -97, 23, -106, 87, 260]
4780B60k32K73m38O4J34j13j13J91K8j63p5J44k13N43J16n23J02m5J11j46l0K4
4802a01N1k5j41J50K01o2P1m7J6P3l83L09j38r7K37j70j11P4pQ7Q1l8P4k87K46
4827F3k1N2l96J72o3L34l11J00R9r6J02P3l9J73k37p3L7j03K40k3k68J51j4n4
4851a02K06r5j46L61l52L45j82j18J64l27K69J9m3R5l01K92p8j88J63O3j44L76
4873B77l74p0K03n5R9q5J38j95j24J77k1j40K35o6j36J00k04J59J15j20M3K0j86
4896b10N3L63l55r6J0M67k01k50P2J76K31j58R4j82nJ15j6J30l4j43j54K43j19
4919C1J57pj85k4j92J21P6J46k03J67J23k10K14l08k06J39l8L77j55P5j11j77
4941a90J68j38L67o8j46L6j23J17m4L5Q0j40j33J16J4L7K2o9l2j2K13l47J32J65
$$ y = [260, 28, 301, -137, -73, 61, -52, -165, 26, 54, -109, -184, -40, -253, 290, 406, -117, -15, -60, 51, -95, -125, -101, -50, -75, -216, -66, 135, 73, 144, 97, 113, 186, -197, 112, -26, -123, 114, -56, -167, -93, -100, -13, 68, 30, 104, -183, 63, 42, 94, -302, -130, -193, 141, -170, -70, 29, -67, 35, 108, 69, 242, 5, -68, -31, -134, 106, 83, -185, -34, -48, -102, 104, 9, -137, 224, -128, 217, 35, -83, 81, -246, 23, 42, -1, 94, -207, 85, 7, -181, -18, 45, -99, 277, -97, -167, 36, -19, 80, -5, 133, -62, -186, -9, -30, -170, 65, -1, -137, -37, -241, -82, 33, -87, -44, -24, -210, -157, 206, -149, -245, -235, 232, 31, -219, -147, 29, 260, 102, 196, 14, 9, 124, 108, 238, 204, 61, -93, 150, 31, 188, 181, -4, -28, -220, -99, -23, 123, -80, 87, 210, 0, 214, -94, -300, -161, -199, 178, 23, 98, -13, -190, -22, -160, 207, 139, -7, 29, -94, 23, -21, 14, 94, -46, -179, -63, -49, -12, 10, -59, -91, -103, 110, -237, -105, 60]
4965F0l9j46K39j84N9P4Q2l53L91k29J94j62J78n2k07J37k23N9j63L48o3M8j55
4988a07J11K88n69J64q7N9J47K3j15JJ82m34K96J3p1R7P6o7j55J04j16L9K89j27
5012D1j55O6k5J55n2L4j40J2j70K65j62K25p6j44PQ8M7J25j9k00j40L41k93K53
5036H3J58k52k62J53k2J55J13j06l86L47j47O8J4J05L9j58J68Q8j00L1j61J96
5058A24k1r0P0j67j26K84k23P3J49Q7o9M6j3L5j59j40k38M99j99J55j00K6R1J08
5082B02j74k78L2K21M2K00j24l72K81K3j1q6p5l7J04K1J76R4p2O4k52kr1R6J7
5107ak2n9K30j35M2N6J4k09j0J52k07JR6P1L0Jm3j26L11j75R3j47Q0J5j4J71l72
5134a57L05J4j02K60j19k65Q5J08j33p6L05m93J27J78k47K17n8q8j26K96Mn1J0
$$ y = [60, 21, -125, 114, -70, -11, 63, 145, -208, 183, -46, 148, -14, 164, 112, -95, 42, -181, -122, -285, 63, 0, 48, -107, 4, 292, -277, -113, -200, -141, 6, 29, -86, -85, 97, -337, -41, -28, -99, -2, 74, 7, -148, -44, -160, -121, 168, 41, -114, -48, -73, 82, 30, 64, -76, -64, -234, 31, -131, 94, 18, -126, -119, -31, 16, 141, 122, -78, -218, 123, -170, 83, 241, -11, -273, -120, -142, 13, 126, 20, -366, -19, -166, -98, -84, 21, 60, -98, 70, 158, 58, 89, -72, 124, 103, 13, 83, -84, -210, 74, -149, -76, 73, 160, 91, 137, 124, 159, 0, -140, -378, 121, -78, 77, -23, 3, 94, 202, 28, -250, -218, 3, 45, 245, 121, -251, 30, 53, 42, -44, -119, -156, -52, -31, 145, 239, 167, 231, -21, -23, -114, -18, -1, -23, -82, 148, 13, 55, 111, 125, -84, -94, 58, -149, -148, -52, 19, 49, 50, 7, -119, 192, 17, 110, -37, 43, 58, 44, 215, -157, 148, 162, 60, 320, 201, -64, 21, 129, -4, -80, 225, -268, -141, 37, -210, 7, -51, -139, -265, 31, 35, -16, -6]
5157fR4j28p3J06J55l36L49j26j63O6o3J82n0K25k72j0K30j35k37L94l80m0L83
5180A65j3j76j77J25j11J79o3J41q3k40L62q0k18J38l1J72k23K0J21J78k14J04
5202G6Np4m1K77k57J54p4J4Pj10Nm2N6m2k0K25J0j95j2L4K13l67J04L11l54M0
5228e7J23K59m12R3J2o6Q6P9k25l3M34l27J41j74j76L02j1j75J00P1k72J33n5
5251a50J1J62k9k84K11J81q9p5P0M3j57J56n3j06K02k62K77j4J86l69k54J32K76
5274F5Q7q7j74J08J88j19j42J56j99J10J22j44r7N4K0J02N9k73J49K9jJ58l8k32
5298i9K14k28j2K92l9k92R9K58j71jj01k07M82k75Q7K14j33j0j89J70O2j38k94
5321c11J7K37P6P3j76j54N70l85Ln6J15O4J1j92K13j95j3K31l1o0K04k38M3k56
$$ y = [-6, 88, -40, -113, -7, 148, -188, 161, 35, -128, -62, -125, 57, 7, 232, -40, -50, 180, 45, -192, 202, -178, -218, 165, 152, -24, -201, -76, -187, -8, -71, 70, -13, -253, 109, 29, -189, -51, -82, 90, -133, -113, 8, 186, -28, 76, 81, 7, -34, 243, -14, 140, 66, 80, 87, -23, -18, -60, -4, -46, -66, 159, 169, -26, -38, -4, 209, -158, -54, 257, -97, -57, 66, 325, -87, 6, 18, -48, 38, 117, -108, -141, 293, -34, 107, -67, -243, 59, 48, -127, -27, 44, -228, -95, -150, -139, 23, -6, -290, -79, 102, 13, -62, 8, 51, -106, 50, -3, -109, 93, -169, 108, 94, 280, -89, -343, -211, 65, 152, 65, -109, -1, 187, 68, -74, 82, -117, -7, 115, -29, -126, -72, -52, 50, 109, -164, -15, 14, 13, 171, 133, -99, 115, -113, -125, 167, 128, -164, -65, 193, 22, 21, -80, -287, 195, -80, 7, 221, 88, 78, -111, 59, 121, -17, -311, -294, -57, 19, 92, -84, -238, 332, -53, -50, -106, 9, 73, 84, -108, 105, -90, -103, 128, 97, 37, 241, 3, 46, -210]
5345b10Q4J35K11k67j36lJ80M1k23K87l19L53m04K11J96j46j38pL7J42K16l45
5367a05j05L94j38m7q4p8O3Q1m2m7L72k51N1k27M2N8J1J8K2O8k4m58O72j61j93
5392a08K84k08M3k55L27J10k27l7L37l02k9J60J1rj96kk5K6J39R8rj57J76mj44
5417aR2k57K5J24k1R2k35L79k82q8L24j25J95k01K0K52j43l68J89J8n8j73K89
5440D7j78J6L16j82ml4M00n71J84k25M2J53J63k11J57k17J00p8Q5K86j61q1pj47
5464a47K51j26j13N8K2K12l82L90j54Jj43k4L98l05K8M2k39K56N6j98K02k57K10
5487C8k71K13M5M12l87j22K10k08M7J08K4mq6j00MJ15k94K33J61m28J14J84l38
5510c30K42j37K23J20k69J56j22j6L51l25m8J44k7L49k18l02K18OQ6p7q4Q5j29
$$ y = [-210, -126, 9, 220, -47, -183, -186, -6, 35, -188, 99, -220, 133, -271, -60, 136, -10, -148, -155, -118, 24, 240, -105, -210, 184, 46, -1, -85, -163, -100, -19, -61, -108, 264, 13, 64, -163, -121, -63, -52, -34, -12, 56, 32, -426, 246, 85, -108, 176, -32, 11, -244, 83, 193, -34, -71, 266, -36, -65, 95, 106, 97, -99, -101, -126, -100, 39, 137, 128, -29, 147, 143, -1, 91, -166, -141, -17, -38, 54, -181, 198, -84, -172, 152, 27, 222, 21, 41, 293, 150, -218, -29, -11, -69, -242, 47, -131, -115, 201, 19, 15, -19, 381, -190, -6, -231, -189, -36, 127, -84, 73, -144, -44, -122, -37, 249, 88, 7, 0, -147, 104, -22, -135, -77, -55, 157, -225, 165, 11, 12, -131, -155, 243, -62, -34, 8, -231, 25, 81, -117, 85, -172, 38, -233, -20, 25, 437, 50, -72, 138, -70, -23, 85, 109, 105, 19, -81, -77, 38, -256, -23, 138, -290, -176, 8, -330, -88, -225, -2, 118, -151, 5, -117, -133, 218, -107, -155, -11, -38, 311, 93, -209, 9, 15, 101, 24, -60, 25, -104]
5533a04J1J94k86K05j00P8L00l16N0l3k13M66j36r6j9J1k84K50j26J36M2j41M6
5556f5N1J10k59J74n9p1J66J60l44K50n2j7j88J43j61L2K24j42K86k27j93K68
5578H6l4j23M6r6K32o2O7l37l1K04J77j72j21J82J08o9j46J18R1j25M2K03l47
5601a07K28j69n4J01om2P0j07J53k15j37M02j26J53l0j39K7n8j34M36k65L71k08
5624A44j14n0m2J27k9r3K54l02j6R8k75J57J21K2J2k21M18p5k48lM7J08j38K91
5648A93j69M8J07l45J64Q0l47L21r6J68k21J01M9L4j50J67k39k9L04m6k11L02
5670A85J28l44J14q4K08k95J10J19k28M7j26N3K11L5l6J02p9J60j04k28J98j31
5692A5N6O1m80L49R5j18J87j23k07K72m5j7L3j73K34j63Q6K16j76q7k06L33n1
$$ y = [-104, -93, 101, -185, 20, -80, -2, 298, -18, 32, -1, -214, 252, 116, 20, 1, 12, -272, -22, -148, -12, 30, -111, -65, -14, 96, -163, 11, -48, -119, 47, 207, -137, 113, 61, 44, -144, -1, -162, -130, 94, -48, 238, 11, -182, 86, 52, -71, -25, -121, 111, 49, 116, -221, -252, -48, 129, -43, -164, 18, 126, 57, -89, 29, 120, -5, 37, 240, -107, 121, -48, -102, -1, -7, -49, 21, -86, 67, -148, -285, 117, -9, 144, 114, -25, 2, -56, -190, 246, -19, 352, 144, 30, -20, -62, 65, 36, -57, 197, -105, -121, -23, -298, -141, -20, 2, 14, -207, 211, 136, -112, -115, -68, 40, -98, 193, 24, 72, 179, -166, -2, 78, -269, 52, -44, 124, -97, 4, 53, 87, -63, 104, -135, -164, 140, 94, -117, 185, 313, -31, 83, -1, 207, -88, 22, 141, -87, -40, -166, -113, 98, 133, 97, 199, 120, 280, 176, -52, 146, 15, 71, 132, -348, 1, 96, -22, 165, 42, -165, 107, 62, 45, 78, -95, 139, -24, 62, 278, 102, 15, -191, 142, 91]
5715I1O2j81J97j54l16M45k01J97l20J31j08j9O2J76l9j07J49n3J57j14P8j50
5737a7J6K31n0n41M65J30k08R6j64O1k37J64J60j53l5P4k03L29J21m08J63J07
5759A01l27K54m0j31R8k68K67P3r8k0j02K58k5j16J33O6j94K73k92K08l04K01
5781A5l4R4Pj47P6o7Qp1N7K25m20J07L25k30p8L7M5j47J53K13k46J17N3l35J62
5806h1J17j9J80k12j06L17l13L19l3l97J18J09j18K95Q6l38n6J59rM5m70L23R6
5829A2m3jj04K85j34k18Q0%l7J73q9QM9K4l8p9J56k3j90J38j70J96j68N2NJ60
5855D4N4Mk9q1J52q3j49J14n4Q6k06K47n4k22j34J93j10J84q0R1K21O2k20K53
5879B83n29O31l81J14j70K22k36K29m71L75Q3N5j16M4r3j59J70k15J6J14R0r0
$$ y = [91, 153, -28, 169, 15, -301, 144, -57, 140, -180, -49, -157, -176, -114, 62, 23, -84, 65, 12, 169, 55, 133, -17, -1, 230, 180, -361, 104, 234, 26, 122, -42, 19, -218, -54, 106, -47, -82, -8, -211, 118, 239, -169, -6, 101, -226, 28, -12, -143, -45, -313, -46, 27, -71, -91, -193, 65, 40, -76, 57, 123, -71, 202, -90, 118, -186, 15, -19, 75, 82, -65, 11, -56, -48, -119, -62, 163, -257, -150, 175, -55, -133, -96, -51, -198, -45, 168, -78, 39, 92, -243, -81, 36, 17, 197, -15, -121, 196, -117, 202, 169, -228, -110, -1, -119, 176, 262, -76, -132, 27, 18, 63, -407, -84, 12, -31, -32, -136, 149, 15, -203, -123, -123, -160, 13, -76, -68, -19, 5, -33, -112, 44, 21, -169, -31, -201, -5, -173, -121, -116, 44, 98, 102, 73, -8, 144, 61, -88, 26, -28, 58, -148, 99, 45, -177, -311, -118, -228, -44, -124, -33, 188, 250, 30, 283, -246, 385, 4, 118, -52, 170, -66, 163, -308, 67, 150, 205, 89, 133, 40, -119, 51, -164, -148, -34, 56, -34]
5901c4j19O6K76K4n9O5k76K06j68K24m6k55K15k31K90j06k86K72j7k44K23k51
5923b31K73j5l41K56K02r6M3j82l2m1J88j9j03J72K2m60J62J90K27k38J23k23
5945a23L06j51J45k23Q8k42M85n90K87N7n5J16k34K20m7j45OJ34n7JlK26j34l56
5969b89L95r7j21M77k97J06j87r7Q8K07j52JO8op4j9M0j08m5L02l32J43K12k85
5993g0j54P2K29j02K31l89L32j91K1j01j5J2L43k82r2K03p9Q8j53p8J02k40K22
6016i1R4PK16k96N6j08R5l2M9J8N0j05J37p9l18K87K60j90j38JQ0k23M22k7l17
6041a52J10r7J06k5J06k12K31l08R7J9K91k68R0k68K23K64j31j01j10L03n9j11
6063bN1Qj38J12p6r5M0P7n5J15l35M48j54M0K62l28R6j36O4k4J3jJ44m62K61J95
$$ y = [-34, -153, -87, 189, 213, 154, 219, -57, 149, -19, 205, 159, -96, 119, -112, 178, 72, -214, 58, 41, -203, 20, -231, 42, 27, -314, -58, 144, 48, 91, -91, -123, -164, 24, 5, -98, 74, 96, -364, -202, -12, 215, -23, 100, -123, 183, 32, 177, -46, 42, -200, 285, -305, -18, 39, -16, 100, -134, 86, 39, -106, -100, 34, -23, -22, -25, 201, 67, -289, 106, 9, -112, 365, 68, 174, -13, -110, -22, 185, 33, 34, 102, 96, 22, 3, 43, -65, -110, 192, -140, 3, 215, -70, -224, -152, 77, -25, 206, -183, 149, -42, -21, -122, -137, -125, 218, -64, -156, 47, -32, 56, -97, -175, -73, -313, -91, 3, 10, 226, -70, -14, -122, -27, -59, -10, 8, 58, -47, 90, 11, -307, -20, 240, 50, -88, -87, -7, -230, 192, 165, -152, -42, -139, -33, -58, 48, -164, 67, -241, -144, -125, 166, -102, -12, -280, -57, 207, 76, -25, -135, 168, 109, -2, 49, 57, -81, 31, -45, -140, -100, -23, -78, 37, -298, 150, -4, 36, 298, -30, 66, -70, -6, -30, -17, -18, 126, -336, -75, 120]
6089A20k49M2j18M0O0l0K52J8l88K12pk31M64k65N0J35K0j57P9J5m8J91j05J32
6113B32k96k64J09L32q6j06n0N5j16r7K62k74K77l2KJ01J37Oj16m9L7j00j01J23
6137a4K5J25P8k26k13N97m63N3Q9P1l9L9l18q6L56R4J06m43J22J65l15O19j52
6160B70j38j90J05n4n0j08J99J48k97L2L3J00n0j51J80J16q6K22l02q1J62L7J05
6183B02m74K07j16J95k36M21m98K62J31k57K97j17O4J81k43J01j13M8p6M3J88
6204B10j91J71l77J90q7m2K25O5j80k9n9K82j51o4n9K9k24K22N0J59k90L01l13
6227a62K61l0N1k3k3m6q2L06k24p9J32n1K0J3R1q5j74K15l79L78P2j52l5j02n1
6252a59N1l2J8J06j25N5j29J79K11k60j30L84o9j02j5j73R1J48M8nl38M17k52
$$ y = [120, -129, -87, -205, -165, -105, -135, 117, 135, -253, -41, -48, -279, 185, -80, -30, 105, 125, -32, 47, 62, 14, 205, 100, 232, -64, -328, -219, 113, 27, -79, -129, -74, -190, -287, -25, -299, -22, -54, -52, 49, 186, 192, 76, 27, 64, -36, -137, -14, 11, 136, 214, -12, -225, 372, -91, -38, 51, 122, 83, 122, -196, -282, 74, 168, 274, -169, -47, 118, -197, 422, 270, 132, -58, 47, -7, -57, -165, 34, 182, -115, -83, -50, 50, 0, -151, 29, 145, 59, 281, -21, -102, 60, 97, 202, -272, -65, -181, 14, -222, 199, -299, -37, 94, -163, 134, 17, 81, 262, 19, 120, 7, 55, -21, 22, 210, 19, 190, -187, 3, -84, -126, 99, 164, -16, -45, -104, 178, 27, -37, -96, -67, -291, -69, -19, 140, -150, 151, -162, 99, 69, 120, 97, 74, 28, -54, 252, 28, -51, 81, 30, 50, 63, 154, 69, -105, 110, -269, 109, 181, 29, -6, -108, -159, -108, -140, -122, -16, -141, -86, -215, -36, 175, -85, -215, 169, 100, -2, -17, -190, -99, 49, 97, 92, -246, 171, -81]
6275h1L63l72M6O6l49L51j53j62J37L16k34r3L02j94K73q0j45n9L29l13n4%L82
6298B76k29K2J49j4k27p5L90l25J6J26k63M24l80L14m20K83q4j71J27M4N0j1J37
6321A59q6o8j35j2q4J9J52J13J38k37n0J70j92J43K24l20J48jk10K10l32K36j28
6344a43L2J82m5l3P8k71K71J35r0j56j61J76P7K1k86P3L95k22Q5j34K6K18l22
6367i4J6K09n0J52l95K20o8k5Q9p1M6m7RJ60k38K95j21J52k33R9k28K7l2J34J34
6392A40L21l30P7q1p6J26k05P0K4r9j76j34M63O1m81L22r7o9M39l97j4K41j23
6415Bm4kK27j89J58j76K07l4k78J8k31J58M9K42n4j40j53K02l0R5p1k33K47N5
6439B5k31P8K54k9k14L9QJ57l03K13J27Kk3J8j02k66K01p1K49j0J10k26Q8L0L2
$$ y = [-81, 282, -90, -44, 22, -327, 24, -129, -291, -154, 162, -72, -165, 137, -57, 216, 136, -9, -68, 261, -52, -106, -106, 276, 47, 69, 218, 204, -23, -98, 292, -33, -17, 109, -154, 270, -110, 204, -216, 67, -17, -188, -61, -17, 33, 22, 159, 73, 5, -130, -142, -226, -207, -55, 58, 196, -41, -91, 79, -113, 30, 254, -66, 82, 81, -129, 81, -251, -15, -143, -111, 71, 26, -7, 71, -200, 71, 206, 116, -40, -201, -25, 52, 73, -213, -140, 255, 33, 118, -16, 10, 228, -94, -78, 131, 81, 233, -162, 58, -10, -35, 54, -17, 29, -18, -9, 151, -87, 208, 87, 239, 6, 105, -123, -96, -128, 6, 140, 461, 131, 208, 127, 51, 177, -28, 42, 66, -33, -209, -343, 120, 181, -300, 22, -75, -144, 295, -102, -116, 125, 2, -42, -44, 183, -6, 152, -24, 183, 149, -129, -111, -342, -184, -135, 107, 53, -87, -240, -38, -68, 27, -44, -277, -30, 25, -206, -128, 126, 97, -117, -78, -70, 87, -216, -3, 124, 126, 103, 121, 19, -247, -46, -117, 132, 122, 232, 6, 94, 124, 156]
6464A56j82M6K68m66R7M05l15N3k3j5N5L6j52j53M31k71P2q3m8K92k87Q9K75l35
6488e5J68j83r6J71j1J07k45M0j46M33j51J94m4m82L20Q7l85L05j40o9L93r3k88
6511a70J70j50K11j02Q2P7L9k59K29j16j90K49J57m36J14J92k15J02k09L05r9
6532a9j06L3Q7L6j40K38l19J68m0q8J74q2N1J03j09L3L5l0j06K52o5L5k85R8K40
6557A94k65K24k24j57J33j95J75Q6k14M2K16J26j76J90k02M4JJ44k41J93r4jq3
6580h4n4k1K86j59J05m4J25k24NJ05j69L06k42O6k5K36k89rM9j29O9k6J37r3l7
6605a16K2R6n6j98N3K71j32K57mk05K3j07J18No3J83j90L5K44k46J55k85L6J36
6629C2k53L09j94QL01j68j24P0J0J61j48m2J34l8l19J94j02k0K73j59J8Q1K60
$$ y = [156, -26, 20, 288, -178, -81, 324, 9, 62, 39, 24, 79, 115, -37, -190, 241, -30, 42, -41, -89, 203, -84, 5, 280, -55, 113, -70, -166, 5, -6, 101, -144, -104, -250, 183, 32, 226, 182, -300, 20, 107, -278, 27, -113, -182, 211, 118, -170, 0, -150, 61, -41, 41, 118, 157, -102, 127, 11, -179, 70, 227, -209, -95, 97, -118, -16, -225, 80, -19, -125, -92, -5, 31, -109, 129, -190, -22, -62, -150, 24, -58, -7, 96, -13, 20, 55, 25, -81, 171, 106, 141, -144, -46, 194, -71, 153, -71, -228, -95, -290, -115, -29, -243, -201, 15, 141, -35, 155, -47, -3, -2, 142, -99, 94, 0, -1, -84, -138, -159, 127, -32, 73, 29, 154, -70, -65, 40, -129, 177, -65, 1, -24, 212, -77, -86, -37, -166, -97, -123, 14, -79, -116, -94, 2, -54, -252, -199, 72, -60, 197, 193, -12, 11, -96, 22, 27, -36, 147, -43, -8, 236, -10, 145, -140, -104, 32, -221, 88, -106, -98, 203, 35, -89, -19, -9, 152, 4, -38, 96, 58, -261, -67, -169, -189, 84, -75, -57, 24, 284]
6652B84l08o8P7j46L67k4J73l95J33l69J99L01j86P3j99J10K4j04n6L09k71q5
6674a61P0k06N40j30k2j23r9N14j52p7p1Pm61N03p7p6J4K2j92J40K32q9k75K93
6698A24k33n7M3L05j40J52j77j26J1J58n5k04L76k76j09P1K98j12Ql7O6p7J51
6721A60j04K50l26j36J80k0k24M22m29L07Pm3j06j58K22J26j48o4j4P7J4N4l8
6744Ij17K03j72K73k45Q7n7j41L86j03l31K59k7L1j47K00o2r5O5o3j43M40k47
6767CJ09j86o2L07j18j55K77j42k51Q9%K07nk11N1L1j24M7J20P8j20R4J10j72
6791b3k86L50j49ML2J34O7j15o4m2Q6k1N8k47K85r7O1nJ35k97L93j20j95Q0J06
6816A30j98l4K92m00J37l9L18l74M06j04j87q1K14k09J34J6M7M4n6pr8K9k3M7
$$ y = [284, -24, -92, -15, -161, 206, 182, 355, -40, 93, -276, -77, 224, 38, 111, -88, 22, 46, -58, -114, 195, -76, -161, -91, -297, 243, 113, 91, -32, -131, 383, 231, 154, 83, 90, -371, 132, 55, -21, -7, 15, -177, -37, 195, 106, -169, 124, -109, -166, -123, 182, 42, 194, 17, -109, -98, 60, 5, -199, 177, -99, -208, -137, 161, 49, 57, 20, 86, 9, 160, 56, 306, -20, -156, 24, 4, -220, 202, -227, 80, 87, 44, -62, -220, 2, 128, -20, -84, -98, -21, -7, 47, 9, -108, 95, -77, 196, -49, 38, -19, -160, 226, 123, -208, 51, 24, 55, -92, 108, 46, -49, 16, -47, -190, 250, 3, 112, -74, -136, 171, 53, -102, 175, 33, -218, -129, -129, 78, 73, -138, -87, -56, -180, -133, -13, 65, -55, 39, 149, -23, -309, 41, -108, -104, -72, 62, 129, 14, -50, -92, -6, -27, 31, -216, 69, -28, 33, 28, 163, -134, 259, 139, -56, 24, 130, -68, -102, 190, -210, -73, -112, 206, -168, 238, 134, -53, -134, 80, -129, 5, 21, 68, 112, 56, 49, -49, -20, -43, 4]
6840DJ81q8j36j74K11J85k27r9K79n1r5L67l10M1O1o6qj84K99k75O3k8k3J56N0
6865A33l48J8K24J3l28J14L7J37lj59K24j62K48Q0j35j44j8j01L21L3k17q8j0
6888a31J03N0m0R3Lm7K17l23L0L11l97N8J79J5R4k28J81k12K67K49n56L06k94
6911g2l9K06k33nJ39j50J80P6k08RJ12Jr8M8o3J25J00j25J22k1k7k00j3K74k35
6936i7J18k6K39k05k37J24Q0j40M47l84K99k61J5PJ17j34l09L94j37R6j2L2K10
6959B36k58l0KL01m50K72n74N99o1P3j36nK14O1k67k3j9j65K66j46J21p5L47m09
6983a26J16l9k75J78Q9K73k44K16k62N0j79J59J29k90J77JM76l03l2j46J48j99
7005h3J09j34J59O1J21j86Mq3J44J25k41j01J02j94K20k65K31K0K12m80J92J43
$$ y = [4, 185, 97, -39, -213, -2, 183, -44, -143, 136, 85, -10, 357, 47, 88, 149, 83, 75, -109, 190, -85, -22, -50, -73, 83, 133, -215, -197, 27, 40, -288, -174, -137, 0, -3, -162, 62, -100, 148, 228, 93, -51, -69, -170, 151, 184, -33, -121, -131, -28, 22, -18, 75, 78, 31, 248, -75, -45, 266, -131, -73, 106, 121, 215, -13, 168, -44, 223, 472, -84, 222, -72, -111, 95, -138, -143, -4, -154, 26, 102, -106, -97, 15, 16, -82, -34, -97, 28, 128, 3, 125, 104, 77, -123, -136, 138, -97, 21, -5, 234, 29, -208, -84, -4, -144, 303, -81, 218, -43, -28, -21, 96, -38, -347, 47, -90, 6, -6, 26, 236, -22, -52, -50, 251, -199, 73, -501, 98, 37, 110, -26, -31, 183, 244, -23, -46, -65, -230, 36, -110, 11, -64, 283, -126, -10, -49, -324, -146, -57, 216, -28, 188, -74, -24, -203, -44, 85, -205, -28, -27, 449, 146, 114, -32, 116, -83, 26, -108, 51, 112, 233, 47, 51, -32, 112, 237, -4, -105, -3, -197, 23, -242, -11, 9, 221, -259, -67, 76]
7027G6k35n7P0r3M9L38o3j46J1L5J54q6l1j4o7K50j44L9J62m7l25m4J18J47k0
7052G7n7j9j12k00L56j46J60K7j8J40j28q2K5K1J83k99J75n0j4K21k83Q8j84L23
7076B04k06p7J83L4Mj52j56L60l8q0J28l91%J48N7k46J24k0J97j16j5k7j56M84
7100B43l61J31l6L12j38k96K10l07K69p8j5k26N2J65K3J18m9O4J9j6l22k0L10
7123E2j76J94R7N2k17J20k8N6j93n1J35j43K46j23OK03l04J42r5K6K02k47J47
7146A01j59J26J62k52Q9J10j73M8k44J59J81j8k58K07k77P7J77k80M40k92J50
7167G4l23K48j00K64k45K24J88m22J2P5J31j98J86k79J34J2N7j75K00nm62L30
7189g4J99j54L9j4K45j17J18l37R6QQ1k10R4p5MJ04j17K10m11L72m7J20j65j69
$$ y = [76, -159, -216, -146, -239, -190, 148, 85, -61, -50, -15, 139, 53, 22, 8, -59, 191, 47, 86, 248, 201, -124, -168, -50, 97, 77, 20, 1, -111, -311, 45, -101, 59, 86, 68, 208, 80, -2, 23, 44, 227, -72, 103, 53, 39, 260, -23, 65, -119, 204, -2, -79, 104, 138, 142, -10, -166, 194, 156, 76, 204, -187, -187, -39, 18, -228, -104, -124, 73, -43, -58, -85, -241, 243, -118, 13, -23, 289, 151, -145, 65, -242, 27, -51, -66, -292, -240, -75, -52, 66, 17, 81, 100, 84, -238, -258, 52, -124, 70, 167, 219, 2, 122, 94, 150, -43, -94, 41, -102, 144, 21, 27, 230, -74, 68, -27, -1, 201, -46, 101, -58, 68, 230, -22, 67, 177, 4, 52, -192, -33, 148, 130, -128, 79, -198, -121, 56, -224, 216, -76, 74, -249, -1, -101, 163, -82, 142, 330, -92, -80, -5, 126, -72, 114, -165, -31, -19, 38, -137, 63, 58, -404, -74, 125, -29, 10, -4, 241, 124, 242, -95, 1, 9, 90, -120, -26, -101, -97, 7, -110, 100, -311, 61, 14, 134, -31, -200]
7213b00K03L0Q6qk13K41l11K30Onj30J64k03J71j48P9R2j73J18L47l00j95L54
7236B35m8k17r2N9j85K84o3J47j79j0qj27K20L2j07Q3m4j04Q1nm0J94j12J43O8
7261B05l37Q8k3N3N0k68K93k57J05j75K91L2j10K55k91j76l0K46K15k45J15k04
7283a68K6K77k03J51j70mK6jrJ81j37R8r3J54j78r7j0J92j42QL13k13n3J0N1J05
7309A14k68J76j26M59l21m1l10M39j68j05K45o5j8J36K6k05K31q1k1j42Q7m16
7331c74K59l5oK53q4K1K15j51n7L6K6k36K71l49L10j17j9J19oK99l60j7J55m40
7355b87P5J1K84j53J54j61J4K07k19J56m20M18j14L8j11O6J62j63n4r9J47n0n7
7378a56J49Kj52L45k77Q9%k35K17j0J1J64J8p8j70J59Kn0j4j34n2J21L98m11J49
$$ y = [-200, 3, 33, 119, 111, -102, 139, -172, 58, 64, 59, -71, 93, -110, 61, -87, -8, 84, -89, 29, 376, 76, -119, 235, 187, -30, -122, -63, -248, 36, -27, 120, -59, -69, -77, -204, 16, 48, -59, 24, -20, -124, -43, -48, -88, 106, -6, 137, 205, -132, -44, -67, -14, 36, -232, 61, -196, -91, -266, 25, 57, -53, 202, -89, -265, -295, -49, 166, -79, 36, -168, -142, 135, -68, 83, -87, -91, -65, -66, -75, 106, -31, 67, -26, 128, -50, -147, -157, 35, -107, -99, 214, 1, -52, -42, 9, 114, -154, 22, -104, 355, 34, -7, -317, 122, -46, -151, 94, 29, 11, 147, 173, -32, 199, 118, 97, -45, 42, -374, -115, -150, -156, 97, 13, 34, 249, 98, 41, 77, 103, -133, 138, -211, 99, -18, -37, 82, 76, 375, 15, -2, 153, -287, -212, -201, 83, -70, 84, -77, -63, 144, -75, 81, -339, 79, -35, 3, -108, -42, 120, -43, -97, -196, -49, -99, -156, -7, -5, -157, 188, -89, 0, 0, -235, -18, -28, -17, 147, 165, 87, -83, 76, 78, 28, 14, -120, -172, -51, 347, -64, 85]
7403H5o7pK19m02M6J42N9k05N4L47k91J87P4l11r1J26Q6j7l4r9J10j37q5L38M2
7428A69k81o1K03o9K85j82J70j53k10J50j5k09L33J30j62N1j58KKm8j89J07J55
7451B0j43K88k97K05j37J33j36R6L47k73o4J92m66K62l1o0k21M06o3j6M6n3j1
7474B4k9k2j34J6J74j6j56J37k50L06R4j1k47j23L03J98m54K09k56L62m3k3K22
7497B81n07K52j2o2r2J55l0P8Q3P1k46O7O2k72j69N30j33P9k6M9j24j30K77J36
7521C17j53Jj56K9K0n7K95k18k2N7M3j20j7l4Oj83J5K95J12j35k80M8n2K45p1
7546a5M3lJ76k43j17j80K42L0J94m05K63R0P1n0k06L54j13Q9j06k65R7r4K79k0
7570A11k3k02j7O1K04m4R9j66N6K6l37J64m2J61L30j79l37K41O2j51N9J35l91
$$ y = [85, 18, 11, 230, -172, -126, 16, 75, -130, -76, 271, -20, 167, 241, -70, -161, -35, 51, 34, 0, -99, 11, -126, -211, 127, 169, -112, -173, 30, -39, 246, 64, 234, 81, -129, 21, 6, -203, 130, 260, 98, 149, -9, -7, -5, -53, -242, -135, 20, -123, 165, -132, 73, -64, 69, -67, 29, 376, 103, 39, 231, -235, 27, -4, -64, -285, 121, 58, 42, 88, 35, 24, -5, -27, -161, -145, 29, 13, -143, -6, -256, 50, 144, 133, -114, -237, 66, 264, -190, 19, -237, 125, 82, 59, 281, -226, 26, 14, -48, -140, 15, -15, 63, 146, 217, -29, 38, 100, -172, -341, 189, 56, 135, 109, 158, 34, -96, 181, 317, 164, 165, 9, 38, 58, 1, 296, 78, 56, 113, 156, 36, 19, -15, -9, -192, -177, 118, 230, 95, -185, -137, -189, 56, -15, 28, 25, 201, -42, -159, -339, -97, -67, 127, -278, -15, 75, 146, 96, -110, 244, 131, 220, 114, -151, -54, -148, 131, 111, 88, -114, -131, -70, 134, 90, 189, 23, 79, 105, -232, -68, -110, 51, 381, 202, -135, 106, 168, 17, 76, 211, -180]
7593a80Q1L3P1J39k9r9m5K1o5J99j12j55L66j91Pm5j68K44l7m0Q4M5j29jK29k09
7619A4r3K34j71j8p3M8J62j09j59J92k00Q0K65o8Q4k20K19j52K6k9J52N6k61K6
7643Ek05M36j15M1k82J31J10Q2k30J75r6j11qn1L15k20K6K9J94j82j52J42k08
7666a74L6R0k0K4J43j20j23J57l8j08K88j75P1l10K74K0Nj76K41R7k87l2R2o9
7690i4K06np9j58K47N2j77j36K11M5j75J62r5r6J5K97m1j72J58o1q5m6k34K17
7714d4J12r5q5J54J07l1k29K28rl9j09m6k14K01K41Q2k39K0j07L1P0K01kj53O3
7739A08j88O3O6k34J08N5o8K15J1j56l8K60l03N13n19lj57L01j15J01m1J04l54
7762b71J81J58j58K3K32j76K05j98J72j70j24M18k03J63k66J05r9p9p7K97k62
$$ y = [-180, -99, -66, 5, 144, 115, 16, -29, -8, -73, 126, 14, -141, 225, 34, 41, -4, -172, 72, 35, -5, 79, 124, -5, -6, 223, 14, -79, 155, -16, -34, -107, -59, 103, -6, -165, 27, -173, -93, 172, 104, 188, -32, 187, 35, 61, 32, 184, 240, -21, 5, -200, 236, 121, 162, -120, 11, 121, 203, -27, 148, 52, -59, -67, -118, 197, -23, 3, 32, 226, 44, -108, 34, -174, -138, -48, -68, -44, 99, -21, -144, 13, -25, -133, 155, -20, 51, -259, 15, 35, 40, -136, 105, 202, -85, -117, -25, -94, 112, 107, 28, -130, 117, 169, -8, -144, 67, 112, -63, 99, 4, -92, -77, 220, 179, 7, 165, 104, 19, -27, -261, -44, 68, -27, -112, 42, 149, 118, -111, 117, 108, 69, -40, -86, -300, -99, 142, 224, -15, 5, -102, -71, -1, 200, 198, 45, 108, -80, -17, 49, -185, -77, -22, -90, 125, 136, -20, -58, 202, -101, 412, -107, -110, -267, 34, -81, 20, -21, 83, -271, -90, 68, -90, -67, 165, -11, 194, -4, 168, -2, -126, 292, 89, 252, -14, 91, -8, -87, -164, 133, -129]
7783a29O9J47k2Mk26K63k18K70q2k64J1L27k87O2O3J0j29J78l7n6k24J81J22N1
7807H4R6k32j65J70K08j59J46%j09r3j2J63j83K36m7p8Q8j61K64L0j70m29J37
7830b16O3J10O5j37J81j6P1j47N5R6m68K86N3K6O4k16M4N8J21P7m27M75l06K5
7854f3O2J32k18K9Q7J08j50l6k5O3N4j00K57k78K56j76L6J10j05j14J15L1J56
7877B31l84k4L55n7k05L9O4j70M62j91l42K65q9O6m2K2q1m9mJ82M1j21J2K9J35
7902A44j79M1J59j36L8l04K35P3J27n1M8j85j84J65n5O2J46l02J13o4J39l57O6
7925b61K26j38J64j07M15l18k12K78j46J0J01J11LJ76m88K65j38j8J52J47k66
7946d4LK20j08o2k5J93j46o1L6R4J57m10K56j02j63J04R4k31M82k14k28J86k31
$$ y = [-129, -60, 87, 65, 69, -157, 106, -112, 158, 76, -188, -177, 150, -137, -75, -12, -2, -131, 47, 10, -46, -270, -89, 33, 84, 180, -52, -217, -47, 161, 2, 148, 148, 39, -54, -66, 97, -86, 150, 103, 25, 113, -48, 216, 246, 76, -353, -216, -153, -43, 22, -115, 66, 50, 121, -26, 29, 125, -343, -57, -4, 22, 86, -130, -86, -28, 93, 170, -257, 218, -88, -63, -1, 131, -87, -58, 29, 137, -13, -49, -74, -11, 43, -57, 200, -78, 178, 2, 38, 148, 43, -71, 44, 75, 231, -153, -177, 178, 121, -84, -45, 19, -151, 311, 120, -222, 43, -46, 20, -22, 0, -81, -130, -134, 48, 89, -32, -20, 9, 144, -35, 6, 165, 29, 67, -237, -2, 71, 198, 147, 195, 10, -174, -9, -64, -2, 144, -158, -45, -109, 30, -327, -261, -35, -173, -9, -116, 299, -19, -231, 47, -99, -89, 12, 123, 126, 302, -186, 79, -59, -77, 75, 222, -44, -41, 179, 71, 9, -16, 177, 31, -30, 6, 100, 257, -153, 103, 1, -162, -58, 36, -195, 287, 73, -155, 31, -200]
7969b00K44m3K12k88J64j14K66l22J68j5l7J34k61K78j00j29o3j3J54J34j09j92
7991a32K26j71J95j77J16N8J31k96r3O4R5j00J65k29J58O7k55K30Q3k55K40k28
8013a08O0K67m11J07K18j82j0K0M9n5K25m2k61J24j93M9Q5L1K43m55K17j50K49
8036G7j29K01l36K02M3O7k64J22j11p7K88m9J16M9j03j48n5P9O7k0O8l8O1M6P0
8061B26j93j85M30k76J61m1j28Jl6J09opN7j99O0N3m9J61N8k52m7k05L32J5J9
8086E8k75J07J21J57j40r6J20o6Q3J23L4k89JJ96j39L5J94l06J54l8J3k15rM12
8110B35l10J44p8J69Nq8p9N2j81J45N4k27J8Q0m9K81j28j38K16r8M8J05k09L0
8134cp0q0K02j81J62j88K2J89p2o5j49M05j52lk89L79l62L14j1k05K84l19K03
$$ y = [-200, 44, 1, 213, -75, 89, -25, 241, -81, 87, 72, 35, 169, -92, 186, 86, -43, -106, -119, 35, 169, 60, -132, 94, -77, 118, -59, 57, 115, 246, -50, -143, -79, 16, -84, 81, -148, 10, 77, -178, 52, 135, -120, 120, -108, -48, 219, -192, -85, 133, -49, -59, -39, 10, -45, 180, 138, -123, 1, -192, -143, -58, -27, 216, -239, -22, -172, 77, -52, 149, -187, 15, 58, 125, -139, -17, -128, -205, 83, 34, 150, 199, 96, -52, -107, -28, 39, 19, 87, 49, 110, 156, 226, 33, -152, 278, 2, 163, 122, -6, -5, -41, 68, 62, 55, 112, -87, -27, 26, -23, 138, 196, -56, -103, -308, 24, 39, 58, -217, -110, 11, 168, 28, -68, 52, -14, 69, 192, 226, -63, -62, 134, -5, 30, 224, -82, 72, 34, 47, -168, -177, 235, -75, 69, -9, 160, 165, 77, -2, 50, -131, 14, 68, -159, -141, -61, -110, 171, 43, -95, 121, 23, 71, 176, -33, -3, -73, -153, 49, -132, 30, -158, -136, 53, -19, -84, -233, 172, 20, 17, -272, 107, -255, 59, 48, -157, 127, -192, 11]
8157A1j49K02r1j53P6j06J47M25l43J09j11j1j49J73l66L96k16J52j53L7J7R5
8179hj08K6P9Q4l19J86M14m10j02K97j59R2
$$ y = [11, -138, 64, -27, -180, -104, -210, -63, 362, 19, 128, 17, 6, -143, 30, -336, 60, -156, -4, -157, -120, -103, -8, -116, -90, -11, 73, -246, -60, 354, -56, -158, 139, -20, 72]
8191G2
$$ Imaginary data points
##PAGE= N=2
##DATA TABLE= (X++(I..I)), XYDATA
0@%%%%%%%%%%%%%qJ6j6J6j6K1k9L2m0M8n6O4p2Q8j04J19j35J52j73J97k23K53
35A34k84L19l59M03m50N00n55O16o83P56q36R23j018J121j233J359j499J653j823
54i56K012k226K471k751L072l449L902m452N138o026P222q933J1593j6337K7368
69A7648j00883l9630J80699L6444J6490L7951J0602n2293j1498m966k7555k0011
81D2998J1569m1157l4232R132k3001l8121K6859K8658K237N701K5886J2122j5322
94A3329k274Q794j5626O38M776j7640k410N159j6600q287J1997J4890m555K364
108e445K0579n742j2957P605p618j587R205j3542l136J3026m245l281J1894J3842
122A8598q51m529Q610n258j0449K991j2054l500J3212j4166r435J1574l289j0627
$$ y = [0, 0, 0, 0, 0, 0, 0, 0, 0, 0, 0, 0, 0, 0, -8, 8, -8, 8, -8, 13, -16, 16, -24, 24, -32, 32, -40, 48, -56, 63, -72, 80, -93, 104, -119, 134, -150, 169, -190, 213, -237, 263, -292, 324, -359, 397, -439, 484, -534, 587, -646, 713, -786, 867, -956, 1056, -1170, 1301, -1450, 1622, -1827, 2075, -2377, 2761, -3265, 3957, -4976, 6617, -9720, 17648, -83235, -122865, 57834, 94278, 110768, 148719, 159321, 107028, 95530, 90564, 63009, 42998, 54567, 13410, -20822, -11690, -34691, -72812, -45953, -17295, -15058, -9357, 16529, 28651, 13329, 11055, 19849, 4223, 4861, 9637, -8003, -10413, -5254, -21854, -30141, -18144, -3254, -7809, -5445, 15134, 9392, -3565, 4040, -3578, -5165, 4040, -9502, -12638, 388, -3857, -7138, 4756, 18598, 17747, 13218, 21828, 16570, 6121, 9112, -2942, -6442, 6770, -7396, -16831, -5257, -8546, -19173]
136a9173K734J4923M601n788J3391N907j4081M918J186j0091Q591O194n823k148
150E341M418l083j8151j17J0980j7660l48K1633o442l236J4574l032j0603Q52
164d874K403q607j412J8333j758o806J8894k555j5654P530p07j0165J108P281
178C011J521n317M694K937j3997K399O272j0190M705Q649o062k288K176n8n804
193g352o16J0089m049l633J0615l537m024N819m400J01N392k183M98K161K476
208G357k966o033P366j646p723P358O04m989L944m116k068K859l841k685K51L703
224b625K55m457P437M270r834L247L366o081K821J817m55J657J068J028m765L40
240i11N707r334l25R863m789o08P561j143k164j262n14l032l355N832k936m952
$$ y = [-19173, -16439, -1516, 3085, -2703, 10688, 16595, 2514, 7432, 8618, -1473, 7118, 13312, 7489, 5341, 9759, 6676, -11475, -11592, -612, -18272, -18620, 3013, -3429, -6665, 7909, 4877, -5726, -4874, -2471, -11078, -12490, 5843, 4085, -2721, 16173, 13618, -2036, 5494, 4787, -5378, -4270, 3011, 4532, -785, 3909, 6846, -7151, -4752, 1520, -8670, -3965, 4684, -1378, -3666, -1490, -1548, -7352, -7968, 2121, -1928, -5561, 5054, 1517, -2507, 3312, -1088, -987, 4405, 2222, 2720, 4881, 7357, 4391, -1642, 5724, 4078, -3645, 3713, 4317, -672, 3272, -844, -2912, -53, -3894, -6579, -6328, -2625, -2370, -6827, 610, 4880, -4954, -1707, 1659, -4422, -1601, 216, -239, 1418, 2486, 3514, -1251, -911, 4796, -4538, -4863, 5000, 211, -397, 7164, 6021, 3857, 2595, 2081, -951, -4306, 1526, -1410, -6362]
256f362R809k571q590O365L32m516J174K803K646r60K735K320n430K572J107q789
272e355N764M618o868J583L409j224l496j332M404k880j914N834l335m35N366
287D139n798j635L888m174j239J938L684j78l452M842P3n557N536l33l538O332
303D528n53k855L037L56j258l792R27K463o097K387L541n606L119J318n194K865
319h14J389k514n26R91K744m290j308O357l594j830N541l325P8L437j884P44O63
336A859L28j109j834M750j100n207N504j333m763M315o41k751J807n67k02k057
352c001J594K633m739K471L121n376K492K764l518K277J070j506l73L5J772l104
368a388m95O015l875j578O085k870j889K312k295q44k30J80J096k436K671j223
$$ y = [-6362, 3447, 876, -7714, -1349, -1017, -5533, -4359, -1556, 1090, 130, 2865, 5185, -245, 2327, 3434, -5355, 409, 5027, -1841, -258, 3151, 1927, -1569, -2901, 1503, -1377, -3291, 2543, -792, -1227, 4139, -1659, -3294, 594, -3580, -4819, -2881, 803, 625, -2827, 2015, 2088, -3469, 2067, 1734, -1804, 4528, 3975, 1120, 4157, 4513, 3255, -537, 390, 2853, -3244, -857, 2684, -2922, 197, 1515, -3679, -814, 575, -1939, -2465, -1474, 1270, -3020, -4328, 2029, -1565, -3395, 2146, -1179, -1101, 2336, 452, 1196, 1859, 2187, 1078, -756, 3994, 2894, -2313, 3191, 1858, -2905, 1410, 769, -1982, -175, -742, -944, -3001, -1407, 1226, -3513, -1042, 2079, -3297, -805, 1959, -1559, 718, 1788, 282, -91, -56, 1716, -1388, -1883, 4132, 257, -1321, 4764, 1894, 5, 2317, 22, -822, -1052, -872, 224, -2212, 459, -764]
384g64m301M353q85m280L969J78r38J993J079J940n75K80K898l773N83K291m316
401b68J251J193l491J718L21o93J362r15R73j231o49K787l807r31L899m206n59
418c246L233j998R50N7m86N64j098J865o14j281N001k344l714O005j112k648K987
435B121K55q60r34P38J138l846L048J778n421L720K197n578J607K151k238k443
451b567K19J686k334j025M397l683l76O639l090j364M673j088l136k5L039m05
467A560l964M120J553n236K899R15k936K039q18k830o36O05J495j941J727N215
483C767l763p57L823l243j296O20p29J275j089P87J429j352K174J37j734K996
499C045n61q78J246k898Q32O10l083K884M88l147J47j387m2l88l05L785m93p70
$$ y = [-764, -5065, -712, -1597, -5877, -1908, -1730, -2668, -675, 404, 2344, 1769, 2049, 4947, 1174, 1757, 4048, -268, 983, 2176, -1315, 403, 724, 31, 1393, 478, 1451, 220, -429, 2358, -1449, -2380, 1519, -2687, -3246, -13, -2011, -1061, -1004, -1490, -926, -2024, -159, -773, -2054, 2947, 603, -3111, 2894, 1782, -866, 2121, 2376, 1516, 582, 1320, 2458, -1388, 1660, 3438, -1983, 1737, 3934, -1644, -37, 2114, -124, -2567, -2348, -662, -2996, -4021, 376, -3307, -3683, 2956, -134, -1498, 3175, 2087, -1049, -1074, 1965, 1560, -2404, 1716, 3269, -1967, 932, 1847, -1089, 950, 132, -2698, -3334, -2729, -1234, -3175, -1448, 3767, 4, -753, 3070, -173, -1469, -849, -1578, -303, -1392, -605, 824, -528, 1646, 1783, 49, 3045, 2484, 1606, 2852, -46, 786, 1396, -1687, 1197, 1685, -1462, -1315, -2702, -2744, -3132, -3437, 348, -145, -915]
517i15K673l565j002M409k129o83K406k80k568k357L860L14m928N039L321l793
533a98K290J000k137j69J209j65k725P93K585o218j010N880l652p03O581J92l071
550D82k47J578k479k656N104o1l974L981j46n446K868K092k395L33K069P54l706
567a849R84L474l048O24L970l156r44P56k806j600J9J993P82j541L270l34l833
584c239K455Q28j267J426M09J430q58k046J747n8m25K863l32R6L70k104N44r70
602H69p41J436k465Q9J707m160m58J895m43J02J272K642q06l533L056M28l857
619b967L388J779k707J061J71j466k40J433K601l424J147L418m999o72M131k216
635D38j176J845O69k302j851K749j389k199M568n62l577M653M76m165J095J322
$$ y = [-915, 1758, -1807, -2809, 1600, -529, -1212, 1194, 914, -1654, -4011, -151, 163, -4765, 274, 3595, -198, 2092, 3092, 955, 786, 1995, 1830, -895, -102, 2483, -3735, -4745, 1135, -2517, -3220, 3361, 3553, 482, 235, 1813, -666, -3322, 1782, 1721, -2253, 1728, 1582, -3864, -996, 1096, -1299, -966, 1103, 1857, -1849, -865, 2609, -439, 185, 4155, 999, 55, 811, -1995, -3595, -3576, -1583, -801, -2342, 928, 594, -3239, -784, 44, -1223, 203, 612, 2042, 1184, -862, 885, 827, 402, 3265, 2933, 3029, 3399, 1295, 1839, 869, 128, 1564, -901, -812, 895, -3265, -3723, -1828, -2271, -2169, -897, 1745, 939, -2594, 462, 890, -2967, 421, 2200, -507, 554, 725, -741, -981, 452, 3053, -371, 776, 4194, -805, -1477, 2654, 438, -738, 1107, 1776, -526, -2377, 372, -1017, -3216, 1352, 790, -2787, 1866, 2342, -1823, -728, 594]
651E94l66k186J978K169m075K85K672k497J316K171j473O43L91r08n18n60K560
668B196j210k655K958j383l360J940O90j76J65n65J497r19j179J251p04J154J189
685H89j655J802P95j629L96n43L13J383j539J044J033j562j10j095J097N86j982
702g77J313l9k256J659j196j198K107m57o16M74O30Q78j944O37K614k315m04K472
720A582j335M21l7m15N39l84P79m84j042K437j563k517L304m27k701J363N46j91
738a25j332K64J667j952O07Q82k254J578J424k183J456J042j291J63K97R78o14
755F07o62K324j522j142J909j305k47J661j636J7l5l45N71j557Q63L86j663J410
773c66j87j243J758j203m93J332n23Q47M7M24J031j607K58J500j377O69Q83j448
$$ y = [594, 228, -1958, 20, 2189, -1886, -1601, 1071, -1426, -110, 2061, 588, 1231, 1622, 714, 196, -364, 2196, 986, -1669, 1289, -94, -3454, -1514, -824, -1000, -835, -1400, 97, -822, -2001, -750, -1454, -300, 889, -766, 1036, 1831, 202, 598, 55, 368, 1751, 212, 1256, 2289, 727, 617, -478, 619, 1205, -777, 536, 497, -1759, -100, -1296, -2494, -387, -844, -1460, -986, -356, 522, -1422, -785, 1829, -486, -890, 1582, 247, 668, 631, 216, 755, 371, 1150, 666, -376, 2061, 498, -2019, 1285, 858, -1843, -480, 66, -125, -1457, -1193, 474, -1478, -871, 11, -2243, -665, 759, -1424, 32, 1074, -217, -54, 243, 1221, 607, -55, 2269, 747, -395, 1514, 209, -38, 1623, -13, 4, -31, -376, 195, -1362, -499, -113, -1776, -366, -553, -1796, -38, -1241, -1734, -402, -925, -78, -31, 393, 1424, -183, 75, 1575, 198, 867, 1750, 302]
791C02J288l93q16Q62j059q1j17q61J452j231n19K164j957l71J414j345L69L74
809e25j21P17r23Q11J84j162J196l27p63K335o30n15J475j001o9l89o4Q32j218
828a57L52R58j962M89P05j841J081L37j003N59m51L61q7l21J139l99j65J423j165
847a47K24J019j371K54N45n9N96m86N77K96k002J781l71r31J030q23q70Q85j551
866a404J37L49m09J091j190J077P44j920R57Q43j176P94qJ3J117r40M70L96m56
885D85N54p99J51J350j378L7P14j193M94J13m13M22j119J71k9q09Q73o33j062
904b071K156p84q1J849n94J20r2n25O50o46O24L41j222J337j8j979J284O14j145
923a82N57l08M23n59o96J341j134n58J453j744N22J413j487j32Q46j62j48j77
$$ y = [302, 1590, 1197, 381, 1243, 184, 103, -14, -875, 577, -654, -1173, 991, -966, -1337, 77, -1268, -899, -525, -646, 71, -852, -41, 143, -1019, 177, -150, -913, 1422, 792, 277, 1752, 751, 682, 293, 229, 1061, -157, 195, 1153, -809, -320, 385, -1456, -375, -38, -1041, -482, -933, -572, -659, -980, 159, -240, -405, 1018, -147, 77, 1096, -275, -21, 524, 465, 1061, 575, 1152, 1448, -554, 1227, 856, -75, 955, 132, -738, 147, -1404, -1267, -918, -1327, -236, -1426, -349, 395, -1525, -568, 275, -901, -107, -115, -102, 1015, 75, 545, 941, 485, 1039, 240, 391, 1741, 363, 400, 1114, -79, 415, 528, 115, 537, -582, -411, -440, -1249, -376, -1009, -2071, 85, -699, -780, 1069, 475, 595, 503, -22, 628, -18, 606, 947, -275, 1062, 1044, -935, 349, 963, -182, 375, 67, 490, -69, -765, 576, -558, -1116, 337, -1407, -885, 528, -959, -1091, -245, -407, -555, -732]
941g32J145N27k084J807O02j446J745o6l71J25q54L74o77j62J211q73k49J264
959A286j642K1N06r01P2m29L5O12j095Q10M99j212J090J38m38O60r44Q93j94l65
979e98J474L06r67Q52l87o22M67lP14r37j72J195j682k77J413j463N31Q84j085
998c57k24l56M20k66o78J920k87j818K155o1j706J327P27j35m22M46J094k319
1016e40K9J911j900K59J936j597k65J004j284l44n74J400l33j393K052j64k569
1033b372K255O35r06L22M69J20p29j61J367j561O39J835j675L24O19r74k94L1
1051e6K29M35r50J216l53k162J279l25o69J569Q3m23k89n32N14o44Q2K025r47
1070H2n80Q71p65J40j67L40J326j079L67O75j674Q95Q14j367R75O87m34m47o77
$$ y = [-732, 413, 940, -1144, 663, 1265, -181, 1564, 1498, 1127, 1252, 398, 772, 95, -67, 1144, 271, 22, 1286, -356, -335, 171, -730, -658, -1087, -1052, -440, -1535, -725, -226, -1438, -348, -210, -648, 12, -932, -39, -233, -598, 876, 1182, 215, 1067, 680, 58, 525, 522, 1236, 299, 127, 1322, -360, -637, 776, -687, -156, 728, -357, -581, -937, -517, -783, -1461, 459, 172, -1646, 509, 448, -1258, 69, 796, 661, 239, 685, 1779, -540, -511, 1400, -500, -241, 1695, 98, -167, 837, -447, -791, -1365, 35, -298, -1691, 361, 197, -2372, -117, 518, -388, -66, 403, 523, -206, -367, 1000, -561, 78, 1913, 238, 562, 1181, 207, -87, -56, 173, 608, -342, 874, 521, -1641, -362, -687, -1356, 213, 296, -127, -416, -948, -434, -1078, -996, 1029, 82, -498, 373, -392, -252, -419, -79, 1247, 168, 535, 1210, -464, 431, 1245, -122, 853, 1540, 1106, 659, -18]
1089a8N04j036j155K311l56j509J322j55j261k26R39M68k92Q50O95k453P30J635
1107I93j703P54J599m50j034NP17p92p77J999m16j503J788j035j548J632l08o62
1125g41L8R25J76j769P58Q97j758N55J792j159N30J53n82M23n13J077j11p50J484
1144A425r92j266J304n7n45N77l4K36j013k15J037j351L02J024r28J33N18j087
1162i32L10m82O77K84n56Q67M90j147M14K2j41P47k17N31j02q90J046o07o07J553
1182A260o93p19O01l43k58n80N53O12j377O98P71j886P80M56p13N53N4M70k52
1201a3k66Q48n26o38J485o89k90J044m91n23L19K19Q3o69N28M78j505M89O76j656
1221a097Q04M30o48J0nL3L1n64J331p03jR55o98j04O07o04J71L17p4M59m72M94
$$ y = [-18, 486, -550, -1705, 606, 250, -1259, 63, -92, -1353, -1579, -640, -172, -464, 386, 1081, -1372, -642, 993, -710, 44, 1643, 1193, 159, 164, 881, 89, -688, 1311, 895, -608, 1180, 145, -1403, 229, -79, -741, -703, 222, 398, -1371, -613, 284, -1474, -919, 873, -286, 244, 397, -185, 238, -275, 802, 691, -59, 1425, 433, -833, 471, 414, -131, 446, 412, 648, -365, -580, 457, -894, -592, 432, -496, -363, 155, -932, -622, -1104, -427, -143, -699, 168, 658, -489, -75, -53, -194, 553, 336, 867, 765, -125, 921, 314, -293, 1260, 567, -152, 449, 106, -152, -732, -179, 433, -944, -246, 525, -1361, -581, -125, -838, -285, -231, 239, -13, -279, 569, 43, -595, 890, 201, -89, 955, 464, -59, 260, 479, 562, -107, 421, 899, -606, -117, 559, -1097, -293, 137, -511, -501, -506, -473, -442, -1006, 325, -378, -379, 576, -122, -226, 381, -223, -52, 265, 191, 650, 178, 672]
1243F72K11r83O33L71q63N42l41l85L00r85N30K79q38O38m38o4L91n87P76J91
1263E0r12J010r5l95Q84p20N46M59r95Q31j78l83N83r46P66M12j342O04M56q74
1283b39M68l46J96J13r06P93k78n14P41n95m0J150r76J04L82l29L90m14K89N55
1303E44o23P30J35p58N08O9m87K92k55j77K35o76R13o72m32O33o04J88L10o85
1323h12P98k74l56N99j11P7L4n74J033m33o85J269m82j10O35n89M32m1m46P27
1343F91l47l47M53r61N91O0j021O96L8o16L82j71J52L38m63N88k73j59M39l46
1363b76Q9O13q09O09J56m05K57m4J2M5nM81m59l71J036o71n41O74k20m16L38n24
1385d31J45m55K59L45l86L02K17q16J064Qp96Q56l45J19m3j34P39n28J16K92n09
$$ y = [672, 883, -100, 533, 904, 41, 583, 242, -143, 157, -828, -298, -19, -857, -219, -657, -721, -330, -917, -141, 50, -862, 148, 53, -342, 542, -178, 368, 827, -168, 663, 485, 102, 685, -261, 505, 917, -425, 179, 635, -239, 229, -117, 79, 192, -714, 79, -199, -713, 28, -567, -607, 543, -433, -329, 53, -276, 114, -300, -11, 544, -79, 651, 786, 28, 536, 605, 118, 410, 155, -22, 213, -463, 450, -222, -654, -21, -625, -437, -127, -812, -14, -288, -644, -45, -156, -79, -45, -619, 414, -19, -704, 565, 83, -27, 608, 19, 451, 410, -36, 691, 344, -3, 450, -511, 80, 140, -881, -185, -147, -763, -381, -552, -400, -62, -525, 63, -210, -369, 70, -276, -187, 426, -383, 226, 382, -23, 234, 190, 202, 247, 242, 723, 264, -107, 929, 258, -283, 391, 171, -245, 93, -431, -286, -741, -482, -137, -523, -221, -4, -820, 244, 252, -544, 312, -33, 86, 43, -91, 648, 120, 236, 528, 19]
1406A9j3O73m98L13N3o01K79m73K66K4p00M25l34n25J153m28k20O19k05K8Q2n5
1428a18M61l25k78J056j123L71O06o02M63l65j27L08m55J27L36o68P78l64o65
1447e84M07n62K46n2o7M70m75o8R44l99l04L68k5K51L43j79K77q52M20K15l16
1468E8J23M11o23L14L2j78o0l24P11j93o77Q79o90m61Q73k99n45O30j69K0l89
1489e57K12Q57j313P43O40r11L47L75o32L43J47M86n10K3P58m18p28M08J16n39
1509a53L80o0l58J6j32j25k91K28J020j437N48M02o79R8O41j97M16p31J004j85
1529D05p26N97P1n08R16L3m12L02n61J69q00L87R07p82m8M09r27j69K51J66J27
1550a93k71K57K90q99M58O18j050Q78L85l52o3k34K55j48p3J059o34m53J295q72
$$ y = [19, 6, 679, 181, 494, 547, -54, 225, -248, 18, 42, -658, -233, -567, -1092, 61, -367, -587, 32, -173, -145, -63, -118, 343, 18, -260, 796, -327, 44, 650, 48, 511, 146, 19, 327, -128, -1, 335, -333, 445, 81, -584, -177, -739, -493, -545, -612, -142, -617, -685, 259, -140, -444, -76, -101, 150, 493, 314, 591, -261, 159, 374, 58, 181, 592, -31, 283, 315, 137, 77, -247, 464, 271, -406, 473, -217, -678, 195, -104, -649, -19, -188, -168, -557, -345, 512, -801, -58, 582, -329, 18, 393, -239, 104, 251, 737, 227, 250, 1008, 590, -138, 270, 386, -153, 227, 167, -191, -175, -307, -432, -723, -495, 525, -912, -364, 38, -641, -543, 98, -99, 317, -414, 590, 405, -321, 276, 347, -161, 755, 788, 376, 678, 117, 286, -514, -127, 780, -2, -50, 359, -568, -737, -486, -320, -193, -464, -207, 83, -816, -358, 260, -790, 88, 473, 121, 58, -176, 79, -69, -142, 917, 283, -170, 1125, 253]
1570B53m78O47m14K14k15J13K19j141O26J85q71M65P46n72k28L71O9j64k43Q78
1590D60m88J07J000j035n22J151l50m81O57K00j69p09M99N3r53M93J010j356M85
1609E2K58r14J6K77K96j71k62N56n69l53R21l02M8M07J70ro00K38L89q20P22M25
1631G75n62K30K51o49j82N10j99k01k17P14j95j131P35j90n54N22L55q0k16J1
1651b73P4m58J55J054m63r0N74n53p3m3L67L83n99L94r6o53L02K85o20K65M64
1672C96n31j47j37K46l05k42Q56n99NO73m91l85N46M1j04J0L54M9o06O45L79j127
1694d74P96J70m14L90j74j99k84J47K38k21j54M25l53m68O94m60J1K41j60M17
1714A68o34L11K18m88M93J84o19M42K29k44J56oK30j11j60M05j02n17K70k23N9
$$ y = [253, -225, 422, 8, 222, 7, 120, 339, -802, -176, 9, -862, -397, 349, -223, -451, -80, -11, -175, -418, 460, -28, 79, 1079, 44, -478, 673, 323, -158, 499, 699, 530, -179, 320, 373, -580, -87, 923, -433, 52, 310, -604, -588, -311, -15, -186, -448, 108, -461, -814, 107, -195, -147, 260, 430, 421, -179, 59, 448, -372, 350, 775, 213, 443, 694, 45, -137, 373, 174, -27, -244, 470, 275, -856, -121, -311, -865, -343, 12, -68, -284, -273, -199, -657, -502, 552, 89, -1, 573, 20, -53, -96, 271, 654, 55, 449, 353, -300, 2, 287, -333, -68, 396, -135, -282, -419, -173, -478, -720, 136, -463, -458, 215, -276, -661, -115, -74, -178, -168, 186, 235, -371, 274, 653, -474, 322, 492, 78, 468, 294, 95, -189, -42, 196, -25, -179, 246, -107, -575, 119, -341, -330, -89, -249, 168, -466, -155, 63, -425, 68, 252, -367, 75, 304, 60, 216, 210, 440, 329, 169, 574, 472, -45, 225, 2, 61]
1735F1K34k86K85l78l12L77m56L23K17m30M16k02q2R3j97L98O7n44R28n25j88
1756b01N55k54j13M34m18L45k05j85O54n88p3M02p09K2L16l67L08k29j34M64m48
1777d24J57J92n90Q05R6m83O86o17Q0M30k03K96l53K3L14l29j40M70k81O3j23
1798F9k73K28k41J76m2l07K49l19n3L98l95K5N99l49J70o2k14N79k04k47M00k58
1820g1L12K45m46N27k94k90N45l51J45r9l00N49n68p8J02j80J68m8l82M55p6j46
1842b81J17J7M1K14m71M83k37J08J13k97PM35j91K86L96p50M68n46M33K5l81k2
1864c3M02p46K71j59j35K68m06M04R7j32R5L60n91O90l54k02L99o41M46K01l89
1885a55L56j20J67M6k97L08j76l5K60k58j12L85p07J57K2k29L41k93J67L9k54
$$ y = [61, 295, 9, 294, -84, -396, -19, -475, -152, 65, -365, 51, -151, -233, -140, -337, 61, 128, -416, 512, -13, -201, 354, 100, -13, 421, 3, 348, 143, -42, 612, 24, -49, 353, -356, -334, -18, -385, -77, -306, -440, 24, -424, -267, -75, -665, 140, 236, -247, 439, -178, -98, 332, 129, 425, 72, 95, 409, 80, -60, 410, 129, 192, 69, -204, 24, -217, -41, -83, -390, -141, -460, -513, -115, -510, -485, 114, -235, -65, -127, -341, 238, 34, -213, 187, -71, 241, 486, 40, 567, 273, -17, 528, 177, 322, 223, -77, 472, -96, -174, -72, -252, -84, -132, -514, -59, -135, -281, -164, -147, -106, 108, -363, 120, -117, -9, 104, -193, -186, 249, 58, 344, 740, -10, 458, -88, 345, 370, -11, -33, 369, -377, -106, -265, -400, -132, -538, -134, -37, -169, -74, 286, -305, 385, 31, -171, 228, -413, 33, 234, -155, 201, 81, 248, 294, -3, 305, 129, 94, 354, 96, -16, 369, -338, -181, -159, -388, -47, -340, -173, -134, -388]
1906c88L15J45m23O19k52m4J0l21M42Pk29M58Ml25O25n57L15p0n8N9j27l23M32
1929C14j56l77J92m29K57K13k32L26k27j03L9o7j4N43l33j74M07k58K26m01N60
1950C06o3j60M21l24k01L79l33K08O9k77o3k01K10J62l45P3K38p19P29j54l90
1971d35J80K05k97L54m44N55j94l24P44m08j00M84J94l93J97l21L19k77K49N8
1991C46m93L23P6m42o4M08l15J90j11K5k03k94N35j60m20O69l07O6J67q6K87l70
2013a73J73L21m48L81K60p94O77Q6o77L76o6L61k05p06N64j44l60M31R1l58K00
2034a0k86K99k03j26L61k97j04O60n98k3O53o04N24J9j2K05l76K85J69q17O12
2055C31J20p73M59j73j90q3L36L1l70L38J82n82l63P94j46j61M30n9j88m4J57
$$ y = [-388, -73, 72, -351, 268, 16, -28, -18, -339, 103, 110, -119, 339, 343, 18, 643, 86, 401, 331, 273, 332, 205, -118, 314, 158, -219, -27, -456, -199, 14, -218, 108, -119, -222, -183, -250, -264, 279, -54, -228, 179, -79, 147, -254, 306, 243, 83, 504, 180, -21, 358, 25, 233, 302, 25, -38, -239, -29, 133, -212, -139, 99, -620, 109, -45, -435, -255, -50, -347, 7, -437, 118, -76, -400, 344, -64, -164, 320, 514, 121, 318, -3, 316, 39, 288, 346, -147, 176, 252, -190, -254, 154, -161, 29, -82, -57, -260, -554, -19, -179, -599, 70, -237, -171, -4, -90, 197, -173, 0, 321, -127, 254, 514, -280, 397, 483, -194, 182, 116, 477, 272, -434, 130, -14, -374, 57, 148, -210, -10, -296, 3, -200, -326, 35, -262, -366, 294, -304, -327, 326, -278, 246, 265, 253, 458, 82, 367, 536, -281, 331, 451, -322, 137, -36, -226, -309, 27, 58, -312, 26, 208, -374, -737, 57, -89, -250, 180, 121, -67, -111, 46]
2076D6k5l11N02L07n34N72k90l89L40j27j00J59P3L28p44k24J028q52n6L82k43
2097a58R2k84J20K34m19L93L76m69R0J66l68K42J78k90J73M42K65m16n58O36j04
2118C41p39P78j60l52L28l76O1m36K93P83r12K98K60n32o4J74rR2K42K55o06n8
2140c39K09K88n82J076m07j98L00k12q0p9L3L74k62k43R03j070J22J57j89j32
2160c31K35N2Nn71M18q0k51O33k46k10N39Jm23K83P2J47k11R6L60o59J52P9n8
2183C2n2J16L8Jj7J40j23p15M14N23o14K64P1m38L2J12K57L3m66K98p7j33M05
2206A01k52q9M74o8n4j88OK62k28K18J89o99K88L04l34q4j15L50ql84P5l6j84
2229d56L46J6k94L21k35R8J48J21J13o37K64N00l67L24m8j93j25R9l1j3m2L23
$$ y = [46, 21, -290, 212, 519, -15, 557, 267, -122, 218, 91, -9, 150, 223, 551, -193, -417, 611, -241, -297, 85, -158, -66, -350, -230, 4, -415, -22, 354, -115, -25, 141, -227, 15, 193, -97, 76, 518, 783, 367, -191, 445, 341, -398, 380, 220, -132, 196, -180, -119, -555, -262, 521, -391, -93, 167, -365, -429, -255, -264, -172, 70, 325, -281, -339, -130, 158, -424, 652, 245, 47, 347, 135, 55, -24, 9, 383, 121, -122, 781, -289, -167, -10, -199, -331, -96, -44, -39, -610, -192, -272, -523, 110, -136, -346, 193, 194, -229, 54, 126, 273, 62, 158, 518, -141, 11, 90, 32, -20, 96, 134, 135, 118, 258, 135, -580, -166, 357, -257, 7, 78, -360, -328, -216, 41, 74, -392, -94, -171, -304, 101, -151, -240, 234, 166, 112, -76, -70, 192, -36, 182, 371, -328, -40, 264, -70, -154, -269, 81, 73, -311, -236, -272, -456, -110, -94, -388, -67, -302, -204, -56, 65, 178, -459, -195, 305, -62, 262, 214, 21, -104, -5, -36, -49, -91, 232]
2251B32k88l35L27L4j08L33l56NK22l60M23j72j63L51j04k12J29j68K71J38m29
2272b30L37q1P1J53p6N8l5j59K15j26j57K97j78j29J57l78K54k48n2N0J54k9O8
2295f4m64L05K4j23O68o15K34M3j42L42L45o66L75k15R6J48m51L02j17m31L59
2316d7N3j01R4k91N27k02m81N53j00m58N07l45K27o7J35K8J03j42J95k91M95j57
2338B35n78O22k01k62M65q0n9k24P4n3M7J8r2J50o6m0o6J99o5l13L97k26l68M36
2362e0n8Q6k0l73L64N3j94M43l39L90j09p4J18k05K29k2k02K40n07n4L71k06l43
2385d62O05k29p1K99m08P5J51k98L55j92J35J51l70J73K00j12J82j44j14K55k40
2406e9L56k02j00P0j91L6N24o90L83j44k70L92l83ML44j9j22rp1L38k83K5K10
$$ y = [232, -56, -391, -64, -30, -138, 195, -161, -156, 66, -294, 129, -43, -206, 145, 41, -171, -42, -210, 61, 199, -230, 107, 26, 97, 250, 174, 232, 197, 38, 253, 127, -30, 267, 89, -40, 117, -261, -7, -255, -307, -257, -103, -132, -64, -528, -223, -199, -322, 346, -269, -35, 8, -134, 208, 553, -113, 262, 47, 143, 291, -160, 142, 25, -406, -47, 6, -95, -1, -292, 235, 33, -448, 105, 5, -453, 54, -291, -64, -131, 4, 32, 135, -7, 188, -103, 392, 235, -343, 279, 78, -184, 281, 201, 142, -82, -8, -61, -14, 4, -88, 62, -4, -44, -110, 89, 24, -289, 108, -118, -486, -50, -108, -22, -42, -415, -51, 2, -192, 251, -88, 302, 193, 119, 237, 32, 261, 239, 37, 277, -230, -284, 87, -119, -462, 143, -86, -157, 142, -266, -191, -40, -338, 17, -175, -40, 111, -259, -86, 114, 2, 184, 40, -74, 181, -59, 297, 95, -5, 65, -126, -90, 434, -256, 127, -17, -287, 105, -278, -274, 70, 51, -71, -80, -151, 187, -96, -71, 139]
2429A39l74K88J54n03L15j39J62J37j22K18n4m62O46m72r3K6M0N8J54j27J16j3
2451I4r8O1l34k7K81r6M5J78k09j0K7QL09l81M76k86OJ37j54%J37K2r1N9k17J35
2477G2q4j38L04k74J67K54k99k47K54j18Q1j35PK14n63N41p2J13j42L7n8K99j62
2500E1J87j87l39N48pj38L59m05k06K46k58L22k72K3K38j56m7m3k67K25J97j39
2522f8J1l14K51L2j83L35J51l19J18j08J8L62m58J84L21k39J85l88q8L85k7n7
2544A04P2l09o9J19K40j14l19K89j3N1K51m37k79L51l8M9K51j21J11m16Q0M99
2566C52n93L60K00m28P2J15O3j35m1l7K54m60L00J5l52J74J57K3q2P5j76N9k9
2589a14J68l65J01L83J91l34k5m9j15L17r1K62m81K23K80m89K29P3k12J20j54
$$ y = [139, -235, 53, 207, -296, 19, -120, 42, 179, 57, 275, 221, -241, 405, -67, -160, -134, -94, -36, 118, -9, 107, 94, -4, 57, -277, -304, -23, -119, -74, 104, -105, -115, -88, -80, 229, -152, 324, 38, 44, 181, 27, 27, 164, 186, 95, 154, -63, 72, -12, -150, 154, -120, 47, 301, 2, -245, 9, -109, -28, -163, -156, 58, -505, 36, -36, 77, -65, -28, -86, 213, 51, 238, 51, -288, 260, 253, 115, 474, 69, -137, 109, -149, 173, -99, -76, 162, 6, -41, -84, -351, -126, 71, -68, -57, -371, -120, -88, -271, 64, 215, -104, 14, -94, -76, 286, -172, 12, 333, 94, 279, -109, -197, 188, 161, 104, 176, -133, -202, -83, 157, 43, -276, 13, 0, 51, 302, -135, -414, -63, -101, -52, 199, 78, 189, -227, -147, 352, -241, 119, 319, -109, -37, 78, 141, 6, -35, -72, 182, -278, 22, 37, -315, -141, 16, 39, -43, 32, -144, -85, -114, 54, -311, -210, 173, 364, 30, 5, -44, -159, 158, 67, 329, -152, 71, 351, -138, 91, 164, -48, 72, -82]
2610h2L68k28k31k01K08j49M02O1k83J83j99o2K02J08M5k4o1L34l62k7J65l36
2632a69L66Nj69J09l93L15K7l06L49q7m23N09l37j73N83k7j29J27k62J58m62N4
2654c35M25k81J1K77j38P9J36j63N7j15K81P9l32K47j54j92J6L8q8J2J13R8m7
2677B4l76N45n03J50K40j00j9J19q5j05p7O9L15k73M0J2l33N4K59K94j21r7J47
2700A79k84J20Q8k09o3L54k71j60J62K75p1j54N6K40n38M22N5k40J81k64Q2J07
2722F7M7J48j64j76M05j24k15K99k09n6k8oR9k32J0L50m63j3L56k96J06J41j27
2745h1K90k96q4K31k40J10m1m56O87l05J77K65j06k27J4J88m3n2n2L26m47J90
2767D8j30J88j09l9p9J69k63J04p4q4J74l00L64j28K15j0k52J81K07Nl24K45K7
$$ y = [-82, 286, 58, -173, -374, -166, -315, 87, 148, -135, 48, -151, -213, -11, 97, 142, 118, 57, 391, 29, 2, 167, -169, 197, 202, 33, 142, -251, 64, 91, -215, 134, 47, -376, 133, -204, -377, 206, 179, 50, 177, -85, 73, -389, -335, 90, -191, -180, 97, -41, 38, 174, 11, 68, -47, 234, 313, -19, 228, 74, -118, -102, -64, -152, -140, -27, 71, 24, -352, 193, -310, -160, 80, -20, -39, 80, -5, -110, -187, -118, 197, -76, -36, -24, -357, -303, -44, 250, 129, 32, 179, -105, 15, 103, -106, -169, 185, -86, -246, -84, 191, 120, -34, 22, 262, -276, 146, 201, -39, 142, -122, -40, 67, 114, 262, 98, -78, 327, 203, -12, 287, 78, 22, -6, -12, 87, -145, -135, 215, -248, -261, 95, -201, -95, 46, -81, 209, -87, -171, 60, -180, -70, -111, -567, 120, -185, -8, 257, 151, -76, -62, 126, 83, 31, -21, 305, -142, 48, -82, 106, -3, -42, -121, 48, -215, -111, -185, -269, -95, -395, -31, -159, 56, 46, -206, -25, 182, 187, -137, 108, 135]
2790A35o1R1j61J15k33O2J36k35P2J82j48J98Q9l56O0J48k19j59N19r9k65r5L23
2813I9k34N2L14n73K26K00j33k34N83k97j5K95l27K43l73L53M2l22J53lJJ42k82
2836i0J94j50j35K70l18R8K66l46J24J47k86K4K51n8L05l83O9J74q0J9J06Nj52
2859E4L9j21qj34M19l91J72n9j4Q0O5o5k23J47O4M6k34K73J51q4j09jj57j4J86
2884H2r8K31k69J77j14m55N93R6l03N8J12j32K8L3j13N5OK32k51j19J41j54J75
2907A1j8N6P4l44K37J52k77r8K26M7j78P5K23L4j62rK02k03J09J54l5k25l6j55
2931a40K98k90J31l0q2K19l28K38q0j38J77J92k83K05j59o4L35l47K24q6j52L44
2953A84j57k4K02k46N1lJ0J80k99K70J08l19j04M58n57K71Kj22K2j34K6K2j7Q4
$$ y = [135, 74, 165, 4, 119, -114, -52, 84, -151, -79, 103, -45, 153, 242, -114, -54, 94, -125, -284, 235, 136, -129, -224, 99, -135, -83, 231, -342, -116, 84, -49, -283, 300, 3, -12, 283, -44, 199, -174, 179, 221, -101, 52, 49, 50, 192, -90, 104, -46, -181, 89, -229, -131, 135, -211, -87, 60, -226, -202, 49, -9, 296, -87, -18, 156, 76, 95, 201, 206, 54, 93, -28, -36, -170, 249, -142, 30, -29, -43, 37, 102, 37, -186, -39, 25, 71, -163, 110, 261, 177, 68, 67, -90, -104, 82, -16, 215, -54, 123, 9, -446, 147, 243, -60, -2, 110, -22, 6, 39, -74, -19, -13, 219, -32, -151, -10, -164, 11, -7, 49, 123, -221, 16, 168, -109, -207, 19, 66, -112, -37, 186, 220, 58, 49, 251, 48, 157, 311, 276, 51, 15, -140, 158, -132, -1, -31, -113, 106, -222, 16, -64, -202, -25, 167, -116, 89, -70, -134, 201, -146, 78, -8, -160, 184, 27, 3, 205, -41, 10, 7, 17, 197, -102, 168, 276, -43, -147, 311, -246, 25, 27, -95, -73, -207, -181, -159, -176, -92]
2977i2J71j53K45k64M5M4K25j05Pj5L1M3l85J75l8J24R1j49L3N9j16J09l46J52
3001a09K43m71K59j24Q8R7k22J86J1J3Kk94K03L9KJ82K58k71k58M28k47M6q8J8
3025iK03k58J78J79m18R5o6j35J31k40L48k14R4J15l01K73J01k9j09o9O4O0l38
3048c45L31L89k12j73%J1K30j87K8n0L1k05J43k82J30l0r1L89j73N6K05o2k13
3071h0o7K69m1n2N9j26J76j59L7j27M13J9k85K46k83K84k61j87K69J03m23M15
3093A99k46Ol52J83J59K03k85J53j67kJ85k70K70K25l34N6P3j24M6q0J81k06K7
3116a00M22m05J21q1L2l26K59k4L64l91j31M80l82O4K29jk49K63k30K55k82M69
3138C56l22L2J24j08k38J22n5o3M30j63oq6N1j42J4j89K52J31l8k34L63l36r1
$$ y = [-92, 79, -74, 171, -93, -48, -4, 221, 116, 123, 108, 139, 182, -203, -28, -66, 58, 149, 0, 33, 92, -24, 85, -261, -109, 134, -337, -78, -202, -114, -17, -239, -53, -42, -29, -27, -321, -118, -79, -77, 105, 363, 92, -166, 262, 15, 61, -27, -9, 194, -64, 114, 293, -125, -30, -96, -231, -100, -340, 8, -206, -112, 3, -298, -25, 76, 47, -62, -131, -67, -7, -345, -14, 375, 163, -10, -10, 1, 231, 44, 72, 22, 53, -152, -9, -291, -161, -191, -282, 107, -66, -10, 195, 133, -80, -147, 122, 81, 29, 88, -38, 138, -21, 16, -111, 302, 321, 36, 282, -1, 283, 22, -165, 104, 207, -216, 199, -47, -41, -393, -210, -51, 152, -133, 20, -147, -149, 36, -234, 36, 261, -73, -17, 56, -68, -22, -102, 79, -127, -100, 322, -83, 38, -43, -11, -337, -78, -102, 262, -129, -260, 220, -162, -98, 131, 130, -119, 144, -86, 169, -113, 356, 34, 66, 190, 82, -156, -34, -89, -152, 278, 115, 109, 23, 74, -68, -54, -243, 9, 140, 102, -132, 231, -105, -196]
3161a96l4K16k51K55N3k91J04j25k5J41J15m8K07l39K08J00o8jJ05L4J9q4q8J
3185Hj45K03n8o5N1l75M08%l5m7QJ77l21J28L1Q4l91N31k13J5k67L58L3j30J27
3210A15J3P3l42J84k29L57j47R1J05k72M8O9j40k72L02L1j28J13o9K10k24j42
3232b54Q8k42L55j44J21K69PJ8j66MP1k53K1qL49k88J07q4k8M37l04k33L13j15
3256D1q6j2n1J86p5j63J88j51R2%j95M1R1O0K2nq1K04Q2j49m04M74K0j22L48n45
3282a90K22l9o8L0k73K66R8j13j60M12l99N5K27k56mK58j55l0LK63j37r6J48j17
3306e5j4M26k52M9K18j51m0j95O9L3k00J32q6j11L40l69K01k3l3j32L00j14oj30
3330a43o6P8K20j75J21j02O8pK2K30j77K1q3J41k01J32R4m0Q7k01K01m96L06Q1
$$ y = [-196, -230, -14, -265, -10, 43, -248, -144, -269, -294, -153, -38, -86, 121, -218, -10, 90, 22, 21, 126, 160, 179, 95, 7, 8, -137, 66, 8, -57, -6, -381, 27, 27, -8, -55, -47, 130, -191, -63, -32, 52, -339, 192, -21, -6, -273, 85, 118, -12, 115, 128, 201, -141, 43, -186, 171, 24, 115, 220, -52, -4, 65, -75, -347, -45, -14, -142, -29, -98, 112, -112, -254, -166, -408, -53, -197, -76, 193, 200, 218, 52, 56, 127, -126, -105, -113, 236, -52, 55, -29, -57, 380, 76, -157, 156, 41, -45, -57, -108, 78, 3, -160, 28, -123, -31, -31, -226, -185, -94, -34, -12, -17, -98, 106, 188, 39, -365, 109, 129, 7, 355, -190, 32, -7, -75, -45, -318, -52, 46, -67, -227, 185, -214, -159, 68, -188, -192, 66, -89, -119, -116, 147, 10, -86, 62, -55, -69, 357, 105, 154, 372, 221, 181, -14, 55, 88, -112, 20, -66, -177, 163, -206, -5, -28, -61, -193, 107, -7, -13, -143, -209, -131, 89, -86, 35, -67, 1, -6, 16, 246, 69, 90, 7, 148, -53, 79, 173, 133, 220, 19, 220, -276, 30, 111]
3354A11l8k15l5K76l09k2J46J14k44L97k18j8K01j13Lk63M74k84R1J85L1j91N3
3377A32N4l12L5k33J49M39m99K77J13l00J95j40j12L87j07k92N8K8K74k15K73
3398B04l0K6j73j20K26l91K29J42o2J93k63J58m0o3J19k29o0J24Km7M05m23J80
3421A07k98J07P5o2R2%j33K22j29n4L25l88J32J23M9k98K70j27M8j20n1K70m37
3444b77M03K9m03K47k09L44r7j38J10o9M8N3l20K51mJ09k3n8R8k14K27r5l7j6
3468d1J11J16r4K60k31o4n9j69K1J03j01Q8K85m23J86j41ONK20m2j95M14k44P3
3492H4J62q2j06J91l19k31K37m7J52j40P9J12K2k10J67j05R5Q7J10j9k76j43L72
3515A92j56k80N01j45M0j07r3KK36J2k15k0m1L88j25j50j35n7K11k04qJ15L10
$$ y = [111, 73, -142, -177, 99, -210, -232, -86, 28, -216, 181, -37, -55, 146, 33, 36, -227, 247, -37, 54, 239, 270, 79, 132, 186, -126, -91, -324, -175, 264, -235, 42, 155, -145, 50, -90, -202, 185, 78, -214, -156, -128, 146, -69, 204, 174, 200, 27, -93, 133, -258, -29, 113, 51, 244, -19, 139, 99, 36, 155, -74, -134, -10, -8, -55, 350, -73, 107, -191, -84, -9, -71, 21, 21, -112, 110, -19, -73, 252, -136, -4, 119, 168, -130, 140, 13, 61, -59, -110, 160, -277, 126, 155, -248, -1, -210, 134, 37, -101, 9, -60, -12, 41, -279, -28, -32, 77, 54, -4, 94, -120, 107, 12, -25, -41, 70, 186, 92, 352, 121, 57, -2, -171, -150, -47, -148, -60, 225, -198, -12, -153, -147, -142, 78, 36, -159, 255, 11, 84, 246, 164, 58, 249, -70, -301, -64, -111, 41, -99, -20, 92, 114, -96, 71, -34, 61, 148, 258, 239, -37, -180, 192, 36, -244, 257, 112, 152, 45, -48, -46, 190, 202, -13, -33, -74, 314, 189, 39, -96, -153, 58, -146, -154, -39, 271]
3538B71k18QP5m2p0P7q0j80N0L2p8J06q4P0K68m93J36J2L4O2J57r6J14j55m7L25
3564B54k45K17j26j49N3q9J84PNN2j83P2q9J73j63K37j51k7j5l02L10J10L4k14
3588d5M0K01k83J2R3K37r8N4k24j63L98r1j92K96k59K20k38R1L2j31j24K72l57
3611b59K08J39J1Q1k48J94k3r2K72j67k46K39r7N0l17L63k6J1K9k04J57p0P5j57
3635g7K3K49j86K9k76j46K04K14q7j8k00R0J94r6Q7j40J36p4q3L48j43l45J37
3658a60K26r5j13j48M23k65M5L80l35j25R5M61l15J35k89K8l6K48k40J06J02k58
3680a30M6J44j83J70j06N5R2l91K89M0k33J91K5J3O4R8m72M64j54o7n5j12K53
3703D1M9N1j83J07j98K81j02r3L0L9P9o8k5J32k43J15K4p8K71j78K05j74j37K85
$$ y = [271, 53, 61, 136, 94, 24, 101, 21, -159, -109, -77, -155, -49, -133, -63, 205, -288, -152, -140, -106, -44, 113, 17, 131, -24, -71, 254, 9, 226, 100, -49, 4, -85, 99, 106, 111, 163, -20, 52, -37, 136, -27, 210, 59, 32, 17, -285, 25, 135, 169, -45, -5, 196, -87, -75, 18, 255, 157, 211, -13, -176, 222, 131, -61, 235, -24, 196, -42, 49, 81, -50, -174, 98, -259, -51, 88, 99, 180, -68, 126, 103, 11, 283, 116, -130, 109, 12, 62, -255, 108, 82, 93, 122, -82, 75, 5, 80, -77, -54, 195, 9, 38, -238, -384, -180, 34, -53, -71, -271, -181, 13, -83, 4, -136, 0, -74, -157, 191, 48, -297, -160, 66, -29, -142, -290, 133, -132, -87, 293, -42, -167, -72, 389, 74, 209, -80, -52, -88, 160, -80, 26, 128, -130, -84, 60, -123, 47, -59, -4, 88, -303, -14, 26, -207, -16, 9, 22, 86, 184, -288, 176, 22, -45, -100, -212, 41, 90, 141, -42, 65, -133, 148, 46, -47, -17, 22, 101, 33, 8, 140, -103, 12, 36, -42, 229, 51, 256, 82, -55, 230]
3727B30j74k92J54Q2k76L17l6Pk1N8r2N1J72k48p9K32q2k12J25J19j93M70l45
3750c3n8J64l43J52J04o2L22k35p3M9O7j1n40N55j91K04q3L4p6K71j73k20L7n2
3774a91P1K75j70j00l3J75k54J75m3K45j25J44k69K34j39Pk3J25m3k02L50M4l62
3797a09P9k8n5M6J77o5j24M5L7%k60K94n0j90j8L84r8r8J65LQ2k03J12k16L49
3822B59k57qj33L2O3L4J99j89j39K74j36R0J14k61K72r9r9J37k06m1LL4l33L06
3846h4J98k29k3J80p5J23j07m5K0J52k21J9K19l78L58j86J72k41L2J88l93K37
3868h4J12K7o8K08k77J22R4j95L11m34J70K48q6q1K18l81q1J42L4J85J3l47K85
3891A35J77l93K31k75n7J83%j52K21j19N3J24m4k02j00J54J16J2p3j18L42j92
$$ y = [230, 56, -236, -82, 0, -276, 41, 5, 12, -9, 49, -43, 8, 180, -68, -147, 85, 3, -209, -84, 35, -158, 312, -33, -91, 73, -270, -118, -14, -76, 246, 11, -62, -13, 54, 43, -497, 58, -133, 71, -12, 22, -54, 217, 44, -176, -139, -191, -120, 155, -15, -115, -148, 27, -227, -52, -95, 150, 25, 169, -100, 134, -5, 2, -21, 104, 61, -141, 209, 253, -109, -30, -58, -113, -67, 110, 45, -79, -34, 3, 3, -257, 37, -13, -203, -221, 163, 65, -33, 132, 135, 217, 14, 126, -90, 259, 2, -6, -139, -107, -44, -10, 189, 0, -139, 135, -1, 89, 203, -58, 214, 115, 16, 153, -53, -94, -91, -57, -390, -84, 114, -115, -138, 42, -33, 90, -17, -62, -42, 110, -111, -92, 127, -251, 107, -79, 93, -148, -116, 72, -321, -84, 28, 55, -13, 195, -82, 40, 134, -61, 250, -184, -14, 234, 148, 67, 285, -96, -177, -35, -1, 184, 197, -150, 135, 312, -81, 150, -125, -182, 1, 1, -151, 70, -49, 4, 128, 84, -118, -218, -64, 52, 64, -9, -127, 215, 23]
3913B3M5j81O1L50l6j35k40K77j61j66J94r7J23j65N6J05J32j60j45P7K31l95
3935b07O7L6J1q5M04j22k76M67m18L1j69M10j18j34J63k69J49K7k1n5j4K84j19
3958D2k94K55J79k65J52L4k54K77n1k09l6K24J2j8k15K67q0P2N0l3l23L09j85
3981i0L7K18j57ol5M6J10j54Q6R1k00K17k20K03rk78o7M50n43L19p0K52k73%P3
4006@R5l03K41k14N0K00o5J83j47J8k9Q4Pj98J07jkl67N34j70k8pj96K61k66N37
4032C24m56M2Ro5K14k3k7J16j67Q3J44j35j10J2o5K44m00M88k51J73j69L49n37
4055b07K74LQk08K88N2l56K54j02J19k55J20k02M28j9J2j22q0n3K5n19N81n5J19
4079A05J76m44K06j49J27j54K21j38oo8k34M15k14L4K38j27j50J46r3L26m24J97
$$ y = [23, 68, -113, -52, 298, 262, 127, -113, 164, 3, -163, 31, -66, 57, -108, -52, 53, 185, 25, -120, -43, 188, -207, -140, -104, -93, -178, 226, 104, -172, 295, -123, -92, -261, 149, 31, -103, 60, -209, -60, -33, -54, -109, -123, 161, 42, -252, 3, 182, -83, 69, 103, -151, 126, 75, -134, -170, 54, 66, 48, -167, 100, 20, 92, 142, 109, -214, 95, -90, -53, 165, 8, 2, -33, 13, 123, -31, 55, 146, -54, 163, -57, 146, 137, -141, -208, 242, -301, 18, -52, 200, -73, -73, 0, 95, -208, 33, -181, -131, 69, 4, 187, 40, 58, 29, 113, 120, -78, 29, 28, 26, -341, 193, 23, -5, -12, -208, 53, -213, 324, -132, -90, -81, -146, 68, 45, 18, 134, -33, 50, 194, 59, -51, -39, -104, 140, -260, 228, -23, 150, -19, 330, -207, 67, 70, 78, -130, 158, 210, -146, 108, 6, 125, -130, -10, -212, 216, 197, 209, 87, 7, -46, -21, -540, 41, -14, 105, 281, -163, 43, -106, 21, -133, 88, -50, -56, -124, -358, 57, -157, -123, 115, -12, -162, -16, -109, 217, -207, -10]
4101a0r8J87j56J37l4P4k49jJ42M4m4O1J23l48K58m5j93K26k89M71k47q2K10k21
4125h4PJ97ok42L68o0m2j23j56PK06r0O4N%o5J27j3q5O8J10L45o58K56%lj44m6
4153e7OJ5J29o2k5K07l17J24jq2L46m84L33rLj03J9J03q6J63j44n2l25K68n9J65
4179G5L3r3p3J48j98j83L00k7O3%k37K01j94Q6J76j43j67J66J94j19k29J68j84
4202b37K93P3L1j91J78j38J44j02J02j68Q1J3P4l17K02j06j10K61l4q6l0N0m8
4225f5KqJ50J8j92K06J53l45m0K41m8j69M39o16J67M4J17k0l0n1K8J76k05J1j01
4250a38M7P2k53M06JMj01j74pk1P4K5K47k10N0j59J42m9L8r8M4L0K98k67Q9k20
4276a30K29m3r0K77j93qP7k00L84l05J77j82J0J89m62L86j63J35j50Ok78M48j44
$$ y = [-10, -108, 79, -77, 60, 26, 100, -149, -150, -8, 36, -8, 53, 176, -172, 86, 41, -152, 74, -215, 256, 9, -73, 137, -84, -77, 120, 114, -128, 240, 180, 138, 15, -141, -134, 72, -18, 46, 51, 51, -14, 113, 100, 15, 83, 193, 538, -120, 136, 136, 133, -11, -57, -51, -36, 93, 31, 6, 213, -104, 20, 19, -63, 283, -201, 132, 123, 126, 23, 42, 145, 59, 222, 78, 26, -299, -31, -90, 75, 108, 15, -58, 90, -108, -291, 9, -18, 45, 45, -192, 9, -185, -99, 77, -66, -233, -67, 127, 8, -221, -53, -237, 56, 129, 160, -31, 147, 9, 153, 51, 153, -15, 66, 79, 153, -164, 38, -68, -178, 83, 49, -37, -67, -17, -65, -63, -71, 79, 97, -95, 111, 264, -81, -121, 120, 72, -97, 342, -274, -107, -63, 54, 34, 4, -47, -19, 157, -48, -37, -138, -91, -19, -272, 134, 135, 139, 38, -136, -143, -164, -90, -65, 182, -28, 22, -137, 5, -44, -6, -104, -60, -30, 268, 1, 90, -130, 99, 56, -34, 243, 50, 42, 119, -81, 303, -2, 175, -7, 3, 192, -270, 116, -47, 88, -62, -56, -334, 114, -30]
4299c0J78M7k49L9o9l8j00O0M80l27L9J14O9m77J62K04P3k17O6j1l36K24o0L49
4323A90k87n8J1L01j52J85n3l8M5j72KKJ26r5J32j62J99j46N1j61J86j19P6J32
4347A95k93J68l5k62K53k14K84k50k4K70l20Q5N2j9j4L8Q4K9O2r8j18M10k61j7
4371EK28j64L3j62Q1k1j75M41j43q3j9q7J7N9Kl2k6J54j63Q0O2l08J70j9P8LO8
4398G9j27J22j76Q7K8j89K83j63L9O0j01LJ43m8n6k09J04K43k13L0N5m8l0K9p9
4423a34J55p1j86L74j90K36j9j31L7l02M35J4k21q2N3j02pJ5L4Jj6j4PK11m8j4
4449C5j60q2J63R0Q0j98O0j9j44J33J56o5j66n4K35J67j05p9j14R0R5q1J4j83
4473a32J32r5J0J94m4r8k21K62n5r9r1L4K57p2R6J21l64K81N5n88O78l51J27L01
$$ y = [-30, 148, 195, -54, -15, -84, -122, -222, -162, 318, -9, 30, 144, 213, -264, -102, 102, 175, -42, 24, 13, -323, -99, -159, 190, -97, -155, -144, 157, 5, 190, 137, 99, 144, -28, -26, -24, 102, 7, 139, -23, 176, 30, 81, -80, 106, -13, 63, 195, -98, 70, 35, -227, 26, -188, 96, -154, -178, 92, -228, -143, -91, -110, -124, -86, -2, 27, 89, -9, -127, 283, 22, 5, 233, 69, 102, -60, 21, 0, -175, 266, 123, 40, 21, -66, -49, 10, 12, -20, -46, 108, -55, 25, 87, -221, -51, -70, 8, 11, 79, -48, 74, -102, -15, 13, -176, 107, -56, -17, 43, -58, -55, 88, 40, -16, -225, -121, 122, -91, -61, -6, -54, -84, -55, -134, 21, -50, -236, 138, -52, 184, 165, 34, 71, -231, 204, 218, -3, -85, -32, -134, -141, -126, -92, -91, -107, -121, -114, 97, 49, 35, -125, -207, -44, 46, 126, -72, -12, -31, -175, -42, 114, 49, -117, -171, 64, 231, 126, 47, -67, 23, 118, 37, 51, -132, 0, -95, -85, 109, 65, -33, -254, 8, -47, -146, -237, -203, 54, -18, 78, 199, -165, 116, 171, -417, 261, -90, 37, 338]
4497C38l23N7lp4L59k96Q4j82Nk8K38j27o1j39K01J35l84L37Q5j39j9j63J74j42
4521f7j75K55k48J49%j5J90l0j41p6L06r4J1J78k08Q9j05r6K29oj05r8P9J87k02
4546G%j14o2J52j34L1j04M00k15M4j7j06J53k45K41K6j22K07q9r6P0J95J10m52
4570a20J76J48k47P2O3k8J29j92j47J23o4j83J91LK33r3N4J36k41J33k21J79J64
4593B68k82J49j05p0K10j64J24j56q3J01k01K76j51l0j3J48l4J31q4o0O9j02l3
4616i2o7J94m6R9J15l7p0j63N0Q0L6j13K15k25p8J06J54k40J94L0p2q5K00l12
4640a27K78p5k44N6J74m8J44j76Q9j23J6J36R1l36Q4K62j97Mj32O2j13L2J11k44
4664b76J40J35O0jj94L32j47j3r6K01j91J5j02J55pL77m96K02O3k04J31K4k55
$$ y = [338, 15, 72, 69, -5, 354, 58, 142, -40, -35, -63, 175, 48, -13, -152, 49, 184, -200, 137, 222, 83, 64, -99, 75, -67, -242, 13, -235, -86, -86, -101, 89, 59, -82, -158, 148, 54, 65, 243, 35, 124, 19, -77, 152, 146, 41, -57, 22, 209, 7, 7, -107, -169, -17, -151, -120, -224, 176, -39, 5, -12, -118, 35, -210, 31, 57, -65, 142, 53, -43, 27, 222, 332, -120, 56, 204, -43, 29, 92, 64, 193, 1, -146, -23, -87, -270, -79, -76, 157, 64, 118, 254, 13, 146, -75, 104, 268, -14, 135, 30, -40, 170, 6, 130, -26, -109, -8, -209, 67, -84, -114, -127, 21, -13, 118, 34, -26, 43, -59, -92, -159, 35, -11, 88, 203, 166, 96, -67, -17, 63, 99, -14, 201, -24, -102, 4, 158, -82, 112, 142, 70, -15, 185, -127, 151, 76, -168, -112, 62, 14, 158, -18, 71, -52, -36, 100, 191, -145, -61, 201, 4, 8, -124, -62, -175, -143, -32, -276, -136, -1, 59, 58, -136, 196, 49, 36, -60, 141, -50, -35, -137, 18, 11, 388, -108, 94, 157, -47, 84, 108, -147]
4687a47j06K12J58j9k2oL1l15J99J1o6J21K02l46K60J03j63K8o2NOm82L39K16
4711A57l46J35L6%N9o4J64m17M02k98M5J87j79M8J22K94m31J85J5ro6q1O6l0N4
4736D8j20J16q3L06k33j70K83q2j94K34K59l86L9M6j10j72J97mK46l33J89N5k34
4759a03l3J82k33J48j46L02q1R4k91j11M50j70j33K22l6l95L42n5K9R2M9q9Q4
4782A18o4oK21l00J8J40p4j87J61Q8m2n0J15j01j70K32j34K9J1m4Q0j24J16q1
4806d8J92j03m7j75J49K31l41K13j02p1l1K76j67p1J24R1k00n5J88J47k78J66
4828H8o2M9j30o3Q4j47L57k5m3k01N4J21J03k99J32J47k16J02J54j91K81k55n
4851C5J6N3r1J08k9k5j28L5l0R7qj48J56o2j19L63n6k44m2k8P1mj59L15j44J75
$$ y = [-147, -253, -41, 117, 98, 76, 70, 101, -214, -15, -4, -70, 51, 253, -93, 167, 270, 107, 135, 73, 78, 84, -398, -59, 157, -189, -54, -18, -18, 41, -23, 141, -276, 126, -172, -127, 60, -119, -71, 51, 345, -86, 99, 114, 105, 39, -42, 24, -6, 48, -72, 44, -39, 267, 34, -136, 147, 65, -129, 105, 364, -22, 17, 63, -47, -219, -22, -26, 220, -113, 76, 131, -103, -136, 46, -187, -39, -185, 117, 36, 130, -161, -272, 178, 8, -125, 97, 61, -334, 8, -47, -18, 74, 123, 34, 118, 54, 48, 269, -31, -13, 127, 53, -134, 27, 115, 73, 23, 138, 37, -133, 99, -35, -6, 5, -39, 41, -83, 33, -48, 144, 41, -6, -181, -32, 199, -142, 71, -31, -102, -133, 143, -24, -95, 29, 120, -80, -135, 53, 200, -78, 88, 26, 75, -55, -118, -34, -181, 176, 151, 108, -93, -39, 82, 185, -114, 18, 165, -51, 51, 205, 14, 295, 40, 35, 51, 104, 13, 121, 92, 67, -61, -26, -56, 41, 33, -115, 41, -21, -140, 223, 167, -77, -119, -147, -76, -80, -239, 76, -68, 107]
4877A07p3j78L44m41M10n3l27J52r4K63j25K00j92J24k38L2J07J42J83j41m41
4898b39Q0K24j23q1J57j06R8j39M14k62K09j37L7j6l8Q3j44K83j54J29j59j72
4920e6Np2J42P5Q1l42j7n6K47q2JJ20k64J63P4n5K09j01Kj2k40L10J19m04L06
4945A53k81m2L69k26j3M5j30J03j09J30Q1j75K67j96QJ40k6q2l5j2m4K47J2k91
4969a07J84j61R3j42o0OL47J9nk88K85l22J26n9O4j10K81k88L19k77L51o0l58
4992a62L53j90J15j65K00L1j13p4O2j23Qk13M47r0k28N5nL2j46J88R1k11Q7L63
5016C12l21K31o7j60kJ45l8O9r1j40j6LL9p9l4K07j19J74n1j15P2k5M7J29J8k93
5042a05j1L23p4l37M02j57j10K70J25m85J65j20J34k07M3R3pJ51n4j50Q2jp3J41
$$ y = [107, 34, -144, 200, -241, 169, 116, -211, -59, -153, 110, -15, 185, -7, 117, -121, -89, 18, 160, 343, 202, -239, -159, 65, -58, -139, 18, -88, 10, -129, 285, 23, 232, 95, 132, 116, 78, 161, 17, 300, 146, 275, 116, -56, -51, -123, 19, 94, 175, -167, -184, -240, 7, -75, -74, 46, -218, -55, 19, -36, 173, 72, 74, 62, -178, 132, 251, -153, 153, -128, -170, 199, -27, -40, 5, -125, -22, -131, -1, 80, -95, 172, -24, -16, 124, 98, 16, -19, -31, -75, 172, 184, -107, 77, -84, 9, -133, -193, -187, 160, 179, 174, -114, 171, -151, -25, -84, -20, -130, 151, -137, 182, -95, 256, 196, -162, 191, 1, 116, -49, 151, 182, 69, -5, 57, -66, -58, -271, 176, 86, -142, -87, -92, -60, -206, -18, 73, -138, -51, 312, -9, 222, 155, -5, -7, 138, 100, 169, 78, -62, -78, -75, -36, -115, -149, 58, -61, 113, 62, -53, 19, -6, 41, 170, 188, -105, -116, 207, 133, -204, 198, 41, -69, 201, 326, -159, 6, -114, 20, -187, -144, -51, -58, 93, 39, -111, -29, -30, -103, 38]
5066C8o1k0j37N18k56qj49N6J23l63J00L65m83M70j4n7mJ70k64M7l27L3L99k59
5090h3J92k81N7j1N3Q5j68L0K61Qj40Rl74L65J4k14L05k99M27k56k54J98K15q4
5114E5j14m6J02Pj13J91k05j05K27lO9j22l2O1j4J04K75m38O7n3l8L18l54R7N7
5139gn9K0OQR6j13P8J82p9l6N1m2k62L17r0N7m2Nj66K81m3m14L45j97p0L91J4
5166B31l09K99k68j27M34l66J13L3M8l1k40Q1JK19k13L08p9j42N6K01m52K05q0
5189g8r5K07l1Lk9J87k79PJ91k65M7K23j28J6p1P9r1L03p9j70k14M37k78J2K34
5214A38k64J53n8N2K15m72M55l35J4O4m3j48R4N3n1J41N2P8j14M8K4m2k4j24K35
5239A41k36J65j84K64k20J28n0p1K93j59j23Q5J78l4o7PMl33K79J48j96l80K32
$$ y = [38, -23, -43, -180, 338, 82, 74, -75, -19, 104, -259, -159, 206, -277, 193, 179, 122, 118, 288, 24, 71, -256, -223, 176, -83, 109, -172, -115, -126, -73, 12, -156, -126, 135, 143, 3, 12, -362, 3, 17, -197, 108, -191, 236, -20, -274, -76, 139, 55, -59, -105, -3, 4, -109, 82, -123, -228, -1, -4, 65, -57, -89, -28, -42, 62, 337, -101, -34, -87, -125, 193, -161, -64, -7, -66, -46, -40, -32, 64, -49, 29, 211, 132, 96, 147, 105, -157, 160, 70, 127, 85, 90, -76, 205, 162, -252, 93, -104, -174, 217, 231, -78, 221, -47, -174, 260, -106, 7, 40, 88, 57, -183, -102, -101, 118, -95, 213, 134, -8, 48, 249, -203, 2, -78, -173, 34, 3, 6, -23, 164, -115, -108, 83, -182, -135, 88, -40, -24, -95, -16, -107, 196, 117, -53, -267, 170, -108, -96, 138, -126, 27, -31, 21, 236, -236, 219, -116, -102, -38, -81, -229, -135, -82, -133, 8, 60, 138, 24, 72, 96, 54, 30, -94, 141, -95, 70, -114, 150, -70, 58, 8, -63, 230, 71, -52, 33, 211, 177, 110, 117, 121, -212, 67, 215, 19, -361, -129]
5262a29L38k14j92j26L16Qj34L63j44j19K24j28N9r4k4OJ5k32O5k7J93K8r1O4
5286B5j63L75k48K07l24k5L18j75Q6l7O1l10q1M39j87j17J75K00j66k94J59jj83
5309b66L00l17K42J15j01P8j72J96Jj75j06K58k36K15k80J75j8L9K94m54L08m3
5331E3j17J29j69o1J78K4J83j69Jj14J01pJ3O7j94J4p5J19k47K73j26K53k06Q2
5355Eqn6J44j7M4k99J70oR2J19j40K4j6L8M1k56K02M9j38kmJ32j27L26o21L82
5381G8j86j5j45L35O2l36N7m8P9j02K36JM0M1O0J7k27j10J39pN0k9J5j43J10K4
5407dp1q7K61q5j14O9N9k2n5j6m9j33L05o6j8n2j48kR2r5L03n1k73K26J28k06
5433a04N2J0O3k7J31k1Ln0q6L2L5n4N0j73L36j42Op2k4J51j19N1l12kM57k29O
$$ y = [-129, 209, -5, -197, -323, -7, 1, -133, 230, 86, -33, 191, 63, 122, 28, 4, 10, 25, -207, -142, -169, 24, 52, -39, 25, -138, 237, -11, 196, -128, -153, 165, -10, 76, 39, 100, -210, -291, 148, -39, -156, 19, 219, 53, -241, -82, -83, -266, 34, -283, -41, 74, -27, 51, -121, 75, 76, -99, -205, 53, -183, 32, -248, -73, -91, -52, 242, -212, 96, 53, -64, 65, -104, -165, 13, 37, 220, 51, 52, -62, 39, 32, 45, 112, -82, -68, -143, -24, -271, 2, -124, 129, -77, 5, -3, -59, 85, 68, 112, -187, -17, -23, 69, 188, 48, 72, 56, 94, 135, -121, 81, 130, -8, -10, -14, 118, -9, 317, -304, 78, -108, -123, -268, 67, 129, -207, -150, -198, -119, -221, 15, 16, 56, 97, 157, 174, -53, -163, -24, -31, 19, -10, 5, -138, -28, -4, -75, -162, 99, 14, -100, -31, 28, 6, -49, -65, -114, -247, 58, -8, -26, -78, -226, -228, -136, -231, 72, 21, -252, -26, 102, -104, -52, -42, 21, -6, 125, 104, 107, 57, -29, 3, 38, -16, 34, -139, 197, 55, 61, -11, -35, 116, -3, 48, -264, -266, 191, -38, -32]
5460c2J7j15N5J50j82O5q4J08R2M3q5k8J91j35Rq1Mj83J64N2j8j07L55m10J52
5485cj59L2j02K55J06q6J29l7J8n9K62l22J8P0K47l03Q9l06L67j1l62K07K6j25
5509d9J23l2p8k18NJ34K39j01p7O3P6l9r7L62k21jp6j78J84J77m6j94P6q2L0j37
5535a57K58k03K81j65N7n1M5l34j02K86Qm4J66k27J98k02J0J55q9J31m2K24l22
5558a19K48P9p5R2k75K73k45r7Q4j53K36m8L02l64J37j40O4l6p1l2j15M10m76
5581c21L21j9L59k50j06J06k23J62m6p0j16r6N45J86l49p5j03J99J45r5k39J43
5603E8j12j04P5J35j44L7m4M6M4J76l04K43J11m1k64l1K35k50L34p3j71J50m6
5626F0j27K93j73j4L3j39J84q0k34J70J77l09Q6j74L52J39m3l17J8P2J94m39J63
$$ y = [-32, -15, -130, -75, 75, -107, -42, -126, -18, 74, 117, 32, 4, 195, 60, 69, -12, -8, -191, -27, 25, 7, -100, 255, -155, -3, -162, -130, -232, 23, 129, 43, 172, 135, 153, 94, 356, 34, 52, 122, 369, 66, 155, -151, 216, 205, -157, 50, 76, -49, 74, 42, -36, -254, -249, -115, 124, 23, -54, 9, 85, 46, -51, 311, 90, 89, 13, -165, 19, 196, 150, -44, 32, -50, -20, -157, 101, -102, 179, 14, 71, 20, 65, -269, -371, -85, -77, -121, 45, -182, 16, -186, -176, -21, -110, 21, -21, 203, -119, 129, 208, 133, 225, -50, 223, -22, -119, -35, -188, 48, 0, 302, -62, 75, -65, -1, -37, -108, -140, -255, 155, -321, 0, -19, 340, 90, -16, 90, -133, 29, -17, -87, -203, -299, 246, 432, 83, 8, -95, 104, 249, 154, -85, 58, -54, -158, -83, 52, -92, -55, -99, -53, -9, 167, -137, 106, 217, 176, -88, -119, 116, -134, 200, 127, -44, 106, 60, -67, 226, 53, 39, 72, -67, 117, 37, -197, -27, 150, -159, -73, -247, 105, 244, 201, -116, -98, -26, 168, -271, -108]
5649a08Pk51M08J68p1j51k6m3J00j2qk1j9J59l70J26J00k26K34m0K26j39K16m26
5673a67J12k43K97J53l59L58j89J03QK0p2k0j06J46p2R5n5P7P6J22j75j22M3m
5697B6K9N1j00k3J36m9J21j05r5O5n8J14m9K7j22K0J9p4p6K22j4j77K20L6k93
5722a49n8PM76L5k99n0p8K5J87k08jq5J05M1k38K37j36q2M61j48m9j23J73j5r2
5747f4j6O9J9J25m6J50j77kk0J57j85o2J1O0o9K66j41L0Oj7q7J3J51j21j74J53
5773B9J87k12J19j29J21M9L0k54L2r3p7K10j04L12l26K18K48k36m1j8J26k57J30
5796F4nj9j16K23k45K8J6lj68L87j72J88j93MK16k66J87l15J71M4l6J51k83jJ40
5821cN1p7k3J38L9q2P6n18L21j14K97l27J25q5j08K83J48l3J59k03J9k57K25n8
$$ y = [-108, -101, -352, 56, 224, 153, 2, -24, -67, 33, 21, 13, -8, -27, 132, -238, -112, -12, -238, -4, -44, 182, 43, 259, -167, -55, -298, -1, 152, -207, 151, -38, 65, 73, 93, 21, 1, -105, 41, -31, 64, 9, 86, 162, 284, 109, -13, 30, 26, 55, 106, 6, -17, 119, 70, 191, 86, -9, 56, -2, 112, 63, 90, -32, -12, 7, -67, -143, 79, 65, -112, 108, 144, -149, -207, -200, 276, 311, 12, -38, -116, -91, 96, -112, -113, -198, -93, -52, -290, -53, -189, -271, 190, 42, -7, -130, 43, 28, -64, -80, -11, 8, 133, 87, 237, 60, 58, 38, 195, 10, -52, -41, 19, -50, 216, 75, 105, 111, 94, 7, 20, 171, 50, -124, 29, 216, 4, 123, -6, 115, 164, 194, -60, -28, -121, -198, 12, -92, 220, -106, 112, 360, 124, 83, 65, 191, -66, 64, 59, 40, -76, 147, -98, -70, -54, -57, -225, 162, -10, 178, -15, -11, 205, -61, 126, -189, -18, 26, -10, 141, -142, -143, -3, 48, -29, -52, 86, 125, 43, 119, -399, -78, -192, 105, -222, -97, -182, -290, -7, 141, 108, 267, 64, 83, -174, 51, -7]
5845gk3J78p4j72p0J37r2K93o5J27l86J83J17l56L55k23K28l22L30n3l18L32L5
5868A54k06L6J46k43K03l88L21M1m8J20kj96K02k21J69o4K32j76J8P0j02l8N0
5891G8k78K89j56k6J90J19k85K41j20r0J21n8j20j34L16j05j8L9j6j7M6Lp7LQ0
5916B5R3l6m9N2j55Oo4J36j63P1K32qO1k77J9M9k06K23l05L97o5L87k92l07J43
5941c3OJ11J49l46L49j79j5r1J15r4l6K57j70j46J18O1n3n3k68K34o4J40K09k86
5965h5K39l9j91L4J70k31R5K53k39Q6J0k21P3J34j01R3k09J82p8mO1k24K88k35
5989a39P6J81on7k07r5L23m9k4R5k98M2l0K88O7j30P6j01q1K86o5j78K34j76L4
6014F6J08l30K76m01L37j48q7n6M25k00J06J03k30J33l34J37j00J55Q3l3j83M76
$$ y = [-7, -30, 148, 74, -98, -168, -31, -123, 170, 105, 232, -154, 29, 146, -210, 145, -78, 150, -172, 158, 105, -213, 119, 154, -52, -16, 130, -113, 90, -298, 23, 64, 16, 136, 134, -62, 140, -81, 88, 24, 256, 80, 98, 168, 66, 28, 78, -200, 89, -67, -93, 97, 216, -69, 172, 52, -38, 83, 25, -95, -229, 87, -18, -36, 3, -13, -30, 16, 19, -58, -55, 25, 118, 82, 33, 85, -70, -64, -128, 8, -155, -84, 148, 140, 201, -76, -57, -8, -214, 9, -296, 101, 36, 423, 131, -176, -33, -27, 84, 233, -113, 236, 57, 42, -49, 66, -28, -64, 193, 23, -123, -5, 56, 3, -50, -318, -84, -148, -8, 201, -85, 154, 115, -76, -42, 128, -103, -8, 245, 6, 92, 102, -119, -46, 88, -13, 80, -129, 53, -25, -29, 32, -192, 96, -139, -63, 118, 112, 55, -152, -247, 76, 27, 3, 98, -200, -158, -188, 100, 167, 37, 113, 12, -69, 217, 152, -26, 208, 32, 66, 174, -156, 120, -281, 56, -92, -179, -235, 190, -10, 96, 199, -31, 102, -232, -95, -195, -40, 43, 10, -173, 303]
6036C03j86k52K49l04P7J32J29j48p0K96o9o9J49j12k74QJ49lJ55k83J20q2O9
6059a6J90j24n7k98M66j83J07j72L01n28K49J0j67N1K99l59J87L5L1L8j31K27
6081A56k82J97m43L98kR4l7N9m05K93M6j00q1Q2j89K60k96K31PM3N6L8j09k20
6105b04K13qM9o1K55l13J67J4m5J3j26k29L80j20K3M1j51L42k10q1J3k57L09j84
6129a70L0R0K09j07j79L42k69r6K01M5J45k25j40p7K17o1j60P6q5L19L1j31n5
6152e0J57r4R3l66L16j40J57J40k00l81N30j61j68k4Q5J12K24j76j22K00j83K29
6174A78k03k5QL9J04o7j25j50J35K10j87K16j18n9k44L31o1K9j06P3J15j06O4
$$ y = [303, 117, -135, 114, -190, -113, 19, 148, 0, -70, 226, 157, 88, 237, 125, -149, -141, 8, 5, 160, -123, -3, -85, -16, 174, 50, -7, -305, 161, -22, 85, -87, 214, -314, -65, -55, -222, -171, 128, -231, -44, -9, 22, 60, -71, 156, -126, 71, -372, 26, 24, 118, 81, 140, -265, 28, 74, -26, -107, -25, -214, 46, -250, -19, -12, 31, 87, 125, 16, -204, 9, 1, 50, -11, 244, -69, 98, 112, 67, 80, -46, -275, 105, -15, 8, 49, -102, 240, 30, -51, -38, -295, 14, -170, -140, -50, 159, 52, -127, 215, -54, -150, 51, 96, 241, 16, -124, -201, 16, -45, -205, -129, -214, 105, 136, 5, -50, 107, 13, 106, -260, 56, -84, 73, 213, 13, -368, 162, 1, -167, -191, -106, 6, 230, 54, -68, 132, -51, 178, -25, -50, -42, -3, 101, 34, -91, -241, -106, 104, -83, 133, 15, -44, -288, 43, -18, 11, -95, -22, 93, -13, 51]
$$ [...]
8191E0
##END NTUPLES=NMR FID
##END=
