##TITLE=abcd
##JCAMPDX= 6.0         $$ Bruker NMR JCAMP-DX V2.0
##DATA TYPE= NMR FID
##DATA CLASS= NTUPLES
##ORIGIN= UXNMR, Bruker Analytische Messtechnik GmbH
##OWNER= root
$$ XWIN-NMR		Version 3.5
$$ Tue Oct 27 15:01:16 2020 Russian Standard Time (UT+4h)  servis@DPX200
##.OBSERVE FREQUENCY= 200.131235884673
##.OBSERVE NUCLEUS= ^1H
##.DELAY= (6, 6)
##.ACQUISITION MODE= SIMULTANEOUS
##.ACQUISITION SCHEME= undefined
##.AVERAGES= 129
##.DIGITISER RES= 18
##SPECTROMETER/DATA SYSTEM= spect
##.PULSE SEQUENCE= zg
##.SOLVENT NAME= DMSO
##.SHIFT REFERENCE= (INTERNAL, DMSO, 0, 16.5164)
##AUDIT TRAIL= $$ (NUMBER, WHEN, WHO, WHERE, WHAT)
$$ ##TITLE= Audit trail, XWIN-NMR		Version 3.5
$$ ##JCAMPDX= 5.01
$$ ##ORIGIN= Bruker BioSpin GmbH
$$ ##OWNER= servis
$$ F:\spectra/data/av/nmr/H1/1/audita.txt
$$ ##AUDIT TRAIL=  $$ (NUMBER, WHEN, WHO, WHERE, WHAT)
(   1,<2020-10-27 15:00:23.75 +0400>,<servis>,<DPX200>,
      <created by zg, POWCHK disabled, PULCHK disabled
       terminated by command 'halt'
       configuration hash MD5:
       00 E9 B6 7A A2 85 ED C7 34 08 36 98 17 FE 4E 26
       data hash MD5: 32K
       4C 16 11 DC A3 03 47 26 5A AD E0 9E AD 75 97 79>)
$$ ##END=
$$ 
$$ hash MD5
$$ 37 3B FA 99 9B 99 5C 41 E0 46 6E F1 EE D6 D3 17
##$RELAX= 
##$RELAX= 
##$RELAX= 
##$RELAX= 
##$RELAX= 
##$RELAX= 
##$RELAX= 
##$RELAX= 
$$ Bruker specific parameters
$$ --------------------------
##$DU= <F:\spectra>
##$EXPNO= 1
##$NAME= <H1>
##$PROCNO= 1
##$TYPE= <nmr>
##$USER= <av>
##$AMP= (0..31)
100 100 100 100 100 100 100 100 100 100 100 100 100 100 100 100 100 100 
100 100 100 100 100 100 100 100 100 100 100 100 100 100 
##$AQSEQ= 0
##$AQ_mod= 1
##$AUNM= <au_zg>
##$AUTOPOS= <>
##$BF1= 200.13
##$BF2= 200.13
##$BF3= 200.13
##$BF4= 200.13
##$BF5= 500.13
##$BF6= 500.13
##$BF7= 500.13
##$BF8= 500.13
##$BYTORDA= 1
##$CFDGTYP= 0
##$CFRGTYP= 5
##$CHEMSTR= <none>
##$CNST= (0..31)
1 1 145 1 1 1 1 1 1 1 1 1 1 1 1 1 1 1 1 1 1 1 1 1 1 1 1 1 1 1 1 1 
##$CPDPRG= <>
##$CPDPRG1= <>
##$CPDPRG2= <>
##$CPDPRG3= <>
##$CPDPRG4= <mlev>
##$CPDPRG5= <mlev>
##$CPDPRG6= <mlev>
##$CPDPRG7= <mlev>
##$CPDPRG8= <mlev>
##$CPDPRGB= <>
##$CPDPRGT= <>
##$D= (0..31)
0 2 0 0 0 0 0 0 0 0.06 0 0 0 0 0 0 0.0002 0 0 0 0 0 0 0 0 0 0 0 0 0 0 
0 
##$DATE= 1603796423
##$DBL= (0..7)
120 120 120 120 120 120 120 120 
##$DBP= (0..7)
150 150 150 150 150 150 150 150 
##$DBP07= 0
##$DBPNAM0= <>
##$DBPNAM1= <>
##$DBPNAM2= <>
##$DBPNAM3= <>
##$DBPNAM4= <>
##$DBPNAM5= <>
##$DBPNAM6= <>
##$DBPNAM7= <>
##$DBPOAL= (0..7)
0.5 0.5 0.5 0.5 0.5 0.5 0.5 0.5 
##$DBPOFFS= (0..7)
0 0 0 0 0 0 0 0 
##$DE= 6
##$DECBNUC= <off>
##$DECIM= 32
##$DECNUC= <off>
##$DECSTAT= 4
##$DIGMOD= 1
##$DIGTYP= 9
##$DL= (0..7)
0 120 120 120 120 120 120 120 
##$DP= (0..7)
150 150 150 150 150 150 150 150 
##$DP07= 0
##$DPNAME0= <>
##$DPNAME1= <>
##$DPNAME2= <>
##$DPNAME3= <>
##$DPNAME4= <>
##$DPNAME5= <>
##$DPNAME6= <>
##$DPNAME7= <>
##$DPOAL= (0..7)
0.5 0.5 0.5 0.5 0.5 0.5 0.5 0.5 
##$DPOFFS= (0..7)
0 0 0 0 0 0 0 0 
##$DQDMODE= 0
##$DR= 18
##$DS= 0
$$ [...]
##$SUBNAM0= <"">
##$SUBNAM1= <"">
##$SUBNAM2= <"">
##$SUBNAM3= <"">
##$SUBNAM4= <"">
##$SUBNAM5= <"">
##$SUBNAM6= <"">
##$SUBNAM7= <"">
##$SUBNAM8= <"">
##$SUBNAM9= <"">
##$SW= 20.6817932712277
##$SWIBOX= (0..15)
0 0 3 0 0 0 0 0 0 0 0 0 0 0 0 0 
##$SW_h= 4139.07284768212
##$TD= 32768
##$TD0= 1
##$TE= 0
##$TE2= 300
##$TE3= 300
##$TEG= 300
##$TL= (0..7)
0 120 120 120 120 120 120 120 
##$TP= (0..7)
150 150 150 150 150 150 150 150 
##$TP07= 0
##$TPNAME0= <>
##$TPNAME1= <>
##$TPNAME2= <>
##$TPNAME3= <>
##$TPNAME4= <>
##$TPNAME5= <>
##$TPNAME6= <>
##$TPNAME7= <>
##$TPOAL= (0..7)
0.5 0.5 0.5 0.5 0.5 0.5 0.5 0.5 
##$TPOFFS= (0..7)
0 0 0 0 0 0 0 0 
##$TUNHIN= 0
##$TUNHOUT= 0
##$TUNXOUT= 0
##$USERA1= <user>
##$USERA2= <user>
##$USERA3= <user>
##$USERA4= <user>
##$USERA5= <user>
##$V9= 5
##$VALIST= <valist>
##$VCLIST= <CCCCCCCCCCCCCCC>
##$VD= 0
##$VDLIST= <DDDDDDDDDDDDDDD>
##$VPLIST= <PPPPPPPPPPPPPPP>
##$VTLIST= <TTTTTTTTTTTTTTT>
##$WBST= 1024
##$WBSW= 30
##$XGAIN= (0..3)
0 0 0 0 
##$XL= 0
##$YL= 0
##$YMAX_a= 633374
##$YMIN_a= -617077
##$ZGOPTNS= <>
##$ZL1= 120
##$ZL2= 120
##$ZL3= 120
##$ZL4= 120
##$ABSF1= 10
##$ABSF2= 0
##$ABSG= 5
##$ABSL= 3
##$ALPHA= 0
##$AQORDER= 0
##$ASSFAC= 0
##$ASSFACI= 0
##$ASSFACX= 0
##$ASSWID= 0
##$AUNMP= <proc_1d>
##$AZFE= 0.1
##$AZFW= 0.1
##$BCFW= 1
##$BC_mod= 2
##$BYTORDP= 0
##$COROFFS= 0
##$CY= 19
##$DATMOD= 1
##$DC= 2
##$DFILT= <>
##$DTYPP= 0
##$F1P= 11.0000007629395
##$F2P= -0.999999237060547
##$FCOR= 0.5
##$FTSIZE= 0
##$FT_mod= 4
##$GAMMA= 1
##$GB= 0
##$INTBC= 1
##$INTSCL= 1
##$ISEN= 128
##$LB= -0.2
##$LEV0= 0
##$LPBIN= 0
##$MAXI= 10000
##$MC2= 0
##$MEAN= 0
##$ME_mod= 0
##$MI= 0
##$NCOEF= 0
##$NC_proc= 0
##$NLEV= 6
##$NOISF1= 0
##$NOISF2= 0
##$NSP= 1
##$NTH_PI= 0
##$NZP= 0
##$OFFSET= 16.51637
##$PC= 1
##$PHC0= -45.75485
##$PHC1= 2.197691
##$PH_mod= 0
##$PKNL= yes
##$PPARMOD= 0
##$PSCAL= 4
##$PSIGN= 0
##$REVERSE= no
##$SF= 200.13
##$SI= 16384
##$SIGF1= 0
##$SIGF2= 0
##$SINO= 400
##$SIOLD= 16384
##$SREGLST= <1H.CDCl3>
##$SSB= 0
##$STSI= 0
##$STSR= 0
##$SW_p= 4139.07284768211
##$SYMM= 0
##$S_DEV= 0
##$TDeff= 0
##$TDoff= 0
##$TI= <>
##$TILT= no
##$TM1= 0
##$TM2= 0
##$TOPLEV= 0
##$USERP1= <user>
##$USERP2= <user>
##$USERP3= <user>
##$USERP4= <user>
##$USERP5= <user>
##$WDW= 1
##$XDIM= 8192
##$YMAX_p= 0
##$YMIN_p= 0
$$ End of Bruker specific parameters
$$ ---------------------------------
##NTUPLES= NMR FID
##VAR_NAME=  TIME,          FID/REAL,        FID/IMAG
##SYMBOL=    X,             R,               I
##VAR_TYPE=  INDEPENDENT,   DEPENDENT,       DEPENDENT
##VAR_FORM=  AFFN,          ASDF,            ASDF
##VAR_DIM=   16384,         16384,           16384
##UNITS=     SECONDS,       ARBITRARY UNITS, ARBITRARY UNITS
##FACTOR=    0.0002416,     1,               1
##FIRST=     0,             0,               0
##LAST=      3.9581328,     0,               0
##MIN=       0,             -617077,         0
##MAX=       3.9581328,     633374,          0
$$ Real data points
##PAGE= N=1
##DATA TABLE= (X++(R..R)), XYDATA
$$ [...]
9780A04Ml1J91j75R0j28j0J16k56J83j05K88j42%n1J13k17J58o9K03q0n62L59
9803a7L11k04QQO7K11l73mJ36Mp1K1oj11J84q5q8K20q5oP6K8l30K03r6k9P0L5
9831G7n3J63m3M7m6Q4k06J25O6J12l22M9P6q4l3L9Oj19M5j10R7J66j58J86k53
9856h9K61j38L0n8L2M4j2J53R1q4J8j10k25Q2N5K76q7j72J89k25J64J1j57q8r8
9881a37L40m4l25L71pj26O2L7k03J47L5p7k44K90K7j90Q3j8n4J26J82l20M4K1
9905B0j12J10o4M8J03j90R8K1kj34J87j67l1J11M4r2K94j5j68M8K61l19k78L41
9929A14QN4m2J23k84K84k1k28O0J32j87q7J09P3L9j31K4P0m7N0l55K56OM4m5N3
9955G2Jj57J32k43J95NK2j05J5r3O4k0J43j24K76NJ11j95N6j14j71K13l0K93q8
$$ plain form
9780 104 108 77 268 93 183 55 45 161 -95 88 -17 271 129 129 78 191 -26 132 63 266 186 -376 -17
9803 -17 294 90 98 106 173 384 11 7 143 147 76 97 91 -20 164 79 -9 211 126 120 196 224 -106 97 1 -28 42 77
9831 77 24 187 144 191 145 229 23 148 214 326 4 53 129 45 12 51 57 -62 -17 -127 -30 136 -22 164 -89
9856 -89 172 34 64 6 38 82 70 223 314 230 248 138 -87 -5 50 326 239 67 256 31 195 206 49 -39 -137
9881 -137 203 159 -166 205 198 72 134 171 -32 115 150 73 -171 119 146 -44 39 21 -33 93 275 -45 -1 20
9905 20 -92 18 -46 2 105 -85 13 34 32 -102 85 -82 -113 -2 42 -50 244 229 61 109 370 51 -227 114
9929 114 122 176 134 257 -27 257 236 8 68 200 13 -74 35 108 147 16 40 110 63 113 -242 14 20 64 19 72
9955 72 73 -84 48 -195 0 5 27 -78 -63 -156 -92 -112 31 -93 183 188 299 104 160 46 -125 88 58 351 263
9980B63o1pn6j80J22J57j88J93k65K43j86P9j29KJ56j75N4L3N5m0n1j1J60j1o3
10005I4rp1K89k42k8N1l9J52r9l4L8l5qR0l84L42nO1O6j40J08Qj98J70k62R8P5
10032H8J95r8p6K3j84L97j76n2j9O8j29J28k11J44j70J59R7j81J02k52K99N5l12
10055a05Q0o6K40j17J30j61J23O1K1k1N3j34O6L1N2j94p0J49k24K14J18j88L1
10078H9J05j70m4M2K9k2O2J14j56j26L33k34J09j40J36j04lJ75j35m3k87K95R9
10101A24r3J18j66J41m9O4J07k28K20k19J01qon4m5M0l6O3p9J14np1K16k03K33
10126B79Q2q5k52K24m1oj4l55K62N2MK8J8j24q1K08k36J83p8O1Pn9m0J55J66j86
10152A72j81J75p2Q6j67Q7n0J5j82J43R9j06J09J75r1j9jq3q6J30o5R6J09k38
$$ plain form
9980 263 202 195 139 -41 81 238 50 243 -22 221 35 114 -15 -13 143 -32 22 55 110 70 19 8 168 157 94
10005 94 85 14 303 61 33 84 45 197 98 64 102 67 59 149 -235 107 102 163 229 89 197 205 7 177 -85 13 88
10032 88 283 185 109 132 -52 345 169 117 98 166 37 165 -46 98 -72 87 184 3 105 -147 152 207 -105
10055 -105 -25 -91 149 32 162 1 124 185 206 185 238 104 170 201 253 59 -11 138 -86 128 246 58 89
10078 89 194 24 -20 22 51 29 91 205 49 -77 256 22 131 -9 127 23 20 195 60 17 -270 25 124
10101 124 31 149 -17 124 75 139 246 18 238 19 120 112 106 52 7 47 11 74 -5 109 104 33 249 46 279
10126 279 361 276 24 248 207 201 187 -168 94 146 150 178 196 72 -9 199 -37 146 68 129 136 77 37 192 358 172
10152 172 -9 166 94 180 13 100 50 65 -117 26 125 19 128 303 212 193 192 109 23 153 88 184 293 55
10176E5J41q4J10Qj86J14K60l38K4Pp8J43r9J84j42p0M1o0p0K91j50k29J29J18
10200A19l82L43R9k9o1L4L7r8o2j40L03j98J51K9n5K6k13J29K74k75K25j60J89
10223B85l9k27K32K2l2j96j93k7K05L0J38N2l62L82j44L9n0r2J05R0p0k55J06
10246aJ89j4j7q0m4q8K44kj46J39J28j87j13p2K57k70L4l9J11P7L8r2j17J80R5
10271B10j5j12J3J04k40K48j15P9Q5j74%j05J9l2K76p6O6l61J94m0J20j79J31
10294I6l9j2o2J41j01J74p7j68L8J02K02j24n2P6r4l9m9m8K54k85K45Q7l53P5
10318a3J76o5n3q9Q3j2J94l42J81L40l57K4j56L44j82o2j14K75%J67l41J58k76
10341a20L42N9j05l57K23N5j67J64K59k78j76J46M6q4L2J39k9j22P6k22K40j79
$$ plain form
10176 55 196 112 222 230 44 158 418 80 104 111 33 176 77 261 119 49 90 30 -40 251 101 -128 1 119
10200 119 -263 80 179 150 89 123 160 62 0 -140 163 -35 116 145 90 116 -97 32 306 31 256 96 285
10223 285 246 19 251 273 241 45 -148 -175 30 60 198 250 -112 270 126 165 115 23 128 218 148 -107 -1
10246 -1 188 174 157 77 33 -55 189 187 41 180 308 121 8 -64 193 -77 -43 -82 29 106 144 52 -65 115 210
10271 210 195 83 96 200 -40 208 93 172 257 83 83 -22 -3 -35 241 165 231 -130 64 24 144 -35 96
10294 96 57 45 -17 124 23 197 120 -48 -10 92 294 170 118 194 100 61 12 -36 218 -67 178 265 -88 -13
10318 -13 163 98 45 -44 39 27 221 -121 60 400 43 67 -89 255 73 11 -103 172 172 339 -2 156 -120
10341 -120 222 281 176 -181 42 97 -70 94 353 75 -101 45 91 7 39 178 149 27 103 -119 121 -58
10363e8O8K03J07m00R8K6N1N4j28P1j49K89k04p2K89r8j45K29Q3j87j10J94k76
10386f5K52J71l08P4j34l4J50j55P1Q8j31P0K29l36J25oqJ36j07j26Q5O1l5LJ4
10411H4l9K7L4k6J06q4J08P4k03R4k5nQ3p4lj20J71J6L9L7k25L4P5j08J40L8o3
10438A85q7r7J28lKn4J7j8j08K6j06K71j74Q5J97k56r3M13j03m0j77P7M0O9L5
10463B29j52p4Q1N0j6j02J20K40r0k40N9J31K0q5j86L40k30J78r7K36k08o3j82
10486d1k03K22J31k28J49j51J66o8R1l1J60j53j05J60k2j84m8K82j75J63NJ34
10508B54k59L7K55j16j17J47k76J97J17j24k56J94J63n4K45l70P7j4Q1O5J03m80
10530a31L96j49K3k95K83j10P9o7K04j86j18O5J16M2nk58L00o5O8k24J74j78O8
$$ plain form
10363 -58 10 213 320 -80 18 44 95 149 21 92 -57 232 28 -44 245 147 2 231 314 127 17 211 -65
10386 -65 187 358 50 124 -10 -44 106 -49 22 110 -21 49 278 -58 67 61 53 189 82 -44 41 102 67 70 84
10411 84 45 72 106 80 186 102 210 284 81 175 150 145 228 154 151 31 202 218 257 294 69 103 178 70 210 248 185
10438 185 98 1 129 126 128 74 91 73 -35 -9 -115 156 -18 67 264 8 -85 328 225 185 8 85 125 194 229
10463 229 77 3 84 134 118 16 136 376 286 46 105 236 256 171 -15 325 95 273 176 412 204 141 -41
10486 -41 -244 -22 109 -119 30 -121 45 -23 68 37 197 44 -61 99 77 -107 -155 127 -48 115 120 254
10508 254 -5 32 287 171 54 201 -75 122 239 115 -141 53 216 162 407 37 114 100 181 246 349 -131
10530 -131 265 116 139 -156 127 17 96 29 233 47 -71 -6 110 152 147 -111 189 124 192 -32 142 -36 32
10553C2J8j32K18m6k2j25o2Q8J1j3J65L2L2j95N3K46J82m02M6kj66N3k7l4J07
10578E7j55J63o0J16j20J20M2j13J71R0k21J14n5q5j16j0M1O2M3L5R1j04m7M3
10602A02J63k32l7J3m8O8R2J57j56R0l28L69j85K83j46j33J53j88K41j57J01j9
10624B03M9m56K15J51q2N7qM0j23k3J96j8q8Q9P6n1j97m9K41M5k3k14J53k3k33
10649g3J48l8j79M39j36o4q9K1K5M0l2r4K27k03L97m06K71j19j69J42J00N8j40
10672A26J6j02J09L3r3k37Q9J78k9K44m15pM0K02j66J36L7q0p2J22k66K10k2J6
10696F9J4n7oK33k54Q6R4n17N55m4l1k09L43m32L35P7k55J81j79J43L63o04Q3
10719a2J61J48j87L7L2j10K14O3m16M09o6l47r3K80K4J75l58R7J70L2k26Q2l1
$$ plain form
10553 32 50 -82 136 90 68 -57 -119 -31 -20 -33 132 164 196 1 54 300 482 80 126 124 -42 11 -16 -50 57
10578 57 -98 65 5 121 1 121 163 50 221 311 90 204 149 64 -52 -62 -21 41 84 119 210 106 59 102
10602 102 265 33 -4 9 -39 29 121 278 122 212 -116 253 68 351 205 72 225 37 278 121 222 203
10624 203 252 -204 11 162 80 137 129 169 46 23 219 201 113 202 278 227 30 -19 222 267 244 30 183 160 -73
10649 -73 75 37 -142 297 161 97 8 29 54 94 62 -32 195 -8 389 -17 254 135 -34 108 208 266 126
10672 126 142 40 149 182 89 -148 -59 119 90 334 -81 -88 -48 154 -12 124 161 81 9 131 -135 75 53 69
10696 69 83 26 20 253 -1 85 179 -338 217 173 142 -67 276 -156 179 256 1 182 3 146 509 -95 -12
10719 -12 149 297 110 147 179 69 283 346 -70 339 273 -74 -167 113 137 312 -46 51 221 253 27 109 78
10742G8j96L75l71K98K4l0ml41J75K15j08K22k84k11J88P1J55j49J60j77K6J16
10764B32j16J61o0j06J26j23r5J96K23l62J29m0p0J79j20nk26J53j94K92J6m15
10786b25K57J13j78J51J49j85j99K12R6p4o1K6RQ7J15j80q7N1J10j69l3K62r1
10809A56Q0k79rL9M6K69l43J68o0J0K06k03n5j6J5J65j38o2K15j35k0J75k14m6
10833c6J87l17J46l2K74r7j91J66m7k48J88j91K54J91q7J25k61K23j61k66M04
10854B24J12k63k1J14J27l2p8l2j39K37J03k89M6J93k04p2J38j85J07ml07L10
10876H5j4Q3n6m8P7j1Mm5p1J68Q1p7M5k83M0J63m5j39Q0J42j14K00j16m1J69Q4
10902C61m69L40j47o8K6K40l6j10R4j73k5K59k04J67j75n3Q3R9J0p6m3n6K91k30
$$ plain form
10742 78 -118 257 -114 184 208 178 174 -167 8 223 115 337 53 -158 30 101 256 107 267 90 116 232
10764 232 116 277 217 111 237 114 19 215 438 76 205 165 95 274 154 149 -77 76 -118 174 190 -225
10786 -225 32 145 -33 118 267 82 -117 95 191 117 56 82 91 178 293 113 26 77 187 18 -15 247 156
10809 156 236 -43 -52 -13 33 302 -41 127 67 77 283 80 25 9 24 189 51 -11 204 69 49 224 10 -36
10833 -36 151 -166 -20 -52 222 125 -66 100 53 -195 -7 -198 56 247 160 285 24 247 86 -180 224
10854 224 336 73 52 166 293 261 183 151 12 249 352 63 109 302 98 26 164 -21 86 82 -225 85
10876 85 71 154 98 50 127 116 120 75 4 172 253 176 221 -62 -22 141 96 -43 37 179 65 265 149 108 277 361
10902 361 -108 232 85 17 43 283 247 137 231 58 33 292 88 255 80 27 110 209 219 143 100 44 335 105
10926A05oJ8j67J15n2K71l3m40J7K12L4Q3Q9l17K21P6k09M5L2j68J21J62m84L51
10950G6M31n58o4J01J72JJ49j57j73N2K70q0K32l07o2J7J62k24K25Lk60L08l69
10973e5J70O1n8j9k32j21L49o7j31K75p3j82LJ33p1J84N4r9J8k30J08n0J01l5
10997C3L20j34p8j72k8J11L9J23j92L87k62l7M4K1j61K96m40K10n3mK71m5K6j0
11021B65j31j24M8o1J42k2J25j89j00k00P8L72k82J41j96K90l6K05k87K47j18
11042A67l81J24K51l42M08l05K12m2j05J90j53K23j89J28j01J16P2p6j45R3K2
11063A67M7j06L63k30K0k98J84M9j13K69q7p9J21k31J46j25o5r2J54Q7m9o1J38
11086B09j62Q0p9j39J88l04L34r6QO9J70q8l5l1j58J25K47k29J68l20L06k16J64
$$ plain form
10926 105 99 117 -50 65 13 284 251 -189 -172 40 74 157 246 -71 150 226 17 62 94 -74 47 209 -275 76
10950 76 507 -51 -115 -14 158 159 308 151 -22 30 300 220 452 145 83 100 262 38 263 266 6 314 -55
10973 -55 115 176 118 99 -133 -254 95 28 -103 172 99 -83 -80 53 -18 166 220 121 139 -91 17 -33 68 33
10997 33 353 219 141 -31 -59 52 91 214 22 409 147 110 154 175 14 310 -130 80 27 23 294 249 275 265
11021 265 134 10 58 -3 139 117 242 53 -47 -247 -169 203 -79 62 -134 156 120 325 38 285 167
11042 167 -214 -90 161 -181 227 -78 134 92 -13 177 24 247 58 186 85 201 273 197 52 145 167
11063 167 214 108 471 241 261 -37 147 196 83 352 265 186 307 76 222 97 32 -60 94 181 132 71 209
11086 209 47 127 48 -91 97 -207 127 31 39 108 278 190 155 124 -34 91 338 109 277 -43 263 47 211
11109B11N7k52R8J4Ll6K86k22K7j16K49k29k30K57m7J23j89J80r2n1rJ08n1j09
11133b0K18j63J4k33K19N8L1j56K88k71R7J06k81L24J3r4j75K19J3m4P3k04J15
11156A47r6J18j11o7rp7J84j9j69K44j88K73k1k43K20l25K70p1M4N5J16l12J05
11179F8P9j67j9J94j14m3j7J02O1k9p5J19j68Q5KK80k49M6J09j00j22J42J81k49
11203A16LJ61j40N5j85J23L8r9%p7K94j70n7n2L19l37m3K32j85J09k74K49J33
11226B13m3p4k00K36Q4l20O8O8k6Q6p0J89k00q7J99mJ05J22j33m5n3q7K29l13
11250e6J48J3K1R2j99K81j48j09J50K8j26m2J27L2k63J87J13k43j09J87Q6k16
11272d6J95j0o2J26n4p4K69k32J84l2j13k09M7J44J16j44j29J65j09Q0K7L0J37
$$ plain form
11109 211 268 16 114 128 131 95 381 159 186 70 319 90 -140 117 70 193 4 184 92 41 32 140 89 -20
11133 -20 198 35 49 -184 35 93 124 -32 256 -15 82 188 -93 231 244 150 -25 194 207 163 236 32 147
11156 147 51 169 58 -9 -18 -95 89 70 -99 145 -43 230 209 -34 186 -139 131 60 104 159 275 -37 68
11179 68 147 -20 -39 155 41 -2 -19 83 144 115 40 159 -9 76 78 358 109 155 264 164 42 184 365 116
11203 116 119 280 140 195 10 133 171 72 72 -5 289 119 62 10 329 -8 -51 181 -4 105 -169 80 213
11226 213 170 96 -104 132 216 -104 -36 32 6 92 22 211 11 -76 123 119 224 346 213 168 115 28 257 -56
11250 -56 92 105 126 218 19 300 152 43 193 221 95 53 180 212 -51 136 249 6 -103 84 170 -46
11272 -46 149 139 77 203 149 75 344 112 296 264 151 -58 -11 133 249 105 -24 141 32 112 139 169 306
11295C06m17L50m4j1Q8j15KJ70k25P0j58M01m48Q1M20k87j78k9J13J86k57P7j46
11318e1L0Q2p5L44j61j41l6K20m05p8L50Rk60M34j68K35m12K07k25K32j09nJ69
11341A86j97J74m2k8J5N7K6P1r0J21m2k61J2K71l54K65j63M6JK86l48Q1j2p6J53
11366A52J7J21j91j05p1J29L6o8N3j62M4Q1L0P2j73j04L24p1l22K94N8j73Rj31
11390a51K74j60J44J25j69R5j32J58k13M6K4K29q0l35K27J06k11o4J29J99k83
11411d2K64k22J14J04o7k64J07J1J2j62K09J89k24J5Q4j26j55K30L39k51k95J52
11433B2J31q1m6K12p4q4J62l60O8K19k17L11Pp4m9j19R4k0J25q3j2K0O4l09J95
11458A02rJ0K63j41R3k25l7P3q2l4k7J42l2p6J9M1N6l54M66j60J6k17J7J74J63
$$ plain form
11295 306 -111 239 195 184 272 157 159 329 104 174 16 417 -31 50 470 183 5 -24 89 275 18 95 -51
11318 -51 -21 61 -14 330 169 28 -8 212 -193 -271 79 88 -172 262 94 329 -83 124 -101 131 22 17 186
11341 186 -11 163 121 93 108 165 191 262 172 293 251 -10 2 273 -81 184 21 67 68 354 6 87 75 -1 152
11366 152 169 290 99 -6 -77 52 88 20 73 -89 -45 36 66 138 -35 -139 185 114 -208 86 144 -29 -20 -151
11390 -151 123 -37 107 232 63 158 26 184 -29 17 41 270 190 -145 82 188 -23 -87 42 241 -42
11411 -42 222 0 114 218 151 -113 -6 5 17 -145 64 253 29 44 128 2 -153 77 416 165 -130 22
11433 22 153 72 26 238 164 80 242 -118 -50 169 -48 263 270 196 147 28 122 102 227 144 132 152 216 -93 102
11458 102 93 103 366 225 318 93 56 129 47 13 -14 128 96 20 39 80 136 -218 248 88 104 -113 -96 78 241
11483B41o5j12l6m6J34k75L41k75K40O7l9j13K3l4Q6q9J93J17j79j1OL5QO0k71
11508FK71%j78p6J41J49k40l7k1L71m90J69K7N8R8p0J03k36j31l6R9J37L8J29
11532B81j96n0R1q5L8q7J52p5m10K09J93J37M4m3K3l7j29m6J98k9P5q5Pk1k22
11557f7L68k09Q8l04Q9K21MJ05k01n8R2j34L5J31j74QJ06J27j31K01k95J33l9
11580I6J4kOn1j20J63Q3j6k14J84N6q8j22R7J85j26J06l27K18j61K90M8k65j6
11604C8j5N2P3q2p2J52J68k66K7P1o9J05l2m5j78J70j83L17j20p0M6n7q0J24q1
11629gJ19o1j24j06J85P5O7j04J08l0J95m38K48K7p4J37N1j96o6L27o09M60q4
11652A00m6M7N9l21N0P1R1J4J51j15l4Q5j82J06l3J37j12O2J09k21p5K00Q4k69
$$ plain form
11483 241 176 64 28 -18 116 -159 182 -93 147 214 175 62 85 51 137 48 241 358 179 168 174 209 217 277 6
11508 6 277 277 99 23 164 313 73 36 15 386 -104 65 92 150 248 178 281 45 -86 -122 -23 114 152 281
11532 281 85 35 126 41 79 -8 144 69 -341 -132 61 198 242 199 222 185 56 10 208 179 254 169 176 155 -67
11557 -67 301 92 180 -124 -35 186 190 295 94 36 128 -6 29 160 -14 -6 100 227 96 297 2 135 96
11580 96 110 108 114 63 -57 106 189 173 -41 143 199 111 -11 86 271 145 251 -76 142 -19 271 319 54 38
11604 38 23 75 148 66 -6 146 314 48 75 146 77 182 150 105 -73 97 -86 231 111 41 87 30 -50 74 -7
11629 -7 112 51 -73 -179 6 81 148 44 152 122 317 -121 127 154 80 217 268 72 6 333 -276 184 100
11652 100 54 101 160 -161 -111 -40 51 65 216 101 67 152 -30 76 43 180 68 130 239 18 -57 143 227 -42
11676d2L23l15R5kJ33l3lj75J07K9n8J32k42J64K1J00OK08k34j66J34K2N6j04
11700A56L8p9P2r9M4K8J9l29J74K66k25J93l00n1J88R0k89K98q5j37J71q2K12
11723B73l48J25J39r4l2N4M8R4r2K0Q0q4j90N1O0L3j19J74Rj18J28rj11N1j3l6
11749I3l4J77n2P1L0k84p0L76o9j48M8J84k24J02r4q0J8P1O8j30m8M5J7q1J74
11774A60j70J27K5r5r7J14J05r1q6Q0Pj30L58j27j31L18m18J60j19j5J10O7J08
11797B60j24M4j39J44j00m7L8j49K76j94K79j78N4p3K06k46l3J16k7j36J63j22
11819A2r6Q9J8o4K08l4mk99K46L4j74p5M2L77k25j28N5O8m7J59q0n0ro3K46J25
11845C31k18q8K00q8J14j71J6J60k40J08J6p9P4r5K49k75J51p2o7J03n7J21k70
$$ plain form
11676 -42 281 -34 61 59 192 159 156 -19 88 117 59 191 -51 113 134 234 240 448 214 48 182 204 260 156
11700 156 194 115 187 88 132 160 179 -150 24 290 65 258 -42 -93 95 185 -104 194 109 -28 143 61 273
11723 273 -75 50 189 95 63 117 165 259 167 187 267 183 -7 44 104 137 18 192 201 83 211 202 91 142 129 93
11749 93 59 236 184 255 285 1 -69 307 238 90 138 322 98 200 106 26 44 115 183 53 5 50 67 -14 160
11774 160 -10 117 142 47 -50 64 169 78 -8 72 79 -51 307 180 49 367 -51 109 -10 -25 85 152 260
11797 260 136 180 41 185 85 38 76 -73 203 9 288 110 164 91 297 51 18 134 107 -29 134 12
11819 12 -84 5 23 -41 167 133 129 -170 76 110 -64 -139 -97 280 55 -73 -18 50 3 162 82 32 23 -40 206 331
11845 331 113 25 225 137 251 80 96 256 16 124 140 61 135 40 289 14 165 93 26 129 72 193 -77
11868g7L15R3o27M05j15Q0j28R6j4OL67j31j52l6j30J79j00J53J00r6p8K10m41
11891a21L92j72m4J01j73Q2J06On1J30n45M15N5P7l67J58j8M0m0K26j69J92n36
11914b56K16K9K6k13K38m3q9J24J19o1o7J16oL7k00K8J22j41M4L01l0j18N5j44
11938H7j04nK72j95q9K54nM6l99L47m8p2K83k92j51K83j35J03p9j56K85j63j20
11961e3K41k98J87k4Qk5K30k28P7J74j28m4q9R9J05k06M4%O3l6j53j0K1k9K79
11986B05J0k0J90j73j06k3L45k16N6k49J26M3Q6mj9q3j02m8n1J49K01l17MK01
12010B05j91J4J70j14J28j55P5j13J14L5j33j60L90k31r7M6J47j47l6J91k7K5
12032A36j25q4K33J11j9k9k26K11J87k55j6J70j96J25l9L0j77J50l21J46j60K29
$$ plain form
11868 -77 238 331 -296 109 -6 74 -54 42 28 34 401 270 118 82 -48 131 31 184 284 188 110 320 -121
11891 -121 271 99 55 156 -17 65 171 177 126 256 -289 126 181 258 -109 49 31 71 31 257 88 280 -256
11914 -256 -40 -11 15 -198 40 -3 -92 32 151 90 23 139 133 170 -30 -2 120 -21 23 324 294 176 231 87
11938 87 -17 -22 250 55 -34 220 215 261 -138 209 161 89 372 80 -71 212 77 180 101 -55 230 67 -53
11961 -53 188 -110 77 53 61 36 266 38 115 289 161 117 28 127 232 26 70 70 133 97 -56 -66 -45 -74 205
11986 205 215 195 385 212 106 83 428 212 268 19 145 188 274 270 251 168 66 18 -33 116 317 0 4 205
12010 205 14 28 198 84 212 57 132 19 133 168 35 -125 265 34 -63 -17 130 -17 -53 138 111 136
12032 136 11 -73 160 271 252 223 -3 208 395 140 124 294 98 223 184 214 37 187 -134 12 -148 81
12054H1j3kj36k8K80j83L0mQ3j38J78k4k8Q8j84P8QQ2l07M05j66j18J53j0o1O2
12080A26K11l53K60k53J80J9k7Q8m8QO3l07O6J24l31J90J23j13m0K70r1k55oL12
12104B16k83K16Q0l39l5J01k4K09J16m74L21k8k99L50m3n6O6J26k50L37n5k68
12126a6J23O6J91l62R0nQ3n2K2M4K06l74J04J98j28k7j57m7K81j25K5J33k38M7
12150H2m5M76l56r1j13K63k6k6j04o4j4qJ03p5j53L92k30J56J2m47N72k15M9j81
12174d3J92k4J9j8Pj12J74j79J34K5l08M84k97J51n8m8O0j17J47l7j23L8J17j69
12198A5j82K07N3n8L0R8j96J51j54k0k39K81J54J2p1k1J20j48L50k09j41J82l03
12221h9j35K56m9N1P5M4j11L6O1j32K69j46K7j00O8J94k36j0l0o5k0J8J38j63
$$ plain form
12054 81 68 66 -70 -98 182 -1 29 25 108 -30 148 124 96 184 0 78 86 168 -139 266 100 -18 135 125 64 126
12080 126 337 -16 244 -9 171 190 163 251 203 211 274 -33 33 157 -174 16 139 26 -14 256 165 -90 -96 216
12104 216 -67 149 229 -110 -145 -44 -68 141 257 -217 104 76 -223 127 84 28 94 220 -30 307 252 -16
12126 -16 107 173 364 2 92 87 170 118 140 184 390 16 120 318 190 163 6 -41 240 115 140 273 35 82
12150 82 37 513 157 66 -47 216 190 164 60 -4 -18 -26 77 2 -151 241 11 167 179 -268 304 89 138 -43
12174 -43 149 125 144 126 133 21 195 16 150 175 -133 351 54 205 147 99 159 42 189 152 29 67 184 15
12198 15 -167 40 93 35 65 163 -33 118 -36 -56 -295 -14 140 152 81 60 180 32 382 173 32 214 -89
12221 -89 -224 32 -17 34 109 153 42 78 139 7 276 130 157 57 125 319 83 73 43 -22 -42 -24 114 -49
12245d9J9R1J45j58lk6j16J82j44K18r6j46Q0K01k83J49k26K23L7j08K53j3j64
12268F6J40j01l06K14J42n2o5J42kk46J62j28J11J25J7j18J24R1k7k75J46l11
12290a51J86J91M3n7j71Pj2K08j35k13K62k47O2J63NM9l10J78K5l5j9K07k52q
12314b4J43N2k98R4K97K9j19m2l2k35K03l0K11k16K15l14J99j89K06k25l1K09
12336A03j26OJ35j66J90l4J41k35K18j75J83k39m9K78R9j59n7j20l9K02j58J26
12358A24m05P31n95M2P0l6K0p0J84n9L1r8J97K0j19j71M32k1p0q1j04R0P0k8r
12383A45j48J40N0Q1N2l02Q8J17j48j30L3m9N3J04j07o0K17J32j70o4Q7P5j90
12406FM4j29K20K8j8k8Km15M93J06k13j27K53k4L6k56Q1N8l20L02j86K17j2p5
$$ plain form
12245 -49 -30 61 206 48 45 19 -97 85 -59 159 63 -83 -3 198 -85 64 -162 61 98 -10 243 230 66
12268 66 206 105 -201 13 155 103 38 180 178 -68 94 -34 77 202 219 101 225 316 289 14 160 -151
12290 -151 35 226 269 212 41 48 36 244 109 -104 158 -89 -27 136 141 190 -120 58 83 48 29 236 -16 -24
12314 -24 119 171 -127 -33 264 293 174 132 100 -135 68 38 249 33 248 -66 133 -56 150 -75 -106 103
12336 103 -23 -17 118 -48 142 108 249 14 232 57 240 1 -48 230 329 170 113 -7 -46 156 -2 124
12358 124 -281 450 -145 -103 -33 -69 -49 -119 65 6 37 -61 136 156 37 -134 298 277 207 126 22 112 182 154 145
12383 145 -3 137 187 268 320 18 106 223 75 -55 -22 -71 -18 86 -21 -81 136 268 98 34 121 196 6
12406 6 50 -79 141 169 151 123 125 -290 203 309 96 -31 222 198 234 -22 59 117 -203 99 -87 130 118 43
12430D3J40J2j93M2j27J23K38j01k81P5J56l53K90J24j78N0J65j97o2Q3j38M18
12452C29j65m7j92K32K45j35j88k0Q5j49K14j84J62o4r5l6J66J64r8k63L19j58
12474A22R9r5o6J44M7J57k73J60k03K75n55L36k1K1j32o4K97k44L86k55j68J79
12496A47J47m7L6m77L13j0J10j95m2j9L61l41q3M23j50l3j33k5L6K31j48J12k21
12519hK36k19J72k52K57J9m2J8k8K00m16J45j19K21K88k32j82J06j52K93k30o7
12541Hj40K29o2L12m47J66Q2l60M18j06j15q7O0No5M10m04J10N9n0K16j2j84N0
12565I3L8o8Q7n8Oj01j22J26J99j77L3k1J1Q1p8J5r8O5O9J23k15K67k50M6K89
12590C60j25l7j36J92r1j61J19j52l3MK00k1j12L6K23j5j87J0q2j6n6J88j20J45
$$ plain form
12430 43 183 195 2 44 -83 40 278 177 -104 -29 127 -226 64 188 10 60 225 28 -34 49 -89 329
12452 329 164 117 -75 157 402 267 79 59 144 -5 209 25 187 123 28 -8 158 322 224 -39 280 122
12474 122 221 126 60 204 251 408 135 295 92 367 -188 148 127 148 16 -48 249 5 391 136 -32 147
12496 147 294 247 283 -194 119 109 219 24 -18 -37 324 -17 -100 323 173 140 7 -18 18 249 101 213 -8
12519 -8 228 9 181 -71 186 205 163 181 153 353 -63 82 -37 184 472 240 58 164 12 305 75 8
12541 8 -132 97 35 347 -100 66 148 -212 206 100 -15 -102 -42 -37 -102 308 -96 14 73 23 239 227 43 93
12565 93 131 63 150 92 98 -3 -125 1 200 23 56 35 46 127 49 64 -34 31 100 223 8 275 25 71 360
12590 360 235 198 62 254 163 2 121 -31 -64 -60 140 119 7 43 266 251 64 74 -8 -24 -80 108 -12 133
12614A33K1j05J26l8K1M8o6p1J8J03m3J21p0j24L1J7R7m2K30r9l68L01k8j08j75
12639g0J56P2j61K39jj80j61K60j05J2J30J25j44j69J7K40j74j85K78j26J10J25
12661B88l26K13M1j42r8K64j82K50r1q1L04k18k1O1j15n2n9l8J28Nl0j48L84j47
12685A90j20L13n01J99J40n2j14KJ48k3O2k81O5P8L6j01J90j32j91K33m3k7n9
12708A2M7N9k55M57m28J93o4qL32k03j53J51j2K38m53k7K07r0K28j27n3K11n6
12731B06q5K3q6J46j58l4K29k82L54qk76n5o9M01k31K7K2j03NK8K09l2k52J21
12755A00n4q1J52o0j18J44Q9k38R5J96k1j92K52k23R7Jj21K49J3J1j13LJ74l95
12779d0K48k36J89p2q9l9M48k02p9l9Pm5l1L49j81r9j77N9Q7J71k54K19j64j6
$$ plain form
12614 133 154 49 175 137 158 206 140 69 87 190 147 268 198 74 105 122 219 177 407 308 -60 241 213 105 -70
12639 -70 86 158 -3 236 235 55 -106 154 49 61 191 316 172 3 20 260 86 -99 179 53 163 288
12661 288 -38 175 216 74 -24 240 58 308 217 136 440 222 201 262 147 95 36 -2 126 131 101 -47 337 190
12685 190 70 383 -118 81 221 169 55 57 205 182 244 -37 28 106 142 41 231 99 -92 141 98 71 12
12708 12 59 118 -137 320 -108 85 21 13 345 142 -11 140 128 366 -87 -114 93 3 231 104 51 262 206
12731 206 121 144 58 204 46 12 241 -41 313 305 29 -26 -95 306 75 102 124 21 26 54 263 231 -21 100
12755 100 46 -35 117 57 -61 83 172 -66 29 225 204 12 264 41 138 139 18 267 280 291 178 181 355 -40
12779 -40 208 -28 161 89 0 -39 409 207 128 89 96 51 20 369 188 89 -88 -29 58 229 -25 194 30 14
12803A4m6k2J31k58K30j20J11k1QJ80j01m2l11M19j74K68n7j20j38K42j37R7j45
12826HkQJ97N1l9R6k14J41p3k70JJ90o2L00l71j4K53O6k01r6K40j27K56k65k2
12851E1O3L3J47k8k09K13m33N70k20l23L44Rj38J0j67M40j48k5j38K70o4j74k1
12874F2r8O3J25l9N2k06J35j1o2Q0k9P1j52M2J0J43j09p1K2O2M9j24J13M3q5j58
12900g2J47P6o8L2l1Lm1J11k48N03k19q0R3m9p5j27J92rl0K28j77P4k0n6J32l64
12926g5L31j18Np0K56l01Q0j43J83r4Lj09J03L58n17K84n6j47K80q6k78P3l1L41
12950B72q3Nk68J6L32L4k2m79J42jJ18L4k38L10J10l77K95j78K35r6j60P2K08
12973B81j20J70k50j32Q6J54l04L42q4O3j19n7O6k88J08J45P0o3jl0J84j27k8
$$ plain form
12803 14 -32 -54 77 -181 49 -71 40 19 27 207 106 64 -247 172 -2 266 209 89 -49 193 56 153 8
12826 8 6 14 211 262 223 319 105 246 173 -97 -96 94 32 332 -39 -53 200 266 65 -31 209 82 338 73 51
12851 51 114 147 294 266 57 270 -163 407 187 -136 208 217 79 89 -78 362 214 189 51 321 257 83 62
12874 62 -36 27 152 113 165 -41 94 83 21 101 72 143 -9 33 43 186 77 6 28 90 139 15 128 171 86 -72
12900 -72 75 151 83 115 84 87 46 157 -91 412 193 113 206 157 82 -45 147 138 108 336 159 233 213 157 289 -75
12926 -75 256 138 143 73 329 28 108 -35 148 54 57 -52 51 409 -108 176 120 -27 253 167 -111 -38 -69 272
12950 272 189 194 -74 -58 274 308 286 -193 -51 -52 66 100 -138 172 282 -95 200 22 257 161 1 73 281
12973 281 161 331 81 -51 35 189 -115 227 143 206 87 30 96 -192 -84 61 131 68 67 37 221 94 66
12996F6ro1R2K07k56P0Q2j66J06pr8l0o6J88%j26j6J52L11l98L53l47j78L44k83
13021g0M91k11k21L79j85Q6j01J20j94k8O3q3J47k71J36J14j15Q3j64R8M4m2j02
13044b6K3k7j01K10j72K47k11K06p1J7o0q9K22j69N6J46n7l06K33l8J44N5j65
13067F7L7j8J74K5l0k39J62J2j53L5J91j53l00M7L42Q1l25J62j07l7K46q1k2l
13091A13r6j24L15j17l5n1J74P6J02k47o5j07o1J40K6k0J01Pj81j4J68j2o0N3
13115H5k0J79j8o8m9r8L67k05L08m48K64j44J2Jl7L9Q8j60L9n6j92N6K55o2m5
13140I1J55j93r9n5K18P1k75J8P4l6LL33q5k81K86L6j98k18J29K12r2R5j37J56
13164B08j84K09j9m3n3K45j96J9q9j08K76j73J31j03p0M2J37p7j8l17O5J21K26
$$ plain form
12996 66 57 -4 88 295 39 109 191 25 131 124 26 -4 -70 118 118 -8 -24 128 439 41 394 47 -131 213 -70
13021 -70 421 210 -11 368 183 269 168 288 94 66 129 46 193 -78 58 172 57 140 -24 74 118 76 -26
13044 -26 -3 -30 -131 79 -93 154 -57 149 78 95 35 -54 168 -1 55 201 144 -162 71 33 177 232 67
13067 67 104 86 260 285 255 16 178 190 37 72 263 110 -190 -143 199 280 -45 117 10 -27 219 138 116 113
13091 113 17 -107 208 91 56 5 179 255 357 110 45 -62 -123 17 43 23 124 131 -50 -64 104 92 32 85
13115 85 65 244 226 158 109 11 378 173 481 33 297 153 165 166 129 168 256 96 135 79 -113 -57 198 136 91
13140 91 246 53 -46 -101 117 188 -87 -69 5 -31 -28 305 220 -61 225 261 63 -155 -26 186 94 189 52 208
13164 208 24 233 214 171 118 363 167 186 97 -11 265 92 223 120 50 92 229 152 134 -183 -118 3 229
13187B29k84J1Q8j60K4J79j36J36K3j10j21J53J70Q8p1k24R4P1n0Q4J16j94P8
13210A94p8j24J37P5j28J04J40k69J20Rq4j28L85l63R8K39n96N28m0k53K71Lk11
13233B9K00j85K5L6k2J66j94l2K13r6n4l7j46L6O9J35j35j37oL39L6j55Q2j44
13257B3J53K83m44J01K47l02J35p3J06j76NO5J82q7l64K18k0J97j55P5jJ2j09
13280G1q8J21j55J02j68L2J1K7K18j37J52l9l8J40j05k46P9l5J00Q9J41j90r1
13303ip3j35K78L73m80K17l2j93J36M2R7k4j10k8J95J2p8p9J4o8k7j4J98k49J36
13328I9Kj00R0L5Pj50R9q5J29q4j17o6j18L42j1N9j96L5J13j41L37N9k84L5j36
13353d7L6M6K70j71j06L4PJ40J00k37N4N0k24M0N7J69k19R7J82j94k51K80M7j3
$$ plain form
13187 229 -55 -44 44 -116 -92 87 -49 87 110 0 -121 32 202 290 219 -5 89 160 110 194 310 116 194
13210 194 116 -8 129 204 76 180 320 51 171 180 96 -32 353 -10 88 327 -269 259 219 -34 237 240 29
13233 29 229 44 69 105 83 249 55 23 236 140 86 49 -97 -61 8 143 8 -129 -135 204 240 85 167 23
13257 23 176 459 15 116 363 61 196 123 229 53 58 123 305 218 -146 72 52 249 94 169 168 180 71
13280 71 -17 104 -51 51 -117 -85 -74 -47 171 34 186 147 109 249 144 -102 -23 -58 42 131 272 82 -9
13303 -9 -82 -217 61 434 -46 171 139 -54 82 124 221 197 87 59 254 266 188 109 123 55 28 14 212 -37 99
13328 99 101 1 91 126 133 -17 82 -3 126 42 -75 -141 -259 83 72 131 -65 -30 83 -58 279 338 54 89 -47
13353 -47 -11 35 305 134 28 62 69 209 309 72 126 176 -48 -8 49 218 -1 96 278 84 -167 113 160 147
13377A47J5K28l48j5n9J0J14l34M84k21O7j17L34l40Q8M4k42J77J23k95K43Ok78
13400a69M18k65J6k12L22K1j35J30j77J66K27N4l73J25M8q8K39k86j7n9Q7K84
13422C56k99m2J96n08M01j83K27j15qjO1K3q4OL8rJ79k38k91M52j02r4q3Q8J88
13447A58k7p5N6Mj55K4K67m0j21J0N4j64j37M47r3m0q6M9K42l35j60Q2J78J1j01
13472D8l6O1J14p3M1r0o1J7r4K02j05P7j48L4K38j25j93J14l9m0N7J77j07M2l2
13497G9M8k69K46o8M1J00n2j79J75j64J5J24N6j6m7ONN3M9q5QK9k93K54j32K14
13523A97%j40m2Nn5L03l12L30q1j41m3m5K04J1k04Q5l37M13j13J82j60Mo7O2j89
13548a33J30Q7j71J11J64j37J83k01M8P8L7j85J31L0j35P7l4NP6J18k90K40k57
$$ plain form
13377 147 162 390 42 27 -32 -22 92 -242 242 21 88 -29 305 -35 53 97 -145 32 155 -140 103 109 -169
13400 -169 249 -16 0 -212 110 131 -4 126 -51 115 342 396 23 148 196 108 347 61 44 -15 72 356
13422 356 57 15 211 -297 104 -79 148 33 25 24 85 108 24 30 68 59 238 0 -291 161 59 -35 -118 -30 158
13447 158 131 56 112 116 -39 -15 252 212 91 101 155 -9 -146 301 208 168 82 131 373 38 -122 -40 138 149 48
13472 48 12 73 187 114 155 65 4 21 -73 129 24 101 -47 -13 225 100 -93 21 -18 -58 -1 176 69 111 79
13497 79 127 -142 104 36 77 177 125 -54 121 -43 -28 96 152 136 89 95 100 153 202 117 125 154 -139 115 -17 197
13523 197 197 57 15 20 -35 268 -44 286 205 64 21 -24 180 191 -13 72 -265 148 35 217 57 61 -6 56 -133
13548 -133 -3 84 -87 24 188 51 234 33 81 159 196 11 142 172 37 114 80 85 161 279 -11 229 -28
13571b8P7L62m61p8J75J90j89J7%p1J80j28K39m27R0N7k75L55J36Pk38L4K50k67
13595Gm7q0J82Q4j93J63j44N5K07m2P7j2k47J27J36j41K25J09k61J75o7k05p3
13618C5J1J50Q3K1r8j57M0n5J80j80q0J91p7k57J48K94j53K0Q8k31K00o3R3j17
13642H6P0r6R4k36J28k1J92k52K52l8m1J1n8r2j53K44J00pq3m1q4J40j58j37K94
13667A14j04q1J19J05k97L25M5l8k13L09l27K33q4j77l0o4j0J89L04k73K87j41
13689A91j54l0N7k5L1J44r2Q8j13k2K2J00J59m66J82k00L79j30kJ15j10P9N2j34
13713A21J83j5j71p8K0jj46p9K66Qj17k4J35n6J0k24j7L44m9r4J28j1j19M7M6
13738A07j40L48j17k35J84J28j84n0J52r2n1J00L28k15J26j39j45k9J20j19J86
$$ plain form
13571 -28 49 411 -50 -128 47 237 48 65 65 -6 174 46 285 -142 -52 5 -270 85 221 228 -10 24 274 7
13595 7 -40 -120 62 146 -47 116 -28 27 234 192 269 257 10 137 273 132 357 466 205 380 313 108 35
13618 35 46 196 279 300 202 45 85 30 210 30 -50 141 64 -193 -45 249 96 116 204 -27 173 110 203 86
13642 86 156 60 154 -82 46 25 217 -35 217 179 138 149 91 -1 -154 90 190 183 100 59 -25 115 -43 -180 114
13667 114 10 -71 48 153 -144 181 226 188 -25 284 -43 190 106 -71 -101 -165 -175 14 318 45 332 191
13689 191 37 7 64 39 70 214 122 210 97 75 97 197 356 -110 72 -128 251 121 119 234 124 203 255 121
13713 121 304 289 118 40 60 59 -87 -166 100 108 -9 -33 102 46 56 -168 -185 159 110 16 144 133 14 61 107
13738 107 -33 315 198 -37 147 275 91 41 193 101 50 150 478 263 389 250 105 76 196 77 263
13759B63j39j03K9J86j30J5J63l08P2o9N4O6K19r5l52K13J64q5k71O4L40l47Q5
13782C4L4L2p7k23L00l7j17J70m1Ml2J20k33K36j78J11J35j39J22k62p5L66m5
13805B05j49J52l1p2j07m3K63k79r5J47J9J98k62J31O2o6J45l2k6J56l56o3K30
13828A27o1k5L2k37KL0J76J07r3L1o1J26n8K28l6l15K87j57o1J85k53L2J66K5
13852A97O0k21%J51J37j83q2p7R4L1O6j02R0n6r6J85o3j94L23k33O0k04K26j82
13876g3O0K76k31mK62j45j52J05J26k71J4Q9K06j83pmk6K71k72Q2m2P4j82j74
13900b01N02q0L6j69O9L8r1L6j69J76J68o6j3M4m8k91J58O3kk69N6K11j37l6J1
13925dO1o5J41k83Q2L6J95j0K3p8j95K96k7p4k19L88k81j3K14Rm3k61Q2Q7Q2O0
$$ plain form
13759 263 124 21 50 236 106 121 284 -24 48 -21 33 99 318 223 -129 84 248 163 -108 -44 296 -51 34
13782 34 68 100 23 -200 100 63 -54 116 75 79 47 167 -66 170 -8 103 238 99 221 -41 -116 250 205
13805 205 56 208 177 105 -2 -45 218 -61 -156 -9 10 208 -54 77 139 73 218 186 160 316 -40 -103 127
13828 127 66 41 73 -164 -162 -132 44 151 58 89 28 154 96 324 288 -27 260 103 42 227 -26 6 172 197
13852 197 257 36 36 187 324 141 59 -18 76 107 173 71 161 105 9 194 131 -63 260 27 87 -117 109 -73
13876 -73 -13 263 32 28 290 145 -7 98 224 -47 -33 56 262 79 72 68 42 313 41 123 81 155 -27 -201
13900 -201 301 221 257 88 157 195 104 140 -29 147 315 249 236 280 232 -59 99 162 160 -109 -53 158 21 -15 -4
13925 -4 57 -8 133 -150 -68 -32 163 153 176 98 -97 199 172 98 -121 267 -14 -27 187 196 153 -108 -26 61 143 203
13951B03o0m9J80LJ1j37m1j52J69J33K25n23L23l45K05m13K90o2p4K76j23K7M0
13974A06L5J60K7m67J27K0K4j00N2J21J22k11l4n8j94L29q1L72m81J15J28k93
13996a81M59k33M2j6J65j54K44k89rL29j45j04O3k58L41k07j55K60j6k9N2m5J25
14019B39k15N2Q1j48J62j59N2J51l7j31L18l86K46m12M21j82P9N4Qj50K40m4j89
14042E0j31P1n2K71l5J19k69rJ62j11O3J55j40n6K88k78J12J58k63j80K2J37J00
14065A84n6R3j03p5j34l3J57L2K03j00P5l04K48k03L6L9n0J43j44RmP4j33K56
14089B10j80J02J62j98J56M7k60M3J06J69k81J33R4l70K43j40J15R7j26K6n7j67
14111g6L23j45J23k13J81M6k76M34k70l1j62K37mk26j1J82n8p4L7K6j03jJ69o0
$$ plain form
13951 203 143 94 274 277 288 151 110 -42 127 260 485 -38 285 -60 145 -268 22 -40 -114 162 39 66 106
13974 106 141 301 328 -139 -12 8 32 -68 -16 105 227 16 -18 -76 -270 59 -22 350 -131 -16 112 -181
13996 -181 278 45 87 71 236 82 326 37 28 357 212 108 171 -87 254 47 -108 152 136 107 159 114 239
14019 239 24 76 157 9 171 12 64 215 178 47 365 -21 225 -187 234 52 131 185 193 43 283 239 50
14042 50 -81 -10 -62 209 174 293 24 15 177 66 129 284 144 88 376 98 210 368 105 -75 -53 84 184
14065 184 128 221 118 43 -91 -124 33 65 268 168 243 -61 187 -16 20 59 9 152 8 17 13 87 -46 210
14089 210 30 132 294 96 252 299 39 82 188 357 76 209 303 -67 176 36 151 248 122 148 91 -76
14111 -76 247 102 225 12 193 239 -37 397 127 96 -66 171 167 -59 -70 112 54 -20 17 43 -60 -61 108 48
14135D8n0r0K21L0k65K70l7q1K41k69J95R4j22j06M8j6j5o7J81L9n8p1j98K02
14159A24M9J91l35J45j57L78k54r6J30K1j28J32Nl65K38R0P3k23j45J35J00p5
14181C3j9Q3J5n0J43k26j57L41q1J25J27k44P0J33k49J32k3K78l21k1R6P2L5j68
14205A24R3j71j7J69j5j98J44p0p3N6k4M7lq7K06l37K09J38M0j64k79M61l32J0
14229g3p3K28p0m5K31o6K27k13O8J42j32k03K03j41oo0J8J66j73j68K18J18j66
14252C0K24j35m4M03m21J97P6j06k09R0J02j76j11K22PK52q7l62K09L3l07M36
14274C23k16p5j1q7K83r2p4M4j68K72k37J24k09J10K97j52q5N7j4J42k6O2j66
14297A02L6L6j57J10J15k13J99O4k29npn0O6o8K25Q6l38J28j11j19N91l80j51
$$ plain form
14135 48 -2 -92 129 159 -106 164 127 46 287 18 213 307 185 79 127 111 96 29 210 249 191 120 -78 124
14159 124 173 364 29 174 17 395 141 45 175 196 68 200 205 -160 78 168 241 18 -127 8 108 33
14181 33 14 97 112 62 205 -21 -178 163 82 207 334 90 160 293 44 176 153 431 110 89 185 257 292 124
14205 124 217 46 29 198 183 -15 129 59 -14 42 18 65 62 -25 181 -156 53 191 231 67 -212 249 -83 -73
14229 -73 -146 82 12 -33 198 132 359 146 214 356 224 21 224 83 77 17 35 201 28 -140 78 196 30
14252 30 254 119 75 478 57 254 330 224 15 105 207 31 -80 142 149 401 314 -48 161 194 -113 323
14274 323 107 32 21 -66 217 125 51 95 -73 199 -38 86 -123 -13 284 132 47 104 90 232 206 268 102
14297 102 138 174 17 127 242 29 228 292 63 58 51 1 67 -1 224 310 -28 100 -11 -130 461 81 -70
14320g0P2k04L37j70M4p2P0P3k31J70N1P2J80p4j35J02j79J90j15m8K69p9L2k15
14344G0j84N2L51k15K8j88J71P4l7R1j86K19l08R0J10k59J04m3J97r1O6N2k48
14367h4q1L10j02J23l29J74m5N2k3J10j10K26j72j18J05J5J4J12j81N6jJ53k66
14390f2M85j56j9J8J21k08l6j22J18J98k17o5K55k86N8m2J31K20m15J99j16j63
14412a04k0M7K86j3j63j95L34k37O7J30j39k33J87K95j16j73Q6J20M1j61J2K26
14434B77k88L55k61Q1k4j11k16L19j41J80n6j2K4K1q2K56k37L2j01J64l45L17
14456A52j20k8K44k65K04j03j97J55kOj27J49L20l11M4j32o9lJ83j39P1j30N5
14479d3J45J33m28M19np5p8j93M56j28j96L24j27Kj04q0K60k02K56j90O5j06J05
$$ plain form
14320 -70 2 -202 135 -35 9 -63 7 80 -151 19 70 142 322 248 113 215 36 226 111 63 332 253 285 70
14344 70 -114 -62 289 74 102 -86 85 159 122 213 27 246 -62 28 138 -121 -17 -60 137 46 112 164 -84
14367 -84 -165 145 43 166 -163 11 -34 18 -5 105 -5 221 49 -69 36 51 65 177 -4 52 51 204 -62
14390 -62 423 267 248 266 387 179 143 21 139 337 120 55 310 24 82 40 171 391 -24 175 59 -104
14412 -104 -124 -77 209 196 33 -162 172 -65 2 132 -7 -240 -53 242 126 -47 39 159 200 39 51 277
14434 277 -11 344 83 164 140 29 -187 132 -9 171 115 103 127 148 66 322 85 117 16 180 -165 152
14456 152 32 4 248 -17 187 84 -113 42 40 46 -81 68 388 77 121 -11 -80 -83 100 -39 32 -98 -43
14479 -43 102 235 -193 226 221 146 68 -125 331 203 7 331 204 206 102 22 282 80 336 146 211 105 210
14502B10m5l9J04r0r8o7OJ37J21j62P0j7j33J27m5K04j2j51l03L17n9j55J57j44
14526f7K96j68Q4K02k64O8j06n1J87k27J18O2l0l3J35Kk1p5M3r1P4Q9j58L4J21
14551B24k06K09j76o6J31M1j37j79j41L56J14k12qj8L8J61Lk40P8K49j64M9J14
14574B20k67Q6n3J35q0J23l5j75J40J13l5o5j49K41n8n8j07L44p4j56J03j39P9
14597A33q5J50j12j74L9m9N3M28k52r1j13K98m2r6k5j37J30J12k39m2L63j65l2
14620E2k52J74J07j4kj41N5J99r4r0K52l33J75Kl0R9J28j92j0K11m5r2j84R8n3
14645B0J12r0l3J16M7j39J80l3j49j5K06j76m2JJ91j96lM9J8J51j23K77n42O02
14669D29l57n3Q1l3j49K23j14K11j80o0O1R1j53Q4O4R5l01K11p2j72K81j11K0
$$ plain form
14502 210 165 126 230 140 42 -25 -19 118 239 77 147 130 -3 124 79 283 271 120 -183 134 75 -80 77 -67
14526 -67 229 61 145 347 83 151 45 -6 181 -46 72 134 104 71 206 208 187 112 155 64 138 227 69 103 224
14551 224 18 227 51 -15 116 157 20 -159 -300 56 170 -42 -50 -68 -30 131 134 -106 -28 221 57 106 220
14574 220 -47 39 -14 121 41 164 129 -46 94 207 172 107 -42 199 141 83 -24 320 246 90 193 54 133
14597 133 48 198 86 -88 -49 -98 -45 383 131 40 -73 225 183 87 62 -75 55 167 -72 -114 249 84 52
14620 52 -200 -26 81 67 65 -76 -21 178 84 -6 246 -87 88 90 60 159 287 95 85 296 251 159 -25 73 20
14645 20 132 42 9 125 172 33 213 180 31 16 222 46 4 5 196 0 -3 46 64 215 92 369 -173 429
14669 429 72 19 100 67 -82 141 27 238 58 -2 59 150 -3 81 145 240 -61 150 78 -94 187 76 96
14692I6O8j30J04j06jJ78j09K07j69l0L3Nr2q5J42L1K9l98K51j7r9M4M6m7rM0
14718a8J96r0K39k12j02J12o1k09K46r7K44n49L22J41J08L5k1j92J34j96JK68
14740B99l30M56m48J67J17k35M7O6k24k7k5K67m7J52j39j89O9J35P8k64N4Q5o1
14763CjJ46J32l22Q8Q7k2n3K03k70M0J07J1K7J45l84K10rQ5N2j57QQ6m3J46l60
14789d5K53P9k05n4P0K40k64K41k56L4k2K71m94J58J29k28J16K55j52J81l72L96
14811C31q6k89J96j85J86M2k26O7m8J84J5k42R3J41O0q4N8K4Pj07mQ4J46k47M4
14836A60p2K14j52j51j2L03o1k6L5p0pn8n3J36k27L4R8j06M7n6J56k41J68P1k18
14861h8j33J21J8J50K49k24p1Lj35K26j31K08j9o4j46J09O8j18K80j56P3K1J54
$$ plain form
14692 96 164 34 138 32 31 209 100 307 138 108 141 146 54 -31 111 142 171 -227 24 7 -92 -48 -2 -49 -58 -18
14718 -18 178 88 327 115 13 125 64 -145 101 4 248 -301 21 162 270 305 284 92 226 30 31 299
14740 299 -31 425 -23 144 261 26 73 139 -85 -112 -137 130 83 235 96 -93 -24 111 189 -75 -21 64 3
14763 3 2 148 280 -42 46 133 111 58 261 -9 31 138 149 176 321 -63 147 138 223 275 118 126 212 169 315 -45
14789 -45 208 287 82 28 98 338 74 315 59 93 71 342 -152 6 135 -93 23 278 126 307 -65 331
14811 331 245 -44 152 -33 153 195 -31 36 -12 172 187 -55 38 179 239 155 213 237 244 137 133 217 363 116 160
14836 160 88 302 150 -1 -13 290 229 203 238 168 161 103 50 186 -41 -7 91 -15 32 -24 132 -109 59 130 -88
14861 -88 -221 -100 -82 68 317 93 22 25 -110 116 -15 193 174 110 -36 73 141 23 303 147 220 241 395
14884C95l50J92k8j85R9M1N4j2J15k16K4n3k7J05j62R6l5J78Q8l22R6k80K81O9
14908A63L8k28K9M0K75l67R1P1j57J21J72o6j87K49j8j07j59L6J34L9j36J55r
14931A79k28J68J40j77J58r2P9j57OJ39j25J32j12r4o0j4K88k00R3j62J21J40
14953B22J2k38k05K04K9J11p5n4j45J80m0k2K38J68k08j73j41J56K57j70K00k20
14975H6O9j38M8J13r0M1j9k21L19j68J85p1O8j60P3L7Mj7r9P8J24o0J74l49J23
15000A50j37k26L70l1l5J8o1j75J78P5k75K39m9Q6kj83R6j60J78J12j13M0o0q
15024B7L23j21j22j26J92j68J00J36Qk51N4J18k5j61J74j21Q5J83j48j42j52M54
15046C17l5o7j07k21J40k2N1jP8J6j81J44l2J03J7k88R2J46j82J29npM6j70J22
$$ plain form
14884 395 45 237 209 24 123 164 218 206 321 105 129 76 49 154 -8 88 53 231 319 -3 93 -187 94 163
14908 163 201 -27 2 42 317 -50 41 112 -45 76 248 182 -5 244 226 119 -40 -4 130 169 33 188 179
14931 179 -49 119 259 82 240 148 227 70 76 215 90 222 110 16 -44 -58 230 30 123 -39 82 222
14953 222 234 -4 -209 -5 24 135 60 6 -139 41 1 -21 217 385 177 4 -137 19 276 106 306 86
14975 86 155 17 65 178 88 129 110 -111 208 40 225 154 222 62 135 172 176 159 60 138 262 202 376 27 150
15000 150 13 -213 157 126 91 109 48 -127 51 126 -149 90 41 127 125 -58 38 -122 56 168 55 95 35 27
15024 27 350 229 107 -19 173 5 105 241 249 -2 52 170 145 -16 158 37 122 305 157 15 -137 317
15046 317 282 215 108 -113 27 5 56 55 133 149 -32 112 80 183 200 -88 4 150 -32 97 92 85 131 -39 83
15071H3K8J34l33K05J1j24j04J12L36n8j10l21M19n8j72O2P2p3m1o0n6j12K82
15094A22o4Q1j13j26L78l22L15l33O4Q7j69J06Ml9p2j9J85o1N1n2J06L3m5j43
15118b6J43k02J85K14k84L8K4J44l18J57o6N8P3n7j06J25J30k68O6J46l0J9j57
15141HJ04O4N6p7K8L1n9l07J12J73n0Q3m23M27j57k5K8j73K22k04K02N7k56M16
15165B80j52j3L2k16L26l07J61L%J56MJ73l93j79K34p1J35p5n7J06J92k37JP0
15189A73J29m41J87N4K53l55J57n5J27k60K34r0o2O2k03J60M03n39J61k1m6j24
15211i6K50j33q7KK15j46L8K30j27R1p4q7o8P0K18l03j84K28r0J90J5K84k91o3
15235H2j9n6K8L7l1L02k98J93k22O0l1j3J88j67K4O2q3j27K80k13J86j63j26J72
$$ plain form
15071 83 111 245 -88 117 128 4 -100 12 348 290 180 -141 278 220 48 110 182 109 68 8 -48 -160 122
15094 122 58 139 26 -100 278 -44 271 -62 2 89 -80 26 30 -9 -81 -100 85 24 75 23 129 162 117 -26
15118 -26 117 -85 100 314 30 68 92 236 -82 75 9 67 140 83 -23 102 232 -36 30 176 146 165 8
15141 8 112 176 232 155 183 214 155 -152 -40 133 83 166 -257 170 13 -12 16 -157 65 -139 63 120 -136 280
15165 280 128 115 147 -69 257 -50 111 114 114 270 274 447 54 -125 109 38 173 98 41 147 339 102 103 173
15189 173 302 -139 48 102 355 0 157 102 229 -31 203 113 51 113 -90 70 473 -66 95 74 28 -96
15211 -96 154 21 -66 -64 151 5 43 273 146 237 163 76 8 78 296 -7 -191 37 -53 137 152 436 145 82
15235 82 63 7 35 72 41 343 45 238 16 76 45 32 220 53 77 139 56 -71 209 -4 182 19 -107 65
15259F5J25j41p4K41j61N0r3P2L0Q6J04k43K64o4o6P3J16k06lj30K26r9pk2l61
15284b18L89j33K10q6j54P6R3k08p8r9J71J23j59J89j1k02J73k0j38R7k9P1R3
15307A50K0j19m7J62k45K14j19J31rJ3j39K81j70J58K2k30qm9J00Q3j05J95m12
15330a23K45J94k86N31n69J55m2r6L37l10J95l96O1K00j31J31m8j75J71K80l36
15351a2J7J29O1j60J78j52j24K73j52O0Q0J11j87NJ1j92J82j27K5J2K42l40K80
15374B20k19J32Q4k60K03j7R5j07j16K27k03j2J94j62r9NL38l9k54J95k77K88
15396B16j63n9J2JJ7K56j24J67k62J33j33j26P9j34p3J68K72q7J14lj81O3K2m3
15420A32j09L86j99L1k45q4M2p9K96j90R5n6j24K96r4j5K08l19K26k32K57K6k18
$$ plain form
15259 65 190 49 -25 216 55 105 12 84 114 200 304 61 325 261 195 268 384 178 175 45 271 172 165 143 -218
15284 -218 171 38 248 162 8 84 177 -31 -109 -208 -37 86 -73 116 105 -97 76 56 -82 15 -14 57 150
15307 150 170 51 4 166 -79 135 16 147 138 151 12 293 123 281 303 73 65 16 116 199 94 289 -123
15330 -123 122 316 30 561 -8 147 105 9 346 36 231 -165 -104 96 -35 96 48 -127 44 324 -12
15351 -12 5 134 195 35 213 61 -63 210 58 118 198 309 122 127 138 -54 128 1 26 38 280 -60 220
15374 220 1 133 217 -43 160 143 238 131 15 242 39 27 221 59 -40 -35 303 264 10 205 -72 216
15396 216 53 -6 6 7 24 280 156 323 61 194 61 -65 14 -120 -193 -25 247 160 274 271 90 153 175 132
15420 132 23 409 210 241 -4 -88 -46 -125 171 -19 76 20 -104 192 98 83 291 -28 198 -34 223 249 31
15443C1j17K76k19j62R4N0K99k26j23K47n5k0O6j59J59l09O6M41l01K13k66L0
15465A5J06K9K0p1j86K14Q7pL8K30l56K0J12j36k70K51R7r9J18j87L86m45J07
15488G3J33j12n4J05k73K43j48K43k39K31R2k48J23k4J2P0r5j08J25k29Q6K5K78
15511C09k78j90N64n29L56J08k09L30l29j6K0p4m4P5J29k19j7L04J78k56j42K5
15533I5J12k5k55K69l56L30j47q3K82r3N6l07J77o7o3rJ52J29k74j23K80K4J1
15556A15j12K18q8j20l3K00j39P8Qm19P44k01r9p6j32P4J58j51KK47n0p7q8J23
15580A82l7j74J23K3j05kK14k69J33R2j76k8O1M0k02J70J16j62J94k36L6J8L1
15603D2K97n45R5L15N2r6j31O7J41p7K23l66N2P5k7n8J32L9j76J53j63J66l34
$$ plain form
15443 31 -86 190 -29 -191 -97 -47 252 26 -97 150 95 75 141 -18 141 -168 -102 339 38 251 -15 15
15465 15 121 150 170 99 -87 127 214 207 245 475 119 139 251 115 -155 96 193 94 212 25 411 -34 73
15488 73 206 94 40 145 -128 115 -33 210 -29 202 294 46 169 145 157 227 132 24 149 -80 6 31 309
15511 309 31 -159 405 -124 232 340 131 461 132 116 136 62 18 93 222 3 -14 290 468 212 70 95
15533 95 207 182 -73 196 -160 170 23 -60 222 129 185 -122 55 -12 -75 -84 68 197 -77 -200 80 104 115
15556 115 3 221 133 13 -20 180 41 119 127 -292 452 251 152 76 -56 18 176 25 27 274 224 147 59 182
15580 182 145 -29 94 117 12 10 224 -45 88 180 4 -24 37 77 -125 45 161 -1 193 -43 -7 11 42
15603 42 339 -206 -111 204 256 160 29 96 237 160 383 17 69 144 117 59 191 230 54 207 44 210 -124
15626a24K30o7N7k0K31P2o17M72m32K21J65j65l6J4oJ09j4j26K72k4j51N3k1j46
15650e3J37J51k17M5j12j55M55j35n5o6J64R4J2Po8j97K78j61J57m82M34L3Oj76
15674I6j10L9N9MP7L9k58J93j14nJ61j47P9k56J2K10k6j2j15jK83k79K41M5k64
15699d9J45M7k61J94L5k9K61m09L96k65j08P4L40l00Q7j42K31j49N1N2o1M5k91
15722a06L26Rj31L68k28q6Lp6J54j29k11L54p1j31K9Q3r6QK3q3l6J55N8m15M65
15747B36j42J38j50J40k11J46k91K49N7j34O5Lk00K34Nk5K9j83L06k4K4j57K8
15770A43L3j39p3J83JQ2q5L6r3N8j3Pj76L2N9P5j38K11J8p6l5J71l15p4J38k9
15796AM5k6J14j85J90j27J06j74N0J83k72K80j29l5L44j28Q4k90n2L28k02K97
$$ plain form
15626 -124 106 39 96 76 307 379 -238 234 -198 23 188 23 -13 1 -5 104 90 -36 236 212 61 114 93 -53
15650 -53 84 235 18 63 -49 -204 251 116 61 -5 159 253 265 272 204 7 285 124 281 -201 233 266 272 96
15674 96 -14 25 84 88 165 204 -54 139 25 20 181 34 113 -143 -131 79 53 41 -74 -75 208 -71 170 215 -49
15699 -49 96 143 -118 76 111 82 343 -66 330 65 -43 31 371 71 158 16 247 98 149 201 140 185 -106
15722 -106 220 229 98 466 238 152 155 79 233 104 -107 247 176 45 74 157 61 69 92 9 -27 128 186 -229 236
15747 236 94 232 82 222 11 157 -134 115 172 38 103 106 -94 140 145 120 149 -34 272 248 272 115 143
15770 143 176 37 -36 147 148 230 145 181 88 146 133 140 -36 -4 55 130 -8 203 221 145 110 281 -34 -108 30 1
15796 1 46 20 134 -51 139 12 118 -56 -6 177 -95 185 56 21 365 237 321 31 -21 307 105 402
15818D02j84L9n2j23J0J52j43R4q7O3p6q1n4R9L11k14j49Q2K70l71LJ57j3l86
15842b51n7N53k05k4lj49J84Q0q6P0m4P9n3k0M9J02R7m6P9k44J50j33K8R9p2L7
15868B20J5p7K01k34r7P6P8P1m51K68L1j07R6q2P0j15J52k87J16J08q5j02j39
15891b74L79k74K79N3rj62J24l46J91L10J1l75K2R6n8L08j9n3J87m21L34l6m2
15914B25K3j82K5k37R7L81j73J56l78K85o6k0r0K6J03k31R0k27J63m2L57k83Q5
15937H7m0P5M7Kj36n6K55k11J59K37k03m55L44k12L91N6l22q8R5J89n9O8m9J4
15961A88M4J5k82R4P4j12J98j61l8J68r0J52j73j12K79K3l08M1J50j14j0M6%j26
15985e4j6Km5L05k09Q9J55k00N1m8K79l01N3Q3l1j00J71R5j01Q3r8%r6n9J86p3
$$ plain form
15818 402 218 257 205 82 92 244 101 195 108 171 95 14 -40 59 370 156 7 89 359 -12 -9 148 135 -251
15842 -251 -308 245 40 16 13 -136 48 128 42 112 68 147 94 74 123 225 322 276 355 111 261 128 156 255 183 220
15868 220 235 158 359 125 28 104 182 253 -198 70 101 -6 90 8 78 -37 115 -172 -56 52 -33 -135 -274
15891 -274 105 -169 110 163 154 -8 116 -230 -39 271 282 -93 -71 25 -33 275 256 203 390 -31 303 267 225
15914 225 248 66 91 -146 -49 332 159 315 -63 222 156 136 46 72 175 -56 34 -193 -30 -72 285 2 87
15937 87 47 122 169 171 35 -21 234 23 182 419 216 -239 105 -107 284 340 18 -70 25 214 155 223 174 188
15961 188 232 247 -35 59 133 21 219 58 20 188 98 250 77 -35 244 267 -41 0 150 36 26 72 72 -54
15985 -54 -70 -68 -113 192 -17 72 227 27 78 30 309 8 61 144 113 13 184 279 178 261 163 163 67 8 194 121
16011A21n8K58l24J54jq8L24k77n7N8j08p4K33l49J89K05j45L0J2J92k30r8J06
16034G3N4M1k14j26J93K17k56p5J44P9q8J67j03K06j14kj76J67O9k27P9R8m1j19
16058D6K57j06J37k50Q3j50K92k74K45p6J07j65j09l3J55r9l4N1k51N53n10k88
16080d19N76k21J55Q3j54Q2O9p1j42J49J40j41J96k17n5J78R6q6J50j77l6j31
16102B4L69l85J31q1J48k13L79j87M0O1R1o6l60K15O5J08l11K58l43o2K34j4P0
16125A71j81M9L0j96J69l2J46m9k69J37J05J8J44k70J53j52qK13o6o7k7K2m6O9
16149F3O0k65Q8P3m7Q1J35J82k48J82q6k20R0K46J04k86j61K70j49P3J8k59j21
16172a77J05QJ3J27M0o0J35p3J06L2N1k06J0lo8J53m2J0j57j51K47J46k86J53
$$ plain form
16011 121 63 321 -3 151 150 62 386 109 52 110 2 -72 161 -188 1 206 61 91 103 295 65 -33 73
16034 73 127 168 -46 -172 21 238 -18 -93 51 130 42 209 106 312 198 196 20 187 256 29 108 206 165 46
16058 46 303 197 334 84 167 17 309 35 280 204 311 146 37 4 159 60 26 77 -174 379 -131 -419
16080 -419 157 -64 91 174 20 102 171 100 -42 107 247 106 302 85 30 208 304 218 368 191 155 24
16102 24 393 8 139 58 206 -7 372 185 225 286 377 311 -49 166 231 339 28 286 -57 -119 115 101 171
16125 171 -10 39 69 -127 42 10 156 107 -162 -25 80 98 242 -28 125 -27 -35 178 112 45 18 40 -6 63
16149 63 123 -142 -54 19 -28 53 188 370 122 304 218 -2 88 334 438 152 -9 261 112 185 203 -56 -177
16172 -177 -72 -64 -51 76 116 56 191 118 224 256 307 101 111 108 40 193 151 161 4 -147 100 246 -40 113
16196A13o2Q6J32j63J03p0O2j27J42r5o8P7J4J11n16N61k90r8J97PJ4l9pj7m2
16221B5n7L2o5j26L61l3j96J59nl10J32J79Q1k26K31N6l99L42q2m2q7K64k02J79
16245B11l77L48l9Nj57Q3K23l42K74j92o5j05K7J28K0r3J52m1J60r7k9J78r8j83
16269iK58k8k92J36J22q7N2R4j41K61k76j36J25O1j07L15k34j87J45k7n6J64j22
16292C1R8L8j00O0j41q7K31r8K07j42P9j2k89L07J15k52J27mj6j42j2K87j48l4
16316A03q7q2N9Q2q3Q9j42n8J72oK8L3On4j14K14jj61J20j52J60j23j65K30P6
16341A44J73p3j13R1j01j60K64J40j38K5j56N4l06K08j05N9J42j45M25k84L3j90
16363a3Jj3N7J86j03j57rj11L36j79p6K91k43K1j00K10p7l9J13r
$$ plain form
16196 113 51 137 269 106 209 139 201 74 216 121 53 130 144 255 -261 300 10 -88 109 116 130 91 84 67 25
16221 25 -32 0 -65 -191 170 137 -59 100 95 -215 -83 96 177 -49 182 238 -161 181 99 57 -30 234 32 211
16245 211 -166 182 143 148 -9 74 297 -45 229 37 -28 -133 -106 22 42 -51 101 60 220 123 94 272 174 -9
16269 -9 249 221 -71 65 187 100 152 246 105 366 90 -46 79 140 33 348 114 -73 72 45 -11 153 31
16292 31 129 167 67 127 -14 -101 130 32 239 97 176 164 -125 182 297 45 172 168 152 10 -2 285 137 103
16316 103 16 -66 -7 75 -8 81 -61 -119 53 47 75 108 114 60 -54 160 159 -2 118 -34 126 3 -162 68 144
16341 144 317 244 131 222 121 -39 225 365 227 252 96 150 -156 52 -53 6 148 3 428 144 177 -13
16363 -13 -12 -25 32 218 115 -42 -51 -162 174 -5 -81 210 -33 -12 -112 98 21 -18 95 86
16383H6
$$ Imaginary data points
##PAGE= N=2
##DATA TABLE= (X++(I..I)), XYDATA
0@%%%%%%%%%%%%%%%%%%%%%jJ27k55K58k58K58k58K59k92M20n16N17n49O77p75
36c88Q50r79J051j180J341j470J670j847J995k207K457k715K990l297L631m007
52b105M426m879N382n961O619p360Q230r252J0467j1951J3814j6229J9496k4209
66a3512L1595m5003P7171k97103l70225M37214M99683L13554j74425l73084l04126
77b18261J1680J84542J84713Q914j00826j40362r5998o9634P798J10798K01765
88H5129J25704p9362k53521j73596J13357L71624L20497k0072l78534m26351j41773
99d56898K26627L47169J55362j45338k66625j37062R3493K11074J56482J4811
109A99095r6409j33810j08251l3739P9779J76359J71265K4074j81887k78259j57103
$$ plain form
0 0 0 0 0 0 0 0 0 0 0 0 0 0 0 0 0 0 0 0 0 0 0 -1 126 -129 129 -129 129 -129 130 -162 258 -258 259 -290 387 -388
36 -388 462 -517 534 -646 695 -775 895 -952 1043 -1164 1293 -1422 1568 -1729 1902 -2105
52 -2105 2321 -2558 2824 -3137 3482 -3878 4352 -4900 5567 -6384 7430 -8799 10697 -13512
66 -13512 18083 -26920 50251 -246852 -617077 -179863 319820 633374 458949 85865 -218261
77 -218261 -206581 -22039 162674 171588 70762 -69600 -165598 -235232 -227434 -116636 85129
88 85129 210833 131471 -122050 -295646 -182289 189335 509832 489760 111226 -315125 -456898
99 -456898 -230271 116898 272260 126922 -139703 -276765 -183272 27802 184284 199095
109 199095 102686 -31124 -139375 -173114 -93335 83024 254289 278363 96476 -181783 -338886
120c38886J08657K91387K20519m7582k63895k32195P292K28704K39379M7707j71197
131H9890k35369j15062P9326J98895J78796N9573p4944j58657j58284o9535O8141
142a37230J60946J24935k7175j69937j68952p560J83380K34051R3508j24879k37193
153g6106j52926N1832K04083J87610L1070j35451j95333j28843L266J15183J41309
164D5694P4086m1664j23694r8722K6925J58100J80166N6638j30529k31789j60922
175b45711L2771J88680J81037K7734j36056j76544q0293O3424J45060J21830K5363
186A47295p2131j09510o6846K7747J11660J22457L4714j06223j95786j47247K3132
197b30738J84980K01437N4250j30995j92774q4348R2457J81173J15317l8336j44397
$$ plain form
120 -338886 -230229 61158 281677 234095 -29800 -261995 -254703 -25999 213380 261087 89890
131 89890 -145479 -260541 -181215 17680 196476 256049 181105 22448 -135836 -205371 -137230
142 -137230 23716 148651 121476 -48461 -217413 -224973 -41593 192458 285966 161087 -76106
153 -76106 -229032 -177200 26883 214493 245563 110112 -85221 -214064 -210798 -95615 45694
164 45694 119780 78116 -45578 -144300 -117375 40725 220891 277529 147000 -84789 -245711
175 -245711 -212940 -24260 156777 184511 48455 -128089 -208382 -144958 102 121932 147295
186 147295 75164 -34346 -101192 -73445 38215 160672 195386 89163 -106623 -253870 -230738
197 -230738 -45758 155679 209929 78934 -113840 -198188 -105731 75442 190759 152423 8026
208H026j24271j2983Q9541J12988N8985k3846r0787j13702p6922J4628J16192
219d2151J50041P2907p2588j64524j15995M2896J74543J54856q217j70706j84676
230a63614l7701J36255J82430P1809q7491j59114j04158J1435R3109J00210N3909
241I7079m046m8198p0395n3412P877Q4371J06571L1201r8763j67648r3763P6448
253a32678J91982J41273l7099j84925j68502p141J53368J73476N1111r2068j34773
264d5976o2677L8462Q3877N7746M716l4785n7778o2161l5460L1178J01121J09010
276A27273K1453j03977j56102p1709Q8114J78740J11558n8769j75661j32634K5816
287a45898J50857J34654O554j11049j24122m1143N3570Q9088O1603R795l1720
$$ plain form
208 8026 -116245 -129228 -39687 73301 132286 108440 17653 -96049 -172971 -158343 -42151
219 -42151 107890 180797 108209 -56315 -172310 -129414 45129 199985 191768 21062 -163614
230 -163614 -201315 -65060 117370 189179 101688 -57426 -161584 -150149 -57040 43170 97079
241 97079 93033 44835 -25560 -78972 -71095 13276 119847 151048 52285 -115363 -209126 -132678
253 -132678 59304 200577 163478 -21447 -189949 -197090 -43722 129754 180865 88797 -45976
264 -45976 -108653 -70191 13686 71432 76148 41363 -16415 -78576 -114036 -82858 18263 127273
276 127273 148726 44749 -111353 -183062 -94948 83792 195350 136581 -39080 -171714 -145898
287 -145898 4959 139613 146167 35118 -89004 -130147 -76577 12511 74114 83909 52189
298E2189n8193o1833l1161L5127R7429Q9984j481j10501j31229l2140J06627J56094
310A10912O5065q8673j64920r8382M9137J44189J10917n651r8366r8083k5946
321i9801M5894P3105N3201J1093l2925o6430o5764j7669N6966J02229O4677l8004
333H6572j21124j04511Q507J21451J31533K7061r7469j32828n5224O0117J14174
344C8259P2122j7907q1011p9783k7336L2147O8630O4935K2972l6635q1189o9852
356i4648J0Q1616J01710L2020p3427j21832o5908M8405J22676R3198r588r5694
368A8538r8086k4579N6843Q5263M9580j1148n6820o6283l7357J3268O1870P2668
380F3757K5369n0991r6542o0568L6395J14674J01847J310j02345j19575l8040
$$ plain form
298 52189 -6004 -67837 -98998 -63871 33558 123542 122061 11560 -119669 -151809 -45182 110912
310 110912 175977 87304 -77616 -175998 -126861 17328 128245 122594 24228 -73855 -99801
321 -99801 -53907 19198 72399 83492 50567 -15863 -81627 -99296 -42330 59899 124576 86572
333 86572 -34552 -139063 -130556 -9105 122428 149489 52020 -80808 -136032 -75915 38259
344 38259 110381 92474 11463 -68320 -95656 -63509 5121 70056 93028 56393 -24796 -94648
356 -94648 -94638 -13022 88688 120708 47281 -74551 -140459 -92054 30622 123820 114232 18538
368 18538 -79548 -104127 -47284 37979 87559 76411 19591 -46692 -84049 -70781 -8911 63757
380 63757 89126 38135 -58407 -118975 -82580 32094 133941 135251 32906 -86669 -124709
391a24709O7253J04229N0508l6635q3104n8608K121M8199N8428L5986j858l8881
403B2929n9521l9649J6363P6979Q5745J9802p6712j21434o5003M7730J19059Q2401
415A08689k5120j03352q4356R039Q8232Q8489J9450n1458p3438m0793P228L8846
427a8544M7887L5544M123m1276p3625n5808J2080Q3446Q8622J3788p7662j00663
439h2088k7155P7554J17306N1464n9444j17660p3556K3532Q8599P4241Q029m6897
451C3925n8438l3743j590K3802L9552L8637J1183l2757n9815l3346L5416Q9309
463E2135O7748k1155j06003j04876j3560Q8871J10849L7551o0264r9696n2284
474a00684K8283P3372N5297J659l7693m0480j6582J1603L4280M2116K5747j6988
$$ plain form
391 -124709 -57456 46773 97281 60646 -22458 -81066 -78945 -30746 27682 63668 61810 22929
403 22929 -36592 -76241 -59878 17101 102846 122648 45936 -75498 -140501 -92771 26288 108689
415 108689 83569 -19783 -104139 -95100 -6868 81621 101071 49613 -23825 -64618 -57390 -18544
427 -18544 29343 64887 69010 27734 -45891 -101699 -89619 -6173 82449 96237 18575 -82088
439 -82088 -109243 -31689 85617 137081 77637 -40023 -113579 -90047 -1448 72793 80822 33925
451 33925 -24513 -58256 -59846 -36044 3508 42145 53328 20571 -39244 -72590 -37174 52135
463 52135 119883 98728 -7275 -112151 -125711 -36840 74009 111560 51296 -48400 -100684
474 -100684 -72401 971 56268 57927 20234 -20246 -36828 -25225 9055 51171 76918 59930
486E9930o6375p8522k9390N0068R6673O3868k3134r0947p6197P732Q5143Q6936
498H5785J4266o3399q1842k9323L8866O8696M1283j1062n2639o0835l6477M802
510h1879M4755O4661M4465o202n4636o0918j1055N4804P6394K6926n2454r3023
522d8162n3768K9823Q6894O8764m527p1527p8931k7196L6313O8581N3413J0676
534G0353k7792m4687l2165J268L6353M5810J4423l9568p1996m8638J8198P8793
546C52P8818J3372o3509q9679m0809L8468Q4026O0453l445n4066n5751j6501K7772
559b0499M5122K7330j0395m4279n3001k6375K1423O3635O4974J7170m8055q1674
571d4624m7149K6764Q2889O9402M74o4038p1046j8356M3945O2873K4806l2664
$$ plain form
486 59930 -6445 -84967 -114357 -64289 32384 96252 73118 -17829 -94026 -86294 -1151 85785
498 85785 100051 36652 -45190 -74513 -35647 33049 74332 63270 10631 -50204 -86681 -81879
510 -81879 -37124 27537 72002 65800 11164 -49754 -60809 -6005 70389 97315 44861 -48162
522 -48162 -101930 -72107 14787 83551 79024 7497 -71434 -98630 -62317 6264 59677 70353
534 70353 42561 -2126 -34291 -33023 3330 49140 63563 23995 -48001 -96639 -78441 352
546 352 79170 92542 29033 -60646 -101455 -62987 21039 81492 78047 23981 -31770 -48271 -20499
559 -20499 24623 51953 41558 -2721 -55722 -82097 -60674 2961 67935 85105 37050 -44624
571 -44624 -91773 -65009 17880 87282 87756 23718 -47328 -65684 -21739 41134 65940 33276
583C3276o4698m8116j800M1688O0124M4893M572l7081n8745l7404J5360O2474
595A4543O0458P134n7511p7512l0373M1147P6712M0552l2846q1227n9275R595
607h8603O8849P6049L1709k2371n1393m4555j2866K0503L9105L1004j861m1113
619D457n5986k5899K9296P0582N1954j3794p4796p2811m742P1822R2077L8161
631A10321l9348p9412n4478N605M8012M4265P142k9398m0926k5211L235L2533
643a7660M8139L3492q828n4113o2981j8528M8925Q4771N0265k7031q4980p1205
655g9734J03O5103O8207J0089n1103o3986k2139L1889N9019M1921K389l2430m6563
668a7235l5485k690L5594N6856L7424j3117o2621o5037j2907N2831P3831K7099
$$ plain form
583 33276 -31422 -79538 -81338 -39650 20474 65367 69939 32858 -25887 -63291 -47931 14543
595 14543 75001 82135 24624 -52888 -83261 -42114 34598 75150 42304 -38923 -98198 -88603
607 -88603 -19754 56295 88004 65633 14240 -30315 -43181 -22678 16427 47431 45570 4457
619 4457 -51529 -77428 -48132 22450 74404 60610 -14186 -86997 -91739 -19917 72160 110321
631 110321 70973 -8439 -62917 -57312 -9300 34965 42107 12709 -28217 -53428 -50193 -17660
643 -17660 30479 63971 55143 1030 -61951 -80479 -31554 53217 103482 76451 -8529 -79734
655 -79734 -79631 -14528 53679 63768 12665 -51321 -73460 -41571 17448 59369 61758 29328 -17235
668 -17235 -52720 -55410 -19816 37040 74464 61347 -1274 -66311 -79218 -26387 47444 74543
680G4543m5505p8500l9109L4158Q0990N9380n736n9289o4531k3138K5421M8884
692G568L7423O777k5012m3346l6696l120L7353N4978K7077k8987o5925m5426J9555
705e7781P5641P0615N329o5419q3764l2481L6503O9876M3613j1696m8958m5618
717d4140j0606K5394M1618L2229L624k9450m6268k9998J3161N6176N8316J1690
729H1746n2074q0338m1766K9067P6776N7904q116o2074n9632p000M6246O0271
741D1010K5636k2086m9714m0814p132K7978M5519L5335k74m0466n7875l2026K0695
754e4214O3885N5745J303n5754o5443j6926M6360P1800L3945k9399o8727n0445
766f7870L884M9512N4652K0286k2192m6298l9812q632K7619M7723L5791k549m3640
$$ plain form
680 74543 29038 -49462 -88571 -54413 26577 85957 80221 20932 -43599 -66737 -41316 7568
692 7568 44991 51768 26756 -16590 -53286 -56406 -19053 35925 63002 34015 -31910 -77336 -57781
705 -57781 17860 88475 93804 28385 -55379 -87860 -51357 18519 62132 50436 1478 -44140
717 -44140 -54746 -29352 12266 44495 48119 18669 -27599 -57597 -44436 11740 70056 81746
729 81746 29672 -50666 -92432 -63365 13411 71315 63199 1125 -58507 -65507 -19261 41010
741 41010 66646 44560 -5154 -45968 -53100 -25122 20397 55732 55458 14992 -42883 -74909 -54214
754 -54214 9671 65416 66719 10965 -54478 -71404 -25044 46756 80701 51302 -17425 -67870
766 -67870 -63986 -14474 40178 60464 38272 -8026 -47838 -56470 -28851 18872 54663 52114 8474
779H474n3299j8395L5973O5141L9418k1956o9210o0037p87N6943O8000K2659l5121
792C7803o2143l8181J0220M6593M6007J4717k2863m2952l4065k248L3228M8485
804C4601K7415j8057n5715n2511n453M8320O6877K9104l1103o7366m5698J1828
816e7758N8783N6110Q691m1196n5992k7698J7768M6225L9942P708k8759m6275
828b2451l2819L828M1026N0873K3011k5415n7095m3877O503N4456N8878J3082
840G0000m3302o5430l2564K4519O0244M6078k328m5115n0884j8760K2144M5733
852A0335L6336K782l1067m4859k7136J0283M4495M7575J2514l5443n9214l4004
864f7403J8762N9754N1267O31m9984n9940j9581L3009N7853L5008j2512m6583
$$ plain form
779 8474 -44825 -63220 -27247 37894 77312 55356 -13854 -73891 -74678 -17735 50265 72924 37803
792 37803 -24340 -62521 -52301 -5708 40299 55016 32153 -10799 -44864 -47112 -13884 34601
804 34601 62016 43959 -11756 -64267 -69720 -21400 45477 74581 43478 -23888 -69586 -57758
816 -57758 1025 57135 65826 24630 -31362 -59060 -41292 4933 44875 52583 23824 -22451
828 -22451 -55270 -51442 -10416 40457 63468 38053 -19042 -62919 -56416 -1960 56918 70000
840 70000 26698 -38732 -71296 -46777 13467 59545 57217 12102 -38782 -57542 -35398 10335
852 10335 46671 49453 18386 -26473 -53609 -43326 1169 48744 61258 25815 -33399 -67403
864 -67403 -48641 11113 62380 63011 13027 -46913 -66494 -33485 24368 59376 46864 281
876B81m3287j0445K7359M4249L0828k089l4707m4361k2676J7092M7843M2987L081
889E6155m2304n6334k3160L0275O0894L9955j3573n6283n1930n991M1021N4550
901C3275K5559j8559m5266l6640m539K7819L9869K4856o592l5765m1670j6443
913e4096K4233M9849L6661q411n0667n2583j0248M2205O2140L0773k3215n5990
925i349m2139L179M0786M3055J1516k4366m1763k7540K691L0356L9284K2585j0853
938C7442l9219m0349q871L2990N3392L0377j8769n6066m7997j473M4656N1421
950C7534J4069l2758m9797k4928J8139M6051L8436O213k6724l9468k7034J275
962c8992K8723L7268J9126j5298m2804l8602k354L9006N1106J9773k8613n3482
$$ plain form
876 281 -43006 -53451 -26092 18157 48985 46896 12189 -32172 -54848 -37756 10087 53074 56155
889 56155 13851 -42483 -65643 -35368 25526 65481 51908 -4375 -56305 -62296 -21275 33275
901 33275 58834 40275 -4991 -41631 -46170 -18351 21518 46374 39782 4017 -37653 -54096
913 -54096 -29863 19986 56647 48236 -2431 -55014 -65262 -23057 39083 69856 46641 -9349
925 -9349 -51488 -48309 -7523 35532 47048 22682 -19081 -46621 -43930 -13574 25710 48295 37442
938 37442 -1777 -42126 -50997 -18007 35385 65762 46993 -9073 -57070 -58543 -13887 37534
950 37534 51603 18845 -30952 -55880 -37741 8310 46746 52959 26235 -13233 -40267 -38992
962 -38992 -10269 26999 46125 30827 -11977 -50579 -52933 -13927 37179 56952 28339 -25143
974b5143l1615J7698N2470M3503j41m1383m8945k0343J7659L8675L0679M909k1230
987A6793l2414k1195M493L0458L5705J2597k3428m6670l1782J1275M8743M7851
999E2426O758m0648n4096k3116K4336M9288L3294o662l5864l6593j0417J8756
1011b2538L1860K2350j265k3824l2284j6977J3354L9625L9399P709l3554n1535
1023b7680k9029J6627M7682L6712m983m1450m1882o359L2603M3777K1879j3665
1035C4232l4707k8668m001K0993L1615K1570l431l0226l9148k1663J3041M0360
1047c3L6755L203l2660m0309j0207L1693M7595K4134k0015m7935l7950j027L1797
1060a4959L7469J4834j4930l1837k5789l535K0530L2251K3282j850k6411l2234
$$ plain form
974 -25143 -56758 -39060 13410 56913 56772 15389 -33556 -53899 -36240 2435 33114 38023 16793
987 16793 -15621 -36816 -32323 -1865 33840 46437 23009 -23661 -55443 -44168 4575 52426
999 52426 59184 18536 -35560 -58676 -34340 14948 48242 41580 5716 -30877 -41294 -22538
1011 -22538 9322 31672 30407 6583 -25701 -42678 -29324 10301 49700 57409 23855 -27680
1023 -27680 -56709 -40082 7600 44312 39329 -2121 -44003 -50362 -17759 26018 47897 34232
1035 34232 -475 -29143 -33144 -12151 19464 41034 37603 7377 -31771 -53434 -40393 -33
1047 -33 36722 39925 7265 -33044 -43251 -11558 36037 60171 40156 -7779 -45729 -46756 -14959
1060 -14959 22510 37344 22414 -9423 -35212 -38747 -18217 14034 37316 35466 9055 -23179
1072b3179j1194K1144L8704K2895j5551m5456m0205k551L7229M7108J9830j8999
1084B9775l9359k7247M783K9796K9758Q628j6733k8610k1234R1K2686L0154J5875
1097C8363j2334l5406l2372l764L0795M3331K1287j7339m2326l2078L198L4426
1109d219L5119P465k4114l4271j6850J2426L1390K6839M241k1062l2661k2814
1121c8511J593K5846L2993J5761j3263l3579k6988K374L1968L5044R951k4043
1133A9146l8673k1058J2883L6113K8988r39k8952l5821j5850J2729L1315K7950
1145B7831O767j6133k7024j7731M986K5027K5749N417k2077l5340k0933J0872
1157c2589L5629L2455K820k8900l6915j5138J7618L5922K6641j239k5185k8868
$$ plain form
1072 -23179 -34373 -13229 25475 48370 32819 -12637 -52842 -55393 -18164 28944 48774 29775
1084 29775 -9584 -36831 -32048 -2252 27506 36134 19401 -9209 -30443 -30352 -7666 22488 38363
1097 38363 26029 -9377 -41749 -45513 -14718 28613 49900 32561 -9765 -41843 -38645 -4219
1109 -4219 30900 38365 14251 -20020 -36870 -24444 6946 33785 38026 16964 -15697 -38511
1121 -38511 -36918 -11072 21921 37682 24419 -9160 -36148 -33774 -1806 33238 43189 19146
1133 19146 -19527 -40585 -27702 8411 37399 36460 7508 -28313 -44163 -31434 -119 27831
1145 27831 34598 18465 -8559 -26290 -21304 3723 29472 34889 12812 -22528 -43461 -32589
1157 -32589 3040 35495 38315 9415 -27500 -42638 -25020 10902 37543 36304 11119 -17749
1169a7749j1276J2111K4572J8280k102k1918k7374j2622J2639L2520K8150L709
1181C8940k5232l5475j7379J4977L5105K6270l006l0011l1550q527J9620L0720
1193A4452J6812q833k6658k3661m279J8188K8347J9415k685k3217k8783j3577
1205c4479J2120K9891K4641j008k6815l1060r766K0442L4713J8914j1680l2715
1217f802k7115r10K5210L0303J3949j1100k5802k2112l940J5975K4288J6150l849
1230B4245k2053k5274q616J6802L0449J9178q608l1914k9761k275K7378L5324
1242B4875J5426j5604l2068k2122K615K3168K3855O829j2859k2956j7020k10J7454
1255h617K3913J4176p113k5622k4490m012K1987L2952J6423j3699l4072k6535
$$ plain form
1169 -17749 -29025 -16914 7658 25938 23836 1918 -25456 -38078 -25439 7081 35231 38940
1181 38940 13708 -21767 -39146 -24169 10936 37206 34200 4189 -27361 -35888 -16268 14452
1193 14452 31264 22431 -4227 -27888 -32167 -13979 14368 33783 31098 7881 -20902 -34479
1205 -34479 -22359 7532 32173 31165 4350 -26710 -36476 -16034 18679 37593 25913 -6802
1217 -6802 -33917 -34827 -9617 20686 34635 23535 -2267 -24379 -28319 -12344 11944 28094 24245
1230 24245 2192 -23082 -31698 -14896 15553 34731 26123 -5791 -35552 -37827 -10449 24875
1242 24875 40301 24697 -7371 -29493 -26878 -3710 20145 26974 14115 -8841 -25861 -26071 -8617
1255 -8617 15296 29472 22359 -3263 -27753 -31765 -9778 23174 39597 25898 -8174 -34709
1267c4709J953K7341K9251P108j9488k8331j4325R710K4565K2100M647j4407k3211
1280g796j6815o0J8114K3855J1883j0577k7672k3388N23K6278L1121J0495j8467
1293A7494l2255j8148R949K9909K3822k54k2962k7053j1571R345K2347J9445M111
1306B4179j2900k0872j5008L675K0708K4366Q212j6016l0531k0306O875K8941
1318A323K7081K584k3459k9887j1345J5076K9091J9676l144k0887k2904q468R643
1331a5620K0370J6849J476j5989k3162j3897P338K5173K4644M742k0383k9685
1343a8144j3881J3123K9418K1013m804k6352k6155o448J7240K6131J5525m802
1355B1864j9790j9521o588J1317K0927J6650p6j8941k4619j1658J1215K6751K1182
$$ plain form
1267 -34709 -32756 -5415 23836 30944 11456 -16875 -31200 -21490 3075 25175 29822 15415 -7796
1280 -7796 -24611 -24671 -6557 17298 29181 18604 -9068 -32456 -31933 -5655 25466 35961 17494
1293 17494 -14761 -32909 -22960 6949 30771 30517 7555 -19498 -31069 -21724 623 20068 24179
1306 24179 11279 -9593 -24601 -20926 -218 24148 32360 16344 -14187 -34493 -27618 1323
1318 1323 28404 30988 7529 -22358 -33703 -18627 10464 30140 26996 6109 -16795 -25263 -15620
1331 -15620 4750 21599 23075 7086 -16076 -29973 -22635 2538 27182 31924 11541 -18144
1343 -18144 -32025 -18902 10516 31529 26725 373 -25782 -32230 -14990 11141 26666 21864
1355 21864 2074 -17447 -24035 -12718 8209 24859 24783 5842 -18777 -30435 -19220 7531 28713
1368B8713k357k4753k7200o669J9090L0062J6120q882k5804k1925k563J6661K2077
1381A2570J1104o471j9672j7919m113J3801K2849J5561l782k2514k4604p337J6224
1394a4303K8434J6973p806k6862k3546j804K1220K6138J0367j1661k4013j7005
1406b3868J906J8341K0766Q623r860k1555j8989k832J6505K4368J4669o234k3535
1419a695k1492k238J9416K5636J0460j3349k7398j8632M061K3444K3161O254j5078
1432A2550k4115j4843M020J9471K0884P798r540k1005j6671L20J7359K1417Q768
1445B6413j2613k5134j7690M078K3856K4781O248j7293k7073j5577P433K3588
1457A017K1322L995j5246k1147j1568N919J8837J6616K466j4577k2313j3654N679
$$ plain form
1368 28713 26356 1603 -25597 -32266 -13176 16886 33006 24124 -1680 -23605 -26168 -9507 12570
1381 12570 23674 17203 -2469 -20388 -24501 -10700 12149 27710 23928 1414 -23190 -30527 -14303
1394 -14303 14131 31104 23298 -3564 -27110 -28914 -7694 18444 28811 17150 -6863 -23868
1406 -23868 -21962 -3621 17145 25768 15908 -5647 -24636 -27468 -10963 13405 28074 21840 -1695
1419 -1695 -23187 -25425 -6009 19627 30087 16738 -10660 -29292 -25231 -1787 21374 27628 12550
1432 12550 -11565 -26408 -22388 -2917 17967 25765 16225 -4780 -21451 -21131 -3772 17645 26413
1445 26413 13800 -11334 -29024 -24946 -1090 23691 29939 12646 -14427 -30004 -22571 1017
1457 1017 22339 26334 11088 -10059 -21627 -15708 3129 19745 22211 7634 -14679 -28333 -22654
1470b2654K1967K2576O300j5564k5467j5185P518K4842K1987K219j8466k4844
1482a4771j0873R755K1640J5391k840j8725k0754o763J1528K3016J8814K158j5573
1495A2003k2448j2731O427K0514J8462Q32j8608k3951r969J1821K4938J7421l050
1508B1661k1032k2044m520J5859K4631J4539m536k0164k1210q048R553J8608J4568
1521A7865j148j5617j8605o014J2076K3739J5740m182k2760k3705o167J6105K5750
1534A3077J4943p042k2583k0135k537J5077K0728J0804o518j7928j5893j715J3162
1547f560J9115J0800o263k0642k0393m143J6182K5535J5860n897k2688k0891l093
1560b3078J6843K1162P994j1632k2456j4264L429J8556K0034P469r449j9225j5295
$$ plain form
1470 -22654 -687 21889 28189 12625 -12842 -28027 -20509 4333 26320 28539 10073 -14771
1482 -14771 -25644 -15889 5751 21142 18302 -423 -21177 -27940 -16412 6604 25418 27576 12003
1495 12003 -10445 -23176 -16749 3765 22227 23059 4451 -19500 -29469 -17648 7290 24711 21661
1508 21661 629 -21415 -25935 -10076 14555 29094 24558 4394 -16816 -24864 -15311 3297 17865
1521 17865 16717 1100 -17505 -23519 -11443 12296 28036 23854 1094 -22611 -28778 -12673 13077
1534 13077 28020 20978 -1605 -21740 -24277 -9200 11528 22332 15814 -2114 -18007 -19722 -6560
1547 -6560 12555 23355 17092 -3550 -23943 -28086 -11904 13631 29491 23594 906 -19985 -23078
1560 -23078 -6235 14927 22921 11289 -11167 -25431 -22002 -3446 16588 24057 14608 -4617 -19912
1573a9912J60J5329K0736J0680p742k1681j9972l092J5758K1851R355j1551k2149
1586a2230j3742O851K3004K1880M071j5008k3527j4107L461J6609J7005N173j0119
1599I321j8617j2913J520J6410J9366Q320j0594k0724j4022N081K1170K0888K768
1612B7974j8210k5284j4137P182K1309J8633K956j3763j7288q174P255J6502J4187
1625A9142J264j2766j9072j1572N299J9254J9326L379j5380k3809j2803Q049K3142
1638C453J8910P88j6774k0703p072J0520J9061J2316l576j6248j7320n712R875
1651a2482J8860J4907P01j4786k0443j0480P135J9717J7098M20j6926k0012p082
1664b3373J2163K1987J3395n335j9964j8186k958J3579J9707J1299m602j6918
$$ plain form
1573 -19912 -19752 -4423 16313 26993 19251 -2430 -22402 -25494 -9736 12115 21470 9919 -12230
1586 -12230 -25972 -19121 3883 25763 29834 14826 -8701 -22808 -19347 -2738 14267 19440 9321
1599 9321 -9296 -22209 -20689 -4279 15087 23407 12813 -7911 -21933 -16852 4318 25206 27974
1612 27974 9764 -15520 -29657 -22475 -1166 17467 20423 6660 -10628 -18802 -11547 4955 19142
1625 19142 20406 7640 -11432 -23004 -17705 1549 20875 24254 8874 -14935 -27738 -19689 3453
1638 3453 22363 23151 6377 -14326 -21398 -10878 8183 20499 16923 675 -16645 -22357 -12482
1651 -12482 6378 21285 21986 7200 -13243 -23723 -16588 3129 20227 20647 3721 -16291 -23373
1664 -23373 -11210 10777 24172 18837 -1127 -19313 -22271 -8692 11015 22314 17712 794
1676G94j7113n586R381J7913J2995r37j4588j7594n346J1447K0435J2592n783
1689A8610k0899j9678l329J5644K1884J1263p535j8936j5790p58J3466J7495Q590
1702B0027o095j5705j4238j642J2130J7373R456o595j8934j7032k085J5376K1303
1715A3339J0741p880j9711j6060j16J5887J8585O328r826j8342j2608K465J5271
1728a927J6778N576r036j7873j3409N46J4948J8147Q061q330j8809j4046J010
1741a8364J5846J8030N695j0955j9299j2028M439J7051J6832L614j2220j8224
1753i583j1194M167J5945J6154M485j0186j7480j1365L755J5476J6035L662j1968
1766G903j8457j0838N704J7268J6772J867j3447j8437r023O470J7272J4378J408
$$ plain form
1676 794 -16319 -21905 -12524 5389 18384 17447 2859 -14735 -20081 -8634 11801 24393 18610
1689 18610 -2289 -21967 -25296 -9652 12232 23495 15960 -2976 -18766 -19524 -6058 11437 20027
1702 20027 13932 -1773 -16011 -17653 -5523 11850 21306 14711 -4223 -21255 -23340 -7964 13339
1715 13339 24080 16200 -3511 -19571 -19687 -3800 14785 21113 11287 -7055 -19663 -17198 -1927
1728 -1927 14851 20427 11391 -6482 -19891 -19345 -4397 13750 21811 13481 -5328 -19374 -18364
1741 -18364 -2518 15512 21207 10252 -9047 -21075 -16636 415 17247 20861 8641 -9583
1753 -9583 -20777 -16610 -665 15489 19974 9788 -7692 -19057 -15302 174 16209 19871 7903
1766 7903 -10554 -21392 -15688 1580 18352 20219 6772 -11665 -20688 -14218 3054 17432 18840
1779A8840j2648j6941q493N926J6032J3962J143j2649j6857q672O561J7459J5301
1792A8964P11j4263j8208p914Q039J7858J3410j355j4757j6524n982R401J6922
1805F302J2035j855j3450j5391o091P858J6094J2646j026j3737j6897o716Q601
1818a1627J7756J2815k213j5416j7218m333J1205J8652J0841m491j6228j4726
1830a4983k907J0233J5772Q882m300j3471j3609l027R684J5403J0464k997j4560
1843E84j5742m240J0563J8412J0816m834j6787j5845k355J3055J7345P787p120
1856A1639j6449j1964R56J2716J5015O039o579j4605j2041r74J0529J4812Q734
1869A7828m698j4549j3471k837J1999J6636Q188p282j7746j3135K012J5460J6711
$$ plain form
1779 18840 6192 -10749 -19242 -13316 2716 16678 17821 5172 -11685 -20357 -13796 3663 18964
1792 18964 19675 5412 -12796 -20710 -12671 5187 18597 17242 2485 -14039 -20021 -10620 6302
1805 6302 18337 16482 3032 -12359 -18450 -10592 5502 18148 17122 3385 -13512 -20228 -11627
1818 -11627 6129 18944 16731 1315 -15903 -20236 -9031 9621 20462 15971 -257 -14983
1830 -14983 -17890 -7657 8115 16997 12697 -774 -14383 -17410 -7726 7677 18141 15144 584
1843 584 -15158 -19398 -8835 9577 20393 15559 -1228 -17073 -19428 -6373 10972 18759 11639
1856 11639 -4810 -16774 -15818 -3102 11913 17952 11373 -3232 -15273 -16247 -5718 9094 17828
1869 17828 13130 -1419 -14890 -17727 -5728 10908 19096 11814 -5932 -19067 -17055 -1595 15116
1882A5116M942j0247j7064j0444K533J3500J3754M325p390j3924r799J140J0878
1895b680J2945N565o880j4687j1313J817J4259J6590N376j0231j8053j2296L566
1908a6022J5118J4945K836j0835j4927q110N474J3381J2297J161r733j3784p317
1921a5516M142J3310J2975K825j0351j5721j0275K624J4197J4223L692r568j4752
1934h195p801O346J4791J1862q59j2578j5126o709O785J5077J1707j08j1241j4505
1948a0554p032N660J4176J1861J309j0406j3432n888O327J3733R631j802j2680
1961I03j4662m909Q013J5623J1463m56j1481j4738o024O529J3991J0283j412j1820
1975A303j3099l596Q526J4710R078l979j3919j3200k902R951J4714Q935k941j2261
$$ plain form
1882 15116 20058 9811 -7253 -17697 -15164 -1664 12090 16415 9025 -4899 -14698 -13558 -2680
1895 -2680 10265 15830 8950 -5737 -17050 -15233 -974 15616 20992 10761 -7292 -19588 -16022
1908 -16022 -904 14041 16877 6042 -8885 -16995 -11521 1860 14157 15318 5585 -8199 -15516
1921 -15516 -11374 1936 14911 17736 7385 -8336 -18611 -15987 -1790 12433 16125 6557 -8195
1934 -8195 -15996 -9650 5141 17003 16144 3566 -11560 -18269 -11484 3593 15300 15192 3951 -10554
1948 -10554 -17586 -11926 2250 14111 15420 5014 -8418 -14306 -7979 5754 15385 13583 903
1961 903 -13759 -18668 -10655 4968 16431 15975 4494 -10244 -16268 -9739 4252 14535 13123 1303
1975 1303 -11796 -15392 -6866 7844 16922 12943 -976 -14176 -17078 -7127 7587 16522 13581 1320
1989A320j2532m029O943J2325Q613j399j0497j1664k777Q983J4616Q420m646j5335
2003a659j4787k857J1298J6098Q357m847j3756j1300r5J0426J2349N425n462j1284
2017b094q870j48Q811J1217N471n159j3296j2082k134J0498J5530R950l540j3597
2031E57j2504j037J1276J3226M531q851j4991r337L507J2888J2308K873q295j2354
2045f203q161K190J0436J1750N436m262j1782j0248j387Q447J1928M833o463j4076
2059g562r710L307J4497J5031L473j0108j5984r426L869J3206J1213J817q837
2072D786j1471n928L685J0091Q644J482p252j0720o730L237J1278J2148L147q716
2086G681j4560j0114K469J3374J3034L494r382j3665o376O128J2973R310k030
$$ plain form
1989 1320 -11212 -15241 -8298 4027 12640 11241 744 -10920 -13697 -4714 9902 18322 13676 -1659
2003 -1659 -16446 -19303 -8005 8093 16450 11603 -2153 -13453 -13548 -3122 9227 14652 9190 -2094
2017 -2094 -10964 -11112 -2301 8916 14387 9228 -4068 -16150 -18284 -7786 7744 17694 14154 557
2031 557 -11947 -12984 -1708 11518 16049 7198 -7793 -17130 -13623 -735 11573 14446 6151 -6203
2045 -6203 -14364 -12174 -1738 10012 15448 11186 -596 -10844 -12231 -3784 8144 12977 6514 -7562
2059 -7562 -17272 -13965 532 15563 19036 8928 -7056 -16482 -12613 593 11806 13623 4786
2072 4786 -6685 -12613 -8928 1163 9807 11289 4037 -6683 -13413 -10176 1102 13250 16397 7681
2086 7681 -6879 -16993 -14524 -1150 11884 15378 5996 -7669 -14045 -7917 5056 14366 12336
2099A2336j1604j2517l890P001J2667R038k76r214j1164n486L400J1167J0109
2112A1567J730p949j1797o681M128J1994R948p42j1508j3744m087Q240J5477J0288
2126A6864j913j1916j2981l831O861J1640O947k568r755r591j938O354J0982P204
2140A2359j877r857j0761l730P104J2583R856j558j1481j3181m811O905J2847
2153D398Q195k828j1350j0599n22R563J3013N664n516j2664r997o18Q711J1759
2167G209N843l393j0315j0083j719P137J0758O542k912j0152r651j255Q486J2248
2181H743O233n041j3249j1302m04J0659J3408N845n512j2482r339J360R656J0538
2195I113K921o405j0721o844J849R266J0034L621n602j0761q556r6Q999J1344
$$ plain form
2099 12336 732 -11785 -15675 -8674 3993 13031 12755 3541 -7623 -13109 -9709 1458 11567
2112 11567 13297 5348 -6449 -13130 -9002 2992 12940 12198 690 -13054 -17141 -8901 6576 16864
2126 16864 14951 3035 -9946 -13777 -6916 4724 11671 9103 -652 -10243 -12181 -5827 5155 12359
2140 12359 10482 625 -10136 -13866 -6762 5821 15677 14119 2638 -10543 -15354 -8449 4398
2153 4398 12593 9765 -1585 -12184 -12706 -3143 9870 15534 10018 -2646 -12643 -13261 -4550 7209
2167 7209 13052 9659 -656 -10739 -12458 -5321 5437 11979 9067 -1085 -10736 -11991 -3505 8743
2181 8743 14976 9935 -3314 -14616 -15020 -4361 9047 14892 9380 -3102 -12441 -11081 -1425 9113
2195 9113 12034 5629 -5092 -11936 -10087 -821 9213 12834 7232 -3529 -12085 -12181 -3182 8162
2209H162N878m487j2084r883j3J0019J2134L678p174j3048p536L846J2603J1075
2223A3170R59q869j2011o130L592R583Q806J693o255r216o139J811Q340R267L450
2238A2051n763j1275p664J975J1327J1673K470r106j3845p497M623J2973J0762
2251A2704j81r613j1371l706N994J0644O821j249q230r203l905L595R077Q156
2265I533J505o861j0532o455L222J1049J0478J470r053j2607n976O252J2369R104
2279A3498k222j1270j1276k420P932J1166O780k522r285q701k083N333Q948O169
2293A0047n66q051r370m091M784J0532Q576m00r783j1295l786P185J2121P955
2307A3858l086j1469j0659j177P851J1393N653m346j0372q095j59P430R795M704
$$ plain form
2209 8162 14040 9553 -2531 -12414 -12427 -2408 9726 13404 6230 -6818 -14354 -10508 2095 13170
2223 13170 14129 5260 -6751 -12881 -9289 294 9100 10793 4538 -4678 -10817 -9006 -666 8601 12051
2238 12051 6288 -4987 -12651 -10676 651 12324 14794 5688 -8157 -15654 -11031 1942 12704
2251 12704 12523 2910 -8461 -12167 -6173 4471 11292 10043 1813 -7390 -11295 -7700 1377 9533
2265 9533 11038 4177 -6355 -12810 -9588 1461 11939 13409 4356 -8251 -14227 -7975 4394 13498
2279 13498 11276 6 -11270 -13690 -5758 5408 12188 9666 381 -8320 -10403 -5070 3878 10047
2293 10047 9481 1430 -7940 -12031 -7247 3285 11861 11461 1678 -9617 -13403 -6218 5903 13858
2307 13858 10772 -697 -11356 -12533 -4682 6711 12364 8018 -2354 -10449 -10608 -3178 6617 11321
2321A1321l098q678q009k567O343R618O341k436r583r467j948P596J1059O641
2335A3133l798j1272r704m69R021J1474M712n303j1195p861O59Q824R693L303
2349A1217n414r503o463R01P791Q900L775m257r450p742l41P619J0041M951m069
2364G956j0707q562O20R142J0805L085o650j1193p058L115J0051J0024J214p089
2378D753j0289n826K894Q876P673J832n480q689n427J596P839Q364K586n479j0109
2393d886o858K057R959R790K481p269j1519o543L404J0443R223O38q008r792m022
2408a0902N094R443O565q00p513q951l436L520Q341P676R79o183r329n213K747
2423g962R016Q683J164p533j0210m728M545J0841P787j448r769j0263k657O398
$$ plain form
2321 11321 8223 -455 -8464 -11031 -4688 4930 11271 8835 -748 -10215 -12163 -4567 6492 13133
2335 13133 9335 -1937 -11641 -12110 -3089 8385 13097 7794 -3401 -11262 -10603 -1779 7914 11217
2349 11217 5803 -3700 -10163 -9262 -1471 7429 11204 6947 -2503 -10245 -10586 -2967 7074 12025 7956
2364 7956 -2751 -11313 -10693 -1551 9254 12339 5689 -5504 -12562 -9447 604 10628 11842 4753
2378 4753 -5536 -11362 -8468 408 8081 9913 4433 -4256 -9683 -8087 -248 8116 10702 5223 -4886
2393 -4886 -11744 -9687 272 10062 12543 5274 -6245 -12788 -9384 1059 10282 10920 2912 -6880 -10902
2408 -10902 -5808 3635 10200 9400 1887 -7064 -10500 -6980 1361 9037 10016 3833 -5496 -10709 -7962
2423 -7962 1054 9737 10901 3368 -6842 -11570 -7025 3816 11603 10155 386 -9877 -12534 -6136
2437f136J0789P132j802q616q439k671M890P837N348j263o744p447k943M609Q948
2452C492P148o91q282r657l674N429J1111P483j683j0126r916k273O472J0071
2466D904N279l715q668o789J83P228R066L742l589q709p356j803N239Q583N630
2481I225j253p953q380k002N975R461N967l001r338q140k4P807R937L666n731
2496F216j0339p237O46Q111Q864L865l958p638o038N45N866P189L171m111q102
2511b950o497K62P015R186M000m283r921p420M30Q369R755L546n073r642o391
2526i614J789P983P403J195n729q611m638L157Q241P398J873n440q446o004Q97
2541h546O989P938K839m653q361n565J524Q332Q022J587o320r512m913L565R373
$$ plain form
2437 -6136 4653 11785 9983 1367 -7072 -9743 -4853 2984 8332 7069 325 -7122 -10065 -5456 3492
2452 3492 10640 9949 1667 -7990 -11664 -6235 4876 12359 10676 550 -9366 -11639 -5167 4904
2466 4904 10183 6468 -2200 -8989 -8806 -1578 7488 11230 7641 -1068 -8424 -10227 -4988 3595 9225
2481 9225 7972 19 -8361 -10363 -4388 5073 11040 8039 -1299 -9439 -9463 -1656 8281 11947 6216
2496 6216 -4123 -11360 -10714 -2603 6261 10126 6168 -1470 -7508 -6963 -1097 6092 9263 5152 -2950
2511 -2950 -9447 -9185 -2170 7016 11016 6733 -3188 -10608 -10178 -1809 7946 11492 6419 -3223 -9614
2526 -9614 -7825 158 7561 8756 3027 -5584 -10222 -7065 1176 8574 10447 5007 -3439 -9443 -8546
2541 -8546 -1557 6381 9220 4567 -3794 -9359 -7835 497 8519 10106 3786 -5726 -10639 -7074 2299
2556B299P618K28p017r371m359L340Q327O596N84n803p104l293L173P380O069
2571H667k92o134q414m178L255Q643P222Q10o401r022m296L434Q572P172o09o724
2587A705q034k703M644Q437N229j947p347p662j989M566Q441N765p57o674p504
2602e830l090L731P588N744p66o504p370k518M724Q704N519k114q316q054j901
2617a0453N952R204N229k204p849p576n88M950P733M013k520p007n871p68N175
2632b580P293M084k333p570o995j500N894Q396N426k360q068p162j048N783Q633
2647E893L030l558q137n761M69O941P750K608m041p801n518J89O081P404L119
2662H668l147o923o055j46N429P334L029l549p451n495O24P307P948K499n218
$$ plain form
2556 2299 9917 10145 3128 -6243 -10602 -7262 1065 7661 8245 2442 -4662 -7955 -4782 2598 8667
2571 8667 8375 2241 -6173 -10351 -7096 1547 8769 9579 3178 -5844 -10140 -6706 1866 9038 8429 1705
2587 1705 -6329 -9032 -4388 4049 9278 7331 -16 -7678 -9667 -5101 3340 9105 8348 1674 -5830
2602 -5830 -8920 -5189 2399 8143 7377 873 -6497 -9015 -4291 4413 9932 7818 -498 -8552 -10453
2617 -10453 -4501 4703 9932 7728 -121 -7697 -8285 -3335 4398 8411 5891 -1116 -6987 -7755 -2580
2632 -2580 4713 8797 6464 -1106 -8101 -9601 -3707 4689 10115 7755 -313 -7475 -8523 -2740 5893
2647 5893 8923 5365 -2772 -8533 -8064 -1123 6627 9235 5194 -2607 -8125 -7936 -1855 5549 8668
2662 8668 5521 -1402 -7457 -7603 -2174 5160 8189 4640 -2811 -8306 -7682 -375 7573 10072 4854
2677D854q278n887J249P213P348J939m275p475m550J556O675O300J198m510p043
2692c686m316J519O868O464J808m757p408n357J474P116P120J690m663p676m171
2707g975K165P090O379K42n874p426l390L130P425N960L18n372p405l375K520
2722e588O755N749O04m945o938l634K584P069N568J47n659p251k978L130P768
2737B381N926l61o233p377k989L671P350N179o52n958o328k251L895O681M522
2752G456r08n661o610k385L967O754N142p04o116o797j872L476P471M940j594
2767F559o545o430j564M709P092L763j643o529o175r44M505P004M432k118o235
2782a19o047j148M238O629L644j797o032n796j105N072O849L606k068o760n890
$$ plain form
2677 4854 -3424 -9311 -8062 -849 6499 8438 4163 -3312 -7862 -6306 369 6669 7867 3357 -3686
2692 -3686 -8002 -6483 385 6849 8657 3900 -3508 -8865 -7391 -275 6845 8535 3872 -3804 -7975
2707 -7975 -5810 1280 7659 7901 2027 -5399 -8789 -5659 1766 7726 8044 2672 -4733 -8108 -5588
2722 -5588 1167 6916 7520 2575 -4363 -7997 -5413 1656 7224 7371 1712 -5539 -8517 -5387 2381
2737 2381 8307 7946 1713 -5664 -8653 -4982 2368 7547 6895 937 -5391 -7642 -3747 2934 7456
2752 7456 6548 887 -5723 -8108 -4141 2613 7755 7051 935 -5862 -7734 -4258 3213 8153 6559
2767 6559 14 -6416 -7980 -3271 3821 7584 5941 -588 -6763 -7707 -3202 3802 8234 6116 -119
2782 -119 -6166 -7314 -3076 3553 7197 5400 -632 -6428 -7533 -2461 4388 7994 5926 -834 -6724
2797f724o35N304O935L094k939o752n315k25N389O860K545k829o128n010RN028
2813a393O568K511l283o520n177R0N244O676K626k940o233m857Q77N340O439J956
2829G924l763o664m981P11O040O180J663l714o846l917J471N832O219J610l755
2844D010o671m136J236N446N567J254m027o346l898J518O098O324J359m297o375
2859b938l988J893N814N457O91m707o708l400K492O088N396R29m543o345k791
2874f660K286N796N154J29m781o166l255K360O049N353j8m697n954k764K987O312
2890B131N023k72n150o367k519K604O122M576l97m824n945j995L463O103M231
2905F784n40n201n516k527L329N956M330m59n599n695j837L423O173L983q19n351
$$ plain form
2797 -6724 -7359 -2055 4880 7974 5035 -1717 -7032 -7257 -1868 4992 7537 4708 -1420 -6430 -6421 -1393
2813 -1393 5175 7686 4403 -2117 -7294 -7204 -1960 4716 7342 4402 -1831 -6688 -5811 -471 5968 7924
2829 7924 4161 -2503 -7484 -6773 -733 5447 7110 3396 -3450 -7367 -5896 -64 6155 7765 4010
2844 4010 -2661 -6797 -5561 -115 5452 6706 2679 -3667 -7565 -6047 51 6375 7734 3437 -2938
2859 -2938 -6926 -5033 781 6238 6929 2222 -4486 -7886 -5394 694 6090 7019 2476 -3869 -6660
2874 -6660 -4374 1422 6576 6705 1924 -4242 -7497 -5137 912 6265 6247 1550 -4404 -7168 -4181 2131
2890 2131 7154 6882 1732 -4635 -7154 -4550 1572 6148 5751 927 -5018 -7013 -3550 2553 6784
2905 6784 6244 1043 -4473 -7000 -3671 2285 6615 6156 557 -5138 -6975 -3552 2621 6604 5785 434
2921D34n575j575M033O103L546j495n606n778r87L883O329L207j304n405m894
2936e084j293L878N732L380j965n529m936p20M335N838L321j898o049m889l44
2951f223M074N976L148k147n589m905k35M045N588K710k402n653m439K91M434
2966a327O117K346k809o008m560L26M088N930K409k625n667m036M87M514N253
2981D438J979k835n876l888M65N054N541J919l347o067l837R94M908N454J747
2996F649l365n362l895J131M779M968J100l676n424l467J195N788M966J282l503
3011C166n753l485J393M922M907P37l719n442l017J565N384M829O0l681n412k915
3027f461K391N408M455O58m408n639k858J844N285M440M23m156n316k082K542
$$ plain form
2921 434 -5141 -6716 -2683 3420 6966 5471 -135 -5913 -6900 -3017 3312 6519 5215 -190 -5084
2936 -5084 -6377 -2499 3233 6613 4648 -881 -5817 -6537 -2202 3636 6957 5059 -990 -5879 -6223
2951 -6223 -2149 3827 6975 4828 -761 -5666 -5901 -1856 3732 6442 4040 -1613 -6052 -5761 -1327
2966 -1327 4790 7136 4327 -1681 -6241 -5915 -1827 4103 6512 3887 -1780 -5816 -5329 -815 4438
2981 4438 6417 3582 -2294 -6182 -5717 -663 4878 6797 3450 -2617 -6454 -5460 -552 4902 6649
2996 6649 3284 -2078 -5973 -4842 -63 4905 6005 2329 -3095 -6562 -5367 421 5387 6669 3166
3011 3166 -2587 -6072 -4679 243 5150 5887 2168 -3274 -6291 -4726 658 5487 5547 1866 -3546 -6461
3027 -6461 -4070 1338 5793 6451 2043 -3596 -6454 -4610 675 5115 5538 1382 -3934 -6016 -3474
3042c474N205M326j59m475n326k417K311N549M193j82m553n202k196K739N476
3057A815M028j64m641m893j819K822N200L682r18m876m987j860L125N649L857
3072F020p05m422n004j480K869N209L495j396m619m921r21L310N485L304j737
3087D487m822m648r09L787N134L447j454n080m662j252L860M660L003k105m602
3102a156m050k51M039N149K749k066m841m843l23L769N126K218j907m896m045
3117e328l11M097N106K299k413m673l623K09M083M820J714k227n413m181M62M027
3133a352M991K143k398n145l407M22M428M774J242k684n269l362P46M482M530
3148D141J481k992m947l094Q62M417M685J055k569n007l082J041L636M528R88
$$ plain form
3042 -3474 1731 6057 5898 1423 -3903 -6320 -4009 1540 5733 5551 998 -4204 -6400 -3661 1815
3057 1815 5843 5679 1038 -3855 -5674 -2852 2348 6030 5112 236 -4751 -6611 -3486 2163 6020
3072 6020 5315 893 -4111 -5591 -2722 2487 5982 4586 -33 -4954 -5875 -2565 2920 6224 4487
3087 4487 -335 -4983 -5892 -2105 3029 6476 5022 -58 -4720 -5972 -2112 2548 5551 3446 -1156
3102 -1156 -5206 -5457 -1418 3731 6480 4414 -427 -5270 -5593 -1824 3302 5520 3613 -1283 -5328
3117 -5328 -5639 -1542 3564 5863 3450 -1223 -4846 -4637 -554 4266 5980 3753 -1660 -5841 -5379 -1352
3133 -1352 3639 5782 3384 -1761 -5168 -4746 -318 4456 5698 3014 -2255 -5617 -4871 -389 4141
3148 4141 5622 2630 -2317 -5411 -4549 -132 4553 5608 3039 -1968 -5050 -4009 -373 4155 5143
3163E143l212n191k481J492M816M298Q63l300m916k719J261M203M170N12l304
3178A635m944k279J189M956M185M45l403m874k278K011M802L883J77l800m934
3193c229k608J996M545L843R9l653m055k119K088M799L729n05l650n019j622K025
3209c336M588L642l43l917m667j623K718M505L591n03l803m062j721K676M311
3224B056K998n27m488m562j321L016M783L297q13m207l738j484K794M498K807
3239E109j067m308m257o99K852M669K933j441l776m205o38L078M761K720j684
3254D047m572l890o31L182M215K488j530m401l249k26L485M329K204j596m517
3269f62l754j94L169M497J915j806m691l012k55L685M676J815k336m271l142L83
$$ plain form
3163 5143 1931 -3260 -5741 -4249 567 4865 5728 2428 -2488 -5207 -3946 257 4427 4939 1635
3178 1635 -3309 -5588 -4399 557 4742 5187 1784 -3090 -5368 -3357 1445 5328 5505 1705 -3229
3193 -3229 -5837 -3841 704 4547 4646 993 -3062 -5181 -3093 1706 5435 4930 1280 -3739 -5361 -3336
3209 -3336 1252 4894 4551 634 -4033 -5656 -2938 1567 5158 4655 852 -3210 -4931 -2255 2056
3224 2056 5054 4527 39 -4523 -5844 -2828 1955 5252 4439 232 -3506 -4990 -2196 2302 5109
3239 5109 4042 -266 -4523 -5222 -2370 2299 5232 3791 15 -4190 -4828 -1750 3011 5731 4047
3254 4047 -525 -4415 -5046 -1864 2351 4839 3309 -1092 -4341 -4567 -1082 3247 5451 3855 -662
3269 -662 -4416 -4610 -1441 3056 4971 3165 -1526 -4538 -4793 -1108 3568 5383 3047 -1224 -4366 -3983
3285c983L420M228J542k465m534l280K17L793M548J537k214m356k845N75L799
3300a8M033J171k521m481k917O86L719L991R61k476m450k633J133L910L934J313
3316E355k996m276k699O82L904L812R34l121m229k428J400M036L845N37l082l955
3332b281k369J410M081L163J95k867m395j965J596M051L658L29l183m118j662
3347d357J460M060L236m5l265m056j883J812M065L352j11l253m282j314K026M064
3363A509L057j57l691l852j492K066M176K489l36l300l793j265K116M254K921
3378D702o19l724l742j160K377M191K270n35l260m114q71K680L813K922j369l577
3394a6l651o55K697L693K312j096l686l301o86K836M028K216j518l391l546m97
$$ plain form
3285 -3983 -563 3665 5207 2742 -1792 -5072 -4855 -1062 3486 5023 2809 -1547 -4392 -3817 -18
3300 -18 4015 5186 2665 -1816 -4733 -4047 -328 3663 4624 2148 -2302 -4935 -3802 108 4042 5355
3316 5355 2359 -1917 -4616 -3934 -30 3782 4716 1595 -2634 -5062 -3662 374 4219 4756 1674 -2281
3332 -2281 -4650 -3240 841 4004 4199 1332 -3063 -5028 -3432 619 4277 4606 1423 -2695 -4357
3347 -4357 -2897 1163 4399 4354 1089 -2967 -4850 -3038 1027 4379 4268 1015 -3267 -4581 -2555 1509
3363 1509 4566 4409 718 -3134 -4626 -2560 1616 4105 3769 469 -3324 -4589 -2473 1781 4702
3378 4702 4083 359 -3383 -4543 -2166 2025 4295 3760 500 -3614 -4485 -1805 2008 4930 3561 -16
3394 -16 -3667 -4322 -1625 2068 4380 3284 -402 -3703 -4389 -1553 2475 4691 3173 -218 -3764 -4261
3410d261K966L567J951j290l779l249l43L181M307J658j505l829l253k91L408
3425g62L169K034j517m074k866j87L260L618J944j930l576k884M45L019L335J533
3441D561j815m383k868L23L355L491J465j756l912k249N25L237L314J145k217
3456B216l877k770P66L365L397J049k299l882k078P77L414L502R53k330l748k420
3472c965P69L343K964O97k766l544k123J222L881L349N87k506l672j943Q87L492
3488F72K651L47k663l668j707J450L499L042K88k682l548j455J177L864K691Q1
3504D039k919l829j395J256L236K909n8k947l074j074J911L833K217j99k882l602
3520b578j551J545L632K406l39k818l434p95J689L597K716o39k992l006j002J819
$$ plain form
3410 -4261 -1295 2272 4223 2933 -846 -4095 -4438 -1257 3050 4708 3203 -626 -3879 -4170 -762
3425 -762 2407 4441 2924 -1150 -4016 -4203 -943 2675 4619 2689 -887 -3771 -3326 -307 3028 4561
3441 4561 2746 -1637 -4505 -4182 -827 2664 4129 2373 -1539 -3788 -3263 -26 3288 4433 2216
3456 2216 -1661 -4431 -3665 -300 3097 4146 1847 -2035 -4113 -3336 78 3580 4533 2203 -1545 -3965
3472 -3965 -3196 147 3111 3808 1042 -2502 -4625 -3403 478 3827 4414 1908 -1764 -3707 -2820 672
3488 672 3323 3670 1007 -2661 -4368 -2918 581 3623 3911 1229 -2319 -3774 -2597 1267 3958 4039
3504 4039 1120 -2709 -4104 -2848 388 3297 3239 292 -2782 -3856 -1945 1888 4105 3906 1024 -2578
3520 -2578 -4129 -2584 1048 3454 3115 297 -3137 -3932 -2243 1354 4070 3431 439 -2567 -3569 -1750
3536a750L402K101p29l137l071j177K402L134K799q09k839l123n22K030L428J775
3552C914j097l107k971o44K195L842J633j129k776l026l16K316L530J828j292
3567B900l411k740m32K436L273J527j243l195k404k04K851L227J437j467l223
3582f68k381m37K460L170J536j515l278k597M77K653L229J113j601l251k262M86
3598b866K754K954Q97j841l090k550L58K818L004J256j501l343k081M92K882K549
3614B692O99j674l383j848N27K934K723R78k017l060j962O10K969K695P28k321
3630A290k812j907P77K849K675P04k182l171j798J118L090K788k2k105l293j595
3646c594J227K727K666J96k333k915j347R38L310K217M58k680k967j500J183L063
$$ plain form
3536 -1750 1652 3753 3024 -113 -3184 -4361 -1959 1175 3974 3165 326 -2797 -3319 -1289 2139 3914
3552 3914 2817 -290 -3261 -3905 -1710 2132 3765 2636 -140 -3166 -3482 -1166 2364 4192 2900
3567 2900 -511 -3251 -3683 -1247 2026 3553 2310 -885 -3289 -3493 -642 2585 4022 2555 -668
3582 -668 -3049 -3486 -1026 2144 3680 2165 -1113 -3710 -3233 -580 2649 3762 2161 -1090 -3352 -2866
3598 -2866 -112 2842 3739 1898 -1192 -3742 -3384 -566 2438 3694 2193 -1150 -3231 -2739 143 2692
3614 2692 3391 1717 -1666 -3514 -2987 -53 2670 3648 1631 -1429 -3391 -2781 188 2883 3611 1290
3630 1290 -1522 -3429 -2652 197 2872 3576 1394 -1777 -3575 -2457 633 3421 3399 1294 -1999 -3594
3646 -3594 -2367 360 3026 3222 889 -2026 -3373 -2435 875 3092 3550 870 -2097 -3597 -2414 649
3662F49K429K68k767k785j175J252L099K276j98k318l019j153J596K844K322l04
3678C016k728k736j119J548L172K326n03k610k479j055J401L286K116r01k854
3693a20k675m61J728L184J679n57k738k526m82J415L049J875n15k835k479r64
3709c422K103K858J487o90k634k591l34J941L126J792j022k814k512l05J994L044
3725B021J261r17k891k450j25K341K623J439r82k808k287j0K066K730J312j313
3741B010k687k337m0K233K730J289r67l112j890J20K291K539J107j344k633k227
3757b918P6K607K374Q12j498k686j881O41K545K276Q14j512k761j977N67K482
3773c9K265P36j549k776j833P57K326K400O78j555k883j644O46K542K514N22j847
$$ plain form
3662 649 3078 3346 579 -2206 -3381 -2129 970 3246 3048 730 -2289 -3442 -1846 998 3320 3016
3678 3016 288 -2448 -3567 -2019 1153 3479 2976 366 -2113 -3168 -1767 1519 3635 2734 -120
3693 -120 -2795 -3256 -1528 1656 3335 2778 40 -2486 -2968 -1553 1496 3371 2856 21 -2458 -3422
3709 -3422 -1319 1539 3026 2336 -298 -2889 -3223 -1282 1844 3636 2614 -200 -2712 -3017 -1023 2021
3725 2021 3282 2365 -526 -2976 -3101 -760 1863 3302 2320 -488 -2775 -2785 -719 2011 3323 2010
3741 2010 -677 -3014 -3054 -821 1909 3198 2231 -881 -2771 -2651 -360 2179 3286 1942 -691 -2918
3757 -2918 -2842 -235 2139 2951 1453 -1233 -3114 -2473 72 2348 3162 1650 -1111 -3088 -2521 -39
3773 -39 2226 2962 1413 -1363 -3196 -2439 -113 2287 2965 1410 -1473 -3117 -2471 71 2585 3107 1260
3790A260k934j437R18K323K340O03j925k759j256P32K399K249L00j605l039j114
3806b945Q24K417K510j35j917k481j399J174K445K442q0k198k429j162J237K458
3822G61J851l59j765k381j013J146K693K061o53j779k681p70R83K732J984k12
3838B598k111k350j105J675K217J982m89k316k055q14J404K681J386k4k619k368
3854b308p91J734K509J729o84k011k416n75J734K480J462n82k438j941n55J509
3870a144K569J322q00k396k192j63J764K397J337q02k152k177K46J376K356J139
3886B680r34k246j960J83J636K449J039j197k213j941k25K024K299J112r29k217
3902d40k170J98K115K250R05j244k486j940M24K224K214O69j326k208j891O35
$$ plain form
3790 1260 -1674 -3111 -2193 130 2470 3073 1148 -1611 -2867 -2135 264 2513 2813 1208 -1831 -2945
3806 -2945 -2121 296 2806 2671 754 -1727 -3126 -1952 493 2935 2855 657 -1772 -2934 -1697 761
3822 761 2612 2253 488 -1893 -2906 -1760 933 2994 2341 562 -2119 -2889 -1906 826 2810 2598
3838 2598 487 -1863 -2968 -1293 924 2906 2417 101 -1954 -2768 -1364 1317 2703 2679 60 -2308
3854 -2308 -3099 -1365 1144 2873 2189 178 -2238 -2813 -1079 1401 2863 2281 -157 -2098 -2653 -1144
3870 -1144 1425 2747 1947 -449 -2641 -2804 -1040 1357 2694 1892 -260 -2437 -2191 -815 1541 2680
3886 2680 1746 -500 -2460 -2277 -641 1808 2847 1650 -563 -2504 -2729 -705 1594 2706 1777 -440
3902 -440 -2610 -2412 -297 1953 2858 1614 -872 -2812 -2388 -164 2050 2719 1393 -815 -2706 -2071
3918b071J810K150Q21j280k369j378J53K253K232N72j606k275j817O08K007K275
3934B085N86j631k038j674P86J972K129L39j403k203j361O19K218J753q4j456
3950F37k088j350R20K146J959K56j234k718j043Q75J693K198J51j652k341r91
3966b582Q55K229J880K2j810k175j030J063K297J679Oj842k123p62O89K247J576
3983B219M8k045j867r10J163J953J883m46j743k127p39J014K573J789m91k051
3999B23j964n24J335J890J393l10k339j434p42J624J897J424o03j829k004n54
4015b517J420K063J488l54j893j991o54J449K058J063m29k143j728j67J510K393
4031A568J024o63k142j818o6J299K092P01m03j886j953O4J393J996J122q75j811
$$ plain form
3918 -2071 -261 1889 2710 1430 -939 -2317 -2164 89 2321 2893 1287 -988 -2805 -2197 -190 2085
3934 2085 2671 1040 -998 -2672 -1886 86 2215 2554 1151 -1052 -2413 -1794 424 2177 2093 637
3950 637 -1451 -2801 -1881 265 2224 2480 1246 -1472 -2515 -1640 53 2251 2402 750 -1591 -2582
3966 -2582 -1727 502 2382 2404 594 -1581 -2611 -1548 749 2428 2434 592 -1531 -2293 -1604 643 2219
3983 2219 2267 222 -1645 -2555 -1392 561 2444 1998 255 -1872 -2611 -1597 976 2765 2274 223
3999 223 -1741 -2265 -930 960 2353 2043 -296 -1730 -2472 -848 1049 2473 1870 41 -1963 -2517
4015 -2517 -1097 966 2454 2100 207 -1784 -2438 -989 1069 2132 1703 -440 -2168 -2335 -825 1568
4031 1568 2592 1929 -213 -2031 -2097 -798 1294 1995 1592 -294 -2247 -2183 -790 1206 2328 1453 -358
4048c58j560p6J545K099P80p61k026k168K33J749K283P34j116k217j512N19J774
4065g8J708M36q75k150j235L54J641J848O53r84k006j379J93J639K110M96j190
$$ plain form
4048 -358 -1918 -1994 -449 1650 2430 1669 -357 -2525 -2292 -543 1740 2474 1358 -859 -2371 -1852 -78
4065 -78 1630 2066 1191 -959 -2194 -1840 -199 1649 2302 1318 -688 -2067 -1874 -235 1875 2371 1181
$$ [...]
16383b00
##END NTUPLES=NMR FID
##END=
