##TITLE=1H_K-39B
 CDCl3, 108 sc, 
 22.9.2020
##JCAMPDX= 6.0         $$ Bruker NMR JCAMP-DX V2.0
##DATA TYPE= NMR FID
##DATA CLASS= NTUPLES
##ORIGIN= UXNMR, Bruker Analytische Messtechnik GmbH
##OWNER= root
$$ XWIN-NMR		Version 3.5
$$ Tue Sep 22 10:45:41 2020 Russian Standard Time (UT+4h)  she@DPX200
##.OBSERVE FREQUENCY= 200.1315066352
##.OBSERVE NUCLEUS= ^1H
##.DELAY= (6, 6)
##.ACQUISITION MODE= SIMULTANEOUS
##.ACQUISITION SCHEME= undefined
##.AVERAGES= 108
##.DIGITISER RES= 18
##SPECTROMETER/DATA SYSTEM= spect
##.PULSE SEQUENCE= zg30
##.SOLVENT NAME= CDCl3
##.SHIFT REFERENCE= (INTERNAL, CDCl3, 0, 15.7039)
##AUDIT TRAIL= $$ (NUMBER, WHEN, WHO, WHERE, WHAT)
$$ ##TITLE= Audit trail, XWIN-NMR		Version 3.5
$$ ##JCAMPDX= 5.01
$$ ##ORIGIN= Bruker BioSpin GmbH
$$ ##OWNER= she
$$ F:/spectra/data/she/nmr/H-F/1/audita.txt
$$ ##AUDIT TRAIL=  $$ (NUMBER, WHEN, WHO, WHERE, WHAT)
(   1,<2020-09-22 10:43:32.57 +0400>,<she>,<DPX200>,
      <continue with go, POWCHK disabled, PULCHK disabled
       configuration hash MD5:
       00 E9 B6 7A A2 85 ED C7 34 08 36 98 17 FE 4E 26
       data hash MD5: 16K
       C0 B2 5D 6C 77 FD 34 C0 A6 17 A6 9E 6D D4 9E A9>)
$$ ##END=
$$ 
$$ hash MD5
$$ D7 29 F0 F6 AC 61 F9 87 17 AA B4 A4 F1 9B 1E 01
##$RELAX= 
##$RELAX= 
##$RELAX= 
##$RELAX= 
##$RELAX= 
##$RELAX= 
$$ Bruker specific parameters
$$ --------------------------
##$DU= <F:/spectra>
##$EXPNO= 1
##$NAME= <H-F>
##$PROCNO= 1
##$TYPE= <nmr>
##$USER= <she>
##$AMP= (0..31)
100 100 100 100 100 100 100 100 100 100 100 100 100 100 100 100 100 100 
100 100 100 100 100 100 100 100 100 100 100 100 100 100 
##$AQSEQ= 0
##$AQ_mod= 1
##$AUNM= <au_zg>
##$AUTOPOS= <>
##$BF1= 200.13
##$BF2= 200.13
##$BF3= 200.13
##$BF4= 200.13
##$BF5= 200.13
##$BF6= 200.13
##$BF7= 200.13
##$BF8= 200.13
##$BYTORDA= 1
##$CFDGTYP= 0
##$CFRGTYP= 5
##$CHEMSTR= <none>
##$CNST= (0..31)
1 1 145 1 1 1 1 1 1 1 1 1 1 1 1 1 1 1 1 1 1 1 1 1 1 1 1 1 1 1 1 1 
##$CPDPRG= <>
##$CPDPRG1= <>
##$CPDPRG2= <>
##$CPDPRG3= <>
##$CPDPRG4= <mlev>
##$CPDPRG5= <mlev>
##$CPDPRG6= <mlev>
##$CPDPRG7= <mlev>
##$CPDPRG8= <mlev>
##$CPDPRGB= <>
##$CPDPRGT= <>
##$D= (0..31)
0 1.2 0 0 0 0 0 0 0 0.06 0 0.03 0 0 0 0 0.0002 0 0 0 0 0 0 0 0 0 0 0 0 
0 0 0 
##$DATE= 1600756627
##$DBL= (0..7)
120 120 120 120 120 120 120 120 
##$DBP= (0..7)
150 150 150 150 150 150 150 150 
##$DBP07= 0
##$DBPNAM0= <>
##$DBPNAM1= <>
##$DBPNAM2= <>
##$DBPNAM3= <>
##$DBPNAM4= <>
##$DBPNAM5= <>
##$DBPNAM6= <>
##$DBPNAM7= <>
##$DBPOAL= (0..7)
0.5 0.5 0.5 0.5 0.5 0.5 0.5 0.5 
##$DBPOFFS= (0..7)
0 0 0 0 0 0 0 0 
##$DE= 6
##$DECBNUC= <off>
##$DECIM= 32
##$DECNUC= <off>
##$DECSTAT= 4
##$DIGMOD= 1
##$DIGTYP= 9
##$DL= (0..7)
0 120 120 120 120 120 120 120 
##$DP= (0..7)
150 150 150 150 150 150 150 150 
##$DP07= 0
##$DPNAME0= <>
##$DPNAME1= <>
##$DPNAME2= <>
##$DPNAME3= <>
##$DPNAME4= <>
##$DPNAME5= <>
##$DPNAME6= <>
##$DPNAME7= <>
##$DPOAL= (0..7)
0.5 0.5 0.5 0.5 0.5 0.5 0.5 0.5 
##$DPOFFS= (0..7)
0 0 0 0 0 0 0 0 
##$DQDMODE= 0
##$DR= 18
##$DS= 0
##$DSLIST= <SSSSSSSSSSSSSSS>
$$ [...]
##$SUBNAM2= <"">
##$SUBNAM3= <"">
##$SUBNAM4= <"">
##$SUBNAM5= <"">
##$SUBNAM6= <"">
##$SUBNAM7= <"">
##$SUBNAM8= <"">
##$SUBNAM9= <"">
##$SW= 16.880792210976
##$SWIBOX= (0..15)
0 0 2 0 0 0 0 0 0 0 0 0 0 0 0 0 
##$SW_h= 3378.37837837838
##$TD= 16384
##$TD0= 1
##$TE= 0
##$TE2= 300
##$TE3= 300
##$TEG= 300
##$TL= (0..7)
0 120 120 120 120 120 120 120 
##$TP= (0..7)
150 150 150 150 150 150 150 150 
##$TP07= 0
##$TPNAME0= <>
##$TPNAME1= <>
##$TPNAME2= <>
##$TPNAME3= <>
##$TPNAME4= <>
##$TPNAME5= <>
##$TPNAME6= <>
##$TPNAME7= <>
##$TPOAL= (0..7)
0.5 0.5 0.5 0.5 0.5 0.5 0.5 0.5 
##$TPOFFS= (0..7)
0 0 0 0 0 0 0 0 
##$TUNHIN= 0
##$TUNHOUT= 0
##$TUNXOUT= 0
##$USERA1= <user>
##$USERA2= <user>
##$USERA3= <user>
##$USERA4= <user>
##$USERA5= <user>
##$V9= 5
##$VALIST= <valist>
##$VCLIST= <CCCCCCCCCCCCCCC>
##$VD= 0
##$VDLIST= <DDDDDDDDDDDDDDD>
##$VPLIST= <PPPPPPPPPPPPPPP>
##$VTLIST= <TTTTTTTTTTTTTTT>
##$WBST= 1024
##$WBSW= 4
##$XGAIN= (0..3)
0 0 0 0 
##$XL= 0
##$YL= 0
##$YMAX_a= 90813
##$YMIN_a= -84314
##$ZGOPTNS= <>
##$ZL1= 120
##$ZL2= 120
##$ZL3= 120
##$ZL4= 120
##$ABSF1= 10
##$ABSF2= 0
##$ABSG= 5
##$ABSL= 3
##$ALPHA= 0
##$AQORDER= 0
##$ASSFAC= 0
##$ASSFACI= 0
##$ASSFACX= 0
##$ASSWID= 0
##$AUNMP= <proc_1d>
##$AZFE= 0.1
##$AZFW= 0.1
##$BCFW= 1
##$BC_mod= 2
##$BYTORDP= 1
##$COROFFS= 0
##$CY= 11.3945322036743
##$DATMOD= 1
##$DC= 2
##$DFILT= <>
##$DTYPP= 0
##$F1P= 16.9975609425685
##$F2P= -3.02152046262296
##$FCOR= 0.5
##$FTSIZE= 0
##$FT_mod= 4
##$GAMMA= 1
##$GB= 0.15
##$INTBC= 1
##$INTSCL= 1
##$ISEN= 128
##$LB= 0.24
##$LEV0= 0
##$LPBIN= 0
##$MAXI= 10000
##$MC2= 0
##$MEAN= 0
##$ME_mod= 0
##$MI= 1.114404
##$NCOEF= 0
##$NC_proc= 0
##$NLEV= 6
##$NOISF1= 3.799351
##$NOISF2= 2.8
##$NSP= 1
##$NTH_PI= 0
##$NZP= 0
##$OFFSET= 15.70392
##$PC= 1
##$PHC0= -10131.18
##$PHC1= 16.4009
##$PH_mod= 1
##$PKNL= yes
##$PPARMOD= 0
##$PSCAL= 0
##$PSIGN= 0
##$REVERSE= no
##$SF= 200.130013532006
##$SI= 16384
##$SIGF1= 3
##$SIGF2= 2
##$SINO= 400
##$SIOLD= 16384
##$SREGLST= <1H.CDCl3>
##$SSB= 0
##$STSI= 0
##$STSR= 0
##$SW_p= 3612.71676300578
##$SYMM= 0
##$S_DEV= 0
##$TDeff= 0
##$TDoff= 0
##$TI= <>
##$TILT= no
##$TM1= 0
##$TM2= 0
##$TOPLEV= 0
##$USERP1= <user>
##$USERP2= <user>
##$USERP3= <user>
##$USERP4= <user>
##$USERP5= <user>
##$WDW= 1
##$XDIM= 8192
##$YMAX_p= 0
##$YMIN_p= 0
$$ End of Bruker specific parameters
$$ ---------------------------------
##NTUPLES= NMR FID
##VAR_NAME=  TIME,          FID/REAL,        FID/IMAG
##SYMBOL=    X,             R,               I
##VAR_TYPE=  INDEPENDENT,   DEPENDENT,       DEPENDENT
##VAR_FORM=  AFFN,          ASDF,            ASDF
##VAR_DIM=   8192,          8192,            8192
##UNITS=     SECONDS,       ARBITRARY UNITS, ARBITRARY UNITS
##FACTOR=    0.000296,      1,               1
##FIRST=     0,             0,               0
##LAST=      2.424536,      0,               0
##MIN=       0,             -84314,          0
##MAX=       2.424536,      90813,           0
$$ Real data points
##PAGE= N=1
##DATA TABLE= (X++(R..R)), XYDATA
$$ [...]
$$ plain form
1735 -44 -922 -221 -901 -747 -248 -1024 75 -1129 -13 -963 -356 -379 -391 -71 -788 466 -732 42 -310
1754 -310 74 -143 -38 508 -449 622 -352 832 -252 400 282 88 934 -298 862 -280 705 232
1772 232 731 356 280 883 -165 1195 -204 916 -19 367 435 -24 692 -239 855 -236 782 -406
1790 -406 223 63 -79 612 -481 499 -443 214 -354 39 -227 -374 -184 -953 158 -1133 -45 -677 -508
1809 -508 -262 -752 44 -1148 126 -1094 -225 -803 -516 -459 -930 -115 -960 196 -898 1 -633 -110 94
1828 94 -562 260 -691 347 -730 300 -142 127 225 -146 641 -442 987 -203 602 225 305 763 -62
1847 -62 699 -208 652 -182 835 324 299 764 -186 703 -264 880 -294 409 189 326 366 -42 521 -640
1867 -640 624 -593 305 -52 -238 51 -671 334 -685 244 -769 -148 -696 -417 -256 -946 227 -1031
$$ packed form
1735d4q78P01o80J54M99p76J099j204J116r50O07k3j2L20p17J254j198P74l52
1754c10L84k17J05N46r57J071r74J184j084O52j18j94Q46j232J160j142R85m73
1772B32M99l75p6O03j048J360j399J120r35L86O8m59P16r31J094j091J018j188
1790d06O29j60j42O91j093R80r42O57n68L93k66j47J90p69J111j291J088o32J69
1809e08K46m90P96j192J274j220Q69n78K87N7m71Q15q45J156j094Q99o34N23K04
1828I4o56Q22r51J038j077J030m42K69R8l71P87j083J429j190Q05l77Q0M58q25
1847f2P61r07Q60q34J017n11k5M65r50Q89r67J144j174P03k20J37M0m08N63j161
1867f40J264j217Q98l57j86K89p22J005j019R29j013O21n48K79J61o90J173j258
$$ plain form
1885 -1031 8 -951 -393 -360 -881 -371 -819 -21 -955 28 -898 -148 -526 -571 -18 -807 264 -817 175
1904 175 -696 23 -300 -362 -87 -375 582 -808 794 -432 295 -9 -21 555 -324 621 -141 865 66
1923 66 473 229 304 694 -220 859 -267 800 217 204 523 93 678 -112 724 -371 559 -136 293 156
1943 156 -291 458 -571 545 -603 235 -199 -96 -278 -534 5 -601 76 -725 216 -680 -223 -345 -755
1962 -755 -77 -920 113 -844 71 -578 -341 -536 -653 -32 -918 144 -878 46 -473 -262 153 -456 255
1981 255 -586 393 -395 294 -184 415 111 -140 661 -289 998 -81 587 538 468 590 216 782 80 674
2001 674 33 899 -19 470 573 -52 906 -72 856 -133 594 60 230 197 -192 562 -462 592 -430
2020 -430 333 -327 -90 54 -733 147 -815 215 -804 -148 -358 -403 -174 -722 109 -744 -27 -684 -81 -543
$$ packed form
1885a031J039r59N58L3n21N10m48P98r34R83r26P50l78m5N53p89J071j081R92
1904A75q71P19l23o2K75k88R57j390J602j226P27l04j2N76q79R45p62J006p99
1923F6M07k44P5L90r14J079j126J067n83j3L19m30N85p90Q36j095R30o95M29j37
1943A56m47P49j029J116j148Q38m34J03j82k56N39o06O77q01R41q96M57j22m10
1962g55O78q43J033r57R15o49K37j95j17O21q86J062j022R24n19K11M15o09P11
1981B55q41R79p88O89m78N99l04k51Q01r50J287j079O68m9p0J22l74N66p02N94
2001F74o41Q66r18M89J03o25R58r78R28r89P27n34J70l3l89P54j024J054j022
2020d30P63o60K37J44p87Q80r62J030j019O56k10m5K29n48Q31q53P17o57O03m62
$$ plain form
2040 -543 -435 -221 -726 45 -788 93 -502 97 -346 -276 233 -476 266 -664 355 -657 170 -29 -108 124
2060 124 -276 662 -202 550 -286 549 181 199 617 7 696 -332 543 -142 473 462 268 672 -82 698
2080 698 -126 766 11 562 159 48 542 -127 695 -178 541 -121 295 -7 -201 92 -469 237 -638 -39
2100 -39 -353 -92 -172 -429 -76 -786 34 -826 -180 -803 -317 -587 -781 -6 -753 109 -716 17 -543 -277 -329
2121 -329 -378 72 -723 229 -841 221 -365 53 182 -132 385 -235 388 -355 281 -180 166 335 31 566
2141 566 -130 743 -98 613 193 419 495 -4 893 -112 817 -28 723 141 320 521 -5 660 -321 659
2161 659 -374 267 -203 111 323 -315 309 -416 305 -561 163 -196 -140 -273 -564 -173 -779 63 -639 -95
2181 -95 -574 -360 -214 -824 122 -768 -119 -735 4 -503 -556 -264 -658 -182 -668 106 -666 -29 16 -259 80
$$ packed form
2040e43J08K14n05P71q33Q81n95N99m43P0N09p09P42r30J019j012Q27j99p9K32
2060A24m00R38q64P52q36Q35l68J8M18o10O89j028Q75o85O15j1j94M04p54P80
2080F98q24Q92p55N51m03j11M94o69Q22q73P19o62M16l02j94K93n61P06q75N99
2100c9l14K61q0k57L53p10Q20q60O46o23M86k70j94P75p47Q62q25P33n60K66n2
2121c29m9M50p95R52j070J062n86M18J29l14N17o20O23p43O36m61L46J69l04N35
2141E66o96Q73q41P11m20K26P6m99Q97j005R29q45P51n82J79K01n26O65r81R80
2161F59j033O41m70L14K12o38O24p25P21q66P24l59N6j33k91L91o06Q42p02N44
2181i5m79K14J46o10R46q90O49o16P39n07n3K92l94M76m86P74p72O37M5k75L39
$$ plain form
2202 80 -232 364 -213 488 -50 296 53 55 266 -118 456 -147 692 -45 428 119 209 493 -133 717 -88
2223 -88 675 -180 370 278 6 473 35 502 -285 637 -248 228 15 -168 260 -317 354 -423 376 -276 113
2244 113 -92 -87 191 -498 187 -789 84 -531 -193 -321 -523 -44 -621 95 -514 -12 -892 -255 -293 -452 -270
2265 -270 -809 -75 -621 -209 -665 -291 -303 -501 21 -486 319 -407 257 -332 39 -100 -298 277 -389 513
2285 513 -254 515 -265 321 227 78 503 -118 568 -125 612 156 251 303 -188 507 -211 453 72 268 -48
2306 -48 57 210 -257 582 -181 513 -269 399 -68 -38 157 -237 262 -522 168 -176 134 -208 -27 43 -407
2327 -407 161 -773 22 -624 -56 -345 -258 -80 -582 -131 -583 30 -661 -107 -567 -323 30 -555 -20 -347
2347 -347 120 -519 -82 -125 2 -95 -83 128 -333 456 -199 311 20 -113 252 14 515 35 611 -231 385
$$ packed form
2202H0l12N96n77P01n38L46k43KK11l84N74o03Q39p37M73l09R0K84o26Q50q05
2223h8P63q55N50r2k72M67m38M67p87R22q85M76k13j83M28n77O71p77P99o52L89
2244A13k05NK78o89O85r76Q73o15L38j28k02M79n77P16o09N02q80O37l8j59J82
2265b70n39P34n46M12m56L74j2j98N22n07Q05p26O64n89L71j39j98N75o66R02
2285E13p67P69p80N86r4j49M25o21O86o93P37m56R5N2m91O95p18O64l81J96l16
2306d8J05J53m67Q39p63O94p82O68m67L0J95l94M99p84O90l44L10l42J81P0m50
2327d07N68r34P95o46N68k89Q7J78n02M51m52O13o91N54m60K44L53n85N35l27
2347c47M67o39M37m3J27r7J2K11m61P89o55N10k91j33L65k38N01m80N76q42O16
$$ plain form
2368 385 135 263 404 86 603 -149 607 1 338 185 36 449 2 348 -174 518 -265 301 77 -137
2388 -137 287 -444 186 -336 205 -473 -20 -138 -171 -21 -365 354 -554 267 -433 -246 -193 -371 -137 -611 -3
2409 -3 -572 99 -615 -77 -333 -161 81 -407 339 -430 77 -571 29 -132 -175 227 -337 99 -196 297 -330
2430 -330 8 181 -23 329 -404 346 -447 234 32 138 81 340 566 -31 564 -267 584 46 303 247 8
2451 8 461 -210 449 42 423 4 200 189 -27 286 -330 237 -234 321 -243 -59 -63 -165 159 -298 112 -468
2473 -468 33 -313 -12 -77 -418 330 -339 255 -533 15 -232 -232 -1 -493 -90 -481 284 -319 95 -217 -140
2494 -140 13 -415 278 -446 203 -251 163 -137 28 228 -51 405 -92 266 -180 393 291 122 242 -195
2514 -195 381 -174 504 56 440 161 428 290 13 402 -14 412 149 359 188 129 261 -56 434 -208
$$ packed form
2368C85k50J28J41l18N17p52P56o06L37j53j49M13m47L46n22O92p83N66k24k14
2388a37M24p31O30n22N41o78M53j18l3J50l44P19r08Q21p00J87N3j78K34m74O08
2409cn69O71p14N38k56J72K42m88P46p69N07o48O00j61m3M02n64M36k95M93o27
2430c30L38J73k04L52p33P50p93O81k02J06n7K59K26n97N95q31Q51n38K57n6k39
2451HM53o71O59m07L81m19J96j1k16L13o16N67m71N55n64J84mj02L24m57M10n80
2473d68N01l46L01o5l41P48o69N94p88N48k47%K31m92M03l91P65o03M14l12P7
2494a40J53m28O93p24O49m54M14l00J65K00k79M56m97L58m46N73j02j69J20m37
2514a95N76n55O78m48L84k79K67j38k77L89m16M26k63K10j71n9J32l17M90o42
$$ plain form
2534 -208 398 1 105 78 129 174 -138 275 -246 240 -204 146 -66 -163 2 -559 -20 -562 -243 -409 -70
2555 -70 -133 -326 -164 -583 33 -528 120 -368 -53 -21 -236 129 -311 45 -206 144 -345 41 51 -231 181
2576 181 -32 552 -329 159 -67 144 -45 89 302 -150 480 1 367 -113 244 76 59 296 33 371
2596 371 -53 496 170 218 340 168 430 -35 583 -239 136 7 293 166 96 202 -236 422 -9 159 -15
2617 -15 152 -84 -343 29 -418 126 -452 64 -256 -274 -5 -343 -196 -520 8 -536 -71 -440 -21 -243 -260
2638 -260 19 -267 65 -497 54 -296 -318 -239 -51 298 -366 339 -107 390 -71 149 194 55 151 -194 500
2659 500 -244 199 40 218 223 -16 334 -63 244 16 399 189 174 318 -101 556 326 95 34 412 145
2680 145 378 80 -309 431 -160 198 -355 478 204 326 394 -192 205 -184 412 -253 0 -257 -244 -148 -269
$$ packed form
2534b08O06l97J04k7N1M5l12M13n21M86m44L50k12r7J65n61N39n42L19j66L39
2555g0o3j93J62m19O16n61O48m88L15L2k15L65m40L56k51L50m89L86J0k82M12
2576A81k13N84q81M88k26K11j89J34K13m52O30m79L66m80L57j68j7K37k63L38
2596C71m24N49l26M8J22j72K62m65O18q22L75j29K86j27p0J06m38O58m31J68j74
2617a5J67k36k59L72m47N44n78N16l20j8K69l38J47l24N28n44M65l69M19k22j7
2638b60K79k86L32n62N51l50k2P9J88L49o64P05m46M97m61K20M5j39R6l45O94
2659E00p44M43j59J78Nk39L50l97L07k28L83k10j5J44m19O57k30k31o1L78k67
2680A45K33k98l89P40n91L58n53Q33k74J22O8n86L97l89N96o65K53k57J3R6j21
$$ plain form
2701 -269 -184 -397 -12 -538 -356 -241 -292 -125 -293 -78 -540 68 -498 -127 -300 -517 -39 -226 1 -490 -33
2722 -33 -172 -75 4 -106 -94 -182 137 -214 247 16 304 22 179 380 61 455 -1 427 84 164 207 151 295
2745 295 -233 283 -4 398 76 281 72 -108 224 -69 346 -14 346 41 94 -20 -216 246 -260 248
2765 248 -273 56 -222 -96 16 -247 142 -561 -10 -427 -47 -231 -236 -420 -376 -74 -521 -11 -584 113 -431
2786 -431 -252 -325 -219 -321 -418 16 -521 83 -306 -151 -45 -292 199 -32 -15 -153 2 -116 80 157 -29
2807 -29 425 94 590 164 198 43 254 111 300 593 -69 407 14 -65 -238 76 -67 -301 631 -302 151
2828 151 120 635 37 239 257 -633 154 -579 74 -8 86 -50 -238 -236 -336 -33 -289 222 -435 179 -382 -358
2850 -358 255 -104 362 -91 137 -57 23 139 19 -93 -531 275 -180 66 -450 126 -233 -133 -260 -248 -14
$$ packed form
2701b69Q5k13L85n26J82J15n1J67j68K15m62O08n66L71j73k17M78j87K27m91M57
2722c3j39R7P9j10J2q8L19l51M61k31K88k82J57K01l19L94m56M28l43Q0M3n6J44
2745B95n28N16k87M02l22K05k09j80L32k93M15l60L60l05N3j14j96M62n06N08
2765B48n21L29k78J26J12k63L89p03N51m17L80j84nj84M4L02m47N10n73O97n44
2786d31J79p3J06j02r7M34n37O04l89J55J06k47M91k31J7j38J55j18J96P7j86
2807b9M54l31M96m26L4j55K11j43J89K93o62M76l93p9j73L14j43k34R32r33M53
2828A51l1N15n98K02J8q90P87p33O53q2R4j36j88Kj00L03k56N11o57O14n61K4
2850c58O13l59M66m53K28j94Q0J16j20j12m38Q06m55K46n16N76l59J00j27J2K34
$$ plain form
2871 -14 -236 107 -231 121 -273 -345 281 -11 492 -116 176 -35 273 103 -228 261 -297 336 -236 381 -13
2892 -13 497 133 45 190 188 134 -34 445 290 427 47 182 453 59 283 -283 166 -155 60 84 -47 67
2914 67 -218 -180 -487 14 -97 -209 -79 -149 -45 -523 -278 -553 48 -249 -264 -251 -229 134 -353 97 -510 228
2936 228 -168 -44 -130 -341 154 43 33 -50 150 -400 -2 -203 -137 3 -355 34 -396 476 -206 240 111
2957 111 -119 -6 -107 232 -20 505 14 203 305 -9 241 56 368 108 292 100 200 103 113 60 -123
2978 -123 262 75 316 34 71 -17 443 234 151 80 2 232 -154 201 268 -136 135 -446 -67 -202 -42 32
3000 32 -322 124 98 28 -60 9 207 -251 -278 53 -126 44 294 -568 49 -33 -130 38 294 78 50 176 -518
3023 -518 312 95 -158 -212 11 109 62 314 -65 496 -205 -111 172 -204 231 -185 405 -66 310 -10 489
$$ packed form
2871a4k22L43l38L52l94p2O26k92N03o08K92k11L08j70l31M89n58O33n72O17l94
2892a3N10l64q8J45kn4j68M79j55J37l80J35K71l94K24n66M49l21K15K4j31J14
2914F7k85L8l07N01j11j12J30p0J04m78K45k75O01k97j5J3K2L63m87M50o07P38
2936B28l96J24q6k11M95j11j0q3K00n50L98k01O6J40l58L89m30Q72o82M46j29
2957A11k30J13j01L39k52N25m91J89J02l14K50j85L12k60J84j92J00r7J0n3j83
2978a23L85j87K41k82L7q8M60k09q3p1p8K30l86L55O7m04K71n81L79j35J60P4
3000C2l54M46k6p0q8O9J98m58k7L31j79J70K50q62O17q2r7J68K56k16k8J26o94
3023e18Q30k17k53n4K23R8m7K52l79N61p01R4K83l76M35m16N90m71L76l20M99
$$ plain form
3044 489 250 228 373 155 451 186 304 86 266 537 457 324 -120 330 -293 480 -234 -263 -329 -167 66
3065 66 -165 23 -384 -255 -272 43 -204 -29 -281 -468 -201 41 -351 -575 -160 58 -105 88 -384 -132 -149
3086 -149 227 -111 -218 -68 -398 -30 -434 114 -138 50 -162 126 211 157 106 -148 228 75 115 117 211 40
3108 40 112 486 -75 190 79 384 -173 119 236 198 397 63 363 -401 259 -240 190 83 -213 120 -209
3129 -209 357 -219 107 -41 67 108 -113 161 -139 35 -208 125 -150 57 -149 -261 91 -145 -17 -399
3149 -399 149 -152 -28 -58 -163 100 -447 -95 -426 -65 -259 -43 15 -206 -201 -255 94 -234 265 1 28 59
3171 59 -352 -39 -343 -200 48 292 63 268 247 45 198 -100 377 86 153 133 152 59 41 250 5 246
3193 246 -15 152 199 116 146 67 110 -181 159 -11 152 146 67 215 -31 225 -247 87 -194 108 -281 -254 101
$$ packed form
3044D89k39k2J45k18K96k65J18k18J80K71q0j33m44M50o23P73p14k9o6J62K33
3065F6k31J88m07J29j7L15k47J75k52j87K67K42l92k24M15K18j63J93m72K52j7
3086a49L76l38j07J50l30L68m04N48k52J88k12K88Q5n4n1k54L76j53M0KR4j71
3108D0P2L74n61K65j11L05n57K92J17l8J99l34L00p64O60m99M30j07k96L33l29
3129b09N66n76L26j48J08M1k21K74l00J74k43L33k75K07k06j12L52k36J28l82
3149c99N48l01J24l0j05K63n47L52l31L61j94K16N8k21Nn4L49l28M99k64K7L1
3171E9m11L13l04J43K48K44k29K05k1k02J53k98M77k91O7k0J9r3j8K09k45K41
3193B46k61J67M7q3L0p9M3k91L40j70J63op9J48k46K56m72L34k81L02l89K7L55
$$ plain form
3216 101 -245 15 -148 -7 -109 -22 -15 4 195 -244 48 -318 124 -293 7 -239 -269 -46 -265 219 -373 70
3238 70 -280 -125 15 -317 -78 -205 171 -278 1 101 222 118 -47 90 -91 -40 -170 98 -156 112 22
3259 22 51 180 68 225 15 39 -182 220 137 72 216 -152 57 3 189 -131 -58 -70 96 177 -149 308 70
3282 70 161 -186 -41 107 -32 40 -80 241 -5 100 -31 -263 -86 -111 280 -50 -52 -314 -80 -258 19 98
3304 98 -161 -94 -162 127 -321 -59 20 -80 60 -39 -17 -185 -32 -371 16 8 -74 188 -56 71 -294 138 -115
3327 -115 43 -141 15 -48 56 224 6 313 76 382 271 6 157 269 162 -31 224 -87 187 131 161
3348 161 282 -16 500 -155 273 -45 273 -131 -158 185 -126 5 -67 100 -188 4 -57 -193 -39 -79 1 -256
3370 -256 -79 -184 -16 -243 20 15 -258 127 -114 113 -302 46 26 -1 -223 -218 68 -106 115 -336 48 -13
$$ packed form
3216A01l46K60j63J41j02Q7PJ9J91m39K92l66M42m17L00k46l0K23k19M84n92M43
3238G0l50J55J40l32K39j27L76m49K79J00J21j04j65J37j81N1j30K68k54K68r0
3259B2K9J29j12J57k10K4k21M02q3o5J44l68K09n4J86l20P3j2J66Q1l26M57k38
3282G0R1l47J45J48j39P2j20L21k46J05j31k32J77k5L91l30kk62K34j78K77P9
3304I8k59O7o8K89m48K62P9j00J40r9K2j68J53l39L87qq2K62k44J27l65M32k53
3327a15J58j84J56o3J04J68k18L07k37L06j11k65J51J12j07j93K55l11K74n6L0
3348A61J21k98N16o55M28l18L18m04k7L43l11J31p2J67k88J92o1j36J54m0Q0k57
3370b56J77j05J68k27K63nk73L85k41K27m15L48k0k7k22NK86j74K21m51L84o1
$$ plain form
3392 -13 -9 -12 -181 109 -102 190 -88 -2 44 79 73 23 184 -48 317 42 143 43 24 32 6 228 -178 295 135
3417 135 145 117 91 366 55 80 -140 201 -73 143 184 70 141 -100 202 -143 54 -169 -13 28 -97 62
3439 62 -308 140 -302 -53 -277 -66 -172 -315 -83 -384 3 -305 54 -220 -192 -200 -208 -68 -286 80 -293 -97
3461 -97 -37 -99 11 -34 177 -271 288 -2 233 -107 -7 61 -131 151 -198 171 -25 44 132 194 78 -157 -32
3484 -32 -172 218 35 372 -70 -68 11 -116 130 27 424 -143 173 -48 166 393 29 145 193 57 89 167
3506 167 -189 36 156 -99 72 -216 98 -197 -83 -206 33 123 -227 -39 47 -51 -265 -87 -308 -268 -194 -141
3528 -141 -160 -387 -21 -151 90 -48 -190 -43 -21 -26 -213 2 -113 -127 -232 73 59 -196 32 -233 250 31
3550 31 -2 385 -136 319 -15 -67 511 24 -123 -92 26 -155 8 -148 205 -159 339 -19 -88 -15 79 348
$$ packed form
3392a3Mlj69K90k11K92k78Q6M6L5on0J61k32L65k75J01j00j9Qk6K22m06M73j60
3417A35J0k8k6K75l11K5k20L41k74K16M1j14P1k41L02l45J97k23J56M1j25J59
3439F2l70M48m42K49k24K11j06j43K32l01L87l08L59k74K8qqJ40k18L66l73J96
3461i7O0o2J10m5K11m48N59k90K35l40J00O8j92K82l49L69j96O9Q8O2j16k35J25
3484c2j40L90j83L37m42KP9j27K46j03L97n67L16k21K14K27l64J16M8j36L2P8
3506A67l56K25J20k55J71k88L14k95J14j23K39R0l50J88Q6r8k14J78k21M0P4N3
3528a41j9k27L66j30K41j38j42J47K2nj87K15j15j4j05L05j4k55K28k65M83k19
3550C1l3L87n21M55l34n2N78m87j47L1J18j81J63j56L53l64M98l58o9P3R4K69
$$ plain form
3572 348 -30 237 -40 120 -17 326 242 -276 -157 -212 33 -36 324 -198 -115 -312 -229 242 -242 197 -108 -89
3594 -89 -174 -134 -213 36 216 -189 -18 -132 -5 -210 -8 -49 -235 -127 -153 86 -187 82 10 76 18 -148 128
3617 128 -263 126 -111 103 90 -103 334 2 225 53 181 -229 53 201 81 124 122 221 2 126 -63 109
3639 109 -164 -86 62 4 148 -98 101 40 32 41 119 -150 32 150 116 -59 -233 -13 -96 -157 27 -173 -124 -289
3663 -289 -25 -33 121 -106 -79 30 -297 -23 -165 -41 -205 -155 -79 19 -144 -40 7 -310 92 -325 97 -393
3685 -393 -152 -173 -280 139 -83 -68 -88 -55 79 117 -175 -1 95 113 90 39 78 -35 0 121 -128 167 57 111
3709 111 118 102 79 55 364 90 234 96 259 128 78 133 -71 57 -116 -5 15 83 -147 117 -44 -105 98
3732 98 -29 59 -90 144 -141 20 -57 -41 17 -237 93 -21 23 80 -277 -60 -276 159 -112 -107 37 118 -75
$$ packed form
3572C48l78K67k77J60j37L43q4n18J19n5K45o9L60n22Q3j97Q3M71m84M39l05J9
3594h9q5M0p9K49J80m05J71j14J27k05K02m1j86J08k6K39k73K69p2O6n8j66K76
3617A28l91L89k37K14j3j93M37l32K23j72J28m10K82J48j20M3kR9k19J24j89J72
3639A09k73P8J48n8J44k46J99o1qRP8k69J82J18l4j75j74K20q3o1J84k00M9j65
3663b89K64qJ54k27K7J09l27K74j42J24j64N0P6R8j63J04M7l17M02m17M22m90
3685c93K41k1j07M19k22J5k0L3J34L8k92J74R6J8k3n1L9j13L5J21k49K95j10N4
3709A11Pj6k3k4L09k74J44j38J63j31n0N5k04J28j73J11K0O8k30K64j61o1K03
3732I8j27Q8j49K34k85J61p7J6N8k54L30j14M4N7l57K17k16M35k71NJ44Q1j93
$$ plain form
3755 -75 -139 -132 14 38 -167 160 -191 124 -108 101 -40 1 77 -134 -21 67 126 99 143 40 133 294 -132 -8
3779 -8 -142 25 4 49 213 32 151 203 182 112 183 32 -9 106 -12 36 50 229 264 44 94 80 105 0 -50
3804 -50 -66 127 -150 -118 -76 -52 102 -92 -9 -268 52 -245 -7 -163 -207 82 -226 148 11 6 -190 -24 -13
3827 -13 -11 -234 34 81 -291 12 -151 -71 -23 -70 126 -182 109 -164 -141 -78 40 49 42 -35 -172 10 -223 55 -303
3852 -303 83 -59 128 36 29 177 -17 109 -212 56 107 66 138 102 29 -215 83 140 130 282 1 50 -41 66
3876 66 24 235 -195 49 3 -45 -124 -125 117 -128 -71 -198 -126 -17 -18 -62 -14 -29 -286 194 -152 -58 102 -194 150
3901 150 -194 -105 -98 81 -226 151 15 -44 -26 -298 -80 -131 87 104 -48 144 45 220 -45 152 -75 97 -50
3924 -50 -90 107 -86 142 -171 66 -42 83 -277 82 110 1 96 -249 182 -247 14 66 -57 74 -115 97
$$ packed form
3755g5o4PJ46K4k05L27l51L15k32K09j41M1P6k11J13Q8N9k7M4j03R3J61m26J24
3779hj34J67k1M5J64j81J19N2k1p0P1j51m1J15j18M8J4J79L5k20N0j4K5j05n0
3804e0j6J93k77L2M2K4J54j94Q3k59L20k97K38j56m4K89l08L74j37nj96J66J1
3827a3Kk23K68M7l72L03j63Q0M8m7J96l08K91k73K3O3J18Rpp7j37J82k33K78l58
3852c03L86j42J87r2pJ48j94J26l21K68N1m1P2l6p3k44K98N7j0J52k81M9r1J07
3876F6m2K11m30K44m6m8p9jK42k45N7j27P2J09jm4M8j5k57M80l46R4J60k96L44
3901A50l44Q9PJ79l07L77j36n9J8k72K18n1K18J7j52J92r9J75k65J97k27J72j47
3924e0m0J97j93K28l13K37j08J25l60L59K8j09R5l45M31m29K61N2j23J31j89K12
$$ plain form
3946 97 62 155 -153 107 -28 242 125 -15 213 -122 199 -108 21 34 -280 -17 -21 28 76 109 -309 -40 64
3969 64 -79 -5 -60 -231 -346 155 -235 -1 -359 -178 65 30 -19 -227 1 -205 12 -33 -186 213 64 157
3991 157 93 184 247 10 -87 102 -43 98 219 -117 329 -46 158 -87 19 95 -53 66 3 82 35 -72 21
4014 21 -29 36 -166 -58 18 163 -60 94 -110 210 -36 -91 276 -188 213 -139 121 224 60 19 -181 61
4036 61 -211 146 -67 -88 12 64 -89 -163 117 -247 -165 -205 -124 -215 -38 118 -328 -45 -145 -131 -256 -140 125
4059 125 24 -48 -58 -136 -168 63 -88 -8 115 0 -161 59 222 28 106 53 -107 50 162 240 -134 188 63
4082 63 40 44 97 3 -30 76 -144 192 91 47 -85 65 90 -55 48 -40 99 -85 217 11 -46 59 -11 84
4106 84 -181 322 -36 92 -108 -57 -168 64 202 -287 283 -65 -41 -194 2 61 -85 12 -117 -170 -100 159
$$ packed form
3946I7l5R3l08K60j35K70j17j40K28l35L21l07J29J3l14K63mM9M8L3m18K69J04
3969F4j43P4n5j71j15N01l90K34l58J81K43l5m9k08K28k06K17m5j53L99j49R3
3991A57o4R1O3k37r7J89j45J41J21l36M46l75K04k45J06P6j48J19o3P9m7j07R3
4014B1n0O5k02J08P6J45k23J54k04L20k46n5L67m64M01l52K60J03j64m1k00K42
4036F1k72L57k13k1J00N2j53p4K80l64Q2m0Q1r1J77J56m46K83j00J4j25J16K65
4059A25j01p2j0p8l2K31j51Q0J23j15j61K20J63j94P8n3j60J57J12P8l74L22j25
4082F3k3MN3r4l3J06k20L36j01m4j32J50K5j45J03q8J39j84L02k06n7J05p0R5
4106H4k65N03l58J28k00N1j11K32J38m89N70l48K4j53J96N9j46R7j29n3P0K59
$$ plain form
4128 159 -29 -59 -143 -20 -32 -281 18 -124 -92 -104 53 0 -114 87 4 89 -160 -19 -45 60 55 45 56 -177
4152 -177 230 1 145 226 21 104 130 71 76 32 60 91 67 29 98 -116 203 -83 -17 21 257 94 -64 -36 -3
4177 -3 -34 -173 -22 13 134 13 90 -30 51 -143 -105 183 18 162 -154 -53 106 13 159 -213 162 -231 -260
4200 -260 -206 -13 26 -135 207 -148 17 -215 -274 108 -170 199 -200 104 -228 83 0 7 -55 -74 -157 -75 214
4223 214 -125 119 58 101 -2 -34 11 -44 134 -39 258 119 -14 1 30 167 208 381 -92 143 52 32 23 -146
4247 -146 51 -301 -42 -18 77 37 -31 12 -55 -107 -210 -4 -238 135 -193 51 -84 -46 -75 -220 131 -245 -64
4270 -64 -254 -64 -143 45 -158 -8 32 25 -18 72 -120 76 -110 -96 26 -21 -253 45 -194 -60 153 -207 14
4293 14 -130 14 33 81 0 -23 -96 -283 139 -3 -3 208 173 12 33 -62 4 87 -7 108 -223 115 -42 3 87
$$ packed form
4128A59j88l0q4J23j2k49K99j42L2j2J57n3j14K01q3Q5k49J41k6J05nj0J1k33
4152a77M07k29J44Q1k05Q3K6n9Nm4K8L1k4l8O9k14L19k86O6L8K36j63j58K8L3
4177cl1j39J51L5J21j21P7j20Q1j94L8K88j65J44l16J01J59r3J46l72L75l93k9
4200b60N4J93L9j61L42l55J65k32n9L82k78L69l99L04l32L11q3Po2j9q3Q2K89
4223B14l39K44o1M3j03l2M5n5J78j73K97j39j33J5K9J37M1J73m73K35r1k0rj69
4247a46J97l52K59K4R5m0o8M3o7n2j03K06k34L73l28K44j35L8k9j45L51l76J81
4270f4j90J90p9J88k03J50M0pm3R0j92J96j86J4J22m7k32K98k39J34K13l60K21
4293A4j44J44J9M8q1k3p3j87M22j42%K11l5j61K1r5O6Q3r4J15l31L38j57M5Q4
$$ plain form
4318 87 74 66 108 202 -120 265 72 -35 155 46 129 -186 67 -4 79 -132 -64 -111 -39 57 -219 -107 -149 1 -72
4343 -72 -75 22 1 14 -211 59 -146 -39 -101 16 57 -170 59 -212 74 33 113 4 -99 -34 -109 12 -77 159
4367 159 0 131 -25 -13 277 -123 282 5 -136 113 -38 3 -35 14 15 37 -220 -160 -313 -95 66 -18 -55
4390 -55 128 150 -120 217 -213 -89 29 -124 160 -72 61 -228 20 -26 -50 -147 -89 38 -173 101 -16 38
4412 38 -77 -92 -146 -110 -86 -158 -112 -173 -26 -96 7 -116 -36 38 -61 -53 -294 -95 40 118 45 -65 79 -166 16
4437 16 -88 -69 33 78 173 -44 159 52 32 -142 -62 -186 153 6 -8 55 -126 91 -155 67 -137 -29 27
4460 27 -136 -16 53 173 -55 53 -146 84 131 71 -16 -82 182 -175 139 4 -12 -30 -194 25 82 64 9 -242
4484 -242 -60 89 69 -211 22 26 -53 -18 87 -88 -179 -69 -53 92 -199 57 -115 -197 -35 -43 39 -156 -64 -166
$$ packed form
4318H7j3qM2R4l22L85j93j07J90j09Q3l15K53p1Q3k11O8m7P2R6k76J12m2J50p3
4343g2lR7k1J3k25K70k05J07o2J17M1k27K29k71K86m1Q0j09j03O5p5J21q9K36
4367A59j59J31j56J2K90m00M05k77j41K49j51M1l8M9JK2k57O0j53K18J61q4l7
4390e5J83K2k70L37m30J24J18j53K84k32J33k89K48m6k4r7N8J27k11K74j17N4
4412C8j15j5n4L6K4p2M6o1J47p0J03j23Q0P4r9Qk41J99J35P8p3j10J44k45J82
4437A6j04J9J02M5R5k17K03j07k0j74Q0j24L39j47j4O3j81K17k46K22k04J08N6
4460B7j63J20O9J20k28J08j99K30M7o0q7o6K64l57L14j35j6j8j64K19N7j8n5k51
4484b42J82J49k0k80K33Mp9L5J05j75r1J10J6J45k91K56j72q2J62qQ2j95R2j02
$$ plain form
4508 -166 -61 -150 47 136 -50 76 6 14 101 -96 139 76 105 161 59 24 -77 -4 -67 -87 267 253 61 132 -68
4533 -68 82 30 102 6 49 24 -97 93 -85 91 34 -26 118 18 94 -61 207 -174 -169 164 -14 -110 70 -60
4557 -60 -104 175 -73 88 -112 202 -164 -73 105 -129 20 -143 -160 -55 -156 -263 43 64 -185 -97 -14 -78 -24
4580 -24 213 -64 -204 77 3 216 50 -46 -172 11 -108 179 252 226 46 13 141 120 120 261 42 -8 18 27
4604 27 -89 14 126 32 -82 78 75 25 31 -76 164 1 77 -92 16 8 -173 -30 -30 -49 -89 51 8 108 63
4629 63 27 119 -48 289 -42 -22 129 63 -68 50 -189 45 91 34 54 39 -166 -148 61 -13 -160 -36 143 -9
4653 -9 -110 -87 127 -177 -60 -35 171 88 -32 -143 -62 205 -92 45 -211 4 134 41 -31 141 31 -178 247
4676 247 33 137 66 136 99 157 243 75 292 -11 80 16 -56 239 -78 -81 2 45 -166 67 -62 206 211 -238 29
$$ packed form
4508a66J05q9J97Q9j86J26p0QQ7j97K35o3K9N6j02l5j01P3o3k0L54j4j92P1k00
4533f8J50n2P2r6M3k5j21J90j78J76n7o0J44j00P6j55K68l81NL33j78r6J80j30
4557f0m4K79k48J61k00L14l66R1J78k34J49j63j7J05j01j07L06K1k49Q8Q3o4N4
4580b4K37k77j40K81p4K13j66r6j26J83j19K87P3k6j80l3J28k1%J41k19n0K6R
4604B7j16J03J12r4j14J60ln0Oj07K40j63P6j69J08qj81J43%j9m0J40m3J00m5
4629F3l6R2j67L37l31K0J51o6j31J18k39K34M6n7K0j5k05J8K09p4j47J24J79j52
4653ij01K3K14l04J17K5K06q3j20j11Q1K67k97J37k56K15J30r3p2J72j10k09M25
4676B47k14J04p1P0l7N8Q6j68K17l03R1o4p2K95l17lQ3M3k11K33j29K68Nm49K67
$$ plain form
4701 29 -26 -124 134 74 -82 6 -56 -46 170 -24 33 -145 -120 7 -39 96 -162 -101 -2 213 27 -91 229 -61
4725 -61 -3 -28 187 -25 -76 -197 194 -73 118 -149 -111 118 -84 11 -183 148 -61 90 95 64 33 -120 33
4748 33 -198 179 145 -76 37 20 172 145 175 -45 164 204 209 91 -194 120 -23 90 -61 -10 58 154 -32 154
4772 154 97 -75 2 66 -143 -9 -3 24 24 -54 -185 -12 -64 -66 -50 21 56 -89 -75 -129 -56 63 -122 -76 -23 61 -67
4799 -67 127 -85 -10 53 186 -167 -179 268 164 155 -150 -98 -145 59 -69 -9 -14 -165 4 106 -52 -32 123 52
4823 52 22 19 38 242 83 144 -83 122 -29 -151 -35 9 165 34 63 79 -40 270 -156 75 -19 -75 64 -171
4847 -171 125 -35 7 10 65 -18 36 -253 -16 -77 -4 -74 -245 103 -11 -23 -216 -1 -96 -224 -26 -7 148 -204
4871 -204 -11 -39 52 51 -11 22 147 206 1 59 -77 -20 -85 148 243 35 170 -80 -73 16 32 -133 -42 -96 -123 37
$$ packed form
4701B9n5r8K58o0j56Q8o2J0K16j94N7j78K5J27m6J35k58O1R9K15j86j18L20k90
4725f1N8k5K15k12n1j21L91k67J91k67L8K29k02R5j94L31k09J51Nl1l1j53J53
4748C3k31L77l4k21J13j7J52k7L0k20K09M0Nj18k85L14j43J13j51N1O8R6j86J86
4772A54n7j72P7O4k09J34OK7%p8j31J73n2kJ6P1L5j45J4n4P3J19j85M6N3Q4j28
4799f7J94k12P5O3J33l53j2M47j04rl05N2m7K04j28O0nj51J69J02j58K0J55p1
4823E2l0lJ9K04j59O1k27K05j51j22J16M4J56j31K9J6j19L10m26K31r4n6J39k35
4847a71K96j60M2LN5q3N4k89K37o1P3p0j71L48j14j2j93K15r5j28J98J9J55l52
4871b04J93k8R1jo2L3J25N9k05N8j36N7o5K33R5k08J35k50PQ9J6j65R1n4k7J60
$$ plain form
4897 37 171 128 -82 -22 76 96 -4 -61 -120 2 131 58 220 97 -96 -156 63 222 61 -38 -264 164 93 211
4921 211 41 52 150 82 -204 147 180 24 144 -136 -86 -39 -109 74 46 144 -91 0 -228 -47 -74 34 -33 -73
4945 -73 107 69 207 162 -154 72 54 116 42 -103 -64 39 -69 223 -128 -181 82 -36 -111 143 -132 -21 -13 23
4969 23 81 59 -209 15 -104 -222 203 -46 -89 -80 119 -121 -72 -239 138 156 -60 -53 -143 160 35 -43 -125 -52 91
4994 91 73 193 -177 191 19 83 28 -15 142 -121 155 145 128 -102 95 23 -51 -65 -87 76 -116 -243 69 -55
5018 -55 21 -92 86 50 123 198 13 -112 3 -87 -6 56 -142 -80 -98 -60 14 58 16 12 -124 -231 -64 115 154 -50
5044 -50 93 216 73 160 89 188 -38 69 -7 -112 -24 128 163 -36 10 -12 244 36 -64 182 -194 214 -41
5067 -41 198 -100 121 -57 -13 136 262 259 -13 -74 4 138 -81 -57 -13 -12 -67 -192 96 -96 -74 -178 21 187
$$ packed form
4897C7J34m3k10O0R8K0j00n7n9J22J29p3J62j23j93o0K19J59j61r9k26M28p1J18
4921B11j70J1R8o8k86L51L3j56J20k80N0M7p0J83k8R8k35R1k28J81k7J08o7m0
4945g3J80l8J38m5l16K26j8O2p4j45L9J03j08K92l51n3K63j18p5K54k75J11QL6
4969B3N8k2k68K24j19j18M25k49m3RJ99k40M9j67L77J8k16Pr0L03j25p8q2P3J43
4994I1j8J20l70L68j72O4n5m3J57k63K76j0j7k30J97p2p4j4k2J63j92j27L12j24
5018e5P6j13J78l6P3P5j85j25J15r0Q1O2j98O2j8L8P4M4m2mj36j07J67J79L9k04
5044e0J43J23j43Q7p1R9k26J07p6j05Q8J52L5j99M6k2K56k08j00K46l76M08k55
5067d1K39k98K21j78M4J49J26lk72o1P8J34k19K4M4Jn5j25K88j92K2j04J99J66
$$ plain form
5091 187 -174 -87 69 0 137 -30 -105 8 31 -172 134 -117 25 -7 -72 -64 -174 -1 -138 -14 -127 -147 -110
5114 -110 -121 -175 101 3 54 -114 -17 160 -12 116 138 -73 -20 -43 134 19 331 126 -173 55 172 90 32
5137 32 -1 14 96 35 93 -35 52 212 -11 -43 -48 -175 -39 3 -59 -81 92 59 94 -109 165 -187 -9 37 113 115
5163 115 -126 -107 47 -30 -31 234 141 -131 -5 -103 137 -9 -70 72 -31 24 -139 -20 -85 84 -86 184 -134
5186 -134 -108 -180 -55 72 -39 26 79 66 -4 -280 -107 89 55 -52 90 136 102 64 -114 78 35 -16 -68 110
5210 110 2 76 169 42 51 -21 85 81 -161 3 45 -55 -22 -5 195 158 -100 -51 -73 208 -87 -207 -153 -165 33
5235 33 -181 -3 -66 -71 -138 68 51 -40 75 -62 -90 34 -51 70 54 107 -137 -50 110 106 51 4 -43 -33 195 -138
5261 -138 247 -151 44 43 90 -72 19 139 39 6 30 -110 -101 49 -91 161 75 -53 159 -85 37 55 145 93
$$ packed form
5091A87l61Q7J56o9J37j67p5J13K3k03L06k51J42l2o5Qj10J73j37J24j13k0L7
5114a10j1n4K76r8N1j68R7J77j72J28K2k11N3k3J77j15L12k05k99K28J17q2n8
5137C2l3J5Q2o1N8j28Q7J60k23l2nj27J36M2o2k2J73l3L5k03K74l52J78M6P6K
5163A15k41J9J54p7jK65r3k72J26r8K40j46o1J42j03N5j63J19o5J69j70K70l18
5186a34K6p2J25J27j11O5N3j3p0k76J73J96l4j07J42M6l4l8j78J92m3n1n2J78
5210A10j08P4R3j27Rp2J06mk42J64M2j00L3J7K00l7k58M9k2K81k95j20N4j2J98
5235C3k14J78o3no7K06j7r1J15j37k8J24q5J21j6N3k44Q7J60mn5m7m7J0K28l33
5261a38L85l98J95jM7j62R1J20j00l3K4j40RJ50j40K52q6j28K12k44J22J8R0n2
$$ plain form
5285 93 -107 187 39 186 -59 355 22 -63 162 -6 20 82 110 12 -119 131 -12 64 144 -36 -175 13 59
5308 59 248 -30 -126 -12 -46 173 -193 18 -13 -49 182 120 -34 79 54 -56 104 -129 110 38 101 33 29 42
5332 42 -22 -48 -4 6 -17 -166 86 -16 12 198 -89 104 -68 -61 -75 -50 118 42 -69 145 84 16 -80 -1 39 46
5358 46 78 -103 60 280 44 62 41 28 -194 122 136 -3 62 174 -21 48 -35 -21 207 82 21 -211 -120 -24
5382 -24 -55 60 -159 23 141 36 59 20 85 113 -3 -126 3 53 54 -15 44 247 60 31 -84 167 -18 -38
5406 -38 3 -53 -36 59 36 -10 163 -65 40 6 78 -49 25 -136 -23 20 197 50 29 178 67 15 34 -35 -73
5431 -73 -18 45 68 90 -68 -22 209 -83 65 96 -108 74 -83 35 88 73 147 166 -22 186 -12 145 -2 29
5455 29 -71 -15 16 -19 -45 -152 -67 17 -79 -3 -25 -54 -38 -87 -158 -28 49 -20 -25 -87 63 -203 -97 0 -89 -299 -41
$$ packed form
5285I3k00K94j48J47k45M14l33q5K25j68K6O2K8r8j31K50j43P6Q0j80j39J88M6
5308E9J89k78r6J14l4K19l66K11l1l6K31o2j54J13k5j10J60k33K39p2O3o8mJ3
5332D2o4k6M4J0k3j49K52j02K8J86k87J93j72Pj4K5J68p6j11K14o1o8r6P9M0P
5358D6L2j81J63K20k36J8k1j3k22L16J4j39O5J12j95O9q3J4K28j25o1k32R1R6
5382b4l1J15k19J82J18j05K3l9O5K8j16j23J29N0Jo9N9K03j87k9j15K51j85k0
5406c8M1n6J7R5k3m6J73k28J05l4P2j27P4j61J13M3J77j47k1J49j11n2J9o9l8
5431g3N5O3K3K2j58M6K31k92J48L1k04J82j57J18N3j5P4J9j88K08j98J57j47L1
5455B9j00N6L1l5k6j07Q5Q4r6P6k2k9J6m9p1J30P7o9no2J50k66J06R7q9k10K58
$$ plain form
5482 -41 1 -43 23 68 -204 143 15 -110 385 169 56 210 -115 181 -122 104 46 -182 -89 212 249 33 -142
5505 -142 150 302 -110 -116 -25 -131 -53 115 50 -20 222 108 -202 211 -256 85 39 56 -229 -41 -4 47 -162
5528 -162 -50 13 -82 -35 -242 73 73 45 -93 -248 -59 -88 144 -109 -61 -156 87 22 -136 72 -33 -133 -25
5551 -25 -140 -33 114 -111 -57 42 -157 -66 -12 -71 -30 -59 -53 -134 -55 176 94 -190 236 50 153 127 -86 85 112
5576 112 52 104 51 -41 -76 202 64 95 -29 -46 -67 53 164 129 110 12 -69 8 89 -2 -200 -34 -7 122 -18
5601 -18 -39 20 -66 -46 -82 41 -159 -83 -125 -122 -144 -10 29 30 180 98 -108 -114 38 29 46 -18 115 -111 -96 -136 -113 114
5629 114 73 113 -63 -169 -78 -111 13 -64 -73 -218 -18 -62 -47 45 -19 -26 -83 59 140 38 34 22 -77 46 205 31
5655 31 79 168 72 9 -151 191 -93 246 39 219 -119 12 147 -24 17 166 125 -57 111 154 -74 -9 44
$$ packed form
5482d1M2m4O6M5k72L47j28j25M95k16j13J54l25K96l03K26n8k28R3L01L7k16j75
5505a42K92J52m12oR1j06P8J68o5p0K42j14l10M13m67L41m6J7k85J88L7N1k09
5528a62J12O3r5M7k07L15%k8j38j55J89k9K32k53M8r5K43o5j58K08j05j00J08
5551b5j15J07J47k25N4R9j99R1N4n9M1k9Oq1P9K31q2k84M26j86J03k6k13J71K7
5576A12o0N2n3r2l5K78j38L1j24j7k1J20J11l5j9r8q1P7Q1r1j98J66K7J29j40
5601a8k1N9q6K0l6J23k00P6m2Lk2J34L9JJ50q2k06oJ52rJ7o4J33k26J5m0K3K27
5629A14m1M0j76j06R1l3J24p7rj45K00m4J5R2o4pn7J42Q1j02mj2r9J23J59j74
5655C1M8Q9r6o3j60L42k84L39k07J80l38J31J35j71M1J49m1j82J68M3k28O5N3
$$ plain form
5678 44 -127 -68 27 134 50 22 -102 -61 16 -83 58 -31 -166 -41 78 77 43 192 77 -63 -166 -190 -329 -106
5702 -106 -53 -5 -195 69 53 -83 -91 -226 -143 -18 -116 -90 41 -16 69 20 13 -116 -6 -5 16 -196 -24 135 57 34
5728 34 197 -34 111 -25 -12 -113 25 -82 113 105 59 -33 -134 149 -1 -9 35 155 13 -16 38 -192 -77 23
5752 23 109 57 -120 -53 125 -133 -43 -180 -166 0 -207 -68 23 -282 13 -32 -52 -5 77 3 43 -5 -96 -100 -33 140
5778 140 -24 112 19 105 16 225 -33 -207 72 119 -31 113 43 -38 -38 -86 -35 -214 -75 -43 -121 -163 8 -45 147
5803 147 47 -88 92 30 -190 46 -73 156 -122 -48 106 -228 181 114 -40 68 29 -113 -100 78 -1 -16
5825 -16 -40 -162 -23 -87 -121 -31 -218 -173 -86 -101 150 -188 -104 -71 -215 -161 7 -192 32 128 0 -125 -50 -5 20
5850 20 -76 -264 -224 -11 -48 -51 -92 7 131 66 60 56 -102 109 -249 42 -136 58 -115 80 -19 -136 -85 -61 -54 -143
$$ packed form
5678D4j71N9R5J07q4k8j24M1P7r9J41q9j35J25J19jl4J49j15j40j03k4j39K23
5702a06N3M8j90K64j6j36qj35Q3J25r8K6J31n7Q5m9pj29J10JK1k12J72J59p8k3
5728C4J63k31J45j36J3j01J38j07J95qm6r2j01K83j50qM4J20j42k9N4k30J15J00
5752B3Q6n2j77O7J78k58R0j37J4J66k07J39R1l05K95m5k0M7Q2p4M0m8r1mO7J73
5778A40j64J36r3Q6q9K09k58j74K79M7j50J44p0q1%m8N1j79J39L2p8m2J71n3J92
5803A47j00j35J80o2k20K36j19K29k78P4J54l34M09o7j54J08l9j42J3J78p9j5
5825a6k4j22J39o4l4R0j87M5Q7j5K51l38Q4L3j44N4J68j99K24R6j28j25P5M5K5
5850B0r6j88M0K13l7lm1R9J24o5omj58K11l58K91j78J94j73J95r9j17N1K4Pq9
$$ plain form
5876 -143 71 -150 3 -98 17 -19 -100 155 56 108 202 78 239 -126 -70 -54 117 144 -186 -109 -28 -30 -175 69
5900 69 61 117 -86 -81 93 -95 56 42 -66 -114 171 -93 39 -45 -126 -56 -46 -182 -115 -52 -154 0 -146 -88 35
5925 35 23 -197 37 177 -190 189 -34 41 189 -143 -96 -85 122 -238 -68 -108 23 369 -90 161 63 17 -8
5948 -8 6 176 -58 18 236 -78 67 125 27 120 -8 -19 -75 -174 255 -21 -61 30 -69 48 -61 151 100 142 7
5973 7 139 -242 -25 -5 -47 -28 -47 -142 -117 73 49 29 -117 -83 110 -100 65 17 16 -102 79 -99 119 -208 -83
5998 -83 -184 -188 -30 113 -85 -12 -189 -172 -67 118 -43 -133 -63 159 -63 26 -117 -87 13 -175 211 40 -28
6021 -28 -70 256 27 54 45 -88 10 112 -128 69 127 61 -12 95 -113 -22 -27 103 55 73 69 35 258 98 -48 -124
6047 -124 150 -74 9 15 -145 91 -135 135 106 37 9 180 -86 14 -47 -139 1 -203 -203 226 60 -108 -91 -151
$$ packed form
5876a43K14k21J53j01J15l6q1K55r9N2R4j24J61l65N6J6J71K7l30P7Q1kj45K44
5900F9qN6k03NJ74j88J51j4j08m8K85k64J32q4q1P0J0j36O7O3j02J54j46N8J23
5925C5j2k20K34J40l67L79k23P5J48l32M7J1K07l60J70m0J31L46m59K51r8m6k5
5948hJ4J70k34P6K18l14J45N8r8R3j28j1n6r9M29k76m0R1r9J17j09K12n1M2j35
5973GJ32l81K17K0m2J9j9r5K5J90k4k0j46L4J93k10J65m8jj18J81j78K18l27J25
5998h3j01mJ58J43j98P3j77J7J05J85j61r0P0K22k22Q9j43L0J00j88L86j71o8
6021b8m2L26k29K7rj33R8J02k40J97N8o6p3J07k08R1nJ30m8J8ml4K23j60j46p6
6047a24K74k24Q3Oj60K36k26K70k9o9k8J71k66J00o1r2J40k04%M29j66j68J7o0
$$ plain form
6071 -151 -68 193 4 -90 37 -248 -174 -75 37 -257 -253 0 -53 6 -375 312 -125 -41 -31 108 -55 54 -102
6094 -102 -47 110 65 -67 -95 57 -200 -54 281 43 124 -22 217 90 54 178 -11 -125 155 -52 -53 167
6116 167 -96 -129 -26 -146 -60 61 58 -55 7 -83 -84 -83 144 -93 -20 -228 -77 40 -101 58 -11 -161 11 -58
6140 -58 -29 150 -6 28 171 183 -51 -34 -60 35 -102 -108 59 86 203 14 36 19 92 -52 -146 105 64 -22 -114 -18
6166 -18 -20 -8 19 110 6 -44 2 45 52 -41 109 106 197 -2 121 106 -54 198 84 125 165 -134 164 296 280 -129
6192 -129 232 88 65 -80 -99 49 114 85 120 36 -181 94 159 -9 -49 -120 43 -87 150 -71 296 -103 -192
6215 -192 105 -53 9 79 -51 -84 84 -19 45 108 -97 -51 -41 68 -67 -100 -77 29 6 -104 79 -76 80
6238 80 0 14 -86 79 80 12 -215 -64 118 -206 -88 -59 36 -15 56 8 -49 124 -9 -29 0 46 52 149 33 -53
$$ packed form
6071a51Q3K61j89r4J27k85P4R9J12k94MK53n3N9l81O87m37Q4J0J39j63J09j56
6094a02N5J57m5j32k8J52k57J46L35k38Q1j46K39j27l6J24j89j14K80k07jK20
6116A67k63l3J03j20Q6J21lj13O2r0jJK27k37P3k08J51J17j41J59o9j50J72o9
6140e8K9J79j56L4J43J2k34J7k6R5j37oJ67K7J17j89K2j7P3j44r4K51m1q6r2R6
6166a8kJ2K7R1j04n0M6M3Pr3J50lR1j99J23j5j60K52j14M1M0k99K98J32j6m09
6192a29L61j44k3j45j9J48O5k9L5q4k17K75O5j68m0p1J63j30K37k21L67l99q9
6215a92K97j58O2P0j30l3J68j03O4O3k05M6J0J09j35l3K3J06k3j10J83j55J56
6238H0q0J4j00J65Jo8k27J51J82l24J18K9R5n1P1m8n7J73j33k0K9M6OR7j16q6
$$ plain form
6264 -53 98 73 37 -176 107 48 -63 11 -73 -1 100 187 338 50 -19 -22 106 -209 -108 -164 77 -59 137 -114
6288 -114 -84 -62 -356 28 -208 41 -26 -60 -22 143 19 66 -93 2 198 112 81 -113 181 40 117 -45 -5 28
6312 28 -64 -142 -364 -40 -4 5 -75 -99 -116 15 48 -195 60 17 29 63 48 49 -92 131 -56 -39 3 22 7 85 180
6339 180 -32 -144 81 126 -122 144 106 -118 -46 -174 -25 -162 -5 61 -153 -35 77 77 28 -207 -118 -121 125
6362 125 167 -50 -134 -40 -315 125 -60 -96 -174 -32 79 3 21 -165 123 86 -96 22 -57 23 -29 -16 270 92
6386 92 -69 -15 149 -139 143 26 110 -125 56 2 38 2 27 -143 -69 -1 -104 64 -98 -56 -54 -30 104 57 -64
6411 -64 117 209 -108 -146 59 0 31 -59 -59 15 -57 18 -65 154 145 48 50 2 -11 143 -5 -20 94 48 78 -96 -19 -127
6439 -127 -157 -26 -25 20 70 35 -15 -9 -32 -289 101 -163 54 -90 5 68 -30 -191 -25 -55 84 -84 -133 -51 6 141
$$ packed form
6264e3J51k5l6k13K83n9j11P4q4P2J01Q7J51k88o9lJ28l15J01n6K41j36J96k51
6288a14L0K2k94L84k36K49o7l4L8J65j24M7j59R5J96q6l1j94K94j41P7j62M0L3
6312B8r2p8k22L24L6Rq0k4j7J31L3k43K55m3J2L4j5Jj41K23j87J7M2J9j5P8R5
6339A80k12j12K25M5k48K66l8k24P2j28J49j37J57O6k14J18J12%m9k35Q9lK46
6362A25M2k17q4R4k75M40j85l6p8J42J11p6J8j86K88l7j82J18p9Q0n2J3K86j78
6386I2j61N4J64k88K82j17Q4k35J81n4L6l6K5j70P4O8j03J68j62M2KK4J34m7j21
6411f4J81R2l17l8K05n9L1r0%P4p2P5q3K19rr7Km8j3J54j48j5J14m6L0j74P7j08
6439a27l0J31JM5N0l5n0Ok3k57L90k64K17j44R5O3r8j61J66l0J39j68m9Q2N7J35
$$ plain form
6465 141 -59 223 23 1 18 207 -149 113 55 -52 67 130 -119 -12 173 -76 118 127 -87 67 173 -70
6487 -70 -26 -248 -148 -156 -27 -28 -264 -82 -208 -182 -51 -109 -176 72 -24 -10 72 -46 -33 -216 -113 15 109 -123 88
6512 88 94 63 -14 -157 -62 -174 -18 -97 -42 -127 -36 -38 -50 47 99 -172 11 -29 -229 92 -9 5 17 -81 -81 103 -113
6539 -113 140 -130 226 29 106 231 58 69 -61 -61 26 66 -46 86 -26 70 104 90 -14 189 148 -86 -195
6562 -195 -89 -54 -69 -72 -58 31 -74 40 -16 -154 68 14 -208 114 -209 -30 121 35 14 -5 -33 -120 -34 98 299
6587 299 120 85 -10 244 -84 -178 305 -145 -135 -43 -75 -51 -16 4 -244 38 -145 205 -137 68 -152 24 272
6610 272 -108 -8 50 158 83 -6 96 3 -127 53 129 30 -30 24 76 -35 -73 -95 -169 144 -2 272 -29 21
6634 21 27 -80 212 -43 15 15 -75 -148 189 142 89 109 -260 -35 -245 147 7 -33 18 0 97 107 -12 130 -96
$$ packed form
6465A41k00K82k00k2J7J89l56K62n8j07J19O3k49J07J85k49J94Rk14J54J06k43
6487g0M4k22J00qJ29jk36J82j26K6J31n8o7K48r6J4Q2j18J3j83J03J28R4k32K11
6512H8Ol1p7j43R5j12J56p9N5q5R1kj2R7N2k71J83m0k00L21j01J4J2r8%J84k16
6539a13K53k70L56j97P7J25j73J1j30%Q7M0j12J32j12R6L4j4j04K03m1k34j09
6562a95J06L5j5lJ4Q9j05J14n6j38K22n4k22L22l23J79J51q6k1j9k8q7Q6J32K01
6587B99j79l5r5K54l28r4M83m50J0R2l2K4L5K0k48K82j83L50l42K05k20J76K48
6610B72l80J00N8J08p5q9J02r3j30J80P6r9o0N4N2j11l8k2p4L13j46K74l01N0
6634B1Oj07K92k55N8%r0p3L37m7n3K0l69K25k10L92j40m0N1j8R7J0j19J42k26
$$ plain form
6659 -96 -26 163 -117 134 -43 138 57 -83 -39 -58 -70 178 67 25 161 -73 136 -18 126 -81 -181 114
6681 114 -70 79 -98 -177 -90 32 -26 23 -347 55 -36 95 132 84 -151 93 177 172 252 212 215 -54 51 26 192
6706 192 9 194 52 144 68 7 50 13 157 3 -64 37 185 56 -37 104 -78 -77 82 -13 -150 -102 -41 -122
6730 -122 -52 -250 -7 115 -98 -50 -74 -350 -70 -106 122 -50 -74 97 -26 -1 346 12 105 -63 -3 -50 -91
6753 -91 24 -303 120 -26 -44 -235 -11 -39 71 31 -51 -44 20 -264 -106 -8 94 62 67 42 88 -144 -210 66 0
6778 0 112 -48 78 -68 227 110 229 136 67 -39 70 185 -38 76 -107 -40 24 -36 132 -53 49 -62
6800 -62 53 86 -31 23 -163 9 -68 96 87 15 16 -10 -255 -216 117 -155 -26 -67 -59 -105 38 -153 11 -141 30
6825 30 -103 -42 91 75 87 -23 123 -96 72 49 30 52 72 -86 -76 89 0 32 45 72 -21 96 41 -148 69
$$ packed form
6659i6P0J89k80K51j77J81q1j40M4j9j2K48j11m2J36k34K09j54J44k07j00K95
6681A14j84J49j77p9Q7J22n8M9l70M02r1J31L7m8k35K44Q4nQ0m0Lk69J05k5J66
6706A92j83J85j42R2p6o1M3l7J44j54o7J01J48j29r3J41j82JJ59r5j37M8O1q1
6730a22P0j98K43J22k13M8k4k76K80l6K28j72k4J71j23K5L47l34R3j68O0m7m1
6753i1J15l27M23j46j8j91K24k8J10m0q2PO4k84J58R8J02l2Nk5M6k32o6K76o6
6778@J12j60J26j46K95j17J19r3o9j06J09J15k23J14j83O7O4o0J68j85J02j11
6800f2J15L3j17N4j86J72p7J64rp2Jk6k45L9L33k72J29m1Qm6J43j91J64j52J71
6825C0j33O1J33j6J2j10J46k19J68k3j9K2K0j58J0J65q9L2J3K7r3J17n5j89K17
$$ plain form
6850 69 140 22 -94 -26 -180 -72 72 98 -82 108 127 136 173 -49 -118 55 135 -24 101 -33 144 55 214 -20
6874 -20 -55 -116 -94 -72 -57 14 120 -98 120 -7 52 28 -33 -332 -16 -18 145 -20 59 117 -64 -77 -76 -172 107 -70
6900 -70 -54 -7 67 -45 49 -86 48 176 236 28 -49 6 72 33 -41 150 -74 -44 -178 40 16 146 -92 14
6924 14 57 -162 121 -54 -115 82 92 134 52 -32 -73 106 78 -65 94 -65 -88 -84 -1 30 77 93 54 124 -55 -91
6950 -91 28 -37 31 -129 125 126 95 -36 -66 29 -68 -15 34 74 -37 141 15 20 6 20 -103 -214 -75 103 -6
6975 -6 -159 -30 -28 120 197 -106 -182 -169 2 -139 -99 -1 -1 -87 166 -15 -28 -83 -15 20 -36 74 -129 111 -56 -103
7001 -103 -101 145 20 -45 197 83 -56 38 -104 -125 12 76 7 -40 -121 -77 70 -231 75 20 -96 25 69 -110
7025 -110 50 -10 -146 -138 6 22 62 -35 8 159 -20 -144 83 71 -16 12 -84 -60 42 -16 43 22 -149 76 6
$$ packed form
6850F9P1j18j16O8j54J08J44K6j80J90J9RL7k22o9J73Q0j59J25j34J77q9J59k34
6874b0l5o1K2K2J5P1J06k18K18j27N9k4o1k99L16kJ63j65P9N8j81j3Jr6K79j77
6900g0J6M7P4j12R4j35J34J28O0k08p7N5O6l9p4J91k24L0j34K18k4J30k38J06
6924A4M3k19K83j75o1J97J0M2q2q4m1J79k8j43J59j59k3MQ3L1M7J6l9P0j79l6
6950i1J19o5O8j60K54Jl1j31l0R5r7N3M9M0j11J78j26Nj4J4j23j11J39J78j09
6975fj53J29KJ48P7l03p6J3J71j41M0R8%q6K53j81j3n5O8L5n6J10k03K40j67m7
7001a03KK46j25o5K42j14j39R4j42k1J37O4o9m7q1M4J47l01L06n5j16J21M4j79
7025a10J60o0j36QJ44J6M0r7M3J51j79j24K27j2q7K8r6K4J02n8N9k1j71K25p0
$$ plain form
7050 6 -91 125 43 -92 78 -144 -194 74 -133 -123 -126 35 34 -11 -26 -224 -142 118 -61 2 96 191 27 -43 3 33
7076 33 40 139 46 -39 -16 58 35 -88 -180 -223 -172 -1 127 46 -6 -93 -161 119 -148 24 51 -49 151 -104 19 -62
7102 -62 -82 -31 25 13 98 198 65 58 -143 58 37 79 85 35 -63 -54 84 -73 197 -136 48 61 46 -7 -141 63
7128 63 -15 7 -66 -176 52 253 47 109 -98 -103 114 22 -129 143 224 -97 216 27 21 36 89 62 -28 -74 -65 85
7154 85 26 128 121 -28 -168 73 -25 37 77 308 -22 -256 -26 26 -75 81 -64 -5 -67 -128 138 -205 -127 123
7178 123 -196 63 64 49 59 80 -55 -86 -10 -40 -57 199 135 -101 115 23 18 -91 25 112 -114 -15 -37 -78 102 9
7204 9 3 333 -85 53 -38 -34 -102 17 55 -5 -121 125 -78 244 -151 -114 -184 265 -50 -83 155 2 -169 -175 96
7229 96 46 34 -4 -133 32 127 -95 -54 -25 -45 155 277 52 138 -25 32 -104 -129 -170 262 118 121 -119 35 20
$$ packed form
7050Fr7K16q2j35J70k22n0K68k07J0lJ61jm5j5j98Q2K60j79O3R4R5j64p0M6L0
7076C3PR9r3q5K3P4k3j23r2m3N1J71J28q1n2q7o8K80k67J72K7j00K00k55J23q1
7102f2k0N1N6j2Q5J00j33pk01K01k1M2On0r8RJ38j57K70l33J84J3j5n3j34K04
7128F3p8K2p3j10K28K01k06O2k07nK17r2j51K72Q1l21L13j89oJ5N3k7r0m6RJ50
7154H5n9J02pj49j40K41r8O2M0K31l30k34K30N2j01J56j45N9o2o1K66l43P8K50
7178A23l19K59Jj5J0K1j35l1P6l0j7K56o4k36K16r2nj09J16Q7k26R9k2m1J80r3
7204IoL30m18J38r1Mo8J19L8o0j16K46k03L22l95L7p0M49l15l3K38j53j71oK71
7229I6n0j2l8j29J65R5k22M1K9k0K00J22k25Q6j63N7j36k5m1M32j44Lk40J54j5
$$ plain form
7254 20 117 67 -111 -55 87 -64 94 63 11 -138 -93 -82 168 57 170 106 -36 -88 46 146 -21 105 144 54
7278 54 126 90 123 44 -85 29 -198 -29 102 159 -14 64 -180 64 23 112 -108 72 141 49 16 -41 14 14 63 37
7304 37 54 -47 51 -125 -45 3 11 -142 67 -18 -7 38 -23 -112 -55 -9 31 100 -37 87 119 50 -213 135 -70 55
7330 55 -4 60 128 112 -136 83 -187 -52 -89 -33 -65 -110 9 -36 22 143 171 -42 118 1 26 -16 64 -58 -36
7355 -36 -14 19 -23 16 29 66 -16 116 -60 129 -68 162 -8 213 -13 137 182 67 -65 87 -63 -193 -21
7378 -21 -23 88 62 94 -17 -76 60 175 -111 45 -132 136 -90 46 6 36 -114 208 34 78 105 127 342 137
7402 137 164 -280 -95 96 -92 -167 -26 92 -103 -70 -33 55 48 37 -158 -140 -95 3 30 -62 -71 21 36 -91 -95 -143 -108
7429 -108 22 53 19 -7 210 181 65 -55 -29 68 11 175 71 -213 193 72 49 -39 -14 -67 171 -217 205 -179
$$ packed form
7254B0R7n0j78N6J42j51J58l1n2j49M5J1K50j11J13o4j42n2J34J00j67J26L9r0
7278E4P2l6L3p9j29J14k27J69J31N7j73P8k44K44m1Q9k20J80O9r2l3n7N5%M9k6
7304C7J7j01R8j76Q0M8Qj53K09q5J1M5o1q9N7M6M0O9j37J24L2o9k63L48k05J25
7330E5n9O4O8j6k48K19k70J35l7N6l2m5J19m5N8J21K8k13J60j17K5m2Q0j22K2
7355c6K2L3m2L9J3L7q2J32j76J89j97K30j70K21k26J50M5j15j32J52j50j30J72
7378b1kJ11k6L2j11n9J36J15k86J56j77K68k26J36m0L0j50L22j74M4K7K2K15k05
7402A37K7m44J85J91j88p5J41J18j95L3L7Q8pj1j95J8M5R8K7r2rR2J5j27mm8L5
7429a08J30L1l4k6K17k9j16j20K6R7n7J64j04k84M06j21k3q8K5n3K38l88M22l84
$$ plain form
7453 -179 119 -116 43 -29 -163 86 -133 -28 189 88 14 125 -46 -248 30 7 162 -12 -141 25 -132
7474 -132 115 5 -39 91 -35 -94 166 33 -85 -133 -132 133 76 -10 175 37 118 147 46 18 201 -2 165
7497 165 14 -32 44 160 177 -84 81 75 -51 188 -49 138 47 144 57 82 29 -42 -11 107 -72 -53 -7 141 125
7522 125 101 -106 13 128 126 -4 52 -144 -31 -22 -14 -100 106 68 12 -1 249 44 -105 -87 168 -44 -112 135 128
7547 128 63 44 -148 -90 -5 51 -32 -14 -42 44 100 -14 28 180 -3 152 -149 4 -1 -66 3 130 -46 85 -22
7572 -22 -97 -97 -106 -31 67 188 -44 -6 -185 141 -42 -51 131 -109 27 29 -28 -14 -66 65 152 -13 116 30 172 92
7598 92 50 -47 14 -100 -14 62 -141 -25 87 169 -115 59 72 50 28 -92 13 -39 52 -114 3 27 -127 60
7622 60 -105 -87 -114 -160 -92 186 173 -107 -136 34 -100 -53 58 63 59 -194 -54 -10 -80 -86 -15 -74 107 128 104 -93 -12
$$ packed form
7453a79K98k35J59p2j34K49k19J05K17j01p4J11j71k02K78k3J55j74j29J66j57
7474a32K47j10m4J30j26n9K60j33j18m8JK65n7q6J85j38Q1K9j01k8J83k03J67
7497A65j51m6P6J16J7k61J65oj26K39k37J87r1R7q7K5n3p1L1J18j79J9M6J48j6
7522A25k4k07J19J15kj30N6j96J13RQq6K06l8n6j3K50k05j49J8K55k12o8K47p
7547A28o5j9j92N8Q5N6q3J8k8Q6N6j14M2J52j83J55l01J53no5O9J27j76J31j07
7572b2p5%rP5R8J21k32L8j79L26j83rJ82k40J36Kn7J4n2J31Q7j65J29q6J42q0
7598I2m2r7O1j14Q6P6k03J16J12Q2k84J74J3k2k2j20J05n2R1j66J17K4j54J87
7622F0j65J8k7m6O8K78j3k80k9J70j34M7J11Nmk53J40M4p0oP1n9J81K1k4j97Q1
$$ plain form
7649 -12 -55 -10 152 9 -48 132 17 -139 0 -116 72 -25 37 -99 10 -45 113 16 41 65 -119 -71 -74 85
7673 85 114 -324 -46 142 -48 61 4 145 -14 41 225 18 81 64 18 -59 73 16 -141 27 57 126 -89 7
7697 7 -53 66 208 228 106 112 -30 -72 60 -96 -151 -111 -46 -17 -102 -107 -102 -62 116 -38 -18 -41 -129 -113 -58 69 11 129
7725 129 146 -61 -37 4 51 -9 85 -58 -16 -185 38 74 28 38 68 2 -262 -4 -60 -46 125 22 -3 -140 46
7750 46 20 50 260 -10 51 185 -135 68 -114 76 203 76 -139 114 -93 228 4 31 78 -154 15 149
7772 149 55 126 -13 -34 -25 77 128 -73 -51 -188 84 -13 -131 126 -53 150 26 171 -63 -99 86 150 197 124
7796 124 91 59 90 226 -126 15 -82 116 -104 -12 -22 101 -44 -16 -51 133 -124 59 177 182 131 179 86 78 -156
7821 -156 124 157 2 3 57 21 -20 -137 -165 374 122 -178 61 -62 -10 -230 266 -113 25 30 -50 -186 143 6
$$ packed form
7649a2m3M5J62j43n7J80j15j56J39j16J88r7O2j36J09n5J58r7K5K4j84M8lJ59
7673H5K9m38K78J88j90J09n7J41j59N5J84k07O3j7m6p7J32n7j57J68L0O9k15R6
7697Go0J19J42K0j22Oj42m2J32j56n5M0O5K9q5nNM0J78j54K0k3q8J6N5J27n8J18
7725A29J7k07K4M1M7o0R4j43M2j69K23L6m6J0L0o6k64K58n6J4J71j03k5j37J86
7750D6k6L0K10k70O1J34l20K03j82J90J27j27k15K53k07L21k24K7M7k32J69J34
7772A49r4P1j39k1RJ02N1k01K2j37K72r7j18K57j79K03j24J45k34l6J85O4M7p3
7796A24l3l2L1J36l52J41r7J98k20R2j0J23j45K8l5J84k57J83J18Nn1M8r3qk34
7821a56K80L3j55JN4l6m1j17k8N39k52l00K39j23N2k20M96l79J38Nq0j36L29j37
$$ plain form
7845 6 -227 31 52 73 106 134 -84 84 6 141 -95 143 73 49 -242 -88 40 -32 -41 -148 -18 -70 106 -3
7869 -3 155 -16 -67 -57 -115 96 17 87 -32 -30 -20 -68 -4 184 64 10 -165 -54 57 86 219 25 96 -143 73
7894 73 7 8 157 -52 -20 5 -37 71 -8 -100 -30 -35 94 -113 186 80 -130 21 -59 46 -103 47 -58 42
7918 42 -12 -100 10 -53 79 143 108 -4 -14 31 132 -80 -181 -19 -114 59 -22 181 -89 -66 210 0 9 12 92
7943 92 -39 144 -33 128 63 -73 -7 -20 29 25 -23 -32 -46 -20 88 74 81 62 -153 -137 188 60 -38 8 31 83 1
7970 1 24 -48 31 -195 -258 -58 -39 -220 -69 61 167 112 -123 38 106 8 180 -24 -26 24 47 163 154 22 -145
7995 -145 79 -114 -62 22 -7 -157 32 0 175 48 -89 612 -179 -31 73 -27 177 -109 -45 47 -9 99
8017 99 -9 -16 -94 -127 109 -90 -88 -11 125 -71 38 135 -70 60 64 15 156 -79 -139 38 86 31 -165 -187 140
$$ packed form
7845Fk33K58K1K1L3K8k18J68p8J35k36K38p0k4k91J54J28p2rj07J30n2J76j09
7869cJ58j71n1J0n8K11p9P0j19KJ0m8O4J88j20n4j75J11J11K9J33j94P1k39K16
7894G3o6JJ49k09L2K5m2J08p9r2P0nJ29k07K99j06k10J51q0J05j49J50j05J00
7918D2n4q8J10o3J32O4l5j12j0M5J01k12j01J62r5J73q1K03k70K3K76k10RLQ0
7943I2j31J83j77J61o5j36O6j3M9mm8rj4K6J08j4Pj9k15J6L25j28r8M6K3N2q2
7970AK3p2P9k26o3K00J9j81J51J30J06n5k35J61O8r8J72k04kN0K3J16rj32j67
7995a45K24j93N2Q4k9j50J89l2J75j27j37P01p91J48J04j00K04k86O4R2n6J08
8017I9j08pp8l3K36j99KP7J36j96J09R7k05J30Mm9J41k35o0J77M8n5j96k2L27
$$ plain form
8042 140 140 -89 -136 15 145 42 74 -11 -72 200 69 104 103 -35 177 -44 22 -125 -84 50 -201 -165 47 -93
8066 -93 -4 30 -152 -20 19 19 -54 -107 -21 -31 34 124 9 -3 -38 2 171 65 -156 -185 -74 -58 -110 -109 -40 -50 149
8093 149 -53 -38 -40 54 118 47 192 161 152 -37 41 -50 -33 26 -19 137 153 -162 -22 103 127 65 -78 26 202 -24
8119 -24 230 118 91 120 142 -67 159 93 -203 148 31 83 113 -11 -41 199 282 -64 -20 125 143 14 -27 -64
8143 -64 82 -40 57 -3 3 186 98 61 -193 -49 165 -91 116 -42 6 -47 52 -38 -67 31 146 62 -138 104 39
8168 39 -21 -85 -98 -78 206 12 150 -36 0 158 -109 39 86 58 -50 -77 -15 -62 -118 -125 -57 41 -33
$$ packed form
8042A40%k29m7J51J30j03L2q5o1K72j31L5jj38K12k21O6j47M1J34k51L6K12j40
8066i3Q9L4j82J32L9%p3n3Q6j0O5R0j15j2l5M0J69j06k21k9J11J6n2JO9j0J99
8093A49k02J5kR4O4p1J45l1rj89P8r1J7N9m5J56J6l15J40J25K4o2j43J04J76k26
8119b4K54j12k7K9K2k09K26o6k96L51j17N2L0j24l0K40Q3l46M4J45J8j29m1l7
8143f4J46j22R7o0OJ83q8l7k54J44K14k56K07j58M8n3R9r0k9R8J15q4k00K42o5
8168C9o0o4j3K0K84j94J38j86L6J58k67J48M7k8j08k7O2m7n6pO8R8p4
8191c3
$$ Imaginary data points
##PAGE= N=2
##DATA TABLE= (X++(I..I)), XYDATA
$$ plain form
0 0 0 0 0 0 0 0 0 0 0 0 0 0 0 0 0 0 0 0 0 0 0 0 0 0 0 0 0 0 64 -108 108 -108 108 -108 108 -108 109 -183 216 -216 216
41 216 -230 306 -324 325 -378 432 -450 522 -554 625 -673 753 -827 903 -1007 1117 -1250 1404
59 1404 -1585 1796 -2059 2397 -2833 3439 -4310 5733 -8309 14726 -61453 -84314 2952 -65972
73 -65972 -26928 -22813 -25580 -23442 -14863 -37187 -11934 -30631 -23065 -10515 -32587 1216 -18519
86 -18519 4775 -1030 -2275 24822 4649 11103 19468 20411 -365 26804 4275 11656 12802 3509
100 3509 22004 -3461 19022 11052 9643 6643 13600 8690 685 10474 -1921 10330 -11502 10081
114 10081 -3860 -6721 5174 -8120 1365 -11968 3444 -10270 -6131 -8026 -2027 -8171 -10055
127 -10055 5478 -13062 4891 -9888 5160 -3683 -7214 5030 -10611 -980 -8267 688 -9613
$$ packed form
0@%%%%%%%%%%%%%%%%%%%%%%%%%%%%O4j72K16k16K16k16K16k16K17k92L99m32M32
41B16m46N36o30O49p03Q10q82R72j076J179j298J426j580J730j910K124k367K654
59A404k989L381l855M456n230O272p749J0043j4042K3035p6179k2861Q7266o8924
73f5972L9044M115k767K138Q579k2324K5253j8697P566J2550k2072L3803j9735
86a8519K3294n805j245K7097k0173O454Q365R43k0776K7169k2529P381J146r293
100C509J8495k5465K2483p970j409l000O957m910q005R789j2395J2251k1832K1583
114A0081j3941k861J1895j3294R485j3333J5412j3714M139j895N999o144j884
127a0055J5533j8540J7953j4779J5048q843l531J2244j5641R631p287Q955j0301
$$ plain form
140 -9613 630 -2786 2112 -1407 -1501 13956 -10083 12766 -429 3370 2728 -3464 5303 -6381
154 -6381 -653 -4144 1185 -10286 7446 -4206 251 7201 -4921 13748 -7625 7275 2373
167 2373 -3224 -353 122 -3014 -4712 3761 -8716 8626 -7275 7387 4167 -2665 12532 -1912
181 -1912 6929 620 5683 -1627 4375 -2426 2475 3233 -5670 12663 -6179 8853 2386 3308 5862
196 5862 1650 6753 438 6757 -1695 9696 -3417 6839 3116 -1305 8030 -4845 8016 -3895
210 -3895 3314 -587 1472 -735 -318 2925 -6037 6365 -6776 3826 -4530 -593 -1191 -7101 758
225 758 -9154 -304 -9535 -359 -7866 -2348 -3133 -6640 1323 -8888 2198 -7951 -361 -6824 -2994
240 -2994 -4216 -7900 549 -9230 2185 -7448 2152 -2886 -452 1560 -2701 4066 -3487 5955 -4912
$$ packed form
140i613J0243l416M898l519r4J5457k4039K2849j3195L799o42o192Q767j1684
154f381N728l491N329j1471J7732j1652M457O950j2122J8669k1373J4900m902
167B373n597K871M75l136j698Q473j2477J7342j5901J4662l220o832J5197j4444
181a912Q841o309N063p310O002o801M901P58q903J8333j8842J5032o467R22K554
196E862m212N103o315O319q452J1391j3113J0256l723m421R335j2875J2861j1911
210c895P209l901K059k207M17L243q962J2402j3141J0602q356L937n98n910P859
225G58r912Q850r231R176p507N518p85l507P963j0211J1086j0149P590o463L830
240b994j222l684Q449r779J1415r633R600n038K434K012m261O767p553R442j0867
$$ plain form
255 -4912 5524 -1516 1201 3796 -2431 6908 -2010 7062 -320 6696 1961 5144 4843 1081 8762
270 8762 -2369 9040 -1565 5745 2143 1524 4634 33 6600 -1138 7601 -2251 6091 -464 523
285 523 3342 -4465 4878 -5018 2597 -3953 1838 -2611 -713 672 -5008 2938 -7705 2117 -7744
300 -7744 -1411 -4074 -6102 -1771 -6728 -355 -7589 1302 -7610 336 -4214 -4589 -66 -8018 891
315 891 -7837 -85 -6443 -1183 -3116 -2928 121 -4549 3748 -5927 4912 -3188 1707 1761 -572 3745
331 3745 -1237 5654 -1791 6599 -885 5250 2926 1750 6914 -279 8451 4 7774 2103 5830
346 5830 4594 3425 6601 647 8456 -1548 6815 -165 2710 1977 -655 3542 -2435 4210 -3799
361 -3799 3751 -3239 417 -588 -4192 758 -6541 183 -7714 -1367 -6814 -4034 -5113 -6738 -2982
$$ packed form
255d912J0436p040K717K595o227R339q918R072p382P016m735L183l01l762P681
270H762j1131J1409j0605P310l602o19L110m601O567p738Q739r852Q342o555R87
285E23K819p807R343r896P615o550N791m449J898J385n680P946j0643R822r861
300g744O333k663k028M331m957O373p234Q891q912P946m550l75M523p952Q909
315H91q728P752o358N260j933J88L049m670Q297r675J0839q100M895N4k333M317
331C745m982O891p445Q390p484O135k324j176N164p193Q730q447P770n671L727
346E830j236j169L176n954P809j0004Q363o980K875p33k632M197n977O645q009
361c799P550o990L656j005l604M950p299O724p897O347n447K780j079j625L756
$$ plain form
376 -2982 -9754 -365 -9904 -2451 -5714 -4704 -3657 -5662 -1923 -6955 -562 -8227 -125 -6620 -2516
391 -2516 -1774 -5400 2003 -4944 3715 -1875 2615 1223 3138 1740 2292 5827 -1841 7996 -1494 5879
407 5879 1902 2800 5980 791 6847 1848 6473 1680 7819 1634 5512 4368 847 7250 -2885
422 -2885 6443 -1125 1305 977 22 614 -1026 2109 -3060 3571 -4304 4002 -2476 -1202 2370 -5077
438 -5077 1539 -5231 -227 -4879 -2565 -4425 -2356 -3989 -4434 1348 -7164 2609 -4390 -203 -2145
453 -2145 -2890 268 -5803 -436 -4663 -842 -5477 244 -3263 -1572 153 -3007 3887 -4717 4415
468 4415 -884 1469 1340 927 3372 -1486 4309 -284 3026 -1576 4883 94 1482 5361 -462 6981
484 6981 -150 7392 2756 3205 5224 3227 3741 1847 5358 -605 5524 -1554 5072 1260 -251 7127
$$ packed form
376b982o772R389r539P453l263J010J047k005L739n032O393p665Q102o495M104
391b516P42l626P403o947Q659n590M490j392J915j398N52L535p668R837r490P373
407E879l977Q98L180n189O056m999M625m793O139o185L878j144l521O403j0135
422b885R328p568K430l28r55N92j640L135n169O631p875Q306o478J274L572p447
438e077O616o770N004m652K314j860K069j633m45N782q512R773o999M187j942
453b145p45L158o071N367m227L821m635N721l507J691J725l160O894q604R132
468D415n299K353j29m13K445m858N795m593L310m602O459m789J388L879n823P443
484F981p131P542m636M49K019j997N14j894L511n963O129p078O626l812j511P378
$$ plain form
500 7127 -2061 5004 1577 3766 1173 2713 791 1661 281 -1891 3871 -6653 3203 -2910 -2052
515 -2052 255 -3738 1414 -3909 -603 -1396 312 -5461 1556 -3478 -4036 752 -7335 1036 -7015 -996
531 -996 -2650 -4919 -1249 -1864 -2422 -2515 1777 -4162 3275 -4213 1490 643 -4670 3984 -4006 688 -1011
548 -1011 1037 -599 1358 1145 1978 2591 -697 6990 -2577 5385 2229 1224 3900 262 4914 128
564 128 2994 1083 4307 -472 3683 2661 473 4552 -1137 6073 -1320 3041 2087 22 2002 -222
580 -222 1745 -2272 1964 -2767 1298 -3138 52 -243 -4460 2426 -4186 1065 -3373 -749 -2052 -3536
596 -3536 -2205 -3496 -2893 -6144 -402 -6953 -1202 -4358 -3808 -1129 -5846 423 -4833 -1460 -2900 -1155
612 -1155 -3068 -1734 -1552 -2809 297 -4829 2909 -4047 450 815 -1507 1921 -657 2793 -436 3062
$$ packed form
500G127r188P065l427K189k593J540j922Q70j380k172N762j0524R856o113Q58
515b052K307l993N152n323L306p93J708n773P017n034n58M788q087Q371q051O019
531i96j654k269L670o15n58r3M292n939P437p488N703q47n313Q654p990M694j699
548a011K048j636J957k13Q33O13l288P687r567P962l156j005K676l638M652m786
564A28K866j911L224m779M155j022k188M079n689P210p393M361r54k065J980k224
580b22J967m017M236m731M065m436L190k95m217O886o612N251m438K624j303j484
596c536J331j291O03l251N742o551N751l156N50K679m717O269n256L373j440J745
612a155j913J334J82j257L106n126P738o956M497L65k322L428k578L450l229L498
$$ plain form
628 3062 118 3528 -181 2234 2879 -1264 5356 -1539 4168 856 2043 3151 1427 2699 2004 3886
644 3886 -677 4842 -837 2954 911 -130 3186 -2388 3432 -1120 1290 -525 1252 -987 -355
659 -355 438 -2451 1930 -4337 1587 -2918 -1143 -774 -2928 -148 -3551 66 -3933 -375 -3606 -661
675 -661 -2532 -2718 111 -4501 739 -4005 -184 -2738 -1096 -1381 -2176 -95 -3342 1390 -3442 1314
691 1314 -1930 -67 -327 -1158 1553 -2105 2488 -1874 1804 -649 1232 1063 -433 2903 -940 3145
707 3145 -551 3006 188 2091 1623 301 3506 -505 3845 -287 3146 789 1725 2058 351 3032
723 3032 -585 3208 -1123 2727 -563 826 1561 -1202 2214 -1839 1902 -1916 907 -1649 -204
738 -204 -656 -2012 959 -3604 1268 -3186 -399 -1966 -1753 -1080 -3151 -394 -3669 -10 -3862 -185
$$ packed form
628C062k944L410l709K415O45m143O620o895N707l312J187J108j724J272o95J882
644C886m563N519n679L791k043j041L316n574N820m552K410j815J777k239O32
659c55P93k889M381o267N924m505J775L69k154K780l403L617l999L558l231K945
675f61j871j86K829m612N240m744L821k554J642k85p95K081l247M732m832M756
691A314l244J863k60q31K711l658M593m362L678k453J881j69j496L336l843M085
707C145l696L557k818J903m68j322L205m011M350m132L433k357R36L33j707K681
723C032l617L793m331L850l290J389P35k763L416m053L741l818K823k556J445
738b04m52j356K971m563M872m454K787j567K13O73k071K757l275L659l852L677
$$ plain form
754 -185 -2493 -1663 -475 -3171 762 -3514 382 -2659 -168 -1986 -1025 -270 -2332 1580 -2518 1941
770 1941 -1713 1387 10 76 1523 -803 2275 -883 2857 -1015 2640 636 836 2467 -373 3013
786 3013 -683 3126 -219 2468 1282 1195 2393 14 3223 -822 3001 -615 1847 860 16 1573
802 1573 -820 1800 -1659 2309 -1266 1107 -119 -604 1011 -2131 1430 -2470 706 -2536 -485
817 -485 -1516 -2056 -300 -3158 484 -3566 250 -2678 -1078 -1210 -2162 -460 -2829 248 -3658 229
833 229 -2922 -889 -1166 -2340 235 -2822 952 -2380 846 -1512 496 -35 -436 1503 -1379 2633
849 2633 -1558 2080 -512 464 1048 -129 1824 -298 2963 -365 3398 366 2428 2008 597 3282
865 3282 -626 3087 -365 2050 243 1189 748 229 1738 -1092 2916 -1807 1832 -635 -29 495
$$ packed form
754a85k308Q30J188k696L933m276L896l041K491j818R61P55k062L912m098M459
770A941l654L100j377O6J447k326L078l158L740l872L655k004K00J631k840L386
786C013l696L809l345K687j186q7J198k379L209m045L823l616K462r87q44J557
802A573k393K620l459L968l575K373j226m85J615l142L561l900L176l242K051
817d85j031n40J756k858L642m050L816k928J600j32r52J702k369L077l906L887
833B29l151K033k77j174K575l057L774l332L226k358K008n31m01J939k882M012
849B633m191L638k592R76N84j177J953k122L261l328L763l032K062m20j411K685
865C282l908L713l452K415j807R46m41n19J509k830M008m723L639k467O06N24
$$ plain form
881 495 -1534 1016 -2138 582 -2078 -140 -2497 -480 -1133 -2590 128 -3355 756 -3026 -196 -1623
897 -1623 -1397 -708 -2082 -146 -2921 473 -3160 96 -2368 -742 -576 -2475 1154 -2551 1102 -1599
913 -1599 570 -765 55 170 -901 1005 -1734 1971 -1959 1189 -326 -177 913 -1162 2184 -1460
929 -1460 1743 -501 1319 -94 1260 1155 -358 2309 -1092 2541 -1184 1683 274 -279 1605 -683
945 -683 2319 -551 1915 -186 1707 -162 1102 1063 -1169 2419 -2099 1603 -999 378 -130 -913
961 -913 691 -965 431 -1344 1185 -2361 633 -1231 -1119 695 -3032 1025 -2661 -431 -1732 -896
977 -896 -1396 -1130 -562 -2016 174 -2831 1187 -2918 -145 -329 -1933 721 -2114 453 -1610 475
993 475 -1093 670 -820 94 1006 -1830 2539 -1209 2130 -220 863 1432 91 1690 328 1931
$$ packed form
881D95k029K550l154K720k660J938k357K017o53j457K718l483M111l782K830j427
897a623K26O89j374J936k775L394l633L256k464J626J66j899L629l705L653k701
913a599K169j335Q20J15j071J906k739L705l930L148j515J49J090k075L346l644
929a460L203k244J820j413J354j05j513K667l401L633l725K867j409n53J884k288
945f83L002k870K466k101J893j869J264l9k232L588m518L702k602J377n08p83
961i13J604j656J396j775K529l546K994j864J12J814l727M057l686K230j301Q36
977h96n00K66N68j454K190l005M018m105K773j84j604K654k835K567k063K085
993D75j568J763j490R14R12k836M369l748L339k350J083N69j341J599j362J603
$$ plain form
1009 1931 -186 3058 -386 1878 1330 495 2618 -801 2934 -383 1934 651 1253 1087 313 1399
1025 1399 -389 1639 -1460 1908 -1391 84 506 -1509 853 -1814 868 -1787 63 -1260 -320
1040 -320 -1308 -1324 -90 -2948 510 -3121 -22 -2158 -1552 -381 -2318 43 -2093 48 -2218 253
1056 253 -1767 -672 -766 -1321 753 -2836 1490 -1545 543 -388 -293 624 -872 981 -510 1449 -1108
1073 -1108 1817 -186 736 1277 -439 2429 -752 2390 -53 1399 657 1080 1117 293 1981 -443 2760
1090 2760 -810 1953 701 258 1794 -573 1720 -556 1513 -462 1132 -192 420 608 -903 1588
1106 1588 -2083 1437 -1170 67 -513 -916 1 -1155 275 -1743 664 -2129 525 -1305 -1174 -193
1122 -193 -2209 269 -2460 73 -1570 -553 -1124 -954 -322 -1691 608 -2096 736 -1520 4 -582
$$ packed form
1009A931k117L244l444K264n48q35K123l419L735l317K317j283O02j66p74J086
1025A399j788K028l099L368l299J475M22k015K362k667K682k655J850j323R40
1040c20r88j6J234k858L458l631L099k136O06J171j937K361k136K141k266K471
1056B53k020J095r4n55K074l589M326l035K088r31R5R17j496J853j491J959k557
1073a108K925k003R22N41j716K868l181L142k443J452p42M23L7q24J688k424L203
1090B760l570K763j252m43J536k367K293k276K069j975J594j324O12J88j511K491
1106A588l671L520k607J237n80m03R17j156J430k018K407k793K654j830J31R81
1122a93k016K478k729K533j643J017n71J70O32j369K299k704K832k256J524n86
$$ plain form
1138 -582 -997 581 -1540 703 -1301 1197 -998 784 120 10 1051 -654 1949 -738 1688 -24
1154 -24 1211 653 456 1706 -134 2080 -536 1760 25 1495 911 405 1766 -264 2178 -443
1170 -443 1908 233 988 617 142 1333 -870 1380 -876 1024 -641 352 -109 -877 837 -1730 821
1187 821 -1811 272 -1034 -589 -929 -1277 -14 -1929 267 -2439 89 -1720 -652 -816 -1840 127
1203 127 -2236 179 -1631 -70 -1393 -449 -538 -1423 299 -1568 661 -1624 559 -741 -144 381 -238
1220 -238 1270 -825 1560 -748 1261 -108 498 1055 -53 1748 -360 1738 -70 1686 431 959
1236 959 1133 240 1963 -427 1920 -306 1297 130 705 1013 -283 1309 -756 1566 -766 1222
1252 1222 -217 101 550 -954 946 -1128 667 -1447 285 -884 -819 -229 -1626 117 -1894 249
$$ packed form
1138e82m15J578k121K243k004K498k195J782o64j10J041j705K603k687K426j712
1154b4J235n58j97J250j840K214k616K296j735J470n84n06J361k030K442k621
1170d43K351j675P55l71m75J191k203K250k256J900j665R93m61p68J714k567K551
1187H21k632K083j306M45l40l48J263j915K196k706K528j809J068j64j024J967
1203A27k363K415j810J561j323R44q9q85J722j867K229k285K183j300N97N25o19
1220b38J508k095K385k308K009j369O06N57j108J801k108K098j808J756j255N28
1236I59J74q93J723k390K347k226J603j167N75L08j296J592k065K322k332J988
1252A222j439L18M49j504J900k074J795k114J732j169O5N90j397J743k011K143
$$ plain form
1268 249 -1712 -282 -1101 -1016 -200 -1494 171 -2060 390 -1861 -291 -911 -1019 -180 -1455 356 -1494
1285 -1494 556 -1081 306 -458 -319 521 -835 1178 -1132 1233 -423 603 415 167 1033 -239
1301 -239 1541 -463 1536 -144 1234 723 470 1551 -39 1828 -287 1628 -99 1191 433 486
1317 486 940 -429 1710 -597 1458 -308 455 408 -412 826 -603 971 -974 839 -894 103 -309
1334 -309 -815 327 -1429 551 -1541 37 -1119 -401 -667 -701 -175 -1603 267 -1943 85 -1269 -817
1351 -817 -474 -1345 -141 -1505 114 -1528 179 -1160 -469 -549 -832 264 -1341 882 -1266 499 -564
1368 -564 -79 491 -338 933 -491 1143 -318 1127 184 638 732 27 1431 -548 1733 -348 1124
1385 1124 645 512 1065 83 1440 -246 1505 -351 1130 -39 494 599 -453 1009 -822 1108
$$ packed form
1268B49j961J430q19Q5Q16j294J665k231K450k251J570o20j08Q39j275J811j850
1285a494K050j637J387p64J39Q40j356K013k310K365j656J026j88k48Q66j272
1301b39J780k004J999j680J378n11k53J081j590J867k115J915j727J290p58N3
1317D86M54j369K139k307K055j766P63m7q20J238j429J574j945J813j733R97m12
1334c09n06J142j756J980k092J578j156P18k66l4N26j428J870k210K028j354M52
1351h17L43q71J204j364J619j642J707j339O91q0k83J096j605K223k148J765j063
1368e64M85N70q29J271j424J634j461J445r43M54R4p05J404j979K281k081J472
1385A124m79j33N53r82J357j686J751j856J481j169N33J05j052J462j831J930
$$ plain form
1401 1108 -629 275 -320 -32 -70 -626 500 -1335 674 -1210 167 -768 -569 25 -1495 153 -1229
1418 -1229 -68 -1179 -113 -1014 -601 -431 -1363 207 -1921 589 -1348 -348 -627 -781 151 -1178 266
1435 266 -849 372 -1069 687 -652 -135 528 -869 727 -829 905 -276 382 401 21 454 -119
1452 -119 1111 -398 1477 -154 812 472 261 1501 -469 1257 -128 1108 69 844 536 277 907
1469 907 -285 1403 -739 1307 -117 629 494 -79 796 -492 706 -556 558 -534 283 -240 -399
1486 -399 407 -1143 671 -1263 208 -680 -305 -359 -724 -40 -1077 231 -1195 370 -1199 -47 -377
1503 -377 -862 192 -1307 378 -1098 170 -578 -234 -73 -334 107 -796 837 -987 941 -273 203
1520 203 249 -385 1016 -476 1150 -118 777 167 650 441 189 1283 -233 1541 -331 1034 353
$$ packed form
1401A108j737R04n95K88l8n56J126j835K009j884J377r35J99N94j520J648j382
1418a229J161j111J066r01M13J70r32J570k128K510j937J000k79j54R32j329J444
1435B66j115J221j441J756j339N17O63j397J596j556J734j181O58J9l80M33n73
1452a19J230j509J875j631R66l40k11J240j970J726j385J236j039P75l08k59O30
1469I07j192J688k142K046j424P46j35n73Q75j288J198j262J114j092Q17n23j59
1486c99Q06j550J814j934J471q88L75n4l65O84j037J308j426J565j569J152l30
1503c77m85J054j499J685j476J268p48L44J61k61M41r03J633j824J928j214M76
1520B03M6o34J401j492J626j268Q95o10M83k09k52J094j516J774j872J365o81
$$ plain form
1537 353 387 1109 153 1109 164 1129 25 1179 77 669 677 -210 1095 -702 984 -646 280 13 -443
1556 -443 71 -256 42 -876 684 -1242 405 -931 -596 -249 -1182 110 -1257 101 -977 -196 -815
1573 -815 -625 -338 -960 79 -1367 450 -1155 -16 -655 -703 -3 -731 276 -1022 478 -782 139
1590 139 -191 -76 179 -446 768 -458 764 -245 685 481 273 799 -141 990 -189 1216 76
1607 76 924 409 443 1009 133 1195 -319 1193 20 605 567 380 865 -97 794 -471 913 -64 384
1626 384 84 -35 485 -591 657 -562 265 -635 -152 -481 -621 167 -1005 259 -1143 -2 -902 -327
1644 -327 -367 -822 -244 -1195 17 -1286 62 -1033 -292 -665 -712 24 -925 461 -934 64 -501 -198 -273
1663 -273 -346 357 -574 703 -365 582 -226 434 168 248 882 -130 1169 -39 869 316 737 743 376 1048
$$ packed form
1537C53L4P22r56R56r45R65j104J154j102N92Qq87J305j797J686j630R26k67m56
1556d43N14l27K98r18J560j926J647j336L35L47r33J292j367J358j078P81o19
1573h15J90K87o22J039j446J817j605J139o39m8P00p28J007j298J500j260R21
1590A39l30J15K55o25J214j226J222j009R30k04k08N26r40J131j179J405j140
1607G6Q48n15L4N66q76J062j514J512j173N85l8j87M85r62Q91j265J384r77M48
1626C84l00j19N20j076J248j219Q27r00M83l29j40P88j172J264j402J141r00N75
1644c27m0m55N78r51J212j303J348j095P41l73m7P36r49J386j395R98n65L03p5
1663b73p3P03r31J277j068R47q08O60k66Q0O34j012J299j208R08n53M21Ol67O72
$$ plain form
1683 1048 -109 1167 -149 953 316 577 535 103 1054 -175 1112 -302 828 -108 44 365 -315
1700 -315 761 -465 645 -723 261 -339 45 -110 -658 188 -925 241 -821 30 -645 -298 -120 -801
1718 -801 91 -1003 125 -973 89 -691 -582 -156 -759 190 -843 148 -958 283 -612 -314 -229 -564
1736 -564 549 -901 498 -714 350 -246 -50 282 -320 837 -432 885 -201 581 252 147 455
1753 455 -39 961 -142 925 92 732 278 505 902 -38 1101 -148 953 -171 611 242 54 617
1771 617 -303 863 -356 768 -562 258 -53 -283 228 -396 505 -653 264 -628 -123 -362 -415 -122 -1056
1790 -1056 262 -1082 87 -753 -319 -204 -623 -12 -881 224 -1092 171 -839 -87 -263 -558 140
1807 140 -768 270 -705 438 -333 -95 186 -143 388 -437 648 -419 659 -106 451 308 -177 466
$$ packed form
1683A048j157J276j316J102o37K61m2m32R51j229J287j414J130r36J52L21o80
1700c15J076j226J110j368R84o00L84j55n48Q46j113J166j062Q51o75L47J78o81
1718h01Q92j094J128j098J062p80J09M26o03R49j033R91j106J241q95K98Q5l35
1736e64J113j450J399j212J064n96J96L32o02J157j269J317j086P82l29j05L08
1753D55m94J000j103J067q33O40m54K27L97r40J139j249J101j124P82l69j88N63
1771F17r20J166j219J124j330Q20l11k30N11o24R01j158R17q92N05k39n3K93r34
1790a056J318j344J169q40M34J15m19O11q69J105j316J263j010P52j76k95O98
1807A40r08J038r75J143p71K38K81l29N31q25J085j067J078p65N57j43m85O43
$$ plain form
1825 466 -86 1043 -34 983 169 624 484 407 858 -38 1043 -27 886 32 562 456 -86 803 -383
1844 -383 760 -121 535 -47 109 88 -121 400 -686 614 -697 401 -248 -343 -21 -590 155 -695 27
1863 27 -770 35 -664 -278 -82 -702 215 -1058 433 -667 109 -534 -223 -173 -588 166 -454 542 -722
1882 -722 253 -404 50 239 -353 573 -412 496 -296 424 -40 417 323 -79 908 -323 927 -115 834
1901 834 196 182 873 28 853 165 1021 -37 588 65 362 707 -205 793 -344 865 -97 235 95
1920 95 124 239 -358 417 -590 522 -494 237 -360 -303 137 -725 468 -734 6 -721 -251 -393 -472 -215
1940 -215 -862 136 -890 -14 -653 -272 -522 -531 -12 -693 228 -709 67 -623 65 -332 -166 236 -723 481
1960 481 -472 364 -379 170 197 63 495 -263 523 -128 644 -209 605 -19 -5 702 -18 770 -123 691 249
$$ packed form
1825D66n52J129j077J017q14M55j40p7M51q96J081j070R13q54N30j06n42Q89j186
1844c83J143q81O56n82J56k1k09N21j086J300j311J098o49r5L22n69P45q50P22
1863B7p97Q05o99L86J96o20R17j273J491j100P76o43L11N0m15P54o20R96j264
1882g22R75o57M54J89n92R26r85R08p92P20m64M57r4m02R87j231J250j042R49
1901H34o38j4O91q45Q25o88Q56j058O25n23K97L45r12R98j137J209r62L32j40
1920I5K9J15n97P75j007J112j016P31n97N7M40q62J193j202P40p27M70j42p9K57
1940b15o47R98j026Q76o39L81k50rN19o81R21r37P76o90O88l97J66M02r59J204
1960D81r53Q36p43N49K7j34M32p58P86o51P72q53Q14o24J4P07p20P88q93Q14m42
$$ plain form
1981 249 569 466 75 695 -40 900 -261 748 -55 416 326 -54 750 -216 558 -470 355 -321 151
2000 151 85 -376 106 -606 163 -840 298 -503 -364 -279 -662 -18 -624 70 -713 74 -687 -382 -436 -768
2020 -768 -170 -927 183 -775 -226 -574 -384 -256 -449 166 -660 375 -593 427 -218 140 341 -294 640
2039 640 -246 640 -398 583 138 465 247 -135 550 -400 707 -357 586 42 287 493 10 670 -265
2058 -265 641 -22 535 193 24 386 -37 564 -404 613 -83 436 232 74 190 -366 2 -297 305 -327
2078 -327 330 -251 -349 9 -626 135 -676 145 -648 -224 -261 -385 -139 -617 13 -743 -49 -717 -158 -561 -400
2099 -400 -212 -482 246 -669 204 -492 -184 -165 -264 82 -405 298 -680 429 -317 75 -13 -133 531 -270 497
2120 497 -372 598 -7 486 65 29 387 22 647 -115 531 116 481 4 12 568 -138 648 -233 612 -197
$$ packed form
1981B49L20j03l91O20p35R40j161J009q03M71r0l80Q04r66P74j028Q25o76M72
2000A51o6m61M82p12P69j003J138q01J39Q5l83O44o06O94p83P87p61L05n4l32
2020g68N98p57J110r58N49l48J90J28j93O15q26J035r68J020o45L58K01o35R34
2039F40q86Q86j038R81m45L27k18l82O85r50J107j064R43n44K45K06m83O60r35
2058b65R06o63N57l42j69L62m23O01r68J017o96N19k04j58J16n56L68k99O02o32
2078c27O57n81r8L58o35P61q11Q21p93M24l7j24K46m78O30p56O94o68N59m03J61
2099d00J88k70P28r15Q73o96L08J9r9L46m87P03r78J109p46L92q8j20O64q01P67
2120D97q69R70o05M93m21l6L58l65O25p62O46m15L65m77QN56p06P86q81Q45q09
$$ plain form
2141 -197 317 218 -219 288 -358 394 -289 273 -69 -30 37 -211 460 -375 479 -446 221 -568 33 47 -475
2162 -475 38 -790 48 -334 44 -654 -10 -315 -503 10 -509 -11 -810 34 -505 -143 -45 -481 90 -618
2182 -618 150 -741 201 -250 -45 -15 -265 357 -405 490 -118 349 -59 60 254 24 544 -139 737 -136
2202 -136 676 174 170 394 0 717 22 583 -94 620 292 182 242 -2 589 -130 831 -290 489 72 39
2223 39 317 -345 136 -148 334 -282 391 -353 -109 38 -497 217 -590 66 -506 -12 -226 -223 -10 -574 56
2244 56 -867 264 -578 10 -204 -341 76 -640 183 -708 0 -364 -31 -43 -77 97 -72 419 -175 485 -246
2265 -246 183 102 146 318 -32 442 -93 627 34 296 160 116 433 165 903 -118 680 41 595 389 -17
2286 -17 532 -98 465 -319 588 -219 364 259 -66 258 -275 415 -427 327 -312 11 -25 -310 -30 -585 225
$$ packed form
2141a97N14r9m37N07o46P52o83N62l42L9O7k48O71q35Q54r25O67p89O01J4n22
2162d75N13q28Q38l82L78o98O44l05j88N13n19M98p99Q44n39L62R8m36N71p08
2182f18P68q91R42m51K05L0k50O22p62Q95o08M67m08J19J94k30N20o83Q76q73
2202a36Q12n02mK24l94P17o95N61o77P14l28j10O0k44N91p19R61j121P79m17l3
2223C9K78o62M81k84M82o16O73p44K44J47n35P14q07O56n72M94k14LK13n64O30
2244E6r23J131q42N88k14j37M17p16Q23q91P08l64L33j2l4J74j69M91n94O60p31
2265b46M29q1M4J72l50M74n35P20n93K62j36m4L17k68P38j021P98o39N54k06m06
2286a7N49o30N63p84R07q07N83j05l25L24n33O90q42P54o39L23l6k85K80n55Q10
$$ plain form
2307 225 -490 136 -416 -201 -287 -383 -205 -652 146 -632 -62 -580 8 -371 -252 10 -463 238 -574 157 -517
2328 -517 -17 68 -265 185 -255 402 -187 239 -149 -7 142 -235 482 -228 553 -84 455 169 45 259
2348 259 73 624 -24 827 45 624 79 520 390 -18 581 -88 618 64 482 19 313 186 86 364
2368 364 -245 654 -260 392 26 49 239 -180 252 -512 111 -283 -7 -134 -35 41 -397 112 -648 79 -303
2389 -303 -1 -386 -200 -215 -362 11 -572 92 -642 -30 -551 -313 -129 -408 192 -492 148 -114 2 -105
2409 -105 -154 148 -256 394 -277 401 -215 275 51 192 336 -182 629 -139 460 18 423 290 197 628 160
2430 160 703 -170 771 101 489 389 132 330 45 329 -101 519 -113 350 175 34 327 -455 294 -230
2450 -230 278 -323 -217 -206 -174 95 -275 2 -653 -64 -482 -284 -161 -397 -76 -736 -154 -487 -96 -348 -107
$$ packed form
2307B25p15O26n52K15q6r6J78m47P98p78N70n18N88l79J19K62m73P01q12P31o74
2328e17N00Q5l33M50m40O57n89M26l88J42J49l77P17p10P81o37N39k86j24K14
2348B59j86N51o48Q51p82N79n45M41j30m08N99o69P06n54M18m63K94j27j00K78
2368C64o09Q99r14O52l66K3J90m19M32p64O23l94K76j27R9P6m38N09p60P27l82
2389c03L02l85J86j5j47L73n83O64p34O12n21K38J84k79O00o84O40k62J16j07
2409a05m9L02m04O50o71O78o16M90k24J41J44n18Q11p68N99m42M05j33r3M31m68
2430A60N43q73R41o70L88j00k57J98k85K84m30O20o32M63j75j41K93p82P49n24
2450b30N08o01J06J1L2K69l70K77o55N89m18J98J23k36L21o60N82l33L91k52K41
$$ plain form
2471 -107 -276 -380 -113 -396 225 -495 45 -394 -130 -133 -181 192 -406 130 -434 162 -53 35 123 145 289 -114
2493 -114 344 -116 615 -81 437 420 179 526 130 460 -152 422 234 262 392 116 527 -1 475 167 359
2514 359 132 136 146 -73 467 -243 442 -272 217 -270 1 -50 -319 80 -452 111 -421 -30 -592 -108 -337
2535 -337 -248 147 -513 80 -472 -30 -323 -258 -134 -423 -10 -518 37 -438 -126 -275 35 -67 -320 251 -154
2556 -154 272 -138 -21 -126 88 171 -148 259 -71 598 72 170 118 46 393 -69 570 -156 316 -157 399
2577 399 7 298 193 28 495 60 570 -108 389 331 227 471 190 311 -175 122 -217 319 36 -38 178
2598 178 -228 337 -189 281 -391 -22 -206 -185 148 -394 230 -389 38 -561 -13 -521 -232 -64 -385 85
2618 85 -562 79 -374 -22 -201 -296 46 -196 242 -304 63 -180 -7 -132 -150 224 -51 348 -265 120 9
$$ packed form
2471a07j69j04K67k83O21p20N40m39K64lm8L73n98N36n64N96k15Q8Q8K2J44m03
2493a14M58m60P31o96N18j7k41L47l96L30o12N74j88K8J30k76M11n28M76l08J92
2514C59k27MJ0k19N40p10O85p14M89m87K71n1k69L99n32N63n32L91n62M84k29
2535c37Q9L95o60N93n52M42k93O5J24k89M13n08N55m75L12j49L10j02k53N71m05
2556a54M26m10J17j05K14Q3l19M07l30O69n26R8n2p2L47m62O39p26M72m73N56
2577C99l92K91j05j65M67m35N10o78M97n8j04K44k81J21m86K97l39N36k83p4K16
2598A78m06N65n26M70o72L69j84K1L33n42O24o19M27n99N48n08K89J68l21M70
2618H5o47O41m53L52j79r5L42k42M38n46L67k43J73j25j8L74k75L99o13L85j11
$$ plain form
2639 9 255 281 156 308 38 293 -65 190 107 203 370 119 525 103 433 38 355 -107 24 339 211 334
2661 334 -141 458 -162 172 127 41 150 -153 311 10 192 101 -191 -311 91 -149 -233 -16 -173 351 -222
2682 -222 141 -280 -96 144 -541 -263 -544 -438 -79 -38 -91 -56 -135 -295 138 -199 179 -319 159 -355 -41
2703 -41 -182 -101 83 -325 89 -297 197 94 -19 -16 -82 293 -74 397 -169 88 172 -10 252 42 461 -111
2725 -111 338 120 224 157 110 365 -41 476 -148 218 -36 275 19 63 125 -28 349 -28 480 -250 147
2746 147 -73 -17 -46 -34 80 -320 217 -319 -74 -44 -201 -131 -313 25 -280 76 -320 39 -29 -134 -125 -385 159
2769 159 -316 89 -261 -69 -185 -146 190 -348 152 -134 208 -150 106 17 -3 180 -5 203 -224 334 -32
2790 -32 83 234 76 128 -235 507 -23 406 206 203 107 2 228 -57 177 116 188 190 499 194 423 238 -151
$$ packed form
2639IK46K6j25J52k70K55l58K55q3R6J67k51M06m22L30l95L17m62J31L15j28J23
2661C34m75N99o20L34m5q6J09l03M64l01J82r1k92j20M02k40q4K17j57N24n73
2682b22L63m21J84K40o85K78k81J06L59M1n3L5p9j60M33l37L78m98M78n14L14
2703d1j41Q1J84m08M14l86M94j03j13Lo6L75l67M71n66K57Q4j82K62k10M19n72
2725a11M49k18J04o7m7K55m06N17o24L66k54L11k56M4O2j53L77l77N08p30L97
2746A47k20N6k9J2J14m00N37n36K45L0j57P0j82L38l05L56l96L59o8j05Rk60N44
2769A59m75M05l50J92j16L9L36n38N00k86L42l58K56q9k0J83j85K08m27N58l66
2790c2J15J51j58N2l63P42n30M29k00lr6j05K26k85K34o1P2KL09l05K29j85l89
$$ plain form
2813 -151 383 -102 118 214 201 130 -102 -68 -675 58 -616 532 -363 45 -263 -21 76 -315 -198 -518 0
2834 0 -354 -60 -39 -115 342 -313 -424 -278 150 -168 -283 40 -91 211 -259 1 -517 402 -185 0 27 -141
2856 -141 281 -79 5 -317 -10 117 9 245 -89 125 -365 218 -135 -48 108 -7 238 126 518 3 197
2877 197 87 479 64 234 234 124 431 -271 480 -169 538 -190 121 117 -187 355 -473 197 -27 38 -194 -6
2899 -6 237 -494 -86 -400 152 -184 217 -83 -516 15 -219 44 -453 -221 -585 -34 -474 -267 -39 -279 -158
2920 -158 -431 -105 -433 176 253 -279 26 -118 76 -5 53 -186 324 31 -135 174 -59 374 14 192 -17
2941 -17 146 158 226 275 -67 209 53 397 46 114 -136 111 231 -138 521 -435 365 -56 172 346 97 289
2963 289 -150 247 -210 79 -199 -94 41 -139 30 -212 54 -279 230 -110 92 -182 -237 89 -270 348
$$ packed form
2813a51N34m85K20R6j3p1k32L4o07P33o74J148q95M08l08K42R7l91J17l20N18
2834@l54K94K1p6M57o55j11J46M28l18j15L23j31L02m70K60n18R19n87J85K7j68
2856a41M22l60Q4l22L07J27j08K36l34K14m90N83l53Q7J56j15K45j12L92n15J94
2877A97j10L92m15J70%j10L07p02P51o49P07p28L11ml04N42q28O70k24O5k32J88
2899fK43p31M08l14N52l36M01l00m33N31k34K63m97K32l64N51m40K07K28k40J21
2920a58k73L26l28O09P7n32L05j44J94q1N8k39N10k93j66L09k33M33l60J78k09
2941a7J63J2O8M9l42K76j56L44l51O8k50K47J20l69O59r56Q00m21K28J74k49J92
2963B89m39L97m57K89k78J05J35j80J69k42K66l33N09l40K02k74n5L26l59O18
$$ plain form
2983 348 -205 145 28 74 -124 -158 27 -277 38 -369 -226 -387 79 -147 -406 -199 -612 74 -382 388 -178
3004 -178 -19 -14 -181 10 -428 463 -92 242 -21 105 59 -444 -53 57 307 77 176 66 25 68 -135 602
3026 602 -358 507 111 351 384 54 316 95 434 -90 457 158 258 25 109 42 -240 362 -156 194 -191
3047 -191 -194 68 200 55 -86 -2 -267 181 -213 -23 2 -350 82 -442 -67 -118 -14 -247 112 -307 -6 -144
3069 -144 -101 89 -180 90 -360 100 -35 -164 -172 -117 150 8 153 -280 183 99 41 297 -126 209 -83 482
3091 482 -174 181 -87 231 -148 177 203 239 216 -78 185 80 -296 285 47 418 -44 304 -189 -103 149
3112 149 84 45 -255 296 -164 116 71 217 46 -215 -367 -265 102 -77 158 -10 -27 -108 -147 22 -62 140
3134 140 -406 345 -175 -145 -12 -154 -29 -417 83 -354 86 -160 -72 5 -122 15 -327 234 -253 100 -154
$$ packed form
2983C48n53L50j17M6j98l4J85l04L15m07J43j61M66k26k59K07m13O86m56P70n66
3004a78J59Nj67J91m38Q91n55L34k63J26m6n03L91J10K50k30R9j10m1M3k03P37
3026F02r60Q65l96K40L3l30K62k21L39n24N47k99J00k33Q4o7k82O02n18L50l85
3047a91lK62J32j45j41Q4k65M48l94J90K5l52M32n24L75n1J04k33L59m19L01j38
3069a44M3J90k69K70m50M60j35j29qN5K67j42J45m33M63q4n8K56m23L35k92N65
3091D82o56L55k68L18l79L25K6L6k3k94K63j05l76N81k38L71m62L48m93Q6K52
3112A49o5l9l00N51m60K80m5J46j71k61j52J02L67j79K35j68j7q1l9J69q4K02
3134A40n46P51n20L0J33j42J25l88N00m37M40k46Q8P7j27J37l42N61m87L53k54
$$ plain form
3155 -154 -2 100 -178 205 -75 276 -130 109 -309 -55 175 -29 247 -269 351 132 212 226 162 538 -19
3176 -19 59 -384 326 65 242 -71 288 151 136 236 -366 287 -125 161 -70 149 67 -289 19 -373 37
3197 37 -202 -28 -122 -184 -190 -10 257 -367 -69 34 -3 -308 -200 -153 -151 62 -487 77 -268 -22 -75 129 -20
3220 -20 -207 -8 -209 216 -101 6 -74 -231 17 -89 103 -173 -57 100 -97 136 70 24 9 202 74 -31
3242 -31 -173 180 26 41 115 -103 227 -49 278 124 207 10 4 211 -104 136 -128 316 52 175 -9 69
3264 69 -8 -183 92 -390 319 -218 -42 -89 -202 -52 -295 138 -146 -39 -297 -114 -164 -205 -96 -147 16 -338
3286 -338 -4 -233 -106 -313 -169 -36 -376 145 -250 25 -209 75 19 -76 -55 -234 306 -229 17 -153 17
3307 17 -31 -4 292 -250 32 -42 237 73 182 80 -25 227 -251 276 -66 176 17 98 -3 -118 183 -154
$$ packed form
3155a54J52J02k78L83k80L51m06K39m18K54K30k04K76n16O20k19Q0J4o4L76n57
3176a9P8m43P10k61J77l13L59j37j5J00o02O53m12K86k31K19q2l56L08l92M10
3197C7k39J74r4o2oJ80K67o24K98J03l7l05J08M7KK13n49N64l45K46n3K04j49
3220b0j87J99k01M25l17J07q0j57K48j06J92k76J16J57j97K33o6m6j5J93j28j05
3242c1j42L53j54J5P4k18L30k76L27j54Q3j97oK07l15K40k64M44k64J23j84P8
3264F9p7j75K75m82P09n37J76m7j13J50k43M33k84J07k58J83n0m1J09n1J63l54
3286c38L34k29J27k07J44J33l40N21l95K75k34K84n6r5K1j79N40n35K46j70J70
3307A7m8K7K96n42K82p4K79j64J09j02j05K52m78N27l42K42j59Q1j01j15L01l37
$$ plain form
3329 -154 39 24 167 -123 -76 22 171 451 -147 288 -293 8 -236 -191 155 -133 173 -112 202 -365 2
3350 2 -146 33 -193 -196 65 -313 -72 -306 35 -324 -317 31 -43 -57 -356 -121 -483 -60 -86 9 -55 -92 83 -178
3374 -178 84 -106 101 140 91 142 -198 287 -164 50 -80 -10 23 15 241 2 250 -227 142 -197 55 76 84
3397 84 264 55 228 -90 179 -194 47 -26 164 300 -69 151 -138 206 -70 212 -46 -30 94 -110 -39
3418 -39 9 54 -175 252 -69 -98 65 -150 261 -330 112 -23 -21 -72 -248 -89 -337 85 -327 -94 -115 -145 -364
3441 -364 -93 19 -190 -28 -134 -50 -78 4 -60 -48 -55 -178 111 196 154 157 92 192 53 161 -20 179 -72 236
3465 236 -39 -7 -134 122 0 -10 123 -110 98 66 -45 101 -127 199 -16 -24 -407 63 -74 56 148 34
3487 34 252 -232 157 -201 240 -247 -147 -30 -256 80 -57 -23 -340 -156 138 14 -111 -266 108 -223 71
$$ packed form
3329a54J93j5J43k90M7R8J49K80n98M35n81L01k44M5L46k88L06k85L14n67L67
3350Bj48J79k26lK61l78K41k34L41l59PL48p4j4k99K35l62M23k6R5o4l7J75k61
3374a78K62j90K07L9m9N1l40M85m51K14j30P0L3qK26k39K48m77L69l39K52K1Q
3397H4J80k09J73l18K69l73K41p3J90J36l69K20k89L44k76K82k58J6J24k04P1
3418c9M8M5k29M27l21k9J63k15M11n91M42j35Kn1j76J59k48M22m12K33k1l0k19
3441c64K71J12k09J62j06Q4k8Q2o4J2pj23K89Q5m2Lo5J00j39J08j81J99k51L08
3465B36k75L2j27K56j22j0J33k33K08l2j11J46k28L26k15ql83M70j37J30R2j14
3487C4K18m84L89l58M41m87J00J17k26L36j37L4l17J84K94j24j25j55L74l31K94
$$ plain form
3508 71 -82 -125 -273 -77 -45 -90 -132 -191 -36 -131 -22 27 -288 -123 -150 123 -261 -63 -88 54 -103 3 -19 41
3532 41 235 -20 175 29 239 -68 129 276 -89 17 125 134 210 199 20 265 337 -43 236 -480 -11 -236
3554 -236 -42 -13 66 -34 -178 183 65 3 -17 -4 48 -33 -69 -33 85 -50 40 -131 -160 -23 -145 -136 -223 223 -88
3579 -88 507 -141 15 14 -76 169 -154 348 -231 -124 -233 -57 -98 -182 40 -133 120 -42 160 1 202 38
3601 38 -4 2 38 110 -189 -46 -35 129 -205 -169 22 -162 336 50 267 195 0 30 33 292 -234 352 -12 96
3625 96 32 178 104 117 35 -46 193 -77 232 114 -55 10 53 80 -224 227 -71 -33 -42 -53 -63 -71 -28 -239 -38 -362
3651 -362 -24 -10 -55 -38 160 68 -28 -54 -78 63 -103 4 62 -74 -51 -106 107 -232 35 -28 -93 -69 -64 166 -129
3676 -129 -47 85 -134 62 7 -76 -30 -33 -218 214 72 177 -27 -85 17 93 146 -136 228 42 152 -29 176
$$ packed form
3508G1j53m3j48J96L2m5m2n9J55r5J09M9l15J65k7K73l84J98k5J42j57J06k2O0
3532D1J94k55J95j46K10l07J97J47l65J06J08RP6j1j79K45P2l80K79p16M69k25
3554b36J94K9P9j00j44L61j18o2k0J3N2q1l6L6J18j35R0j71k9J37j22Rq7M46l11
3579h8N95o48J56jr0K45l23N02n79J07j09J76m1q4K22j73K53j62K02j59K01j64
3601C8m2OL6P2k99J43J1J64l34L6J91j84M98k86K17p2j95L0LK59n26N86l64J08
3625I6o4J46p4J3q2q1K39k70L09j18j69O5M3K7l04M51k98L8rj1j0qM3k11K01l24
3651c62L38J4m5J7J98r2r6k6k4J41j66J07N8j36K3n5K13l39K67o3o5K4NK30k95
3676a29Q2J32k19J96n5q3M6lj85M32j42J05k04n8J02P6N3k82L64j86J10j81K05
$$ plain form
3699 176 129 -77 140 88 290 -32 254 121 88 73 -49 19 -121 69 -251 22 -85 -84 120 -165 243 -242
3721 -242 123 -95 60 -202 -10 13 -296 119 -75 23 -170 4 10 -14 -28 -183 117 -146 -19 -274 -139 -63
3743 -63 -368 -6 -24 -107 -86 153 -27 150 34 -104 43 -17 46 -72 81 -159 99 70 -38 129 -102 167
3765 167 -93 145 11 -141 -124 10 97 -73 239 9 78 -107 -43 181 12 81 -85 191 -112 99 -87 0
3787 0 -56 -110 -16 -44 -8 -208 81 -166 -7 -77 6 -53 -282 -107 -18 -139 -121 -77 -161 -260 1 -181 -47 -184 -37
3812 -37 -164 -74 -158 -211 -56 -57 151 -247 191 -95 -326 112 -36 7 -60 38 -142 41 100 76 75 -1 -31 -123 177
3837 177 -42 142 11 -8 127 -42 154 -27 176 48 50 -14 7 234 98 129 -104 274 10 247 101 -142
3859 -142 106 -187 230 -71 53 119 47 -193 -224 32 -93 119 -265 78 -216 -20 -130 -69 -14 -149 -79 -125
$$ packed form
3699A76m7k06K17n2K02l22K86j33l3j5j22O8j40J90l20K73j07JK04k85M08m85
3721b42L65k18J55k62J92K3l09M15j94R8j93J74Ok4j4j55L00k63J27k55J35P6
3743f3l05L62j8q3K1K39j80J77j16j38J47o0O3j18J53k40K58k9j08J67k31K69
3765A67k60K38j34j52J7J34Q7j70L12k30O9j85O4K24j69O9j66K76l03K11j86Q7
3787@n6n4R4k8L6k00K89k47J59p0Q3n9k29J75Q9j21J8M4q4r9K61j82J34j37J47
3812c7j27R0q4n3J55jK08l98M38k86k31M38j48M3o7R8j80J83N9k4jp6l0r2L00
3837A77k19J84j31j9J35j69J96j81K03j28Ko4K1K27j36L1k33L78k64K37j46k43
3859a42K48k93M17l01J24O6p2k40l1K56j25K12l84L43k94J96j10O1N5j35P0m6
$$ plain form
3881 -125 51 -235 -166 -85 -48 -224 -12 66 -346 -176 -232 142 -183 -9 27 71 66 -117 117 55 21 56 14 181
3905 181 174 -31 93 179 186 181 61 -44 78 93 305 -13 124 125 -24 -176 151 43 -92 129 -106 137 -138
3928 -138 123 -117 -118 -50 -168 58 -66 -39 -253 85 60 -65 45 5 84 20 94 -272 -45 48 64 -39 -46 274
3952 274 -123 92 -153 -129 -168 134 -39 -240 -75 -199 -11 -140 66 -190 -13 24 -84 -4 -174 28 -161
3973 -161 105 138 -66 181 -89 168 -167 48 211 224 143 13 88 -26 194 12 215 -12 45 200 64 -2
3995 -2 -132 168 -25 165 170 194 15 -26 -15 -224 64 -99 29 -97 41 -143 -150 114 -147 11 -104 183 92
4018 92 65 -49 -122 -41 167 105 -126 71 -359 -31 54 -227 270 -262 152 3 39 -171 -48 -124 13 -80 -177
4041 -177 -179 -106 49 -152 -156 -193 -47 142 -104 -56 -63 -86 131 -102 77 -15 155 -160 190 -330 94 -60 113 11
$$ packed form
3881a25J76k86O9Q1L7j76K12P8m12J70n6L74l25J74L6M4nj83K34o2l4L5m2J67
3905A81pk05J24Q6Pnj20j05J22J5K12l18J37Jj49j52L27j08j35K21k35K43k75
3928a38K61k40jO8j18K26j24K7k14L38k5j25J10m0P9o4P4l66K27R3J6j03pL20
3952B74l97K15k45K4l9L02j73k01J65j24J88j29K06k56J77L7j08Q0j70K02j89
3973a61K66L3k04K47k70K57l35K15J63J3q1j30P5j14K20j82K03k27N7J55j36o6
3995bj30L00j93J90NK4j79m1J1k09K88j63J28j26J38j84pK64k61J58j15K87r1
4018I2k7j14p3Q1K08o2k31J97m30L28Q5k81M97n32M14j49L6k10J23p6J37r3r7
4041a77kP3J55k01ml7J46J89k46M8pk3K17k33J79r2J70l15L50n20M24j54J73j02
$$ plain form
4065 11 -62 282 -36 233 -24 330 153 -28 70 -139 228 -101 159 10 24 -80 45 46 -11 102 -296 141
4087 141 -46 94 66 -80 107 -146 26 -80 30 -166 -129 -102 -23 158 -90 -24 -61 -2 19 176 2 -179 -92
4110 -92 -51 46 -160 -31 3 86 98 -198 265 -109 145 -46 106 27 33 96 -232 76 35 59 -225 220 78 212
4134 212 29 -133 188 -218 113 57 246 264 118 -38 89 138 -89 322 43 129 -60 101 165 -151 -4 -64
4156 -64 215 -95 139 141 50 95 -177 10 -134 65 -230 47 -98 39 -126 -265 -6 -23 57 18 -89 -91 -120 18
4180 18 -242 117 -77 -70 -137 -19 -127 -44 -191 25 81 -203 169 11 -163 9 -128 -63 -50 -119 121 252 9
4203 9 -27 126 200 121 84 -29 -52 193 -60 -78 -120 171 66 68 78 -10 194 -119 302 -84 86 40 -95 258 -166
4228 -166 59 53 35 -34 60 111 -93 160 -194 249 -170 -52 81 -35 100 -52 -7 -248 33 -114 155 -174
$$ packed form
4065A1p3L44l18K69k57L54j77j81R8k09L67l29K60j49J4j04J25Jn7J13l98M37
4087A41j87J40k8j46J87k53J72j06J10j96L7K7P9J81k48O6l7N9K1J57j74j81Q7
4110i2M1R7k06J29L4Q3J2k96M63l74K54j91J52p9OO3l28L08m1K4k84M45j42J34
4134B12j83j62L21m06L31n6J89J8j46j56J27M9k27M11k79Q6j89J61O4l16J47o0
4156f4K79l10K34Kr1M5k72J87j44J99k95K77j45J37j65j39K59j7Q0l9j07kk9J38
4180A8k60L59j94Po7J18j08Q3j47K16N6k84L72j58j74J72j37O5J3o9K40J31k43
4203Il6J53P4p9l7j13k3K45k53j8m2K91j05KJ0q8K04l13M21l86J70m6j35L53m24
4228a66K25oj8o9R4N1k04K53l54M43m19J18J33j16J35j52M5k41K81j47K69l29
$$ plain form
4250 -174 -263 -8 -197 -21 -147 -225 -364 -4 115 -110 -87 -82 27 -89 204 73 -58 -152 10 -27 -173 170
4272 170 22 57 -19 190 56 9 253 12 164 221 -27 -22 118 31 31 10 -93 62 -217 189 160 68 48 -27 65
4297 65 -152 255 -37 79 155 -211 -70 -52 197 -96 44 -43 117 45 0 -18 94 124 -213 -34 -157 79 -18
4320 -18 -126 28 85 -29 -293 132 -302 13 -118 -179 -67 -45 -10 71 272 -214 -66 208 -78 -170 77 68 -215
4343 -215 -215 -203 30 -70 -105 129 17 -21 -133 122 -151 249 -174 28 45 110 216 0 91 71 122 -222 34
4366 34 67 4 316 89 13 -57 -69 -21 29 -25 -112 -3 39 234 -174 70 -348 -8 10 -114 -40 -245 -144 123
4390 123 194 -77 84 31 -27 29 -200 -41 -111 92 -3 -26 -3 125 -116 -109 107 -214 56 -106 -134 6 -230 59
4414 59 -170 36 -152 -149 -74 -126 -54 -30 51 -12 -33 -125 61 243 60 43 102 -12 -104 25 15 161 188 17 -58 56
$$ packed form
4250a74q9K55j89J76j26p8j39L60J19k25K3NJ09j16K93j31j31r4J62l7j46L43
4272A70j48L5p6K09j34m7K44k41J52N7k48NJ40q7%k1j03J55k79M06k9r2k0p5R2
4297F5k17M07k92J16P6l66J41J8K49k93J40q7J60p2m5j8J12L0l37J79j23K36r7
4320a8j08J54N7j14k64M25m34L15j31o1J12K2L5Q1K01m86J48K74k86r2K47rk83
4343b15%J2K33j00l5K34j12l8j12K55k73M00m23K02J7O5J06k16R1k0N1l44K56
4366C4L3o3L12k27p6p0j2M8N0n4q7J09M2J95m08K44m18L40J8j24P4k05J01K67
4390A23P1k71J61n3n8N6k29J59p0K03r5k3K3J28k41PK16l21K70j62k8J40k36K89
4414E9k29K06j88LP5n2P2K4Q1o3k1r2J86J82j83j7N9j14r2J29j0J46K7j71p5J14
$$ plain form
4440 56 186 64 81 38 19 28 -171 69 135 63 -199 78 85 -71 75 67 -22 -150 12 -204 30 -112 45 14 -58
4465 -58 67 -156 171 53 -37 26 -30 221 59 -148 73 -144 -226 39 -4 -104 -75 -12 53 -148 -100 -165 -32 -80
4489 -80 -106 -173 65 -58 -155 103 -237 107 -159 -101 25 -45 5 -15 245 -32 -50 -168 8 133 23 280 -7
4512 -7 111 -163 104 -67 11 96 -9 83 97 220 -108 -40 -22 -8 100 -21 -19 26 123 -171 -12 139 171 -78 -76
4537 -76 -105 -75 -46 -315 77 -94 -132 -8 -191 -60 -213 136 93 -85 -80 -91 107 -22 -12 -116 99 -197 1
4560 1 81 -57 -80 -29 113 -111 121 -3 37 39 -1 171 -183 114 185 119 -48 160 -25 -142 127 -183 -279 108
4584 108 97 82 193 -27 -29 174 85 -80 -130 -5 -30 -83 -5 -61 173 68 84 36 252 36 -86 13 38 325 -232
4609 -232 75 -133 -6 69 -39 -30 -288 -13 -71 125 -101 -7 115 -95 -50 8 -210 -122 110 -102 8 51 -86
$$ packed form
4440E6J30j22J7m3j9Rj99K40O6p2k62K77Pj56J46qq9j28J62k16K34j42J57l1p2
4465e8J25k23L27j18r0O3n6K51j62k07K21k17q2K65m3j00K9O3O5k01M8o5J33m8
4489h0k6o7K38j23r7K58l40L44k66N8J26p0N0k0K60k77j8j18J76J25j10K57k87
4512gJ18k74K67j71P8Q5j05R2J4J23l28O8J8J4J08j21KM5R7k94J59J51L2k49K
4537g6k9L0K9k69L92j71l8J24j83J31j53L49m3j78Nj1J98j29J0j04K15k96J98
4560AQ0j38k3N1J42k24K32j24M0Km0J72l54K97P1o6j67K08j85j17K69l10r6L87
4584A08j1j5J11k20kK03q9j65n0J25k5n3P8n6K34j05J6m8K16k16j22R9K5K87n57
4609b32L07k08J27P5j08Rk58K75n8J96k26R4J22k10M5N8k18Q8K32k12J10M3j37
$$ plain form
4632 -86 -80 -16 137 192 65 -13 -29 -49 131 42 126 -143 102 205 38 124 -47 -2 -17 -77 157 -246 -88 -73 26
4657 26 95 102 114 91 151 -14 132 -85 -21 25 -32 199 66 225 46 -40 -66 213 37 50 192 51 77 159 -73
4682 -73 -34 -67 -49 -7 76 -199 76 -60 92 51 -108 220 -95 60 -32 106 -25 -62 -225 -223 -24 -193 29 -67
4706 -67 71 -209 -37 -161 85 29 23 -79 -124 164 -73 -4 29 42 62 110 2 100 235 -127 194 22 -132 -137
4730 -137 132 334 -87 28 -95 147 -158 -95 59 -27 111 -181 46 -60 13 -10 -128 215 37 253 -5
4751 -5 69 39 -24 -40 -12 64 -123 327 94 243 22 201 177 89 -194 -102 219 -68 -108 52 -14 -120 -46 -87 -18
4776 -18 0 -276 78 -126 -59 -96 -83 -10 -241 -16 -199 -34 -63 -41 -32 -126 5 28 4 240 82 155 -71 145 -154
4801 -154 -61 171 224 -30 108 219 -59 -98 -97 123 -108 158 189 270 68 105 48 186 -62 -8 -60 -9 -14 -162 12
$$ packed form
4632h6OO4J53N5j27p8j6k0J80q9Q4k69K45J03j67Q6j71M5j5o0K34m03J58J5R9
4657B6O9PJ2k3O0j65J46k17O4M6n7K31j33J59j79q6k6K79j76J3J42j41K6Q2k32
4682g3L9l3J8M2Q3k75K75j36J52m1j59L28l15J55r2J38j31l7j63KJ99j69K22r6
4706f7J38k80J72j24K46n6oj02m5K88k37O9L3J3K0M8j08R8J35l62L21j72j54n
4730a37K69K02m21J15j23K42l05O3J54q6J38k92K27j06P3k3j18L43j78K16k58
4751eP4l0o3j6K8P6j87M50k33J49k21J79k4q8k83R2L21k87m0J60o6j06P4m1O9
4776a8J8k76L54k04O7l7J3P3k31K25j83J65k9K2Rr4J31K3k4K36j58P3k26K16k99
4801a54R3K32N3k54J38J11k78l9JK20k31K66L1Q1k02L7n7J38k48N4n2N1nj48J74
$$ plain form
4826 12 -18 54 -165 71 -101 -101 222 -89 86 -117 -105 -75 -107 154 14 -79 -43 -38 -232 -86 36 -92 7 -166
4850 -166 86 -78 203 -58 -225 76 -113 -61 -65 176 -223 54 -196 7 49 -79 -21 -201 -16 -117 -33 -39 -181
4873 -181 -160 -79 75 -31 174 249 149 48 19 20 15 24 -12 94 -106 -8 129 51 161 98 174 -40 161 -51 16
4898 16 -17 24 111 -87 32 -151 81 -219 -26 -215 -194 14 -48 -22 -18 114 165 -223 64 -45 -57 -130 204 116
4922 116 70 97 -30 -53 -170 -42 20 142 -69 -13 -202 217 170 -84 130 -74 51 -206 28 1 67 -81 -218
4945 -218 -92 -8 -4 202 59 -69 43 -166 -121 135 189 -41 344 121 -86 106 -3 13 -28 16 -19 129 184
4968 184 207 29 -93 235 -3 1 66 117 104 95 -60 -169 -97 106 52 -37 -138 97 -131 24 -39 -119 90 -134
4992 -134 -17 135 -65 -125 2 -20 -93 8 -118 29 71 -177 -164 167 52 -212 79 26 48 -179 74 -40
$$ packed form
4826A2l0P2k19K36j72%L23l11J75k03J2L0l2K61j40r3L6Nj94J46J22j28R9j73
4850a66K52j64K81k61j67L01j89N2mK41l99K77k50K03M2j28N8j80J85j01Q4oj42
4873a81K1Q1J54j06K05P5j00j01k9JnRl6J06k00R8J37p8J10o3P6k14K01k12O7
4898A6l3M1Q7j98J19j83K32l00J93j89K1K08o2K6MJ32N1l88K87j09j2p3L34q8
4922A16m6K7j27k3j17J28O2J22k11N6j89M19m7k54K14k04J25k57K34k7O6j48j37
4945b18J26Q4MK06j43j28J12k09M5K56N4k30L85k23k07J92j09J6m1M4l5J48N5
4968A84K3j78j22L28k38MO5N1j3rj55j09P2K03n4q9j01K35k28J55o3q0K09k24
4992a34J17J52k00o0J27k2p3J01j26J47M2k48J3L31j15k64K91n3K2k27K53j14
$$ plain form
5014 -40 24 69 -115 -68 -83 -47 -7 -79 -68 -11 5 -127 64 -36 -224 27 -72 -26 -131 39 -53 -75 14 193 15
5039 15 -20 53 105 23 -24 77 106 156 49 94 -168 -114 37 -63 -204 -25 198 -54 -101 -19 13 -53 -61 -24 -205 -88
5065 -88 -109 -211 -220 7 -52 -175 -84 24 -49 -44 90 -311 -85 37 -47 35 47 65 -200 -172 11 -35 -92 34 206
5090 206 -168 41 143 75 -140 116 25 -13 -16 -42 56 -67 99 27 -107 -100 -78 93 -162 -53 68 -44 55 18
5114 18 112 19 115 94 -17 -159 164 158 -31 -11 98 -31 38 159 137 142 42 175 81 -72 42 -4 131 -146 -108
5139 -108 -26 -68 -17 -53 -64 54 -63 -69 -18 79 -127 68 -88 -115 -36 -178 140 -153 -172 6 85 -32 -87 117 -73
5164 -73 -13 40 -79 166 87 -8 264 20 -6 69 -28 59 -57 -96 3 -90 92 -25 -50 79 -10 -194 28 -99 -130
5189 -130 28 53 -2 7 97 -267 52 -74 -38 -312 149 -253 -185 130 -44 15 -10 58 -252 -56 75 182 66
$$ packed form
5014d0O4M5j84M7j5L6M0p2J1N7J6j32J91j00j88K51r9M6j05J70r2k2Q9J79j78
5039A5l5P3N2q2m7J01K9N0j07M5k62N4J51j00j41J79K23k52m7Q2L2o6qL7j81J17
5065h8k1j02rK27n9j23R1J08p3NJ34m01K26J22q4Q2J2J8k65K8J83m6n7J26J72
5090B06l74K09J02o8k15K56r1l8lk6R8j23J66p2j34PK2J71k55J09J21j12R9l7
5114A8R4r3R6k1j11j42L23oj89K0J09j29O9J21k2Nj00J33r4j53J14m6J35k77L8
5139a08Q2m2N1l6j1J18j17oN1R7k06J95j56k7P9j42L18k93j9J78P9j17n5K04j90
5164g3O0N3j19K45p9r5K72k44k6P5r7Q7j16l9R9r3J82j17k5J29q9j84K22j27l1
5189a30J58K5n5RR0l64L19j26L6k74M61m02O8L15j74N9k5O8l10J96J31J07j16
$$ plain form
5212 66 -204 161 -76 60 -22 12 33 -188 97 -182 -35 -10 -301 -20 -138 -104 -53 27 -47 104 -75 -15 -16 -88
5236 -88 10 -173 99 -142 40 103 -29 27 -128 108 -85 -36 143 47 -6 197 -48 -57 139 -47 138 -64 -5
5259 -5 -162 9 -247 98 -164 -135 122 -136 -26 144 -63 -132 -29 3 -120 -57 21 -122 63 -89 -244 -23
5281 -23 -25 -13 -25 -93 -15 9 96 18 66 124 28 168 -144 -71 -51 163 70 49 132 5 -29 -15 58 -201 -169 -93 -92 -14 -170
5310 -170 -68 -299 170 -50 -32 -31 -246 19 6 -131 -200 -44 40 -58 -44 272 -182 -187 61 16 101 50 263 -62
5334 -62 20 147 -2 -58 49 -47 207 -61 263 83 -41 26 93 -136 95 -147 -8 -41 -180 45 -124 249
5356 249 42 25 -112 -30 -19 -16 -202 138 141 -73 46 163 20 3 44 -104 259 -14 -33 -100 -40 -75 63 -11 130
5381 130 80 -10 32 -130 -45 10 -74 -167 112 -168 89 -88 182 -112 -50 91 -48 37 -127 222 -52 112 -20
$$ packed form
5212F6k70L65k37J36q2L4K1k21K85k79J47K5k91K81j18L4N1Q0p4J51j79O0jp2
5236h8R8j83K72k41J82O3j32N6j55K36j93M9J79r6n3K03k45rJ96j86J85k02N9
5259ej57J71k56L45k62K9K57k58J10J70k07o9J03L2j23O3P8j43J85j52j55K21
5281b3kJ2j2o8P8K4Q7p8M8N8r6J40l12P3K0K14r3k1Q3j27l4J4P3k59L2P6JP8j56
5310a70J02k31M69k20J8Jk15K65j3j37o9J56Q4r8J4L16m54nK48m5Q5n1K13l25
5334f2Q2J27j49n6J07r6K54k68L24j80j24O7O7k29K31k42J39l3j39K25j69L73
5356B49k07j7j37Q2J1Lj86L40Lk14J19J17j43j7M1j48L63k73j9o7O0l5J38p4J41
5381A30n0r0M2j62Q5N5q4r3K79k80K57j77K70k94O2J41j39Q5j64L49k74J64j32
$$ plain form
5404 -20 40 111 -61 12 109 160 47 33 39 179 105 -82 36 238 51 -74 133 150 154 -64 11 -51 -78 239 -109
5429 -109 -134 -4 -190 114 -194 93 -155 -66 -109 -1 -149 -2 -38 -81 133 -110 167 100 -8 -55 -34 -42 -75 -25
5453 -25 148 26 3 -122 -54 121 98 89 -6 -88 97 -221 -3 49 -73 35 -121 134 82 36 107 -204 -138 29
5477 29 -40 -106 168 -182 249 -30 -87 -166 143 172 105 -62 55 -54 -180 -49 196 41 -103 128 129 250 81
5500 81 -21 -84 136 -73 12 -197 145 -106 240 -177 -108 -250 -91 69 -129 -145 -167 -189 13 -50 -97 -1 -33 -129
5524 -129 84 -101 68 69 -105 51 -92 68 -51 260 -261 -22 -39 69 160 -245 111 -172 -77 -110 -155 64
5546 64 -56 100 8 -57 -225 -89 -76 -68 -56 -134 10 -124 -4 -163 -46 -37 -183 50 -58 159 -15 62 24 229
5570 229 129 2 -69 -25 -129 -48 182 -39 166 9 63 -7 -79 217 -48 37 83 17 -160 -250 -85 -90 -28 -189
$$ packed form
5404b0O0P1j72P3R7N1j13j4OJ40p4j87J18K02j87j25K07J7Mk18P5o2k7L17l48
5429a09k5J30j86L04l08K87k48Q9m3J08j48J47l6m3K14k43K77o7j08m7K1ql3N0
5453b5J73j22k3j25O8J75k3rr5q2J85l18K18N2j22J08j56K55n2m6P1l11O6J67
5477B9o9o6K74l50M31k79n7p9L09K9o7j67J17j09j26J31K45j55j44K31JJ21j69
5500H1j02o3K20k09Q5k09L42k51L46m17O9j42J59J60j98j6k2k2K02o3m7R6l2r6
5524a29K13j85J69Jj74J56j43J60j19L11n21K39j7J08R1m05L56k83R5l3m5K19
5546F4j20J56r2o5j68J36J3QJ2p8J44j34J20j59J17Rj46K33j08K17j74P7l8K05
5570B29j00j27p1M4j04Q1K30k21K05j57N4p0p2K96k65Q5M6o6j77r0J65nO2j61
$$ plain form
5594 -189 -140 -105 110 -96 -151 -99 -208 -48 -58 166 -25 0 -75 126 -76 25 162 -116 4 94 114 -148 -4
5617 -4 26 26 0 -63 -127 -128 47 185 1 38 -117 12 70 57 -84 162 -6 -154 -79 8 -58 -38 95 -19 226 -22
5643 -22 107 81 148 -280 -57 39 48 20 43 202 37 -24 63 -20 -9 50 53 -70 -11 78 -41 -23 25 99 -72 138 -64
5670 -64 -29 64 -60 -116 -108 -85 12 24 -120 -126 2 37 -64 -197 -51 -130 45 -72 57 -62 -104 -20 -251 13 -78
5695 -78 12 47 45 125 -182 59 -12 -38 -114 180 -62 125 -218 -86 82 -21 -133 -79 -12 2 -122 -132 -187 33 37
5720 37 -30 -33 0 15 -137 69 -99 -84 -140 -198 100 -40 -7 108 -6 -41 244 -56 94 -37 -4 81 -164 89
5744 89 -66 -26 13 27 -43 -8 -123 -115 -17 7 97 -82 162 -25 -201 106 -150 86 -2 10 15 230 -35 -75 -158 107
5770 107 204 69 -25 14 138 116 115 161 136 74 112 118 -26 98 38 15 65 72 57 -116 -13 39 -125 -44 -69 -78 14 3
$$ packed form
5594a89M9L5K15k06n5N2j09J60j0K24j91K5p5K01k02J01J37k78J20R0K0k62J44
5617dL0%k6o3o4jJ75J38j84L7j55J29N8j3j41K46j68j48P5Q7o6K0J33j14K45k48
5643b2J29k6O7m28K23R6Rk8K3J59j65o1Q7q3J1N9Lj23N9Q9j19J8M8P4j71K10k02
5670f4L5R3j24n6QK3R7J2j44oJ28L5j01j33J46p9J75j17J29j19m2Q4k31K64r1
5695g8R0L5kQ0l07K41p1k6p6K94k42J87l43J32J68j03j12N4O7J4j24j0n5K20M
5720C7o7lL3J5j52K06j68J5n6n8K98j40L3J15j14l5K85l00J50j31L3Q5k45K53
5744H9j55M0L9J4p0L5j15QR8K4R0j79K44j87j76L07k56K36q8J2NK15k65m0q3K65
5770A07R7j35r4L9J24k2jM6k5o2L8Oj44J24o0k3N0Pj5j73J03N2j64Q1k5rR2j1
$$ plain form
5798 3 49 -46 -58 -1 -90 -171 137 -79 22 44 41 77 -64 -39 -113 -34 -60 17 37 233 137 118 -71 -120 45 52 85 -43
$$ packed form
5798CM6r5j2N7q9q1L08k16J01K2lL6j41K5p4P9k6P7K0J96r6j9j89m9J65PL3j28
$$ [...]
8191g
##END NTUPLES=NMR FID
##END=
