##TITLE=1H_K-398/1
 CDCl3, 8 sc, 
 23.9.2020
##JCAMPDX= 6.0         $$ Bruker NMR JCAMP-DX V2.0
##DATA TYPE= NMR FID
##DATA CLASS= NTUPLES
##ORIGIN= UXNMR, Bruker Analytische Messtechnik GmbH
##OWNER= root
$$ XWIN-NMR		Version 3.5
$$ Wed Sep 23 11:01:46 2020 Russian Standard Time (UT+4h)  she@DPX200
##.OBSERVE FREQUENCY= 200.1315066352
##.OBSERVE NUCLEUS= ^1H
##.DELAY= (6, 6)
##.ACQUISITION MODE= SIMULTANEOUS
##.ACQUISITION SCHEME= undefined
##.AVERAGES= 8
##.DIGITISER RES= 18
##SPECTROMETER/DATA SYSTEM= spect
##.PULSE SEQUENCE= zg30
##.SOLVENT NAME= CDCl3
##.SHIFT REFERENCE= (INTERNAL, CDCl3, 0, 15.7039)
##AUDIT TRAIL= $$ (NUMBER, WHEN, WHO, WHERE, WHAT)
$$ ##TITLE= Audit trail, XWIN-NMR		Version 3.5
$$ ##JCAMPDX= 5.01
$$ ##ORIGIN= Bruker BioSpin GmbH
$$ ##OWNER= she
$$ F:/spectra/data/she/nmr/H-F/1/audita.txt
$$ ##AUDIT TRAIL=  $$ (NUMBER, WHEN, WHO, WHERE, WHAT)
(   1,<2020-09-23 11:00:40.23 +0400>,<she>,<DPX200>,
      <created by zg, POWCHK disabled, PULCHK disabled
       configuration hash MD5:
       00 E9 B6 7A A2 85 ED C7 34 08 36 98 17 FE 4E 26
       data hash MD5: 16K
       02 80 7D 61 87 3B 9C 66 AF 9C 89 6D 85 32 49 2A>)
$$ ##END=
$$ 
$$ hash MD5
$$ 4C 43 48 CA 6E 28 1D F6 E9 1F 03 55 72 B7 B3 9A
##$RELAX= 
##$RELAX= 
##$RELAX= 
##$RELAX= 
##$RELAX= 
##$RELAX= 
$$ Bruker specific parameters
$$ --------------------------
##$DU= <F:/spectra>
##$EXPNO= 1
##$NAME= <H-F>
##$PROCNO= 1
##$TYPE= <nmr>
##$USER= <she>
##$AMP= (0..31)
100 100 100 100 100 100 100 100 100 100 100 100 100 100 100 100 100 100 
100 100 100 100 100 100 100 100 100 100 100 100 100 100 
##$AQSEQ= 0
##$AQ_mod= 1
##$AUNM= <au_zg>
##$AUTOPOS= <>
##$BF1= 200.13
##$BF2= 200.13
##$BF3= 200.13
##$BF4= 200.13
##$BF5= 200.13
##$BF6= 200.13
##$BF7= 200.13
##$BF8= 200.13
##$BYTORDA= 1
##$CFDGTYP= 0
##$CFRGTYP= 5
##$CHEMSTR= <none>
##$CNST= (0..31)
1 1 145 1 1 1 1 1 1 1 1 1 1 1 1 1 1 1 1 1 1 1 1 1 1 1 1 1 1 1 1 1 
##$CPDPRG= <>
##$CPDPRG1= <>
##$CPDPRG2= <>
##$CPDPRG3= <>
##$CPDPRG4= <mlev>
##$CPDPRG5= <mlev>
##$CPDPRG6= <mlev>
##$CPDPRG7= <mlev>
##$CPDPRG8= <mlev>
##$CPDPRGB= <>
##$CPDPRGT= <>
##$D= (0..31)
0 1.2 0 0 0 0 0 0 0 0.06 0 0.03 0 0 0 0 0.0002 0 0 0 0 0 0 0 0 0 0 0 0 
0 0 0 
##$DATE= 1600844439
##$DBL= (0..7)
120 120 120 120 120 120 120 120 
##$DBP= (0..7)
150 150 150 150 150 150 150 150 
##$DBP07= 0
##$DBPNAM0= <>
##$DBPNAM1= <>
##$DBPNAM2= <>
##$DBPNAM3= <>
##$DBPNAM4= <>
##$DBPNAM5= <>
##$DBPNAM6= <>
##$DBPNAM7= <>
##$DBPOAL= (0..7)
0.5 0.5 0.5 0.5 0.5 0.5 0.5 0.5 
##$DBPOFFS= (0..7)
0 0 0 0 0 0 0 0 
##$DE= 6
##$DECBNUC= <off>
##$DECIM= 32
##$DECNUC= <off>
##$DECSTAT= 4
##$DIGMOD= 1
##$DIGTYP= 9
##$DL= (0..7)
0 120 120 120 120 120 120 120 
##$DP= (0..7)
150 150 150 150 150 150 150 150 
##$DP07= 0
##$DPNAME0= <>
##$DPNAME1= <>
##$DPNAME2= <>
##$DPNAME3= <>
##$DPNAME4= <>
##$DPNAME5= <>
##$DPNAME6= <>
##$DPNAME7= <>
##$DPOAL= (0..7)
0.5 0.5 0.5 0.5 0.5 0.5 0.5 0.5 
##$DPOFFS= (0..7)
0 0 0 0 0 0 0 0 
##$DQDMODE= 0
##$DR= 18
##$DS= 0
##$DSLIST= <SSSSSSSSSSSSSSS>
$$ [...]
##$SUBNAM2= <"">
##$SUBNAM3= <"">
##$SUBNAM4= <"">
##$SUBNAM5= <"">
##$SUBNAM6= <"">
##$SUBNAM7= <"">
##$SUBNAM8= <"">
##$SUBNAM9= <"">
##$SW= 16.880792210976
##$SWIBOX= (0..15)
0 0 2 0 0 0 0 0 0 0 0 0 0 0 0 0 
##$SW_h= 3378.37837837838
##$TD= 16384
##$TD0= 1
##$TE= 0
##$TE2= 300
##$TE3= 300
##$TEG= 300
##$TL= (0..7)
0 120 120 120 120 120 120 120 
##$TP= (0..7)
150 150 150 150 150 150 150 150 
##$TP07= 0
##$TPNAME0= <>
##$TPNAME1= <>
##$TPNAME2= <>
##$TPNAME3= <>
##$TPNAME4= <>
##$TPNAME5= <>
##$TPNAME6= <>
##$TPNAME7= <>
##$TPOAL= (0..7)
0.5 0.5 0.5 0.5 0.5 0.5 0.5 0.5 
##$TPOFFS= (0..7)
0 0 0 0 0 0 0 0 
##$TUNHIN= 0
##$TUNHOUT= 0
##$TUNXOUT= 0
##$USERA1= <user>
##$USERA2= <user>
##$USERA3= <user>
##$USERA4= <user>
##$USERA5= <user>
##$V9= 5
##$VALIST= <valist>
##$VCLIST= <CCCCCCCCCCCCCCC>
##$VD= 0
##$VDLIST= <DDDDDDDDDDDDDDD>
##$VPLIST= <PPPPPPPPPPPPPPP>
##$VTLIST= <TTTTTTTTTTTTTTT>
##$WBST= 1024
##$WBSW= 4
##$XGAIN= (0..3)
0 0 0 0 
##$XL= 0
##$YL= 0
##$YMAX_a= 590000
##$YMIN_a= -543374
##$ZGOPTNS= <>
##$ZL1= 120
##$ZL2= 120
##$ZL3= 120
##$ZL4= 120
##$ABSF1= 10
##$ABSF2= 0
##$ABSG= 5
##$ABSL= 3
##$ALPHA= 0
##$AQORDER= 0
##$ASSFAC= 0
##$ASSFACI= 0
##$ASSFACX= 0
##$ASSWID= 0
##$AUNMP= <proc_1d>
##$AZFE= 0.1
##$AZFW= 0.1
##$BCFW= 1
##$BC_mod= 2
##$BYTORDP= 1
##$COROFFS= 0
##$CY= 11.3945322036743
##$DATMOD= 1
##$DC= 2
##$DFILT= <>
##$DTYPP= 0
##$F1P= 16.9975609425685
##$F2P= -3.02152046262296
##$FCOR= 0.5
##$FTSIZE= 0
##$FT_mod= 4
##$GAMMA= 1
##$GB= 0.15
##$INTBC= 1
##$INTSCL= 1
##$ISEN= 128
##$LB= 0.24
##$LEV0= 0
##$LPBIN= 0
##$MAXI= 10000
##$MC2= 0
##$MEAN= 0
##$ME_mod= 0
##$MI= 1.114404
##$NCOEF= 0
##$NC_proc= 0
##$NLEV= 6
##$NOISF1= 3.799351
##$NOISF2= 2.8
##$NSP= 1
##$NTH_PI= 0
##$NZP= 0
##$OFFSET= 15.70392
##$PC= 1
##$PHC0= -9974.608
##$PHC1= 16.8009
##$PH_mod= 1
##$PKNL= yes
##$PPARMOD= 0
##$PSCAL= 0
##$PSIGN= 0
##$REVERSE= no
##$SF= 200.130013532006
##$SI= 16384
##$SIGF1= 3
##$SIGF2= 2
##$SINO= 400
##$SIOLD= 16384
##$SREGLST= <1H.CDCl3>
##$SSB= 0
##$STSI= 0
##$STSR= 0
##$SW_p= 3612.71676300578
##$SYMM= 0
##$S_DEV= 0
##$TDeff= 0
##$TDoff= 0
##$TI= <>
##$TILT= no
##$TM1= 0
##$TM2= 0
##$TOPLEV= 0
##$USERP1= <user>
##$USERP2= <user>
##$USERP3= <user>
##$USERP4= <user>
##$USERP5= <user>
##$WDW= 1
##$XDIM= 8192
##$YMAX_p= 0
##$YMIN_p= 0
$$ End of Bruker specific parameters
$$ ---------------------------------
##NTUPLES= NMR FID
##VAR_NAME=  TIME,          FID/REAL,        FID/IMAG
##SYMBOL=    X,             R,               I
##VAR_TYPE=  INDEPENDENT,   DEPENDENT,       DEPENDENT
##VAR_FORM=  AFFN,          ASDF,            ASDF
##VAR_DIM=   8192,          8192,            8192
##UNITS=     SECONDS,       ARBITRARY UNITS, ARBITRARY UNITS
##FACTOR=    0.000296,      1,               1
##FIRST=     0,             0,               0
##LAST=      2.424536,      0,               0
##MIN=       0,             -543374,         0
##MAX=       2.424536,      590000,          0
$$ Real data points
##PAGE= N=1
##DATA TABLE= (X++(R..R)), XYDATA
0@%%%%%%%%%%Qj6J6j6K4l2M0n4O6q0R8j18J41j69K00k37K78l25L78m36N05n80
$$ 0 0 0 0 0 0 0 0 0 0 0 8 -8 8 -8 16 -16 24 -30 36 -44 54 -64 77 -92 108 -129 149 -176 202 -234 271 -309
32c09O65p60Q62r74J098j237J392j563J748j948K168k410K671k958L274l617L991
$$ -309 356 -404 458 -516 582 -655 737 -826 922 -1026 1142 -1268 1403 -1555 1719 -1898 2093
49B093m397M843n334N874o468P125p859Q678r595J0633j1825J3201j4811J6728
$$ 2093 -2304 2539 -2795 3079 -3389 3736 -4123 4555 -5040 5593 -6232 6969 -7842 8886
63H886j9047K1919k5577L0398l7043M6893r3974M09818p38210K77607K32756o57800
$$ 8886 -10161 11758 -13819 16579 -20464 26429 -67545 342273 -395937 -118330 114426 -543374
75e43374Q14746l90577j40855M92474n39074K94352J75452m04027L07309j67392
$$ -543374 271372 -119205 -260060 232414 -306660 -12308 163144 -240883 66426 -100966
85a00966j1609K16909j99104j0989J03336p2733K0212J23862j78001J648J91193
$$ -100966 -112575 104334 -94770 -105759 -2423 -75156 -54944 68918 -109083 -107435 83758
96H3758k04648J92501p5366k19288M09604k73738M363K67479m55642L73530l5514
$$ 83758 -120890 71611 -3755 -223043 186561 -87177 -82814 184665 -270977 102553 67039
107F7039k76802M68813m48364J15671L20186m76995L66149j25615k03365M27766
$$ 67039 -209763 259050 -189314 -73643 246543 -230452 135697 10082 -193283 234483
117B34483l46709R6884J44456l17408L00498o6079j13150J45414j53349J19090
$$ 234483 -112226 -15342 129114 -188294 112204 46125 -67025 78389 -74960 44130
127D4130J9394r8798M8965k9961K3879p548J3596l8260k7588P2924n1124N7556
$$ 44130 63524 -35274 13691 -16270 7609 61 13657 -24603 -52191 20733 -30391 27165
139B7165m7155o7285J61687j15934M3883L8689j63571K00778j05106k8492J45344
$$ 27165 -19990 -87275 74412 -41522 2361 41050 -122521 78257 -26849 -55341 90003
150I0003k43464J69928K8716j61291J97223j69671M5832J46812k07289J62212
$$ 90003 -153461 16467 45183 -116108 81115 -88556 -42724 104088 -103201 59011
160E9011n2328r0609J86532j38499M4636J6507j05848J46954o1489l6005N1952
$$ 59011 6683 -83926 102606 -35893 8743 25250 -80598 66356 4867 -31138 20814
171B0814n8187O4787m659l1247K3753k9562L2959M426j2596k2987l856M2738m3449
$$ 20814 -37373 27414 22755 -8492 15261 -14301 18658 23084 10488 -12499 -16355 26383 -17066
184a7066L3861k0731l5915P8763n7301L6124R708q9472J01594l0692k8056N5062
$$ -17066 16795 -3936 -39851 38912 -18389 17735 27443 -62029 39565 8873 -19183 35879
196C5879j03541P8688J7463q3362Q9654p4193J1883P3560p9556M6288j8626k6478
$$ 35879 -67662 11026 28489 -54873 34781 -39412 -27529 46031 -33525 12763 -5863 -32341
208c2341O7714m2640k827N531k5686M1787j5547q870J572j4321L6347l423p088
$$ -32341 35373 -7267 -10094 -4563 -30249 11538 -4009 -12879 -11307 -25628 10719 7296 208
221B08j2210N508K4584j7712R890k2448m370L6054k6049P778j629k4834M3202
$$ 208 -12002 -6494 18090 378 10268 -12180 -16550 19504 -6545 1233 -396 -25230 17972
234A7972j3320p869J6637l4645L6106Q02j8708J6373k9924K3306J2742k3984Q731
$$ 17972 4652 -3217 13420 -21225 14881 15683 -3025 13348 -16576 6730 19472 -4512 4219
247D219j1321M721J8239j4723j490m913N403J2102j2735L438j0860P659P741j0436
$$ 4219 -7102 -2381 15858 1135 -355 -5268 135 12237 -498 2940 -7920 -261 7480 -2956
261b956R915j8698O305J5090j3776P852r790m935K3675j4495j303M846j6615K2906
$$ -2956 6959 -11739 -5434 9656 -4120 3732 -6058 -10993 12682 -1813 -3116 1730 -14885 8021
275H021o186q751P830j3539J4268J529j0284N579m572J59J2201p238n282M851
$$ 8021 1835 -6916 914 -12625 1643 3172 -7112 -1533 -6105 -5946 6255 -983 -6265 -1414
289a414l083P470K032j1377j202J0880n873L596j721j1708J8344o766k07O495
$$ -1414 -4497 2973 5005 -6372 -7574 3306 -2567 1029 -692 -12400 5944 -822 -1029 5466
303E466j6201J5267J787j2658J4140j1882k045J7193j9691J3025j907j4749K6119
$$ 5466 -10735 4532 6319 -6339 7801 -4081 -6126 11067 -8624 4401 2494 -12255 13864
316A3864j3007k838J1235j5318J2143L090j5479J1929o737k886J4262j5367L861
$$ 13864 857 -1981 9254 -6064 6079 9169 -6310 5619 -1118 -4004 10258 -5109 -1248
329a248N492o459O633j626l385N270l190j924R943j1987O91Q875j3171Q188J08
$$ -1248 4244 -2215 4418 2792 -593 4677 1487 -437 9506 -2481 -1790 7085 -6086 2102 2210
344B210j2253J5277n136p987J8329j7268N881J2117k1083J7025o921o231J5056
$$ 2210 -10043 5234 98 -7889 10440 -6828 -947 11170 -9913 7112 191 -6040 9016
357I016j7877Q640O557j8580J8165n930q970J9637j9811P348Q380j7327J4764
$$ 9016 -8861 -221 6336 -12244 5921 -9 -8979 10658 -9153 -1805 6575 -10752 4012
370D012m211o289R414n977J558N144p491M123K338m744M604k018m386L756J046
$$ 4012 -199 -6488 2926 -3051 -1493 3651 -3840 283 2621 -2123 2481 463 -3923 -167 879
385H79m753N865p307N62J2787j6561J0258K589j2859J8834j0984k244J3859k0415
$$ 879 -3874 1991 -5316 -4754 8033 -8528 1730 4319 -8540 10294 -690 -2934 10925 -9490
399i490J3587L950j9378K0148j5030K326J6163k4949J6768j127j0521J9137j4858
$$ -9490 4097 8047 -11331 8817 -6213 -3887 12276 -12673 4095 2968 -7553 11584 -3274
412c274J431Q305j3039J4495m721j0876J4470p894J962K734o396L084j103k55
$$ -3274 -1843 6462 -6577 7918 3197 -7679 6791 -1103 859 3593 -2803 281 -822 -1077
426a077J009K162r304L826J1487j2348L954J740n744J2144j0447J405J0084k2280
$$ -1077 -68 2094 -7210 -3384 8103 -4245 -291 1449 -4295 7849 -2598 -1193 8891 -13389
440a3389K0901j022j9528K0927j7934R801R454k5947K2079k985j2155K2036j5606
$$ -13389 7512 6490 -13038 7889 -10045 -244 9210 -16737 5342 2357 -9798 12238 -3368
453c368J811P468j3692J9343j1476j0063J5888p392J775l38k927J972l60K860
$$ -3368 -1557 5911 -7781 11562 86 -9977 5911 -1481 294 -44 -2971 -999 -1359 1501
467A501n27k095n047O567Q292j3341J987O115o466J1944j2726J635J1737k1210
$$ 1501 974 -1121 -6168 399 8691 -4650 -2663 3452 -3014 8930 -3796 -2161 9576 -11634
481a1634K0465r17j8899J6714q695O629N316k1572J6998q82q119J5188j3992M189
$$ -11634 8831 7914 -10985 5729 -2966 3663 8979 -12593 4405 3523 -4596 10592 -3400 789
495G89K198l180J4742j7541l94R054m156M272r874L10M857m981P241m728m719
$$ 789 2987 -193 14549 -2992 -3386 5668 1512 5784 -4090 -3780 1077 -3904 3337 -1391 -6110
510f110M739k447J2671j0948q096J4289o679N050l080o174P401o700O541L193
$$ -6110 -1371 -3818 8853 -2095 -10191 4098 -2581 2469 -611 -6785 616 -6084 457 3650
524C650j3392L051M304M595j781j2081J0150J951r61L416o790N130m658P054O163
$$ 3650 -9742 -6691 -2387 2208 427 -11654 -1504 447 -514 2902 -3888 1242 -3416 3638 9801
539I801j6830N826L228J02N877j5957O995P977j3869J5298o041j0057J2954n461
$$ 9801 -7029 -1203 2025 2127 8004 -7953 -958 7019 -6850 8448 2407 -7650 5304 -157
553a57O896k664j2832J3150J899p147K517k773L5K694L38J755o550j473O852L747
$$ -157 6739 4075 -8757 4393 6292 -855 1662 -1111 -1076 1618 1956 3711 -2839 -4312 2540 6287
569F287q749l389O532k018M527m621k950P227p881Q260M203j6288Q337L578m267
$$ 6287 -2462 -5851 681 -1337 3190 -1431 -4381 2846 -5035 3225 7428 -8860 -523 3055 -1212
584a212P426j3950M633P909j2064J2521o680q780J3772m099K849Q5j1280J2483
$$ -1212 6214 -7736 -3103 4806 -7258 5263 -1417 -10197 3575 -524 2325 2410 -8870 3613
598C613K971q793M259n407R88N695l001j222k904M99N154K913p932j475O107k10
$$ 3613 6584 -2209 2050 -3357 -2369 3326 325 -897 -3801 -3302 1852 4765 -3167 -4642 1465 1255
614A255J437k611m443M349R28j72K850r502K433P221k284N05p666L737N909m364
$$ 1255 2692 81 -4362 -13 915 743 3593 -5909 -3476 3745 1461 1966 -5700 -1963 3946 -418
630d18J935m279k990Q328j875j305m07o174R170J823n419R47k331L263K565k041
$$ -418 1517 -2762 -5752 2576 701 -604 -1011 -7185 1985 3808 -1611 -664 -2995 268 2833 792
646G92k674k218K127M349j269m679j499M138L918k324k241k380M078J752j353
$$ 792 -1882 -4100 -1973 2376 1107 -3572 -5071 -933 2985 661 -1580 -3960 118 1870 517
661E17N35o516L054N507k442j657l238J630N718j479k264j494o53N814l34j777
$$ 517 1052 -5464 -2410 3097 655 -1002 -4240 -2610 3108 1629 -635 -2129 -2782 3032 2698 921
677I21l367j312Q353j784l085m97j730M714J777l877p19j600K496N025m511k393
$$ 921 -2446 -3758 4595 2811 -274 -771 -2501 2213 3990 113 -606 -2206 290 5315 804 -1589
693a589n02L247K777k649k634j715L981K478j956k717j919L346L086k016k280
$$ -1589 -2091 1156 3933 1284 -1350 -3065 916 3394 1438 -1279 -3198 148 3234 1218 -1062
708a062j273J404M541k825j026j751m02N879k683j420j527o82N269m07l104n27
$$ -1062 -2335 -931 3610 785 -241 -1992 -2394 3485 802 -618 -2145 -2827 2442 2035 -1069 -1596
724a596q58M773J119m720P69j728L272K278m630J5k67J341L012k443k354N05J690
$$ -1596 -2454 2319 3438 -1282 -513 -2241 1031 3309 -1321 -1306 -1573 -232 2780 337 -2017 -1512 178
741A78K221n85l578j6J917K374j623j851k319L040L553k817r77j678K120L289
$$ 178 2399 1814 -1764 -1780 137 2511 888 -963 -3282 -242 3311 494 -483 -2161 -41 3248
757C248k259j765p85K74L257r50k354l21l83M351q78k857J388j774L953Q17l429
$$ 3248 989 -776 -1561 -1287 1970 1020 -1334 -1655 -2038 2313 1435 -1422 -34 -1808 2145 2962 -467
774d67j134O07K047O59k670j022M63J960J410k496k08L4J336K426k263j303k77
$$ -467 -1601 -994 1053 1712 -958 -1980 -1517 443 1853 -643 -851 -817 519 2945 682 -621 -898
791h98K064L86o80j643j022K249J423r42j792J95J074J514r71j228o08J481J408
$$ -898 1166 1552 872 -771 -1793 456 1879 937 -855 -660 414 1928 957 -271 -879 602 2010
808B010j552J25j770Q00K214j445k29j310N32J869l76j226p50m99K181J89j586
$$ 2010 458 583 -1187 -387 1827 382 153 -1157 -625 1244 868 -358 -1108 -1607 574 763 -823
825h23o01k31L007l90j768O62j85P99O21r14j131K6Q96R31p65j638N95J073L67
$$ -823 -1424 -1655 1352 962 -806 -144 -329 470 1091 177 -954 -928 -32 899 134 -1504 -909 164 531
844E31k21l07j306J919K05M20j607j335L501j605m39N16k321K910j30j877K308
$$ 531 310 3 -1303 616 821 1241 -366 -1701 1800 195 -244 272 -2049 861 731 -1146 1162
861A162k688O59K623l385K400j440m84L503l220J352l5j499K884j170j104J034
$$ 1162 -1526 -867 1756 -1629 771 -669 -1153 2350 -870 482 447 -1052 1832 662 -442 592
877E92j545J648Q02k497Q07L02J90K57M4n72P37L84j223K347k834k01K931k918
$$ 592 -953 695 1497 -1000 -193 109 299 556 600 28 765 1149 -74 2273 -561 -762 2169 -749
895g49J346m72k355M152k672m37L093m629L100N08k887L855m614K364K368n081
$$ -749 597 125 -2230 1922 -750 -1187 1906 -2723 377 885 -2002 1853 -2761 -397 1971 -3110
911c110L793j162j188K994k831J677P97l548M047j593k08L38j005K384k385P76
$$ -3110 683 -479 -1667 1327 -1504 173 970 -2578 1469 -124 -332 6 -999 1385 -1000 -224
927b24J115j272J021n05J162r01j148J743j146J91K7r89K535l616J169K851m614
$$ -224 891 -381 640 135 1297 396 -752 991 -155 36 63 -926 1609 -2007 -838 2013 -2601
944b601L222j371L51J735m282M214q88l035M400l296J193J229m519O213l491j623
$$ -2601 621 -750 -399 1336 -2946 1268 380 -2655 1745 -1551 -358 871 -3648 2565 -926 -2549
960b549M881n047L178k4k531M127l988J238K959m423J927P73j222K188k631J303
$$ -2549 2332 -2715 463 439 -2092 2035 -1953 -715 2244 -2179 -252 521 -701 1487 -1144 159
976A59Q56j791R86M35o64j551K260l84l40N98k259L340o15l001M727l326o69M141
$$ 159 1015 -776 210 645 -19 -1570 690 306 -34 564 -1695 1645 1030 -1971 2756 -570 -1239 2902
994B902m600L142j458k472O619n766Q67L253n162M751j774j871M481n249K677
$$ 2902 -1698 1444 -14 -2486 4133 -1633 -766 2487 -2675 2076 302 -1569 2912 -2337 340
1009C40K407m970L158j260L1K013l317K011j39q41J026l01k85j111J362O78j367
$$ 340 2747 -2223 935 -325 -294 1719 -1598 413 274 -567 459 158 -127 -1238 124 802 -565
1026e65oo71J618P3k082K570j563l84K679k943J986j814m28M207m414J047J196
$$ -565 -571 -1242 376 449 -1633 937 -626 -1010 1669 -1274 712 -1102 -1530 2677 -1737 -690 506
1043E06k421L692k368j18K208l885L630R2k717K161j873K500m92k489K919k059
$$ 506 -1915 1777 -591 -709 1499 -2386 1244 1336 -1381 780 -1093 1407 915 -1574 1345 -714
1059g14P63J735k249Q38p28K31K239k643qO93N07K07j680J268o38K02J027q85
$$ -714 49 1784 -465 373 -355 -124 2115 -528 -536 157 664 871 -809 459 -179 23 1050 165
1077A65N22j258J096Q93j886N17o19N8K290k856J367pk011L983k595l4R15j852
$$ 165 687 -571 525 1418 -468 49 -570 -512 1778 -1078 289 282 -1729 2254 -341 -375 540 -1312
1095a312L052j592j615K392j629J292N60k673K249j374Q47J408k970J419p3Q4
$$ -1312 1740 148 -1467 925 -704 588 1148 -1525 724 -650 197 1605 -1365 54 -19 65
1111F5J114k121O56J46K35O46q38j76m9P98O71j654L69k77M57J275k256J058m13
$$ 65 1179 -942 -286 -140 95 741 -97 -273 -322 476 1147 -507 -138 -415 42 1317 -939 119 -294
1130b94J38K049k399N32K83n95K128j820j016J768j356J654l03j627J245q43J527
$$ -294 -156 1893 -506 26 309 -286 1842 22 -994 774 -582 1072 769 -858 387 -456 1071
1147A071l63j578J117m16J042l02j592P86R3M21M64j326J41L29M04O61j613K02
$$ 1071 708 -870 247 -169 873 571 -1021 -235 -142 279 743 -583 -442 -113 291 952 -661 -459
1165d59Q9P38M12j555J93J57O57O56j359j6J25N96R67j770j80R01k74J292j132
$$ -459 -370 368 780 -775 -582 -425 232 888 -471 -487 -362 234 1201 -569 -749 152 -122 1170 38
1184C8o41L93j73J596j080n04L28q6J244j76j642P00k2P73K77j529M24N0Q65k7
$$ 38 -603 -210 -383 1213 133 -371 -43 -129 1115 939 -703 -3 -25 748 1025 -504 -80 -30 835 808
1204H08j466O65L4M65M41j338o6M27N73L54j246j02J09N00P68j355L1L45M12O93
$$ 808 -658 7 41 506 947 -391 -457 -30 543 897 -349 -451 -342 158 926 -429 -398 -53 359 1052
1224A052j579K00O0L15P09j084l21L31L47Q17r89o29N38J05R49p10j095J142n33
$$ 1052 -527 -327 -267 48 757 -327 -648 -317 30 847 -142 -771 -233 -128 821 111 -984 158 -375
1243c75R69m83q51M91K11O07m37r82L61M55M55K4j299N68J69J02N21j133K27J95
$$ -375 594 111 -740 -249 -38 569 132 -850 -489 -34 421 445 -854 -286 -117 -15 506 -627 -400 -205
1263b05P28Q5q90J20j87Q20K53j127K68J08q5J159j477J19K25j7J110j578M79
$$ -205 523 608 -282 -162 -349 471 724 -403 -135 -27 -112 1047 -430 -311 -86 -103 1007 -571 -92
1282i2K86m90J427j154o39J025n94R64j15j148P96j91M56J03j245R41l67L29l0
$$ -92 194 -296 1131 -23 -662 363 -231 733 618 -530 266 75 531 634 -611 330 -37 292 262
1301B62q67K82K35N23j42p75j5K00Q15l39j223J237m53L94M77j530Q42m11K57
$$ 262 -605 -323 -88 435 293 -482 -497 -297 518 179 -1044 193 -260 134 611 -919 -77 -488 -231
1320b31J136j787N62O2j67J429j468r0R41j222J409o33q08J211q26J269n15j298
$$ -231 905 -882 -320 -258 -425 1004 -464 -554 387 -835 574 -59 -867 344 -482 787 272 -1026
1338a026J195j09J41Q6q92N18m9M16M71j315M16Q0N18N1j220Q68n51Q96q4j073
$$ -1026 169 60 201 287 -605 -87 -136 280 751 -564 -148 -68 450 501 -719 149 -402 494 410 -663
1358f63J038o52O69K59j451R60k41j82J427k142J087L50j173J833j641o4J102
$$ -663 375 -277 392 651 -800 160 -81 -263 1164 -978 109 459 -714 1119 -522 -586 516
1375E16j309K125j276j108J632j042O02M47j415J335k27l97J076j841N39L85J65
$$ 516 -793 1332 56 -1052 580 -462 140 587 -828 507 280 -117 959 -882 -343 42 207
1392B07k0n28M17J37r8l23k17N96n87N23L25j264Q27l06L31O19j871J940q01k91
$$ 207 187 -341 76 213 115 -208 -425 171 -416 107 432 -832 -5 -311 20 639 -1232 708 -93 -384
1412c84J407j764P58J69j093J758j386l3J483j505R28j97p77J729j419O38K61
$$ -384 1023 -741 17 186 -907 851 -535 -568 915 -590 338 141 -636 1093 -326 312 573
1429E73j119P16o1J70k14o07P63q4l04L15l11L90m6k32N34q00J91k42N64Mq76
$$ 573 -546 170 109 279 65 -542 221 137 -167 148 -163 227 181 -51 483 -317 -126 -368 196 200 -676
1450f76J006k50l72O88p86O07k43j71J196j423K54O69j147R52q67N41N85j146
$$ -676 330 80 -292 396 -390 217 -26 -197 999 -424 -170 499 -648 304 -563 -22 563 -583
1468e83J233m53o90R46p85L19M07j318J272l57m41P29l34J64l36L0N41n46j26
$$ -583 650 197 -493 453 -332 -13 394 -924 348 -9 -450 279 -55 109 -227 -197 344 -202 -328
1487c28N20j71J23L4q4k77K27j95L07J58m67L71L00r19O87k52j82O36r25P16o
$$ -328 192 21 144 178 94 -183 44 -151 156 314 -153 218 518 -401 286 34 -148 488 -437 279 273
1508B73p28O75k65j56O77q81O78j87m58R14o98j29N29n41M12j63j05L01l30j74
$$ 273 -455 220 -45 -201 476 -405 273 86 -372 542 -156 -285 244 -297 115 -48 -153 148 -182 -356
1528c56L66rJ03l28O3K79l11J47K46m9k72J72p2k53K72M6m1Q0m21L73l4l23O18
$$ -356 10 1 104 -224 -161 118 -193 -46 200 151 -121 51 -21 -274 -2 44 3 83 -338 35 1 -322 296
1551B96m08J13j18o8M30k89l06M04j30J58k02J77J74m20J10L61m27M22j4j07O3
$$ 296 -112 1 -117 -185 245 -44 -350 54 -76 82 -120 57 231 -189 -79 282 -145 277 263 156 219
1572B19l46L20l11Q9J98l79K86PNJ59m40J57J68j62J64o3Om7N4L3j24J46j94J23
$$ 219 -127 193 -118 -29 169 -210 76 83 88 247 -193 -36 132 -30 134 71 77 30 84 117 -7 139 -55 68
1596F8q2M4J9r4j70L01k64o5K30r2O0J1j38M11l27J66l2j71L36m41K90ro1j0j44
$$ 68 -14 30 49 -45 -215 86 -178 -243 -13 -105 -45 -34 -172 239 -88 78 46 -125 211 -230 60 51 -10 -20 -164
1621a64k9J77m6O6n2N8P4j35J11k76J40O6K5j33M79l91j46J70R7k38K60j70L24
$$ -164 -193 -16 -62 4 -48 10 84 -51 60 -216 -76 -10 15 -118 361 -30 -176 -6 91 -147 113 -57 267
1644B67q7l31k8L35j82K57j35k62J59J98j70q6R7Ro9K59m6l75n3K30o5n3l12L96
$$ 267 180 -151 -179 156 -26 231 96 -166 -7 191 21 -65 32 41 -28 231 185 -190 -243 -13 -78 -131 -443 -47
1668d7L25p6j74k90O1M68m87J90J03k70K52o9R3j06L7n7j9N1l65K06K87j66L00
$$ -47 278 202 28 -262 -201 267 -220 -30 73 -197 55 -14 79 -27 10 -47 -66 -15 -380 -174 113 -53 247
1691B47l39J25M7NJ24k41n0O9Q4l22J73j35O3K10J67j65j76K30Lj37M4p3q8K11
$$ 247 -92 33 80 85 209 -32 -82 -13 71 -251 -78 -213 -150 60 227 62 -114 116 119 -18 26 -47 -135 76
1715G6M3j39j85Q9K31j81L70l37r4L19N4l37o9K4J57o8O5nO0M2J57l88o1J1j0
$$ 76 119 -20 -205 -116 115 -66 304 -33 -127 192 246 -91 -160 -136 21 -47 18 13 73 115 272 -116 -177 -166 -176
1740a76L15l22Q9j77J92J08J5j1pj2O8j70N5O4k50O67o28K89j55k8L78l98O7o59
$$ -176 139 -183 -94 -271 -79 29 44 33 26 14 82 -88 -33 31 -219 448 -180 109 -46 -74 304 -94 -27 -686
1764f86N21J83j76J97l4q4K01lk62j59L7L35j49j21J03o3L71o2j02O0k24L17j1
$$ -686 -165 18 -158 39 5 -79 122 119 -143 -302 -265 70 -79 -200 -97 -160 211 149 47 107 -117 200 189
1787A89R8n56J46K27K4j36j39J25j01L23l19K81p9n6J74j2k42P0K8j05P7j09J
$$ 189 287 -269 -123 104 128 -8 -147 -22 -123 200 -119 162 83 27 201 189 -53 17 45 -60 17 -92 -91
1810i1J25p7J98o3k0k60K63O3MP6l14K02K1j93O8j92M02l31k4M3J32O2l2j86M2
$$ -91 34 -43 155 92 72 -188 75 138 142 218 -96 106 127 -66 2 -190 212 -119 -143 -100 32 94 62 -124 -82
1835h2j11J87N3mpj00J17p1n7k30N09k59K03k47Lk1K49m8k19J58j31K15M4l8j41
$$ -82 -193 -6 47 43 36 -64 53 -18 -75 -305 204 -55 148 -99 -96 -117 132 84 -135 23 -108 107 151 113 -28
1860b8o5%L80l22q4J68j37K33k70J3J19j3K10J12k75m1%L5N3j39J19k72O6K66
$$ -28 -93 -93 287 -35 -119 49 -88 145 -125 -112 7 -6 204 316 41 0 0 35 88 -51 68 -204 -138 128
1884A28l34K02p6J91J26m40Q9k4rK44k72L8P9J36k36L72l69K59j54J3K28m18L01
$$ 128 -206 -4 -80 111 237 -203 -114 -138 -147 97 -175 -137 -58 78 -158 214 -155 104 -50 -37 191 -227 74
1907G4j28j30L41k70K2K08j52j78K5j9n2K70M2K4j45j5nJ3J25J96j39k07J11N6
$$ 74 -54 -184 157 -113 -91 117 -35 -213 -188 -207 -259 11 53 77 -68 -83 -88 -75 50 246 107 -100 11 67
1931F7k01K39P6k22j49L44j2k45J01j3j2K9r3J43L5k32K79k44K05j8j83J28p7
$$ 67 -134 105 181 -41 -190 154 142 -103 -2 -15 -27 2 -91 52 87 -145 134 -110 95 77 -106 22 -55
1954e5J72r3R6k04K02J50n00J85m6K46m26L93l33K03J04Lj02j37L12R7l17o0N3
$$ -55 117 24 120 -84 118 268 -232 -47 -93 153 -273 120 -213 -10 94 97 -5 -142 170 267 -50 -110 -57
1977e7Mk44Q3K62m7j35P5Q5M6p3j8J51p8q7O5k40M22m2n0j8n15N44J3l36L74l54
$$ -57 -53 -297 -214 48 1 -134 -59 26 72 -1 -19 132 54 -33 32 -208 214 172 122 104 -411 133 146 -190 184 -170
2003a70L08J22l61J50p8J74oj74J71j51oR9l7Q4p7n8q0l9J99k58L69j24mQ7k86
$$ -170 138 260 -101 49 -29 145 139 -35 136 -15 -21 78 41 125 48 -10 -90 -129 70 -188 181 57 53 140 -146
2028a46O7L99l63k4J4k10K09R0M7m9P8m2J52j69j70P4K66n27J68J93j6N7j25k7
$$ -146 -79 320 -43 -67 -53 -263 -54 36 83 34 112 70 222 53 -117 -43 223 -304 -136 57 41 98 -27 -54
2052e4J28m5J54k12J55j88J29j2J11j62K32m13K82j66M15k04l85L21j24J1L8K9
$$ -54 74 29 183 -29 126 -62 67 55 166 4 236 -177 105 -61 354 150 -235 86 -38 -27 11 40
2074D0j45L88n20L19q0n4k9J67o0J27l61K61k9J0k1j21q7J34K58j67Q1k39J82
$$ 40 -105 283 -237 82 2 -52 -81 86 26 153 -208 53 24 34 13 -108 -195 -61 197 30 111 -128 54
2097E4O2k94J35k22K14J46m9j01Rk55M41K9L5j12j86J98q6J0k06m6K81j29K4o6
$$ 54 116 -178 -43 -265 -51 95 46 -55 -46 -301 140 169 204 92 -94 104 18 28 -178 -224 57 -72 -48 -114
2121a14k29K82P9N7P8m55L22o4K16k72J90k01P8q7J4p8N8J67J64j51j11n2K70
$$ -114 -343 -61 18 75 153 -302 20 -44 172 -100 90 -111 -33 -120 -106 -184 -126 41 205 54 -57 -109 161
2144A61j04o6k5J06o7j60L05j64j6M1J20k27J15j17J48j41J10j3J45j72J03j26
$$ 161 57 -9 -34 72 5 -155 150 -14 -30 11 131 -96 19 -98 50 -91 19 6 151 -21 82 -44
2166d4J60K6l23K18J3J64k18j95J12J4J91p3j13J39j48J03R3M6Q8l22j1K89k07
$$ -44 116 142 -181 37 50 214 -4 -199 -87 -73 118 45 -68 71 -77 26 119 165 253 -69 -80 209 2
2189Bj16K01k16K56j21p5O0n4J03P8n6q0J13k31J09Pj33J18K58m3k05M93n36L7
$$ 2 -114 87 -129 127 6 -69 -9 -63 40 118 62 -18 95 -136 -27 -20 -153 -35 223 180 -25 468 -68 -31
2213c1P4O3j08p5K6L1%K00m35J23J36NJ38l31r5K76j10J3K74J42k83K00j13j61
$$ -31 43 106 -2 -77 -51 -20 -20 180 -255 -132 4 9 147 -184 -279 -3 -113 -100 174 316 33 233 120 -41
2237d1L85m58J58K34n1k50J1N7R8j21k02J2J31nJ64j25J55j4L6j82j1M3n8l69
$$ -41 344 -114 44 278 227 -23 -12 45 143 22 -180 -168 -37 -42 122 -3 152 138 174 -8 -19 24 -34 -403
2261d03N12j02J60j14K15j00j17Jk5m9N0K5M4N9k36K12k17P0j84L55j38p2R4k2
$$ -403 109 7 167 53 268 168 51 52 27 -22 28 53 97 156 -80 132 -85 -15 -199 156 18 -54 40 18
2285A8j86J92j47j41M79n9l2j1L1q8m0k5L5k02L66q8k42P7m9J40k74L13l32J14
$$ 18 -168 24 -123 -264 215 156 124 113 144 56 16 -9 26 -176 190 102 -140 -63 -112 28 -246 67 -265 -151
2309a51L6L6L0n9J38k23Q4j1q7J70jL6k72K69Pk64J30K78k28l1l4J53M7j83J35
$$ -151 -115 -79 -49 -108 30 -193 -109 -120 -207 -37 -38 -2 -274 -5 2 -262 -132 146 -82 -113 -147 6 53 -130 5
2334EJ30j37k1M9P0j09p3j13J23J00o0j3N3K5K95k82k51p1J92J97k32L7J98l25
$$ 5 135 -2 -23 26 96 -13 -86 -199 -76 24 -36 -49 4 29 324 42 -209 -280 -88 109 -123 -86 112 -213
2358b13N74k49k00J30J21K04n29L67k56n5K38O8r8J14l19j61K53l55L68J81r2
$$ -213 361 112 -88 42 163 367 -162 205 -51 -106 132 200 102 216 -103 -264 -11 -366 2 183 91
2379I1j4N8m3l2oq5K2J14M8q0j65J25K16m00L25r0o0j65J48J50l39J90L0q3L34
$$ 91 77 135 92 60 54 -31 -9 105 153 73 -92 33 249 -151 174 84 24 -141 7 157 -182 8 38 -45 289
2404B89l80JK45l7n44M35l7K08M3l37K66k62R3J49k09p4n7K15l7n2l4J34m6j89
$$ 289 -91 -90 155 118 -426 9 -28 180 223 -114 152 -110 -17 132 -77 -151 -208 7 -30 -82 -116 18 -28 -217
2428b17J81J11k91J66N4P1M8j68r3L42l10K21j30m7M9P5j38N5l9K23k6q8l22L65
$$ -217 -36 75 -216 -50 4 75 123 -45 -138 204 -106 115 -15 -62 -13 62 -76 -21 -60 163 137 49 -273 92
2452I2K2k32O1n5n5K57J93m8k37r5N1J46J55m03J80p8L0K72k56j31L00j90O8m
$$ 92 114 -118 -57 -112 -167 90 283 235 -2 -97 -46 100 255 -148 32 -46 -16 256 0 -131 169 -21 47 43
2476D3j09K78j72k54J58k5J37j40O5J02l3L2j73K8O0R2kj81J14O8L1l88J95j43
$$ 43 -66 212 40 -214 -56 -81 56 -84 -19 83 50 82 -91 -63 -3 89 87 -94 20 88 119 -269 -74 -217
2500b17L84j87O7p8J19L0n9r5J21k97K48j0j47J60J00R6j86n7%K3J02M6l11J99
$$ -217 167 -20 47 -31 88 118 59 -36 85 -212 36 26 -121 39 139 235 49 -8 -8 15 117 163 -148 51
2524E1k3j41L9j07L8K66k71J05Nj48J37J7J52j69o8J98r9J13K0k0r2K9k57K20
$$ 51 28 -113 -74 -181 -143 123 -148 -43 -38 -186 -49 -32 120 -49 -117 81 -18 95 115 95 3 32 -225 -5
2548eJ43R5l21K08k84P7k03J78J00P0%k35M53l5j96o8o3j63K04Q4k15J22K39l36
$$ -5 138 233 -88 120 -164 -87 -290 -112 -12 58 58 -177 276 241 45 -23 -86 -249 -45 39 -176 -54 185 -151
2572a51Q1J21j17K2m1J8j74J82jJ02l9p9P6p0N8J68j17k0J88j07k66K65l16K79
$$ -151 -70 51 -66 -44 -85 -67 -241 -59 -60 42 3 -76 0 -70 -12 156 39 19 207 100 -166 99 -217 62
2596F2qJ11k38O2J50k06J29J26j03j42j8Nk33J48N6K12k73j0J81P3J03Ql64M5
$$ 62 54 165 -73 -11 139 -67 62 188 85 -57 -75 -70 -303 -155 -99 113 -160 -170 11 84 187 195 -169 -124
2620a24J92M2l4j43K31J1j18j29N9n1N7P3j44j23K81j42L09k53J97Q1j90P7m87
$$ -124 68 110 76 -67 164 175 57 -72 -13 -64 -7 66 -78 -201 80 -62 247 -6 191 272 82 159 -328
2643c28L93M6J16l22P3J43n7j09j11K16J67m15M10j68j48J43J27p9j98P8J4k3
$$ -328 65 111 227 -95 -22 121 64 -45 -156 60 227 -188 222 54 -94 49 176 97 -101 -23 -9 -32
2665c2j8q2q3L21j80j07J94j16K34j5n8L8l05K01J2J63p5p2k25J18J83L9M3j89
$$ -32 -50 -132 -215 106 -74 -181 13 -103 131 116 58 96 -209 -8 4 167 92 20 -205 -87 96 135 178 -11
2689a1j95M50l37J42R9r2j18J14K55j77j72mJ25n3n5J5q6K7M2n7P2P6k09M68l55
$$ -11 -206 244 -93 49 148 56 -62 52 307 130 -42 -46 79 26 -29 -14 -100 -73 -31 -88 -16 60 -149 319 -36
2714c6L3J43j22n8J85n0k77Q3J63J9k35J10L3k1k8J29j58L59n25Q6L6K03q8R1
$$ -36 -3 140 18 -40 145 95 -182 -99 64 83 -152 -42 -9 -30 -58 71 -87 272 -253 -167 -131 72 -16 75
2738G5L33n93L08j95J93m6j05K64j75K51m55L3M7N9m2J51j17J46L5j51l1R3k79
$$ 75 408 -185 123 -72 121 75 -30 234 59 310 -145 -112 -65 -6 -48 103 -14 132 167 16 -15 78 -201
2761b01J28J18j08P8n8K26m8j6K0J0l41K60J30j88R0j1j66j53K27m12L17Q6p5
$$ -201 -73 45 -63 15 -43 183 135 119 139 149 -192 68 198 10 100 89 -77 -230 -3 -415 -98 -12 -87
2784h7o9R6L74j66j47Q7j15P4nN3j99K05q8r9J19l2n4j24M13l35L16l10J21K6
$$ -87 -156 -60 314 148 1 88 -27 47 42 95 -104 101 13 -86 33 1 -53 -177 236 -99 217 -93 28 54
2808E4R0j48l5L9K1LJ5K5Q5p7k60L37j24j73J20N1l9j8j9M8m3k8J42j79J78j6
$$ 54 144 -4 -39 0 21 24 39 64 149 72 -188 149 25 -148 -28 23 -16 -34 -53 -5 -48 -76 66 -113 65 49
2834D9j49N8K67j66K3q2k75L30k29J40J59l20K69K07k35j92j20O6N1K49j43j76
$$ 49 -100 -42 225 59 82 0 -275 55 -174 -34 125 -195 74 281 46 -146 -266 -200 -149 100 -43 -219
2856b19M37k38oQ0j26NJ2J20j27QO7R0rl8l15K18N4j95K86j73J90j27O4M8j13
$$ -219 218 -20 -26 54 -72 -67 -55 65 -62 -54 13 103 94 56 -259 -41 13 -182 104 -69 121 -6 58 106 -7
2881gp3J79M4l14K70P1k00k24M24k49J08q3q0j6N1P8L1J33l20j87L59O0o0q7l0
$$ -7 -80 99 143 -171 99 170 -30 -254 170 -79 29 -54 -134 -150 -99 -21 10 143 -177 -364 -5 55 -5 -92 -122
2906a22j30M46k94J93l4j77J79j08Q4K3l9j04J66k20K88j63j12j43J99K8L5j38
$$ -122 -252 194 -100 93 59 -118 61 -47 37 60 21 -83 83 -137 151 -12 -124 -267 -68 -40 -5 -143
2928a43K54p9K5k05J06k7O3j27L1J99j72J30o6R8k78L58l91K92j5l6J00oj57J8
$$ -143 111 32 57 -148 -42 -69 -6 -133 -102 97 -75 55 -11 87 -191 167 -224 68 53 17 117 111 -46 -28
2952b8P7j92P6J38n1p9J09L2k07L72j38l4n5J68j15j19n4k08K21P5j50J48J40
$$ -28 49 -143 -67 71 20 -59 50 82 -125 247 109 75 20 188 73 -46 -100 -308 -87 -12 -162 -14 126
2975A26J45l45P5J84j20q1J33k51K84L0l8m6L5O4k23m4p0M01j69Q0k19J86k06
$$ 126 271 -74 1 185 65 -16 117 -134 150 180 142 96 131 195 -28 -72 -142 259 90 170 -49 137 -69
2998f9K02k69q7L72l84K86q5n5PK8L5j7j03K29k63J21j74K54j82L41l36L5L66
$$ -69 133 -136 -223 149 -235 51 -34 -89 -82 -54 -19 -36 -139 90 -173 -52 -226 28 -154 187 -149 -114 252
3021B52k67K07k15O0M9J17p6k57R2l6J16J29j41R2r6L6o3J46k08r1J28J19p5j52
$$ 252 -15 192 -23 37 86 203 127 -130 -38 -74 42 171 30 122 26 62 -1 145 -63 -154 -26 93 18 -134
3045a34K71k39j11J10Q1J0p7R1K5J49k62K21j57j66K51P9j42K2o2N8j19K44r9
$$ -134 137 -102 -213 -103 -22 -12 -89 2 27 176 -86 135 -22 -188 63 142 0 22 -40 18 -101 143 44
3068D4j96o0L52j3oj54k00O8J58p3Rl2O7K62q9j38m0J00j96K93q5j05J36O9j27
$$ 44 -152 -212 140 127 121 -33 -233 -165 -7 -80 -71 -103 -36 226 137 -1 -41 59 -137 156 71 -34 102 171 44
3093D4r6J2k2J55r0M3K4j10K23l27O9p1L14l6j99N2K36K7k17M7k02J1K16n1k67
$$ 44 -52 -40 -62 93 3 46 70 -40 183 -144 -75 -146 168 132 -67 -15 221 248 31 78 -124 -113 103 52 -215
3118b15K36k9J04oj96k68M34j94J54j13R8k28R7K87k45q6J01rQ5k46K61j49O1
$$ -215 21 -8 96 90 -106 -374 60 -134 20 -93 5 -223 -126 161 -84 -170 -69 -78 7 -239 22 -127 -66
3141f6K6j87L23n4l1n6p6J22r3K21l4j58K73k55K75l70J34P8mj53Q6J91j06l32
$$ -66 -40 -227 96 42 11 -45 -121 1 -92 129 95 -63 210 -45 230 -140 -6 72 68 -85 1 192 86 -246
3165b46K48%j11k7J27N3j53L20k10mJ55j45j53LM85j36l26j56N55l49J3J27n2
$$ -246 2 2 -109 -136 -9 44 -109 211 1 -3 152 7 -146 -143 342 206 -120 -276 279 -70 -57 70 18
3188A8m9oJ18J17j04k3J6j91O3J57j98M3K8L45l53l8K54r9j1o1j31K50j51k60
$$ 18 -31 -37 81 198 94 71 87 -104 -41 116 -82 -39 -11 334 -19 -57 197 98 87 26 -105 145 -6 -266
3212b66M83k86l0j16J65j2J33Q9k20j1kL0JJ38q1q4n7j70K47k75N79n05K17j18
$$ -266 217 -69 -99 -215 -50 -62 71 160 -60 -71 -73 -43 -42 96 15 -69 -126 -296 -49 -324 255 -250 -33 -151
3236a51%K75j80P0J36j91J29Jj12j93K25k2J34nk89Q2o3J26o7J48l4m4p8J47j01
$$ -151 -151 124 -56 14 150 -41 88 89 -23 -216 9 -13 121 116 -173 -91 -154 -28 -95 53 19 -25 -103 44 -57
3261e7k2J05q4J54j24j08O6p9M18l89K45q5p7L9k15L33j56k16K57p7J71l8R1o8
$$ -57 -79 26 -58 96 -28 -136 -70 -149 269 -120 125 40 -37 2 -213 120 -36 -252 5 -72 99 61 152 84
3285H4J88j08k65m7N18k44j07l0M3M0j18Om8J1J02O0lp9j43J84M8q9J89j96k0
$$ 84 272 164 -101 -148 370 126 19 -11 32 72 -46 -40 -88 -77 25 85 82 3 -140 44 92 3 192 -4 -24
3310b4K15l74K67l45K74j12J85n3j21m4Q4Ok09K71j44k0J87k88K86l9l0n9m3K
$$ -24 191 -183 84 -261 13 -99 86 33 -88 -132 -48 -42 -251 20 -124 -144 43 -245 41 2 -28 -87 -130 -128
3334a28J75L0j21M6k42J44K7q2M8R3o6j76J96r3J71O9m3J19p6k56K08j09K08k10
$$ -128 47 77 -44 2 -240 -96 -69 -151 -103 -10 -76 -252 -56 -149 22 91 48 167 91 -165 43 -66 142 -68
3358f8J36k14k4K01J64m7k59K77j43L8j01nK2J05j03Q1j54L13k4o1r5k88J71j70
$$ -68 68 -146 -170 31 195 148 -111 166 23 61 -40 -45 -23 82 -21 60 -94 219 195 134 39 -249 -78 -248
3382b48K88j85L39k04o5r9J44Q7q5K17l10K83q0J09j29j40K2j84%L32n1K0k3l8
$$ -248 40 -145 194 -10 -75 -174 -30 57 -28 189 -121 162 82 191 62 -78 -56 -240 -240 92 41 61 38 0
3406@P4Q9j35o6l4L5J78j62k13L29n2k9q8m7Q0J23N2j32K6qj54J87L3k52L58l95
$$ 0 74 163 28 -38 -72 -37 141 -21 -234 95 43 14 -74 -121 -41 82 134 2 28 20 -134 53 86 -166 192 -203
3432b03J96M7J75m12K54p7M6r5K62l89K70j7l1N6r2j05N8m1K09j18J31q3k97N1
$$ -203 -7 40 215 -197 57 -20 26 -69 193 -196 74 57 26 82 -10 -115 -57 -98 111 -7 124 41 -256 -205
3456b05J83J54Q0nk56q5P9N8j72M3K49q0O9j01j26K43J4j23M3j91K22k00J14K09
$$ -205 -22 132 212 207 -49 -134 -55 3 -169 -126 123 43 112 11 -115 128 142 19 62 -129 93 -107 7 216
3480B16n39J35K44J45k75P2M3j0j58M34m68L8J81K7K9m3k56J51J05j11J58j91
$$ 216 -323 -188 56 201 -74 -2 41 31 -127 307 -161 -123 58 85 114 71 -185 -34 71 -40 118 -73
3502g3m8J77O9k34R9k19K44j52K1j29l4J32K44L7j3p5K6K0J0r4j04K43l09J36
$$ -73 -121 56 125 -109 -10 -229 15 -137 -116 -245 -279 -147 97 134 121 46 72 92 102 8 -96 147 -162 -26
3526b6j41J08j45K22rm8P2l59L14K5q7J66m4O0j62j51J95l4K76k58m8K0R3o1M5
$$ -26 -167 -59 -204 18 9 -39 33 -326 -12 13 -74 92 48 108 -54 -205 -10 -44 232 -26 -74 -54 39 -22 23
3551B3p6L7J60j96j33K47L3j42p8N8j7j06K08K9J26l28m8J65Pj57J94j33K4l5
$$ 23 -53 -16 144 -52 -185 62 95 -47 -125 -67 -84 -190 18 47 173 -155 -203 -38 -31 -188 6 -127 -103 -138
3575a38J76J8o6j13K64k33n4J42L4J4k6OPq1P0j0O3KQ4k73K08k33L18j34l11N54
$$ -138 38 56 -10 -123 141 -92 -146 -4 30 44 18 24 31 -50 20 10 73 75 159 -114 94 -139 179 45 -266 288
3601B88l12J37r8N0j04m9J5M0m4J56m7R3k02O8M7j53J63m1K9j6j0j21L69r7j64
$$ 288 -24 113 15 65 -39 -88 -73 -33 -77 79 32 125 -77 -9 38 -115 48 7 36 20 10 -111 258 161 -3
3626ck59K26O6j1k02N3j33M95j85M7k29J35Pq9L67k29j40K37j59O4J18O2l26l04
$$ -3 -262 -36 30 19 -183 -130 -263 232 47 94 -135 0 7 -82 285 56 -84 153 -6 58 176 238 -88 -392
3650c92L91M6QL6r9j04R1j68M59k63j07J35j39K16k19k22J64L06k35M50l09j53
$$ -392 -1 45 53 89 -10 -114 -23 -191 268 5 -102 33 -106 110 -109 -331 -167 139 -96 354 45 -108
3672a08J4K59k21j87J88p0J41J78k20j26K18r5N7k38K13n3M5j87K31O8j19j89
$$ -108 -94 165 -56 -243 -55 -125 16 194 -26 -152 66 -29 28 -210 3 -50 -5 -192 39 107 -12 -201
3694b01R0J61k4j0J16m1r4J25J17l9k55K8N3j15N2p4M19j25n6o5L2k34J90J9m
$$ -201 -111 50 26 16 132 91 -3 122 239 200 -55 -27 26 -89 -37 -111 308 183 127 62 94 -140 50 69 65
3719F5j52q6L32k29L9K56j85j28K26j85l1J85j45N0R2N7m4j89p4K61k14K03k66
$$ 65 -87 -173 159 -70 -31 225 40 -88 138 -47 -78 107 -38 12 104 161 117 -72 -146 115 -99 104 -162
3742a62m0L16j49q1K58o6p2R1p8J1j18R7l3j73J51q9J56m7R2K2j01O3J90l69J30
$$ -162 -202 114 -35 -116 142 76 4 95 17 28 -90 7 -26 -199 -48 -137 19 -28 64 86 -15 48 238 -131 -1
3767aK38q5j86J17j58R9L8k09L49l08J07N6j05Q7o7J53k79N50l72jJ16k61J21
$$ -1 237 152 -34 83 -75 24 62 -147 202 -106 1 57 -48 39 -28 125 -154 396 24 23 139 -122 -1
3790aJ49q6k93L52l04l2J52R0J61mm40M14o7j0kmk20L9N3j49L20k83J85J32j35
$$ -1 148 62 -231 121 -183 -215 -63 27 188 184 -256 158 91 81 79 75 -145 -106 -53 -202 118 -165 20 152 17
3815A7n1o4O8J17k69J16J67k27k1K33o0j9k6m1nL7J7j38J39k67K54j02J75j9Q4
$$ 17 -34 -98 -30 87 -182 -66 101 -126 -147 86 26 7 -19 -60 -65 -28 -11 -149 -10 -277 -23 -125 50 31 115
3840A15O0r2j34j40J25j25K33k27QJ38j9J58p7P2j9J00l48J57Q1l41K79p0K7J40
$$ 115 175 83 -51 -191 -66 -191 42 -185 -177 -39 -58 100 23 95 76 176 -172 -15 66 -275 4 -66 -39 101
3864A01L1l63K12l3Q6k5j08K4K00k63m4Q4J20q6J90m36K80rJ61J76r3l3n0j14
$$ 101 132 -231 -19 -52 34 9 -99 -75 125 -138 -182 -98 22 -64 126 -310 -30 -39 122 298 205 172 122 8
3888Hj38K69MKk77K33j81J20j73P8J0Q8j54qP1j60J33K9L7r0J88R1l70J10L12
$$ 8 -130 139 143 145 -132 101 -80 40 -133 -55 -45 43 -111 -119 -48 -208 -75 -46 -9 -99 89 180 -190 -80 232
3913B32j45L3j44Jn8J61k12L1J59j62K79k56P5p3J38r6m0m2J14J10l5J5K49k92
$$ 232 87 120 -24 -23 -81 80 -132 -101 58 -104 175 -81 -6 -79 59 -37 -77 -119 -5 105 70 85 334 42
3937D2j16j0J56L0l34K41K0O4M5k34L49l41o3L0J32P3j72K11r8N6j0j30L21k18
$$ 42 -74 -84 72 102 -232 9 29 93 138 -96 253 -88 -151 -121 11 84 -88 123 25 81 71 -59 262 44
3961D4K11k68L6m7j12L47l43L0M1K25j42j4j5j2p5m3J21o9R1m7j75K57n7K43k17
$$ 44 255 -13 23 -24 -136 211 -132 -102 -61 164 22 8 -7 -19 -94 -137 -16 -85 6 -41 -216 41 -16 227 10
3986A0%j02J72o4o7J10k88M48r1l20J51K81Kj54k34k9M5j35M16Mj74j02m5J39
$$ 10 10 -92 80 16 -51 59 -229 219 128 -192 -41 240 242 88 -146 -175 -130 -265 151 155 -19 -121 -166 -27
4010b7m36M51o1j21J66Jr9J84q0j6n9j34K72j11N9q7J37l51P03m90Kn2L5J17k1
$$ -27 -463 -12 -73 -194 -28 -27 -126 58 -22 -38 -97 -231 41 -70 -11 -98 39 -312 391 -99 -97 -149 -114 3 -18
4035a8J02O7N9k86o1J52J14m1P3k31JJ46k93K14j47j48K85q4P1j20K08r8J02j55
$$ -18 84 151 210 -76 -137 15 129 88 161 -70 -69 77 -216 -2 -149 -297 -12 -96 -25 -145 63 -35 67 -88
4059h8L5K25j76j16R7L21k98J9J51n4j62p0K44J0j62j24K80k48J23j30J51p8L8
$$ -88 -53 172 -4 -120 -23 298 0 19 170 116 -46 -116 128 138 -24 -148 132 -116 7 -123 28 -50 -12
4082a2j65L17l7l29K5K81j06K24n34K13K96l74O3l6J04J96j39O7j1L8K1K7j01
$$ -12 -177 140 103 -226 -201 80 -26 198 -336 -123 173 -201 -138 -174 -70 126 -13 54 43 81 102 129 28
4105B8J17k72l7L0K27p0m5K6o4Q5J16k52J14rKp5J74j6j7k20J59l1j03K33m7q0
$$ 28 145 -127 -164 -134 93 23 -22 4 -60 25 141 -111 3 -6 -4 -79 95 79 62 -158 1 -30 -133 100 53 -27
4131b7N4Pj29R9P0j7l8P0j04j80o2K17K93j29Q8l46J54R9o5j60n5N8K41l5k74
$$ -27 27 34 -95 4 74 57 19 89 -15 -195 -257 -40 253 124 212 -134 20 119 54 -106 -161 -103 138 103 -171
4156a71N24o03K86j07j01J9K18K5j33k31K79kJ2J07m3l37K66q4j92J95J05k6j14
$$ -171 353 -250 36 -71 -172 -153 65 90 -43 -274 5 3 15 122 79 -258 8 -76 -268 -73 32 6 -108
4179a08J22p2M7lj34j59L62j77J31j26nL2K20j61Q9j62j15L62k58K70r3K05k89
$$ -108 14 -58 -11 -14 -148 -307 55 -122 9 -117 -122 -90 130 -31 58 -104 -219 143 -115 155 62 267 -22
4202b2k7j61J39K18Q1j39j06k13J45j59K48O5J39q3j17rJ87j38M1J00j26p9P6
$$ -22 -49 -210 -71 147 228 89 -17 -230 -85 -244 4 69 208 125 8 -1 186 48 89 189 63 -16 60
4225F0R6j02l7j23P2q1J98p1l33M48J4j82RJ58k22P3K1J47l39RK31p8r9J62j70
$$ 60 156 54 17 -106 -34 -115 83 12 -321 127 141 -41 -32 126 -96 -23 -2 145 -194 -185 46 -32 -131 31 -139
4250a39L41j23m2r2o5K23P5j54K6j9m45M05j40K93j28J46k65L6L29k79j40K03
$$ -139 202 79 37 -55 -120 103 178 24 50 31 -414 -9 -149 144 16 162 -103 -67 262 -17 -157 46
4272D6k46J55N2j62L98m06K47L2p9J2J06j68O1J31p9n6J04j29k32J48mL7J46l78
$$ 46 -200 -45 7 -155 243 -163 84 116 37 49 155 -13 48 179 100 44 148 19 -213 -65 -69 -32 114 -264
4296b64J47L5QJ08P1k30K46q9J05K8k62Q5p3K54j00J2l70K40J56k54M60k41k57
$$ -264 -117 -82 -74 34 105 -125 121 32 137 165 -97 -12 -85 169 69 81 -289 -49 107 -147 313 72 -185
4319a85L83k84K47J9l18K12q6O6j71N5M3k07K85j3j23J5p8J10N1j56KL4L04l4
$$ -185 198 -86 161 180 -138 74 -12 54 -117 -62 -19 -226 59 46 -77 -62 -140 -30 21 -135 -133 -99 205 171
4343A71k28j03K31P5M9k23O5O4q0l05J32L2P0N9N2P2k41R9n9R9p1L31j58n8j9
$$ 171 -57 -160 71 146 195 -28 37 101 21 -284 -152 -120 -50 9 61 133 -108 -9 -68 31 -40 291 133 75 56
4368E6p5q5j5r1Q7J03p5K27k98L2J08J65j27n0J16r8q0R0Q0k32J77o5J60p6j28
$$ 56 -19 -104 -119 -210 -123 -20 -95 132 -166 -134 -26 139 12 -38 78 -20 -100 -10 70 -162 15 -50 110 34 -94
4393i4J27n2J33r0r0j5P1R9l5j87K85l86K21K23k25K3q9K96l00K02J28k41Jk40
$$ -94 33 -19 114 24 -66 -81 -10 89 54 -133 152 -234 -13 210 -15 8 -81 215 -85 117 245 4 5 -235
4417b35J39K67l19L5K43l2k89J16P7K9r0K0nJ36O2p29N53r4j2q3J28J10p9K08
$$ -235 -96 171 -148 -113 130 98 -191 -75 2 31 -59 -39 -44 92 154 -575 -22 -116 -128 -211 -83 27 -52 156
4441A56j49K8J23j65j22L26l19k7K49j26L4L40j76k04k7P9r1l1rk9L34r3k43J05
$$ 156 7 35 158 -7 -129 197 -122 -149 100 -26 8 348 172 -32 -59 20 -71 -102 -111 -140 194 101 -142 -37
4465c7J48m0j91L21k97K35o2k55M92m86K46j18J09p5M0K24l13M24k15n5J66k90
$$ -37 111 71 -120 201 -96 139 77 -178 314 -172 74 -44 65 -10 30 254 -59 365 150 95 261 -29
4487b9O0l52K80m3Q7J46p9Q7o0J44l49N9K09j76N7k37L36l28L84j83J05k13J12
$$ -29 31 -321 -41 -84 3 149 70 157 97 241 -108 -49 160 -16 41 -196 140 -188 196 13 118 -95 17
4510A7J90r6J51l7k02K64l87J11M9k74K68j63K20l4m4l11N05j64J28m73M35j2
$$ 17 207 111 262 225 23 287 -100 11 60 -214 54 -109 111 77 33 -278 227 63 191 -282 153 141
4532A41j76r4L42k7m38J66L3J07j50J32j50K8L63j52p6j50L20m4q2r3R3j94L1
$$ 141 -35 -129 213 186 -252 -86 -53 54 -96 36 -114 -86 277 125 49 -101 219 175 93 0 93 -101 -70
4555g0J01p2Kj12J20n6j36K04rN7o0j00J95K18k92l01K34j46M48j66q2j08K85
$$ -70 31 -41 -39 -151 -31 -87 -223 -19 -28 29 -31 -131 64 282 -10 -311 -77 -223 225 59 -23 -131 154
4578A54j09j40K35o0pl33L18J42k22J8l4k29M92lk44J02j05J19J25k40J64P0j71
$$ 154 45 -95 140 80 73 -260 58 200 -22 -4 -38 -267 225 222 -22 80 -25 94 219 -21 143 213 42
4601D2o1J93j31J02j39O1j60j03J83p6R3rp3P5L3J2n6J95k02K60r3j73J11k21
$$ 42 -19 174 43 145 6 67 -93 -196 -13 -89 4 -5 -78 -3 30 42 -14 181 -21 239 146 -27 84 -137
4625a37L0k4K73qj30j73K80O6j63n2K68j74j7k01J10J78k75L14j08m5o1K9K85
$$ -137 -107 -131 142 134 4 -169 111 177 14 -38 230 56 39 -162 -52 126 -149 165 57 12 -49 -20 265
4648B65n35K57p9J69l4j81K61j70O4K9k60M98k03j77K26m2j20j0J11Oq8nm7q2
$$ 265 -270 -13 -92 77 43 -138 123 -47 17 46 -214 284 81 -96 130 88 -32 -42 69 75 -13 -18 -65 -147
4672a47J86J32k11qK59j53mr2L3R2J89l22K00k07k15J40j32K07L19k39R1k04K38
$$ -147 39 171 -40 -48 211 58 54 -38 -5 87 276 -46 154 -53 -268 -128 -260 -53 266 27 118 -86 152
4695A52j62j02j54J63L0k11K79p7Q1J68o9O3j60m4J88k19J48j68J56lOk13J67
$$ 152 -10 -112 -266 -103 -73 -284 -5 -82 -1 167 98 161 1 -43 145 -74 74 -94 62 59 65 -148 19
4718A9J11k39lJ34j14O5J1L5k4R5r4J1J25k87J4p5J76K47k15R8L6p9m3Q1j22k6
$$ 19 130 -109 -112 22 -92 -27 -16 19 -5 90 -4 7 132 -155 -141 -216 -40 207 -8 90 126 47 4 85 -37 -63
4744f3j79K19J49k80L49j20j85J46K9j65K09j5k08L6J62r3R0j99k4K66j9j52O3
$$ -63 -242 -23 126 -154 195 75 -110 36 65 -100 109 94 -114 -78 84 -9 81 -118 -142 124 105 -47 16
4767A6L4M1Q0l63Q6P9j00J87k43K98m9k22J32L16l47J49N5m4qq9L36m8k56j25
$$ 16 50 91 171 -192 -106 -27 -127 60 -183 115 66 -156 -24 292 -55 94 149 105 97 8 344 296 40 -85
4791h5m0O7rJ00M5k27J58k4o1M7K05k04N1o3Q0j34J26K82k26o2j9J17k04o2J29
$$ -85 -125 -58 -67 33 78 -149 9 -15 -76 -29 176 -28 23 -40 40 -94 32 314 88 26 7 124 -80 -142 -13
4816a3j43K36Q2j79n6m0j16J78J82j10j4N9J06l10R3M9R8r0M9j23P3j18P6J20
$$ -13 -156 80 162 -17 -73 -113 -229 -51 131 21 7 66 172 -138 -45 4 102 12 61 -62 11 -107 -31 89
4840H9L3q2j50J44OJ66j03n0m7n3K45k17J23J7k66J42k46L70p9n1m5L6q0Q7J38
$$ 89 122 40 -110 34 40 206 103 53 6 -47 198 -19 104 121 -145 -3 -249 121 42 -9 -54 -18 -98 -11 127
4865A27pk40N8p3M35n06L51n5j84N6J22k9j96J96k12J33K05k93J13J20l80M09
$$ 127 120 -120 -62 -135 300 -206 145 90 -94 -38 84 55 -141 55 -157 -24 181 -112 1 121 -259 150
4887A50j11j00J97k33j1j16L75k75K41j74J78r9J0k10J03K52j43J68L2k04q0J14
$$ 150 39 -61 136 -97 -108 -224 151 -124 117 -57 121 22 32 -178 -75 177 34 202 234 30 -50 64
4909F4j51J05J6r0j01L21j09j40R2j01Q3j65K74m36K46N0r0K06j03K08j78j7Q2
$$ 64 -87 18 34 -56 -157 164 55 -85 7 -94 -11 -176 98 -338 -92 -42 -132 74 -29 179 1 -16 66
4932F6J10k92J50j78K52k76J45N5k2p2J24j19j55k03K71L92k62j57K45k15K97
$$ 66 176 -116 34 -144 108 -168 -23 32 10 -62 62 -57 -212 -415 -144 248 -14 -171 74 -141 156
4953A56M0j94m6k50K70m9n6K54m35J24K14M9j06k16L41j57J74k9k04j58K51P7
$$ 156 196 2 -44 -294 -24 -73 -129 125 -310 -186 28 77 -29 -245 96 -61 113 84 -120 -278 -27 50
4975E0K2j41m7J17J98J3k32k8L0k01J25k7R7m4p2K83l80L75j45j07L77m64L41
$$ 50 72 -69 -116 1 199 212 -20 -48 -18 -219 -94 -121 -24 -68 -140 143 -237 138 -7 -114 263 -201 140
4998A40k7j85J13j99J41m5L9N9K27k4l77l2J91Q3K1M4m0O0l25L2K4L36j19k84
$$ 140 113 -72 41 -158 -17 -62 -23 36 263 239 -138 -170 21 104 125 169 129 189 -136 -104 -80 256 137 -147
5022a47O7MJ7j33K98j86J42q5M0J22n4j80L03j75o9R4J37j13n1J05k31J08k16
$$ -147 -80 -76 -59 -192 106 -80 62 -23 17 139 85 -95 208 33 -36 58 195 82 31 136 -95 13 -203
5045b03K69J01K9k83Q4P9l9M7j41K3J12r5m2R7K3k68K60k55K68j05j21J89k09
$$ -203 66 167 196 -87 -3 76 37 84 -57 -34 78 -17 -59 38 61 -207 53 -202 66 -39 -160 29 -180
5068a80K37j8r8Q2L2r1rN1q5J68j5P0Oo5L7j14q2K57k79Q7J25j65J27lj15J31
$$ -180 57 39 -59 23 55 -36 -45 6 -79 89 74 144 150 85 122 8 -74 183 -96 -9 116 -49 78 75 -40 91
5094I1j28MJ26p6O8R0O2l21o3K09o4p6M9j4J37j41K6J18j53K45P3k16p4RJ73J32
$$ 91 -37 -33 93 17 85 175 237 -84 -147 62 -2 -78 -29 -43 94 -47 -21 97 -56 189 262 46 -28 -19 154 286
5120B86l67J62J92k70K8K6R0k0Mj07J49r6j1Oj00p3K10j67K06l14N6J46q6K66
$$ 286 -81 81 273 3 31 57 147 127 131 24 173 77 66 72 -28 -101 109 -58 148 -166 -110 36 -50 216
5144B16j46k3j09K50l63P8J75j87J20O7l6j15J73k02J51J23j60j78K53m89M45
$$ 216 70 47 -62 188 -175 -97 78 -109 11 78 42 -73 100 -102 49 172 12 -166 87 -402 43
5165D3J30N8j78P6O2k90j18J78M7o3K17l39K74l59j55M76o7M3J81l83K69m5j31
$$ 43 173 231 53 129 191 -99 -217 -39 8 -55 162 -177 97 -262 -417 59 -8 35 216 -167 102 57 -74
5188g4K0j41K10Qk3n4O9M5j02O1L8p9n7J18q1o1L26k02K9P8j74J73l63J61J43
$$ -74 -54 -195 15 23 0 -54 15 60 -42 19 57 -22 -79 39 -42 -103 223 21 50 128 -46 127 -236 -75 68
5213F8J75n4l7M7l83K58J2L0j21R8l00L87j88l02M60k35O8j14R1r8P1m6N7or1
$$ 68 243 189 152 199 -184 74 86 116 -5 93 -207 180 -8 -310 150 -85 -17 -131 -40 -138 -67 -113 -56 -62 -153
5238a53L47j56k03J9J37N8p5m1K3JM6r8R3r8K23j25k25K09j0K4j45J75p8K05n
$$ -153 194 38 -165 -146 -9 49 -26 -67 -44 -43 3 -95 -2 -100 123 -2 -227 -18 -28 -4 -149 26 -52 153 148
5263A48k18J85r0jL6k05J02P0J12J29k74k64J43j2K0J3j39M05k02J3O8o7r2J46
$$ 148 -70 115 25 24 60 -145 -43 27 139 268 -6 -270 -127 -139 -119 -106 -245 160 -42 -29 39 -28 -120 26
5287B6j64P9K92l79r8K71N4j05k1j15J49M4J47k68J23k31K66J11k78k1l8M5K33
$$ 26 -138 -59 233 -146 -244 27 81 -24 -45 -160 -11 33 180 -88 35 -196 70 181 -97 -118 -156 -111 122
5310A22j50K4P8J02q8l44L67j43q1J43j8j48R3j6J51N7k50M2j20J36O4J37j85
$$ 122 -28 -4 74 176 88 -256 111 -32 -113 30 12 -136 -43 -59 92 149 -101 -59 -179 -43 21 158 -27
5333b7J31k05J17R4O6l80P2P1q9K18J07q4q0L3J21p0N1j99J13k66K38j04j85K19
$$ -27 104 -101 16 110 176 -204 -132 -61 -150 68 175 91 11 44 165 95 146 -53 60 -206 32 -72 -257 -38
5357c8Q0Q1j43J35k02m9K84k87K89k0j68J58l2l9J28o2l32M23k77J91p7j95J58
$$ -38 42 123 -20 115 -87 -136 148 -139 150 130 -38 120 88 49 177 115 -217 206 -71 120 43 -152 6
5380F%o6j75K82q1J27p5j32M05k6k19J1M8j0j01o2K33l38J46j18N6j21K71J7l90
$$ 6 6 -60 -235 47 -34 93 18 -114 291 265 46 57 105 95 -6 -68 165 -173 -27 -145 -89 -210 61 78 -312
5405c12M42m50K35K5j66J58M9J3p5lQ1m6r1K47k04K0n1J06j45J63j58J17pN7j48
$$ -312 130 -320 -85 -60 -226 -68 -19 -6 -81 -84 -3 -49 -140 107 -97 -77 -128 -22 -167 -4 -162 -45 -52 5 -143
5430a43J54K2P9L0q8j67Q2J15j25M8J88j18j54j38J81L1q6k01K08K9q9K0O1K29
$$ -143 11 33 112 142 54 -113 -31 84 -41 7 195 77 -77 -215 -34 -3 -89 -290 -82 -53 -142 -122 -61 168
5454A68k50J53q5K53k22j50K70j97R8O6M1%rNo5rj46K2o6M1J62j67J97k88L00
$$ 168 -82 71 -14 239 17 -133 137 -60 38 104 145 145 136 141 76 67 -79 -57 -123 -82 80 -87 110 -178 122
5479A22Q1k3j64j24K13l83L97j69J55j9j74r4N10l70KK79k46j18o0J12K5J52k97
$$ 122 203 180 16 -108 105 -278 119 -50 105 86 -88 -182 328 -42 -40 239 -7 -125 -185 -73 -48 104 -193
5502a93L17k5Q7j53qnO0Rk32N8m5L30k6k81p4J46J39j02p0O7J35j40K82k68R4
$$ -193 124 99 186 33 25 20 80 89 -143 -85 -130 200 174 -107 -181 -35 104 2 -68 -1 134 -6 276 8 102
5527A02k20J11Kj60J82K7k56K06J26j83P6J37r7j52k4N5r0K03J08j68J37j12N5
$$ 102 -118 -7 -5 -165 17 44 -212 -6 120 -63 13 150 53 -99 -123 -68 -158 45 153 -15 122 10 65
5550F5p1J09j89R3%j84M68k59Pj11j59L34Q2Ok66m4K6m0j36J51M74n23M54k81
$$ 65 -6 103 -86 7 7 -177 291 32 39 -72 -231 103 185 191 -75 -119 -93 -133 -269 -118 356 -167 287 6
5574Fj68N7K51k3k2o5k27K56J21j12K5l42J13m6K47j70J7L07k85J74n6k07K57
$$ 6 -162 -105 146 123 101 36 -191 65 186 74 99 -243 -130 -176 71 -99 -82 225 -60 114 58 -149 108
5597A08k05O9J79jk10l9N1K25l44L3K69j31k02Q2K01R6j36jj37J19Q3k12L9R4
$$ 108 -97 -28 151 150 -60 -99 -48 177 -167 -134 135 4 -198 -116 85 181 45 44 -93 26 109 -103 -64 30
5621C0L39l71k4j76K41j56r8L88k92l8J40j4r5k1k9J39n4L01k68J62k68J87j35
$$ 30 369 -2 -26 -202 39 -117 -215 173 -119 -157 -17 -31 -126 -147 -176 -37 -91 210 -58 104 -164 23 -112
5644a12J39j56J11P8r7J89j67k59J97J42j58L7k3Q2l18L22M0k10j1J39m6K2K95
$$ -112 27 -129 -18 60 -37 152 -15 -274 -77 65 -93 -56 -79 3 -315 7 47 -163 -174 -35 -81 -59 236
5667B36j81K05k85J16j66j44L60k61M80m36l1K45j67J36J18l42K07k15J59J47
$$ 236 55 260 -25 91 -75 -219 141 -120 360 -76 -107 138 -29 107 225 -117 90 -125 34 181
5687A81j03J0j16K0r0J02k38K39k1l0M1L4j98K97l91L51j58nj16L8M2k5J82r2
$$ 181 78 88 -28 -8 -98 4 -234 5 -16 -46 -5 29 -169 128 -263 88 -70 -75 -191 -153 -111 -136 46 -46
5711d6r5j00K17Q6k41J58k8J23j94j09J47N3K14Jl78J5o7K8K58P3O2j03j0j55
$$ -46 -141 -241 -24 62 -179 -21 -49 74 -120 -229 -82 -29 185 186 -192 -177 -244 -216 42 115 177 74 64 -91
5735i1o1M1J20L7n5j28p7J70rK11j42kn8P7l1o3Q1K6J8R1l76m7L35J7J72j35j83
$$ -91 -152 -111 9 46 -9 -137 -214 -44 -53 158 16 14 -44 33 2 -61 20 46 64 155 -221 -268 67 84 256 121 -62
5762f2J00O7O5q0O8j31r5P1p0j20L10k94R4J6O5r6J21M7l62J69j95L20l50L42
$$ -62 38 105 170 90 158 27 -68 3 -67 -187 123 -171 -77 -61 4 -92 29 76 -286 -117 -312 8 -342 0
5786@Jj42K4O1q5J66R9k06M6j30K98r5j17K61r6j97L42k08k15J92j51J09j75P2
$$ 0 1 -141 -117 -56 -141 25 124 -82 -36 -166 132 37 -80 181 85 -112 230 22 -193 -1 -152 -43 -218 -146
5810a46L05q0l47K26J14n6j16K35j87m0j56P7K24J88j09l22L64k07j01M52j43
$$ -146 159 79 -268 -42 72 16 -100 135 -52 -92 -248 -171 53 241 132 -190 174 -33 -134 318 175
5831A75o0J80k81K00k57Q1K6O8k84J75k42O4Q7J51J55k36J06j4m4l0j73L12R6
$$ 175 115 295 14 214 -43 38 64 132 -152 23 -219 -155 -68 83 238 2 108 94 50 20 -153 159 255
5854B55j29n34L35J08l5R3k78J63oQ7k12L83m86L43o1k62J56J10K6R2R7k66N2
$$ 255 126 -408 -73 35 0 93 -185 -22 -28 59 -153 230 -256 87 26 -236 -80 30 56 148 245 -21 31
5877C1l08K55r3J17J20j81k6J48k2j47m2K92j29q6L55k07r6PJ93j96O0N9j56j
$$ 31 -277 -22 -115 2 122 -59 -85 63 41 -106 -148 144 15 -71 284 77 -19 -12 181 -15 45 104 -52 -53
5901e3M1j12J60j79K32j13J99k63n3K64j26k25K44O6nj31rJ61m74N37l64J35K05
$$ -53 -12 -124 36 -143 89 -24 175 -88 -141 123 -3 -228 16 82 77 -54 -63 98 -376 161 -203 -68 137
5924A37j38n5P2q9J2P7OJ79j49j10K69k75Q0o9o5K66k79K10j61K03M8k34K36p6
$$ 137 -1 -56 16 -73 -61 16 22 201 52 -58 211 -64 16 -53 -118 148 -131 79 -82 121 169 -65 171 95
5948I5l56K47k8J1QK3J57j01k66L26q2n4J20m4m0j27L7n7K45k10L25l07j50J22
$$ 95 -261 -14 -42 -31 -23 0 157 56 -210 116 34 -20 100 56 16 -111 -74 -131 114 -96 229 -78 -228 -106
5972a06K09q3r2j02J70M2j08r3J65q8j73M31k91P5J87k58K4P4m0J55j72J30l0
$$ -106 103 20 -72 -174 -4 38 -70 -163 2 -86 -259 172 -119 -44 143 -115 -91 -17 -57 98 -74 56 26
5995B6P6l07M64k78j07K85k99J88j02K15k42L5Q7j1j05Pj9N9L26k81R8l63K40
$$ 26 102 -205 259 -19 -126 159 -140 48 -54 161 -81 -46 41 30 -75 -68 -87 -28 298 17 115 -248 -8
6018hj42M1K92Q6l73L27j96j48J74O7O0O9k23o3n4J07Q4j47k38L93j40k1J04m21
$$ -8 -150 -109 183 269 -104 223 27 -121 53 120 180 249 26 -37 -91 16 100 -47 -285 108 -32 -53 51 -370
6042c70L14J08k68K30R8k83M02j94J21n3J9l27L29j99j1K9r1J50n2r0J51k17P2
$$ -370 -56 52 -216 14 112 -171 231 37 158 105 124 -203 126 -73 -84 -55 -146 4 -48 -138 13 -204 -132
6065a32j92L57K5k26Q5O6O5k08J17J48l8n6K26k88K5L4j70J09j45M9J94j88P0
$$ -132 -324 33 58 -168 -83 -17 48 -160 -43 105 67 11 237 -51 -26 8 -162 -53 -198 -149 45 -143 -73
6088g3J67N5k7J39j60k87L19J2j35m6p8K36n60M52r4k4K82l37K71k18j54L26p7
$$ -73 94 149 122 261 101 -186 133 145 10 -36 -114 122 -438 14 -80 -104 178 -159 112 -106 -260 66 -11
6111a1k26K10j6j19P2J47j06j01L22j02k9k1q6q9JK16J31l4j46j1j93m2K09M2
$$ -11 -237 -27 -43 -162 -90 57 -49 -150 172 70 41 20 -66 -155 -154 62 193 159 13 2 -191 -233 -24 18
6135A8j95o2M88k9k09Rm8K99j08k20J95j60M1Q9N0k01%K21k05o7j77L11N8o4j8
$$ 18 -177 -239 249 220 11 20 -28 271 163 -57 138 -22 19 108 158 -43 -43 178 -27 -94 -271 40 98 34 16
6160A6J7j48K06j74J30m5m0n0J8J60j61L61l60O8Q5kK7m4l61K50n9M9K39j23K7
$$ 16 33 -115 91 -83 47 2 -38 -88 -70 90 -71 290 -70 -2 83 81 108 64 -297 -47 -106 -57 182 59 86
6185H6P8l19J53o6J84k06J5K80j70o7n1J73O9l25L36l35Q5k5O4J25k36J93p3k6
$$ 86 164 -155 -2 -68 116 -90 -75 205 35 -32 -83 90 159 -166 170 -165 -80 -105 -41 84 -152 41 -32 -58
6209e8l8j43K29j20J67j28O3J02L5j61M68k64l04M65m18MN4j57K15K9k65J92P2
$$ -58 -96 -239 -10 -130 37 -91 -28 74 109 -52 416 152 -152 313 -105 -101 -47 -204 11 40 -225 -33 39
6232C9N0o7j34J82P9j72n7J41J3o4lp3P1J34l46J76P4j57O3q7Q4J41m0j32K53
$$ 39 89 22 -112 70 149 -23 -80 61 74 10 7 -66 5 139 -207 -31 43 -114 -51 -138 -54 87 47 -85 168
6257A68k37j67p8K89lJp1J18j69J14K08j95Jp1J82j23J9j21L67j03N6j85m0q6
$$ 168 -69 -236 -314 -25 -28 -27 -98 20 -149 -35 173 -22 -21 -92 90 -33 -14 -135 232 129 185 0 -40 -126
6281a26K89J08k99K70n1m60J49K68R1k48j33M3Q0R2k52L2K78k31l6n0K49J37k88
$$ -126 163 271 -28 242 191 -269 -120 148 239 -9 -142 -99 -19 73 -179 -147 131 -100 -136 -186 63 200 -88
6304h8K39m3k9P9k75K24j51L6q5k30M28k21P5N8L8J43j71QJr7j02J22K02j34J35
$$ -88 151 108 79 158 -117 107 -44 -8 -93 -323 105 -116 -41 17 55 198 27 35 36 -61 -163 -41 161 27 162
6329A62k37o2K25k45Q5J26O3o9N2M1j48j56j0J01j36k0J48J53Rl47J53N7k0rK52
$$ 162 -75 -137 88 -157 -72 54 117 48 100 141 -7 -163 -173 -72 -208 -228 -80 73 82 -265 -112 -55 -75 -84 168
6354A68j71j2k1M1N7j89L24l29P6J25k83J91J57K7k7j87J74k09q6K16Q2j23M0
$$ 168 -3 -15 -36 5 62 -127 197 -132 -56 69 -214 -23 134 161 134 -53 121 -88 -174 42 124 1 41
6377D1L2j65J80r6J66l15J51J87l17J3K10J15j83l5L4m5J82q9j51K04k64l3N09
$$ 41 73 -92 88 -8 158 -157 -6 181 -136 -123 87 202 19 -16 18 -27 155 66 -85 119 -145 -178 331
6400C31l98K26j75oQ8p1%n2l9l1P2O0K52q6j28qj03P7j14N1j34N3P9P2j23L0J51
$$ 331 -67 159 -16 -22 66 -5 -5 -57 -96 -127 -55 5 257 171 43 35 -68 9 -105 -54 -188 -135 -56 16 -107 -77 74
6427G4Q2j35j18Q1N8r7k7N9Q9k04m7L35l93M93k38j6J57o1q8q1j16j60L19J61
$$ 74 156 21 -97 -16 42 -55 -82 -23 66 -138 -185 150 -243 250 12 -4 153 92 4 -77 -193 -353 -34 127
6451A27l00J95j18J05l8J67j56j3j09J94QK0j90l6J31j94K16K4j54L25r7j41J26
$$ 127 -173 22 -96 9 -29 138 -18 -31 -140 54 62 82 -108 -144 -13 -207 9 33 -121 204 107 -34 92
6474I2M7J7r1Qj39j29K71%J09n7J33j87Q6j49n9k9K69j1q4r5M5J1o0O4j65j42
$$ 92 139 156 65 73 -66 -195 76 76 185 128 261 74 160 11 -48 -77 192 181 97 2 47 58 -2 62 -103 -245
6500b45K17mR8L7j17l5J05K50l26K13j42m3mk21J06J61j62L63j68j48j07rP6j22
$$ -245 -28 -32 66 103 -14 -49 56 306 -20 193 51 8 4 -217 -111 50 -112 251 83 -65 -172 -181 -105 -227
6524b27K57j58R7N4kJ0J22l13J65P0Nr7L3n0o1j1K84l87J80J05l15J10M8J65k34
$$ -227 30 -128 -31 23 21 31 153 -160 5 75 80 -17 16 -34 -95 -106 178 -209 -29 76 -239 -129 -81 84 -150
6549a50L37r9r5nN7j01k11L67j0r4K7M8j05R8J00K0p0k20M6K7K5P7l96M15j46
$$ -150 187 88 -7 -12 45 -56 -267 100 90 -4 23 71 -34 64 164 184 114 -106 -60 -33 -8 69 -327 88 -58
6574e8M8L2M8O0m1m23L99j52J14o4K11j4m19K99p2J11k9L6o2j09R3J03k20Q0M
$$ -58 -10 22 70 130 89 -334 65 -87 27 -37 174 160 -259 40 -32 79 50 86 24 -85 8 111 -109 -29 -25
6599b5J32K0k92j0J30J55j79Q0o8K4n9J55r9K77m17J25rR1k66K93J00j99Mj01
$$ -25 107 127 -165 -175 -45 110 -69 11 -57 -33 -92 63 -36 241 -176 -51 -60 31 -235 58 158 -41 -37 -138
6623a38L13j75J94k88K71j46Q6k54K61n4R8j26j7%q0J2L5J88R9k36J44m69J32
$$ -138 175 0 194 -94 177 31 117 -137 124 70 168 42 25 25 -55 -43 -8 180 279 43 187 -282 -150
6646a50L05l10L93j69K26j70N2k88J78K6O5k69J61k43K85m47K41j37K40l08L20
$$ -150 155 -155 238 69 295 125 177 -111 67 93 158 -111 50 -193 92 -355 -114 -251 -11 -319 1
6667Am2J98l1m22L83o8J19j73q4K34K7j1jL0q9j43P1j59J53kj01L10k17O8J44
$$ 1 -41 157 126 -296 87 19 138 -35 -119 115 142 131 130 160 71 -72 -1 -160 -7 -9 -110 200 -17 51 195
6692A95o4k73P0j68K06j7J43j13Q9j37k4j23mK07j4J9j02K30j88K02k45n7K08
$$ 195 131 -142 -72 -240 -34 -51 92 -21 68 -69 -93 -216 -220 -13 -27 -8 -110 120 -68 134 -111 -168 40
6715D0j19Q3m8%O4j45J02j36M7K5K04j2j14J34J35l29n5O6P5q3l8L96k48r8K23
$$ 40 -79 4 -44 -44 20 -125 -23 -159 -112 -87 117 105 -9 125 260 -69 -124 -58 17 -66 -104 292 44 -54 169
6740A69m0j72Rj70K58j24j3J22N4P6k81J46M4J13j76J00Q2j82o3L4J35j43M2K
$$ 169 129 -43 -34 -204 54 -70 -83 39 93 169 -112 34 78 191 15 115 197 15 -48 -14 121 -22 20 22
6764B2J11k12J14j57mJ9p0Q9m8o8K68p3p9K55k04N8M8j27p3R7pJ16P0k00L14k18
$$ 22 133 -79 35 -122 -126 -107 -177 -88 -136 -204 64 -9 -88 167 -37 21 69 -58 -131 -34 -41 75 145 -55 259 41
6790D1o0J38P1j99L6J7k68J68oK48k50J30k53J16J29j1Q7J28l65J88k4j01RL94
$$ 41 -19 119 190 -9 27 44 -224 -56 -62 186 -64 66 -187 -71 58 47 134 262 -103 85 61 -40 -31 363
6814C63n61O6K0J88j95J82l8m6J06o8M7q8J6pJ63k69P2K14k47j93J22J03M7J66
$$ 363 -198 -132 -112 76 -119 63 25 -21 85 17 64 -24 -8 -15 148 -121 -49 165 -82 -275 -153 -50 -3 163
6838A63k78Q2L4j65M1J0P7J41k4J1o8j03p3K18j87J52o1LM7j6J5l4P6Q1m4j66
$$ 163 -115 -33 1 -164 -123 -113 -36 105 81 92 24 -79 -152 66 -121 31 -30 -27 20 4 19 -15 61 142 98 -68
6864f8K03p9j41J8J95n4j49p5L3K21%J8j56r9J70n0K47l25J02k63J27Q0J46k16
$$ -68 135 56 -85 -67 128 74 -75 -150 -117 104 104 122 -34 -133 37 -13 234 -91 11 -252 -125 -45 101 -115
6888a15J5J66l72J24L91j95j52L14k99J67J60j15j54j14J7K58j03J11j64M6j15
$$ -115 -100 66 -306 -182 209 14 -138 176 -123 44 204 89 -65 -179 -162 96 -7 104 -60 -14 -129
6909a29K35j0j09j48R1R0j02J39m12N93p8j50j34Q3K97m06M5Q3N6o1l42K33K45
$$ -129 106 96 -13 -161 -70 20 -82 57 -355 238 160 10 -124 -41 256 -150 -105 -22 34 -27 -369 -136 109
6932A09QMk29m8L44j11l0p1j1on1j28K75k06J82J70o9k23J24j51L5J20l17K78
$$ 109 117 121 -108 -156 188 77 47 -24 -35 -41 -92 -220 55 -151 31 201 132 -91 33 -118 -83 37 -280 -2
6956bJ98L0l66N4l6K64l8k97L04k11O1N0Rj01J55L2k08J29J5K44k85j34J9N3j58
$$ -2 196 226 -140 -86 -122 142 104 -193 111 -100 -39 11 20 -81 74 106 -102 27 42 286 1 -133 -114 -61 -219
6981b19J93Q4Q7M9j73K00l14K6J02j01K46j05j42N4k3q6K08k28P4J80q7K05k49
$$ -219 -26 58 145 194 21 221 -93 -67 35 -66 180 75 -67 -13 -36 -122 86 -142 -68 112 25 230 -19
7004a9K26k08K02j50q2J76q9q0r9J3R3j22J34R2j05j99J55M8K59k33k21K89o4
$$ -19 207 -1 201 51 -31 145 56 -24 -123 -110 -17 -139 -5 87 -18 -217 -62 -14 245 12 -209 80 16
7027A6j8j30J88nq1j89L04J23k65N9P2j97J27ml0Rk4K14k89J54lj02J26l04K37
$$ 16 -2 -132 56 51 -30 -219 85 208 -57 2 74 -123 4 0 -30 -21 -45 169 -120 34 31 -71 55 -249 -12
7052a2j91J60pk6J8p4J26J16lk51J23J6p1k5J63j73Q5J73k93J96j93lq7k0K79
$$ -12 -203 -43 -50 -76 -58 -132 -6 110 107 -144 -21 -5 -76 -101 62 -111 -26 147 -146 50 -143 -146 -233 -253 26
7077B6J20l33K33K0l05J92R3p5P0m3j15k3K94L5m07M25m29j19K25K25k10n5J36
$$ 26 146 -187 46 66 -239 -47 46 -29 41 -2 -117 -140 154 189 -218 207 -222 -341 -116 109 -101 -156 -20
7100b0R4l76J57qJ44k22K93k75O7R7J10J05k2j47J81k76M6J3J54k31J46p4K96
$$ -20 74 -302 -145 -153 -9 -231 62 -213 -146 -49 61 166 144 -3 178 -98 -52 -39 115 -116 30 -44 252
7123B52m51K82no0J48R5j56j45K61k19K14k43l44L54N0r0J00J9m9K3l8j42L5K18
$$ 252 -199 83 78 18 166 261 105 -40 221 2 216 -27 -371 -17 33 -57 43 62 13 36 -2 -144 -109 109
7147A09j97k33J02L85J29j97M0j17K7N4Jl5m8j17j1J47l4j74J45p8p1R2J72q7
$$ 109 -88 -321 -219 166 295 98 138 21 48 102 103 68 20 -97 -108 39 5 -169 -24 -102 -173 -81 91 4
7171Dj41MJ54PR3J9j15o7j47O0L11m04J57J23J46j08j14N5J50K4j79k41K58J16
$$ 4 -137 -133 21 28 121 140 25 -42 -189 -129 182 -222 -65 58 204 96 -18 37 187 211 32 -209 49 165
7195A65l98K19N3n2J5m6j64L10j66R4R3k19K09L6l54K52j00J85r1n5NK35k83K08
$$ 165 -233 -14 39 -13 2 -44 -208 102 -64 30 123 -96 113 149 -205 47 -53 132 41 -14 -9 226 -57 151
7219A51o1k20K90l29J01J03j82J11J28j06J3J55K1j86J69l27K20j07J61j34q0
$$ 151 90 -130 160 -169 -68 35 -147 -36 92 -14 -1 154 175 -11 158 -169 51 -56 105 -29 -109
7240a09J75p9o4J51j26j9l04M89R3k21P7j79l9K17j19k22K79l04L82N4kk55J86
$$ -109 66 -13 -77 74 -52 -71 -375 114 207 -14 63 -116 -155 62 -57 -279 0 -304 78 132 130 -125 61
7263F1j99K7j49L30j80k1L6K29j34M5J3j91K16j04k4MK8kn0j2K23j01j64J17O
$$ 61 -138 -111 -260 70 -110 -131 -95 134 0 45 58 -133 83 -21 -45 -41 -13 -15 -65 -77 146 45 -119 -2 4
7288Dk49L76K9j23oj07RJ95k34K64j33q2P6k04K6K41j86m4M7J30j5j34J25K2j43
$$ 4 -245 131 160 37 31 -76 -67 128 -106 158 25 -57 19 -185 -159 82 -104 -148 -101 29 14 -120 5 27 -116
7313a16K17r4J08k31j1M3J21R4j8r7j21J42m8K91l42j55K49k4o7L4J82j90l4k55
$$ -116 101 7 115 -116 -127 -84 37 131 113 16 -105 37 -11 280 -62 -217 32 8 -59 -25 157 -33 -67 -322
7337c22M78j46n0k0K77j59kK66l33j20J26k4j3J3j2r9J13j00K92k15k05K30k85
$$ -322 156 10 -40 -60 217 58 56 322 -11 -131 -5 -29 -42 -29 -41 -140 -27 -127 165 -50 -255 -25 -310
7360c10K08M7j10K66M4j54J62k2j30k62K37J63j00n1j53N36m15q6J30P6k7K7k00
$$ -310 -102 -55 -165 101 145 -9 153 131 1 -261 -24 139 39 -12 -165 371 -44 -130 0 76 49 76 -124
7383a24j0j36M12Pm24K21Q0r4L13j72k49P1L7L3m7M7j18K21r5o4J95%l5K3j87
$$ -124 -134 -270 142 149 -275 -54 26 -68 245 73 -176 -105 -68 -35 -82 -35 -153 68 -27 -91 104 104 69 92 -95
7408i5J0J51k03J59p3M2n9J80m4K56m02p9K24j71J16l3J19j51J52j29m7J7J65
$$ -95 -85 66 -137 22 -51 -9 -68 112 68 324 -78 -157 67 -104 12 -21 98 -53 99 -30 -77 -60 105
7431A05l26K71j68M6j77J75J22k9J17j53N9q6PJ00P9k56K16j24k8J72R9l72P9
$$ 105 -221 50 -118 -72 -249 -74 48 19 136 -17 42 -44 -37 63 142 -114 102 -22 -50 122 221 -151 -72
7454g2kk5J42p7p0L18k44O5P3m3k74J62L70k62o6o2nK6l3J30j0j14K41j36P4J9
$$ -72 -74 -99 43 -34 -104 214 -30 35 108 65 -209 -47 323 61 -5 -67 -72 -46 -79 51 41 -73 168 32 106 125
7480A25p4n3K16j31l39L91l23K43l5m9N1q2K17j87p0J5K00j56M3N7m49M71j23
$$ 125 51 -2 214 83 -256 135 -188 55 20 -29 22 -60 157 -30 -100 -85 115 -41 2 59 -390 81 -42
7503d2Q0j03k3J2J35l2L5J73l3k20k7o0q8K89M3j97J9R9j73J60o3p6M0J69j33
$$ -42 38 -65 -88 -76 59 27 62 235 202 -18 -45 -105 -193 96 139 -58 -39 60 -113 47 -16 -92 -52 117 -16
7528a6Q7l30K22J50k73L61j7j06j48L71j27l62K58J8Q4k99K47k25L0J5M1j8J14
$$ -16 71 -259 -37 113 -160 201 184 78 -70 301 174 -188 70 88 172 -127 120 -105 -75 -60 -19 -37 77
7551G7l10L74J32P1m37K76m0k75p5K98p5p5J35p7L5j00Q8Nj9j61L8J42m4j90R6
$$ 77 -233 141 273 344 -93 183 143 -132 -207 91 16 -59 76 -1 34 -66 22 27 8 -153 -115 27 -17 -207 -111
7576a11K07k16m5K41n9P3J84k90k3J1N7j76J66J3j24j0J23p7J01j54J32N1l1n4
$$ -111 96 -120 -165 76 17 90 274 -16 -39 -28 29 -147 19 32 -92 -102 21 -56 45 -109 23 74 43 -11
7600a1O8j19m2K7K76J6j5j85k03K26J2N9j66q9J58q9M7J61k26L62m42Q6J93j11
$$ -11 57 -62 -104 -77 199 215 200 15 -188 38 50 109 -57 -146 12 -77 -30 131 -95 267 -175 -89 104 -7
7624gJ3k23J46P0j01o5J11K41l57L63j52m1j2j21J28O7L28n10J67m3j01Q6Kl2
$$ -7 6 -217 -71 -1 -102 -167 -56 185 -172 191 39 -2 -14 -135 -7 60 388 -122 45 2 -99 -13 -11 -43
7648d3j3L2L8l8o5J20N9j40kK26j09j1o7n0j76L60j51k91M25q1K0Q6p5P8R0j85
$$ -43 -56 -24 14 -24 -89 31 90 -50 -52 174 65 54 -13 -63 -239 121 -30 -321 104 23 43 129 54 132 222 37
7674C7J8Qj64J77jj96K02m0m1j66K68j32k43L66j30j84L41j70K17j08Kq8j81K92
$$ 37 55 63 -101 76 75 -121 81 41 0 -166 102 -30 -273 93 -37 -221 120 -50 167 59 61 -27 -208 84
7698H4M1j57R1k37K26k6R9j64M8K5M1n3j20o7K36j68r3J16j7Q9P4k36Q0K67m8
$$ 84 125 -32 59 -178 48 22 121 -43 5 30 71 18 -102 -169 67 -101 -194 -78 -95 -6 68 -168 -88 179 131
7723A31k11J25P1k44r0J34L72k85k8m0J26j54J16J3K86l25k9k44L31N2q1l9J88
$$ 131 -80 45 116 -128 -218 -84 288 3 -25 -65 61 -93 23 36 322 -3 -32 -276 55 107 26 -13 175
7746A75k5k65K65MJ0k29J46Nj1j42J35J48l10K37L1j70m1R9N0k56K01j72K3K52
$$ 175 150 -115 150 154 164 -65 81 86 75 -67 68 216 -94 143 174 4 -37 62 112 -144 57 -115 -92 160
7770A60j86o2O3p2K87l61L19j50j05R1J89k42j72K59j5LJ93p5k99L08k2q0p6m0
$$ 160 -26 -88 -25 -97 190 -171 148 -2 -107 -16 173 -69 -241 18 3 6 199 124 -175 133 111 31 -45 -85
7794h5J13K65k75j61O9J00j56J05J49k37j1N7O3J4j0j46K39n1q6j06K00r9k63
$$ -85 28 293 18 -143 -74 26 -130 -25 124 -113 -124 -67 -4 10 0 -146 93 42 -44 -150 50 -49 -312
7817c12K97K26k08k78M22j81J47k2j40j64R1J29J43j53J98k24k8j5Q2R4j07m4
$$ -312 -15 211 3 -275 147 -34 113 91 -49 -213 -122 7 150 -3 195 -29 -57 -72 10 104 -3 -47
7839d7J77k07l2K85l00O4J15K40l64J07N8M2j84j98j0J7J45P4J03J1p1k10P9N6
$$ -47 130 -77 -109 176 -124 -60 55 295 -69 38 96 138 -46 -244 -254 -237 -92 -18 85 96 25 -185 -106 -50
7863e0J48j98J14q7j16K04k69K2L55l77K34J23j61K0O3J7J42l26K17j67L07j17
$$ -50 98 -100 14 -73 -189 15 -254 -232 123 -254 -20 103 -58 -38 25 42 184 -142 75 -92 215 98
7885I8j59j43K60j41j30L37j38k25L26p2j19K71r0p8K45p9l12Q6j97K08o8rJ87
$$ 98 -61 -204 56 -85 -215 122 -16 -241 85 13 -106 165 75 -3 242 163 -149 -63 -260 -52 -120 -129 58
7908E8K62m06J27L9k52K0R0p0K46k13Q3L8o0N0K69j18k78J88J4O0k92L38k70j3
$$ 58 320 -86 41 80 -172 -152 -62 -132 114 -99 -16 22 -38 12 281 163 -115 73 87 147 -145 193 -77 -90
7932i0J0Qj00J85K78l94K06j58J95P3j71j72L64l52K24j12M6l5q7J05R3j88N9
$$ -90 -80 -72 -172 13 291 -103 103 -55 140 213 42 -130 234 -118 106 -6 40 5 -82 23 116 -72 -13
7955a3J27j27J43j49m6j76L68j56J04JJ13k38k3J84j06p5j4J30n4j6J57l83K35
$$ -13 114 -13 130 -19 -65 -241 127 -29 75 76 189 -49 -72 112 6 -69 -83 47 -7 -23 134 -249 -14
7978a4N6J49k12k36J75J24O5n8m5q6O8J13L8k53K02k33N4J90J67j27M5l83J08
$$ -14 42 191 -21 -257 -82 42 107 49 4 -82 -14 99 137 -116 86 -147 -93 97 264 137 182 -201 -93
8001i3KJ61J20j35j98k6K86r0k01K41Q3Pj98LQ7oM9Mk86K15m1L6K23m65L08j66
$$ -93 -91 70 190 55 -143 -169 117 27 -174 67 150 157 -41 -38 49 43 92 96 -190 25 -16 20 243 -222 86 -80
8027h0J98j62J43l4J28l76L78m1R7k89K89j16k91N1K2p5K31RR6j89J67n3r8j06
$$ -80 118 -44 99 65 193 -183 195 154 251 -38 251 135 -156 -105 -83 -158 73 82 178 -11 156 103 5 -101
8051a01n6K12k01K47k40K38j69L39n20J73J71k13N4r6L5M1J40j37m6Q6O8p3o8
$$ -101 -157 55 -146 101 -139 99 -70 269 -251 -78 93 -120 -66 -162 -127 -86 54 -83 -129 -43 25 -48 -116
8074a16K5K57l71K44rr3m9N9LL05k10L2J83p6k84K5L91l07O4j11LK5k18K20k6
$$ -116 -91 166 -205 39 30 -63 -112 -53 -50 255 45 77 260 184 -100 -75 316 9 73 -38 -35 -10 -228 -8 -34
8099c4p0J41L4k07K2L21m78L40j13j27p5K87j24o6K37j34j6L39k86J49k16N0J6
$$ -34 -104 37 71 -136 -114 207 -271 69 -44 -171 -246 41 -83 -149 88 -46 -62 277 -9 140 -76 -26 -10
8122a0M5nK2p3L54k67K8j91K48j97J81r7J02L4k98J74LO2m32K67l5j53J57K27
$$ -10 35 30 52 -21 333 66 94 -97 151 -46 135 38 140 174 -124 50 53 115 -317 -50 -85 -238 -81 146
8146A46q5k05Q9J21n8k45K33K28k71k01J97J54r6K26k05l87M40k60J65R0K5p8
$$ 146 61 -144 -55 66 8 -237 -4 224 -47 -248 -51 103 7 233 28 -359 81 -179 -14 76 101 23
8168B3l59M12j10q4K42l26R8L57m67L09Rp4J50m0r5%Q7j20M2l4k74J83j10
$$ 23 -336 76 -34 -118 124 -202 -104 253 -214 95 104 30 180 140 45 45 132 12 54 20 -254 -71 -181
8191a81
$$ Imaginary data points
##PAGE= N=2
##DATA TABLE= (X++(I..I)), XYDATA
0@%%%%%%%Qj6J6k4L2m0M8o0Q4j04J28j54J84k22K64l13L69m34N07n91O84p88R08
$$ 0 0 0 0 0 0 0 0 8 -8 8 -16 16 -24 24 -36 48 -56 72 -82 102 -120 144 -169 200 -234 273 -318 366 -422 486
30D86j040J185j345J522j720J938k177K441k730L043l385L761m173M622n113N649
$$ 486 -554 631 -714 808 -912 1026 -1151 1290 -1440 1603 -1782 1979 -2194 2428 -2685 2964
46B964o234O875p573Q337r181J0115j1146J2293j3576J5020j6659J8533k0706
$$ 2964 -3270 3605 -3968 4369 -4812 5303 -5843 6450 -7126 7894 -8765 9768 -10938
59a0938K3256k6298L0001l4617M0552m8497N9717p6830J06282j70275N31980j56805
$$ -10938 12318 -13980 16021 -18596 21956 -26541 33176 -43654 62628 -107647 424333 267528
71B67528m64905P87377q10802M70769Q7628o15485N99796k91206j30829M92283
$$ 267528 -197377 590000 -220802 249967 337595 -277890 321906 30700 -100129 392154
81C92154n09465J76871Q9083k15177K50899j44716j25388J60128o7822m0889Q7458
$$ 392154 -117311 59560 148643 -66534 184365 39649 -85739 74389 6567 -34322 53136
92E3136r1792j13601K40109j35652p714J28297k92527L07572m185k94833L92711
$$ 53136 -38656 -152257 87852 -47800 -55514 72783 -219744 87828 83643 -211190 181521
103A81521l24222N7497L11058m74962L66398j01746k57306N43396m25417O5579
$$ 181521 -142701 -85204 225854 -249108 117290 15544 -241762 301634 -123783 -58204
113e8204K48129m09865M00407j21966k14076L51070l12679J25160J45074k77572
$$ -58204 189925 -219940 180467 58501 -155575 195495 -117184 7976 153050 -124522
123a24522J86018o6379n759J20645j46223N4047J5537q771J9164k0869l862m7692
$$ -124522 61496 -4883 -10642 110003 -36220 17827 33364 24593 43757 22888 19026 -28666
135b8666O8991k1468k2115K5571j02839J36135k1326q7874J32035j52228J10184
$$ -28666 40325 18857 -3258 22313 -80526 55609 34283 -53591 78444 -73784 36400
146C6400N4784j73682J90100j51737N725J85347k43189J29588j0627j18961K25772
$$ 36400 91184 -82498 107602 -44135 -38410 146937 -96252 33336 22709 -96252 129520
157A29520j83052K2943J13602j83321J77729m8797q4797J21495j24375R2943J9707
$$ 129520 -53532 -30589 83013 -100308 77421 28624 -56173 65322 -59053 33890 53597
168E3597j16864Q6832l8212J3010L5898o6131L1606r056R536K5519l1637k822
$$ 53597 -63267 23565 -14647 -1637 34261 -31870 -264 -9320 216 25735 -5902 -8724
180h724q325M4663k4083j3135K4274n8355O9267j4841l4631N8858q5931O1259
$$ -8724 -17049 27614 3531 -9604 14670 -43685 25582 10741 -23890 34968 -50963 10296
192A0296M0462r0825P0760n3270O214Q5247j16084N5547L597n9376J02640p0510
$$ 10296 50758 -40067 30693 -22577 -16363 68884 -47200 8347 11944 -47432 55208 -15302
204a5302o800M2716n5579O3545j4469l8569L8131k4645K5566M794l4271J5485
$$ -15302 -22102 20614 -34965 28580 14111 -24458 13673 -10972 14594 19388 -14883 602
216F02j5182K1719M011k6585J269j02K8576j3703n506K534j4131L8818j4983j8697
$$ 602 -14580 7139 11150 -15435 -14166 -14268 14308 605 -4901 -2367 -16498 22320 7337 -11360
230a1360J7784k6832K7067P252l6754K5851k0792J1949K5477l8341J9586r014
$$ -11360 6424 -20408 6659 13911 -22843 3008 -17784 -5835 19642 -18699 887 -8127
242h127L829K8292l1520L010N718o253J8850j4611j0015O537o32J3734j1361k211
$$ -8127 -4298 23994 -7526 -4516 1202 -5051 13799 -812 -10827 -4290 -4922 8812 -2549 -4760
256d760K823r44J5845j3726L715n858o006K1903j5209l431K947j0318K1790m351
$$ -4760 -1937 -2881 12964 -762 2953 -2905 -8911 12992 -2217 -5648 -2701 -13019 8771 4420
270D420j5056J5775j2108J2900P366k2335J2447p105M131Q148j6766M236K175
$$ 4420 -10636 5139 -6969 5931 13297 -9038 3409 -3696 435 8583 -8183 -3947 -1772
283a772l535J0125l356r746R487R8K116L523j0243j938J0994k646o221M941j1962
$$ -1772 -5307 4818 1462 -8284 1203 1301 3417 6940 -3303 -5241 5753 3107 -3114 1827 -10135
298a0135J1863L798j2432J2042j1425N810J1816j7282Q472Q84j2639J9412j2428
$$ -10135 1728 5526 -6906 5136 -6289 -479 11337 -5945 2527 3411 -9228 10184 -2244
311b244m479J3658k1023J9624N7j7492J8053r189K029J2105j7652O116N405j1933
$$ -2244 -6723 6935 -14088 5536 5593 -11899 6154 -3035 -1006 11099 -6553 -437 4968 -6965
325f965J3813r376o127J3434q323K284K836n260M437N68m880Q318m607o838J4149
$$ -6965 6848 -2528 -8655 4779 -3544 -1260 1576 -3684 753 1321 -3559 4759 152 -6686 7463
340G463r289l9Q837j3478Q412N195j6047J4776n195j0091K1184j8321M122R873
$$ 7463 -1826 -1865 6972 -6506 1906 7101 -8946 5830 635 -9456 11728 -6593 -2471 7402
354G402j6546J7109q341m560J7395j8100P990R051j9491J8151p201r318J9432
$$ 7402 -9144 7965 -376 -4936 12459 -5641 2349 11400 -8091 10060 2859 -6459 12973
367A2973j8369N826P135j3527J0372j173m006P564n427L28O433n938K231J109
$$ 12973 -5396 430 7565 -5962 4410 3237 -769 6795 1368 1696 8129 2191 4422 5531
381E531m969K950K751n275K004K75o639J3881j0877l022J3851j7222J1162J219
$$ 5531 562 3512 6263 988 2992 3267 -3372 10509 -368 -3390 10461 -6761 4401 5620
395E620j4688J7672j1871r64J7692k2828J2040L287j4988K3254k0413R19J5297
$$ 5620 -9068 8604 -3267 -4231 13461 -9367 2673 5960 -9028 14226 -6187 -5268 10029
408A0029k0487J5475l977j1276J6599j0757M664O862j6959J4466K10o744Q791
$$ 10029 -10458 5017 1040 -10236 6363 -4394 270 7132 -9827 4639 4849 -1895 6896
421F896p230K566J507j700M68j01m364k091J2786r723l389R774p642P329j333
$$ 6896 -334 2232 3739 2039 2507 2406 -1958 -4049 8737 -986 -4375 5399 -2243 5086 3753
436C753q864J5452j5087M591J6438k7738J6802o6j0262K0853k5016P616J4294
$$ 3753 -5111 10341 -4746 -155 16283 -11455 5347 5281 -4981 15872 -9144 -1528 12766
449A2766k3538J7661l217j2956J7881j2612Q644L326j9433J8935j200o736M727
$$ 12766 -10772 6889 3672 -9284 8597 -4015 4629 7955 -11478 7457 6257 -479 4248
462D248n084L598n84R36j013l191k258K682P792j1031m064J3037o338M710j114
$$ 4248 -836 2762 2178 3114 2101 -1090 -3348 -666 7126 -3905 -7969 5068 -1270 3440 2326
477B326r422J7994j5289L937J4322k6967J4266M003q283J2022j8537O831J3073
$$ 2326 -7096 10898 -4391 -454 13868 -13099 1167 5170 -3113 8909 -9628 -2797 10276
490A0276j7559J2391n090p028J2387q513J0605q224q931J7825m966M45l243l730
$$ 10276 -7283 5108 18 -7010 5377 -3136 7469 -755 -9686 8139 3173 3618 375 -3355
504c355J0019n064J812J52r532P455j264M160k318j4354J6961p61m596M603r001
$$ -3355 6664 1600 3412 3564 -5968 1487 223 4383 2065 -12289 4672 3911 -685 3918 -5083
519e083R011p11j287O607j2280O71Q733k088j544j1010N896Q151q395L908n274
$$ -5083 3928 3217 1930 8537 -3743 -3072 5661 3573 2029 -8981 -3085 5066 -3329 579 -4695
534d695K022K412r18Q433j5151P88J1642o335L879r358j566J5665j3497M609N608
$$ -4695 -2673 -261 -1179 7254 -7897 -7109 4533 -1802 2077 -7281 -8847 6818 -6679 -2070 3538
549C538j6884J3620M77l706M148j3217J0284P809j1382J969J503j199M234o64
$$ 3538 -13346 274 751 -2955 1193 -12024 -1740 6069 -5313 -3344 -1841 -3040 1194 530
563E30L59l036j751P434K059p269n038Q580m09j409l70o268Q514l131o1Q780j4285
$$ 530 889 -2147 -3898 3536 5595 -1674 -6712 1868 1459 50 -320 -6588 1926 -1205 -1266 7514 -6771
580f771K780J2392r778M679n558m318J5313j2266L591L756j4657J3581Q16o596
$$ -6771 -3991 8401 -1377 3302 -2256 -6574 8739 -3527 64 3820 -10837 2744 3560 -3036
594c036M571r361P179R140j3014K999J608k604P610l415k955l72J003M412Q67
$$ -3036 1535 -7826 -647 8493 -4521 -1522 86 -2518 5092 1677 -1278 -1650 -647 3765 4632
609D632o405l257Q140N08k422o29m239M391L525l614J888m738j107J0246m443
$$ 4632 -1773 -5030 3110 3618 1196 567 -3672 719 4244 630 2518 -2220 -3327 6919 2476
624B476k594k821M6Q623n480j790M76l713P634N36o228K163l849M775N111r397
$$ 2476 -118 -2939 -2893 5730 250 -1540 -1064 -4777 2857 3393 -2835 -672 -4521 254 5365 -4032
640d032J330N99J507L458l336k034pK602L334j620n214L49L831K714l752l077
$$ -4032 -2702 -2103 -596 2862 -474 -2508 -2515 87 3421 1801 -3413 -3064 767 3481 -271 -3348
656c348j29K961L630m063K46k235J308P447l577l572o41J503M822j656n068N89
$$ -3348 -3477 -516 3114 -949 -703 -2938 -1630 5817 2240 -1332 -1973 -470 4352 2696 -2372 -1783
672a783o7M398M02m933L2q55P142L02o981J861k34K748K177n782j368J767O47
$$ -1783 -1850 2548 2950 -1983 -1951 -2806 4336 4638 -2343 -482 -716 2032 4209 -1573 -2941 -1174 -527
689e27L938l991l621L037K290K520l361k565m9L348K317l838k606j11L170K619
$$ -527 3411 -580 -4201 -1164 1126 3646 285 -2280 -2329 1019 3336 -502 -3108 -3219 -49 2570
705B570k908k815P87K097L555k358l262J251p03M997j770m557J165k52M022M01
$$ 2570 -338 -3153 -2366 -269 3286 928 -2334 -1083 -1786 3211 1441 -3116 -1951 -2203 1819 2220
721B220m711N06P81K798K119n635J84J894N33L356n327q98K535K49K288k198k760
$$ 2220 -2491 -1985 -1204 1594 3713 -1922 -1738 156 689 4045 -1282 -2180 355 604 2892 694 -2066
738b066J605K167P53r39l376Q36K581J205j697k744N54J589L617l530j730O62
$$ -2066 -461 1706 2459 1520 -1856 -1020 1561 2766 1069 -1675 -1121 468 4085 555 -1175 -513
754e13J063L300k812k237N29P74K188p89l836P97P86K518K57m663J990l41J995
$$ -513 550 3850 1038 -1199 -670 104 2292 1503 -2333 -1536 -750 1768 2025 -2638 -648 -989 1006
771A006J538m547k81J742J785M00k710r51J579J039J009k538j551J774L94J690
$$ 1006 2544 -2003 -2284 -542 1243 1643 -1067 -2018 -439 600 1609 -929 -2480 -706 -312 1378
787A378k223j776J448J620P58j603o18n08K153J396j533j818P9J651P12q35k146
$$ 1378 -845 -2621 -1173 447 1205 -398 -1016 -1524 629 2025 492 -1326 -1247 404 1116 281 -1865
804a865N56J541J209j781k62J35N10K566j883q87R6J64K085q10j572P8R1J722
$$ -1865 -1309 232 1441 -340 -602 -467 43 2609 726 -161 -65 99 2184 1374 -198 -120 -29 1693
822A693M69k593M17J63J636L51k930R42M1P69M68j320r98O28J054L90o08j664
$$ 1693 2162 -431 -14 149 1785 2136 -794 148 189 958 1426 106 -892 -264 790 1180 572 -1092
840a092O52J419l78j239n51q22J313O20j398J24j563L115L32k443J672j622J694
$$ -1092 -440 979 601 -638 -1189 -2011 -698 -78 -1476 -1352 -2915 200 532 -1911 -239 -1861 -167
857a67J056k896J632p53j346L892l048l16J525k163L906j951o75K448k505K348
$$ -167 889 -2007 -375 -1128 -2474 1418 -1630 -1946 -421 -2584 1322 -629 -1304 1144 -1361 987
873I87K35k423J586o40J27K007l079O99J246l05K38q39K21p4R77j252J276p03
$$ 987 1222 -1201 385 -255 -128 1879 -1200 -501 745 440 678 -161 60 -14 963 -289 987 284
891B84k233M002j731r28K044k881K645J58l134L956l065k96L679m619L163j420
$$ 284 -1949 2053 322 -606 1438 -1443 1202 1360 -1774 2182 -883 -1179 2500 -2119 1044 -376
907c76j723N159m925J524K246l687L274p54j500K422l601K301J251l312K151j317
$$ -376 -2099 3060 -1865 -341 1905 -1782 1492 738 -762 1660 -1941 360 1611 -1701 450 -867
923h67J409o10j324K279j554J95M09K19J35j586J697k99q29J136j198J455p29
$$ -867 542 -68 -1392 887 -667 -472 -63 156 291 -1295 402 103 -726 410 -788 667 -62
940f2j439M312m164L57K188k304K617l023J620J916m624L861k38k184L608l870
$$ -62 -1501 2811 -1353 -996 1192 -1112 1505 -1518 102 2018 -2606 1255 1017 -1167 2441 -1429
956a429L211Q01n326N939k827j208L557m744L370o66k362M824l932l43L428k651
$$ -1429 1782 2583 -2743 3196 369 -839 2718 -2026 1344 678 -1684 3140 -792 -1135 2293 -358
972c58J426p99p57K211k415O68P18j094n29J081R66j998J254j702J275J504l931
$$ -358 1068 269 -488 1723 -692 -24 694 -400 -929 152 1118 -880 374 -1328 -53 1451 -2480
989b480L019p6l472N175k920n98K804m609N696k244l525O552m952J734K006m869
$$ -2480 539 463 -3009 2166 -754 -1352 1452 -3157 2539 295 -3230 3322 -1630 104 2110 -2759
1005b759M545k383j219M862m946J141K189k495K797k378L02K112k251J212q6m66
$$ -2759 1786 -597 -1816 3046 -1900 -759 1430 -1065 1732 -646 -344 1768 -483 729 643 177
1021A77o43Q13J182j480k77L3L37J600k971J530P09k183L136k093k11J248k507
$$ 177 -466 347 1529 49 -228 -195 142 1742 -1229 301 1010 -1173 1963 -130 -341 907 -1600
1038a600M476k997j717L632k700J743N7k531L269k331M02K739m403J931k9n9J796
$$ -1600 2876 -121 -1838 1794 -906 837 894 -1637 1632 -699 -297 2442 -1961 -30 -59 -118 1678
1055A678l536K229K73j333K322k344K06Q21q83J975j980j149K175m15P73j795
$$ 1678 -1858 371 644 -689 1633 -711 -505 316 -567 1408 -572 -1721 454 39 812 -983
1071i83M44R33j242J514p48n31K74N5J412j833k41P63l10J562j475p15K269k454
$$ -983 -539 394 -848 666 -82 -613 -339 -284 1128 -705 -946 -183 -493 1069 -406 -1121 1148 -1306
1089a306K378k20l149L431j890J534J91k991K798o92j94J648k978J577O20j337
$$ -1306 1072 852 -2297 1134 -756 778 969 -2022 776 84 -110 1538 -1440 137 757 -580
1105e80K392k675K60J565j234J342j497j37J390n40L23o19o45R42J35O98j573
$$ -580 1812 -863 -603 962 -272 1070 -427 -564 826 286 609 -10 -655 287 422 1120 -453
1122d53m3J002l97J072j578l10J584r69J761j918p55J651q23J200m38k219K287
$$ -453 -496 506 109 1181 -397 -707 877 -92 1669 -249 -1004 647 -176 1024 586 -1633 654
1139F54n60K9J107k587J395K86j73Q15k027Q23O85K7J4j601O56Q55k74M77j351
$$ 654 94 123 1230 -1357 38 324 151 966 -1061 -238 447 474 488 -1113 -457 398 124 601 -750
1158g50P5J080j79N17j443o6R67j92Q16j692Q1Q59l0P04r04o96J122o5P71j012
$$ -750 -675 405 226 743 -700 -766 201 9 825 -867 -786 73 43 747 -157 -853 269 204 975 -37
1178c7j224J628k44N71o41j339J349K35O69o51j187J190j79O99j73j641P90O98
$$ -37 -1261 367 123 694 53 -1286 63 298 967 316 -871 319 140 839 666 -975 -185 513
1196E13n3M39j555L45R40k00N03j849Q30N90k07O90j317j30Q98K37q3q26l06O89
$$ 513 460 899 -656 -311 629 429 932 -917 -87 503 296 986 -331 -461 437 674 591 -235 -541 148
1216A48j0P64j317m87J430n38P27j080p59J299J14N09j001n97R04J27N82q52q09
$$ 148 138 902 -415 -902 528 -10 717 -363 -1122 177 291 800 -201 -798 106 233 815 -37 -846
1235h46J023P9L79l21j644J265K17J41K74j638P82L51K34J20j246L92J212m12
$$ -846 177 256 635 314 -1330 -65 152 293 567 -1071 -289 62 296 416 -830 -438 774 362
1253C62K35j316Q1J205l47M51j216M12M72K14o1r49K62O45%K70r76l79J171j33
$$ 362 597 -719 -638 567 220 671 -545 -133 339 553 492 -457 -195 450 450 720 -256 -635 536 403
1273D03L65p16o60J198j61L42q36q16J483o76M04j7j303J255L32l25M52j468N62
$$ 403 768 52 -608 590 429 771 -65 -881 602 -74 330 313 -990 265 597 272 724 -744 -182
1292a82P02l50K36j357M30J328o27J36r49M02M19K2L61j221L98K25J86K19j162
$$ -182 520 170 406 -951 -521 807 180 316 -633 -231 188 210 571 -650 -252 -27 159 378 -784
1311g84N33O17o22J097j792O46O88n58J284j730j60J408p19O83o21j169J822p61
$$ -784 -251 366 -256 841 -951 -305 383 -175 1109 -621 -781 627 -92 591 -30 -1199 623 -138
1329a38L30N03j823J630j65k89M68j521J542p2m63M88j033N00L94m41O13q63J95
$$ -138 192 695 -1128 502 337 48 516 -1005 537 465 2 490 -543 -43 351 -90 523 -340 -145
1348a45N72p3K38j186P53K07l88Q79j644Q38K77m96R35j338L16R26r63J141j314
$$ -145 427 354 592 -594 159 366 -22 857 -787 51 328 -168 767 -571 -255 671 -292 849 -465
1367d65m16J732j660J168k34j568K067q86L64K99j496J567K6j045J254j552Q35
$$ -465 -881 851 -809 359 125 -1443 624 -262 102 401 -1095 472 498 -547 707 -845 -10
1384a0N22j158J411j194j33R96l90j45k59J62M02j41k54j11K65l07L10M31j082
$$ -10 512 -646 765 -429 -562 434 44 -101 -360 -198 204 63 -191 -302 -37 -344 -34 397 -685
1403f85N15O07o40J072j668N46J229j680J548p45p22J419j305J067k12j390J905
$$ -685 -170 437 -203 869 -799 -253 976 -704 844 99 -623 796 -509 558 346 -1044 861
1420H61r08k06R49j733J546k56p84J410j392K42M06k17K46m33j2R31j224O28p0
$$ 861 -47 -253 696 -1037 509 253 -531 879 -513 -271 135 -82 164 -269 -281 650 -574 54 -16
1439a6k1J71m35L61p28M77J12j20M82j093O36K83m85N31n88P2O76n05O28n92o92
$$ -16 -37 134 -301 60 -668 -191 -79 -199 283 -810 -174 109 -376 155 -433 -361 315 -190 438 -154 -846
1460h46J519j163P75l87o54J753j244K27O24j363Q22J45l15N40p77L50R25j488
$$ -846 673 -490 285 -102 -756 997 -247 -20 604 -759 63 208 -107 433 -344 6 931 -557
1478e57R49l96r0L88n10O66o05l12O73l5k74K32P1k44J25r9J40J73m17N9M55o52
$$ -557 392 -4 -94 294 -216 450 -155 -467 206 171 -103 129 200 -44 81 -18 122 295 -122 -63 392 -260
1500b60J9M97o93Q36o99k28J166j329Q66K16q64Q53k54k10N42j026O98q5p52J219
$$ -260 -241 256 -437 399 -300 -528 638 -691 175 391 -473 380 126 -84 458 -568 130 45 -707 512
1520E12p27P8L76p37O29k07r7K10k85J40L5r2j28nL83l5k6J25l24L38l65J41L09
$$ 512 -215 -137 239 -498 131 -76 -173 37 -248 -108 -73 -165 -293 -298 85 50 24 149 -175 163 -202 -61 248
1543B48l11K15j94K14K13o03M46J5j81L8k91r8N21n00N06k20k66M32k85J29j82
$$ 248 -63 152 -42 172 385 -218 228 243 62 100 -191 -289 232 -268 238 18 -248 184 -101 28 -154
1564a54KN42m32j6L12l30K27n5mo2n5P8K1P5j23j12K34l60L06J41k43N8m4j09
$$ -154 -152 390 -42 -58 254 -76 151 96 92 30 -25 53 74 149 26 -86 148 -212 94 235 -8 50 6 -103
1588a03L25l65L42k54N4n8O4J15n4l54J40K3K56k17J51J63k69K2K03k35n7m8%
$$ -103 222 -143 199 -55 -1 -59 5 120 66 -288 -148 -125 131 -86 65 228 -41 -19 184 -51 -108 -156 -156
1611a56L98n01L77j45L4O9o6j17m3K50L8J3k35J63k80L54J42k81k41K67j73K73
$$ -156 242 -259 118 -27 7 76 10 -107 -150 100 138 151 -84 79 -201 153 295 14 -227 40 -133 140
1633A40k47L61l57K25J68k65N8j28LJ38J89l85j55L46o7p2J83l10J23pO2k7j19
$$ 140 -107 254 -103 122 290 25 83 -45 -42 96 285 -100 -255 91 24 -48 135 -175 -52 -59 3 -24 -143
1656a43K04j16J17j87J18m0J21j48J85r1o5K49j58J03k09O1l0L10l50k9k19L58
$$ -143 61 -55 62 -125 -7 -47 74 -74 111 20 -45 204 46 149 -60 1 -29 281 -69 -98 -317 41
1678D1j45K39k69J53j6j36J33j15K32K00r9l21j29j46N89m7j76j23K11m7K3rj90
$$ 41 -104 135 -134 19 3 -133 0 -115 117 317 218 -103 -232 -378 211 164 -12 -135 76 29 52 43 -147
1701a47j5K07LJ52j54k71K45j66K60Kl50J37K03j5j36J37l46L61J14l74J05Q0
$$ -147 -162 45 48 200 46 -225 20 -146 114 116 -234 -97 106 91 -45 92 -254 107 221 -153 -48 32
1723C2R9J11l07N7j29L88j18j58P8M6j40l1L6J35o1J97j78l01L16k60K73j50N7
$$ 32 131 242 -65 -8 -137 251 133 -25 53 99 -41 -72 -36 99 38 235 57 -244 72 -188 85 -65 -8
1746hl3J06L6J4l20Q9j37J78K25l35J92q1J29K7r9J30R4k96Q8mj30Q6j6L56j56
$$ -8 -41 65 101 115 -205 -116 -253 -75 150 -185 7 -74 55 82 -17 113 207 -89 -1 -5 -135 -49 -65 291 135
1771A35o7j52k78L38M5K6j85J02j8J21l9J16J0l7n0k23j51K39L9j7j74L67j78
$$ 135 68 -84 -362 -24 21 47 -138 -36 -54 67 28 144 154 117 67 -156 -307 -68 -29 -46 -220 147 -31
1794c1R7R1k39J93j11n1L07j54o4j06J20Pj0j27J03O1R7r8j59J86r1l9K31j58
$$ -31 66 157 -82 111 0 -51 256 102 38 -68 52 59 49 -78 25 86 183 85 -74 112 21 -18 213 55
1818E5K8j41J85J19k8l46K27J23o8l42K09l9M4l4j39O4M5j78M53l16j19L82l55
$$ 55 83 -58 127 246 218 -128 99 222 154 -188 21 -18 26 -8 -147 -83 -38 -216 237 -79 -198 184 -171
1841a71K97k33J3Q0R5q9K10o17O90k47J50j95r1l4K75J17k86o7Q4M7J44j34o3
$$ -171 126 -107 -94 -14 81 -8 202 -415 275 28 178 -17 -108 -142 133 250 -36 -103 -19 28 172 38 -25
1864b5n1J27n7m7L41n31K82j07K77k04J51j18j13K72l48Q5L37m99L85j34k2J23
$$ -25 -76 51 -6 -53 288 -243 39 -68 209 5 156 38 -75 197 -151 -66 271 -228 157 23 1 124
1886A24j79j01J54r7K05l64K80p6r9L35m4n4rj33j5J52j01m5j6M4j22K29j72J06
$$ 124 -55 -156 -2 -99 106 -258 22 -54 -153 182 138 84 75 -58 -73 79 -22 -67 -83 -39 -161 68 -104 2
1910BrJ60J6n3l96n4N5L92o0j23r4K10j27L52o30J93L36k74J10k36K52J80k02
$$ 2 -7 153 169 116 -280 -334 -279 113 53 -70 -164 46 -81 271 -359 -166 170 -104 6 -230 22 202 0
1933@k57K52Q9j40j35J49M8N2j29J43j52K62j04n6k2J65k12j2j51K32P0p5n1R5
$$ 0 -257 -5 84 -56 -191 -42 6 58 -71 72 -80 182 78 22 0 165 -47 -59 -210 22 92 17 -34 61
1957F1o4j93R4M7J94k38n5J36L37q8k45j11L38k01J6J02j13J06k53K15n8O6o4
$$ 61 -3 -196 -102 -55 139 -99 -154 -18 319 231 -14 -125 213 12 28 130 17 123 -130 85 27 93 29
1980B9K30n39L76j12J85k35j1M3N9j29J10r7L2J22J64l27j0p7K06J21k85J97J57
$$ 29 259 -280 96 -16 169 -66 -77 -34 25 -104 6 -91 -59 63 227 -100 -110 -187 19 140 -145 52 209
2003B09j08o3m6m8Q0J1K21k24K3k30L28r1rr6j7J69l64J99O0q2L88m96L34j33
$$ 209 101 38 -8 -56 24 35 256 32 55 -175 153 62 53 -43 -60 109 -255 -56 4 -78 310 -186 148 15
2027A5qk0j04J3J57O3k5N8k93L39k47p7J01j07J99K4l90K49j15K47l23k1L75k90
$$ 15 7 -13 -117 -104 53 116 91 149 -144 195 -52 -129 -28 -135 64 88 -302 -53 -168 79 -244 -265 110 -180
2051a80L25o8O2l21J78N0j50J28n9k0R1r1K18j05k7q7Kj23J45q0J11K6j84L63
$$ -180 145 77 139 -182 -4 46 -104 24 -35 -55 36 -55 163 58 31 -56 -54 -177 -32 -112 -1 25 -159 204
2075B04n5l24P7J0K22j30m6r5J41N0k23K07Qk37L6J11l5L3J01L9j31Oo2m7J67
$$ 204 149 -175 -98 -88 134 4 -42 -137 4 54 -169 38 46 -191 -155 -44 -79 -46 55 94 -37 -31 -93 -140 27
2100B7j45j86L17k65K21N3j45O5M6L2L4n1q5l4J68l04L56j37O5J94k47j67L60
$$ 27 -118 -304 13 -252 -31 22 -123 -58 -12 20 54 3 -82 -116 52 -252 104 -33 32 226 -21 -188 172
2123A72j37J23k69R5q7J49j88j96K12l4J16k02K63p0l03l3K41n5M86k88L9M7j32
$$ 172 35 158 -111 -16 -103 46 -142 -338 -126 -160 -44 -246 17 -53 -356 -389 -148 -203 283 -5 34 81 -51
2146e1k7J75k20J17J26j45O8p0R4l30K72k35N18k69j11RJ01p0n2L7N2J3j6j78
$$ -51 -78 97 -123 -6 120 -25 43 -27 67 -263 9 -226 292 23 -88 -79 22 -48 -100 -63 -11 2 -14 -192
2170a92j59N14j78O0j98j22L90N5n9o3j65O5Om3J53n8r4J76oj4n1j4P0rPr5l9
$$ -192 -351 163 -15 45 -153 -275 115 170 111 48 -117 -52 -46 -89 64 6 -88 88 82 68 17 3 73 64 71 -24 -63
2197f3N8O3K1K93m22n7K50k94P7J52M6K02o3j27O4o34M31JP0k15n9J06K17j28
$$ -63 -5 58 79 372 -50 -107 143 -151 -74 78 124 326 263 136 200 -434 -3 -2 68 -147 -206 -100 117 -11
2221a1j92K01k44L49l35K47M5k31M5R4M1j17PQ9%q2k8Q9j65J12j33L63P0k95J8
$$ -11 -203 -2 -246 103 -232 15 60 -171 -126 -32 9 -108 -101 -12 -12 -94 -122 -33 -198 -86 -219 144 214 -81 -63
2246f3L10j64j74J7J5J43r4m3o9J35k24L24l5l2j87K00j57K95p4r0j20J15K21
$$ -63 247 83 -91 -74 -59 84 -10 -53 -122 13 -211 113 78 46 -141 59 -98 197 123 33 -87 28 249
2269B49l07J26j40j11R8K0L57k92p1J00K0O6o3O8j65n1lq8K24k07K5q0J49J8p9
$$ 249 -58 68 -72 -183 -85 -65 292 0 -71 29 49 115 52 120 -45 -96 -99 -187 37 -170 -145 -225 -76 -58 -137
2294a37p9J81J05J24j27k30K74j86R5k5P5q1k15Q9J63m7j44J04J69o2o5J15J60
$$ -137 -216 -35 70 194 67 -163 111 -75 20 -5 70 -11 -226 -137 26 -21 -165 -61 108 46 -19 96 256
2317B56k18j7J00q8l5p1j51K91J2j35R8j96j13L10oj21L7p4O5o6nJ0J91q2j34
$$ 256 38 21 121 33 -2 -73 -224 67 79 -56 42 -154 -267 43 37 -84 -47 -121 -56 -122 -127 -117 74 -8 -142
2342a42K20j35L2J32j65J58j37J98r9o9l3K03J3j40k2K44k75J0K5j49J52L1l33
$$ -142 78 -57 -25 107 -58 100 -37 161 62 -7 -40 163 176 36 14 258 -17 -7 18 -131 21 52 -281
2365b81L16j38J51Q5l38J57K34Q2l86j10J44P7K4K32k20Kn1O6j8j17J03j28J88
$$ -281 35 -103 48 133 -205 -48 186 268 -118 -228 -84 -7 17 249 29 31 -20 46 28 -89 14 -114 74
2388G4J01m56M99j19k94J02l5j44K89J88k22k86K23J22om0r4J01p6j98J02K95
$$ 74 175 -281 218 99 -195 -93 -128 -272 17 205 -17 -303 -80 42 36 -4 -98 3 -73 -271 -169 126
2410A26m40L16J9M1j65P3j08K50l05J79Lr0M6RK8N9j22m5j49K06j19J03k2J12
$$ 126 -314 2 21 62 -103 -30 -138 112 -193 -14 -11 -101 -55 -46 -18 41 -81 -126 -275 -69 -188 -85 -107 5
2434Ej23J50n8mn1K57j42N7J73j43J26j38L2JK3j37N5l7j12k5R6j1j32K59O0k71
$$ 5 -118 32 -26 -30 -81 176 34 91 264 121 247 109 141 142 165 28 83 46 -66 -91 5 -6 -138 121 181 -90
2460i0N5r4J29Q2k01J29Q2j11k1j29o0K72J23j93J88j1k00J91r9l0m0j5j14oJ
$$ -90 -35 -129 0 82 -119 10 92 -19 -40 -169 -229 43 166 -27 161 150 -50 141 42 12 -28 -43 -157 -163 -162
2485a62K51l43J84q5J71m2q6K84n17L38Q9j75Q3QR5r0J04K6r0k2j52P5M20k35
$$ -162 89 -254 -70 -155 16 -26 -112 172 -345 -7 82 -93 -10 -2 93 3 107 133 43 21 -131 -56 364 129
2509A29Qj38K04j29r6J77j31k81K72J01k30j5O1j3J34R3j0l61K66N8l10K80N4
$$ 129 137 -1 203 74 -22 155 24 -257 15 116 -114 -129 -68 -81 53 146 136 -225 41 99 -211 69 123
2532A23Pk50P7M2j95Q5J56J67k53O1J81k15K76k43k93K15k2R2J38k06j48K17j12
$$ 123 130 -120 -43 -1 -196 -111 45 212 -41 20 201 -14 262 19 -274 -59 -81 11 149 -57 -205 12 -100
2555a00R3p4j05J33J42j96rL5j00L03j31j05K45j72K1Q9j53m9K04N0k76K61l5
$$ -100 -7 -81 -186 -53 89 -107 -116 -81 -181 122 -9 -114 131 -41 -20 69 -84 -133 71 121 -155 106 71
2578G1k91K10L9jj12J48j54%J00k6J83p4j55m9K98l52J26J9J33R3k72k81L64K39
$$ 71 -220 -10 29 28 -84 64 -90 -90 10 -16 167 93 -62 -111 187 -165 -39 -20 113 206 -66 -347 17 256
2602B56l19K20j35J21k90J86j28K68l84L94j27j3L0q3j40K03k50J83j14kR8J18
$$ 256 -63 157 22 143 -147 39 -89 179 -205 189 62 49 79 -4 -144 59 -191 -8 -122 -124 -26 92
2624I2j03O2K26l29L39k76o9M0l3N8J29j22j0j33R2J11qJ8j19J43n8N9k77N7J72
$$ 92 -11 51 277 -52 287 11 -58 -18 -51 7 136 14 4 -129 -37 74 66 84 -35 108 50 109 -168 -111 61
2649F1p8q0O2q5J62o3J66j64l6K11j10j13oJ27J48j11j09l2J07j95L59j11j69
$$ 61 -17 -97 -35 -120 42 -21 145 -19 -55 156 46 -67 -73 54 202 91 -18 -50 57 -138 221 110 -59
2672e9J65j07p4J43J05n5J98m00J39J02j45Q2l12J67j37P5R1O0j30j7MK40k18
$$ -59 106 -1 -75 68 173 118 316 -84 55 157 12 94 -218 -51 -188 -113 -22 38 -92 -109 -105 135 -83
2695h3j58L54Q4l21K28m90O60l74J01J32L4j35K54j21j49k1K03M8l17K03j73R1
$$ -83 -241 113 197 -124 104 -386 274 -100 1 133 167 32 286 165 16 -5 198 246 -71 132 -41 50
2717E0j74R1l7J93l27K79j24l5j06J12n6L40j84j9J79l14J68j94J60K1r1j08Q9
$$ 50 -124 -33 -70 123 -204 75 -49 -84 -190 -78 -134 206 22 3 182 -132 36 -158 2 23 -68 -176 -87
2740h7K44J54l37k01N12m17K28o5j75K01j23j62J64N4K37j40k4k58M95k21o4Q1
$$ -87 157 311 -26 -227 285 -132 96 31 -144 57 -66 -228 -64 -10 227 87 63 -195 300 79 15 96
2762I6j41J36P3l10J03J4J82j78k7k76J79J54N0j78K39j80M8M9j69J14N3nl9J95
$$ 96 -45 91 164 -146 -43 -29 153 -25 -52 -328 -149 5 55 -123 116 -64 -16 33 -136 -22 31 26 -13 182
2786A82m35K28J0m5P2l24L71L7K5k03O9j66K42l7p6M5P8l11K14N3K04l38LJ22
$$ 182 -253 -25 -15 -60 12 -312 59 96 121 -82 -13 -179 63 26 -50 -5 73 -238 -24 29 233 -105 -102 20
2810B0n2p0K60l27J5P9P4O8j57qN2L00Q8l02j06J73P7l04K30o6o6L39j15j23M2
$$ 20 -32 -102 158 -169 -154 -75 -1 67 -90 -98 -46 254 342 40 -66 107 184 -120 110 44 -22 317 202 79 121
2835A21j59O2k19K70k18J26K35j67r2r6K71j31L7j15j76O6J62k4p7K20l7o4j92
$$ 121 -38 24 -195 75 -143 -17 218 51 -41 -137 134 3 40 -75 -251 -185 -23 -47 -124 96 59 -5 -197
2858a97K98j54J86j20j74J19r6L61j7k87J39k2k2j29J68M4J16K84o78J58L00m20
$$ -197 101 -53 133 13 -161 -42 -138 223 206 -81 58 36 14 -115 53 97 213 497 -181 -23 277 -143
2880a43K63K21k46j10j22P4j05J59j87K53j49J01N7m7j7K3m2klJ65l01k7J40K02
$$ -143 120 341 95 -15 -137 -63 -168 -9 -196 57 -92 9 66 19 2 25 -17 -19 -22 143 -158 -185 -45 157
2904A57j63o1J75Q4j10j55J82j15M4k7k7L8M0k80O6RK48j73J08qm4j65J20J63
$$ 157 -6 -67 108 192 82 -73 109 -6 38 11 -16 22 62 -218 -152 -143 105 -68 40 32 -12 -177 -57 106
2928A06o8j82K77J0l54L65o6k7j23J67j0j08K06l9lj93K5r3L25j77j78M73m27
$$ 106 38 -144 133 143 -211 154 88 61 -62 105 95 -13 193 154 151 -42 -17 -110 215 38 -140 333 -94
2951i4l3K16j73N47m01k72K51J60k93N6K9n4J12r8J65j03l2j14J40k0K02k12Q5
$$ -94 -127 89 -84 463 62 -210 41 201 -92 -36 -7 -61 51 -47 118 15 -17 -131 9 -11 191 -21 64
2974F4P7N5l15K47j86J94P1j19n9p9O5n7j2PR9J44j42P2k22J28K73l79N7L8j45
$$ 64 141 196 -119 128 -58 136 207 88 29 -50 15 -42 -54 -47 52 196 54 126 -96 32 305 -74 -17 21 -124
2999a24K00N0k08J98j0j06J45j57K19j9m26L04o0jp6l8p2J62M4J20k76J93m1J50
$$ -124 76 126 -82 116 106 0 145 -12 207 188 -238 66 6 5 -71 -109 -181 -19 25 145 -131 62 21 171
3023A71k68Q6J83k79L32j44o8j3J04q7l0k4j1Q8r6n8QK49j63K6O1j76j19J27j28
$$ 171 -97 -11 172 -107 225 81 13 0 104 17 -13 -37 -48 40 -56 -114 -106 143 -20 6 67 -109 -228 -101 -229
3048b29O5J43J5j01J75j55j93K30N5j29m6J55m3J0p1M7J39o7k21L53R3l54L03
$$ -229 -164 -21 -6 -107 68 -87 -280 -50 5 -124 -170 -15 -58 -48 -119 -72 67 0 -221 132 225 -129 174
3071A74j05k14j06K48N2K85l17k66K18lk1p4K72j98J09j77K12L5l18K89n1j47
$$ 174 69 -145 -251 -3 49 334 17 -249 -31 -34 -55 -129 143 -55 54 -123 89 124 -194 95 44 -103
3093a03K64k17J87j7R5J6j68J4k1k35j2J78J51j60J42j03O9oo2n1J70j62J37q
$$ -103 161 -56 131 114 209 225 57 71 50 -185 -197 -19 132 -28 114 11 80 74 12 -39 131 -31 106 98
3117I8R2j57l07J16j75M34r2q2r9M03l97Q7nJ69j99J23j20R1L1m2j66J76j5j73
$$ 98 190 33 -274 -158 -333 101 9 -73 -172 231 -166 -79 -84 85 -114 9 -111 -20 11 -31 -197 -21 -36 -209
3141b09M8P6o7p8L46k33j6K37q4Q5j74j7J97O0k77J50J43k12R8op2q1K12q3k8
$$ -209 -161 -85 -152 -230 116 -117 -133 104 20 105 -69 -86 111 171 -106 44 187 -25 73 67 -5 -86 126 43 15
3166A5P2k17J78j15Oo2J97j0l17J8J37m7J77J48k71L5j59J49M3K24n3j31m2j08
$$ 15 87 -130 48 -67 -61 -123 74 64 -253 -235 -98 -145 32 180 -91 -56 -215 -66 -23 201 148 17 -25 -133
3190a33J74N9j3K8j3J12k58j91P3K00j13P7k57L34q7m9J09l1j12J34K06j76k87
$$ -133 41 100 87 115 102 214 -44 -235 -162 38 -75 2 -255 79 -8 -57 52 21 -91 43 249 73 -214
3213b14J47j0P0K15j48j30O3j06L2J4P0J53N7j14J9j76J38j89J45O4j40j04L19
$$ -214 -67 -77 -7 208 60 -70 -7 -113 -81 -67 3 156 213 99 118 -58 80 -109 36 100 -40 -144 175
3236A75l05J91j7k17K32j2P1m06M94K46l81j16k4Q3j38M79l68o0P5l8K06Qk27
$$ 175 -130 61 44 -173 59 47 118 -288 206 452 71 -45 -69 14 -124 355 -13 -73 2 -36 170 178 -49
3259d9K9N8L7j43J67k82K74M6j5p4J71k62L6m0J9j53LL00j81J27l78K70k8K50
$$ -49 -20 38 75 -68 99 -183 91 137 122 48 219 -43 -7 -47 -28 -181 -178 122 -59 68 -310 -40 -68 182
3283A82j92l5P3n8j55L16j47p8MK09l9p5m0j31L33n9J34r5k91K09j09n3L8k3K08
$$ 182 -10 -45 28 -30 -185 131 -16 -94 -90 119 80 5 -35 -166 167 108 242 147 -144 65 -44 -97 -59 -82 126
3308A26j7j18p4N3q3J94P1p0Jj36J3k0J38J18k52J17k79K22R7J60n16K40J47k04
$$ 126 109 -9 -83 -30 -113 81 152 82 83 -53 -40 -60 78 196 -56 61 -218 4 101 261 -255 -15 132 -72
3332g2J17q3n3pK39l31Q4J64l68L04P3k16K10p9N4p6j45k8L79j55n2O8P1l52L28
$$ -72 45 -38 -91 -98 141 -190 -106 58 -310 -6 67 -149 61 -18 36 -40 -185 -213 166 11 -41 27 98 -254 74
3357G4l7k28L9P9O7o4J24O9K2J24j24j90j47L3k5J06J40p7J02k95J05K87k38J02
$$ 74 37 -191 -152 -73 -6 -70 54 123 145 269 145 -45 -192 -159 -184 -78 62 -15 87 -208 -103 184 -54 48
3381D8J61j19j34j03J07J19M2J71l88J55k0p1K55k83L73m64K66j34k07L46j06
$$ 48 209 90 -44 -147 -40 79 121 292 -96 59 39 -32 223 -60 313 -151 115 -19 -226 120 14
3402A4k9j89J03O9O5j36j60J48M38l13j19J35kJ43j97j49J46K30J11l34J2L9m5
$$ 14 -15 -204 -101 -32 33 -103 -263 -115 323 10 -109 26 24 167 -30 -179 -33 197 308 -26 -14 25 -20
3425b0l7J36O1m46K88K0j17J22K23l64K36k81Q1p5K24p3K05k06J8j9p0pRJ97k1
$$ -20 -57 79 140 -306 -18 2 -115 7 230 -134 102 -179 -98 -173 51 -22 183 -23 -5 -24 -94 -101 -92 105 84
3450H4MJ08j75P9Kj20K53k36j88J09P6J07O1J09n5k26LJ5J49k03P3J23j3j23R9
$$ 84 88 196 21 100 102 -18 235 -1 -189 -80 -4 103 164 273 218 -8 -5 10 159 -44 29 152 139 16 115
3475A15j17q3O1mK4Q1Rl02K66j08J19O3q6J03o1p3K83o08J38J5K2J75k74L50l92
$$ 115 -2 -85 -24 -28 -4 77 86 -216 50 -58 61 124 38 141 80 7 290 -318 -180 -165 -143 32 -242 108 -284
3500b84K34j40K15j2l6m0R7O2J21j48r7N2J9k05mK23j60J62j0o6r9J27J52m15
$$ -284 -50 -190 25 13 -23 -63 34 96 217 69 -28 24 43 -162 -166 57 -103 59 49 -17 -116 11 163 -252
3524b52L72j45O6J15p2q5J06rj39J49j22k3m0K06jQ0k83p9M11k4r3J08l57O0j3
$$ -252 120 -25 41 156 84 -1 105 96 -43 106 -16 -39 -79 127 126 206 -77 -156 255 231 138 246 -111 -51 -64
3549f4j14L80j22L04k15m05L34Q5j36m8J68l2l73L25M8j71j01K9n3L58N6l53J05
$$ -64 -178 202 80 384 169 -236 98 183 47 -1 167 135 -238 87 135 -36 -137 -108 -161 197 253 -100 5
3572Eo8K32k8K31k60j87n6M73k48k15R8r5K93l32K07K35q5J6k67l6q7J72M9l9
$$ 5 -63 169 141 372 112 -75 -131 342 94 -121 -23 -118 175 -157 50 285 200 216 -51 -87 -174 -2 47 8
3596HK4M6j19K29qk61q8K19J03k02J41k34Q5Q9j6l57O20l05j88L21q9M5j33K15
$$ 8 32 78 -41 188 180 -81 -169 50 153 -49 92 -142 -57 32 16 -341 279 -26 -214 107 18 63 -70 145
3620A45j33l1J87n0m05J64N3J02r9M9oM4K4j23J8o9M29k25O1j26L1q1Q1j23J28
$$ 145 12 -19 168 118 -287 -123 -70 32 -67 -18 -24 20 44 -79 -61 -130 299 74 135 9 40 -41 40 -83 45
3645D5n2l7K14n83N43K80n43J43J76j96J92n69L52n5M3K6j13J87k4J1J02Q3m00
$$ 45 -7 -44 170 -413 130 410 -133 10 186 -10 182 -387 -35 -90 -47 -21 -134 53 29 40 142 225 -175
3668a75O1P8J3J73m01K94j3k30K05K47r3Q7l2l06J25k77K02J61P7j24l18o1K91
$$ -175 -114 -36 -23 150 -251 43 30 -200 5 252 159 246 214 -92 33 -244 -42 119 196 72 -246 -307 -16
3691a6k0Q2m8J6j35K97J39k29k2j4J21k39K33l69j22M19j44j3JL0j2J79j83M7
$$ -16 -36 46 -2 14 -121 176 315 86 64 50 171 -68 165 -204 -326 93 -51 -64 -63 -33 -45 134 -49 -2
3715bJ39o8j11k21L00m3l17K42L09l08K44k25J71k8k31K24k38P8j27M3J09P2k56
$$ -2 137 69 -42 -263 37 -6 -323 -81 228 -80 164 -61 110 82 -149 75 -163 -85 -212 -169 -60 12 -244
$$ [...]
8191a36
##END NTUPLES=NMR FID
##END=
