##TITLE=1H_K-386/3
 CDCl3, 8 sc, 
 24.9.2020
##JCAMPDX= 6.0         $$ Bruker NMR JCAMP-DX V2.0
##DATA TYPE= NMR FID
##DATA CLASS= NTUPLES
##ORIGIN= UXNMR, Bruker Analytische Messtechnik GmbH
##OWNER= root
$$ XWIN-NMR		Version 3.5
$$ Thu Sep 24 10:19:33 2020 Russian Standard Time (UT+4h)  she@DPX200
##.OBSERVE FREQUENCY= 200.1315066352
##.OBSERVE NUCLEUS= ^1H
##.DELAY= (6, 6)
##.ACQUISITION MODE= SIMULTANEOUS
##.ACQUISITION SCHEME= undefined
##.AVERAGES= 8
##.DIGITISER RES= 18
##SPECTROMETER/DATA SYSTEM= spect
##.PULSE SEQUENCE= zg30
##.SOLVENT NAME= CDCl3
##.SHIFT REFERENCE= (INTERNAL, CDCl3, 0, 15.7039)
##AUDIT TRAIL= $$ (NUMBER, WHEN, WHO, WHERE, WHAT)
$$ ##TITLE= Audit trail, XWIN-NMR		Version 3.5
$$ ##JCAMPDX= 5.01
$$ ##ORIGIN= Bruker BioSpin GmbH
$$ ##OWNER= she
$$ F:/spectra/data/she/nmr/H-F/1/audita.txt
$$ ##AUDIT TRAIL=  $$ (NUMBER, WHEN, WHO, WHERE, WHAT)
(   1,<2020-09-24 10:18:18.18 +0400>,<she>,<DPX200>,
      <created by zg, POWCHK disabled, PULCHK disabled
       configuration hash MD5:
       00 E9 B6 7A A2 85 ED C7 34 08 36 98 17 FE 4E 26
       data hash MD5: 16K
       83 02 91 B9 0F B4 25 8A A0 B0 89 8E 62 D7 9F C7>)
$$ ##END=
$$ 
$$ hash MD5
$$ CB 56 92 7F 4A 5B 01 4B 68 45 DC 2C E9 8F 3A C6
##$RELAX= 
##$RELAX= 
##$RELAX= 
##$RELAX= 
##$RELAX= 
##$RELAX= 
$$ Bruker specific parameters
$$ --------------------------
##$DU= <F:/spectra>
##$EXPNO= 1
##$NAME= <H-F>
##$PROCNO= 1
##$TYPE= <nmr>
##$USER= <she>
##$AMP= (0..31)
100 100 100 100 100 100 100 100 100 100 100 100 100 100 100 100 100 100 
100 100 100 100 100 100 100 100 100 100 100 100 100 100 
##$AQSEQ= 0
##$AQ_mod= 1
##$AUNM= <au_zg>
##$AUTOPOS= <>
##$BF1= 200.13
##$BF2= 200.13
##$BF3= 200.13
##$BF4= 200.13
##$BF5= 200.13
##$BF6= 200.13
##$BF7= 200.13
##$BF8= 200.13
##$BYTORDA= 1
##$CFDGTYP= 0
##$CFRGTYP= 5
##$CHEMSTR= <none>
##$CNST= (0..31)
1 1 145 1 1 1 1 1 1 1 1 1 1 1 1 1 1 1 1 1 1 1 1 1 1 1 1 1 1 1 1 1 
##$CPDPRG= <>
##$CPDPRG1= <>
##$CPDPRG2= <>
##$CPDPRG3= <>
##$CPDPRG4= <mlev>
##$CPDPRG5= <mlev>
##$CPDPRG6= <mlev>
##$CPDPRG7= <mlev>
##$CPDPRG8= <mlev>
##$CPDPRGB= <>
##$CPDPRGT= <>
##$D= (0..31)
0 1.2 0 0 0 0 0 0 0 0.06 0 0.03 0 0 0 0 0.0002 0 0 0 0 0 0 0 0 0 0 0 0 
0 0 0 
##$DATE= 1600928297
##$DBL= (0..7)
120 120 120 120 120 120 120 120 
##$DBP= (0..7)
150 150 150 150 150 150 150 150 
##$DBP07= 0
##$DBPNAM0= <>
##$DBPNAM1= <>
##$DBPNAM2= <>
##$DBPNAM3= <>
##$DBPNAM4= <>
##$DBPNAM5= <>
##$DBPNAM6= <>
##$DBPNAM7= <>
##$DBPOAL= (0..7)
0.5 0.5 0.5 0.5 0.5 0.5 0.5 0.5 
##$DBPOFFS= (0..7)
0 0 0 0 0 0 0 0 
##$DE= 6
##$DECBNUC= <off>
##$DECIM= 32
##$DECNUC= <off>
##$DECSTAT= 4
##$DIGMOD= 1
##$DIGTYP= 9
##$DL= (0..7)
0 120 120 120 120 120 120 120 
##$DP= (0..7)
150 150 150 150 150 150 150 150 
##$DP07= 0
##$DPNAME0= <>
##$DPNAME1= <>
##$DPNAME2= <>
##$DPNAME3= <>
##$DPNAME4= <>
##$DPNAME5= <>
##$DPNAME6= <>
##$DPNAME7= <>
##$DPOAL= (0..7)
0.5 0.5 0.5 0.5 0.5 0.5 0.5 0.5 
##$DPOFFS= (0..7)
0 0 0 0 0 0 0 0 
##$DQDMODE= 0
##$DR= 18
##$DS= 0
##$DSLIST= <SSSSSSSSSSSSSSS>
$$ [...]
##$SUBNAM2= <"">
##$SUBNAM3= <"">
##$SUBNAM4= <"">
##$SUBNAM5= <"">
##$SUBNAM6= <"">
##$SUBNAM7= <"">
##$SUBNAM8= <"">
##$SUBNAM9= <"">
##$SW= 16.880792210976
##$SWIBOX= (0..15)
0 0 2 0 0 0 0 0 0 0 0 0 0 0 0 0 
##$SW_h= 3378.37837837838
##$TD= 16384
##$TD0= 1
##$TE= 0
##$TE2= 300
##$TE3= 300
##$TEG= 300
##$TL= (0..7)
0 120 120 120 120 120 120 120 
##$TP= (0..7)
150 150 150 150 150 150 150 150 
##$TP07= 0
##$TPNAME0= <>
##$TPNAME1= <>
##$TPNAME2= <>
##$TPNAME3= <>
##$TPNAME4= <>
##$TPNAME5= <>
##$TPNAME6= <>
##$TPNAME7= <>
##$TPOAL= (0..7)
0.5 0.5 0.5 0.5 0.5 0.5 0.5 0.5 
##$TPOFFS= (0..7)
0 0 0 0 0 0 0 0 
##$TUNHIN= 0
##$TUNHOUT= 0
##$TUNXOUT= 0
##$USERA1= <user>
##$USERA2= <user>
##$USERA3= <user>
##$USERA4= <user>
##$USERA5= <user>
##$V9= 5
##$VALIST= <valist>
##$VCLIST= <CCCCCCCCCCCCCCC>
##$VD= 0
##$VDLIST= <DDDDDDDDDDDDDDD>
##$VPLIST= <PPPPPPPPPPPPPPP>
##$VTLIST= <TTTTTTTTTTTTTTT>
##$WBST= 1024
##$WBSW= 4
##$XGAIN= (0..3)
0 0 0 0 
##$XL= 0
##$YL= 0
##$YMAX_a= 608820
##$YMIN_a= -407935
##$ZGOPTNS= <>
##$ZL1= 120
##$ZL2= 120
##$ZL3= 120
##$ZL4= 120
##$ABSF1= 10
##$ABSF2= 0
##$ABSG= 5
##$ABSL= 3
##$ALPHA= 0
##$AQORDER= 0
##$ASSFAC= 0
##$ASSFACI= 0
##$ASSFACX= 0
##$ASSWID= 0
##$AUNMP= <proc_1d>
##$AZFE= 0.1
##$AZFW= 0.1
##$BCFW= 1
##$BC_mod= 2
##$BYTORDP= 1
##$COROFFS= 0
##$CY= 11.3945322036743
##$DATMOD= 1
##$DC= 2
##$DFILT= <>
##$DTYPP= 0
##$F1P= 16.9975609425685
##$F2P= -3.02152046262296
##$FCOR= 0.5
##$FTSIZE= 0
##$FT_mod= 4
##$GAMMA= 1
##$GB= 0.15
##$INTBC= 1
##$INTSCL= 1
##$ISEN= 128
##$LB= 0.24
##$LEV0= 0
##$LPBIN= 0
##$MAXI= 10000
##$MC2= 0
##$MEAN= 0
##$ME_mod= 0
##$MI= 1.114404
##$NCOEF= 0
##$NC_proc= 0
##$NLEV= 6
##$NOISF1= 3.799351
##$NOISF2= 2.8
##$NSP= 1
##$NTH_PI= 0
##$NZP= 0
##$OFFSET= 15.70392
##$PC= 1
##$PHC0= -9970.07
##$PHC1= 10.4009
##$PH_mod= 1
##$PKNL= yes
##$PPARMOD= 0
##$PSCAL= 0
##$PSIGN= 0
##$REVERSE= no
##$SF= 200.130013532006
##$SI= 16384
##$SIGF1= 3
##$SIGF2= 2
##$SINO= 400
##$SIOLD= 16384
##$SREGLST= <1H.CDCl3>
##$SSB= 0
##$STSI= 0
##$STSR= 0
##$SW_p= 3612.71676300578
##$SYMM= 0
##$S_DEV= 0
##$TDeff= 0
##$TDoff= 0
##$TI= <>
##$TILT= no
##$TM1= 0
##$TM2= 0
##$TOPLEV= 0
##$USERP1= <user>
##$USERP2= <user>
##$USERP3= <user>
##$USERP4= <user>
##$USERP5= <user>
##$WDW= 1
##$XDIM= 8192
##$YMAX_p= 0
##$YMIN_p= 0
$$ End of Bruker specific parameters
$$ ---------------------------------
##NTUPLES= NMR FID
##VAR_NAME=  TIME,          FID/REAL,        FID/IMAG
##SYMBOL=    X,             R,               I
##VAR_TYPE=  INDEPENDENT,   DEPENDENT,       DEPENDENT
##VAR_FORM=  AFFN,          ASDF,            ASDF
##VAR_DIM=   8192,          8192,            8192
##UNITS=     SECONDS,       ARBITRARY UNITS, ARBITRARY UNITS
##FACTOR=    0.000296,      1,               1
##FIRST=     0,             0,               0
##LAST=      2.424536,      0,               0
##MIN=       0,             -407935,         0
##MAX=       2.424536,      608820,          0
$$ Real data points
##PAGE= N=1
##DATA TABLE= (X++(R..R)), XYDATA
$$ [...]
1742e11M81k72j42OM9k62K24J76j05P8K99j01m96O51j58l81J47J66R1l79N69k34
1764a04k80J85J99j0k67L41l25k50J42j46j91L07l2q58O28O3Np7M81k56j02N63
1786A6m4k56K15ln42O34L55k17j19K22j25J58R4K07P0n8O4l25q2J16k59m72M45
1809I4J6j09M3K28l22M21q6k03O2K32j6j12K56l03J3QP0k44K38J20J17j08K11
1832F26k49n0N56n77k30k1J53m6k29L90k08k80M37l25K2r2J51k31M70N2n6j65
1854I8j8j34k57L45j93K4J73N6j33J85J47j93k4n0J16j06L6R7k20j69j75J01j37
1877d31L23o6o0J23J54j00P7k02J87l07K69M6j00J7m2j33J60L30j39k5Q8J9j23
1900F5PJ52k05m7J09N4k3M7Q0m10K64j95p7L56l57L41k08Q6l0k41M0l63N61m7
$$ plain form
1742 -511 -30 -302 -444 -438 -389 -651 -427 -251 -356 -278 21 -80 -576 75 -83 -464 -317 -151 -60 -439 130 -104
1764 -104 -384 -199 0 -10 -277 64 -261 -511 -369 -515 -706 -399 -431 -1289 -661 -598 -593 -670 -189 -445 -547 16
1786 16 -28 -284 -69 -72 -614 20 375 158 39 261 136 294 388 595 665 607 671 346 264 380 121 -351 94
1809 94 110 1 44 272 -50 371 285 82 144 376 360 248 504 201 214 222 292 48 286 406 523 415 626
1832 626 377 327 883 306 76 55 208 162 -67 323 115 -165 272 -53 -31 -123 28 -203 267 319 263 98
1854 98 80 -54 -311 34 -159 -135 38 94 -39 146 293 100 76 26 142 36 72 169 -51 -220 -395 -294 -431
1877 -431 -108 -174 -234 -111 43 -57 20 -182 5 -302 -33 13 -87 -70 -112 -245 -85 245 106 81 169 188 65
1900 65 72 224 19 -28 81 135 112 159 239 -171 93 -102 -179 177 -180 161 -47 39 9 -232 -192 -555 6 -41
1924d1k26K6K34k03J07l0J51J57k34L51m80R7J33L2j50Q5J17j57Q2J91n6L64k69
1947B81J05l24K21j12N0J53j8l11K61k69K20k44j76M28j09p8r4K8P4J4k18J25
1969Gq6j73Q5K05k53K75lQ3j53K15Q8Q3k37J62j18nJ21j95o4j16J27k43K96k04
1993a03R3J56j88J83l59L98m28Q2L3j48K46l4l2j15J70j16K30l3R2L45k74N0K38
2016D86m32L5N4J02N0k03Pr2J3PK2J67j89J24p1J89o15L09k99J08L57l71J11P1
2040f0K10j27l4K66o2QqM2K74q06L54O1j99Q6k2j28J94J9k70J02P1m4k2k14K54
2065e5K9O0m79J97l3J03M19m71L02j41K36j22J04P9j11m1O6L5l1R5m60O0K13k07
2089a53l5K83J12m92N14j50k73j33M37Jn2r9P1k81K97r5k63L92J5Q1k11J22j33
$$ plain form
1924 -41 -267 -241 -7 -210 -103 -133 18 175 -59 292 -188 -91 42 74 -76 9 126 -31 51 242 186 550 281
1947 281 386 62 283 171 221 374 356 45 306 37 257 13 -163 265 156 78 -16 12 86 100 -118 7
1969 7 -79 -252 -167 38 -215 60 57 140 -13 202 290 373 136 298 180 175 296 101 37 -79 48 -195 101 -103
1993 -103 -10 146 -42 141 -218 180 -248 -166 -133 -281 -35 -69 -101 -216 -46 -162 68 35 127 472 198 248 486
2016 486 54 89 143 245 295 92 99 7 20 27 49 216 27 151 80 269 -346 -37 -336 -228 129 -242 -131 -60
2040 -60 150 23 -11 255 193 201 193 235 509 -297 57 118 -81 5 -17 -145 49 68 -202 -100 -29 -73 -95 -309 -55
2065 -55 -26 34 -445 -248 -281 -178 241 -230 72 -69 167 45 149 228 117 76 142 177 146 241 -219 -159 54 -153
2089 -153 -188 95 207 -285 229 79 -194 -327 110 111 59 -40 31 -250 47 -48 -311 81 96 177 -34 88 -45
2112d5N09k71K61n56L24k74j09j4j20M74m96N47j57k63j44j23M59k20j34Q7K69
2133Dj27J70l7m2k81J48j82N99j61P9j53K35p7q8k1p4J22J60l6j97O7j64J19J98
2157B61l03J23l7R5J23k35J55L9m65J86J04K54k28j40J25O2j11J43q1r1M12k96
2179I5J6J56j38P8l3k00J93M3l2j21j21P4M8O5j46P3J43k22r6q6N2M6P0l09K45
2204a07m6j69K10p1O3R8p6P9q0j32j30K30n3p4K42k64l1J46J95J6k60r2k2M38
2228A10l5k31jr8J09JJ27M2j74K91k89J33j17K05j74K52p7j93R9J12K6k58K5J66
2252E1j3L6K05m48Mj4k9J11n2p8K76j73k4K0R4R6Rj39j09K81l25P8J90k22J98
2277B3J59m35J96J63J05k91J83j64j61Q7L62k08j12LJ14N6M4k7j5J8l7j26q0k1
$$ plain form
2112 -45 464 193 454 -102 222 -52 -161 -175 -295 179 -317 230 73 -190 -334 -457 2 -218 -352 -265 4
2133 4 -123 47 10 -32 -313 -165 -347 252 91 170 17 252 175 87 66 -8 114 274 238 41 108 -56 63 261
2157 261 -42 81 44 139 262 27 182 221 -244 -58 46 300 72 -68 57 119 8 151 70 -21 391 95
2179 95 111 267 129 207 174 -26 167 210 178 57 -64 10 58 123 -23 50 193 -29 -125 -211 -159 -113 -43 -352 -107
2204 -107 -153 -322 -112 -183 -120 -22 -98 -19 -99 -231 -361 -131 -184 -258 -16 -280 -311 -165 30 46 -214 -306 -328 110
2228 110 75 -156 -157 -255 -146 -145 -18 24 -150 141 -148 -15 -132 73 -101 151 74 -119 -20 92 118 -140 -115 51
2252 51 38 74 279 -169 -165 -179 -208 -97 -149 -227 49 -124 -148 -128 -34 62 71 -68 -177 104 -221 -143 47 -175 23
2277 23 182 -253 -57 106 211 -80 103 -61 -222 -135 227 19 -93 -90 24 80 124 97 82 100 63 -63 -143 -164
2301a64K16q5r1K00j64k89O15j60N5l9J30k43k47M03k68L53l33J29kN6K8J81k54
2324B7N4Q7k39L8N9O8j75J18j00N4j21J01N4j66M8J24J2k29j28R3K49l17K21j92
2348b60J02j14R0q1r5P9Q3J96j20J72k20J99k81K35o5J77j47J10j44P6j58M45
2370B79k03j51J23o3K9j30J33J8k63O4J47j81J32j39J04K51l23J07J26O3j98n4
2392a29K89k69q1K21P8k26M26l60Q5J20l99L95j24K1Q8j11l8M1J06k87K14m5j3
2415Bj97R4J61o9q2P1j97J46O9k92K08K33n1j95l1R3J11oM75j89l75J6j06J22
2439A1j64K36k75K95j95K35j33Q5j04N0j32P4N2oJ13O8j97K0OL8J79r2j07k5j0
2464B2j4K3j39K55k77L39j27j7J0k78J83j3R5m5m8J16l6k95K47m6k14K71p8OJ33
$$ plain form
2301 -164 52 -33 -124 76 -88 -377 238 78 133 94 224 -19 -266 137 -131 222 -111 18 16 72 100 281 27
2324 27 81 168 -71 -33 26 94 -81 37 -63 -9 -130 -29 25 -141 -93 31 43 -186 -314 -221 28 -289 -68 -260
2348 -260 -158 -272 -182 -263 -358 -279 -196 0 -120 52 -168 31 -250 -15 -80 97 -50 60 -84 -8 -166 279
2370 279 76 -75 48 -15 14 -116 17 35 -228 -164 -17 -198 -66 -205 -101 150 -173 -66 60 123 -75 -129
2392 -129 160 -109 -190 31 109 -117 309 -51 34 154 -245 150 26 47 135 24 -14 27 133 -154 60 15 2
2415 2 -195 -101 60 -9 -91 -20 -217 -71 -2 -294 -86 147 96 -99 -130 -37 74 68 543 354 -21 -5 -111 11
2439 11 -153 83 -192 103 -92 143 10 95 -9 41 -91 -17 35 29 142 210 13 33 39 77 256 164 57 32 22
2464 22 8 31 -108 147 -130 209 82 65 75 -203 -20 -33 62 17 -31 85 49 -246 1 -45 -259 12 -66 -60 73
2489G3j70K27R0k54P1J28j9j57n9j03L98q7j70J23j59M2l1j53K96k17J28Q1k96
2512b18K83k80K85j10J58k26J62J2k9n8l4J40j28j19k1N3O4j15j49M50J3q8M4
2535H9Mk74K23J17j46o0J37j44P6j57J74j36K15K22n50K06M1j07j65M63k83l59
2557d14M29j9R5j65L1o0L53j06j06j6J1k9J31k33j35j54M63r9Q4p3J67k93K43
2580A05j25J13l9RPj24O8L2N5l1j49M23j73l00Q0J37j48K14r8K24k03P8o4j7Q7
2605A61j40LJ05K1J6j2k7O7j15n8p6N6j92L78j37N6K6J5k58J26O8k69R4J26L2
2630F6oN7k15K7J36Oj50J16r0J8L6m8k32L17j21Q8r0pK23P9ll70J68N3k73oR8
2657a23J14r3k6K07n74M96j3P0l83P89n91J51J35o11P08n88o6R70M33q86M54l92
$$ plain form
2489 73 -97 130 220 -34 37 165 146 -11 -70 -173 225 138 -32 91 -68 -26 -57 -210 86 -131 -3 78 -218
2512 -218 65 -215 70 -40 118 -108 54 66 37 -21 -55 85 -43 -162 -183 -130 -66 -181 -330 120 133 45 89
2535 89 93 -181 42 159 13 -47 90 -54 22 -135 39 -97 118 340 -210 -4 37 -70 -235 228 -55 -414
2557 -414 15 -4 91 -74 -43 -103 250 144 38 22 33 4 135 -98 -233 -387 76 -23 61 -12 155 -138 105
2580 105 -20 93 54 63 70 -54 14 46 101 70 -79 344 171 -129 -49 88 -60 154 56 280 77 155 91 74 161
2605 161 21 24 129 150 166 154 127 194 79 21 -55 1 -191 187 50 106 132 147 -111 15 83 -186 -92 34 66
2630 66 60 117 -98 -71 65 71 -79 37 -53 -35 1 -47 -279 38 -83 5 -85 -92 131 210 207 -163 5 58 -215 -221 -123
2657 -123 -9 -102 -128 79 -495 1 -12 58 -325 464 -127 24 159 -452 256 -332 -398 572 1005 119 573 181
2679A81k70L89o02Q2O33l39J42k60J44k65J28L79l96N4J30j14K0o5r5J73j19J78
2701A08n6k79K60pMn4J8o0J07J27k79J80j34L40j56j76K17n4k50P6J32J03j06
2724F1p1r1Q1j43L67k38P1R0l9j27k53k6M04k95J34n2J91L01k51l3r2J58L1n2
2748A26j77J46J60k05j15L7l9O4rj4o5K29j99j3j57K75j52L12j72l4J22k74J68
2771A4J34j87l5J04k23J70J63j00m4m8K46k27J16k11J50O8r0n1M8M9k21J94J09
2794A28L3j95K3K81j79k02K7k8j3J80jk34KQ8J27J8j29K22k52K47q8j56j44K48
2818Cj97K16N0j51j25J97M9j60pJ60J7j00J18J03k45N1Qj45p8K18K09k70j9J93
2842I5l0J76m4m55M43k12J75j47r4J62m1o1R9n2O9m18N18j77J56k29j96J56M37
$$ plain form
2679 181 -89 300 -302 -220 413 74 216 -44 100 -165 -37 342 -54 0 130 16 36 -29 -124 49 -70 108
2701 108 52 -227 33 26 30 -24 -6 -66 41 168 -111 69 -65 275 119 -57 160 106 -144 -68 64 167 61
2724 61 -10 -101 -20 -163 204 -34 37 127 88 -39 -292 -318 86 -209 -75 -127 64 365 114 81 -11 147 178 126
2748 126 -51 95 255 50 -65 -28 -67 -3 -12 -26 -91 138 -61 -74 -231 44 -108 204 32 -2 120 -154 14
2771 14 148 -39 -74 30 -193 -23 140 40 -4 -52 194 -33 83 -128 22 90 0 -51 -3 46 -175 19 128
2794 128 161 -34 -11 270 91 -111 -84 -112 -125 55 54 -180 -178 -90 37 55 -74 148 -104 143 55 -101 -245 3
2818 3 -194 22 72 -79 -204 -7 42 -118 -125 35 52 -48 70 173 -72 -21 -13 -158 -236 -18 191 -79 -98 95
2842 95 65 241 197 -258 185 -27 148 1 -93 69 28 -33 66 14 83 -335 183 6 162 -67 -263 -107 330
2865C30l93K23k11j30L18k42K81k20J41p0k39L12n3q1N3M7P7j94p2N8O7j32L6
2888i4Kj17K95j50J26J01n6k57K22O1j45RmJ30j84K78l99L41q9J45m26J46K55
2911A90k24q8M5m2J84K5J12k78J90K9j59k1J52L0j7j94j97M65r1j30nr4j02J95
2935b5j34j09K02J05k73M20j36q4k0l1J67k03J61J83k77J62j57K88j52j68K14
2956A33j04O3l19J71J13j10J06J81l19j19L24j59R8O1l98K15K11j70J91p6J1q4
2978B0L8j37P4o2q5J20k1k8r9J97l07K57J90l58K04N3j67J15l2K99k1j55L7j95
3002f3R7p3J93k68L80l77j9L55q0n8n2o8P2Oj46J0Q6L2O8j4k48j1n8J73k28N29
3028B38k37J93j45O5M4q3Q1k17O0P9J34j21k48L17j91j21o4mJ93m6J37mk45K26
$$ plain form
2865 330 -63 160 -51 -181 137 -105 176 -44 97 27 -212 100 47 -34 19 66 143 -51 -123 -65 2 -130 -94
2888 -94 -92 -209 86 -64 62 163 107 -150 72 133 -12 -3 -7 123 -61 217 -182 159 70 215 -211 -65 190
2911 190 -34 -122 -77 -119 65 90 202 -76 114 143 -16 -37 115 145 128 -66 -263 202 111 -19 -24 -118 -220 -25
2935 -25 -159 -268 -66 39 -234 186 50 -34 -54 -85 82 -121 40 223 -54 108 -49 239 87 -81 133
2956 133 29 92 -227 -56 57 -53 53 234 -85 -204 120 -39 59 120 -278 -63 148 -22 169 93 104 20
2978 20 58 -79 -5 -67 -152 -32 -53 -81 -180 17 -290 -33 157 -201 3 56 -111 4 -28 271 250 95 132 -63
3002 -63 34 -39 154 -114 266 -111 -130 225 145 87 35 -33 39 45 -101 -91 -5 27 95 81 -167 -178 -236 -63 -291 238
3028 238 1 194 49 114 158 75 156 -61 -1 78 212 91 -157 160 -31 -152 -216 -220 -27 -73 64 60 -185 41
3052D1K51m27J64j80J62j85K55k9J50j49j77M9m8K14j01N1p2J22Q4l77K59O4j92
3075g1L99j50l04m7L07k31K20j00j85K24p2j10J18J8r2K54K4j70J82m46L31j76
3097g7j1Q9k4L5j28K82j73L5k01J52P4j47q6L00r6n3q9J74pj21M4J34o8M5l35
3122b52J25m5J01J38j1l01L47o9j32K15L0j00L51l43J35j99R9j27l1R7n7K52l4
3145A89q1p5ppm1J46j93J03N0k4K7j7j80K08J69l27o5K33mk8L8j10L5k9k5N9l0
3172A4q5K48j01l3j84J73l47M50Oj3k24Q4O8J66j78n6j04J60q4k1J53l41K34J27
3196A12p2n3J30j81J93l07J59L13j48j76K59m29L20k67J38j35J70Q6p5r3K21l37
3218a72M15l85K56l76nK36J68J57l83J64j40J20J9k49L49l95J54R6j97M80k39
$$ plain form
3052 41 292 -135 29 -151 11 -174 81 52 202 53 -124 -75 -123 91 -10 41 -31 91 175 -202 57 121 -71
3075 -71 328 178 -126 -173 134 -97 123 23 -162 62 -10 -120 -2 16 -76 178 202 32 214 -232 99 -77
3097 -77 -88 1 -23 12 -116 166 -7 28 -173 -21 53 -94 -180 120 24 -29 -118 56 49 -72 -28 106 38 83 -252
3122 -252 -127 -172 -71 67 56 -245 102 33 -99 116 146 46 397 54 189 -10 89 -38 -69 28 -29 223 189
3145 189 108 33 26 19 -22 124 -69 34 84 60 87 70 -110 98 267 -60 -125 108 104 76 114 4 39 10 -15 44 14
3172 14 -71 177 76 43 -141 32 -315 135 141 128 -96 -12 56 222 44 -12 -116 44 -40 -61 92 -249 -15 112
3196 112 40 -13 117 -64 129 -178 -19 294 146 -30 229 -200 120 -147 -9 -144 26 112 37 -56 165 -172
3218 -172 243 -142 114 -262 -267 -31 137 294 -89 75 -65 55 74 -175 174 -221 -67 29 -168 312 73
3239G3k28m6M41r8l30K95k3j18q7L20j23j57J30K33k67K57l08O9J59j51j19o6
3261a44K79k14K40n6J4j4q5Pl4J05Q2j35q7O8jj07M5j73L53L7j30K12l88O2QJ50
3287I4r6K02l89K03q5R7K59l62N2k0oJ02j0j89J40J99o3j14R4J3j70l4j5J07m6
3312c7P4M9j61R2n5K72k68Q5k9j09K16j45K24k14M0q6J1J26o5j13N5j18L1J36
3336A1k8k50K91n6M9j33J39k18J97J67l31K9Q1J5N5J31k91R0k42J74N0J55j98
3359a13k9K50m8J4l8ro5K54k09M8j73K19J18l3J09j95J37m60K63N0j83p9L83k09
3383BL6j05j86J8O2QL09L52o04J17j75K29n3j45L35k58N9J36j2j53L9j45J31r3
3407i6J52J31j39j7j90L91Oj00l09n4L34k28R7J32n0J29k29J12jj00K18k27m8
$$ plain form
3239 73 -155 -201 240 142 -188 107 84 -34 -121 199 76 -81 49 282 15 272 -36 33 192 41 -78 -144
3261 -144 135 -79 161 105 119 105 20 27 -7 98 180 45 -42 26 25 -82 -37 -210 143 180 50 262 -126 -64 -56 94
3287 94 -2 200 -189 14 -71 26 285 -77 -25 -45 -51 51 41 -148 -8 191 128 14 108 121 -49 -83 -98 9 -37
3312 -37 37 86 -75 17 -38 234 -34 51 22 -87 129 -16 208 -6 34 -52 -41 85 20 -93 -38 -156 -125 11
3336 11 -17 -267 24 -32 17 -116 23 -195 2 169 -162 -133 -52 -37 18 149 -142 -52 -294 -120 -70 85 -113
3359 -113 -142 108 60 74 36 27 -38 216 7 55 -118 101 219 186 295 100 237 -223 40 90 -93 -172 211 2
3383 2 38 -67 -253 -235 -173 -165 144 496 -108 9 -166 63 10 -135 200 -58 1 137 125 -28 11 -134 -3 -96
3407 -96 56 187 48 31 -159 232 238 138 -171 -225 109 -119 -22 110 60 189 -40 72 71 -29 189 -38 -86
3430h6J32j12J3Q5k74L13J54l02J27J0oK42r4k85J02j46K6J33J07j25j17l9M12
3453B70m28J4J6L29k71j81L81j03j05q3O7J80k38PJ67j12J88j67k2N1M8J00j79
3476g1K01r5m3q1q1J8J39l7J84j81L9L47l29K17j37O7o5r9j22J43k12J41K61j71
3500C3L4j21m8M1O4J78n15L75o6N4M5k4j76Q3J38l8l6lJ46j67j44k8L62l11L47
3525B23l58J90Pj46o8M1J9q7K13j62J99j61K7J27l00M30q3m41K18K83k17k30J96
3548h0J03n3k2N5N7M7k09P9k27K1N08k30k67M92k28J53J64n06L79P18q39l91M35
3571A59j50L42J52r41N78j20J72j02K99j86j67m20K48M72r8l01K8o7O2L3K03k38
3593d2j15Q0L26k12j08K19j10K61k15j79K4j10J71J29q3r3Q5K49l85J48M2j83
$$ plain form
3430 -86 46 -66 -53 32 -242 71 225 -77 50 60 54 296 202 -83 19 -127 -101 32 139 14 -103 -142 270
3453 270 -158 -144 -128 201 -70 -251 130 27 -78 -161 -94 86 -152 -145 22 -90 98 -69 -91 -40 8 108 -71
3476 -71 130 35 -8 -89 -170 -152 -13 -50 134 -47 -8 339 10 227 90 157 92 -7 -129 14 -198 -57 204 33
3500 33 67 -54 -102 -61 3 181 -334 41 -25 29 74 50 -126 -43 95 57 21 18 164 -3 -147 -175 187 -124 223
3525 223 -135 55 62 -84 -152 -111 -92 -179 34 -128 71 -90 -63 64 -236 194 111 -330 -112 171 -46 -276 -80
3548 -80 23 -30 -52 3 60 107 -102 -23 -250 -229 279 49 -218 274 46 199 363 -143 236 954 115 -276 159
3571 159 9 351 503 -438 140 20 192 90 389 203 36 -384 -136 336 238 -63 -35 -102 -40 -7 196 -42
3593 -42 -157 -77 249 37 -71 148 38 299 84 -95 -71 -181 -10 119 36 -57 28 277 -108 40 82 -101
3615a01N8j48O1R6m6P5j07J31J1J64J05k04K0k27K05k15K59K3j18j06k05K58L0
3638A9L9q9q9K44O2k53K79m23M03o3k18K13k78K89k94J86j1L16l33n0K9P0o9J8
3662cK41l00jL2L26k04q8J12k64K32k94J28J75J82j57J7j41o0J80q5J42k73O1
3685d2o2K03j09N2k15L11l26p1J23J57k38L39k61nJ46j51J68j02J98P3p6l7Q1
3708A56j31k08O1K35j23k0J1K73k05n4O5k1n4p7K1q7J33K35j73K4j20J6r8P61
3732F20J5m86L81k31J63k79J3l04J0J32j37K04K27m82J0J40j14J15P5p4j45N4
3754i3O3rK59j95j74J40jr1K08j68K17l39K50R5j08j6N8kr4l4j80J49M7o5o0K08
3780F5j49J35j4J08k90J04J33p5Q3J03j74J89R0k70j01K93q4r5nj20M5N0L5L3
$$ plain form
3615 -101 -43 -191 -130 -34 -80 -5 -112 19 30 194 299 95 115 -112 93 -122 137 160 42 -64 -269 -11 19
3638 19 58 -31 -120 124 186 -67 212 -211 192 129 -89 124 -154 135 -159 27 16 332 -1 -51 -22 48 -21 -3
3662 -3 238 -62 -63 -31 295 91 3 115 -149 83 -211 -83 92 274 117 134 -7 -67 113 28 170 -103 -42
3685 -42 -104 99 -10 42 -173 138 -188 -259 -136 21 -217 122 -139 -144 2 -149 19 -83 115 188 112 75 156
3708 156 25 -183 -122 113 -10 -30 -19 254 49 -5 60 39 -15 -92 -71 -158 -25 210 37 61 -59 -43 -141 620
3732 620 635 149 530 299 462 183 196 -108 -98 34 -103 101 328 -154 -144 -4 -118 -3 72 -2 -147 -93
3754 -93 -30 -39 220 25 -149 -9 -10 -101 107 -61 156 -183 67 162 54 38 96 94 0 -34 -214 -65 -18 -83 -143 65
3780 65 -84 51 37 145 -145 -41 92 17 100 203 29 218 308 38 -63 230 146 51 46 -74 -29 21 56 89
3804H9j14O6l30K92n8j03K72j57M6R6k25K05k6j65j14J33q5K87n2k24J38O1J14
3827A46R1l55kP5J24J62k87K20m8j82j0J73k76m1J24P6r2J17p9J41j2p4k4j64
3851a97J49O6k3%m2mJ63J9l0Or1K88k21p2l23K05k2j38J37j7L5l9O2j14L86j91
3877hJ6p3m3O8J40j07K28k65J50N6j30j60J74j07K46J41K2m9k73J00j93k9Q3j91
3901b04JM6L05p6o0j52J78j91J06j76K56K5J77k96l2O3R4j9j36j23J93p5q0K05
3925B9j83K7R7M4L9L8j13J90J81j65j50Q2PK23m77J78j19j06L8l9J17l74M37k52
3949b51J65K3J48o5j16q7J43K00j13l9K13l67J27j16O7Q0j7J51j60R7j12J20j92
3972a01K17j62j33K94L7l48K09K4k16M8K67j45R7J16j92r6o3K82j42Lq2Q6j08
$$ plain form
3804 89 -25 41 -289 3 -55 -158 114 -43 3 99 -126 79 53 -112 -226 -93 -178 109 57 -167 -29 32 146
3827 146 237 -118 -120 -45 79 241 -46 174 126 -56 -66 107 -169 -210 -86 -10 -102 15 -64 77 65 -9 -33 -197
3851 -197 -48 18 -5 -5 -47 -51 112 131 101 107 16 304 83 11 -312 -107 -129 -267 -130 -147 -112 -151 -89 -203 183 -8
3877 -8 8 -65 -108 -40 100 -7 221 -44 106 162 32 -128 46 -61 185 326 348 299 26 126 -67 -96 -13 -204
3901 -204 -203 -157 148 72 12 -140 38 -153 -47 -223 33 58 235 -61 -93 -30 64 45 -91 -214 -21 -96 -176 29
3925 29 -154 -127 -30 14 53 91 -22 168 349 184 34 116 123 346 -131 47 -72 -178 -140 -179 -62 -436 1 -251
3949 -251 -86 -63 85 20 -96 -183 -40 160 47 8 221 -146 -19 -135 -68 12 -5 146 -14 83 -29 91 -101
3972 -101 116 -46 -179 115 152 -196 13 37 -179 -131 136 -9 88 204 12 -84 -147 135 -7 -4 -86 0 -108
3995a08OO2o1J95M7k44J75L4j40J49p5k90L81q5J24q9j63o4J70qj07l2K31q8m6
4020b6k28L19j50l4j85L85l1j44J47J32M6j4m21J38KK6N4K7j8P8j82J2J02n7J7
4045eJ69N6j78m5j97J53K20j99J32ko2o0J29M9l29K57J15k43J81P3k94J83M3m4
4069A02J63n7m53j03M7J02L64n24R49j3n83L00l82J3J28J35j97K81l90K15k77
4090a80J86j17j57J97J07K0k71R6K96k54L9k4j7K73k38J66j98K26k98J93J33J5
4112A93j08q5n%J97j41j41j02l0J38k4M6l8K3L3J09n8N7q6L3k51L10O6k60L14
4137A90k37J03k25Q7J75k07J09k36L28l9k04J48j11J49r7J65j59J41j04J05k95
4158b14P7P4l8J04l51K63J06j85L45M0k61J20L5m0K05l87J27J51j76J52j09J30
$$ plain form
3995 -108 -102 -40 -101 94 141 -103 72 106 -34 115 40 -250 131 46 170 81 -82 -146 24 16 -91 -123 108 20 -26
4020 -26 -254 65 -85 -119 -304 81 50 -94 53 185 231 217 -204 -66 -64 -38 16 43 25 103 -79 -67 35 -22 -5
4045 -5 164 220 42 -3 -200 -47 173 -26 106 104 42 -18 111 160 -169 88 203 -40 141 214 -80 103 146 102
4069 102 265 208 -245 -348 -301 -199 165 -359 590 577 -6 294 -88 -75 53 188 -9 272 -118 97 -180
4090 -180 6 -111 -268 -71 36 56 -215 -119 177 -77 -38 -62 -79 194 -44 122 -76 150 -148 45 178 193
4112 193 85 0 -5 -5 192 51 -90 -192 -222 -84 -108 -62 -100 -77 -44 65 7 64 -22 11 -240 70 136 -124 190
4137 190 -47 56 -169 -82 93 -114 -5 -241 87 48 -156 -8 -119 30 -67 98 -61 80 -24 81 -214
4158 -214 -137 -63 -101 3 -348 -85 21 -164 181 221 -40 80 115 75 280 -107 20 171 -5 147 38 168
4180A68o0O6p5k53J17J18k74Q9j11M75k96K23Q3j15L1k62O3J60j41oN3j91M58
4203C20m11k2Q2j32K87j9K3j37m9q6j2o1L28Q2k36Q6K19l60K6L03l45Q0j15J54
4227Ej16o0k10K44K24n8MJ08k22j05M09k75O5l27J03Q6J05Q5j64J28K89k65M4
4250I7p1J01k77k25K81P9J16k66j3K66J69n49L25j10P0k18K29R5K08m40K5J36
4272B8J11k34N8K13j45j34L27n2k58J96j66o5M5J44p9j43O4J84j79J06K55j00
4294A76m05K72j66J06k9L32k71L4j62J40K9j01o3M1K02k64K03l30L37o6l8J99
4316A76k08k7J62j02O5l0j39ql7j70M4J50L73k28J2J14L4o4j4k63L15k43J30K03
4340B45k49P9j60m3J01j37Kl3L33j01j05k22K61K04j17k6Q0j21l5l77O04l32J33
$$ plain form
4180 168 108 174 99 -154 -37 81 -193 -104 -215 260 -36 187 270 155 186 -76 -13 147 6 0 53 -138 320
4203 320 -91 -113 -31 -163 124 105 128 -9 -58 -144 -156 -217 111 193 -43 43 262 -98 -72 231 -114 -34 -149 5
4227 5 -111 -171 -381 -137 87 29 33 141 -81 -186 223 -52 13 -314 -211 -125 -20 65 -99 29 318 53 97
4250 97 26 127 -150 -375 -94 -15 101 -165 -178 88 257 -292 33 -77 -7 -225 4 99 307 -133 -108 28
4272 28 139 -95 -37 176 31 -103 224 172 -86 110 -56 -121 -76 68 -11 -154 -90 94 -85 21 276 176
4294 176 -229 43 -123 -17 -46 286 15 49 -113 27 56 -45 -108 -67 135 -129 74 -256 81 15 -23 176
4316 176 -32 -59 103 1 66 36 -103 -111 -148 -318 -274 -124 249 21 33 147 181 117 103 -160 155 -88 42 245
4340 245 -4 75 -85 -128 -27 -164 -162 -195 138 37 -68 -290 -29 175 58 32 112 -9 -44 -421 183 -149 -16
4363a6O2k71J20J22l28M48j89l6J06K62m01J00J21j03l1M0K9M4k38L58l17o8L63
4386A77j52K4j3Q7p9K2O7k69k4rL11j81L9j4L5J40j13o0J86r3j2o4L57n85P9J92
4412D8j7j68K59l92K29J69j07mj16L61k43n9k04L70j73j47j9K71j53Q2J17l24
4434b20K34L5k1L8J20j98J18j4m0J30k37j57K65J54l17J56r3L45k55J05j44r0
4456h6r4R7R5K5J4j11j95M49j03J45k71l06L26j28N5M17n29L36l04J43J39L25
4478D39k23R7m05k15M91j87K37l37K3J56J8m97L09J57lm28J7M60k46M41K9j006
4500f73O30j49Q29n72K99k13o38J219n30L4k67m29N93m01J42R8J65M0j53q6m8
4521a10O58k81k24J78J19m20n1M71m64o2M08%o69L2L12M64m85J23K91j99k4l58
$$ plain form
4363 -16 46 -225 -105 17 -311 137 -52 -88 18 280 -121 -21 100 -3 -34 6 35 79 -159 199 -118 -186 177
4386 177 25 49 36 123 44 66 133 -136 -160 -169 142 -39 0 -14 21 161 48 -12 174 81 69 5 362 -223 -144 48
4412 48 31 -137 122 -270 -41 128 21 17 -99 262 19 -40 -244 126 -47 -194 -213 58 -95 -13 104 -220
4434 -220 14 49 28 66 186 -12 106 92 52 182 -55 -212 53 207 -110 46 -47 298 43 148 4 -86
4456 -86 -180 -83 12 37 51 -60 -255 194 91 236 -35 -341 -15 -143 -88 329 -200 136 -168 -25 114 439
4478 439 216 313 -92 -307 184 -3 234 -103 -80 76 94 -403 -94 63 60 -368 -351 109 -137 304 333 -673
4500 -673 -43 -192 637 65 364 151 -487 732 202 236 -31 -460 133 -268 -126 -28 137 177 24 -62 -110
4521 -110 548 267 43 221 340 -80 -131 340 -124 -186 222 222 -447 -415 -103 361 -124 -1 290 91 67 -291
4543b91K83J80J6k41J95J48o4l73J83K53m32K60J4k33rQ2o4l09K51K93j40oN5
4566E1p2J11j61K0J33k93R9K91Qq9o6k47L26L1l94K41j81M0P7O2j37K91j33J33
4590A41l20K24K03J2k83oN3j59L51l31J75mr8K01j45J17l31K03j25q8L91k70K17
4613A28j55K87l63O4J00P6j62J2j13L9J07J66k48r6K36Q7o5l00M55m10J62N0N4
4636A11m04Q6K71K5K41l69n1K20p4j74L15j71j66P6lL56l49R6M6O0l58K55o5M
4660b2k4L6M8j55J91j6j07J01m5n9r6J40J9j07L88k81Q3j41K73k95m0J95J17k24
4684b1j47P6O7p7O5J14p5L23m35J94j84K31l10J96r9J58j3n1m1n7on8J58r1K49
4709A66j64k6m3jJ37K18L6m10q0l7J72J95J36q4k52m7n5J93O1k09K17l66j18P00
$$ plain form
4543 -291 -8 172 188 -53 142 290 226 -147 36 289 -143 117 131 -102 -111 -29 -93 -402 -151 142 2 -4 51
4566 51 -21 90 -71 -51 82 -211 -112 179 187 98 32 -215 111 142 -252 -11 -192 -152 -75 -13 -150 141 8 141
4590 141 -179 45 248 260 -23 -29 24 -135 216 -115 60 56 -42 159 14 131 -200 3 -122 -210 181 -89 128
4613 128 -27 260 -103 -39 61 137 -25 -13 -126 -87 20 186 -62 -158 78 165 100 -200 255 -155 7 57 111
4636 111 -293 -207 64 89 330 -39 -90 130 56 -118 197 26 -140 -64 -67 289 -60 36 82 142 -216 39 -26 -22
4660 -22 -46 -10 38 -117 74 58 -49 52 7 -52 -148 -8 11 -96 292 11 94 -47 226 -69 -109 86 203 -21
4684 -21 -168 -92 -25 -102 -37 77 2 325 -110 84 -100 131 -179 17 -82 76 63 12 -29 -86 -92 -150 8 -83 166
4709 166 2 -24 -67 -68 69 287 323 -87 -167 -204 -32 163 299 215 -37 -84 -139 54 115 -94 123 -243 -361 339
4733C39k79J52o37M14j30K86k77Q2q7r8R6j76K95J73K2k46M6l00n5L12J21J02
4755A55j30K98k21l44O5j37K01K63l57j41P84k56n07K91j12J02j29j40K99L11
4775B95o73K08L43K7j46P89o58P48j04o65L73o2j4p33P10o62M19j40K13J57k72
4796A53j26j17Q4N16p09K52Q9j90J98N2l72L19m2j70J73k37L10k61K82k11K2l9
4818b4L59R0m53L39j14k01M27K0j92m14o5R5j95M46J19j79R46j036K6r3n74Q38
4840A65j03m22M91O7r9j56J74r2jj12K22j80J60j67J57K54j24n7j26k32L00q2
4862C7l9j44J37N6l28L72o5J33R6n04K12K5O6K37l84m3j60J99J41K8P2n9k83K60
4886F2k20J31N3j41J0J09j45P19R3l36k3L10m35O4k6k19j10M33l54N31n54K52
$$ plain form
4733 339 60 212 -425 -11 -141 145 -132 -50 -137 -235 -139 -315 -20 153 175 -71 -25 -325 -380 -68 53 155
4755 155 25 323 102 -242 -177 -314 -113 150 -207 -348 436 180 -327 -36 -148 -46 -175 -315 -16 295
4775 295 -378 -170 173 200 54 843 185 933 829 164 537 475 461 -272 438 -224 195 55 268 425 153
4796 153 27 -90 -6 510 -199 53 142 -48 150 202 -170 149 107 -63 110 -127 183 -78 204 -7 15 -24
4818 -24 335 425 -28 311 197 -4 423 443 251 -163 -228 -133 -328 118 237 58 1004 -32 -6 -99 -673 165
4840 165 62 -360 131 198 99 -57 117 25 24 -88 134 -46 114 -53 104 358 234 177 51 -181 119 37
4862 37 -2 -146 -9 47 -281 91 26 159 255 -249 -37 -12 54 291 -93 -136 -296 -97 44 72 144 85 -198 62
4886 62 -158 -27 26 -115 -105 4 -141 578 671 335 312 622 187 251 225 6 -104 329 -25 506 -48 204
4908B04m56L49k58K64k2j29K5J38k15r5J99J18L5k18M1L5l6n4J74j04K7r6n2J81
4932E5m0P8J30k47K9qK36j44k30N2jJ14J89j91j9j97J89l7n2N8J30j66K58l50
4956a64PO7L79n93M26J56l18Q5n8K86l2l74L41j98K78k00j17k1J88J89m57K79
4978A49J21k94L63J66r52Q16Qn77J09J27n07R44l54P51q56mJ02n04N13K67j012
4999f24J59O05R1r2m4k14K84p70O03K59k69K14J12l33j82K3K99o4j05l56L54l69
5021d19K65L99m37K90j12N47o85r7K28M0j75N1m9j7J05q7L14k08K23k27L0J06
5043H5j04j5q2K3J48L9j43M5o0j10R7J22R8j09N6k46O4j32K53k22J81l9Q4n9j27
5068a53J24j34J91O9P7j67R9k84P3L2J62j4K14j97l49L52K9k3k8j42l0O2J91k10
$$ plain form
4908 204 -252 97 -161 103 81 -48 -23 115 -100 -195 4 122 157 -61 -20 15 -21 -75 99 -5 22 -74 -126 55
4932 55 15 93 223 -24 5 -3 233 89 -141 -89 -90 24 213 22 3 -194 -5 -42 -94 -36 94 -72 186 -164
4956 -164 -157 -90 289 -304 122 278 -40 45 -13 273 241 -133 208 10 288 88 -29 -50 138 327 -130 149
4978 149 270 -24 339 505 -447 369 377 -200 -91 36 -471 473 119 870 14 10 112 -392 121 388 -624
4999 -624 -465 140 231 139 95 -119 165 -605 -2 257 -12 202 314 -19 -201 -178 121 57 -48 -404 -50 -419
5021 -419 -154 245 -192 98 -14 533 -152 -249 -21 19 -156 -105 -154 -171 -66 -153 161 -47 176 -51 -21 85
5043 85 -19 -34 -116 -93 55 94 -49 -4 -64 -174 -77 45 143 34 90 -156 -92 -224 29 -193 -12 -51 33 -26 -153
5068 -153 -29 -163 28 97 174 7 106 -178 -105 -73 89 75 289 92 -257 95 124 101 73 -69 -99 -37 154 -56
5092e6K22r6j42Q5O2p1j4j95M45l75P7m1J32o7k6R5lJ42nm8j85M8l0n2L71l19
5118d6J03q5j63O2J51j60J86j66O3N9k5J61n5n3Q8j71K94l83J54k08K43N7K51
5141C57l73j3K04J53j51j63o5J52q5p8J55N1k51L0J13Nj59l0Q3k8J73j24J86J
5165A43k46j5K44j91K6o6K39m17N53j77j49P8K1l3j29j16J48l31M10O5j01q1R9
5188b6r9M77l08l16Q0m4M13k54K71j22q0qR8j74j32L57k74R6rN0N8o9j83K25j07
5213h0l0J45M8jm5j56K14l51K96L8J1k50J12MK12l82K29K33p5j6O0r7q0N4j54
5238f1J33M9J1o5Q0k01MJ49m6%J21l2k93R0j37K61j99O2p4K04Q8l62J88j46L25
5263A49k71N7J83m5l65K65m9P8M9o9k26O2n0K56Oj02o3j02K57j13j71J30j23M18
$$ plain form
5092 -56 166 70 -72 13 75 4 -10 -205 240 -135 -58 -99 33 -34 -60 35 32 174 169 121 -64 -16 -46 -98 273 -46
5118 -46 57 -28 -191 -129 22 -138 48 -118 -55 4 -21 140 85 32 120 -51 243 -140 14 -194 49 106 357
5141 357 -16 -29 175 328 177 14 -51 101 16 -62 93 144 -107 -77 36 41 -118 -148 -65 -93 80 -44 142 143
5165 143 -103 -118 126 -65 -39 -105 134 -283 270 93 -56 22 43 10 -119 -235 -87 -418 -8 57 -44 -125 -26
5188 -26 -125 352 44 -272 -192 -236 177 -77 194 72 -8 -16 82 -92 -224 133 -141 -45 -54 -4 54 -15 -198 27 -80
5213 -80 -110 35 83 82 37 -119 95 -256 40 78 89 -161 -49 -45 167 -215 14 247 172 156 216 119 39 93 -61
5238 -61 72 121 132 67 147 -54 -50 99 53 53 174 142 -151 -61 -198 63 -136 -74 -148 56 144 -218 -30 -176 149
5263 149 -122 -65 118 73 -292 -27 -76 2 51 -18 -244 -182 -232 24 30 -72 -135 -237 20 -93 -264 -134 -257 161
5287A61j71O5j49M7j3K3j51O3J09J51l41M8J73J05n1j21K88k70K33l13j2J21J22
5310A17kq0O3j44qk44K30l8m7L90K8M3k84L5l17K84j4J32o5n9K37m29K20j02J69
5335A15O2j43q4j25J66j84J08L06m84K09J7q1L16l44J31L8l3L0k09R9n8k7J83
5358Hj30J41R4p5j93K21n0j44P2QJ37J60j65j16J97j60J92l72J46J7%M4j28j66
5382b62J96J68k67M7M9K35k93Kn6L6J89k27J72p8L1R3j0j84NP1Jl6O0k2J27k81
5408b34K19k22K60j18J06K4q7l33J57L65k59J11J6j73m9pL84N0k82J16j8%M8o9
5432EO2rk29M53n01R3R9pJ27m8j22K83n0o3k31k1J21J42J5j64o6L6L02m45J84
5457c4N9l3O9R8k63M3R8M0k14o7j07L12j5p5L25n25J16K29L6l36M46r9k43K24
$$ plain form
5287 161 -10 55 -94 -47 -60 -37 -188 -125 -16 135 -206 -158 15 120 69 -52 236 -34 199 -114 -126 -5 117
5310 117 115 35 98 -46 -54 -298 -68 -106 -153 237 265 308 24 59 -258 26 12 144 79 20 257 -172 48 -54 115
5335 115 177 34 -50 -175 -9 -193 -85 221 -263 -54 -37 -118 198 -146 -15 23 -10 20 -189 -90 -148 -175 8
5358 8 -122 19 113 38 -155 66 16 -128 -56 -48 89 249 84 -32 165 5 197 -175 -29 -12 -12 32 -96 -262
5382 -262 -66 102 -165 -118 -69 166 -127 -125 -181 -145 44 -183 -11 -89 -58 35 25 -159 -154 -83 -82 -118 -58 -80 47 -234
5408 -234 -15 -237 23 -95 11 35 -52 -385 -228 137 -122 -11 5 -168 -217 -224 160 210 -72 44 26 26 74 5
5432 5 67 58 -171 282 -219 -126 -27 -34 93 45 -77 206 156 93 -138 -159 -38 104 119 -45 -111 -75 227 -218 -34
5457 -34 25 -8 61 159 -104 -61 37 77 -137 -204 -311 1 -14 -89 236 -289 -173 56 92 -244 202 103 -140 84
5481H4l20M01k37K72k70j29K55l71L08J33j09q7O7Q3j36n8J44J59k67po3k9j7
5504a94K98J79m23J60r7J4J26J16M1r4O6k37J8M2m8l5k88N46k93K79l78K52qJ1
5528E3j70J6L08j13j96p0K03K3p8N0%j72J09pJ0J90k71J55k03K66k55M11j21j09
5552B9J57k24p9J1J34j67J50j92N8K47K16r7j4l96L62k68j97L03J82j86J20m6
5574A03j04Q7J4O4N9k67J0J08k2j31p0j30J82J34j73K52m7L0P1m5k57K52o5p9
5598b4n8K0J67l8j4J16q8j02n3K33N0l46J6j06J07n5R8K47j9p7N1L8m7j22Qj14
5624a12Q4l5k1N2RJ55k16n3j09L31n0J09j27j63J4K43k42K75m58J48j22K84J04
5647A00k12K62k16J25Kk86n9M22l32L69K47p17K80M8O1j54K48k03j32K53r2p4
$$ plain form
5481 84 -236 165 -72 200 -70 -199 56 -315 -7 126 17 -70 -3 80 -56 -114 30 189 -78 -85 -148 -177 -194
5504 -194 104 283 -140 20 -77 -63 63 179 220 126 192 -45 -27 15 -33 -68 -356 190 -103 176 -202 50 42 53
5528 53 -117 -101 207 94 -102 -172 31 54 -24 26 26 -146 -37 -44 -34 156 -115 40 -163 103 -152 259 138 29
5552 29 186 -38 -117 -106 28 -139 11 -181 -123 124 340 243 229 -167 195 -73 -270 33 215 29 149 103
5574 103 -1 86 100 164 223 -44 -34 74 52 -79 -149 -279 -97 37 -136 116 69 99 170 125 -132 120 55 -24
5598 -24 -82 -62 105 67 53 169 81 -21 -74 159 209 -137 -121 -227 -120 -175 -77 170 151 74 125 163 116 -6 2 -112
5624 -112 -28 -63 -84 -32 -23 132 -84 -137 -246 85 35 144 17 -146 -132 111 -131 144 -314 -166 -288 -4 100
5647 100 -112 150 -66 59 61 -225 -284 138 -194 175 422 -295 -15 33 94 -60 188 -15 -147 106 14 -60
5669f0k31M04m00K08j0K00j24l7j3J78j46P1N3j22k6n2J03r5J72j61N6K05k40
5692f7J0J64q5k03L44k67Q9qk2J25j61oJ20j9j81J77j10R1j00P9K7j73j0R0L6
5717f0M7K2R6o3j22K70k23J16K2k28J11K8j74K77j42Q2j58J78k26J17J94M3j67
5740D0k23l6K0J58P5P5j97J1K00k78M78n87K95k00K66m1j87J23n5j29K86J03l26
5763a29M8lR2j32M07l43K1m2O5kpr3O5J90oq9j13J79J29k12O3Q4k49K18j62rr2
5790a22K81K42l20k92O1J57Q3j65jK1K76j19k88o1L49l47L65k29O9O3j16p5j17
5813b85J37K32j29J49m2j87J90j41N4J1J14q0L6j82j49M19j77k45M40P7k42M9
5835D9k15J04m8J28L8j2j61J15N4k34m5R5J05J7L7R3J36k99j01l2J01Jj78L39
$$ plain form
5669 -60 -291 113 -287 -79 -89 111 -13 -50 -63 115 -31 40 93 -29 -55 -107 -4 -99 73 -88 -32 173 -67
5692 -67 -57 107 22 -181 163 -104 -15 -23 -45 80 -81 -87 33 14 -167 10 -100 -9 -109 -30 -3 -176 -186 -96 -60
5717 -60 -13 9 105 42 -80 190 -33 83 105 -123 -12 16 -158 119 -23 59 -99 79 -147 -30 164 207 40
5740 40 -183 -219 -199 -41 34 109 -88 -77 123 -155 323 -264 31 -169 97 56 -131 -8 -63 -192 94 197 -129
5763 -129 -81 -84 8 -124 283 -60 -39 -81 -16 -18 -25 -118 -53 137 131 42 -71 108 237 25 88 172 -77 141 -21 -30 -122
5790 -122 159 401 81 -211 -150 7 90 -75 -76 -55 221 102 -186 -247 102 -245 120 -109 -40 23 -93 -168 -285
5813 -285 -148 84 -45 104 62 -125 65 -76 -22 -11 103 23 59 -123 -272 147 -30 -275 165 242 0 49
5835 49 -166 -62 -110 18 56 44 -117 -2 52 -182 -227 -132 -27 -10 27 120 256 -43 -144 -176 -75 -74 -252 87
5859H7k91J64J24r6K66j58k7o1k13M9R5J02j65J89j08J23o5K7J0O2O5k27J67k65
5883a46Q4J28j16J22k62P7r5K98K1k38J53J57j3l47J70K47j18j39rJ41k67J22
5905c0m5L91j60l56L5p0J56r4J98rJ19m53L52J70k32l66M64J1k47J00q8O7K32
5928A45m07L77k11J50o6jr2M1J54O9j14P9j04J85n1k08J7O2K04k30K17j75J9j87
5952a27J71k7j45p7L81k61K28j00j44J91j09M9J35k61p7J74k80J46j09J98PJ22
5974H5r1j83J52K10l27L6P0J05k47K00J03k04L35j92R7k51L26k48L2N3J6k25j9
5997a67J33N5l18J82L4K08l11K41n3r7P3O3n2N5R1O3k19J8Q2k88J51J35j54J6
6021e9J03k91J59l0J10K0j20P1J15N1j65N2l29L58j71p6N9N5J2J03j74L10L0k33
$$ plain form
5859 87 -204 -40 84 -12 254 96 69 8 -205 -156 -61 41 -124 65 -43 80 15 42 52 114 179 -48 119 -146
5883 -146 -62 66 -50 72 -190 -113 -208 90 111 -127 26 183 170 -177 -7 240 122 -17 -26 115 -152 -30
5905 -30 -75 316 156 -200 -165 -235 -79 -173 25 16 135 -318 34 204 -28 -394 70 81 -166 -66 -154 -87 145
5928 145 -262 115 -96 54 -12 -13 -105 -64 90 159 45 124 20 205 154 -54 -37 25 229 -1 216 41 60 -127
5952 -127 44 17 -128 -205 176 -85 143 43 -101 90 -19 30 165 -96 -173 1 -279 -133 -242 -44 -37 85
5974 85 -6 -189 -37 173 -154 -118 -48 57 -190 10 113 -91 244 52 149 -102 224 -24 8 61 77 -148 -167
5997 -167 -34 21 -297 -115 -81 127 -184 57 4 -93 -20 43 -9 46 137 200 -19 -1 81 -207 -56 79 -75 -59
6021 -59 44 -247 -88 -118 -8 12 -108 -37 78 129 -36 16 -313 45 -126 -202 -143 -88 -76 27 -147 163 193 -40
6045d0l0J47m2o7R6J11j68M9j32J68j03p4K35k59k06L12K8K50j01K9l30Q7J57
6068A17j96Lp6K64n5J11l37J19J52m0k0K8P0k74J68m1n2k92J53M50l78K15P3o9
6092I3M9j24L0k53P7l6J88J59j56J25k15PM25n66M35j24j38L51k60j94J16J25
6114A14j61K4J6j71L57J27j99K84j80l14K60j57nK33r8k09Q5j11o8O4M1J01J66
6137A99j40k16Q1pK49p6j07J55K3k44K76j88j94J85oJ87k41q9L12k42J06k26K13
6160A0r9J19l5J56j34P3K3m3k87M82m46L49j98j13N7J68q1J36j86j10J03j89J72
6183g3J22p5K28k35J71j11o1L07j64j21j1J01J4j06L2jp6P6K37m34L23j89J48
6206A02l3k44J89r9R9p5K33j16J03k15J10k25J30J79P6k55J87l37M34j97o8j58
$$ plain form
6045 -40 -70 77 35 -32 64 175 7 56 -76 92 -11 -85 150 -109 -315 -3 25 275 174 203 -127 -40 117
6068 117 -79 -76 -152 112 57 168 -169 -50 102 62 42 70 140 -134 34 -7 -59 -351 -198 252 -126 89 162 93
6092 93 142 18 48 -205 -128 -164 24 183 27 152 -63 -56 369 -197 238 114 -24 327 67 -127 -11 114
6114 114 -47 -23 -7 -178 179 306 107 391 211 -103 157 0 -5 228 130 -79 6 -105 -173 -109 -68 33 199
6137 199 59 -157 -76 -83 166 90 -17 138 161 -83 193 5 -189 -4 -10 177 -64 -153 159 -83 23 -203 10
6160 10 -89 30 -5 151 17 90 113 70 -217 265 -181 168 -30 -143 -86 82 1 137 -49 -159 -56 -245 -73
6183 -73 49 -26 202 -33 138 27 -34 273 109 -12 -23 78 92 -14 18 17 -59 17 254 -180 143 -46 102
6206 102 69 -175 14 -85 14 -61 172 56 159 -56 54 -171 -41 138 214 -41 146 -191 243 46 -22 -180
6228a80m2K98k3k45K05p3K15k96P7j21K56J19m66N26k87nl2j11j7L95q0j24L6
6251B5p0j75J67N1P2k67K44j31r7M15k16j62k3J64L98m18K0j78M51l63J63K7l60
6274b63M30j83K4l7j63K91J39k04n4l08M74k13j78L0J11L09j49j17K49j77j93
6295a82J80J12j25J32P8k34j0N6m1k46L95k5j19n2k8J74n5k23J93l9J31M8L3K1
6319A74j14Q7l24O3L25j71j75K32m13J77J85k1j06o0K57j68j41M8lJ9Q1K9N7M5
6343H3j67K33m02K45n9K42l90J75k8j53K35r8O4o8N2O0k07K8j09N6M20m34K87
6366F5M5J05k06N1Mj99n0k4K61n1j05L3J04P7k79K58k0j52j76J67L32k59L57n07
6390a69P0L41l63o3L73j43K66k26J8k79K12Lp1R4n0j8J53j14l1k27q7L62k25M50
$$ plain form
6228 -180 -222 76 53 -192 13 -60 155 -141 -64 -185 71 190 -276 250 -37 -42 -74 -185 -202 193 113 -11 25
6251 25 -45 -220 -53 -2 70 -197 47 -84 -181 234 18 -144 -167 -3 395 -23 -3 -181 270 -93 70 97 -263
6274 -263 167 -16 8 -29 -192 99 238 34 -20 -328 146 -67 -245 -215 -104 205 56 -61 188 11 -182
6295 -182 -2 110 -15 117 195 -39 -49 7 -34 -280 115 90 -29 -81 -109 65 10 -213 -20 -59 72 120 153 174
6319 174 60 147 -177 -114 211 40 -135 97 -316 -139 46 25 -81 -141 116 -52 -193 -145 -148 -129 -48 -19 38 83
6343 83 -84 149 -253 -8 -67 175 -215 -40 -68 -221 14 -84 -20 -88 -36 24 -183 -155 -264 -208 212 -222 65
6366 65 110 215 9 60 64 -135 -185 -209 52 1 -104 -71 33 110 -169 89 69 -83 -259 -92 240 -19 338 -169
6390 -169 -99 242 -121 -184 189 46 312 86 104 -175 37 40 -31 63 13 -5 148 34 3 -224 -311 51 -174 276
6414B76m86J68l1K4j5n5Q6nl3j49K86j04K7OQ2j21L36k97J29o6j10K95j41m4l3
6439B5K22j17k9Q2k70N5j15m1J31j30L54j42j31K7J07j16OL72l50K94k66j62L38
6462A44k73P7P8r1j10K95l35L48j7l31R4K1J99q5l6j89J20J87j76N0J73k74J91
6485F0L1J03k64q2J10J27o4l7O2l08L06j35K7K29l41Q6P2M4n2K99l15j26J79K02
6509B13l71j07L09j20Q7q1M8K77l93N5J89l06P1K33j85J21j76M7k32M62p6m6r6
6532g7j2J73o8P4k3L4r3J6Ok13J75Jm3K61k99J57j41l2L27m09J33K5K66j13k48
6557a23o1K40J82j59j41O8l4k3J22r7O7k9M0m13L68k71L59l8l4r9j56M08L4n5
6581A55kk18k88O37l27J12M9k9j07J8j7j8J35j96J01k0K96m50k7M8L22k98J33
$$ plain form
6414 276 -210 -42 -73 -49 -64 -119 -33 -38 -71 -220 66 -38 -11 -5 77 -44 292 -5 124 58 -52 243 102 58 25
6439 25 247 130 101 183 -87 -32 -147 -188 -57 -187 167 25 -106 -79 28 -88 -82 290 -60 234 -32 -194 144
6462 144 -129 -52 26 -65 -175 120 -215 133 116 -215 -121 -100 99 14 -22 -211 -91 96 -80 -30 143 -131 60
6485 60 91 194 -70 -152 -42 85 21 -16 46 -262 44 -91 -64 165 -176 -90 -18 26 -26 273 -42 -168 11 213
6509 213 -158 -265 44 -76 11 -70 -22 255 -138 -83 106 -200 -129 104 -81 40 -136 -89 -321 141 65 19 -77
6532 -77 -89 84 16 90 67 101 8 24 30 -183 -8 -7 -50 211 -88 69 -72 -104 223 -186 -53 -28 238 125 -123
6557 -123 -184 56 238 79 -62 6 -28 -51 71 -26 41 12 52 -361 7 -264 95 57 23 -76 -232 176 210 155
6581 155 153 -65 -353 284 -43 69 118 89 -18 0 -17 -35 100 -96 5 -15 281 -169 -196 -148 174 -124 9
6604IK26J3L3k44j05J33j03J90j25j3P9k35O9jJ40j38J0Q5j44m0Q7J2rO3L6p2
6630d4J20J43k18P3n3M9oj78p6J76n5P6j7l7o2P9J1K6k6j42J49j49j60M13j98
6655a06O5J15k70L51k28K90j71J11j85l39K36J33O3j72J29Jj92Q4K42k91N3O6
6677a5K22j58j13K23N2j02j12M0j50K01l8k01L18j02m5J13j57o9J20j6m0K69m48
6700b08K83J41j91M1K48l39K53j11k48K89p1k27K90k62K58j73m9mJ21Q1j62J17
6722G7mj28K34j17j7j98K77j30j6j32O5J31P9m6r4%J76k1m85K97j37J30j13j1
6746a83N02l16j76K49k67K52M0R0j01N4k09p7K49k24P8K00j93Q3j20N2j88J42
6768f3J39M2j02o2K89j54L6m07M48k81N2J24k07M57l48m5J08J58l45M72m59L26
$$ plain form
6604 9 235 248 281 37 -68 65 -38 152 27 14 93 -142 -73 -74 66 -72 -62 23 -121 -161 -74 -62 -71 -8 28 -44
6630 -44 76 219 1 74 21 70 64 -114 -190 -14 -69 7 -10 -47 -109 -30 -19 7 -19 -161 -12 -161 -321 92 -106
6655 -106 -41 74 -196 155 -73 217 46 157 -28 -367 -131 2 65 -107 22 23 -169 -85 157 -134 -81 -15
6677 -15 207 49 -64 159 211 109 -3 37 -113 88 50 -151 167 65 20 133 -24 -93 27 11 -29 240 -208
6700 -208 75 216 25 66 314 -25 228 117 -131 158 87 -140 150 -112 146 -27 -76 -80 41 122 -40 77
6722 77 73 -55 179 62 45 -153 124 -6 -22 -154 -89 42 121 75 -19 -19 157 136 -349 -52 -189 -59 -172 -183
6746 -183 319 3 -173 76 -191 61 101 191 90 144 -65 -142 107 -117 -39 161 -32 51 -69 -17 -205 -63
6768 -63 76 118 16 -46 243 89 125 -282 166 -115 -63 61 -146 311 -37 -82 26 184 -161 311 -148 178
6790A78q6K7j52K3j98O3J89j65K21M2j06r9l3J43j39K4J59k8l11K41J27j37j27
6813a44J94J74j62k5r6PJ22K9L7j39j20J4K17k22m9K63n63N75R7m05J51Q1m6j72
6837a82M5q7Q9K20o7K3j8j9m9n0K12N0r8J42m90N10m43Q9N4J71j77P3N3p5J14
6862I0mj14rq6p8J73p3K93o16M88N7k6l2k02L79k04l17L00m5lj08m7M1J58O4l4
6888D5J10o3qj31L23m43K72k14K7L7K06j20q6K74l14J82J21j68J06j07kn5O4K19
6912B75j34j12q2J44k18n4J52O2M5M3k59J17J69j47J14j8q7j06N7L30k18k48R7
6935g8J35J91k94JK39j78J23j78j10J90l9K59k67Qr6M8J80j74j09L31O9k66O5
6958E0J21j95J09J06m0j92J8Q4O7k99N7J37k86J92J56j68j20K59o2P3r1N6J48
$$ plain form
6790 178 92 119 -33 -10 -208 -145 44 -121 100 142 36 -63 -96 47 -92 -68 91 63 -248 -7 120 -17 -144
6813 -144 50 224 62 37 -59 -52 70 99 136 -3 -123 -109 108 -114 -163 100 -463 112 209 -196 -45 36 -10 -182
6837 -182 -137 -224 -135 85 18 41 23 4 -45 -95 117 167 69 211 -279 231 -212 -123 -69 102 -75 -2 51 -24 90
6862 90 86 -28 -37 -123 -201 -28 -101 192 -424 64 121 95 63 -139 240 36 -281 19 -26 -29 -137 -184 -143 15 79 45
6888 45 155 92 84 -47 276 -167 105 -109 -82 -45 161 41 -45 229 -85 97 218 50 156 49 47 -8 56 275
6912 275 141 29 -53 91 -127 -181 -29 33 78 121 -138 -21 148 1 115 97 10 -96 -39 291 73 -175 -78
6935 -78 57 248 -46 -45 194 16 139 -39 -149 41 2 261 -6 2 -94 -46 134 -40 -149 182 251 -15 50
6958 50 171 -24 85 191 151 -41 -23 61 128 -171 -114 23 -263 -71 85 -83 -203 56 -6 67 -24 32 180
6981A80j86O6k18J92j14k50L90j44J20j68K69j85L02k66j61J19j72K09m5K08l24
7002a78K30k60L50j57o1J18N1j84M31l74J28l5j40J75p9N1p4j02Q3j48J32Q8k84
7025b39J43j04K99n1n1k3L50j84m8O2l2j82j65K30J57k11l7j1K45q9j39NJ26n7
7049fJ53j38K7N2q9J55k91L11Q8k85k73L55J54k23Mrm2l1K82M6m26J20J44k8J56
7074B06r9MN5k34j27J08N1l9K8r5J45Q8N1p9j00N6N7O3K6r2k33K38l6P6l9l43
7100b64K53rJ72J43n03L65J0k05L5k21N8n9K80j25J29n1J31O4k15O5j45L02l34
7123a24J36J10j75j28L61l91L6J14MJ97j29j20J19q9O1j11K21K1J73j44q8kj76
7146a24J85J07Mp9Q3k86J42J25l51K1O7P5J5o0K53k18K37l33K00q2J7L7j26J46
$$ plain form
6981 180 -6 60 -158 34 -80 -330 60 -84 36 -132 137 -48 254 -12 -173 -54 -226 -17 -62 146 -178
7002 -178 52 -208 142 -15 -76 42 93 -91 340 -34 94 59 -81 94 15 66 -8 -110 -27 -175 -43 45 -239
7025 -239 -96 -200 99 48 -3 -26 324 140 92 154 122 -60 -225 5 162 -49 -86 -97 148 59 -80 -75 51 -6
7049 -6 147 9 36 88 -1 154 -137 174 262 -23 -296 59 213 -10 -6 -15 -57 -88 194 240 -186 -66 78 50 206
7074 206 107 111 166 -68 -195 -87 -36 -75 -47 -142 3 91 142 63 -37 19 76 139 165 73 -160 78 42 118 79 -264
7100 -264 -11 -20 152 295 -208 157 167 -38 -3 -224 -166 -225 55 -70 59 8 139 203 -12 53 -92 210 -124
7123 -124 12 122 -53 -181 180 -211 -175 -61 -57 140 11 -109 10 -79 -18 -129 92 113 286 142 54 52 -124
7146 -124 61 168 172 93 176 -110 32 157 -194 -173 -106 -31 -16 -76 177 -41 196 -137 63 -19 -2 35 -91 55
7170E5nQ4k55N2J84j94J54K9r9q6O7K27l08O9n6j09K0M9K39q4j09L9L8k1L7l0
7196a3J15j40q3J98j96N4j39J14M7p4L20l40N8K56j99M3j59J82J96k05O8n6k6
7219B1m7l12N04j57j98J22J53p2J4m0P8k01J4M00m6j03l08M48l68K08j75J28j45
7242h2PK2J93L4k54l7j00J15J29j65Q0J42k19J28J1j06P6K47j26J44k76N6L12
7265C31m33J25j8K4k34J27L13j30j13j60K52Mk76J54j80mJ79O9jJ32l18J66Lj25
7289a13J77j28N8m22L13%K89j70l1N5J81j65j91K06M6l52K56j48N5k38L33m8K3
7312a4Q1m2N2r4MK34N8l11J77o3O8k14J42k49K74j36J76j66j23k7O3K7K67j82
7336Bk19J91M3j69J43K4o4J24p4o6R6j85J78J38k45N0L1lK07r5j16j55K43k53
$$ plain form
7170 55 50 134 -121 -69 115 -79 75 104 5 -81 -14 213 -95 -26 -82 -191 -171 -122 117 33 -76 -37 1 -20 17 -13
7196 -13 102 -38 -121 77 -119 -65 -204 -90 -43 -117 203 -137 -79 177 -22 21 -138 44 240 35 103 47 21
7219 21 -26 -338 166 9 -189 -67 86 14 28 -12 66 -135 -121 279 233 130 -178 270 -98 110 -65 63 -82
7242 -82 -75 -53 140 174 -80 -117 -217 -102 27 -138 -58 84 -135 -7 4 -102 -26 221 95 239 -37 19 331
7265 331 -102 23 5 29 -205 -78 235 105 -8 -168 84 88 -188 -34 -214 -218 -39 30 29 161 -157 9 12 -113
7289 -113 64 -64 -6 -428 -115 -115 174 4 -27 28 209 44 -147 59 105 -247 9 -139 -84 -322 11 -37 -14
7312 -14 67 25 77 -17 -13 221 279 -32 145 82 150 -64 78 -171 103 -33 143 -23 -146 -173 -110 -83 184 2
7336 2 -217 -26 17 -152 -9 15 -49 75 1 -65 31 -154 24 162 -83 -33 -2 -5 202 107 -9 -164 79 -174
7360a74J65j63K16k03L0J52j32J10j63J21K18j52j23K55l53M46l42K68k53m8K04
7381G9j20q2K79p7j23J26r4Q7P0k35j16J47J55j86J64k2K9l13M39j90j44K49q4
7404C8q2J17L2k40q8K00jj79Q6K08j19P2j95P7K5k07L62j1j09r3KQN4j3J6r0L0
7431a00K56j36K7Q9q2j79J06k2N5J7M8J99k00J19p1l64L5P2J70j9j04L9J87j80
7455c8J8L1L9k0k24K55j86K00J69k6m65L16j96M0%m8k3j56L12j20J03J64lJk38
7480i5K71J61m81Q4K21l34O1r7K97l06J89rJ01r3J13J34K0k13k44J59j70L81n1
7503I9j86q6K31J45J7k80rJ99J79m57J69j48J79j85J0N7l8K32j14K09n28K32J70
7526I7k3J9m6K2j05Q5K00m73K62P3j08j46K31o2pk4p7J57J4P7l67M56k83O9k57
$$ plain form
7360 -174 -9 -172 44 -159 -129 23 -109 1 -162 -41 177 25 -98 157 -196 250 -92 176 -77 -125 79
7381 79 -41 -123 156 79 -44 82 -12 75 145 -90 -206 -59 96 -90 74 52 81 -232 207 17 -127 122 38
7404 38 -44 73 105 -135 -223 -23 -24 -203 -117 91 -28 44 -151 -74 -49 -256 106 95 -14 -107 -105 -97 -43 -56 -40 -130 -100
7431 -100 156 20 47 136 54 -125 -19 -41 14 31 79 278 78 197 126 -238 -203 -131 39 20 -84 -45 142 -38
7455 -38 -20 11 50 30 -194 61 -125 75 244 218 -247 69 -127 -87 -87 -135 -158 -314 -2 -122 -19 145 142 143 -95
7480 -95 176 337 -144 -60 161 -173 -112 -209 88 -218 -29 -38 63 -30 83 217 237 24 -220 -61 -231 150 99
7503 99 -87 -173 58 203 220 -60 -69 130 309 -148 21 -127 52 -133 -123 -66 -104 128 14 223 -305 -73 97
7526 97 74 93 47 69 -36 49 249 -224 38 111 3 -143 88 26 19 -5 -82 75 89 166 -201 255 -28 41 -216
7551b16L61l8M4k89J17R6k04J76o6n6K40k96J83K02k17j41K24l22M6M1J30j01
7573h6kj08K51K51n66J74J71j86J15l4K0k39K68k47J57j78J29N9m6K98k29o8R
7596h7m9K11K9l12K67p0l9J17k02J49PL7L5lQ7n41K11K32o7Kq3o0K59j14J52j78
7622a0J43M1rk56K81k39R6J86k64O0r9O0o1O0J6J26J64m9m38M6PJ67k6j21KN9
7648e8J3m1R5k96K51R5J98k69n4r3K07q1j15J16J38j97K85j88l4M0j2R3M6j12
7672B7K8j42N6m1n0K82j38K10k29j82M3o8K78n1Q2j93L51j17k14J41j35J68J7
7695A23j73j18J09O7k14J71n6pO6q4J49j78K70j76j4J47l11K04J7k47K67nP2N3
7719A32k12k4q2K24m6k8P9R6j51J88k93O7l1j07M9j0M3R5J28j91NOO8j50K79l49
$$ plain form
7551 -216 145 107 151 -138 -21 75 -129 47 -19 -75 165 -131 52 254 37 -104 120 -202 -156 -115 15 -86
7573 -86 -88 -196 55 306 -260 -86 85 -101 14 -20 0 -239 29 -218 -61 -239 -110 -51 -97 201 -28 -96 -87
7596 -87 -136 75 104 -208 59 -11 -50 67 -135 14 21 58 93 90 177 -364 -153 79 12 14 -69 -129 130 16 168 -10
7622 -10 133 174 165 -91 190 -49 47 233 -31 29 -70 -10 -71 -11 5 131 295 246 -192 -146 -139 28 2 -119 -117 -58
7648 -58 -45 -86 9 -287 -36 59 257 -12 -66 -159 48 -33 -148 -32 106 -91 194 6 -28 12 0 93 139 27
7672 27 55 -87 -31 -72 -122 160 22 232 3 -179 -136 -204 74 23 105 -88 263 146 -68 73 -62 106 123
7695 123 -50 -168 -59 8 -206 -35 -91 -98 -32 -116 33 -145 125 -51 -65 82 -229 -25 -8 -255 12 7 79 132
7719 132 -80 -104 -186 38 -8 -36 43 139 -12 176 -117 -50 -81 -188 -139 -149 -106 -11 117 -74 -69 -63 5 -145 134 -215
7745b15l1L54j47J35r1p3L2j23j59K46J14o2J43j79oJ04k45qJ44K02j14L3j10
7768e6k31L02N1j18L05j53Q9j48m16L28K8L8j70N9J16J8J28k91M9j24R9K06L3
7791A42j02j08k00K42l1n6l7K91k53J48oJj93R2M2o3J54j14OK27k43Q7M6j07J5
7816b0J48k09K8L36l21L42j12k89P1J9R3j74K24k8J4q8J9J6j23J18j20M9Q0j04
7840c1j29J65J14k08j7o3J04j45J42J18J56j50j19l6j40L60n3j6P8j11J32j64
7862a3p1J62j85J41O2n1k10M55l08K10j50P0k39o4K04q8l37N00Pj74K25l8j72
7885f4LJ71j0j58K54m08J79k9k07P6P9J40l77K94K31l83M08j51o8o9J92j76J21
7908D8l8rR2M5j08J8o2j20M0Q3k22J36K79j69r6R7k4k2j62P2O7qM48l19p0L2J8
$$ plain form
7745 -215 -246 108 -39 96 5 -68 -36 -159 -318 -72 42 -20 123 -56 -62 42 -203 -211 -67 135 21 54 -56
7768 -56 -287 15 66 -52 253 100 189 41 -375 -47 -19 19 -151 -92 24 42 170 -121 -72 -196 -97 109 142
7791 142 40 -68 -268 -26 -57 -113 -150 141 -112 36 30 31 -162 -70 -28 -91 63 -51 -45 182 -61 26 72 -35 -20
7816 -20 128 -81 -53 283 -38 304 192 -97 -26 -7 86 -88 136 108 122 34 53 69 -54 64 -56 -7 73 -31
7840 -31 -160 5 119 -89 -106 -169 -65 -210 -68 50 206 56 -63 -99 -239 121 68 52 130 19 151 -13
7862 -13 -84 78 -107 34 96 45 -165 290 -18 192 42 112 -127 -191 13 -75 -412 88 95 -79 146 108 -64
7885 -64 -61 110 100 -58 196 -212 -33 -62 -269 -193 -114 26 -351 -57 174 -209 199 48 -20 -89 103 -73 48
7908 48 10 1 93 138 30 48 -14 -134 -94 -11 -233 -97 182 13 -83 14 -10 -32 -194 -122 -55 -63 385 66 -4 28 46
7935D6m9P2m4p2l6j65K75J16k8j97O6J4J40r3J09J72l73J05j72r1J75n7O6N8j96
7960a59K32j95k1J65j77R0J81j80r2J01j84L49l32J02K52k07J62k45K78o3J09
7981A66l10K62l81K56m9L2kO3j07p2Q1l09N65ql41J71j14K72j68J32J94l86O5
8004A2o5K05j55l2R3lo9j83K92J3J33j68l37L45P2r0K1l6k00m7Q3K61j17k77K27
8029b2%NJ35L4j60l6j22J80Nj05j11K46j85J47q8K21j68J97j79P9k47J67k1P5
8053D7o0j87K56j06o0K88q9n2l3j41k0K43N4l92J87K63k51J4J6K0P0j71o0j57
8077c21J07J42J36qo5j31l4L46k15L9K8j1q9M0R9k22K13o8k23K53Q7J29m6o7p5
8102D4j31L08k21j7K09j85j59K87k85J67j28Q4K4J76j97r1J22kqr0R6m75M09L13
$$ plain form
7935 46 -3 69 25 -47 -83 -248 27 143 115 -82 -16 -2 138 45 154 326 -47 58 -114 -205 -30 -87 -21 37 -159
7960 -159 73 -122 -143 22 -155 -65 116 -64 -156 -55 -239 110 -222 -120 132 -75 87 -158 120 57 166
7981 166 -144 118 -263 -7 -56 -24 -26 37 -70 -142 -61 -370 195 187 -154 17 -97 175 7 139 333 -53 12
8004 12 -53 152 -3 -35 58 55 -14 -197 95 108 241 73 -264 81 153 63 84 48 -152 -199 -116 145 28 -249 -22
8029 -22 -22 -17 118 152 -8 -44 -166 14 19 -86 -197 49 -136 11 -77 144 -24 173 -6 73 -174 -7 -28 47
8053 47 -13 -200 56 -50 -110 178 89 37 4 -137 -157 86 140 -252 -65 198 -53 -39 -23 -3 67 -104 -164 -321
8077 -321 -214 -72 64 56 -9 -140 -174 172 -43 -4 24 13 -76 -36 63 -159 54 -14 -237 16 103 232 186 119 44
8102 44 -87 221 0 -17 192 7 -152 135 -150 17 -111 -27 -3 173 -24 -115 7 5 -3 -93 3 -472 -63 250
8126B50k74J5j60K45k09K13R8k04OJ96j85J43j64J84j95j41R8J58O4k33L0J44
8148G9k7o9k6k05K92L3j62K88m52Q1j33K80r5L82k51K5o9L5J28q4J16J6Qk42k9
8173h1K10k75J61r4R8o2J08q8L3K04l0k84J81p9l3K9J5j86
$$ plain form
8126 250 -24 -9 -169 76 -133 80 178 -26 -20 176 -9 134 -30 154 -41 -182 -84 74 138 -95 -65 79
8148 79 52 -17 -43 -248 44 77 -85 203 -249 -168 -301 -21 -116 266 15 40 -29 6 134 50 166 182 190 -52 -81
8173 -81 129 -146 15 -79 19 -43 65 -23 10 214 184 -100 81 2 -31 -2 13 -173
8191a73
$$ Imaginary data points
##PAGE= N=2
##DATA TABLE= (X++(I..I)), XYDATA
0@%%%%%%%%qJ6j6J6k4L2m0N6p2Q8j04J25j49J76k15K55k96L47m03M69n42O22p13
31c80Q13r26J050j186J337j503J686j886K104k342K603k889L200l538L913m322
47b266M764n252N785o371P022p739Q536r428J0429j1564J2863j4369J6136j8242
61i696K0803k3998K8117l3649M1513n3657P5065j23910M40321K00427l21409L68893
73F08820k71612j30817J09774m9911j17520J0213N2032l2153j60341J66510k8102
84A56893j96496J35003K0610j87901O1852M0726j08152m7809Q6116K225j16116
95a53049Q2171J48406j94260M4354K09405k33162k6594K23202k01436p3557K00552
106B6032q3669j11075J13603N5677j61345L686J74445j96959m8618K42169j62017
$$ plain form
0 0 0 0 0 0 0 0 0 0 -8 8 -8 8 -16 16 -24 32 -40 48 -56 69 -80 96 -119 136 -160 187 -216 253 -289 333 -380
31 -380 433 -493 557 -629 708 -795 891 -995 1109 -1233 1370 -1519 1681 -1857 2056 -2266
47 -2266 2498 -2754 3031 -3340 3682 -4057 4479 -4949 5480 -6084 6779 -7590 8546 -9696
61 -9696 11107 -12891 15226 -18423 23090 -30567 44498 -79412 360909 561336 239927 608820
73 608820 337208 206391 316165 266254 148734 158947 210979 178826 18485 184995 156893
84 156893 -39603 95400 116010 -71891 -10039 30687 -77465 -125274 -39158 -36933 -153049
95 -153049 -70878 77528 -116732 -72378 137027 -96135 -122729 100473 -100963 -174520 26032
106 26032 -57637 -168712 -55109 568 -160777 -157091 17354 -179605 -228223 13946 -148071
117a48071o8108K31470q8012p5437J39565l975o7339K4083Q6367n3091o6082J36176
129D7546k3634j16057J25101L2522j16212Q6346P8319p3876L729Q3186k3398j13083
141i511N8569L9480j80796L8362J28637j75416L0849J87226j33773l690J63925
152A43862o4717p3761R7366K2618j33426L5438J03945j51346j0745J62554j27133
163D655k9508J68989o8384m4870J05524q492p9471O815L1027r0467p2209P3267
175c124m6774j00080J04838J2126r2537P6959N0195p6197J096O7125m0281p2796
187a19450O8280K4968j27137O7047Q7409j41559N5265J24156j08737J5054J26014
198G1310n9778m4684Q8481l222j01038M3139O5179j26557J6748J12749j08704
$$ plain form
117 -148071 -216179 15291 -72721 -148158 -8593 -12568 -79907 -55824 30543 -22548 -88630 47546
129 47546 23912 -92145 32956 65478 -50734 35612 113931 40055 43784 126970 103572 -9511
141 -9511 49058 88538 -92258 -53896 74741 -100675 -69826 117400 -16373 -20063 143862
152 143862 79145 5384 102750 125368 -8058 27380 131325 -20021 -30766 131788 4655
163 4655 -24853 144136 75752 30882 136406 127914 48443 55258 86285 -4182 -76391 -3124
175 -3124 -49898 -149978 -45140 -33014 -125551 -48592 1603 -74594 -73498 -6373 -46654 -119450
187 -119450 -51170 -26202 -153339 -86292 1117 -140442 -85177 38979 -69758 -54704 71310
198 71310 11532 -33152 55329 52107 -48931 -5792 59387 -67170 -50422 62327 -46377
209d6377r307J15201o8591m2190Q5293j7909n6718L3328M3527n2567k0846Q6171
221D9015l8133n9938R0625o901p9383O8629L0938p0737K1828N8794l4208m3154
233a2625P7019N367r5094P4994L9759j23433M6685O6956j21180Q287P7462p3709
245b9512l0377P8922n237o9043O7958M6747r7566L0627P4978j03350r727Q2688
257C7108p5848k9300P0569j6478m0228M4836M2638m4617K613P2751l9470m7034
269b2460P4507k8230p3358N5857L272o5577K3065N1286l8173j7182P8666n523
281C6150o5079P5892J8692j04207N4180L7300j04532J9592O0077o7219j5608P5541
293B0779j5545m7914O6018K9784q0324L8029N5722r2032N700O2741o7066k1131
$$ plain form
209 -46377 -55684 59517 -9074 -51264 34029 16120 -40598 -7270 36257 -16310 -37156 49015
221 49015 10882 -49056 41569 34668 -44715 23914 54852 -15885 5943 64737 30529 -12625
233 -12625 64394 69761 -25333 49661 89420 -34013 12672 79628 -41552 -33265 44197 -29512
245 -29512 -59889 19033 13796 -55247 12711 59458 -38108 -7481 67497 -35853 -45580 37108
257 37108 -38740 -68040 2529 -13949 -54177 -9341 33297 -11320 -8707 64044 24574 -22460
269 -22460 52047 23817 -49541 6316 9588 -55989 -32924 18362 -19811 -36993 41673 36150
281 36150 -28929 46963 65655 -38552 15628 52928 -51604 -32012 28065 -39154 -54762 20779
293 20779 5234 -42680 23338 53122 -27202 10827 66549 -25483 -19783 42958 -24108 -45239
305d5239O0853k1997l5441M2563K6255m1688P778O2424m3430k6434O9463l1405
317B3702n1937N3502l273o0210K7448L1182m5759j1376O0902k2491n2462P1387
329B0615j88p7427N8265K6045q2021L0562M7041o4280o134N5594k7072m3206N8500
342c706J4052o2872M8894M4768o6859K2119N7240n7762p864M9848k7659l1457
354b1258L1636J3380m6440J2065M4738m3727j1976O2803k7240l2202N8149o080
366C3848m4343K7571J9353m6776o969M7377l1323l1192O6088k508n0824O3597
378D3899J7522o1530L7205L0007n4687j075M2256l5535l4964M4976o246n6786
390c4958L8297K3993o2273K7139M0208m9976P63L9108k9248l0510K7990p71m2661
$$ plain form
305 -45239 15614 -6383 -41824 739 26994 -14694 -6916 55508 12078 -14356 55107 23702
317 23702 -28235 25267 21994 -38216 -10768 20414 -25345 -36721 24181 1690 -50772 20615
329 20615 20427 -57000 1265 27310 -54711 -24149 22892 -41388 -47522 8072 -19000 -62206 -3706
342 -3706 10346 -52526 -3632 41136 -25723 -3604 53636 -4126 -11990 37858 10199 -21258
354 -21258 10378 23758 -22682 -10617 34121 -9606 -21582 41221 13981 -18221 39928 33848
366 33848 -10495 17076 36429 -10347 -17316 30061 -1262 -32454 33634 31126 -19698 43899
378 43899 61421 -109 37096 67103 12416 11341 53597 18062 -16902 28074 21828 -34958
390 -34958 3339 27332 -34941 -7802 32406 -17570 -16807 22301 -6947 -37457 -9467 -10238 -52899
403e2899J4638L4395l9964J320N5159k8803j6168N1306p644l2402L3180J5262
415B7380l8114M515L4016l4694k6496M9179k1722m2616N2082K292m6428L7284
427c322K1578m6490Q832L0806l4215k2645L9727j0352m2619M2710J3313m6332
439d9009L0876L1647l8108J2807M1662j9622r284L5080K366l4148J8475J9418
451D2160m4250K681L4609l2639j1090M3300j5160k3967K9579L688l4914O066K4075
464B4138l7404j3487L7692k6700l0899M2823q971l8375L8019J2333l1904J9066
476a3669L0538k4974r190L6251j7867l3029L2924l05m2213K7926J8040l7238J3087
489a9719K6161k3869j1016K7815o800k7963K1351J2783l6206Q444K7543l4925
$$ plain form
403 -52899 -38261 -3866 -43830 -42510 12649 -16154 -32322 18984 11340 -21062 12118 27380
415 27380 -10734 -6219 27797 -6897 -33393 15786 -5936 -48552 3530 5822 -40606 -3322
427 -3322 18256 -28234 -19402 11404 -22811 -45456 -5729 -16081 -58700 -15990 -2677 -49009
439 -49009 -18133 13514 -24594 -11787 29875 10253 969 36049 38415 4267 22742 42160
451 42160 -2090 591 35200 2561 -8529 34771 19611 -4356 25223 28911 -6003 63 24138
464 24138 -13266 -26753 10939 -15761 -46660 -3837 -12808 -51183 -13164 -831 -32735 -13669
476 -13669 16869 -8105 -17295 18956 1089 -31940 984 679 -41534 -13608 4432 -32806 -19719
489 -19719 6442 -17427 -28443 -628 -7428 -35391 -14040 -1257 -37463 -29019 -1476 -36401
501c6401l395L3982j6597j3030L4219P791k1447K2369K4724k6101Q98L6956k3859
514B0109j5696M2061j2580k5097L2995M342l1390J6332J9433k7001k183L0673
526E1998j5511k1582L3099o966l5077K3299L760l5162R658J9043k3686k152K6118
539B6839o555j8124K4704Q872l0064J6015J9558l0556L13K4341k4103j5490K3226
552A8976q416k3545J6999J4766k7170O703K7917k7115j0988K8575k1499k5656
564c0453K5022o787k6997J7178J3896k1765L869K9754j4935r169L3640n280k1348
577a3375K7470M179k7882J4300J2241k1990q09K2259q157j2199K6442M210k2598
590D091J6942J3010l0285K431J7627k5139r121J9556q552j9528J8049Q205k4086
$$ plain form
501 -36401 -39796 -5814 -22411 -35441 -1222 6569 -14878 7491 32215 6114 7012 43968 20109
514 20109 4413 46474 33894 8797 41792 46134 14744 31076 50509 23508 21325 51998
526 51998 36487 14905 48004 41038 5961 29260 33020 -2142 7516 26559 2873 721 26839
539 26839 20284 2160 26864 35736 5672 21687 41245 10689 11002 35343 11240 -4250 18976
552 18976 10560 -12985 4014 18780 -8390 -1687 26230 -885 -11873 16702 -4797 -30453
564 -30453 -5431 -12218 -39215 -22037 -8141 -29906 -26037 3717 -11218 -20387 13253 7973 -13375
577 -13375 14095 18274 -9608 4692 16933 -5057 -5866 16393 8236 -3963 22479 26689 4091
590 4091 21033 34043 3758 6189 23816 -1323 -10444 9112 560 -18968 -919 7286 -16800
603a6800R662K1772k3674j994K8368j8608j3042K4294p791k0937J5963P779k2132
616a7140O365K0821j6906o909K7228j0670j7578K3807k246k1534J3983R731j9841
629a0889Q90J7126j2594j1459J9464r25k0191J9120R846k1253J1467J7559j7505
642F56j880J9888r815j3202J5528L014k1609J0020J4817k3307L050K1963j6999
655B124o062K3188p237j5050J6159J850k0777L673J2753k1086m949K1312j2556
668f658j0083K2854q06j4378J6576P100j6642L576J2501j3712r833J6305o261
681E39j6402J6494N105j7469J2548J3941j6068L276J5378r890j0996J3414k535
694G335k0108R911P857k0281N346J7891j5997p61K0619q524r375J4798Q45j7351
$$ plain form
603 -16800 -7138 14634 -9040 -11034 17334 -1274 -14316 9978 2187 -18750 -2787 4992 -17140
616 -17140 -10775 10046 -6860 -13769 13459 2789 -14789 9018 6772 -14762 -779 8952 -10889
629 -10889 -9999 7127 -5467 -16926 2538 1613 -18578 542 10388 -10865 602 18161 656
642 656 -1224 18664 8849 -4353 11175 14189 -7420 2600 17417 -5890 -2840 19123 2124
655 2124 -3938 19250 12013 -3037 13122 14972 -5805 -2132 10621 -10465 -15414 5898 -6658
668 -6658 -16741 6113 5307 -9071 7505 14605 -2037 1539 14040 328 -9505 6800 539
681 539 -15863 631 5736 -11733 815 14756 -1312 1964 17342 7452 -3544 9870 7335
694 7335 -12773 -2862 4995 -15286 -9940 7951 -8046 -8807 11812 3288 -6087 8711 9556 -7795
708g795P049Q962j8591j090J6497j2797p501K0216n133j0418J4994L853j3609
721e363N480J0666j3304m250J4237p348j2690J5250O13j5255J2039P430j3484
734e979L906J3346r873n828J3806k685j3792J1096N168j8529P297J1120j6711
747g658M24J4341r782o831J4712q27j1580R782Q374j4766K530J3471j4042m068
761e920J4037p885r177J2748J150j1602Q457Q447j0493m5J3656q246q415J3590
775A0302l954j3879Q703K719j4837M460R072r689j762J3733k556r016J3077J789
789H162j4738P321O021j4752J020J0512j0189l162J2254j521q759J0600N843j2599
803c987N764R556j3192k405J1479j1070p863J0424k782r441P736O912r647K940
$$ plain form
708 -7795 -746 8216 -10375 -11465 5032 -7765 -15266 4950 -183 -10601 4393 8246 -5363
721 -5363 117 10783 -2521 -6771 7466 118 -12572 2678 3291 -11964 75 7505 -5979
734 -5979 -2073 11273 1400 -4428 9378 6693 -7099 3997 9165 -9364 -2067 9053 -7658
747 -7658 -7234 7107 -2675 -9506 5206 4379 -7201 2581 10955 -3811 -1281 12190 -1852 -5920
761 -5920 8117 232 -8945 3803 4953 -6649 1808 10255 -238 -283 13373 5127 -3288 10302
775 10302 6348 -7531 1172 3891 -10946 -6486 2586 -7103 -8865 4868 2312 -6704 6373 8162
789 8162 -6576 745 6766 -7986 -6966 3546 -6643 -9805 2449 928 -7831 2769 8612 -3987
803 -3987 1777 11333 -1859 -4264 7215 -3855 -11718 -1294 -4076 -13517 -5781 1131 -8516 -5576
817e576J2118q198m195J2630m511j0137J0787R83j0913O226P244q168P6J1931
831A0297m446n690J2226N05j1254R223L851j3749L155O139j1209l418R128n329
845e71q110R408J492j1186N782O817j2622J028R716r020l487R777l242p980P852
860d346K795q869L635R459p158r61J2996n287m960J0303q12r314N715L821r854
875b837O99P792o376n297J0681k894q816R960K261r940N447O491r505l66P597
890D897o218o177Q041N2r605Q335N066q523M083Q424p560j789Q272n040o108N886
906B036K47r608K866N431r619o91Q796n868l826R687k417o677O596J346q471P70
922i402N982p763k721R273l231n516R949J595p848P341M294p287J647O780n105
$$ plain form
817 -5576 6542 -1656 -5851 6779 2268 -7869 2918 3901 -7012 -786 6458 -1710 -1634 10297
831 10297 5851 161 12387 12892 1638 10861 14712 963 4118 10257 -952 -4370 4758 -571
845 -571 -8681 727 2219 -8967 -3185 3632 -8990 -7962 1754 -7266 -10753 -976 -4218 -12198 -4346
860 -4346 -1551 -10420 -6785 2674 -4484 -5445 7551 2264 -2696 7607 6795 -2519 3196 7017 -2837
875 -2837 -2138 5654 -722 -6019 4662 1768 -7048 2912 5173 -4767 680 7171 -2334 -2700 4897
890 4897 -1321 -7498 543 595 -9010 -675 4391 -4132 -49 8375 815 -974 7298 2258 -3850 2036
906 2036 2283 -7325 -4459 972 -8647 -9338 -542 -6410 -10236 -549 -2966 -9643 -3047 -1701 -10172 -9402
922 -9402 -3420 -11183 -13904 -4631 -7862 -13378 -3429 -1834 -9682 -2341 1953 -5334 -3687 3093 -2012
937b012m111P575k325p498O269K497q319M428O376o732J190P226l626l806O431
952C563n66p145M322L804p035Q84Q087o053j278Q515k541l963O822J841o412L421
968F266M615p306j879O306n166n799P446k306o208N499K313o551K267M957n704
983a250k180N573k881n913O152M07p654M383L746o280J289O545l712j430O766
998C561p36m627M403K534p857J688M574o868q41N948l638l424O126pm958L238
1014h84L772o190l6N808n089l576N993k510n252N866R02n163L858M530l946L37
1030a580O484l079l444O171p93n867L938K370o616K576L955l948p67N093j088
1045C405m020M918J392n465K262L133o401m5M168m496k170M607q80m022L798K977
$$ plain form
937 -2012 -6123 1452 -873 -8371 -2102 395 -7924 -3496 2880 -3852 -2662 4564 938 -2868 3563
952 3563 2997 -4148 174 3978 -3057 -2173 5914 -139 -1417 7098 4557 594 7416 9257 2845 6266
968 6266 10881 3575 1696 8002 2836 -2963 4483 2177 -4031 1468 3781 -2770 -503 4454 -1250
983 -1250 -3430 2143 -738 -6651 -499 -92 -7746 -3363 383 -5897 -4608 1937 -1775 -3205 3561
998 3561 2825 -1802 2601 5135 -2722 -1034 3540 -3328 -4169 1779 -1859 -5283 843 836 -4122 -884
1014 -884 2888 -3302 -3338 2470 -2619 -6195 -202 -2712 -7964 -2098 -1196 -6359 -2501 2029 -1917 -1580
1030 -1580 4904 1825 -1619 4552 3759 -2108 1830 4200 -2416 160 4115 167 -600 4493 3405
1045 3405 -615 4303 5695 230 2492 5625 -776 -821 3347 -1149 -3319 1288 408 -3614 184 3161
1061C161n162J665M642m681j812N711m018l464M269m82m823K546K752m711O59
1076c748M959k895k064N469j177m461M524K41n206K156K349m223k39M124k018
1091b209k162M593P10m163L715K515m640R45L636m162j478M138j879l305L437
1106c09J147l665K507M034m434R52M321k762k461M172r74m020K489J139m005R85
1122h84L541l296r90N095j667l131M386K66m324K422J606m368l2K777k541k406
1138c546M341o99l227L929J909l822J909L078l868q8L226k040k653K520M42m062
1154b651K463K311l570N59L991l117q11L954j822k875K063P30m205Q21K501l393
1170c051n98L926j888j901M567l07k863L303J099k955L77K644k606p82K802j088
$$ plain form
1061 3161 -2001 -336 4306 -375 -2187 3524 -494 -3958 311 -171 -4994 -2448 304 -4407 -3748
1076 -3748 1211 -1684 -3748 1721 544 -3917 607 848 -4358 -2202 147 -4076 -4315 -191 -2209
1091 -2209 -4371 222 932 -3231 484 2999 -1641 -696 2940 -1222 -2700 1438 -441 -3746 -309
1106 -309 838 -2827 -320 3714 -720 232 4553 1791 -670 3502 2528 -1492 997 2136 -1869 -884
1122 -884 2657 -639 -1629 3466 1799 -1332 3054 3320 -1004 1418 3024 -1344 -1376 1401 -1140 -3546
1138 -3546 795 96 -3131 798 2707 -1115 794 3872 4 -84 3142 1102 -1551 969 1411 -2651
1154 -2651 -188 2123 -1447 -888 3103 -14 -825 3129 1307 -1568 495 1225 -2980 -2159 342 -3051
1170 -3051 -3649 277 -1611 -3512 1055 748 -2115 1188 2287 -668 -291 2353 -253 -1035 1767 679
1186F79k867L098R12l238K316J986l055M85K579j965k058K595r06l139J653J424
1202D99l617J196K586k697p8L164o13j724L024J40k647J595J674k983r8K940k375
1219a4j317K915l94k277K557R10l141J385J974k578j272K451j543k908K592o07
1235a267k738J820J846l071J303K488j521r40L493k69k395K359M37k779J333J726
1251A825k431Q2K589j804j64K524lj950J590J213l069j08J964k310j457K560j455
1268d04j859K204O83k038J346J804j781J34K398j428j394K300n50k444K033N72
1284A576j988Q92J813j380p00K707j334j572J944j91k767J003P05k672J15J858
1300Ik129p17J991m83j564K111P16j874O15K122k342k64K425j758o35J507K70
$$ plain form
1186 679 -2188 910 1822 -1416 900 2886 -169 316 2895 930 -1128 1467 561 -2578 -925 499
1202 499 -3118 -1922 664 -2033 -2111 1053 440 -1284 1740 1880 -767 828 2502 -481 -579 2361 -14
1219 -14 -1331 1584 1190 -1087 1470 2380 -761 624 2598 20 -1252 1199 -344 -3252 -660 -1267
1235 -1267 -4005 -2185 -339 -3410 -2107 381 -1140 -2080 1413 1144 -1251 1108 1545 -1234 99 1825
1251 1825 -606 -524 2065 261 97 2621 2618 668 2258 3471 402 294 2258 -52 -1509 1051 -404
1268 -404 -2263 -59 624 -1414 -68 1736 -45 89 2487 1059 -335 1965 1415 -1029 1004 1576
1284 1576 -412 480 2293 913 213 2920 1586 14 1958 1767 -1000 3 708 -1964 -1849 9
1300 9 -2120 -2837 -846 -1329 -2893 -782 -66 -1940 -1325 797 -1545 -1809 616 -1142 -1777 -270 0
1317@j547J467Q32j009J63K011j338j072J936q89j568J498j52k258O38J048j952
1334b192Q7J807o78j176K058L01j866J845P96j889O33J780j941j91J589m19j113
1351e69J640N28j588J216J340j655J23J682j644q77J402j119j503P88K39j964
1367a961O56J262j511J85J847r05j201J908k04j516R29O80j812j76J943j159n24
1384a559K034j01r54J848L68j486R89P80j420n05Q43q30j106J443j44j287J399
1401C12P19j255O34J108r61l69J066n53j190J101L3j364O44J093j007J38J507
1418A656j102l00J760p98r92P89L71j695M26N60r65o90J472o54r24J253J16j234
1436i51R06O81j655N12R12j234m73J092k87j085J002M97j481P97P45j045L58J199
$$ plain form
1317 0 -1547 -80 752 -257 -94 1917 579 -493 1443 554 -1014 484 332 -1926 -1288 -240 -2192
1334 -2192 -2105 -298 -976 -2152 -94 207 -1659 186 982 -907 -274 1506 -435 -626 963 544 -569
1351 -569 1071 1599 11 1227 2567 912 1035 2717 1073 196 1598 479 -1024 -236 3 -1961
1367 -1961 -1305 -43 -1554 -1369 478 -427 -1628 280 76 -1440 -511 169 -1643 -1819 124 -1035 -1559
1384 -1559 475 374 -580 1268 1636 150 1139 1919 499 -6 837 7 -1099 344 200 -1087 312
1401 312 1031 -224 410 1518 557 188 1254 701 -489 612 645 -719 -75 1018 11 149 1656
1418 1656 554 254 2014 1216 224 1013 1384 -311 115 675 -290 -980 492 -162 -1086 167 283 -951
1436 -951 -45 636 -1019 -507 405 -829 -1302 -210 -497 -1582 -580 -83 -1564 -767 -22 -1067 -709 490
1454D90m95n24O89m8q48M16P08j499K30Q94j013k20J375l93n56J051M2n51K57
1473ER88j088m3J185j290q95J240k76r13R80O96r06O73O88p45rR66o45o10M06
1493D07n84o75M51O77r84L40J045m97P2R15j03j189P69L58j086k87J009j657M2
1512i77R47n90Q5N26N30r45Q52N88j241J96N92o06n47P05l10o54O03K38k89K77
1532b0R13p56j17Q30l56n19Q40j90j094O31J05o88Q4O07o27l63Q08k72l36O14
1552I4l9p26M37K62p65M13K81q7m82N27N6m13Q88J77o62M15L89k34j37O88m14
1573F68n43N81o6p56J45K36l32k63M98l36l31Q11k55o21O15j88m99Q8L31n38j02
1594h57P09l73n7O37J08k79O24L93l53j36N54n23k21L86n52m40L52M4m07M40K41
$$ plain form
1454 490 -5 -529 160 112 -736 -320 388 -1111 -881 13 -1000 -1220 155 -238 -794 257 299 -252 5
1473 5 993 -95 -138 1047 -243 -1138 102 -174 -1087 -107 589 -317 356 1044 299 290 1256 611 1 407
1493 407 -177 -852 -401 276 -708 -368 677 180 252 1167 1064 -125 644 1002 -84 -371 638 -1019 -977
1512 -977 -30 -620 -535 -9 521 -424 428 1016 -225 -29 563 -43 -590 115 -195 -849 -246 -8 -297 -20
1532 -20 893 137 20 850 494 -25 815 625 -469 162 267 -421 -337 270 -357 -720 88 -184 -520 94
1552 94 55 -671 -234 28 -737 -324 -43 -130 -612 -85 -29 -442 446 623 -39 376 765 531 394 1082 668
1573 668 125 706 640 -116 29 265 -67 -330 168 -168 -499 312 57 -564 51 -137 -636 -548 -217 -755 -857
1594 -857 -148 -521 -578 59 167 -112 512 905 552 416 970 447 226 612 60 -380 -28 16 -391 49 290
1615B90m44k00O24n44j67K90m12p02L59N39o46K15N64n34M83O29k62k24O06L50
1635H14m03N04L38j116L31K32r49Q6L36M02p93P88o6p71O42k61l71m05O40j28
1655a50p21M16M3o13K98P33k88J36N41j68m78O39K33m13M28j51m63L37K37m34
1675A62k17K60j47l08N06l72k22L74k21k01k24L35n05m49N70p2j72J34K41j09
1695f37J82L51j42K05L54M7j39R7M51n28M88N9q09N56M01m49l77N07j8m83L58
1716D74J42n72q9J78n16J42k5m1n72M49J83k57L82K85n2L36J49j56j40K60k30
1737C30L0m0K83o43N43j11j94K37J91j84m86K97l44j85J34R2n84P6K97m33J76
1758e18M2q1K61J34J52r5J55K74m45J7L78k83N9j14K4j7J70j17J91J09j15P8k54
$$ plain form
1615 290 -154 -354 270 -274 -441 -151 -563 -1265 -906 -367 -1013 -798 -234 -768 -285 344 82 -142 464 814
1635 814 411 915 1253 137 468 700 -249 -163 173 575 -218 570 504 -267 375 114 -257 -662 -22 -150
1655 -150 -871 -455 -412 -1025 -727 6 -282 -146 395 227 -251 388 621 208 636 485 22 359 596 162
1675 162 -55 205 58 -250 256 -116 -338 36 -185 -386 -610 -275 -780 -1229 -659 -731 -903 -769 -528 -637
1695 -637 -455 -104 -246 -41 313 360 221 318 769 241 729 788 -21 535 936 487 110 617 599 116 474
1716 474 616 44 -45 133 -383 -241 -266 -307 -879 -430 -247 -504 -122 163 111 447 596 440 300 560 330
1737 330 360 320 603 -40 503 392 198 435 626 442 -44 253 -91 -276 -142 -50 -634 -558 -261 -694 -518
1758 -518 -476 -557 -296 -162 -10 -105 50 324 -121 -104 274 -9 50 -64 -40 -57 113 -4 187 296 181 259 5
1781EJ29m42k06L78j07k12l2km13K55K49j22J37J52J2k31K63L0l8P5J08j17j79
1804c08M33k34l9J97Jk47J44K43k72k11L00r9k80J56q2l04K51o9o9J72j7k5l2
1827c91K87j1q0M37j79j47L29k92J9K10j03q2J35M49m21l6J91k1N1j9L11m31O
1850B12M0Q6m84L03l1J5RK49j98L9J1k15K32J79k88n4k09K66j64p9Q9r1o6J18
1874c1Q7j61J68l28J04J73j55j01j43J30j38K00k65L2j72J56J21j38J50K85n8
1895h4k21K12l77J10j02L46n76L64R2k56L1M39l14J53J37k36k4M40k24k39L67
1916C8j23rl38N85k90j69J15M91j52J37kl02j9J69p6l4j42k08N5M23l02J19k1
1939e5K40l47K2J45k6k7j1j41K7O53m26j24j14J04j16M56J2j96jK23l8j65njj50
$$ plain form
1781 5 134 -308 -514 -136 -243 -455 -487 -489 -902 -647 -398 -520 -383 -231 -219 -450 -187 -157 -195 -120 -12 -129 -308
1804 -308 125 -109 -148 49 50 -197 -53 190 -82 -293 7 -92 -372 -216 -298 -602 -351 -420 -489 -317 -334 -359 -391
1827 -391 -104 -115 -195 242 63 -84 245 -47 -28 182 79 -3 132 581 160 124 315 294 345 326 637 206 212
1850 212 252 338 -146 157 126 141 150 399 201 240 251 36 268 447 159 105 -104 162 -2 -81 8 -83 -149 -31
1874 -31 56 -105 63 -265 -161 12 -143 -244 -387 -257 -395 -195 -460 -428 -600 -444 -323 -461 -311 -26 -84
1895 -84 -305 -93 -470 -360 -462 -116 -692 -328 -236 -492 -461 -22 -336 -183 -46 -282 -306 134 -90 -329 38
1916 38 -85 -94 -432 153 -137 -306 -191 300 148 285 283 -19 -38 131 55 21 -121 -329 -274 149 -153 -34 -55
1939 -55 185 -162 -140 5 -21 -48 -59 -200 -173 480 54 -70 -184 -80 -196 260 272 76 75 298 260 95 90 89 -61
1964f1L2J38j93m0l5j75K69p1P6j32R5M28m67L2K14k19J27L83j75l2j42L6J94
1987B82O2k24J55j1J40j04k0l6l35J70j55kJ15O8n0M9L2k80k0N4JJ24k65L84r9
2012C5l22K32K26k92K32J84q0k60J70J28j21r1J76k7PJ38j50l99J43k89J69K34
2034D3k66J15J56K23k00j53J7j64M43l03O5k56K62j7o1p3J94m64N71j96J19K92
2056C47l02k1K97r0K69l33j15L84m28l9K2j55n8L55m00R7j51M67j69j58K74J21
2078B14j83J37n6r1k61L21k5M0N9p1N2J45n7K42j58k12P8q1L5j41J32l41q8J55
2102a55J27p1J62J08m1m76O39m40L91o2r1k35l71R19m52j48M04J2m64j05Q07m10
2124D8j29M76n94L20m82L57N8M76r82L03k0P3P0j50Q6J7O6k50J26J98m1k26L33
$$ plain form
1964 -61 -29 109 -84 -124 -159 -334 -65 -136 -60 -192 -97 331 -136 -104 110 -109 18 401 226 194 52 88 282
1987 282 344 120 275 264 404 300 280 244 -91 79 -76 -78 37 105 55 104 136 -144 -164 -110 -109 15 -250 134 35
2012 35 -287 -55 171 -121 111 295 215 -45 125 253 132 41 217 190 197 335 185 -214 -71 -360 -191 43
2034 43 -223 -108 48 271 71 -82 -65 -229 214 -89 -24 -280 -18 -35 -96 -169 25 -439 132 -64 55 347
2056 347 45 24 321 231 500 167 52 436 8 -31 -9 -164 -222 133 -267 -170 -321 146 -23 -181 93 214
2078 214 31 168 112 21 -240 81 56 96 155 84 136 281 224 466 308 96 174 93 128 -13 119 -222 -310 -155
2102 -155 -28 -99 63 171 130 -346 293 -147 244 182 91 -144 -515 404 -48 -196 208 220 -244 -349 458 48
2124 48 -81 395 -199 121 -361 -4 54 530 -452 -149 -169 -96 -26 -176 -90 -73 -7 -257 -131 67 26 -200 133
2147A33l97J96j61K09L80l22J46K1J19l00O6m0p5J56qj95n3K67k09L25k22j24
2169h8Q0N3j23J10K57l37m9N5J44J38m76J65K01j1j23K08m0l7J81j81M4R1k03
2192E9j49k03K78N0r5J72j21l4m3j86M16j62m2O6J1J24k34J63jj04J86k73J58
2215C6P7J52j50J06k89L02P1j21j57j13K77q5N9k74J17j9m0K42O3k69M4j52K27
2238A04k45kJ21k53K38R4j48O4m2j24L17k03n4K39j51J37p3n2p4J58r4l7M6K92
2262B58j4k3k19O1j35J18j77K19j66J17n2j22O1k51K00J98k87j2J11N3q0J35l1
2285c8j68K06M9j05L1m8m0p3L15l36K24J0p5J41o9P3J5O0Nj97PJ92n2Ro5K9K9
2312A29k15J60Jj14l4K7K10k50J4j69J41R6j07k3J98j54o5O4j2L9l18L25j33K10
$$ plain form
2147 133 -264 -68 -229 -20 360 38 184 205 324 24 90 50 -25 131 123 -72 -125 142 -67 258 36 -88
2169 -88 -8 45 -78 32 289 -48 -97 -42 102 240 -236 -71 130 119 -4 204 164 127 308 127 171 262 59
2192 59 -90 -293 -15 35 -60 112 -9 -43 -86 -272 144 -18 -60 6 17 141 -93 70 69 -35 151 -122 36
2215 36 113 265 115 221 -68 234 305 184 27 -86 191 106 165 -109 8 -11 -51 191 254 -15 29 -123 104
2238 104 -141 -143 -22 -275 -37 57 -91 -27 -69 -193 124 -79 -133 106 -45 92 19 -33 -107 51 -43 -80 -34 258
2262 258 244 221 2 63 -72 46 -131 88 -78 39 -13 -135 -74 -325 -125 73 -214 -226 -115 -62 -142 -7 -38
2285 -38 -206 0 49 -56 -25 -73 -113 -186 129 -207 17 27 -48 93 24 97 112 172 177 -20 -13 179 127 136 71 100 129
2312 129 -86 74 75 -39 -73 -46 164 -86 -72 -241 -100 -4 -111 -134 64 -90 -155 -91 -103 -64 -382 -57 -190 20
2336B0J50m58J78j04J4j26J42r9M00j71j64Q6K8L37l30l8J54k48J0L3O5J09j1
2359b3p0R8Kj11j68K63k36L66o5L5j11j9j03M0J76j72M0L3k4m4K4L2O0J53j62
2384A4K29k86jMl27Q6J64K2o7L92q4k77M0q4K45P3l64M16n4l75M19k39q7O3O3
2409a5j73M75l08l5K41l61K67k3j34r5K50J03l49K62j02o1j61L22j95J59l14L03
2431E6j25M17j45l26K19j01P9K10m9l58J67j70J45q8J89Mk37J26O1r0P9j91k9
2454a57K91k68J55M2j9p9P0K6l1o6q5J81j39K8K6j18M0qJ13j36j21K19J53j82
2478f5N0Q1j19M3k6o0J47j06n7j8k04L81j22K32l51L10j71M5k23J53J71p1J9J70
2502B09k93Q6j03K37k48j37J76J88j06NJ74j65j79J28J77k85j9J49Mn9R0O3k9
$$ plain form
2336 20 170 -288 -110 -214 -200 -326 -184 -283 117 -54 -218 -132 -104 233 -97 -135 19 -229 -219 -186 -121 -12 -23
2359 -23 -93 5 7 -104 -272 -9 -245 121 56 91 -20 -39 -142 -102 74 -98 -58 -25 -49 -93 -69 -37 23 176 14
2384 14 243 -43 -44 -40 -367 -281 -117 -95 -162 230 146 -131 -91 -175 70 143 -221 195 141 -234 185 -54 -141 -78 -15
2409 -15 -188 287 -21 -56 185 -176 91 68 -66 -161 89 192 -157 105 3 -58 -219 103 -92 67 -247 56
2431 56 -69 348 203 -123 96 -5 74 284 235 -123 44 -126 19 -69 120 124 -113 13 74 -16 63 -128 -157
2454 -157 134 -134 21 63 44 -35 35 61 30 -36 -121 60 -79 -51 -25 -143 -103 -111 2 -134 -255 -36 117 -65
2478 -65 -15 66 -53 -10 -36 -96 51 -55 -112 -130 -334 47 -75 157 -194 116 -55 -10 -233 -80 91 20 39 209
2502 209 -84 2 -101 136 -112 -249 -73 115 9 14 188 23 -156 -28 149 -136 -155 -6 -2 -61 29 92 63
2525F3k59J80q6P5R6j00J47J02k12O2r0J3m1K18j38K0j19J31l15Q8O0k4p0Q1J
2550a17J83l83K60J22j36J04o5J15p4j52Q8J3j68L08j14J81l66J91j42L29j93
2571a6L3Q7qk02j25M10j71k9o3k6J16J70k90L0L3K5J57k45K22j20K6m6O8j11k4
2596i9L33j82J8k23Q0j6M40j56k50j1J63J68k40j11j07J44P5k59L49j49m6J20
2618D1j32j1j60R6J55j4kR4J4l69L97m9J8j19J49P3k88J79l3jn2j6M6J51o8j27
2644b8o9K12j0l0j14N6J80o5j13q3J61J7k21J37K8l0j53m9J55K37n84M82r2L3
2668E7j22Q2L1R7j39K04N7l69K85q95P05j53J18J26o5j3O70m79n72J57J6J00M6
2691e6L72l42J71K0j30P9R8j05J37k13k5J86j49J9K92j86n9j42k9K0NJ97j40m2
$$ plain form
2525 63 -196 -16 -102 -27 69 -31 116 218 6 68 -22 -9 -50 168 30 50 -69 62 -253 -165 -105 -129 -199 -118 -117
2550 -117 66 -317 -57 65 -71 33 -32 83 9 -143 -55 -42 -210 98 -16 165 -201 -10 -152 177 -16
2571 -16 17 104 96 -106 -231 179 8 -21 -84 -110 6 176 -114 -84 -51 -26 131 -114 108 -12 14 -32 36 -75 -99
2596 -99 234 52 70 -153 -73 -89 351 195 -55 -66 97 265 25 -86 -193 -49 26 -233 116 -33 -79 41
2618 41 -91 -102 -262 -166 -11 -25 -27 67 81 -288 109 60 78 -41 108 181 -107 72 39 38 -14 -30 16 167 99 -28
2644 -28 -97 115 105 75 -39 17 197 132 19 -64 97 114 -107 30 58 28 -125 -174 -19 218 -366 116 24 57
2668 57 -65 17 48 145 6 210 267 -102 183 -712 -7 -160 -42 84 19 6 676 197 -375 -218 -202 -102 -56
2691 -56 316 -26 145 165 35 114 212 107 244 31 6 192 43 62 354 168 109 -33 -62 -42 -37 160 20 -22
2715b2N0J11k18O5j2r7j47J07J06OJ37J05k80j44M26k67J04o5J03q5o0K87j61
2738D9P8J03j49j4k6ON5M5k72j2L10j97J93j5J0j15L2KJ36l59K62r6P3q7J96k00
2764Hm5j4R9j2j72J10%K38j88p2J09j40P9J07j71P3J4N8j45k44L01KN7jj65Q4
2790c0J01k10lN0Q5o9K8lj02M0L37l32J37q2J42j67J51m3k0K56k21j41J71J00
2814A75n18N64j51j05k5K66k32l0J32N7q4K2K0j8l18J04J88Oj01J39k3k75J37
2837g0k3j11K20k84K63o9J28j51J65k61j7R4Q2Oo3Q0m0JJ25j62J70m41M18p4K30
2862B16p4l2J5M0J16k56Nj72J80k8qj04J38KR9l9j92K05p3k24j3J11R5rK4j12
2888i0J79q9K16j33n8J72q3j32K26k63J93k65J42k14J98J79P9l9p7p4k62K74J66
$$ plain form
2715 -22 28 139 -79 -14 -26 -123 -270 -163 -57 -51 86 191 -89 -233 193 -74 30 -35 68 -17 -77 210 49
2738 49 127 230 81 67 41 47 102 147 -125 -137 173 -24 169 154 164 49 81 83 219 -140 122 26 99 12 208 8
2764 8 -37 -51 48 36 -136 -26 -26 212 24 -48 61 -79 0 107 -64 9 23 81 -64 -308 -7 -5 52 51 -114 -30
2790 -30 71 -139 -142 -92 -7 -76 -48 -51 -153 -113 224 -108 29 -53 89 -78 73 30 10 266 45 -96 75 175
2814 175 -343 221 70 -35 -60 206 -26 -56 76 133 49 71 91 73 -245 -141 47 53 -48 91 68 -207 -70
2837 -70 -93 -204 16 -268 -5 -74 54 -97 68 -193 -210 -116 -34 -28 -91 -11 -51 -50 75 -87 83 -358 60 -14 216
2862 216 142 110 125 165 281 25 30 -142 38 10 2 -102 36 38 137 98 -94 111 38 -186 -199 -88 7 -2 22 -90
2888 -90 89 0 216 83 25 197 114 -18 208 -55 138 -127 15 -199 -1 178 257 218 141 67 -195 79 245
2911B45j29Ql3j33J53k3R0r0L2j34Q0l9j19k7K47k43r3J68r8j43J25J63j22J63
2935D8l11L74j18L05m16Q1r0L5L19k61M29m12J3j79K33j11J87j44m4K2j50L06
2957A16k01K5M6m9O0Q6mp3K08k56k67J87K02Q8j10n4j8K1k02L56o6K9j94P0j55
2982a55J38J32j61N9J08j82J22k20K10J26j29n1JR6q9M8M3j97N3q4P1k3L72l52
3006f4k2M6M3O9k52K62j68m0Jm6J28Nj42K10j53J01O5j09J89J80m38K29j62L41
3030B73m83J45J50n2K5j67j2L23k41K12l2k15O9J6J51k13q1L37k13k0K76k79j
3053c2k08L40k55N54l98j08J58K1R1k29L7J04j62n9J89l38M82l32K53MK2j25j14
3076a05O2J68Nk12J6K08j27O3l4RJ37k24Q9j20qj19J94r2L61k70M4k81L61M1l27
$$ plain form
2911 245 116 124 91 -42 111 88 178 88 120 -14 66 27 -92 -119 128 -115 -208 -40 -138 -281 -156 7 -115 48
2935 48 -263 111 -7 298 -118 -37 -127 -92 227 -34 395 -17 -4 -183 50 -61 126 -18 -62 -40 -190 116
2957 116 -85 -60 -14 -63 -3 83 79 6 214 -42 -309 -122 80 168 58 4 -14 7 -195 161 95 124 -70 0 -155
2982 -155 -17 115 -46 13 121 -61 61 -159 51 177 48 -3 -2 94 5 53 96 -101 -48 -132 -61 -84 288 -64
3006 -64 -86 -40 3 72 -180 82 -86 -126 -125 -171 -43 -38 -180 30 -123 -22 43 -66 123 303 -135 94 -68 273
3030 273 -210 -65 85 33 58 -109 -121 202 -39 173 141 -74 -5 11 162 -51 -132 205 -8 -28 248 -31 -32
3053 -32 -240 100 -155 399 1 -107 51 72 163 -66 -29 75 -87 -146 43 -295 187 -145 108 112 134 9 -105
3076 -105 -43 125 130 -82 -66 142 15 78 44 53 190 -34 55 -65 -73 -192 2 -90 271 1 45 -236 125 166 -161
3101a61K40j98J70r2K05r9J21j80j72K53K6O3j69J84l84J81l7R0j71K61j74j26
3123a69K38J29k97j39L10j55K32Kj29N4j68j6K39j91j42R3J4J1N9J12P0j93o1
3146i7L17k31p8kP6O0M0o9L6k38L07p6k2m2l0J38k17J65j49J32J8n9o6rR6L07
3172C07l06oP4k06J79J0j72J65n6j84J93j69L42m23K71k26O7J39m8O4M1j02Lk
3196d5rR4N2J8n3O8j74J8o6N4Q2lM50m23m4J24j6j99L0O4k07K07J88j96P0Pn0
3223D1l2Q7rj88j95J28j18L06q2J50N2k22J10K32l30M0j91K29J15O0k11J87j99
3246d0J44J3k06K51J13k00k37K75j05L9j76K02j27J08k05J41R3n3l53K78P8J30
3268A63J44k19M2j98l9K32j26j43N7K44r9J6K00k20j84L34l91Q6J48l6j72J32
$$ plain form
3101 -161 79 -119 51 -41 164 65 186 6 -166 87 113 176 7 191 -193 -12 -49 41 -130 131 -43 -169
3123 -169 69 198 -99 -238 72 -83 149 151 22 76 -92 -108 131 -60 -202 -109 -95 -84 -25 87 157 -36 -97
3146 -97 220 -11 -89 -91 -15 45 85 16 52 -186 121 45 23 -19 -49 89 -128 37 -112 20 38 -21 -87 -96 0 307
3172 307 1 -5 69 -137 42 52 -120 45 -11 -195 -2 -171 171 -252 19 -207 -140 -1 -49 15 56 -46 -43 -45
3196 -45 -54 40 92 110 57 125 -49 -31 -97 -43 39 36 486 63 19 143 127 -72 -42 22 -185 22 210 14 84 91 41
3223 41 9 96 87 -101 -296 -168 -286 20 -62 88 140 -82 28 260 -70 -30 -221 8 123 183 -28 159 -40
3246 -40 104 117 -89 162 275 75 -162 113 8 47 -129 73 -54 54 -151 -10 83 30 -323 -45 33 163
3268 163 307 88 130 -68 -107 125 -1 -144 -87 157 58 74 274 54 -130 204 -187 -101 47 11 -161 -29
3290b9J48K6J45k86M3Q7k4J69m26N9R2J4j24K60l92L08j08K9K00k10n6k0K72k39
3314f2J63O1j22q7L2j53K03p2O5j54j38Q9K21j43J42M5m5k3n5K6J75k11J52k13
3338a04M4r4K20o6J96j74Pj05K20k25J88o9n2o9N0K94l41J84kj8p6Kk01N4l9L37
3364A61p3m0k56K14O2j69K78j69J1J02p6R9l2J62j08N5n52M42l01L76k61J71k37
3387a41K10m79L05J48j89N0j8L61l59J78m12M66j74K2o9J03k63K51j01P9R2k93
3409b33K16q0L55k57N2O1p6M3O1k36o1j01K03o9j52M73k40J47k59K57j9j28L68
3432C25k68r0k04J79J25k30L01j01M8j85K00k83K70p8L5K6j8j69j9L39l38R1M6
3455Bj41J88N0j13J70l65O0M18k26nk46L09R2k06r2M57k85j32J35K07k91k3L15
$$ plain form
3290 -29 119 145 290 4 47 134 110 279 -147 -88 4 18 -106 154 -238 70 -38 -9 191 -19 -75 -95 177 -62
3314 -62 101 162 40 -47 -15 -168 35 -37 28 -126 -264 -175 46 -97 45 90 45 22 -33 -7 168 -43 109 -104
3338 -104 -60 -154 66 0 196 22 29 -76 144 -81 107 38 -14 -83 -33 261 -80 104 102 84 8 10 -191 -137 -176 161
3364 161 88 48 -208 6 68 -101 177 8 19 121 45 144 112 274 166 221 -331 111 -190 186 -75 96 -141
3387 -141 69 -410 -105 43 -146 -96 -114 247 -112 66 -346 120 -54 -32 -101 2 -261 -10 -111 -32 60 -233
3409 -233 -17 -97 258 1 53 114 38 81 142 -94 -155 -256 -53 -122 -274 199 -41 106 -153 104 85 -43 325
3432 325 57 -33 -237 -58 67 -163 138 37 85 -100 100 -183 87 9 44 70 52 -117 -136 203 -135 -44 2
3455 2 -139 49 99 -14 156 -209 -149 269 43 38 -208 101 193 -13 -105 352 67 -65 70 277 -14 -37 278
3478B78n19JK00J23k4Q6k2O5k94l4K60L1j42j19Q0J31j27J5k9N5k25N5K06k88
3502b37L34k25K89k43K08j8J63k9m67K7Q1J28l7o4J94k31o0M3J97L32n42K21N5
3525A19n6m40P41l60j28J28J00m38L20J33l61M83k62n2P0j29L38j64j93J84k8
3546EK35k52l10K43J02L9k5J14l72J70J6K50k82J11k8j49L7O3L8O54p89J12J09
3569I1J89o16L85L69n96M26o30P87p55K25l64J33L38P7L7j82N9q0M33k03k15J36
3591D4q3K60n85M18J7j5k30j6J31P5l6J22P3m15J46R3K50l37K23j58p2P6j35j80
3615c34J22K56K9j00j3N4M5k03K42L6j71K7K33j83j1Q4j6k2q2q6J04P0Pj21N7
3640B4r1J12j67L11j42q3O8j2J69PJ30l28j7k80L73j63q0J05J95k16J82R9j35
$$ plain form
3478 278 -241 -240 -40 83 59 145 123 188 -106 -140 120 151 9 -110 -30 101 -26 -11 -40 15 -210 -155 51 -237
3502 -237 97 -128 161 -82 126 108 271 242 -225 -198 -117 11 -26 -90 104 -127 -187 -144 53 385 -157 64 119
3525 119 63 -377 364 4 -124 4 104 -334 -14 119 -242 241 -21 -73 -3 -132 206 42 -151 33 5
3546 5 240 -12 -322 -79 23 62 37 151 -221 -51 -35 215 -67 44 16 -133 -96 -33 5 659 -130 -18 91
3569 91 280 -336 49 418 -178 248 -382 405 -350 -125 -489 -356 -18 59 96 -86 -27 -107 326 123 -92 44
3591 44 -39 221 -364 54 71 56 -174 -190 -59 16 -20 102 175 -240 -94 -1 249 -88 135 -23 -95 -19 -154 -334
3615 -334 -212 44 73 -27 -40 14 59 -144 98 134 -37 -10 223 40 29 113 97 75 -7 -93 11 81 88 -33 24
3640 24 -67 45 -122 189 47 -36 32 20 189 196 326 -2 -19 -299 74 -89 -169 -64 131 -85 97 196 61
3663F1m9k30J57J20j32J86o5k42J70q2j20M19j64N5j45L3J59k20J26J04j30k02
3685a91K15l4R0k89J89q9J29m2P8K18m93R2J09J69m80L64L2J11j78p3J23o2o3
3708g5N4n7j01J09J29J14K0p02M31N2k97K59K86j19r7O8j36j5L8J1PP2l5J58J99
3733C73m99k92J5M20pP7j45O1K67m23L2K33o0J04j49r7Q5k94K03RR4k32K63k08
3757a70L96j23L9l26J60J41j05j48L74j52k06K08j04Q4j38J7J85p2K8q5J73j50
3779B6j42J56k99L80j7r1j30j28K51M4r5o0J04j00L4J55R6k68J40j41Q8r2J6m2
3803a15L2J58J71l37J27q9j88J03L05q9n5l6j70K7J20P2j61J89q7j92P7O2M5K09
3827A78j57L4k3k20K51rq5N0o5n6K01R1k36K11q6K4M6k76pp1M6J54r1J05j44K8
$$ plain form
3663 61 12 -218 -61 59 -73 113 48 -194 -24 -106 -226 193 29 84 -61 -28 131 -89 37 141 11 -191
3685 -191 24 -10 80 -209 -20 -109 20 -22 56 274 -219 -127 -18 151 -329 35 67 178 0 -73 50 -12 -75
3708 -75 -21 -78 -179 -70 59 173 193 -509 -78 -26 -323 -64 222 103 6 74 -62 -77 -39 -28 -21 51 16 174 373
3733 373 -126 -418 -403 17 10 87 -58 3 270 -153 -121 112 52 156 7 -90 -5 -299 -96 -87 7 -225 38 -170
3757 -170 226 103 142 -184 -24 117 12 -136 238 86 -120 88 -16 68 -70 -53 132 60 88 3 176 26
3779 26 -116 40 -259 121 104 13 -117 -245 6 50 -45 -105 -1 -101 -67 88 184 -84 56 -85 3 -89 -73 -115
3803 -115 -83 75 246 -91 36 -53 -241 -138 167 78 23 -13 -183 -156 -36 36 -125 64 -23 -215 -138 -76 -31 178
3827 178 21 55 32 -188 63 54 -31 19 -46 -102 99 190 -46 165 79 103 149 -127 -134 -205 -159 -5 -96 9 -135 -107
3853a07M9K3N7j05J64k35L04r7m6J29P0nl07J15k60J52J55Q2O5l05K00M6j46j37
3877a39M24l71J87j81O9J04p8QK7M5j98L97m24J76j91O7m36Q01k37J14j62m3J39
3900I8j30j55K69K9o2j81r8L13k25K71L97n45l1nJ65l0K4j17j85J45nJ3K4j1N9
3925B7j8j89J18m9P1K64j40Q3j90J90j95j58J68m7l38J50N38p08M80p26Q21k41
3947h9l5J83j87Q3K51l75J16J82m1j68j55K19m7K37j39r4j01K74j92J14J41l2
3969A45R8l14j8j56M20l41K42R0N3j40k33J67n5j86K02j95J78o2q1N4k4n6J30
3992h2N8J42j48K9K42l39R6l1k78L57k50M4o7K86j02J26l53M71p2k04pj65K95
4015D8L9p1j49K95O1l04K68J05k29j63J44J00k7j59j47NJ7P9P1O5n5J30j92L1
$$ plain form
3853 -107 -58 -35 22 -83 81 -154 150 53 7 136 206 201 -106 9 -251 -99 56 138 203 -102 98 144 -2 -139
3877 -139 285 -86 101 -80 -11 93 15 23 50 95 -103 294 -130 46 -145 -78 -514 287 50 164 2 -41 98
3900 98 -32 -187 82 111 49 -132 -230 83 -142 129 526 -19 -50 -55 110 80 104 -13 -198 -53 -58 -45 -21 -32 27
3925 27 9 -180 -62 -111 -40 224 84 167 -23 167 -28 -186 -18 -65 -403 -253 285 -423 57 -669 152 -89
3947 -89 -124 59 -128 -45 206 -169 -53 129 88 -80 -235 -16 -63 174 35 -59 -160 114 -78 36 177 145
3969 145 243 -71 -89 -245 175 -166 76 166 219 79 -154 13 -42 -228 -26 -221 -43 -105 -186 -132 -156 -212 -82
3992 -82 -24 118 -30 -1 241 -98 -2 -33 -311 46 -204 -160 -227 59 -43 83 -270 201 129 -75 -82 -247 48
4015 48 87 16 -133 162 223 -81 187 292 63 -100 44 144 117 -42 -189 -184 -167 -88 -17 48 -7 123 -69 -38
4039c8O9Q3o7k17J31QlN7k84K95k3L0L6j04j29J14M3R3J39j26k3J89r2k58J19
4064D2N2j11J87l93K48r4K14o38Q56q6m91N14k54k31j9L93m33M80j96j40J35R9
4086A34j0l5ojk35J77O3k48q6O91l65O9j78j74Q6J74k75Q4j68K68L68l16Nj11
4110h9p0J12J19k83L92j76J07l7k27J34q3n8J59J19l34K37l0j7J19j02J30j32
4132a0o7K65j96j64L57p4l39J91k9j13K08J30j8j98J6r5k7j8L65k62J39O0j51
4155c0O6J88k40L2k4R0m9J01l59J00K16m0j2l03N5J79R8J41k51k6n5j24M58r8
4179A13j47j17K1J69m3N3p8J29o6nL32m68J60Kk86M21N4k93j3J88M6l00J16m2
4203e4k7l6nJ09M1j35J99j15J4L0j0Mk1k33K84o1J84j68J92k3m97M17m17M18l66
$$ plain form
4039 -38 31 114 47 -170 -39 -31 -34 23 -261 34 11 41 77 -27 -156 -42 1 94 233 107 84 273 181 -77 42
4064 42 94 -17 170 -223 25 -69 145 -493 363 277 -214 300 46 -185 -204 189 -244 236 40 -100 35 134
4086 134 124 89 83 82 -153 24 87 -161 -247 444 79 148 -30 -204 -118 56 -219 -135 -303 -35 333 17 22 -89
4110 -89 -159 -47 72 -211 181 5 112 75 -152 -18 -101 -159 0 119 -215 22 -8 -25 94 -8 122 -10
4132 -10 -77 188 -8 -172 185 111 -228 -37 -66 -179 29 159 141 -57 -41 -136 -163 -181 184 -78 61 121 -30
4155 -30 36 224 -16 16 -8 82 33 134 -225 -125 91 51 39 -264 -209 -30 68 209 -42 -68 -123 -247 211 113
4179 113 -34 -151 -130 39 -4 49 -29 100 34 29 361 -107 53 55 -231 190 244 -49 -62 126 172 -128 -12 -54
4203 -54 -81 -117 -122 -13 28 -107 92 -23 -9 21 11 15 -6 -239 45 -16 168 0 192 169 -328 89 -328 90 -276
4228b76K64L13l68LK02p3Q2l6k66j02K34k5k56R9J41j58K41J17k56M4L09n00j48
4251d15K73J54k39J17O2K9J83l16J08J90j59J58l9k15n4K16n7L8L0J68j28p4m8
4274a8j87L40l63N5R8J19k49J78j58L1J67j58L72k2j54J4k58l8K58m9p5m1J96
4297E8J50l38J00J51j20l4M4K02j59j62O8l0J64k1j31k50M73j00j02k79J97J58
4319C9Q2k75K32k09L00J85m36P5p4M7K18r6j61j51M98l8l12N6J11j55q1J79j03
4342f9l5qK91k80J39k64J51J43o4J79k82K53k89L09j27j64N5j06O5N6J85k68m9
4365a79j04J18O2n2J68k26K26L29l98R5k17L53O4k89K68j2j66M0o7O0k5j24J59
4388H3J94l19K8j91J93j79J08r0M38l05P8k22K31Q0n3j39K01o9j37K35j5l17K54
$$ plain form
4228 -276 -12 301 -67 -64 138 65 147 111 -155 -257 -23 -48 -304 -205 -64 -222 19 136 -120 -76 233 -267 -415
4251 -415 -142 12 -227 -110 -48 -19 164 -152 -44 146 -13 145 106 -109 -163 53 -4 34 64 232 104 30 -18
4274 -18 -205 135 -228 -173 -75 44 -205 -27 -185 -154 13 -145 227 205 51 65 -193 -231 27 -22 -97 -138 58
4297 58 208 -130 -30 121 1 -33 11 213 54 -108 -40 -70 94 73 -58 -308 165 65 -37 -316 -119 39
4319 39 121 -154 78 -131 169 354 -82 -7 -81 -34 184 88 -73 -224 274 236 -76 -20 91 -64 -145 34 -69
4342 -69 -104 -112 179 -101 38 -226 -75 68 4 183 -99 154 -135 174 47 -117 -62 -168 -103 -47 138 -130 -179
4365 -179 -283 -165 -103 -155 13 -213 13 342 -56 39 -178 175 239 -50 218 206 40 80 13 73 48 -76 83
4388 83 277 -42 -14 -205 -12 -191 -83 -173 265 -40 38 -184 47 127 74 -65 136 67 -70 165 150 -167 87
4411H7k56K28o2j23qL32j71k43M18r3n5k25P4r7N1K03k6l68N69j78O4k13l3M1
4435h4m4J05J16J37j30k01J77o5k39J72J48j07L97l34j55J21l6K7m8J18J12k02
4457a5K83k57k72J2o6k7L43k8K72j16l8J43Kk36q1j89L88k36k16O02k44j03Q0
4480AP4m85J59M58n2R7k57j61j53O8M48j84N97o11Q1m23K19J55L57n37J3Q0k86
4503c42L21K40l39j23M32k8J20K72q72L9J47Q2O47o11J90m03M71J24K2m29J58
4524A18P6k60j5L99l27j60P6L60k60K7k96J95K31j12K94m05M09l51J87l25K37
4545I8J54o89N39nK16l59Q8kK98k27l31O4K48R7k61K70j89j2L12k71M7j34L64
4568C15l24l18M08j25Q2L8j49L7K4j40K87m97N35k15J57J53k31j80M20k77J05
$$ plain form
4411 87 -169 59 -3 -126 -134 198 27 -216 202 109 54 -171 -97 -194 -143 60 34 -334 235 57 121 -92 -125 -84
4435 -84 -128 -23 93 230 100 -101 76 11 -228 -56 92 -15 382 48 -107 14 -22 5 -43 75 187 -15
4457 -15 268 11 -261 -249 -315 -342 1 -27 245 129 91 234 236 0 -81 -270 118 -118 -334 268 24 -79 1
4480 1 75 -410 -251 207 155 252 -5 -166 -319 -251 197 13 610 -1 80 -343 -124 31 388 -149 -136 -56 -342
4503 -342 -21 219 -120 -243 189 161 281 553 -319 -280 -133 -51 596 -15 175 -228 243 367 389 -40 118
4524 118 194 -66 -81 318 -9 -169 -93 267 7 34 -262 -67 164 52 346 -59 350 -1 186 -139 98
4545 98 252 -437 102 97 313 -46 42 40 338 111 -220 -156 92 189 -72 198 9 -3 309 38 85 -49 315
4568 315 -9 -327 81 -44 38 76 -73 -36 -12 -152 135 -362 173 -42 115 268 37 -143 277 0 105
4589A05JJ88k97o1j68J80M8J47J55k68j69J43j47L14l15J2o7P9K76p8k97L22K7
4612A30r9R4J29j95j66L25q7k67K69l49J39K74n4j71J41j30o7j40J97N0J41j73
4634iJ79j27k6l16L50o3j6J34k29r8K39P6l24L16q2K7j33j34M5k25N40k11l3J36
4658A6N4j01J30j35O1j56NJ81n0J96j35R9k61kJ49J74k45K4j68L82ll14P0j42
4682a71J24qj4Pk9J69k14Q4N8j26J17J03j94J09l8j47L18j87K77l01m0K05N6m19
4706b61N5J38pJ29J6k8kK8j03K0J22r7R8R9k64P0K6j88Q0J98l88K99l4J4l52M02
4732G0M7m34K66L02p4K63n41j38M60m2k88J24M71r65P41k2l79k6N20k14m16k31
4754e06K61J03M12M62q67l13N82n46k5M51K44j125Q81L16J75Lj44l99L94j099
$$ plain form
4589 105 106 294 -3 -64 -232 -52 -4 143 298 30 -139 4 -143 171 -144 -132 -199 -120 156 78 -219 103 130
4612 130 31 125 254 59 -107 218 131 -136 133 -216 -77 197 143 -28 113 -17 -84 -224 -27 23 164 -9
4634 -9 170 43 17 -299 51 -12 -28 106 -123 -221 18 94 -230 86 4 31 -102 -236 -191 -416 124 -87 -120 16
4658 16 70 -31 99 -36 25 -131 -126 55 5 201 66 165 -96 -98 51 225 -20 4 -164 218 215 -99 -29 -171
4682 -171 -47 -55 -69 -62 -91 78 -136 -52 6 -120 -3 100 -94 15 -23 -170 148 -39 238 -63 -103 102 158 -261
4706 -261 -206 -68 -75 54 70 42 40 68 -35 -15 107 10 108 207 -57 13 39 -149 -69 129 -259 40 6 20 -332 70
4732 70 117 -317 -51 251 177 440 -101 -239 221 179 -109 15 486 -479 262 240 -139 -165 355 141 -275 -506
4754 -506 -245 -142 270 732 -135 -448 134 -412 -437 14 258 -867 14 330 505 508 364 -35 359 -740
4774g40P18L0L59k53J88o59M31J137k038M18N0M36J78m25M66m45J41M66j035O73
4794I6K4k07l9Q5J32L15l34j76L85l65L81k83J64l55LR5P8N25j090J290p03P83
4816H04j249K91K20o19P59k44L22R4n84J9Q9N21n04M39p18J125q45k33O09L24
4836F20p41K14k30lM13q79Q12j52K23o06M14j39K55m54K61J32j40L5Q2k00j18
4857b01M01j08j43J78l63K49k71Q7J5K18R1k40J37p3K97k92J62k1r8N9j19J82
4879A47k05J75k08M0j49J27M4J89k10Q1l83K88J29j37p21Q32J57Rj55J83k77K46
4901B02p1p02Q01K8m80J53K83k19q1L1J73j50j21j06q9L80k51K43j41J14K5L8
4923F0l80J72Q2JO4J83k03j51L05j39L2K60m47P6k2R1J19K5k60K97k18l8n1J09
$$ plain form
4774 -740 -22 8 367 114 302 -357 74 1211 -827 -409 -359 77 255 -170 296 -149 -8 458 -577 96
4794 96 120 -87 -126 -41 91 406 72 -104 281 -84 297 14 178 -177 -174 -79 -1 524 -566 724 21 804
4816 804 -445 -154 66 -553 206 -38 284 378 -206 -187 -98 423 -81 358 -360 765 -80 -313 296 620
4836 620 -121 93 -137 -140 273 -606 206 54 277 -329 85 -54 201 -253 8 140 0 35 117 -83 -201
4857 -201 200 92 -51 127 -236 13 -258 -171 -156 62 153 -87 50 -23 274 -18 144 123 25 84 -35 147
4879 147 -58 117 -91 -51 -200 -73 -29 160 -50 31 -352 -64 65 -72 -793 39 196 205 50 233 -44 202
4901 202 131 -571 230 258 -222 -69 214 -5 -86 -55 118 -32 -153 -259 -348 32 -219 24 -117 -3 22 60
4923 60 -320 -148 -66 -65 -1 182 -21 -172 133 -6 26 286 -161 -85 -107 -16 103 128 -132 165 -53 -91 -142 -33
4947c3Q7j40O8L1P0j61l64N88m88M76l05r4O16l69K13l69L27n5k38K69k88K82
4969A23J14l02L16n29k3N74n95K93l16N05n2m90N68L83l62M49l81p69P57k82N70
4990E51n38k75M30j51J5K06j7m04J1J01K7j87O4M38l51K41mk98M3j48M4R5K39
5013A32j61J8kj6L64n24M18l93L40o62Q28l23K29m54Q24o05J64n02LK58r0J59
5035ER3N6k20J02j60k4N1K29j04j26J16j0r1J76O2k58N1O7P4l53J44J75k44J64
5059b5k5j32K84j65J52M3p3k31R5KJ2R8o8J59J1k91J75N2j27J21J8q8J05m5j34
5084g7j56L54j79Q6K7q4n9p4K88j07m6P8J12m6r8r2J05j77J84m5PP1n8N6k09K30
5110I1m4O0P4oj76P9N7P2j25k11J84M2j48P8k3L17l42q9L24j07k33M2j31J76n2
$$ plain form
4947 -33 54 -86 -18 13 83 -78 -442 146 -342 134 -171 -265 351 -18 195 -174 153 98 -140 129 -159 123
4969 123 237 -65 251 -278 -301 273 -322 -29 -345 160 108 -382 186 569 207 656 275 -494 263 -19 551
4990 551 13 -262 168 17 32 238 221 -183 -172 -71 -44 -231 -167 271 -80 161 157 -141 -98 -246 -202 -107 132
5013 132 -29 -11 -13 -29 335 -189 229 -164 176 -486 342 19 248 -206 618 13 177 -325 -322 -64 -154 5
5035 5 98 154 -66 36 -124 -148 -97 132 28 -98 18 8 -83 93 155 -103 -52 15 89 -264 -120 55 -189 -25
5059 -25 -50 -182 102 -63 89 132 59 -172 -77 -75 -63 35 -33 126 137 -154 21 73 -54 67 85 -3 102 57 -77
5084 -77 -233 121 -58 28 55 -29 -88 -162 126 19 -27 51 163 117 19 -73 32 -145 39 -6 1 72 14 70 -139 91
5110 91 47 107 181 175 -1 78 135 207 82 -129 55 97 -51 27 4 321 -21 -110 214 107 -126 -84 -215 -39 -91
5135i1O5P8r9jR0j36J72l25K27J6n6K08N1k28j04L71j02k54l3M7J7L11l82K50
5159I2k92K03M0J58j77j34K3L9J41M8M1p6k09N5P2n2J46M7j53j84P7J03n2J41
5183I7j8j79P9Q2pk40K12j4j48J59M0K3j87k3L32j71p7j0P2J15Nk50K48k17l4
5208a11J40j47NJ21j98J08r9L36n4m7j48J07j10R9k80M30j56p4M69l27o8j41J01
5231d4K88k97l2j70M16q2q4OJJ1J35j7l15K32n4j94K8K17n8M2j7J54J1j40j10
5256g3J91k70K16P1k53m8K09J6k26Q6J50J93l18p6K63j20oj41J66p7l5j03o9K76
5280B2j88K53j79n8L10k84K12K2l6N7j46J8N0J25k39j72M02j32pm6j4p7K84j80
5304co0j46J62J5j43L11l2M3J3k24J72j59K33n4j91J3J42j66N4M0k7k8K0k10L37
$$ plain form
5135 -91 -26 52 -47 -48 42 -94 78 -247 -20 -4 -60 148 199 -29 -133 238 136 -118 -151 -104 -87 224 -158 92
5159 92 -200 3 43 201 24 -110 -87 -48 93 141 182 106 -103 -48 24 -28 118 165 12 -172 -95 8 -44 97
5183 97 79 -100 -21 61 54 -186 26 12 -136 23 63 86 -101 -124 208 37 -40 -50 22 137 142 -108 140 -77 -111
5208 -111 29 -118 -113 8 -190 -82 -181 155 101 54 -94 13 -97 2 -278 152 -4 -78 391 64 -4 -145 -44
5231 -44 244 -53 -85 -255 161 79 -5 1 2 13 148 131 -184 48 -6 -200 -172 45 -13 29 12 166 177 37 -73
5256 -73 118 -152 64 135 -118 -166 43 59 -167 -81 69 262 -56 -132 131 11 5 -136 30 -47 -82 -185 -254 22
5280 22 -166 87 -92 -150 160 -124 88 110 74 131 -15 3 53 178 -61 -233 169 37 30 -16 -30 -107 177 -3
5304 -3 -63 -209 -47 -32 -175 136 104 147 160 -64 108 -51 182 128 -63 -50 92 -74 -20 20 -7 -35 -15 -225 112
5329A12J35j36Q0R4k50N8k98J15J09j4r6J0j3J28J66k99j6J93l2mp0K22l18K58
5353A34J53j27j84J33j34J25l8l9k37K53J02n4M5L8k1k74Q4lNo9L16j29j32R5
5377D2M8j81K05O3j93Q5J24j32Q4o6q5k65K37N7q5J39j34J64l3n4m6k2j5n8N2
5402f9q7L2J97K79n67K37j1Q8j1r3P5j70K24p1j66K2J11m4J31N9q9j80J98m93
5426c98L29r4J93p8J9j19Rn3L44m87L53L3Or3K15j84k6j75K68j93K42k85L1P6
5450f7M9J97k73K00m9J23k38P6Q8j05N9k26N9J56J0Q0k93J53J33J01l42K1j78
5473b66J24j4K14j26R3n6J08n1K92l10n4j8om9J65k7Q0p3R8j08k11J34n8j2J21
5498a0L33n77J68J26J37k61K39l42L22o8k01J70k40J23K03J33j94k71R3j60L67
$$ plain form
5329 112 247 111 191 285 35 93 -205 -90 19 5 -91 -81 -94 34 200 -99 -115 78 46 42 -28 194 -124 134
5353 134 287 160 -24 109 -25 100 62 23 -214 39 141 87 132 170 149 -125 -41 -44 -39 -108 208 79 -53 42
5377 42 90 -91 114 177 -16 69 193 61 145 79 -6 -271 -34 23 -62 77 -57 107 74 20 -26 -48 -63 -121 -69
5402 -69 -156 -124 73 352 -215 22 11 99 88 -5 70 -100 124 53 -113 -91 20 -24 107 166 77 -103 95 -398
5426 -398 -69 -163 30 -48 -29 -148 -139 -192 152 -335 18 51 57 -36 179 -5 -31 -206 62 -131 111 -174 -143 -67
5450 -67 -18 179 -94 106 57 180 -58 18 106 1 60 -166 -107 49 59 139 -154 -1 132 233 -109 -88 -266
5473 -266 -142 -156 58 -68 25 -31 77 26 318 8 -46 -64 -70 -119 46 19 99 26 124 16 -195 -61 -119 -131 -10
5498 -10 323 -254 -86 40 177 -84 155 -187 135 67 -134 36 -204 -81 122 255 61 -210 -117 -277 90
5519I0j1k6k74K20K4J2J20p7l6P8j72Mj18K22K8j5K1q9K12j06k96R6j63K80O3
5544H7p0l0p7J27m8J6j41P0N1r9K39k10K11j77L16k60j03N3j9J12j31J71J33j87
5568C4J03j24K48m34L4J64J10k75q1J67p1K2J22O9l9j20K36J35m79K58k51M02
5590B30k96L7o2L73j16p8p8J13j5M6pr2m7J76p9p8L4l5N3m1m13L37j15pK84m79
5616c55K76J47N5l22M42l67j37L70k28J35J9J48j89JJ28m9J31l81K84k55L79k42
5638a0J82j07j48J25Q6k01R2J04o4J1K6R0k2j47J27k93L07n4L07k87r3Rr0J03
5662E3j1j81J48J71n9k07j92M77j07N3j33q1J36n7j4j54K70k38J24j05J89j06
5684b4k14K24j47J97k13K0J29l3R2k30Q3J44j82K29P3k6j64j41K96j20O5j57K05
$$ plain form
5519 90 79 53 -221 -1 23 35 155 78 42 120 -52 -48 -166 56 84 69 90 1 213 107 -189 -93 -256 24 87
5544 87 17 -13 -90 37 -11 5 -136 -66 -15 -114 125 -85 126 -51 265 5 -98 -45 -64 48 -83 88 221 34
5568 34 137 13 261 -173 -139 25 135 -140 -221 -54 -125 -103 19 88 49 -71 165 300 -179 79 -172 230
5590 230 -66 -29 -91 282 166 88 10 123 108 154 147 55 8 184 105 27 61 26 79 38 -375 -38 -153 -160 124 -355
5616 -355 -79 68 123 -199 243 -124 -261 109 -119 16 35 183 -6 -5 123 74 205 -176 108 -147 232 -10
5638 -10 172 65 -83 42 128 -73 19 123 59 70 96 186 164 17 144 -149 158 104 411 124 31 40 -50 53
5662 53 42 -139 9 180 121 -86 -278 199 92 145 12 -69 67 10 -4 -158 112 -126 -2 -107 82 -24
5684 -24 -238 -14 -161 36 -177 -157 -28 -61 31 -199 -116 28 -154 75 148 122 -42 -183 113 -7 58 -99 106
5707A06l17K64M0q7p5Q2j43K53j80J6m0j74J23K45o8N3j17L49k32q8L6L0j94J28
$$ plain form
5707 106 -211 53 93 6 -69 13 -130 123 -57 -41 -81 -255 -132 113 45 98 -19 330 98 10 46 76 -118 10
$$ [...]
8191b9
##END NTUPLES=NMR FID
##END=
