##TITLE=1H_K-386/2
 CDCl3, 8 sc, 
 23.9.2020
##JCAMPDX= 6.0         $$ Bruker NMR JCAMP-DX V2.0
##DATA TYPE= NMR FID
##DATA CLASS= NTUPLES
##ORIGIN= UXNMR, Bruker Analytische Messtechnik GmbH
##OWNER= root
$$ XWIN-NMR		Version 3.5
$$ Wed Sep 23 11:59:58 2020 Russian Standard Time (UT+4h)  she@DPX200
##.OBSERVE FREQUENCY= 200.1315066352
##.OBSERVE NUCLEUS= ^1H
##.DELAY= (6, 6)
##.ACQUISITION MODE= SIMULTANEOUS
##.ACQUISITION SCHEME= undefined
##.AVERAGES= 8
##.DIGITISER RES= 18
##SPECTROMETER/DATA SYSTEM= spect
##.PULSE SEQUENCE= zg30
##.SOLVENT NAME= CDCl3
##.SHIFT REFERENCE= (INTERNAL, CDCl3, 0, 15.7039)
##AUDIT TRAIL= $$ (NUMBER, WHEN, WHO, WHERE, WHAT)
$$ ##TITLE= Audit trail, XWIN-NMR		Version 3.5
$$ ##JCAMPDX= 5.01
$$ ##ORIGIN= Bruker BioSpin GmbH
$$ ##OWNER= she
$$ F:/spectra/data/she/nmr/H-F/1/audita.txt
$$ ##AUDIT TRAIL=  $$ (NUMBER, WHEN, WHO, WHERE, WHAT)
(   1,<2020-09-23 11:58:41.54 +0400>,<she>,<DPX200>,
      <created by zg, POWCHK disabled, PULCHK disabled
       configuration hash MD5:
       00 E9 B6 7A A2 85 ED C7 34 08 36 98 17 FE 4E 26
       data hash MD5: 16K
       E2 08 D7 AA 30 EA D9 6C C1 DC D2 68 B3 0E 08 42>)
$$ ##END=
$$ 
$$ hash MD5
$$ 4A 4F 35 29 B0 B3 C9 E2 46 8A 58 80 81 2C AA B8
##$RELAX= 
##$RELAX= 
##$RELAX= 
##$RELAX= 
##$RELAX= 
##$RELAX= 
$$ Bruker specific parameters
$$ --------------------------
##$DU= <F:/spectra>
##$EXPNO= 1
##$NAME= <H-F>
##$PROCNO= 1
##$TYPE= <nmr>
##$USER= <she>
##$AMP= (0..31)
100 100 100 100 100 100 100 100 100 100 100 100 100 100 100 100 100 100 
100 100 100 100 100 100 100 100 100 100 100 100 100 100 
##$AQSEQ= 0
##$AQ_mod= 1
##$AUNM= <au_zg>
##$AUTOPOS= <>
##$BF1= 200.13
##$BF2= 200.13
##$BF3= 200.13
##$BF4= 200.13
##$BF5= 200.13
##$BF6= 200.13
##$BF7= 200.13
##$BF8= 200.13
##$BYTORDA= 1
##$CFDGTYP= 0
##$CFRGTYP= 5
##$CHEMSTR= <none>
##$CNST= (0..31)
1 1 145 1 1 1 1 1 1 1 1 1 1 1 1 1 1 1 1 1 1 1 1 1 1 1 1 1 1 1 1 1 
##$CPDPRG= <>
##$CPDPRG1= <>
##$CPDPRG2= <>
##$CPDPRG3= <>
##$CPDPRG4= <mlev>
##$CPDPRG5= <mlev>
##$CPDPRG6= <mlev>
##$CPDPRG7= <mlev>
##$CPDPRG8= <mlev>
##$CPDPRGB= <>
##$CPDPRGT= <>
##$D= (0..31)
0 1.2 0 0 0 0 0 0 0 0.06 0 0.03 0 0 0 0 0.0002 0 0 0 0 0 0 0 0 0 0 0 0 
0 0 0 
##$DATE= 1600847920
##$DBL= (0..7)
120 120 120 120 120 120 120 120 
##$DBP= (0..7)
150 150 150 150 150 150 150 150 
##$DBP07= 0
##$DBPNAM0= <>
##$DBPNAM1= <>
##$DBPNAM2= <>
##$DBPNAM3= <>
##$DBPNAM4= <>
##$DBPNAM5= <>
##$DBPNAM6= <>
##$DBPNAM7= <>
##$DBPOAL= (0..7)
0.5 0.5 0.5 0.5 0.5 0.5 0.5 0.5 
##$DBPOFFS= (0..7)
0 0 0 0 0 0 0 0 
##$DE= 6
##$DECBNUC= <off>
##$DECIM= 32
##$DECNUC= <off>
##$DECSTAT= 4
##$DIGMOD= 1
##$DIGTYP= 9
##$DL= (0..7)
0 120 120 120 120 120 120 120 
##$DP= (0..7)
150 150 150 150 150 150 150 150 
##$DP07= 0
##$DPNAME0= <>
##$DPNAME1= <>
##$DPNAME2= <>
##$DPNAME3= <>
##$DPNAME4= <>
##$DPNAME5= <>
##$DPNAME6= <>
##$DPNAME7= <>
##$DPOAL= (0..7)
0.5 0.5 0.5 0.5 0.5 0.5 0.5 0.5 
##$DPOFFS= (0..7)
0 0 0 0 0 0 0 0 
##$DQDMODE= 0
##$DR= 18
##$DS= 0
##$DSLIST= <SSSSSSSSSSSSSSS>
$$ [...]
##$SUBNAM2= <"">
##$SUBNAM3= <"">
##$SUBNAM4= <"">
##$SUBNAM5= <"">
##$SUBNAM6= <"">
##$SUBNAM7= <"">
##$SUBNAM8= <"">
##$SUBNAM9= <"">
##$SW= 16.880792210976
##$SWIBOX= (0..15)
0 0 2 0 0 0 0 0 0 0 0 0 0 0 0 0 
##$SW_h= 3378.37837837838
##$TD= 16384
##$TD0= 1
##$TE= 0
##$TE2= 300
##$TE3= 300
##$TEG= 300
##$TL= (0..7)
0 120 120 120 120 120 120 120 
##$TP= (0..7)
150 150 150 150 150 150 150 150 
##$TP07= 0
##$TPNAME0= <>
##$TPNAME1= <>
##$TPNAME2= <>
##$TPNAME3= <>
##$TPNAME4= <>
##$TPNAME5= <>
##$TPNAME6= <>
##$TPNAME7= <>
##$TPOAL= (0..7)
0.5 0.5 0.5 0.5 0.5 0.5 0.5 0.5 
##$TPOFFS= (0..7)
0 0 0 0 0 0 0 0 
##$TUNHIN= 0
##$TUNHOUT= 0
##$TUNXOUT= 0
##$USERA1= <user>
##$USERA2= <user>
##$USERA3= <user>
##$USERA4= <user>
##$USERA5= <user>
##$V9= 5
##$VALIST= <valist>
##$VCLIST= <CCCCCCCCCCCCCCC>
##$VD= 0
##$VDLIST= <DDDDDDDDDDDDDDD>
##$VPLIST= <PPPPPPPPPPPPPPP>
##$VTLIST= <TTTTTTTTTTTTTTT>
##$WBST= 1024
##$WBSW= 4
##$XGAIN= (0..3)
0 0 0 0 
##$XL= 0
##$YL= 0
##$YMAX_a= 84749
##$YMIN_a= -50682
##$ZGOPTNS= <>
##$ZL1= 120
##$ZL2= 120
##$ZL3= 120
##$ZL4= 120
##$ABSF1= 10
##$ABSF2= 0
##$ABSG= 5
##$ABSL= 3
##$ALPHA= 0
##$AQORDER= 0
##$ASSFAC= 0
##$ASSFACI= 0
##$ASSFACX= 0
##$ASSWID= 0
##$AUNMP= <proc_1d>
##$AZFE= 0.1
##$AZFW= 0.1
##$BCFW= 1
##$BC_mod= 2
##$BYTORDP= 1
##$COROFFS= 0
##$CY= 11.3945322036743
##$DATMOD= 1
##$DC= 2
##$DFILT= <>
##$DTYPP= 0
##$F1P= 16.9975609425685
##$F2P= -3.02152046262296
##$FCOR= 0.5
##$FTSIZE= 0
##$FT_mod= 4
##$GAMMA= 1
##$GB= 0.15
##$INTBC= 1
##$INTSCL= 1
##$ISEN= 128
##$LB= 0.24
##$LEV0= 0
##$LPBIN= 0
##$MAXI= 10000
##$MC2= 0
##$MEAN= 0
##$ME_mod= 0
##$MI= 1.114404
##$NCOEF= 0
##$NC_proc= 0
##$NLEV= 6
##$NOISF1= 3.799351
##$NOISF2= 2.8
##$NSP= 1
##$NTH_PI= 0
##$NZP= 0
##$OFFSET= 15.70392
##$PC= 1
##$PHC0= -9973.253
##$PHC1= 11.8009
##$PH_mod= 1
##$PKNL= yes
##$PPARMOD= 0
##$PSCAL= 0
##$PSIGN= 0
##$REVERSE= no
##$SF= 200.130013532006
##$SI= 16384
##$SIGF1= 3
##$SIGF2= 2
##$SINO= 400
##$SIOLD= 16384
##$SREGLST= <1H.CDCl3>
##$SSB= 0
##$STSI= 0
##$STSR= 0
##$SW_p= 3612.71676300578
##$SYMM= 0
##$S_DEV= 0
##$TDeff= 0
##$TDoff= 0
##$TI= <>
##$TILT= no
##$TM1= 0
##$TM2= 0
##$TOPLEV= 0
##$USERP1= <user>
##$USERP2= <user>
##$USERP3= <user>
##$USERP4= <user>
##$USERP5= <user>
##$WDW= 1
##$XDIM= 8192
##$YMAX_p= 0
##$YMIN_p= 0
$$ End of Bruker specific parameters
$$ ---------------------------------
##NTUPLES= NMR FID
##VAR_NAME=  TIME,          FID/REAL,        FID/IMAG
##SYMBOL=    X,             R,               I
##VAR_TYPE=  INDEPENDENT,   DEPENDENT,       DEPENDENT
##VAR_FORM=  AFFN,          ASDF,            ASDF
##VAR_DIM=   8192,          8192,            8192
##UNITS=     SECONDS,       ARBITRARY UNITS, ARBITRARY UNITS
##FACTOR=    0.000296,      1,               1
##FIRST=     0,             0,               0
##LAST=      2.424536,      0,               0
##MIN=       0,             -50682,          0
##MAX=       2.424536,      84749,           0
$$ Real data points
##PAGE= N=1
##DATA TABLE= (X++(R..R)), XYDATA
0 0 0 0 0 0 0 0 0 0 0 0 0 0 0 0 0 0 0 0 8 -8 8 -8 8 -8 16 -16 16 -20 24 -24 32 -34 40 -47 51 -56 64 -72 81 -92
40 -92 103 -114 126 -140 155 -172 189 -209 230 -254 280 -308 339 -374 412 -456 506 -563 628 -703
60 -703 791 -902 1036 -1208 1440 -1770 2274 -3184 5402 -27579 -29500 -50682 -49889 -21793 -42469
75 -42469 -34183 -15749 -19040 -23513 -16579 -17120 -11628 -23516 -10661 -16799 -16290 -4928 -7198 -8131 -5709
90 -5709 6038 -2198 -3127 1516 4123 -2951 544 7380 -9192 7287 7342 -5164 557 7739 -1656
105 -1656 -803 2888 -4358 2634 -4674 364 -5992 -7714 2971 -9129 -8723 -2570 -3706 -8951 -2012
120 -2012 -7020 -4984 -2598 -4288 -2534 -9355 2522 -3188 -6916 -947 -2035 -4548 -2526 -1604 -8201
135 -8201 -34 -5499 -4055 -5534 -5718 -606 -7001 -4293 -3094 -2730 -5433 -11 -6459 -4228 -429 -6692
151 -6692 -2115 -6624 -979 -2771 -4091 -722 -805 -1227 1063 2191 -2693 5116 -402 1722 1254 -518
167 -518 4284 -1033 2496 2661 3561 3485 7937 3943 5956 9450 3619 7236 2458 5558 2697 1277
183 1277 2497 1753 1874 2377 4648 -864 5961 1272 664 1073 -2053 318 -4762 -3347 -5141 -5170 -6234
200 -6234 -3227 -6956 -4681 -559 -6072 -795 -3910 -2391 -3691 -4613 -4247 -6238 -5260 -5360 -4168 -6833
216 -6833 25 -2823 -1500 1622 -1036 1861 -258 1290 -1381 -81 -1107 25 -1840 -77 2967
231 2967 -1642 4341 1836 2707 3944 3500 2701 2091 2816 692 1400 -1847 2231 -801 182 2841 -214
248 -214 3838 2998 3933 2296 3998 1440 1869 398 -652 689 -3177 1426 -1583 -12 1741 1184
264 1184 1766 1974 2522 102 2143 -1923 -243 -2745 -2715 -1668 -4757 -892 -2025 -1112 -994 1091 -475
281 -475 757 380 -1853 59 -3530 -1245 -4034 -3242 -2185 -2533 -1372 -850 580 -603 2442 -654
297 -654 1483 313 -589 382 -2305 18 -1756 -754 -601 899 -137 2247 2434 939 4177 883
313 883 2992 752 879 922 -607 145 -63 1090 260 3213 592 3197 2495 1451 2939 -15 1549
330 1549 -423 105 -1099 -277 -1266 -170 -205 -1429 1836 -1472 1014 -647 -818 -733 -1940 -1985 -2952 -2109
348 -2109 -3763 -1581 -3893 -1710 -1674 -2517 -352 -2282 -477 -1664 -1564 -2774 -1818 -2674 -2184 -1550 -2870
365 -2870 517 -1340 741 409 373 1275 202 889 -120 763 -726 1586 -650 902 1491 299 2711
382 2711 1015 2774 2048 2536 1350 1719 997 1217 1363 -469 2317 -15 1772 1597 1300 2187 1482 2120
400 2120 1106 1983 402 1459 -789 -157 -93 -1636 700 -1055 729 -158 830 296 634 467 -64 304
418 304 -1625 337 -1779 -824 -884 -1118 -328 -403 235 -426 652 -471 565 -1066 -239 -267 -1780 203
436 203 -1482 -48 -670 -143 -247 726 968 562 1517 -65 1846 -338 388 396 -352 644 301 1055 969 2378
456 2378 1472 2831 2344 2153 2612 1237 2623 876 1696 1565 1842 1344 2234 2114 1648 3000 1121 2480
474 2480 897 1332 956 -108 252 -477 -408 -1014 -96 -1152 42 -478 -692 447 -773 -31 -1130 -562
492 -562 -1444 -1578 -1714 -1584 -1054 -1464 -90 -1335 383 -208 -78 218 -277 303 -545 -162 -1176 -434 -1400
511 -1400 -567 -598 -521 451 -216 1103 207 654 429 216 105 189 -38 -564 458 -827 536 -31 647 1199
531 1199 319 1490 771 936 395 1138 110 443 415 -102 689 -93 1111 267 887 1037 944 1091 962 1111
551 1111 -242 853 -427 437 47 -196 -11 -153 635 -376 320 135 582 -303 418 -48 -986 284
569 284 -934 -319 -622 -286 -404 -470 132 257 40 -301 465 -1136 -374 -365 -680 -358 -467 192 -610 353 -371
590 -371 345 122 360 240 -370 715 -447 95 -30 -61 -32 49 116 -70 473 121 763 -13 649 655 -203 510
612 510 -207 4 -453 305 -98 460 284 274 415 -53 889 -234 350 356 -116 178 -101 -10 -279 414 -289
633 -289 110 -163 252 289 -366 394 -429 -354 -614 -246 -505 -315 -686 -737 -289 -674 -95 -851 -208 -475 -874
654 -874 -510 -619 -394 -1105 -334 -1078 -314 -769 -436 -295 -765 -47 -821 -398 -528 -212 -454 -131 -297 -481
674 -481 -134 -296 173 -83 260 121 -21 336 144 -37 233 465 -226 404 205 67 232 91 668 168
694 168 462 267 232 362 541 163 -327 346 -441 431 106 293 134 191 703 118 324 226 319 -301 -53 -151
716 -151 -166 174 -345 158 -153 394 63 67 -70 218 81 -301 52 -859 -75 -521 -439 -488 -546 -99 -466 -138
738 -138 -434 -145 -358 -66 -422 -383 -176 -496 -93 -296 -395 -225 124 182 146 326 -48 749 -340 276 -56
759 -56 -269 -130 -175 196 79 556 -134 457 341 675 727 111 741 -108 301 -52 157 101 151 212 2 469
781 469 25 442 -156 551 160 -30 397 -271 28 -279 -224 -500 12 -220 -49 -63 -251 92 -119 -103 -533
802 -533 -182 -480 -440 -363 -572 -64 -455 -161 -357 -195 -344 -67 -52 -256 66 -68 -193 -308 246 -414 -308
823 -308 -51 -54 366 -6 75 31 335 75 234 -18 -30 247 -328 114 156 -115 195 243 475 252 681 150 372
846 372 122 292 354 -187 148 -138 -41 18 145 307 96 480 281 440 320 218 -173 122 -47 -287 398
867 398 -183 139 83 283 72 -50 129 -107 -106 -72 267 -315 -30 -109 -228 -588 -114 -265 -434 2 -188 -24
889 -24 -315 -142 -294 -193 -292 -331 -200 -422 125 -370 -27 -187 -160 -36 -170 411 -120 345 -250 121 161 271
911 271 189 98 519 279 214 387 502 346 392 342 259 438 77 380 294 272 84 148 248 50 323 162 297
934 297 141 122 -36 -278 -86 -149 66 -272 110 49 171 175 -209 255 -277 -9 -174 20 33 27 -230 -227 116 -226
958 -226 329 -222 196 -152 122 -185 -145 -11 -168 53 -203 145 -213 80 144 20 -54 -47 138 -96 247 177
980 177 241 164 -124 296 -199 328 47 246 219 274 448 173 566 239 202 89 236 85 25 363 210 470
1002 470 319 411 266 382 296 266 31 -30 475 -216 111 -95 -66 -148 -322 -63 -174 61 -144 287 -88 77
1024 77 -95 -22 21 -588 -151 -357 1 -137 -63 108 70 129 -126 96 -160 -26 -59 -376 -30 -208 7 -336
1046 -336 69 -79 111 -181 150 64 -76 77 -161 138 -195 -47 30 64 -325 111 -82 -116 188 134 404 110
1068 110 -128 271 -93 -254 164 111 -73 218 276 60 208 301 133 -27 233 15 169 107 40 77 -53 -26
1090 -26 -66 348 85 -80 -56 56 -4 -98 284 -38 -87 -137 -225 -296 -220 1 -224 -42 -226 -81 56 6 -45 -302
1114 -302 -153 -215 -48 -255 -85 -468 111 -148 66 22 56 -3 -237 176 -126 -154 -162 -181 67 -326 95 25 53
1137 53 96 222 115 176 150 -89 353 -132 438 18 277 126 25 51 161 352 -14 320 113 294 100 -50
1159 -50 229 -58 273 -138 126 76 13 216 144 -54 -32 250 -167 -215 -90 78 -226 -113 -154 -129 371 212 99
1182 99 -510 -533 -351 241 -373 -664 237 -25 -496 98 -604 14 43 -68 -75 42 -180 -31 104 -34 -167 -223
1204 -223 -177 -260 -103 -178 84 -132 -32 284 -74 229 -93 384 -81 235 34 -93 157 -177 -83 8 81 71
1226 71 281 -142 353 -35 123 -54 78 53 86 50 -12 -63 98 -47 46 -169 113 -40 172 177 89 237 -172
1249 -172 -197 -209 -20 -327 64 -165 0 -190 77 -4 -275 -35 -613 148 -365 130 43 -41 -79 -257 -32 -185
1271 -185 14 -38 -10 -60 -156 7 -188 -32 -20 77 -20 -5 75 -10 252 -132 278 -7 217 29 106 3 -127 226
1295 226 54 166 -210 310 -23 262 -4 148 86 294 120 -133 206 191 -183 -92 303 28 -331 308 26
1316 26 123 -105 -246 -39 -185 31 -237 -56 -309 -140 -63 160 -24 -83 -135 -92 -248 -284 94 -225 -196 78 1
1339 1 -277 -300 116 -96 142 -172 -11 81 -91 296 -93 156 -153 14 53 -98 187 -278 308 28 124 105
1361 105 148 97 105 307 14 184 59 174 -7 220 -73 207 80 137 300 66 469 101 162 12 -144 102
1383 102 -166 106 321 26 5 41 126 164 183 -90 237 -174 132 52 -96 -284 -66 -17 -123 -61 -90 172 22
1406 22 -75 89 -164 -183 -64 -97 -307 -131 -293 -97 -204 1 227 -267 183 -381 -107 -89 -117 -20 -197 -299
1428 -299 -301 258 20 29 54 -114 -17 -99 196 -63 232 -241 -56 -68 90 207 102 231 90 448 174 269 -8
1451 -8 48 244 -105 6 -9 162 54 82 -50 13 71 103 -52 -54 268 142 345 -33 236 131 -112 -103 124 194
1475 194 -57 2 -180 36 51 -127 45 -341 173 -195 78 -326 -59 44 -243 -185 -75 -19 -207 288 -40
1496 -40 118 -5 -590 -149 -162 -62 -337 337 -107 49 165 -163 -36 -147 107 154 122 -38 6 202 -76 71
1518 71 -298 263 16 134 91 51 158 181 124 204 185 -14 80 24 344 339 27 235 90 361 51 155 -74 -82
1542 -82 67 -416 -121 -323 200 -54 27 -230 7 81 -105 -10 -126 76 -133 -6 -152 -114 28 -227 123 -145
1564 -145 -42 25 -28 -78 -161 38 78 9 -124 36 12 -172 36 -396 60 92 141 -41 197 -10 215 115 -115
1587 -115 17 -115 164 -222 -42 -36 119 115 166 243 144 414 244 114 72 -261 284 -37 269 80 145 -64 389
1610 389 -99 -8 14 113 366 230 99 -127 -38 -133 -43 -66 -207 79 -27 81 -114 23 -258 -260 -57 -134 134
1633 134 -13 -311 -84 -281 -211 309 -7 -303 -156 -417 227 -60 15 152 -41 -156 -191 213 -270 136 -8
1654 -8 216 -24 38 174 85 244 -77 154 -144 83 13 -60 223 113 -7 68 340 322 516 177 367 98 -110
1677 -110 114 34 92 -1 367 174 45 144 156 99 -259 183 -64 22 -33 -53 -168 39 110 -235 14 40 -31 37
1701 37 -7 7 -174 -102 10 -270 -59 92 -108 -235 6 -202 -3 -512 -197 -267 -214 6 -78 -180 -203 -60 -13
1724 -13 94 -177 3 51 -149 104 42 154 87 130 13 25 286 22 33 -14 312 207 214 -20 131 304 -21
1747 -21 142 -56 266 -150 188 111 281 335 188 94 379 73 -79 98 -134 -21 -84 -178 197 76 -179 -241
1769 -241 -33 11 -65 7 -167 -181 -122 -95 -451 -68 -315 -225 -230 -259 -149 -294 109 -251 99 -302 -134 65 -78
1792 -78 -90 -151 -75 -287 -26 -280 -219 72 -238 111 -20 250 -83 231 101 -235 17 191 89 -246 154 61
1814 61 203 162 114 193 42 269 136 248 192 65 50 114 171 -30 365 62 334 -147 246 20 44 224 4
1837 4 192 -268 179 -54 199 47 46 45 117 205 -37 -46 -145 168 -73 -56 -150 -76 -16 -100 -122 -122 -5 -162 -138 0 -184
1864 -184 205 -53 -89 -201 -5 -2 -2 48 -81 138 -267 18 -20 64 -20 147 7 -253 207 -166 59 -163 386
1887 386 248 378 209 51 321 132 298 -187 -73 4 29 131 215 132 -79 -26 -195 90 -119 -118 32 -33 -6
1910 -6 -164 -101 -253 -170 -56 -240 -66 -357 -106 -67 124 -138 -199 -292 -126 -3 -137 66 -83 -53 -66 -170 -317
1933 -317 -304 -63 -42 81 -278 76 -10 -138 33 -38 46 -37 184 -335 227 -86 -68 -128 -125 4 -47 -19 -17 -141 -219
1958 -219 -103 18 29 -182 134 54 -148 190 -8 -167 106 -61 260 -16 147 145 31 -108 82 184 -215
1979 -215 102 -56 294 -85 119 -310 -50 125 -62 64 -319 134 -35 -15 28 -178 37 91 49 -136 15
2000 15 -263 1 -180 -122 -198 -53 181 -60 -5 -55 199 119 21 -60 -176 -62 -420 99 -142 -19 63 -158 -151 -113
2024 -113 288 95 -221 -239 71 -142 -68 -50 -124 38 17 39 -201 97 30 -183 124 -88 330 315 196 -5 33
2047 33 69 214 137 -128 256 145 -25 -70 118 -92 292 -53 -11 16 -211 22 -201 -27 297 116 223 -66
2069 -66 80 -178 85 -213 -162 11 -156 -167 -305 -5 25 261 -270 -25 154 52 76 -66 163 -217 -45 -221
2091 -221 165 97 -294 154 -151 133 -42 -161 70 -35 -154 115 -54 -277 131 125 344 -38 454 26 78
2112 78 75 -40 494 259 108 129 218 -71 209 158 21 -130 203 204 144 -65 -57 228 -25 17 203 21 -115 2
2136 2 40 -59 -263 92 -26 89 -29 215 -204 -168 -19 113 -95 -253 -72 3 77 -16 62 73 71 47 -128 161
2160 161 -10 183 43 125 22 -141 -218 -75 -149 -91 -182 107 109 115 -73 -14 -118 -67 85 -4 0 35 -13 66 110 60
2186 60 89 -141 118 229 249 223 53 88 125 102 -111 -81 49 -39 66 -33 -80 6 -30 -23 -98 -199 -71 86 18 93
2212 93 -127 9 54 -26 -291 -167 -226 -82 82 -72 -235 -2 -16 55 -186 -100 22 318 -65 -57 -276 -113 38
2235 38 21 19 236 -30 -251 55 -149 -10 145 -16 98 -123 59 89 84 153 131 102 66 16 159 166 -13 171 355
2260 355 113 -144 -126 249 169 -109 -135 59 97 88 22 85 -19 228 143 -236 72 72 -54 -76 -207 -77 -37 124
2284 124 103 65 -118 -104 -83 94 62 22 104 -73 194 -54 213 -292 -10 42 -109 4 -20 97 -257 76 238
2307 238 -10 -32 -303 23 -72 -3 -100 80 -85 51 40 110 197 -165 60 97 -97 91 -4 101 -9 14 -88
2330 -88 -42 25 131 139 254 189 74 -66 -262 120 173 147 77 126 10 4 -116 -25 70 -128 19 -59 -186 -135 13
2355 13 17 -33 94 -49 -45 140 -65 112 -202 36 -186 -108 -367 17 31 -44 141 -99 44 -94 -162 -21 1 46
2379 46 -58 -228 19 -36 258 106 -140 52 -9 125 -100 117 112 -39 14 -211 337 21 -112 357 62 -62
2401 -62 97 64 -133 89 199 165 149 127 214 -79 96 69 -43 -221 119 55 -33 10 1 -8 141 -33 -65 -123 140
2426 140 226 74 158 -135 45 172 289 65 -75 244 -81 -280 -22 -34 53 -3 -67 -10 -214 -37 41 65 -5
2449 -5 -153 -59 -31 186 126 77 -368 -36 156 -238 -33 65 113 135 232 119 58 142 -124 6 -12 -116 -162 -109 36
2474 36 -43 37 59 395 23 -283 12 -124 119 234 -33 -38 -54 -105 14 74 -93 69 31 61 14 300 99 -136
2498 -136 60 -37 -182 -11 -233 -101 133 -160 152 -34 -43 -198 28 78 -149 -7 62 -116 51 126 -46 8
2520 8 -178 -150 99 15 144 -64 -82 170 -95 32 -138 70 -140 67 149 141 -70 -121 51 6 -39 5 125 -133
2544 -133 61 72 -12 -115 94 63 -259 50 238 -67 259 -5 -132 91 126 36 153 16 175 -142 -55 -110
2566 -110 -226 -208 -233 -52 -162 125 -83 -430 104 191 -172 86 -90 62 43 205 96 -52 -189 8 -1 153
2588 153 -46 90 -57 32 -78 1 -174 10 -118 -41 70 -62 122 134 256 101 193 -45 274 163 178 -12
2610 -12 95 -75 15 -95 59 -107 11 -138 -56 -1 -94 169 99 32 -48 -118 106 132 22 22 -165 1 174 2
2634 2 88 -28 128 59 84 72 -75 69 46 11 -48 4 137 -37 -139 -210 60 55 -111 -89 -15 -183 52 41 -76
2659 -76 183 -8 -13 -105 -93 -116 132 -26 -21 -29 71 -112 78 114 -33 -52 -37 72 53 112 197 -31 33 45 13 -5 49
2686 49 19 -13 -137 64 253 -252 -111 242 -107 229 -57 -402 -206 -42 50 136 -120 102 100 204 -25 119
2708 119 2 -131 -13 -21 123 39 110 66 -13 25 -149 -88 240 27 -21 117 208 188 127 -241 -251 84 -76 191
2732 191 91 140 22 58 -92 170 106 -15 112 29 -3 -34 214 -122 -27 -129 -18 39 -46 211 -71 141 -133
2755 -133 -20 266 -96 23 22 259 106 154 148 -170 -15 225 126 111 -55 -21 -88 -28 -8 233 64 82 234 23
2779 23 35 -86 7 -286 -135 -83 127 -89 59 106 138 -144 -27 -103 107 -6 -118 -168 -15 -351 -37 -142 -43
2802 -43 42 164 -156 -131 -46 -34 -237 196 -64 -99 111 -133 124 -179 163 108 54 -60 -117 6 -1 49 16 -61 -4
2827 -4 -107 -59 70 -77 157 -49 -86 38 22 -91 -222 -153 -245 -12 46 138 183 147 123 94 115 -52 -73 164 166 45
2853 45 -107 39 -70 -36 190 -166 120 -204 0 -56 35 -189 -134 -14 28 -235 -187 199 160 -50 -174 -61 79
2876 79 70 -144 55 50 59 -14 112 -139 -123 -55 61 -314 -188 83 -34 143 -68 28 -76 -193 142 -4 -112 248
2900 248 -108 -184 18 -363 263 -157 70 76 -101 22 181 79 -67 30 66 -10 56 -54 -54 -72 -54 23 -175 15
2924 15 353 -38 -13 73 -180 -117 -82 36 -52 -242 23 -54 64 -132 8 33 26 229 -135 -114 -98 83 -59 -157
2948 -157 75 -36 139 -88 55 70 -24 6 113 -134 -191 -132 130 155 117 -20 52 -57 52 -115 -132 168 26
2971 26 68 -51 -28 1 -29 63 -120 77 41 -130 300 119 62 -52 150 94 185 241 119 -142 113 103 115 119 -14
2996 -14 43 -25 102 -54 155 -259 -24 13 -84 -103 5 -138 -135 -74 -21 -145 39 -49 -36 83 33 -52 -19 132 -49
3021 -49 49 -51 221 47 5 -114 76 148 -44 -133 -45 103 -85 43 -2 97 92 61 66 -104 -72 -7 -43 -9 26 95
3047 95 -28 368 134 -107 68 161 -88 -70 30 -219 -71 -106 -70 -18 31 -12 -110 138 -93 -92 260 67 329 133
3071 133 186 314 12 353 -114 256 -577 -289 597 -297 8 664 -67 -16 132 19 0 -119 -68 -4 -171 -202
3093 -202 169 -184 -27 -65 -152 12 -155 -146 94 32 -180 248 41 -155 19 24 101 13 266 86 -115 -72 -57 36
3117 36 -9 55 -68 177 -27 158 103 -125 115 267 -118 -165 124 56 7 90 -45 84 168 62 7 11 163 285
3141 285 -17 -103 48 144 173 119 3 -105 100 224 43 -107 245 148 113 209 36 -81 -212 164 188 -77 167
3164 167 53 -84 165 89 3 -28 -33 110 -14 17 11 -266 313 -107 -8 -186 75 348 101 329 77 -114 -97
3187 -97 -58 -84 116 -75 206 -56 141 35 214 211 68 25 149 37 -57 132 -89 -82 -124 54 8 22 119 -39
3211 -39 -73 -91 -103 -72 93 -37 69 -54 172 -17 -97 73 1 -208 -131 22 40 173 29 -60 -84 -202 247 187
3235 187 45 -271 84 4 -135 230 86 264 -67 49 -85 -7 43 -116 -77 35 173 -110 116 -99 40
3256 40 -10 -154 -272 -6 -180 -99 -70 -161 62 198 -136 77 179 81 71 -319 300 -76 37 72 99 -32 96
3279 96 4 63 240 -87 -154 73 145 -25 -95 -35 156 -101 -45 58 125 121 4 -106 -19 -113 -2 -29 148 113 -278
3304 -278 -87 -11 -4 -125 76 -234 168 -163 -47 110 134 -122 -216 156 99 133 16 -51 -118 224 1 23 -86
3327 -86 -262 123 17 12 -54 -66 96 -17 165 -42 -147 36 57 -38 153 -12 47 -66 -25 72 48 31 68 -95
3351 -95 -93 159 -149 279 22 35 121 54 -14 69 113 143 43 99 157 144 -118 -10 -49 74 -93 79 147 -85 140
3376 140 17 -74 36 186 -12 127 -64 84 -48 -210 -130 281 -56 37 65 -49 -75 -5 90 14 61 -3 6 71
3400 71 24 -90 7 -230 135 -26 43 389 100 -68 -226 46 70 -84 -147 162 -25 -165 10 59 22 -179 -55
3423 -55 -277 -64 -102 -169 4 65 234 117 101 258 85 98 -1 29 233 -47 24 -98 75 238 206 -57 58
3446 58 82 35 -7 -100 103 8 50 -99 -33 -252 -6 -6 189 167 15 60 142 -1 4 27 -107 231 -161 41 105 115
3472 115 -22 -35 39 66 -147 -115 -258 16 -43 -123 57 -70 -80 -71 293 -173 27 21 -23 -316 -254 101 -49 -247
3496 -247 4 156 -120 -84 -303 -123 242 -27 171 -45 -27 158 55 46 54 -298 100 344 -23 131 -143 62
3518 62 -115 41 29 -338 -104 -15 50 61 -117 -73 -72 -165 -23 -290 61 -19 -27 -148 20 -25 70 -61 127 -38 6
3543 6 -162 -165 -62 29 151 -19 -248 -95 -130 -42 -31 15 -154 129 -12 37 154 84 -134 -9 6 -189 189 131
3567 131 217 -9 -48 84 225 -69 -4 25 -22 183 51 -7 63 51 176 177 -153 -42 -133 69 16 -27 -50 -82 116
3592 116 25 -89 38 128 -28 -71 224 -105 -158 -178 -74 -81 40 -13 -69 205 -63 -159 -109 160 22 153 -261 -47
3616 -47 -134 124 -165 171 107 20 -48 -264 -48 -47 103 -108 -12 228 -2 269 -2 6 144 -22 54 -18 -71 36
3640 36 137 -48 88 -125 -19 210 91 21 -101 -127 121 -234 -77 -73 -250 -101 56 -18 87 274 78 -70
3662 -70 97 41 103 -64 155 -10 -169 134 -45 -28 186 -78 -38 -108 44 -123 -63 123 12 -8 152 1 180
3685 180 -101 -37 -32 -244 -136 93 13 50 15 54 -183 47 108 1 -285 159 144 -1 15 -6 -112 -284 176 23
3709 23 56 109 7 -138 -77 -119 -67 125 45 49 -185 -222 88 -96 161 -4 25 -47 53 -112 -99 -158 48 -18 -100
3734 -100 -98 113 13 -120 -136 78 -192 124 4 6 96 58 12 -348 -70 -210 146 -156 205 98 159 10 -135
3757 -135 -190 -27 -232 124 145 65 -117 -311 -111 152 -12 -60 -84 -180 199 -160 130 134 294 -32 -180 48 -59
3780 -59 274 -152 17 -4 -77 125 -30 45 -69 -56 -173 84 168 33 -12 109 -256 4 200 114 198 10 25
3803 25 230 119 -116 -70 -93 144 0 -129 -75 67 -94 -62 -27 114 81 152 3 -61 -18 3 167 70 21 226
3827 226 -273 141 120 43 108 141 72 -252 45 115 149 156 -141 -13 -88 167 -199 -156 105 101 23 11 51 -5 -187 -216
3853 -216 52 10 8 13 178 32 253 3 -85 70 -130 -87 198 -32 -155 90 -117 -133 165 271 152 -127 -110
3876 -110 -92 78 121 139 100 180 217 297 -158 -51 -236 134 61 132 233 -27 53 -20 -168 31 201 14 -284 -249
3900 -249 65 123 -7 -1 -68 168 -5 115 -208 -86 112 46 21 289 -119 -211 -139 -16 42 264 27 -197 -33
3923 -33 242 269 -91 -35 -179 -18 123 111 140 -105 -75 -19 -23 -96 -187 -87 18 -81 -123 51 -88 -51 61 -44 -72
3948 -72 133 -77 268 -94 2 -21 -76 122 -115 120 -33 -235 145 25 -175 83 -48 -27 -18 29 -202 23 64
3971 64 -153 -92 34 -1 157 -3 -84 24 -45 -56 216 150 55 241 111 -42 -47 14 172 -41 -41 171 20 -84
3995 -84 4 -19 -24 -29 179 99 10 42 -93 -108 -30 -9 203 131 85 -90 25 -189 45 15 -73 180 -9 -10 30 1 -116
4022 -116 98 -33 -118 8 -131 -43 82 141 -23 -84 21 123 7 -9 197 -28 247 -49 -106 190 189 127 127 19
4046 19 61 124 -3 -58 121 65 266 -61 -182 -62 -180 -105 -89 -159 -113 39 2 63 23 -86 43 -272 218 70
4070 70 -45 17 75 -22 267 -230 193 -127 156 45 175 74 83 -210 -18 -162 -22 82 20 -149 52 -33 -84
4093 -84 77 -87 -131 -90 -89 -177 5 -133 58 -21 -45 87 112 202 159 -56 63 42 -47 -153 192 -83 14 40 -60
4118 -60 -140 261 165 -89 112 -47 105 -73 73 -63 -118 37 -119 -130 158 98 33 -53 119 132 -89 52 -107
4141 -107 115 -138 -127 85 -39 -44 -125 67 -92 95 34 106 47 -60 -71 18 71 -49 -80 -41 15 -22 162 -56 -91
4166 -91 -7 65 -67 253 35 57 -187 69 -209 -58 144 -29 7 -164 -100 -199 30 -103 135 -12 47 207 90
4189 90 -11 -23 -51 -110 -4 48 157 60 45 96 -5 -6 -12 72 52 167 -7 -10 313 45 -230 121 -57 230 -85
4214 -85 -247 183 -165 154 248 235 10 15 171 7 107 -9 -28 166 -17 114 -164 -1 -2 -27 140 -29 40
4237 40 66 82 -17 -20 169 -20 -140 121 24 -151 -111 113 -66 34 -192 -21 -2 146 -121 -34 10 -159 73 59
4261 59 151 -38 -191 -60 -58 -225 -80 -116 -139 -27 125 -129 127 -99 6 32 173 55 -26 -54 -47 15 15 28 235
4286 235 -208 -254 -95 -148 50 -25 186 20 34 -96 23 15 83 -169 20 163 81 105 -26 -216 -103 -70 -78 -21
4310 -21 30 -26 -264 -45 66 -17 -80 -34 268 78 20 -6 -143 149 29 -43 2 -282 138 44 -392 -163 -70 -149
4334 -149 -13 -16 -167 -100 -104 -220 24 -124 18 23 -6 232 317 -44 -104 213 -87 -83 34 -35 61 184 74 -135 246
4359 246 223 85 -136 -144 66 64 243 195 -76 -178 -105 101 -207 43 -78 -97 89 -60 110 273 -15 128 -39
4382 -39 -36 -64 -287 -153 -102 29 -174 -110 -32 102 140 25 1 -166 96 48 18 52 -216 13 83 181 -111 40 56
4407 56 -27 47 63 -121 38 -28 -213 73 -75 -5 -66 -51 -133 -60 207 -136 -214 64 276 104 12 121 142 -35
4431 -35 151 175 -119 95 174 88 -89 73 346 12 -157 154 -41 6 114 -38 106 -130 51 163 89 14
4453 14 31 289 -127 -175 -90 -132 85 61 -202 10 -194 -41 98 217 21 -62 -63 320 90 63 69 -19 -25 288 75
4478 75 -138 -22 127 -101 -61 11 -66 -78 -22 -193 -228 -72 47 -104 -181 -45 -142 6 -26 -268 208 -36 84
4501 84 -258 -106 -181 -66 77 -60 15 80 -45 -151 -114 -269 28 187 -68 94 126 61 307 -20 -122 -85 -181
4524 -181 -120 108 -111 114 -70 -237 -182 90 92 -39 64 70 -204 215 141 -47 70 -92 -98 22 -115 79 -81
4547 -81 53 -135 50 -97 -95 1 -105 18 -11 9 83 -94 171 -2 26 -224 124 21 113 2 -101 219 155
4570 155 233 -167 36 -3 -102 76 107 90 -38 175 -171 -77 26 33 -2 4 29 -225 43 12 4 -38 144 48 330 44
4596 44 -201 14 -159 -34 -74 244 -99 106 -82 -398 -38 -191 23 -118 -93 -2 -24 80 96 161 -235 19
4618 19 -87 -3 -6 162 162 -272 -114 -17 -46 -134 -113 146 -134 31 -74 -86 74 134 -71 222 -34 -80 244 24
4642 24 62 -32 -227 40 102 107 -135 190 114 249 33 -77 216 146 -226 -48 37 227 58 35 -22 -3 59 -58
4666 -58 46 38 144 111 192 129 -19 -109 0 -84 -48 -105 3 29 -50 -162 -4 -73 251 33 -6 -171 -138 -235 -18
4691 -18 261 -301 25 -41 181 -49 -68 142 59 -49 158 20 103 -360 -40 9 131 92 66 153 -29 40 151
4714 151 139 -95 -34 -5 -37 -147 142 96 148 33 -5 -54 173 -57 177 320 57 -202 -29 40 -73 -81 -37 -8
4738 -8 66 70 174 -67 152 -72 85 -197 116 120 -8 94 -7 192 150 -53 139 74 91 -81 183 -80 -132 -36
4762 -36 57 100 16 49 18 57 -29 -104 81 -53 280 35 -27 -116 89 -134 -330 11 13 0 -49 119 65 -64 140
4787 140 241 153 -28 30 -48 14 -45 27 -44 218 140 70 -4 23 -14 128 -201 -25 -259 9 227 -213 6 -163
4811 -163 23 117 346 -144 -128 105 -10 -226 -77 -215 -62 71 -7 -95 60 87 29 -184 -85 -233 -79 -99 58
4834 58 154 56 -66 -80 88 71 -18 -41 64 -151 -52 16 -135 -54 174 41 -170 -18 264 39 130 11 87 35
4858 35 -237 -15 -13 -32 -90 48 143 -269 85 -51 155 58 -15 -64 149 30 36 -30 167 -72 -100 -93 -117 -8 169
4883 169 140 135 -209 -237 299 -41 -112 6 109 113 -68 70 -10 91 -249 -301 -183 -236 -81 -20 -27 -123 -333 -4 18
4908 18 -180 -151 -277 -111 19 146 -141 -114 213 17 168 -94 185 19 69 -142 -35 169 129 165 -21 143
4930 143 152 -118 46 317 270 -49 -49 45 151 18 -1 -86 -370 -204 -148 -224 -38 183 -119 -1 -85 44 -327 262
4954 262 174 -186 -96 92 -19 106 -182 -112 -101 229 105 331 -107 -64 -282 -94 -117 77 -9 72 22 -46 268
4977 268 89 105 13 -99 51 -11 161 40 -32 -46 102 -65 307 -204 140 173 -92 -55 -51 183 -153 97 -149
5000 -149 -36 -181 208 189 188 77 138 -18 45 -56 -211 76 -232 8 206 88 318 -35 -11 -299 -80 45
5022 45 -114 -12 134 -143 82 62 -71 -33 -29 215 -107 17 -15 -69 -256 -18 -56 -13 -15 189 9 -198 28 53
5046 53 -260 -180 -29 69 -29 -165 214 -92 -10 44 -42 -75 70 -2 40 10 160 135 -3 178 -162 115 65 178
5070 178 -72 93 79 62 79 407 -266 -54 90 -85 94 59 -18 -101 -46 -189 -218 -181 99 -195 1 -181 -206
5093 -206 200 69 -150 29 -101 86 140 -164 -35 -39 209 -207 0 -153 71 45 158 -316 -95 -13 -153 164
5115 164 52 10 -210 112 141 9 137 -7 74 74 95 -251 -242 -176 242 -70 -20 9 -105 -75 2 165 152 -58 88
5140 88 15 459 84 -15 120 15 219 130 178 -51 81 28 -77 -150 96 1 107 9 27 181 219 24 -78 144
5164 144 -91 -14 7 -116 -142 -56 -4 -137 -159 -11 134 144 -31 -5 -321 52 -143 -70 113 140 -179 129 -92
5187 -92 -36 -52 -119 -32 152 -207 193 135 53 -156 14 -213 -52 -94 -36 -236 -127 156 23 -173 33 53 -33 121
5211 121 156 -63 -173 28 -157 -117 30 -192 7 -80 -119 277 -171 28 5 -185 177 -97 102 81 -235 130
5233 130 82 146 -20 23 269 116 147 136 -162 -25 106 -67 -136 18 -144 -213 -95 -51 -28 159 43 -76 173
5256 173 -197 -153 56 -183 59 -62 -83 387 -118 -124 40 -22 -31 -107 -58 94 102 19 179 11 84 -144 36 -174
5280 -174 -221 239 -319 -10 176 258 -3 -84 10 82 -98 164 -70 -114 135 122 114 49 -135 -188 -109 -113 42 211 -92
5305 -92 -98 67 53 64 10 -143 -41 248 131 -17 -181 385 307 26 -322 32 22 -129 -204 143 -121 70 -12
5328 -12 -79 194 151 105 -72 266 -12 4 -165 104 119 21 -109 102 19 -64 -126 -63 35 64 -259 148 -308 -157
5352 -157 88 45 174 -75 173 46 -62 -142 49 144 53 -163 101 120 35 90 -91 -253 88 -6 136 -65 -64
5375 -64 16 60 209 189 -65 252 75 391 -28 227 69 -38 -153 153 224 -47 99 -336 -142 -13 -144 -56
5397 -56 87 -61 -6 42 -16 -39 -91 -197 112 19 64 57 -39 60 100 -71 52 -237 230 -284 25 -219 99 -134
5421 -134 -208 92 -68 -219 -45 156 242 213 1 87 -180 -19 -128 178 -49 123 -128 138 62 -137 -97 -119
5443 -119 -35 -39 -130 40 157 -20 -183 -78 -62 13 -99 9 -55 -31 -4 185 -15 -10 22 -189 -118 19 58 23 181
5468 181 -179 63 98 -92 -103 -88 76 292 -43 -67 121 -111 49 129 64 146 -131 -19 -18 16 351 -199 -114 131
5492 131 -274 39 66 -131 84 59 -135 -22 28 139 -18 -103 106 105 -175 -172 159 -161 151 -122 200 -11 161
5515 161 -2 123 116 22 -102 91 -130 8 -194 -9 -46 111 3 -116 -100 73 -38 46 -194 -36 210 243
5537 243 -30 -98 -15 -147 96 90 58 -138 -28 -59 44 -77 122 253 43 253 -141 -207 183 -15 -163 -191 -122
5560 -122 -63 -121 -50 12 -25 2 -152 -49 -155 -35 -47 20 281 -141 1 -170 218 -29 101 -99 -62 -52 140
5583 140 221 7 173 168 23 38 82 -127 206 262 49 -115 170 -123 62 24 21 -163 61 153 119 -197 70 -118
5607 -118 -76 -74 48 177 -53 12 -175 59 47 -293 -34 -78 -250 -185 14 129 -52 47 -20 7 153 -273 -9
5630 -9 -53 78 -47 1 138 130 -319 97 51 -30 44 -184 83 52 102 27 55 -25 49 71 -62 45 83 101 -115 191
5656 191 230 71 61 211 -44 40 185 257 161 141 -171 321 -177 -104 41 207 102 -290 46 165 115 -124 12
5679 12 66 183 -273 -27 -28 -6 51 -74 -186 -2 266 -47 105 -95 154 100 -136 225 -49 84 72 9 -199
5702 -199 50 -76 -98 168 -14 64 -18 -177 -52 56 71 45 -41 66 212 168 -10 30 0 17 5 -33 51 -152
5726 -152 -140 -129 251 57 25 18 151 -146 -89 -47 -121 -16 28 90 -176 30 58 -57 43 -58 156 121 -11 -152
5750 -152 90 36 -19 82 124 152 25 -109 -17 -51 -11 -126 -20 5 -384 376 -2 -35 77 74 -24 242 -46 -27
5774 -27 0 17 103 215 -26 105 139 -298 -117 92 -81 43 -90 -101 -25 26 127 -54 46 167 13 -42 -143
5797 -143 -94 -281 346 -209 -158 -235 -96 127 -16 -107 -123 22 -159 33 -153 -107 7 292 107 -9 -10 144 -9
5820 -9 -242 138 -122 19 14 125 29 59 -34 -17 0 -189 253 -44 41 78 -4 -142 60 26 57 -250 -108 -6 120
5845 120 27 88 13 24 -7 114 -83 -244 152 -71 -163 -2 -51 -85 56 -70 -115 106 82 23 90 -41 199 73
5869 73 -97 -24 -31 92 93 115 45 -30 81 94 51 -198 -209 -184 156 183 -51 33 96 29 138 123 -196 1 204 65
5895 65 86 9 54 -126 80 -30 -30 31 39 58 -140 -16 108 -6 367 106 -19 131 152 -79 196 45 147 3
5919 3 -233 -85 116 83 175 -85 -49 271 -41 -111 -13 99 89 -95 -95 35 20 92 -369 -150 -96 -6 -1 -56 105 105
5945 105 47 -46 -154 192 -73 56 98 8 -52 -162 -238 177 84 -51 102 -117 249 132 -30 26 132 77 12
5968 12 -15 71 -196 157 -47 -23 28 223 53 260 224 131 30 -63 28 91 237 70 208 -60 148 116 32 92
5992 92 -67 85 -139 -8 97 153 87 104 -56 -157 157 12 173 251 169 94 -146 7 -105 -99 -207 268 137
6015 137 139 -12 -42 132 20 29 -33 -106 46 -2 -212 -90 -38 -99 118 68 -181 31 -27 159 -176 31 25 38 10
6040 10 -159 105 -22 6 -49 -91 101 53 -65 92 14 42 -139 13 219 58 -5 170 5 122 121 42 -42 34
6064 34 -172 170 -6 89 -80 3 -35 21 229 -399 -207 6 -61 106 -61 -18 -233 -114 34 -121 135 44 -52
6087 -52 -142 113 -63 52 422 -183 -334 220 168 -67 46 -167 -270 -127 75 72 -26 -173 -43 -48 3 62 2 85
6111 85 60 -99 -173 43 149 -106 -106 35 202 -162 -18 20 -154 -123 40 31 -203 -229 185 68 100 -110 3 -3
6135 -3 -10 135 -48 69 -143 134 167 -178 244 46 56 -222 -97 73 139 150 -117 14 66 95 -2 87 -31 -185
6159 -185 -69 -56 89 174 -25 359 86 -227 34 80 145 99 -92 135 153 -79 69 50 127 163 152 61 97 -154
6183 -154 25 221 -215 -37 -29 -21 -32 213 132 226 -44 53 -153 166 85 -54 118 187 -52 -100 -71 108 -14 -126
6207 -126 -137 -42 60 180 -81 -92 72 -109 -203 71 109 -15 147 203 110 212 52 -106 -119 -18 3 -23 -214
6230 -214 139 -8 -35 85 -92 112 -28 146 322 -54 -140 -59 63 313 55 -28 43 98 -138 174 -118 -4
6252 -4 16 56 -83 13 -28 -291 -85 14 164 273 -230 53 161 -96 4 147 -74 -83 -51 22 186 82 125 87
6276 87 175 129 -94 94 33 -80 -41 -24 -166 -58 56 33 -20 -21 21 93 -15 -159 172 91 30 70 -8 -144 30
6301 30 138 -222 -28 -10 117 -180 -6 0 12 -7 -145 42 12 -6 -89 79 -300 -212 -105 -78 23 -147 33 -32
6325 -32 145 57 -99 -310 -35 -77 -122 138 -83 125 20 84 -1 179 63 -174 90 110 39 40 93 106 4 96
6349 96 136 -12 63 93 -62 38 113 93 94 -234 -19 -89 106 244 55 -54 -105 -208 -121 -301 2 44 -122 -127 -171
6374 -171 -218 -101 181 -114 187 271 -62 315 -6 -15 -75 -16 54 235 -340 35 -79 43 129 -74 -123 -44 -182
6397 -182 -202 -13 44 52 203 -46 -98 -79 234 68 -117 -46 -339 139 -81 196 98 -212 -234 6 232 -66 -166
6420 -166 30 49 167 21 -86 -36 29 -196 166 -24 196 112 85 128 113 228 53 -214 16 240 388 -146
6442 -146 130 -56 -13 -46 -5 -80 -46 -99 -69 -201 -188 29 -185 -36 122 -53 16 -129 -317 -4 43 114 -85 -153
6466 -153 -192 6 -85 -112 -50 164 12 28 -21 -51 275 129 19 -174 -82 45 -197 -225 72 163 -120 -78 -22 -59
6490 -59 79 -93 73 33 -76 157 310 31 -108 -48 101 101 36 -28 -9 -7 109 124 102 -28 -134 161 123 -125
6514 -125 83 22 -112 -199 -82 -51 3 202 91 214 -91 56 37 -109 -100 180 -32 60 -162 -106 -74 178 21
6537 21 233 110 14 35 -35 -175 73 30 -63 47 -109 42 108 -99 -153 -118 -151 -18 188 -67 63 -34 21 59
6561 59 -78 94 131 64 3 71 128 -135 97 -20 94 32 -103 -44 97 7 -327 28 72 38 -200 48 122 -61
6585 -61 -5 -231 297 155 -25 87 -119 -23 -2 -152 -123 -94 -54 196 29 131 -155 184 -106 -45 -39 57 252 154
6609 154 73 54 128 -33 -215 171 -146 -285 119 29 245 -145 -80 -104 -113 146 44 -63 38 46 -19 -20 -93 162 -145
6634 -145 149 -201 -66 128 39 148 -131 -164 24 -79 -66 20 88 37 223 90 -246 -67 -3 158 57 -123
6656 -123 -244 -41 9 44 86 -72 -96 291 52 86 -86 74 84 154 -37 99 -42 -125 -272 243 -55 -55 317
6679 317 14 106 110 -42 -68 33 137 -117 61 -25 83 34 -120 -300 123 -24 335 -30 263 23 -119 80
6701 80 175 60 -165 -81 -49 -282 -38 119 -91 11 44 192 -334 63 130 -292 -10 188 9 110 28 117 116
6724 116 32 -198 166 34 -20 -235 61 -140 -44 102 111 79 -47 -31 10 -54 77 101 145 -81 14 7 -185 118 61
6749 61 -69 36 51 37 123 241 75 -34 -42 188 95 -81 27 29 -2 -90 10 110 174 -57 83 -64 -132 75
6773 75 353 38 71 76 -119 -113 -68 -21 -1 80 -68 0 -42 -90 56 -72 123 28 157 25 90 153 197 35 162 163
6799 163 109 95 -169 -139 287 -210 -78 -220 -40 -31 274 161 11 -122 -165 44 100 236 -118 212 -54 -89 12
6822 12 60 -151 20 1 -178 65 -139 -30 261 -28 22 353 159 64 121 181 7 5 -314 219 -122 13 -104
6845 -104 43 -26 83 -68 84 -106 53 15 72 84 -10 -8 -93 99 -78 52 -150 84 101 -133 151 61 35 169
6869 169 -157 -189 79 -36 -13 -35 49 120 -261 229 123 34 73 -133 -124 -7 34 132 148 110 57 102 36 148 7
6894 7 23 76 47 -165 -41 3 41 -94 -135 105 176 82 1 211 180 -160 -198 -85 88 -1 -27 -31 -23 -62 48 73 -26
6921 -26 -126 21 28 25 -93 81 302 -42 -7 61 195 -57 11 38 39 -172 91 65 3 -213 61 -35 52 205 -81
6946 -81 177 67 -144 159 74 -153 9 137 99 32 60 -104 20 24 84 87 117 -109 57 183 -57 119 -36 -238
6970 -238 59 -148 -62 64 -238 -31 165 -90 -311 260 29 -46 130 170 226 95 -57 -128 76 -82 -42 -141
6992 -141 -21 88 -7 -60 198 -1 44 313 -74 -100 24 23 -76 -152 23 110 -204 185 -181 129 348 44 347
7015 347 -121 90 9 -13 -156 10 120 -9 67 -115 73 -45 -142 241 -122 -195 58 -28 39 168 -15 -136
7037 -136 -4 131 26 97 -77 129 -15 -274 20 74 -144 -93 273 -151 -86 -95 5 98 -279 -58 -10 239 17
7060 17 141 -9 195 -156 118 132 174 251 -34 9 -95 30 13 -207 -70 91 -89 140 187 -129 52 221
7082 221 -25 86 167 -96 211 -36 220 -319 -49 88 -20 -35 -107 -7 49 -44 -111 -30 148 243 -140 -45 140
7105 140 -202 48 55 12 120 109 -39 114 126 -32 204 65 -14 54 -144 186 70 -174 -210 -127 32 -68 33
7128 33 85 -18 54 -122 21 -47 -6 75 -200 93 -31 21 -103 66 -57 -49 191 -8 276 -13 217 29 289
7151 289 14 -59 -7 -237 102 234 107 -64 237 -149 42 112 -91 175 -203 36 -195 -72 53 -116 -128
7172 -128 -79 261 78 184 13 -161 83 21 -202 -234 212 47 228 -139 176 -210 -17 76 -27 -101 -93 -30 9
7195 9 31 -123 -10 -198 -70 -24 21 87 32 108 -76 81 -37 26 -70 -208 -120 -25 -13 38 68 -15 292 -119 -110 59
7221 59 274 -8 -74 -115 27 112 32 19 73 3 -62 -78 27 84 63 10 85 152 -118 26 -59 -119 -13 162 185 38
7247 38 -88 230 -38 -27 6 -95 -111 103 98 49 61 -33 98 -14 -58 -107 -77 62 54 -57 60 -13 -36 77 -71
7272 -71 175 206 83 -76 -229 70 36 -78 -124 139 -4 -153 -241 -80 172 100 -63 -159 -27 140 193 157 -143
7295 -143 82 -23 23 37 -28 -201 -55 70 139 -65 -53 156 -21 -25 -17 3 162 265 91 -268 300 1 103
7318 103 -49 54 -59 -4 -194 36 12 -116 66 -159 -125 93 -25 -10 -154 109 29 153 28 -44 173 140
7340 140 131 -53 24 -125 78 201 -58 143 38 -95 27 46 -79 -152 -146 -123 63 29 44 99 -83 25 236 7
7364 7 -75 -157 -35 243 49 171 -78 -102 -180 15 -202 66 -35 -52 259 81 115 165 54 1 23 112 164 100 141
7389 141 6 64 -163 128 -224 71 -47 -201 -46 -177 98 143 67 -64 46 5 -147 -53 -107 69 111 -112
7411 -112 107 -181 -324 61 85 27 -153 98 -24 -305 -25 2 232 74 106 -29 154 125 125 81 78 81 132 -16
7435 -16 -44 -45 87 -76 70 46 -107 -376 161 -36 165 61 382 278 -62 -73 -123 89 21 -151 -68 33 41 -9
7459 -9 115 103 -53 193 60 156 -73 -104 -99 170 -110 38 118 290 131 -139 122 -194 3 -212 23 36 -337
7482 -337 -11 119 -65 -189 -92 -75 -41 -22 -113 -18 167 -90 -233 -123 -246 41 85 -104 140 360 -79 -10 173
7505 173 33 171 -126 -123 -4 -28 -73 -232 -57 169 -122 -153 89 -17 -111 170 -19 91 206 -141 16 -106
7527 -106 -96 24 -3 -315 59 -107 317 -12 81 222 -29 -30 13 -60 -242 123 -138 -147 14 -84 80 -122 -57 -232
7551 -232 106 36 -86 184 -78 -49 136 323 -57 41 62 247 78 40 67 67 303 151 -164 30 -152 29 -21
7574 -21 -129 -31 43 81 295 35 49 -88 -156 -149 -138 -69 -119 -285 109 -280 -14 -51 -79 28 -118 -287 6 202
7598 202 165 31 43 56 59 59 -302 103 94 175 228 11 -48 150 171 25 10 -88 129 -165 -11 49 -50 207 -79 -126
7624 -126 -237 158 -91 81 71 -68 -58 49 -122 11 62 -27 -74 2 2 -101 268 -46 21 62 52 -72 25 -166
7648 -166 -270 222 13 -328 -129 -234 -133 28 -52 -54 -368 -200 -76 218 -16 -8 1 -24 51 -108 65 85 -140
7671 -140 -11 114 -101 28 -79 231 -224 -175 33 18 -130 -144 82 36 5 124 33 -1 171 -36 327 121
7693 121 90 -179 72 -73 -190 -137 26 43 203 24 19 -51 39 74 103 -23 111 -61 56 231 -111 -33 99
7716 99 377 -245 247 -80 -2 -59 83 -302 -112 -73 -50 -6 -176 -104 49 160 -103 242 -104 162 -8 -63 -147
7739 -147 13 178 37 -68 -121 49 200 85 -124 -107 32 -75 -84 -170 19 37 -308 -103 155 -2 -38 158
7761 158 -91 75 76 54 160 26 25 132 -30 37 41 -51 121 132 -48 -52 152 -9 92 14 -21 -198 298 29 -57
7786 -57 180 -1 97 58 -138 -199 55 118 -11 -27 -134 -89 250 108 59 -92 189 -91 -3 87 258 -111 -143 192
7810 192 113 -360 -99 -2 -2 -43 -166 108 101 211 -13 -11 169 91 86 -274 -40 -282 23 43 147 -269 130 -100
7834 -100 -179 51 173 165 129 51 123 -156 -10 -161 -76 231 -56 107 53 -123 103 -46 56 79 -47 58 -166
7857 -166 136 48 -35 195 -161 96 30 81 -65 4 124 -69 6 11 -120 160 -20 28 337 -54 -153 -67 -151 -34
7881 -34 -113 -383 56 -88 -168 -115 66 -227 222 186 148 15 257 -50 153 -131 142 126 -61 52 -63 -6 171
7904 171 134 -47 57 267 79 -178 -48 69 -262 81 147 80 72 -25 35 -13 -78 34 293 102 214 -121 298
7927 298 209 -17 79 158 17 193 -133 158 218 166 -123 97 44 22 55 -124 79 -80 148 184 -80 148 -79
7950 -79 104 -28 -227 -320 -14 23 -109 149 -71 -72 49 -113 -324 156 -77 43 49 -185 31 -85 48 -205
7972 -205 -75 138 32 -106 48 95 -14 78 -30 82 -97 108 -45 23 59 14 -8 -52 -19 41 -96 -65 76
7995 76 -239 -23 -36 -83 12 235 -23 132 -144 -74 51 114 121 -2 94 30 141 44 123 -110 132 29 -45 199
8019 199 72 168 284 76 -228 206 141 -7 98 71 -43 -49 -351 -57 84 0 22 79 52 -40 -127 66 178 -238
8043 -238 64 89 73 -83 -8 -39 -263 -98 94 186 62 83 -239 206 -153 -38 -164 -2 34 -258 -91 -65 8
8066 8 135 -257 -45 -66 -85 -21 182 102 109 101 134 -84 0 -51 -96 -3 -35 -173 -124 173 -102 45 151 120 12 46
8092 46 -2 -100 -51 166 -44 -62 -331 -8 137 -200 21 -123 -104 62 5 -145 -74 6 -297 -105 -91 -108 -166 -75
8116 -75 -89 -2 149 37 -40 -214 28 -183 121 -261 -153 22 116 -231 -171 -4 162 -15 -85 50 122 42 42 31
8140 31 69 -132 12 262 18 70 68 14 -185 45 14 -38 60 7 147 199 66 63 6 -144 -37 178 -157 -64 212
8165 212 108 76 22 -163 -41 -4 27 72 56 248 214 14 -32 -56 52 46 -330 -26 165 -111 -99 -126 138 -93
8189 -93 213 -83
8191h3
$$ Imaginary data points
##PAGE= N=2
##DATA TABLE= (X++(I..I)), XYDATA
0 0 0 0 0 0 0 0 0 0 0 0 0 0 0 0 0 8 -8 8 -8 8 -16 16 -16 24 -24 32 -32 40 -47 53 -61 69 -78 87 -99 111 -125
37 -125 141 -157 175 -194 215 -239 265 -292 324 -355 394 -434 478 -526 580 -637 704 -777 859
56 859 -955 1064 -1191 1340 -1518 1740 -2019 2381 -2876 3596 -4749 6889 -12243 56119 84749
71 84749 36920 76659 43937 32967 34292 28632 16852 30936 19399 20190 13965 20623 20056 3036
85 3036 9456 7827 1550 -4729 -4246 -6908 -12812 -5100 -10328 -13837 -11377 3430 -13522 -8637 4598
100 4598 -8428 -3887 275 -9032 -11107 -968 -13273 -11666 -9531 -7534 -2322 -11825 1752 -1884
114 -1884 -3636 1770 -2534 -7635 -2720 -3625 -12380 -7794 -10588 -4573 -10926 -6345 -1040 -7442 2850
129 2850 -8 -3588 -1883 3146 -6261 -4385 -3313 -6879 -1842 -7427 -313 -2214 1220 5049 3396
144 3396 3575 8067 7498 409 6899 -294 3180 877 -980 3502 -228 6270 5351 4896 6544 10793
160 10793 4068 5803 5098 19 3822 -3793 -183 -3420 -2284 -284 -2870 -1483 1233 1781 -2446
175 -2446 3186 -2470 -9 -1753 -4931 -3412 -7574 -3726 -6668 -5831 -4939 -201 -3659 -661 2155 -2218
191 -2218 3498 -1768 -301 -2608 -2262 -2098 -4087 -3178 -1082 -66 -2669 3929 -847 2305 3203 -97
207 -97 2143 -610 1596 -1958 -1544 -2100 -450 -3324 -630 539 -2786 4056 -47 1365 1160 1459 573
224 573 -1009 -185 -1168 -398 -2092 2374 -1713 1957 3641 313 3904 1875 2958 1016 1924 -409
240 -409 834 -391 43 1148 -1932 3736 -864 742 1536 594 234 -79 133 -1860 30 -2951 -395
257 -395 -3199 -838 -344 -3182 810 -1424 -505 -1197 -72 -2235 -618 -1568 -2507 -755 -2929 874 -2534
274 -2534 46 442 -333 743 375 486 -725 1801 -1562 1158 -821 305 1262 -1023 2594 323
290 323 2120 1639 2253 571 2391 1348 -70 2117 -937 2105 -291 987 1292 385 1702 1070 1581
307 1581 386 2359 -1166 1516 -264 -741 361 -1879 630 -1210 250 -381 368 -610 688 -228
323 -228 -1144 990 -2648 -136 -1985 -1515 -1156 -1615 -811 -1013 -132 -935 1322 -1501 1098 -330 -1170 603
341 603 -2123 -74 -1575 -362 -639 290 131 1322 1379 274 2592 -671 1744 -238 -219 20 -529 217
359 217 64 853 -52 2135 -95 1776 937 261 1817 -654 953 -915 -299 -650 -297 -872 -73 415
377 415 -493 1971 -262 1517 469 178 167 -1002 -512 -1712 -1117 -2178 -427 -2312 -275 -751 -1389
394 -1389 725 -1179 -89 -1245 -1054 -1858 -1881 -3034 -2802 -1973 -3076 -745 -2691 -379 -1081 -840 -363
411 -363 -1123 -666 -1799 -848 -2276 -1146 -2467 -911 -1222 -1917 366 -1138 608 156 1005 228 818 508
429 508 228 459 -550 1270 -451 1496 1130 1056 2387 1803 2248 1456 2517 816 1736 623 1100 1071
447 1071 -124 1575 -130 1252 649 939 539 1055 494 168 1127 -330 776 -705 82 -47 -584 359
465 359 -44 722 474 1464 337 1478 584 609 689 -852 429 -882 254 -338 6 -9 544 48 -344
484 -344 466 -1356 102 -1516 -1170 -1342 -1950 -1014 -1776 -1187 -1444 -728 -1617 -468 -1366 -1105 -341 -1857 -83
503 -83 -1329 -299 -678 -456 -280 580 720 537 1993 767 2295 1172 1844 2088 1321 2034 1297 1922 1152
522 1152 2184 1500 2489 2174 1769 2527 1146 2342 720 1305 791 577 118 266 121 -360 861 -269
540 -269 705 -112 220 201 -394 -38 -807 -662 -922 -594 -1477 -417 -725 -1022 249 -727 -187 -624 84 -484
560 -484 -646 -655 -904 -996 -1387 -380 -1522 -132 -227 -183 118 -3 174 -359 327 -777 -392 -873 234 -437
580 -437 -489 34 -711 412 185 671 347 794 895 724 804 489 871 -264 985 548 385 1402 1157 1604
600 1604 1071 1955 1178 1784 1411 1430 912 386 1410 -155 1171 790 858 937 880 878 504 1020 487 654 -392
621 -392 112 -441 -873 -319 -1232 -424 -698 -391 -720 -48 -202 -388 -67 -670 -21 -1172 -498 -705 -883 -604
641 -604 -332 -320 -695 497 -145 568 -80 594 231 -36 305 -657 -158 -268 -224 -431 267 103 162 787 191
662 191 913 -47 448 205 -44 68 -43 -126 -197 336 -278 767 331 509 540 251 681 -108 389 -25 -98
683 -98 -404 146 -275 -419 475 34 707 138 597 140 45 89 -301 176 -409 -218 -655 254 -465 -397 307 -314
705 -314 220 -111 39 -220 -351 -407 -332 -574 -508 -127 -956 -164 -453 -68 -106 -218 261 -240 203 -62 -157 -303
727 -303 107 -619 -505 159 -215 359 -27 199 113 504 154 30 186 217 301 -289 362 -194 94 160 33 311
749 311 377 494 283 531 -29 354 266 303 255 -254 301 87 -18 120 207 152 -12 576 -316 185 -191 311
771 311 -306 -185 -173 -502 -253 -121 14 -420 74 -133 82 -218 -356 -91 -220 -49 -540 -282 -112 -114 -387
792 -387 -311 -53 -223 351 -54 120 -27 -153 99 -302 -98 -361 -56 -169 54 79 205 350 -47 509 -75
813 -75 194 -104 136 83 109 226 41 498 -79 313 -167 76 122 354 531 -40 478 -102 -52 125 -52 33
835 33 -63 227 -110 19 -88 361 -35 26 17 -5 141 -304 -9 -621 -1 -167 -29 131 -132 53 -323 60
857 60 -306 -111 -245 38 -250 -590 46 -308 -27 -325 -19 -170 -94 -21 -295 6 -192 -64 -307 327 -421
878 -421 -209 135 -43 27 20 315 64 -14 85 -150 -118 -33 362 32 96 -249 137 145 229 279 444 247 104 363
902 363 44 196 1 157 205 -165 352 20 97 212 339 250 139 331 165 120 -163 323 -191 -448 -50 -210
924 -210 116 -87 264 -240 -167 -139 104 -93 -340 -84 -382 -243 -273 -307 -439 -149 -135 135 -87 -311 -307 -136 215
947 215 -210 -319 -145 -331 -210 -76 -30 -157 51 -323 215 74 33 385 4 95 -212 199 -236 148 92 214
969 214 254 133 609 -23 364 51 398 -24 26 469 103 484 -90 69 36 251 426 231 183 364 388 186
991 186 190 173 59 29 54 148 -20 386 -4 134 118 -22 159 25 21 -178 173 -406 146 -185 -327 -183 -190 -96
1015 -96 -316 410 -51 -29 -182 -85 -187 -213 55 -69 -125 -454 63 -460 -231 148 79 94 -59 323 -271 213
1037 213 99 105 347 -548 41 49 435 184 429 357 390 621 -58 346 80 388 109 345 332 105 274 277 203
1060 203 242 276 259 180 162 193 224 3 132 -114 59 0 28 -75 223 54 -104 183 11 118 -265 64 -178
1083 -178 -76 -151 -276 14 -242 21 -313 67 -234 -42 6 -524 89 -363 179 -218 -436 -261 -275 27 -122
1104 -122 93 -259 59 -91 52 -27 86 100 -95 410 7 46 -366 70 7 68 273 110 332 203 371 -234
1126 -234 160 -64 -66 521 -192 265 134 111 392 256 320 197 121 83 242 -216 220 -101 -117 144 -14 259
1148 259 -105 56 63 -25 -92 -48 147 -213 -131 -118 60 -415 101 -113 81 139 91 -38 -216 -335 -346 -32 -224
1171 -224 -401 -442 -471 86 -247 273 -89 120 -124 -110 -324 -169 64 99 -414 217 -788 94 -404 -475 46
1192 46 -163 59 -92 47 255 320 -82 423 -11 80 -254 185 -142 149 23 178 113 252 221 23 99 41
1214 41 -60 -10 -11 142 78 233 268 256 97 205 115 -47 32 -233 -114 -254 7 -417 29 -84 -324 -61 -32
1237 -32 46 -182 -42 33 -146 -72 -348 -143 -359 -183 -456 -238 -267 -184 21 -139 -14 -339 -179 -388 8 -185
1259 -185 131 -2 -203 2 -206 135 10 281 -204 151 313 210 172 94 216 -28 178 266 196 188 -91 416
1281 416 134 370 -133 334 80 98 237 88 444 54 259 2 124 50 83 78 -17 288 29 131 -43 114
1303 114 53 22 171 -85 29 -14 8 -401 -111 65 -28 -162 -563 -44 -179 206 -21 7 99 -242 -52 -70 118
1326 118 -132 10 -199 -138 -211 -186 42 25 -56 -34 -278 47 -106 19 31 -23 -35 199 -14 179 256 148 193 171
1350 171 113 -121 25 162 296 156 126 229 70 255 -51 58 -25 -81 -75 33 -15 79 221 -71 -59 123 25
1373 25 -98 -51 -216 -82 -396 -149 -76 -298 140 -94 -196 58 -5 -70 -11 28 -142 208 -46 -74 -64 -65 -111 -82
1397 -82 -29 -17 63 -46 84 234 -13 50 -118 -160 -179 -43 -122 134 -146 192 171 29 213 143 164 -13 62 -68
1421 -68 -115 218 -42 278 -37 359 28 323 -111 139 276 -26 -23 25 1 -131 102 -31 43 120 29 -104 -98 196
1445 196 60 87 -31 189 -84 67 233 -290 64 72 -137 -221 -326 104 -158 138 -13 -48 -311 -98 -111 -326
1467 -326 -143 -200 -47 -67 -90 -40 -51 -139 -122 101 -68 -55 -226 -265 -336 -217 -81 -106 36 -79 213 219 85 97 60
1492 60 14 274 208 -91 27 91 72 -184 125 51 170 12 237 418 216 310 -154 199 119 105 503 -135 314
1515 314 -250 315 138 250 241 183 39 36 -1 -29 97 -90 -87 -143 13 167 -25 261 -126 -208 -53 -150 -42 -147
1539 -147 47 -374 -105 -242 -67 55 29 97 -129 -24 -48 52 -217 12 312 -422 -265 -289 108 -228 72
1560 72 -48 -53 -80 -104 27 -86 125 -175 87 -18 -16 -198 357 269 26 370 33 143 -63 227 261 106 203
1583 203 226 332 -223 -92 58 86 239 167 325 -86 82 -25 294 103 3 -74 -234 402 -107 75 59 -97
1605 -97 -194 -189 166 -158 112 -106 -49 -220 79 -81 -75 -202 -408 -6 -356 -8 117 225 -157 128 54 -381 336
1628 336 -12 -82 -117 75 -187 44 71 -267 272 -14 68 -92 437 -82 -10 306 -50 268 -20 141 212 38
1650 38 34 176 52 -100 166 -11 -31 252 95 32 25 -70 48 281 -63 158 175 118 -60 156 -40 103 56 -93
1674 -93 132 -140 -92 -138 77 246 169 134 -44 -40 -295 12 -321 -175 -94 -63 -110 -286 -228 -185 -121 -143 -190 -133 156
1699 156 -276 -288 21 -208 -347 -320 -218 -73 267 60 -218 238 -208 165 111 -51 123 -17 -26 -8 -18 53 9
1722 9 110 17 130 24 27 -68 99 -173 -127 90 172 40 53 44 -14 -116 -35 396 95 72 114 -125 -210 -143 -39 152
1748 152 -4 22 0 -33 -75 91 -337 70 110 9 -25 -196 -259 -170 55 -112 -190 -206 -163 -51 -17 -5 -297 92
1772 92 -13 -228 -77 55 -59 -258 340 -78 245 -54 -235 -191 127 157 -86 88 -46 210 79 79 -26 213
1794 213 179 -18 187 -2 264 101 100 32 228 206 -113 97 -152 15 -158 296 -20 -273 369 108 79 -5
1816 -5 264 70 -15 -175 -16 293 -151 -74 -54 -173 -58 -113 86 -112 -203 -314 -137 -176 -110 -203 -248 -241 -304 188 -202
1841 -202 -73 -186 -31 -205 10 95 -212 -78 -147 -96 -193 75 -140 69 -54 -130 -280 105 259 -70 -30 -284
1863 -284 153 -110 73 237 -20 415 333 272 138 278 191 202 108 106 285 340 99 140 226 -167 241 164 385 311
1887 311 -272 105 211 -32 197 -22 229 -153 451 102 300 15 119 18 -103 84 -100 168 -201 231
1907 231 -233 -203 -284 -144 -184 -170 155 -215 113 -171 -221 -66 -164 -124 -205 -143 -108 28 -194 -105 -120 -296 4 32
1931 32 37 -70 23 -77 -27 -180 -61 92 -183 76 -52 -22 100 71 108 -5 19 118 91 80 169 14 -70 102 97
1956 97 130 158 277 -25 42 313 -89 172 -8 -9 -93 211 -57 -153 -88 -196 -60 -81 -1 -340 63 -54 104 -100
1980 -100 182 94 -137 135 -110 -284 -340 -162 -123 -282 135 -94 -79 -3 18 -48 -69 -110 35 184 3 92 -132
2003 -132 -22 174 1 -250 -147 -140 0 -97 -23 47 -32 94 -110 117 -57 -6 -222 -27 265 -80 262 103
2025 103 161 -20 107 157 76 244 64 185 91 -39 171 -90 260 -169 -44 164 93 -58 -54 -95 123 160 -106
2048 -106 -220 103 101 -128 -63 -123 -170 -124 -351 16 -138 -167 -104 -42 1 -120 -65 -112 128 54 65 -112 -24 -281 -173
2073 -173 -92 -177 237 -126 11 -73 65 77 137 307 2 -96 -101 -156 72 285 146 -101 -25 -45 109 142 112 0
2097 0 -92 82 121 8 133 88 -60 -18 68 91 262 136 226 206 -19 44 -180 144 -27 21 -38 109 -383 -114
2121 -114 -58 -97 -194 98 84 -159 87 -361 111 -185 84 -73 52 -5 -354 -16 -151 -149 3 -87 126 -56 175
2144 175 -38 -91 -215 -125 -100 -123 3 -64 103 -114 106 26 101 -115 271 -104 63 164 48 108 -147 204 241
2167 241 123 -89 413 -21 127 186 -124 38 20 72 -1 -147 -51 55 125 48 53 168 -156 272 95 -37 -40 -6
2191 -6 -142 -47 108 -168 -84 -190 -26 24 -51 -47 0 -229 -48 223 -120 -16 -170 -23 -262 48 -42 182 -57
2214 -57 -57 21 -284 163 -270 51 60 -131 -357 81 -101 -100 95 -246 17 -172 -8 -38 109 -47 -57 204 -7
2237 -7 167 -33 98 142 -80 84 60 269 -147 80 109 -48 20 89 -49 -178 77 -147 228 -220 109 99 238
2260 238 142 -102 -72 -209 -189 -10 182 -130 -102 -60 -81 375 131 -251 6 -190 -67 -32 -214 -23 50 -62 -176
2283 -176 -47 105 83 54 75 -105 -172 -238 -110 110 96 45 -193 35 87 10 -104 145 165 -101 -238 145 59 236
2307 236 57 121 195 82 -4 113 53 78 -47 -39 -77 146 0 159 226 70 86 98 38 -79 129 156 98 84 -17
2332 -17 89 -176 -231 7 239 43 -30 4 -39 174 -253 189 167 140 -26 -117 -11 33 -48 69 -54 27 119 111 86
2357 86 -24 20 -99 80 -66 -143 -197 237 54 -89 -69 -354 -76 40 -69 63 7 246 123 -50 -60 54
2379 54 -121 -23 71 -124 57 -5 17 -61 12 33 176 11 -87 94 -143 -71 -73 -149 110 -2 15 1 -99 27 -55
2404 -55 330 93 -155 -3 -66 167 -17 -124 -77 64 106 147 -233 144 -27 -221 -142 -51 243 -109 173 -221
2426 -221 96 -175 -62 150 9 53 -40 -188 -25 -69 -47 -107 -127 -144 263 196 123 146 -87 -332 170 77 -145 72
2450 72 -57 8 169 51 174 -74 84 307 40 104 153 -46 -31 208 129 -107 145 143 -56 197 115 -169 256
2473 256 359 139 111 145 -47 -49 30 64 -65 121 33 159 -107 23 -108 79 27 -16 -49 -17 -94 -38 -6 -44 140
2498 140 -213 159 134 -12 -104 13 246 -285 -75 245 -5 -34 -59 -12 40 197 -178 -32 98 37 132 78 9
2521 9 162 114 -94 -154 -119 67 -5 19 -55 -11 159 -103 -135 -156 28 -181 35 166 155 -22 159 -72 29 38 148
2546 148 64 -126 29 102 248 -37 15 80 -93 -297 149 159 -35 -428 -61 19 -126 47 124 55 -3 -158 16
2569 16 -115 225 195 -231 203 -36 -72 -94 -35 -230 -206 -168 -102 -121 74 368 87 83 -14 98 -66 377 -48 37
2593 37 56 18 47 228 88 55 35 -24 232 109 -6 -259 109 66 11 105 -299 -14 -207 -55 -108 -81 -103 116
2617 116 -115 -14 -25 55 259 -30 -13 -68 -61 36 -177 -62 15 34 0 30 -16 -109 -67 -89 -52 110 18 10 27 62 -7
2644 -7 -56 99 -111 69 76 79 50 211 -43 -200 -79 201 21 -235 60 -74 48 310 36 20 86 -113 -175 196
2668 196 129 17 314 161 -95 228 118 51 -106 -30 21 252 217 137 -108 -6 -109 -61 16 -105 -16 269 5
2691 5 152 100 39 180 -89 -5 -249 15 120 -29 -19 39 -52 156 -16 39 92 85 88 -35 150 278 159 83 -91
2716 -91 70 130 -57 -198 320 194 -117 51 51 86 -52 -150 192 -103 37 44 -50 55 -47 -242 -87 223 79
2739 79 -84 15 72 -77 -2 -72 -77 -134 -55 -108 119 193 -13 -38 -73 51 72 222 36 118 16 -209 149 166 156 17
2765 17 238 177 -203 52 60 101 -128 84 14 -144 -98 -5 180 -193 238 -120 -58 120 272 120 385 -120 -63
2788 -63 196 -4 -51 112 51 357 138 -51 -68 -187 155 4 103 113 -11 -39 -39 -154 -50 197 141 123 76 235
2812 235 -86 -142 91 -25 -59 -455 -118 159 -5 145 -116 59 23 227 -162 136 249 17 9 -4 31 135
2834 135 -329 123 170 -333 -136 -134 81 -224 21 34 -315 8 -140 -65 307 -56 60 -73 188 -210 235 -272
2856 -272 96 -94 90 -181 -10 266 70 38 168 74 -11 -17 91 -101 47 -131 34 131 0 156 125 49 17
2879 17 50 -213 120 143 30 -82 -188 -57 276 -226 -7 -61 -11 -123 102 -84 -35 -49 114 82 150 -235 174
2902 174 145 143 -49 -171 6 52 -306 -157 2 -227 -75 -22 -63 -119 107 -34 188 172 5 231 -122 -275 -96
2925 -96 -288 -132 18 -117 -78 -54 -196 46 -183 52 -216 -86 -95 102 45 -117 -104 41 -109 -14 -51 -222 131
2948 131 -71 -36 -24 127 -173 166 110 -69 69 189 -72 -63 -18 20 337 -203 119 -82 -21 -57 -99 20 -244
2971 -244 -174 -129 3 -72 34 290 -232 105 39 114 75 173 -87 -31 27 -33 50 -135 316 -36 270 -25 100 51
2995 51 41 5 20 -11 149 67 111 158 -35 -77 -15 -72 -37 117 13 -68 -86 -53 -30 -125 -117 128 -176 55 -100 -16 -27
3022 -27 -64 -54 106 -77 48 78 -31 43 208 61 -100 -88 82 294 -198 -72 231 122 -235 139 9 -156
3044 -156 -117 -64 153 47 -43 10 100 -206 -8 119 -129 21 -74 34 89 39 167 -298 -310 -344 298 391 194 -290
3068 -290 115 149 -47 15 285 -98 14 -150 491 175 -536 648 749 -306 -109 79 -367 -227 10 189
3088 189 -25 -154 38 -65 245 -107 -343 123 -146 163 20 -240 172 -116 -44 -22 7 -77 -97 167 -6 97
3110 97 124 68 -48 210 228 -34 31 163 -36 -62 -185 34 -42 -37 154 12 -28 27 -2 -89 -22 217 260 374 132
3135 132 30 95 181 81 145 -69 7 61 161 -81 46 64 -161 102 8 -105 -21 151 118 -41 -113 -181 -45 -63
3159 -63 27 76 275 71 93 291 176 29 19 42 -19 -165 -67 -10 -160 -21 139 -48 -248 -156 -111 -162 242 -116
3183 -116 -132 85 126 14 159 267 58 83 -5 177 119 232 60 -84 46 -61 251 -35 -24 -103 20 -60 107
3206 107 14 -211 -99 -161 -127 38 -150 -52 24 73 104 36 220 -38 158 -122 -150 -355 102 -40 -37 -38 -73 131 -65
3231 -65 66 -100 -109 103 -110 -79 -37 -21 -155 107 156 76 -6 32 -33 -100 -138 67 -87 -48 174 11 156 15 74
3256 74 -56 160 28 123 -41 12 48 104 -83 165 26 61 110 135 149 45 230 123 74 254 -20 16 111 60
3280 60 -163 -74 187 64 -49 -219 -255 -78 70 -119 -15 50 120 56 -85 38 -50 18 -62 -25 222 242 -28 47
3304 47 178 -175 -79 263 -283 -104 132 88 -86 86 131 -223 174 29 106 -11 93 -41 -53 -130 19 113 -110
3327 -110 -356 70 -121 -236 202 -163 -136 178 282 100 -155 143 98 110 65 -144 45 260 79 -175 186
3348 186 22 92 151 53 -61 42 -65 -5 -54 91 -80 -84 30 -241 66 -19 -123 -85 105 21 119 103 87 -3 -66
3373 -66 -117 -44 -67 221 -126 -142 -194 -66 -20 37 -82 79 -26 161 -19 -96 -117 1 10 -47 -57 118 62 -158 97
3398 97 -163 9 -244 100 227 113 124 -28 70 -69 -53 -53 -66 -99 142 119 -314 31 62 -124 108 148 -43 114
3422 114 -121 90 -285 -1 35 -131 -39 52 -50 52 99 60 -25 234 -39 210 -45 -165 -80 -21 68 -117 58
3445 58 83 -87 41 -102 42 -109 -173 -212 28 -70 -39 64 45 -80 -4 70 32 165 -124 -131 -79 97 -56 139
3469 139 78 -311 261 27 -142 28 -207 161 25 297 92 -283 -37 197 -15 -135 -58 32 148 -26 -169
3490 -169 72 66 155 214 143 198 175 -15 75 143 129 161 2 -13 -236 46 321 39 -38 72 134 234 232 -60 115
3515 115 -79 57 134 82 -99 -29 -55 81 84 92 -31 -47 -10 111 -93 -29 -117 -83 -18 -109 -116 -152 -67 2 70 58 18 -245
3543 -245 -113 -50 -138 138 -78 126 108 51 206 143 86 46 -122 21 147 -189 38 -81 164 116 4 -160 -131
3566 -131 104 -174 -120 103 56 -161 76 -153 38 -40 42 76 -28 -261 -38 115 134 37 3 74 -8 -21 -160 -394
3590 -394 159 39 99 38 32 -117 -67 229 -48 -39 -23 41 -152 -82 190 -93 148 30 152 -2 -56 84 93 25 43
3615 43 57 -106 48 -107 160 223 115 -20 -63 -127 -242 134 39 37 168 186 25 83 181 91 -29 -178 -21 114
3639 114 228 64 -115 144 -45 -32 -43 29 -214 22 -59 -27 155 314 -186 54 90 188 72 -223 -42 -122 -50
3662 -50 -32 -88 22 35 -73 -168 -33 65 147 -145 64 232 -103 4 -155 -2 -26 -81 -127 1 115 181 -237 109
3686 109 -199 226 139 -107 -141 276 255 19 220 -197 216 -160 -76 -35 119 -43 -140 44 57 -120 5 31 365
3709 365 -42 -32 -95 3 58 -16 105 -150 -48 -72 238 71 157 130 -20 154 -17 -104 30 19 17 -130 49 17
3733 17 -71 -118 34 -55 -44 167 -166 144 161 196 92 -171 153 -91 -130 65 -93 223 -21 38 -109 -104 -109 184
3757 184 242 -64 -24 229 26 -202 12 97 181 -110 -169 -129 17 18 -40 -176 -1 -211 21 65 -3 99 -38 -57
3781 -57 -29 48 -86 -41 -213 109 111 4 -9 -47 3 40 -10 7 69 -25 43 -168 -14 13 88 11 -45 -158 -62 -88 -6
3808 -6 -41 -103 60 22 36 -21 119 -75 -42 -63 45 -184 35 -12 28 -36 110 -118 180 -46 -172 44 101 8 78
3833 78 -160 -107 113 -97 26 102 61 -44 63 -251 60 -32 -83 123 -171 72 -245 -79 418 221 17 204
3855 204 -93 -70 -103 205 58 64 34 -50 -20 139 -36 181 25 189 -98 2 14 63 106 -42 63 -205 91
3878 91 4 -40 -85 174 -47 -67 -69 41 -30 17 94 -58 -201 -81 71 -105 -212 41 -40 39 -197 -172 210 71
3902 71 -29 89 -15 275 39 -24 113 -65 161 -59 125 -100 -131 -113 236 49 -235 197 -133 61 167
3923 167 -100 -258 -56 -15 -12 48 28 -57 -9 168 155 -45 132 -130 24 36 78 51 86 75 -206 -6 48 -19 -34
3948 -34 87 194 113 39 113 -34 -14 50 52 66 65 187 292 -287 -60 124 -107 -341 -59 119 -162 151 9 -147
3972 -147 -35 10 54 -24 123 158 -224 65 -65 19 93 54 31 -3 -44 -2 -37 -208 66 42 -28 24 101 34 33 -121
3998 -121 -32 -211 -109 -22 -269 342 -110 190 38 283 66 -44 -68 105 211 187 164 5 13 -128 130 -212
4020 -212 200 142 -48 -199 246 94 20 -78 8 -55 -86 -147 -163 3 -67 -65 1 42 0 -46 112 29 54 163 49 83
4046 83 -59 61 -150 58 -17 -22 -201 -91 -216 98 51 -92 -55 -156 -199 -183 -129 -47 57 -49 -61 82 78 6 -130
4071 -130 -353 176 -166 -9 -196 -114 -226 -105 95 -304 15 -264 131 119 -58 -144 150 23 148 26 45
4092 45 178 -59 24 78 -22 24 71 95 -97 -13 283 32 16 134 82 -98 158 53 209 -129 -267 -143 -40
4115 -40 -1 7 179 -153 185 -270 -335 179 247 147 28 120 -60 58 184 -46 129 -97 -117 103 -164 -33 -31
4138 -31 110 183 177 67 -116 -11 -60 114 53 76 -119 197 -144 -12 251 131 -38 -22 34 -3 -109 -49 -161 -104
4162 -104 -20 91 110 -144 -170 1 55 -20 -222 -84 25 36 98 -3 113 -23 51 86 -227 -81 247 -50 135
4185 135 -71 -186 -157 77 145 -167 -76 11 34 -12 179 -12 47 -27 -115 181 71 24 -90 -160 -89 -58 20 219 -33
4210 -33 93 -19 190 -26 -195 -176 84 105 154 -191 211 -74 -38 67 61 38 -37 -9 27 -34 -210 -263 -124 -80 -71
4235 -71 -53 -14 71 26 -182 -276 180 132 48 172 -212 -40 34 20 67 -118 -48 -26 -41 -41 -30 -18 -201 19 -284 -20
4261 -20 -68 3 241 -54 -218 -110 46 -2 -34 138 -148 -13 49 -120 107 91 184 -188 74 -6 -211 -42 8
4284 8 -16 -99 66 -153 -191 -54 99 5 -61 166 -29 -179 -14 7 -62 193 -40 33 160 -60 90 49 -121 -229
4308 -229 -4 -53 -62 -68 -89 -27 95 45 -130 -7 -98 -104 -42 -226 141 52 230 90 134 69 80 190 12 -32 -105 -162
4334 -162 -93 -11 63 -88 73 -119 202 262 -48 -40 193 65 64 125 -90 179 87 -107 119 -140 -136 -23 82 46
4358 46 156 -177 -12 92 269 -282 -60 -51 -83 -110 -109 -79 -106 169 7 154 52 81 -56 -68 166 62 39 -42
4382 -42 -44 -190 -58 1 -13 -22 34 12 -59 -38 -70 -15 -185 -44 -230 -65 -19 -20 206 123 -46 22 35 60 -109 56 -14
4409 -14 53 226 93 31 115 7 -20 -119 -10 40 208 -101 -117 -43 -125 49 -52 215 -67 44 86 -2 138 72
4433 72 -241 -211 -17 291 44 -33 79 11 -41 -104 -189 5 -191 165 -51 -176 101 33 113 90 -359 -28 121
4456 121 183 76 -10 3 -109 14 98 144 -116 116 -49 -121 140 317 17 -17 -184 -288 -171 -8 -82 180 36
4479 36 -70 144 27 -210 6 19 382 85 -90 -105 127 49 31 101 -144 134 -216 -133 164 52 185 -38
4501 -38 95 -133 122 345 37 -49 71 -105 -13 -223 299 274 11 -50 86 -179 293 -73 89 -202 28 116
4523 116 53 -88 -127 73 -137 4 42 -113 115 80 -153 31 -18 16 -215 226 -2 84 -52 63 -134 -197 5
4546 5 -171 -18 67 -18 -44 -100 54 102 92 -54 -158 -14 3 215 76 67 97 27 -167 -140 58 54 9 143 -163 147
4572 147 229 80 -101 -128 16 160 -211 157 129 11 184 -43 112 176 82 -85 -116 -4 187 111 44 -217 173
4595 173 56 -137 140 -409 -93 -106 9 103 231 -21 17 95 119 17 33 -263 -128 38 9 100 -167 -45 72
4618 72 73 -52 192 -114 89 -2 -9 131 261 -99 49 68 -5 56 151 167 160 5 -107 -7 -317 71 141 167 -167
4643 -167 138 -17 -59 54 73 -182 36 114 -100 -65 141 80 -182 -90 -189 -103 -60 -41 268 -135 174 -193 -60
4666 -60 -229 -3 -28 -31 37 -123 -353 103 116 -91 -197 132 224 -443 10 97 -167 120 -84 -51 32 17 66 103
4690 103 37 16 194 -101 -31 393 7 44 103 -70 90 -43 95 4 -91 19 -203 125 -267 -53 98 -122
4712 -122 -94 30 60 -117 -42 186 92 -95 138 12 171 -45 -114 2 47 51 -83 71 24 36 38 96 -59 36 -97
4737 -97 -48 110 -27 -58 1 27 19 155 5 4 32 -33 -82 -42 -2 -39 -210 -25 113 -178 341 -38 -80 122 -26
4762 -26 105 219 -153 62 74 -48 -112 110 -87 93 47 375 53 84 -80 -208 -1 -80 -16 -66 48 249 49
4785 49 122 91 112 24 -129 43 87 -210 72 -36 -77 -182 51 26 109 -86 -125 38 -34 44 177 -143 -54 54
4809 54 277 -41 135 -34 3 76 -152 -8 -1 83 -74 -60 -111 -108 109 -99 -20 1 -22 -146 35 -129 33 -82
4833 -82 -117 145 91 -87 -170 34 -34 -41 60 -9 -320 -231 -219 68 29 117 105 21 -88 -15 106 -10 169 14 -98
4858 -98 47 -77 -21 -116 47 -12 22 -48 -60 -119 -176 -86 51 -54 181 193 88 -41 -504 -195 151 266 67 -288
4882 -288 -58 112 -140 16 -108 125 84 -90 -136 42 -72 37 -109 63 130 -34 -253 -64 -142 -143 245 97
4904 97 50 140 245 -8 -171 -182 -163 -58 183 -127 -187 -16 381 -35 30 45 -165 213 38 -28 11 22 -34 85
4928 85 -381 -146 -269 -77 237 -242 -102 2 199 -96 97 102 72 -35 -94 -97 -164 35 -61 244 3 213 -84
4951 -84 -179 62 -50 10 -95 -45 146 -67 -63 13 -61 -65 71 30 219 18 63 -122 -105 184 79 1 -157 112 -391
4976 -391 38 -42 -217 64 207 -254 88 -4 62 -87 -243 -97 -58 315 -249 -375 -32 278 -190 -4 72 102
4998 102 -162 27 -10 -6 -153 -128 255 -43 14 109 63 138 -173 108 15 -105 245 364 -69 154 72 135 -1 89
5022 89 63 224 -220 16 25 3 187 -52 113 -25 136 77 2 -43 204 -9 -141 101 48 -44 -72 -19 -8 44 -124
5047 -124 112 71 -90 105 -36 -104 -10 -9 -137 -279 -92 179 -88 -180 4 -112 2 114 119 -155 256 -236 -11
5070 -11 193 49 -86 117 68 -5 172 -52 92 5 62 -60 -118 255 147 -122 257 -116 -65 -129 -36 -159 135
5093 135 111 106 -199 72 63 -77 157 97 -12 -243 -18 9 129 -6 -27 86 46 107 -105 140 -71 -55 -77 -180
5117 -180 69 -201 145 -127 -139 254 -129 65 84 184 165 -32 35 155 241 53 -211 50 -138 48 4 -417
5139 -417 -81 -157 74 75 60 434 -71 127 -161 -327 141 20 -42 -6 149 86 -228 76 -49 -38 69 -157 -155
5162 -155 39 -23 222 -88 167 21 -2 -66 54 -110 99 34 -49 92 -54 -148 88 36 -72 -76 -8 181 -28
5185 -28 -6 -107 63 128 -29 -14 52 28 -116 -92 134 73 -17 -44 136 47 -41 -126 24 -35 -118 -70 58 -96 -136 28
5211 28 107 -66 -37 24 -47 -246 -53 -155 -70 -14 53 1 62 -120 199 -134 -189 80 31 -45 -153 31 -59 85 -138
5236 -138 46 44 -96 -247 106 -148 -217 164 -13 -84 292 82 217 -41 -28 -139 -56 162 131 -4 17 122 -72
5259 -72 48 326 -138 -74 58 -181 -162 56 123 85 -103 71 -22 -184 288 86 110 -11 -165 282 153 139 -86
5282 -86 -146 150 -50 -1 -40 -119 -37 -32 57 -41 113 351 73 -129 -68 97 78 62 54 93 151 -280 35 -12 -16 6 -41
5309 -41 39 -150 -349 -187 -65 194 -14 -18 129 -7 -140 -162 -119 -96 71 -40 136 4 54 -63 -140 163 163 136
5333 136 160 146 170 -30 -112 -366 -98 -89 110 -48 8 132 34 -22 31 -174 252 32 127 80 -39 -174 124 -20
5357 -20 -62 -3 -90 20 -156 51 -15 -62 -207 111 92 -118 -84 15 -218 -5 46 38 47 175 -198 -271 -79 -125 -368
5382 -368 -305 -94 -150 106 -175 53 -59 -13 -29 -105 113 -106 -40 84 44 93 -212 61 107 -129 -76 -181 149
5405 149 174 -110 -64 216 -98 -457 -173 219 -6 32 -39 173 179 -15 253 -217 -111 82 -22 208 136 139 11
5428 11 -102 136 -74 -110 237 -69 -175 -93 -113 94 -184 34 238 -44 -91 42 -22 132 -60 -161 -23 -38
5450 -38 0 -198 -48 10 -67 202 101 174 -130 152 45 -146 121 162 -103 -208 -78 17 -121 38 157 -151
5472 -151 -8 102 -37 -59 -7 23 -105 27 -6 255 132 190 -175 5 -163 158 169 -42 26 320 72 -302
5494 -302 -24 -191 139 -140 94 140 3 66 -279 218 101 -138 98 28 0 -33 -115 -74 -17 145 45 54 84 35
5518 35 -146 110 144 -15 -47 -280 -207 -157 -68 206 10 145 59 172 85 -124 121 -187 150 41 -131 128 -139
5541 -139 -355 192 6 -68 -81 -328 261 -134 -126 19 -299 -86 111 119 62 -52 28 -54 148 -19 -81 -206 -8
5564 -8 165 -75 -19 55 -1 -10 302 -119 -136 -112 16 -124 366 27 167 -20 -181 159 6 67 97 157 4 123
5588 123 -136 -29 19 132 -45 20 -142 -32 -110 82 -183 269 -202 36 1 36 38 -169 44 -192 171 3
5610 3 91 43 -69 129 -116 -235 19 124 29 67 -116 -44 -125 -53 160 25 -47 -128 142 -36 76 156 -225 -94
5634 -94 -13 173 147 -335 54 259 96 206 41 137 98 -47 76 10 -161 -307 -131 -201 -80 186 141 71 -165
5657 -165 187 -153 -141 -160 137 97 -29 -51 68 -77 64 -8 -180 -131 1 -161 -46 295 -170 67 190 -13
5679 -13 116 -18 -43 4 143 136 74 228 -108 189 -59 152 44 179 -56 183 32 6 24 170 79 -224 -33
5702 -33 -38 -75 -38 101 62 -161 -271 44 43 -70 87 27 -44 92 87 82 -140 -139 276 -145 -136 10 -133 -92 -89 107 -169
5729 -169 -58 47 -156 293 180 5 -127 -152 42 50 28 225 66 -9 82 85 16 132 271 -26 -136 -19 -8
5752 -8 133 -20 236 148 -187 -139 79 20 -130 74 315 76 6 14 12 -58 158 -55 -84 -56 182 99 -91 -5 -60
5777 -60 147 23 -197 -101 -166 -280 -185 7 -155 -137 103 -284 142 -46 -52 98 -60 -159 58 14 155 -125 112
5800 112 24 -169 -61 -230 86 82 -296 -60 -7 -76 -296 66 -32 -341 7 36 -16 -42 -31 76 238 180 6 -219
5824 -219 121 -78 -58 132 73 189 -98 -270 23 -118 -191 92 -92 -8 65 252 292 86 149 -62 253 12
5846 12 141 -42 117 139 242 254 187 146 0 195 112 9 75 92 70 7 -64 18 -19 -6 -47 33 -271 172 66
5871 66 91 -2 218 168 111 38 -71 -223 -114 -143 -131 115 27 97 108 49 -60 -105 -23 44 -55 -144 41 -58 -23 -105 -382
5898 -382 66 14 -27 -90 -80 61 23 -72 63 147 96 77 -114 203 -162 70 -89 -161 57 99 186 -60 -184 161
5922 161 -173 -190 24 -180 21 83 98 -130 135 155 75 70 -17 119 50 -45 39 72 58 71 28 126 -226 29 116 -123
5948 -123 5 49 -305 -88 -7 -31 -49 -164 -17 53 -148 -79 -147 126 -354 -53 -152 121 -45 -67 -210 -15 288
5971 288 62 -41 -32 -60 -26 -135 -24 201 -31 154 -42 -158 -132 -88 -6 -37 27 -189 -91 65 -58 -171 -75 97
5995 97 -2 -19 18 59 -31 -124 -23 -37 1 -27 -107 40 239 111 125 79 14 87 137 -26 -314 170 162 133 62 216 -122
6022 -122 -110 79 101 49 94 -66 225 -155 59 -135 -82 176 -106 120 134 169 94 -26 -79 2 -18 -208 55 -170
6046 -170 143 5 171 90 -47 15 6 156 161 -95 -115 -1 -61 22 68 20 62 227 -181 63 -52 40 95 155 13
6071 13 -86 26 175 -333 -85 133 -122 234 -98 27 139 -130 38 140 -1 18 -55 128 -20 -34 8 -30
6093 -30 -44 -76 35 -159 -152 -82 98 -84 178 52 70 -22 -161 99 -255 -19 -6 -9 -85 -88 59 -66 113 -131 179
6118 179 131 -11 16 -176 -178 190 6 -43 -34 -17 134 -61 -62 -85 6 -19 -47 9 -6 14 -353 -290 -155 -106 -216 -182 246
6145 246 44 21 -73 5 74 267 -157 -52 -168 83 89 -69 -92 19 -56 -212 59 -246 -80 6 134 -133 -161
6168 -161 -3 -19 30 78 -38 159 104 -146 15 31 -270 -180 -121 -110 -65 34 17 -24 -199 -40 -59 4 -159 -165 -36
6193 -36 21 212 40 -226 113 151 -129 53 -82 157 295 71 126 113 -93 -173 -35 -226 91 -150 267 -2
6215 -2 -62 29 72 7 138 -117 -21 -166 -95 181 84 169 -118 -108 -30 152 93 -135 -98 -103 -106 292 83 182 -49 0 56
6242 56 126 -49 -2 30 128 -50 -62 176 103 -122 -53 88 3 -55 -139 67 11 -117 -18 19 -128 0 55 55 -58 -155
6268 -155 -46 -220 -20 -108 165 79 -24 -34 -26 150 152 -118 -149 -58 -90 -129 -231 -233 -57 -170 62 -121 49 -20 -98
6293 -98 145 69 -149 -9 -47 77 207 -131 123 45 -88 -134 95 -4 63 100 121 -8 -160 88 210 -129 -125 59
6317 59 84 221 50 14 50 -62 122 -83 -183 172 -2 -9 91 -186 169 50 85 128 -60 -3 1 104 -181 -9
6341 -9 237 -90 128 95 -249 -47 78 -70 -44 47 130 24 -300 296 24 -115 -234 62 62 -56 221 -48 -15
6364 -15 72 -196 -72 10 -135 94 -74 202 8 52 -52 35 227 -101 -19 32 -114 -255 8 71 -97 141 113
6387 113 -54 78 25 -154 47 74 -167 34 -52 -172 100 100 -126 33 19 65 -66 41 113 65 -28 117 -22
6410 -22 -69 -37 -44 21 -1 -273 38 -31 36 107 208 -88 46 62 -77 148 202 -11 52 126 -38 -94 0 -256 152
6435 152 -52 -244 -5 -53 -67 -178 -158 -38 166 -55 -75 127 149 -103 -227 -28 -131 -40 343 -21 -271 -37
6457 -37 -115 -198 -4 -56 117 -6 4 -56 126 51 -42 49 180 -37 188 -80 -245 24 -203 -196 -54 -6 244 113
6481 113 -48 -187 -114 -28 182 -40 73 -4 310 -121 127 -93 -106 71 92 -107 65 156 391 136 -172 -46
6503 -46 95 203 -287 -166 172 -44 -15 -134 205 47 -108 147 -165 -25 -15 -18 -2 103 -116 -129 95 -110
6525 -110 -115 152 133 -65 -165 -62 8 201 182 -19 -250 123 304 -176 214 87 32 -302 179 59 38 8 25
6548 25 -106 -239 -58 -19 182 16 -217 1 -43 0 -111 294 7 8 268 -227 -147 -123 191 -15 -159 202 187
6571 187 40 302 -265 -181 68 -153 317 71 99 -172 -51 -128 35 122 -72 7 13 -8 228 -95 24 -114 164
6594 164 -122 -130 10 -14 149 82 -16 -169 -89 -78 103 100 178 -6 101 134 283 150 52 203 -191 -124 113 -273
6618 -273 -2 70 -79 118 -85 -85 -83 177 150 15 -106 -66 -140 -144 -106 -47 -2 -277 -28 32 -262 71 -47 65 -157
6643 -157 -162 -123 -71 -29 166 70 -92 39 106 -73 119 -25 -350 116 18 38 -111 49 50 -98 103 61 -173 141
6667 141 -159 84 183 -16 238 -46 -47 -215 -49 63 127 129 113 21 274 193 -212 223 -24 -148 154 105 14 303
6691 303 -171 -191 -71 -140 -55 252 -33 -4 89 -112 -185 46 -89 -34 6 -118 56 -145 -75 -196 143 -51 101
6714 101 69 73 -114 232 -153 -52 88 -47 -89 -211 177 156 79 427 30 -51 -46 -52 54 -167 49 56 -34 -174 21
6739 21 49 -123 4 -35 -44 31 -94 -6 117 90 70 -60 28 18 8 -244 109 -75 -43 -134 85 168 -9 98 -46
6764 -46 -124 238 151 58 -170 205 25 158 -102 -26 148 27 116 -122 81 -141 36 -181 40 -151 -3 236
6786 236 17 33 4 120 69 129 260 334 223 -42 -52 93 3 89 50 -175 99 -141 51 -65 -274 -111 -132
6809 -132 44 185 -47 -31 -11 145 251 134 -197 105 -53 34 -163 80 110 -55 194 -3 -7 -103 -120 7 -217
6832 -217 -257 37 44 64 -54 287 -294 -135 25 -154 110 53 6 -77 45 41 21 294 145 -201 96 198 253 65
6856 65 142 -302 -72 -2 -52 130 -19 207 -19 -147 181 -54 -182 103 66 -168 179 135 -53 156 108 -39
6878 -39 169 -124 -51 99 73 0 99 5 -15 -57 70 -132 -264 146 -57 321 110 89 121 -67 209 -151 -83 104
6902 104 140 -144 -51 -183 73 19 -151 38 87 164 2 -59 -5 34 181 243 191 75 -195 56 -152 -126 80 258
6926 258 321 -108 -187 114 -50 56 232 -62 -13 -89 -46 -306 -153 115 -42 26 132 162 -225 -135 14 50 113
6949 113 -145 -54 -33 -111 -200 -193 -141 27 -84 32 0 151 -84 6 4 161 62 129 -80 74 -51 86 -95 -11 10
6974 10 209 69 -48 61 -43 22 95 -107 50 172 175 131 -8 -131 -121 9 151 45 -113 31 -88 -6 98
6997 98 106 -198 -7 155 -257 166 197 -131 75 -66 -95 183 18 119 -130 268 97 -90 -201 103 -133 -98
7019 -98 -28 -64 -33 -127 110 85 -191 158 233 -12 -99 -276 -56 -39 -297 66 107 -112 -65 187 -88 -132 -71 103
7043 103 -232 136 -15 -97 -13 -15 -147 -84 -68 115 -162 67 59 -204 -76 -88 40 4 -103 84 31 -75 -6 139
7067 139 230 -40 -129 11 117 86 267 23 12 -91 -179 -83 -136 122 -37 12 -81 -83 29 92 120 -136 135 -77
7091 -77 5 116 -58 2 -183 -64 -96 -187 -178 -245 -79 219 -144 54 -2 -149 89 112 -83 12 -131 71 14 290
7115 290 -53 -42 -143 59 39 -98 25 190 -247 -36 12 23 -146 -38 -27 -92 319 -10 -142 -71 329 -183
7137 -183 108 232 243 142 104 18 193 23 33 -240 -119 -145 16 -240 10 -141 78 216 17 -67 -100 27
7159 27 -158 -40 -117 244 230 187 -85 115 -277 -92 120 -16 -186 -38 87 -83 3 -24 -188 -73 94 26
7181 26 206 -70 -284 -6 67 -50 12 -225 -115 167 222 -127 -118 28 263 41 -183 87 109 -237 181 -65
7203 -65 201 -20 -56 -186 150 112 -6 326 56 -21 -208 -133 139 -247 -158 141 -4 179 -35 -99 6 -54 139
7226 139 -13 186 87 75 -50 17 103 45 -41 127 -111 -75 211 114 -1 29 -74 -61 16 87 -14 -1 108 -48
7250 -48 132 177 -81 -84 -24 -14 119 80 18 53 -29 26 -165 -66 136 71 96 240 -276 146 75 234 244 -60 -114 -103
7276 -103 -8 40 135 25 -96 339 176 119 -9 -51 -120 45 8 -60 -115 -226 -233 -109 -209 -158 84 -7 269 49
7300 49 167 17 12 -134 182 16 -252 -165 32 49 -265 -130 37 53 31 101 18 -189 -182 125 27 24 201 -32 -94
7325 -94 -111 209 -147 93 -338 -73 12 -13 0 -14 41 -58 22 -41 -151 -153 -16 -39 -71 -137 -83 76 91 -204 7 61
7351 61 12 -43 -316 134 22 -88 -80 105 -84 -60 -147 138 -27 -156 -7 -150 19 -80 -88 -120 105 -141 132 -117
7375 -117 173 -128 278 -102 -39 54 26 -94 -73 43 -15 -9 50 63 -194 217 148 -171 39 127 -132 -20 166 -58
7399 -58 99 -37 -62 133 243 -54 -101 -127 -7 -90 -75 -96 88 -26 -128 127 12 44 48 112 65 43 187 149 87
7424 87 80 -280 80 -156 43 3 222 -49 -4 -163 186 -261 238 -38 172 177 -34 143 92 63 -13 -104 -44 78
7448 78 21 -107 -216 -68 155 -179 -62 158 -198 -107 -114 -58 146 -104 121 23 51 147 -322 -31 -12 -74 152 195
7472 195 -79 -100 -107 241 -191 12 -36 48 195 82 -150 15 -136 157 191 191 -52 17 43 -66 -180 -436 -107
7495 -107 247 13 105 257 -63 48 114 118 -202 73 159 -10 -107 177 -39 -326 22 24 -6 -80 59 -123 57
7518 57 -52 -76 68 -12 5 -126 80 -78 5 -101 88 -245 101 31 23 24 -194 89 -26 -145 -80 12 -10 202
7542 202 118 -119 -44 -18 176 -110 63 -38 -150 159 -122 60 24 -54 -144 122 82 44 -198 -75 -419 -45 -226
7565 -226 -58 -116 -191 -85 -44 -4 -314 -149 10 -19 -38 94 168 13 16 -129 61 38 179 109 70 -15 -248 119
7589 119 58 -37 78 -9 -59 -194 142 95 218 -97 -30 -30 43 -129 -55 38 -94 122 48 -190 186 -24 11 -207
7613 -207 -31 -145 3 -134 -190 66 58 237 79 84 -10 86 -116 -127 -111 2 -56 415 -100 140 15 -116 -17 163
7637 163 -13 322 169 26 81 212 -88 21 -6 59 95 -220 -122 182 -155 -53 126 5 96 -106 -175 84
7659 84 -200 11 83 -87 40 -28 -23 298 136 -204 -81 -14 35 83 12 151 -46 -24 -187 -77 182 208 124 206
7683 206 -19 26 -6 -25 111 -193 -201 -115 105 114 156 -164 -127 -113 -56 -493 -190 -189 118 -161 45 185 -72 33 139
7708 139 158 -21 136 -24 -28 81 -60 -97 -24 -179 67 155 97 -4 -255 73 11 138 57 -137 -60 54 -56
7731 -56 102 52 -53 70 165 -111 -58 -18 8 87 -112 -73 28 15 275 -110 103 122 -102 -201 -34 120 121 107 95
7756 95 117 3 78 7 239 28 105 107 37 -12 -138 146 -123 9 120 6 -159 73 176 75 110 -75 -1 -227
7780 -227 -9 -37 92 83 -95 170 -9 72 87 -293 -108 47 -40 41 124 79 37 -25 -190 -91 -163 87 -187 14
7804 14 -11 -23 54 -249 35 222 61 119 -132 48 -33 -184 138 -126 14 -196 -97 51 150 114 326 135 79
7827 79 116 -184 -112 -164 27 -6 -10 49 150 -11 -209 4 357 127 155 29 -8 -65 -190 -50 -147 50 -182 -39
7851 -39 117 214 -147 -134 55 -167 259 -21 11 164 -122 108 29 10 -88 127 -50 -131 -45 -168 25 12 233
7874 233 35 -42 107 -69 39 198 6 -81 135 49 182 -49 47 -125 55 137 225 102 -88 89 167 79 -34
7897 -34 403 -113 160 77 14 48 81 268 -224 -78 -65 -80 -21 -83 200 -166 -131 169 -225 145 -149 90 5 -42
7921 -42 -65 -34 203 -121 -189 -180 -30 -51 134 -3 -122 -89 232 -33 -63 -207 -26 163 -143 81 -96 24 -119
7944 -119 -24 61 -72 78 -261 -54 -46 -43 -126 -98 -304 -151 -28 -17 -36 76 -161 -207 -151 131 -27 184 86 -45
7968 -45 -24 -78 51 -184 49 2 -82 -166 53 -13 -49 -50 -252 -138 -312 -52 -5 -57 96 42 7 -3 16 130 211 100
7994 100 -80 43 37 65 76 -191 -163 -149 -85 -48 -50 23 -51 54 -60 -126 49 -15 -133 63 -47 43 -174 5 25
8019 25 -52 102 -209 140 120 68 -24 79 -98 50 -11 -60 27 286 212 85 -13 27 -265 -160 63 -166 -123 -48
8043 -48 -58 -237 126 -91 -60 -163 -107 -115 186 -210 187 196 -78 150 188 81 29 108 24 32 -26 88 -57 49 60
8068 60 -169 59 296 2 33 -106 -21 9 143 121 -110 -124 -70 -61 46 2 -18 91 70 237 129 7 30 208
8092 208 78 25 73 -142 -130 -196 -72 84 97 -73 99 70 26 191 -26 -4 169 395 -84 75 -3 -34 35 -67
8116 -67 88 1 -43 -19 -2 135 264 23 119 84 -54 156 -185 -152 -69 -47 -183 -44 21 124 -136 349 4 -60
8140 -60 265 -19 -45 -25 -168 175 -109 -33 -128 -1 125 -43 -19 148 -63 96 -39 -72 -99 112 49 81 104 198
8164 198 142 105 65 -271 -196 -39 -43 167 122 -11 14 19 156 51 173 280 144 -48 76 -85 85 51 -66 -26
8188 -26 3 -278 156
8191A56
##END NTUPLES=NMR FID
##END=
