##TITLE=1H_K-386
 CDCl3, 8 sc, 
 28.10.2020
##JCAMPDX= 6.0         $$ Bruker NMR JCAMP-DX V2.0
##DATA TYPE= NMR FID
##DATA CLASS= NTUPLES
##ORIGIN= UXNMR, Bruker Analytische Messtechnik GmbH
##OWNER= root
$$ XWIN-NMR		Version 3.5
$$ Wed Oct 28 13:12:49 2020 Russian Standard Time (UT+4h)  she@DPX200
##.OBSERVE FREQUENCY= 200.1315066352
##.OBSERVE NUCLEUS= ^1H
##.DELAY= (6, 6)
##.ACQUISITION MODE= SIMULTANEOUS
##.ACQUISITION SCHEME= undefined
##.AVERAGES= 8
##.DIGITISER RES= 18
##SPECTROMETER/DATA SYSTEM= spect
##.PULSE SEQUENCE= zg30
##.SOLVENT NAME= CDCl3
##.SHIFT REFERENCE= (INTERNAL, CDCl3, 0, 15.7039)
##AUDIT TRAIL= $$ (NUMBER, WHEN, WHO, WHERE, WHAT)
$$ ##TITLE= Audit trail, XWIN-NMR		Version 3.5
$$ ##JCAMPDX= 5.01
$$ ##ORIGIN= Bruker BioSpin GmbH
$$ ##OWNER= she
$$ F:/spectra/data/she/nmr/H-F/1/audita.txt
$$ ##AUDIT TRAIL=  $$ (NUMBER, WHEN, WHO, WHERE, WHAT)
(   1,<2020-10-28 13:11:27.25 +0400>,<she>,<DPX200>,
      <created by zg, POWCHK disabled, PULCHK disabled
       configuration hash MD5:
       00 E9 B6 7A A2 85 ED C7 34 08 36 98 17 FE 4E 26
       data hash MD5: 16K
       33 F0 A1 B5 58 92 DB 60 23 0A 27 76 2C 05 AC 89>)
$$ ##END=
$$ 
$$ hash MD5
$$ 9B 54 08 1B BC 9D B4 28 85 42 DE 01 5B A5 D2 44
##$RELAX= 
##$RELAX= 
##$RELAX= 
##$RELAX= 
##$RELAX= 
##$RELAX= 
$$ Bruker specific parameters
$$ --------------------------
##$DU= <F:/spectra>
##$EXPNO= 1
##$NAME= <H-F>
##$PROCNO= 1
##$TYPE= <nmr>
##$USER= <she>
##$AMP= (0..31)
100 100 100 100 100 100 100 100 100 100 100 100 100 100 100 100 100 100 
100 100 100 100 100 100 100 100 100 100 100 100 100 100 
##$AQSEQ= 0
##$AQ_mod= 1
##$AUNM= <au_zg>
##$AUTOPOS= <>
##$BF1= 200.13
##$BF2= 200.13
##$BF3= 200.13
##$BF4= 200.13
##$BF5= 200.13
##$BF6= 200.13
##$BF7= 200.13
##$BF8= 200.13
##$BYTORDA= 1
##$CFDGTYP= 0
##$CFRGTYP= 5
##$CHEMSTR= <none>
##$CNST= (0..31)
1 1 145 1 1 1 1 1 1 1 1 1 1 1 1 1 1 1 1 1 1 1 1 1 1 1 1 1 1 1 1 1 
##$CPDPRG= <>
##$CPDPRG1= <>
##$CPDPRG2= <>
##$CPDPRG3= <>
##$CPDPRG4= <mlev>
##$CPDPRG5= <mlev>
##$CPDPRG6= <mlev>
##$CPDPRG7= <mlev>
##$CPDPRG8= <mlev>
##$CPDPRGB= <>
##$CPDPRGT= <>
##$D= (0..31)
0 1.2 0 0 0 0 0 0 0 0.06 0 0.03 0 0 0 0 0.0002 0 0 0 0 0 0 0 0 0 0 0 0 
0 0 0 
##$DATE= 1603876286
##$DBL= (0..7)
120 120 120 120 120 120 120 120 
##$DBP= (0..7)
150 150 150 150 150 150 150 150 
##$DBP07= 0
##$DBPNAM0= <>
##$DBPNAM1= <>
##$DBPNAM2= <>
##$DBPNAM3= <>
##$DBPNAM4= <>
##$DBPNAM5= <>
##$DBPNAM6= <>
##$DBPNAM7= <>
##$DBPOAL= (0..7)
0.5 0.5 0.5 0.5 0.5 0.5 0.5 0.5 
##$DBPOFFS= (0..7)
0 0 0 0 0 0 0 0 
##$DE= 6
##$DECBNUC= <off>
##$DECIM= 32
##$DECNUC= <off>
##$DECSTAT= 4
##$DIGMOD= 1
##$DIGTYP= 9
##$DL= (0..7)
0 120 120 120 120 120 120 120 
##$DP= (0..7)
150 150 150 150 150 150 150 150 
##$DP07= 0
##$DPNAME0= <>
##$DPNAME1= <>
##$DPNAME2= <>
##$DPNAME3= <>
##$DPNAME4= <>
##$DPNAME5= <>
##$DPNAME6= <>
##$DPNAME7= <>
##$DPOAL= (0..7)
0.5 0.5 0.5 0.5 0.5 0.5 0.5 0.5 
##$DPOFFS= (0..7)
0 0 0 0 0 0 0 0 
##$DQDMODE= 0
##$DR= 18
##$DS= 0
##$DSLIST= <SSSSSSSSSSSSSSS>
$$ [...]
##$SUBNAM2= <"">
##$SUBNAM3= <"">
##$SUBNAM4= <"">
##$SUBNAM5= <"">
##$SUBNAM6= <"">
##$SUBNAM7= <"">
##$SUBNAM8= <"">
##$SUBNAM9= <"">
##$SW= 16.880792210976
##$SWIBOX= (0..15)
0 0 2 0 0 0 0 0 0 0 0 0 0 0 0 0 
##$SW_h= 3378.37837837838
##$TD= 16384
##$TD0= 1
##$TE= 0
##$TE2= 300
##$TE3= 300
##$TEG= 300
##$TL= (0..7)
0 120 120 120 120 120 120 120 
##$TP= (0..7)
150 150 150 150 150 150 150 150 
##$TP07= 0
##$TPNAME0= <>
##$TPNAME1= <>
##$TPNAME2= <>
##$TPNAME3= <>
##$TPNAME4= <>
##$TPNAME5= <>
##$TPNAME6= <>
##$TPNAME7= <>
##$TPOAL= (0..7)
0.5 0.5 0.5 0.5 0.5 0.5 0.5 0.5 
##$TPOFFS= (0..7)
0 0 0 0 0 0 0 0 
##$TUNHIN= 0
##$TUNHOUT= 0
##$TUNXOUT= 0
##$USERA1= <user>
##$USERA2= <user>
##$USERA3= <user>
##$USERA4= <user>
##$USERA5= <user>
##$V9= 5
##$VALIST= <valist>
##$VCLIST= <CCCCCCCCCCCCCCC>
##$VD= 0
##$VDLIST= <DDDDDDDDDDDDDDD>
##$VPLIST= <PPPPPPPPPPPPPPP>
##$VTLIST= <TTTTTTTTTTTTTTT>
##$WBST= 1024
##$WBSW= 4
##$XGAIN= (0..3)
0 0 0 0 
##$XL= 0
##$YL= 0
##$YMAX_a= 37474
##$YMIN_a= -29909
##$ZGOPTNS= <>
##$ZL1= 120
##$ZL2= 120
##$ZL3= 120
##$ZL4= 120
##$ABSF1= 10
##$ABSF2= 0
##$ABSG= 5
##$ABSL= 3
##$ALPHA= 0
##$AQORDER= 0
##$ASSFAC= 0
##$ASSFACI= 0
##$ASSFACX= 0
##$ASSWID= 0
##$AUNMP= <proc_1d>
##$AZFE= 0.1
##$AZFW= 0.1
##$BCFW= 1
##$BC_mod= 2
##$BYTORDP= 1
##$COROFFS= 0
##$CY= 11.3945322036743
##$DATMOD= 1
##$DC= 2
##$DFILT= <>
##$DTYPP= 0
##$F1P= 15.9154993809931
##$F2P= -4.1035820241983
##$FCOR= 0.5
##$FTSIZE= 0
##$FT_mod= 4
##$GAMMA= 1
##$GB= 0.15
##$INTBC= 1
##$INTSCL= 1
##$ISEN= 128
##$LB= 0.24
##$LEV0= 0
##$LPBIN= 0
##$MAXI= 10000
##$MC2= 0
##$MEAN= 0
##$ME_mod= 0
##$MI= 1.114404
##$NCOEF= 0
##$NC_proc= 0
##$NLEV= 6
##$NOISF1= 3.799351
##$NOISF2= 2.8
##$NSP= 1
##$NTH_PI= 0
##$NZP= 0
##$OFFSET= 15.70392
##$PC= 1
##$PHC0= -10849.46
##$PHC1= 19.60088
##$PH_mod= 1
##$PKNL= yes
##$PPARMOD= 0
##$PSCAL= 0
##$PSIGN= 0
##$REVERSE= no
##$SF= 200.130013532006
##$SI= 16384
##$SIGF1= 3
##$SIGF2= 2
##$SINO= 400
##$SIOLD= 16384
##$SREGLST= <1H.CDCl3>
##$SSB= 0
##$STSI= 0
##$STSR= 0
##$SW_p= 3612.71676300578
##$SYMM= 0
##$S_DEV= 0
##$TDeff= 0
##$TDoff= 0
##$TI= <>
##$TILT= no
##$TM1= 0
##$TM2= 0
##$TOPLEV= 0
##$USERP1= <user>
##$USERP2= <user>
##$USERP3= <user>
##$USERP4= <user>
##$USERP5= <user>
##$WDW= 1
##$XDIM= 8192
##$YMAX_p= 0
##$YMIN_p= 0
$$ End of Bruker specific parameters
$$ ---------------------------------
##NTUPLES= NMR FID
##VAR_NAME=  TIME,          FID/REAL,        FID/IMAG
##SYMBOL=    X,             R,               I
##VAR_TYPE=  INDEPENDENT,   DEPENDENT,       DEPENDENT
##VAR_FORM=  AFFN,          ASDF,            ASDF
##VAR_DIM=   8192,          8192,            8192
##UNITS=     SECONDS,       ARBITRARY UNITS, ARBITRARY UNITS
##FACTOR=    0.000296,      1,               1
##FIRST=     0,             0,               0
##LAST=      2.424536,      0,               0
##MIN=       0,             -29909,          0
##MAX=       2.424536,      37474,           0
$$ Real data points
##PAGE= N=1
##DATA TABLE= (X++(R..R)), XYDATA
0@%%%%%%%%%%%%%%%%%%%%qJ6j6J6j6J6k4L2l2L2m0M8n6O4p2Q0q8J00j09J21j36
41g2J52j69J86k05K29k53K80l09L41l76M13m54M98n53O15o80P54q42R43j064J213
62F47j394J627j940K380l054M236o943K6061J5854o973K4r947R075j0436n612
77A3605J122K180K151l516n401R158k623k046k834o040K602o57p676k472J310
92a137J540M63l749N35O373k133N22j540j200N060j043n222K151J140P50K51m573
109a812M859J428j252J777m670L233K685m879m28J405K60K095l178q96K768j643
125A752J123l449j306L492j709k316N87R83J568J743j972J779J605k74k17l273
141A16P20J412k662j149J417k59K774M15j159L506K44Q40j494k187J558j930k928
$$ y = [0, 0, 0, 0, 0, 0, 0, 0, 0, 0, 0, 0, 0, 0, 0, 0, 0, 0, 0, 0, 0, -8, 8, -8, 8, -8, 8, -16, 16, -16, 16, -24, 24, -32, 32, -40, 40, -48, 52, -57, 64, -72, 80, -89, 97, -108, 121, -132, 148, -161, 180, -196, 217, -237, 261, -292, 323, -357, 397, -445, 498, -566, 647, -747, 880, -1060, 1320, -1734, 2502, -4441, 21620, 37474, 30501, 30525, 20578, 29653, 19217, 13605, 14727, 16907, 19058, 15542, 10141, 19299, 16676, 14630, 11796, 5756, 8358, 7701, 25, -2447, -1137, 403, 866, -2883, -2348, 4025, 1892, 2414, 874, -326, 4734, 3691, -1531, 620, 1760, 2510, 2761, -1812, 3047, 4475, 3223, 5000, 330, 3563, 6248, 1369, 941, 2346, 2606, 4701, 1523, 627, 3395, 1752, 2875, -574, -1880, 1612, -97, -2413, -1826, -843, 725, 2468, 496, 2275, 3880, 3606, 3389, 116, 836, 2248, -414, -1563, -146, -405, 2369, 2784, 1625, 5131, 5375, 6215, 4721, 2534, 4092, 2162, -766]
158g66m46j644J77J894k303J689J952O48J267k183P65N2k216j444j484j858J133
175d767n15j388K561J191J954P03J96J594j38q44q05j823o11R83k490M08J819
192a972M21K247M32J187J628J57j0p25j495P12j215k283J122o07Q42J019M7J508
210C015J035M43q7p70j99K44k439l96k64j239J040m83J5J148O72K37L4l88M36
229B054n17j637M31j428%M06j072N44P98K69J57Q9oO92j102k3l7j061Q81o04m08
250a574P60L12M0K68j32K36J69p37M78q75K83N37r09M84O28j18K59K30l77N37
270D99n45k41j12p38Q32l96k12P21K46P8O69k01O1L41p72N2q48M0K05q09N54M37
292a39J13O39M92l55O65j42l97k07p77K21o82k95L65r0L05Q53m6L06P29m71J29
$$ y = [-766, -1212, -2856, -2679, -785, -3088, -1399, 553, 1201, 2468, 285, 1050, 1102, -1114, -2558, -4042, -5900, -4767, -5282, -6670, -4109, -2918, -964, -261, -65, 1529, 1391, 547, -258, -2081, -2692, -1709, -4199, -3791, -1972, -1551, 696, 1128, 2315, 3943, 4100, 4090, 3365, 1870, 2582, 1367, -916, 206, -401, 441, 1460, 1507, 3015, 4050, 4493, 4406, 3636, 3437, 3681, 1242, 846, 582, -657, 383, -100, -85, 1063, 1735, 1972, 2006, 1618, 2054, 1537, -100, 331, -1097, -1097, -691, -1763, -1219, -421, -152, 5, 94, 88, 780, -322, -345, -382, -1443, -562, -1166, -1574, -814, -502, -462, -194, -326, -90, 79, -658, -180, -1055, -772, -235, -1144, -660, -32, -150, 109, 339, -38, 499, -46, -287, -399, -1137, -305, -701, -913, -192, 54, 132, 801, 600, 661, 1002, 230, 282, -566, -526, -321, -1130, -576, -139, -26, 613, 1105, 750, 1415, 1273, 876, 669, -108, 113, -569, -864, -499, -589, -284, 569, 523, 829, 1558, 1087, 1216]
313A216n55l22j87q31l9k15p3M57L81j55R35K27j27L34n74n1o15m80k49m09PL99
335i26k73L52P71k66N26Qk82R0m85k66m74k72J20j7j72P75J27J19P25k30M10l0
357C30k80j16l21n4l5j25J80O16k46P66K24l8M86k36j04j83j76k17m7k86L25j8
379D45R4O18l03K43J92k34j12k21k60o2k61j90K36k05M79N8MM76j76P4j07j96
401E92k56l0l47Q5o7o9N12j87L68K32r3K1r0k08k32j24l02Pk84K64L1l7M91m6
425B31P9J14p3j99L1l48j5j63p2K83j91L63K27J59K80J26m5L1J2k89P7j96M9K5
449D96k2L17q4L06J74k9K9L7l15j46m2l21l4k52J31nm8J95j5j27J17j50l35L7
473h6l22j78J2k27Q0p9J20J32J5K1J42j87l4J9k82J33j22l7J45PK22Q6J21J94
$$ y = [1216, 661, 339, 152, -679, -718, -933, -1006, -549, -168, -323, 612, 839, 712, 1046, 472, 421, -194, -674, -923, -1332, -1325, -926, -1199, -847, -76, -342, 184, 192, -90, 0, -485, -751, -1225, -1497, -1377, -1394, -1566, -791, -664, -545, 180, -50, 360, 330, 50, -66, -387, -441, -476, -601, -421, 195, -51, 715, 939, 901, 1387, 1151, 1047, 864, 688, 471, 424, 138, 463, 445, 539, 1157, 854, 1097, 1289, 1055, 943, 722, 462, 400, 139, -51, 185, -20, 459, 517, 521, 997, 821, 895, 788, 592, 336, 306, -41, 44, -23, -92, 420, 233, 601, 833, 740, 761, 671, 463, 231, 107, -195, -188, -472, -208, -177, -214, 277, 231, 310, 424, 351, 152, 183, -165, -180, -343, -415, -132, -323, 40, 267, 426, 706, 832, 787, 818, 830, 541, 618, 422, 471, 496, 474, 791, 707, 1013, 1187, 1158, 1187, 1224, 909, 763, 721, 400, 366, 114, 245, 240, 192, 387, 372, 245, 362, 212, -123, -86, -408, -586, -574, -801, -721, -800, -680, -548, -533, -512, -370, -557, -591, -572, -854, -721, -843, -880, -735, -728, -506, -420, -299, -105]
497a05L3l6J89k30k9L0j49J15O2J63J18J18J76J61p9J47qk34J3j21j65OM2L7J08
522C62N2K10J29RJ03k20j00pk64p7q5k0j6O5J2K50j9J68j5j45J40k73j81l9j55
547a16j35k6L7M8J64%K25o3O3Nl15J6j42j26j08l2o2J06P3J16J33k2K09q9l2M0
573c3j25r9K7r1n8J52j9K02P4J75J34l1J48r9j05L7o0o7J8PJ5J71j8K17m1l1J21
600F21q4j7p7j08o9k1n5K5L2J4lj27J54j02k5q5p3j16J4o2p0R2l3N5l7M7L2p0
628a48M7l6q3k6R4r9J01J3j2J17l5J14rpL4p1p8M0p0l7J01k6L5J35p6J26j5ll8
657H8q5n5o0o2K5k5n9J43j2P4O7L6N1l0r0N1o1j25O5j57P4N0P5L9O9P6J5M4m2
686A79n5r1J3j87NJ02r8K5O8O9K1qN6mq0kl9j99N5m2q0J08m2J13mJ01K0J0o1J3
$$ y = [-105, -72, -108, 81, -149, -178, -148, -297, -182, -120, 43, 161, 279, 455, 616, 537, 684, 676, 442, 455, 334, 169, 175, 217, 254, 362, 414, 624, 753, 762, 865, 645, 545, 538, 274, 197, 112, 92, 76, 141, 153, 403, 384, 552, 537, 392, 532, 259, 78, 39, -116, -251, -277, -240, -192, -28, -28, 197, 134, 197, 202, -113, -97, -239, -365, -473, -505, -567, -461, -388, -272, -139, -161, 48, -41, -73, -33, -158, -257, -230, -321, -379, -227, -246, -44, 30, 205, 339, 308, 456, 357, 252, 289, 229, 162, 180, 187, 202, 373, 355, 572, 531, 500, 621, 537, 520, 443, 335, 266, 245, 190, 215, 247, 261, 258, 131, 285, 183, 158, 73, 0, -116, -102, -164, -234, -142, -175, -120, -157, -110, -78, -148, -101, -137, -220, -246, -152, -251, -150, -137, -149, -32, -67, 47, 38, 31, 65, -6, -84, -44, -114, -151, -50, -76, -41, 94, 18, 144, 129, 126, 88, 3, -52, -112, -174, -149, -174, -233, -90, -102, -28, 39, 75, 126, 96, 6, 57, -4, -129, -64, -221, -147, -97, -22, 17, 86, 162, 177, 221, 179, 124, 33, 46, -141, -136, -34, -132, -107, -39, 30, 51, 43, 99, 95, 15, 13, -26, -225, -170, -212, -292, -184, -226, -113, -117, -16, 4, 14, -47, -34]
716c4m6m2O0j66J27l5J3RJ11K5L8K9j3L5j01L7k8n3J4o1kO1kJ02K2J6K1o3l6K6
746F4q9Rl9ok0Q6K0L4N9r8JJ1oj8j1K1j7k8j7O7k5L1j2P0Mo9K4n7J0J0o4j9R9
779B5l4J1M7p3R0n5J8nl1o8l5L3J3O3o1N8QN1k1L3l4m4p0L3n3j2J4j1M7j3jJ35
811E8n9K8K5m1K4q4ON9m9o5O2JM8M9K8NPk9K1kk0l1m5qM3pM7%K8O1p4L5n1l5p2
846c7Q5n6J7o4L6K5k2J0J8N4n5ol2J4l7k1k0J9P0j05L0P6l8J6L8mj7rj7J5l3o9
878a19O0k2P6n9N8K0M9l2k0Rj11N6k4L7MOn1M6NM5k7Q5no3lq0Q6j0j9Nl4P0L5
911G3q5N9L8kj00N1%n3rNLK9J15j01j2J7j7M6l2Kk4n4j1J0M0j4rn7J09K8p1KN1
944B7K8o0p1J6rNrK5M7q3Q4M9n2N6p9L5m0K5j7l9M7L3n8L6L5m7O8J7p6M1l3l6
$$ y = [-34, -80, -122, -62, -228, -101, -136, -123, -114, -3, 22, 60, 89, 76, 111, 10, 47, 19, -34, -20, -81, -83, -22, -24, 78, 100, 116, 137, 74, 38, 64, -25, -16, -55, -61, -81, 5, 25, 59, 118, 20, 21, 32, 26, 8, -3, 18, 1, -27, -44, 23, -2, 29, 17, 87, 91, 22, 46, -11, -1, 9, -55, -74, 25, -9, 2, 49, -24, 66, 11, 29, 24, -7, -75, -110, -77, -64, -1, -62, -4, 4, 55, 34, 67, 33, -11, -81, -48, -101, -113, -99, -110, -63, -76, -77, 58, -1, 27, 52, 11, 35, -49, -43, 16, -33, -98, -36, -35, 13, 62, 90, 95, 102, 73, 94, 92, 72, 41, -4, -12, 31, 24, 71, 71, 99, 160, 86, 121, 70, 35, -37, 48, -8, 9, -55, -19, 6, -16, -6, 12, 66, 11, 5, -27, -13, -50, -71, -91, -72, -2, -107, -77, -1, -39, -23, 15, 11, -6, -15, -32, -17, -50, -119, -59, -81, -5, -64, -6, 14, 63, 31, 11, 20, -91, -35, -59, -22, -18, -12, -63, -17, -12, 33, 6, 91, 86, 23, 20, -60, 26, 16, -3, 2, -32, 38, 73, -12, 47, 85, 83, -17, 34, 34, -19, -28, -23, -20, 9, 124, 23, 11, 28, 11, 57, 25, 27, 3, -51, -62, -52, -12, -26, -35, -92, 17, 45, -26, -24, 27, 55, -5, -76, -60, -69, -64, -73, -48, -1, -84, 0, 49, -3, 53, -26, 9, -31, -6, -23, -62, -15, 18, -40, -4, 31, -16, 52, 69, -7, 34, 1, -35]
976c5O6o5J7K9nL3l5L2oo2J04n8J4k5m9J4l9L6kJ2RM6q0P9m7k8K2j7k7N8n8k3
1008i0L2j9Q4m9%O8l6O8q5K8j7l4K9m5K3N2j4rK0MmK5j6n8K6l3l6N2oPK3J2j2
1041a0m3N6j2kJ1o1nK9L7K9l9J4J6L7j5K2o2L9l9O0m4M3m8k1Q2q0N0k7K9%j7n8
1073b9J11p1k1j6Qk1pK8KoM4m1nL1m5RlN7n1JK3n3N2j7M4l8K3L7j1k7L9o3K3o8
1107f1j6O0j6N8n3M7m1O2m%m7qJL4rqK8rj5L1K9l1ql6N4m6L1Om2nlk1M0J0j8N4
1143D8k4M0k9nk9j2J4j0LN7j00L1L4j7k7J6M9j02N5kPj3K2kK2l4J5j5K1Pk7J3
1175Fn5P7kk2N6n6K5l7k9K4NK3J4j8n1P9n7Kj9l9L2M4k8j2M5j1j0L3JOn5k6K8
1208b7J3k0P0M2r0L9m1k1L3j3K2oM1o6l1J1O3j5L7k6Rm9N0j6o3l0Q1n2J2J3OK6
$$ y = [-35, 31, -34, -17, 12, 7, 40, 5, 37, 31, -31, 73, 15, 29, 4, -45, -31, -70, -34, -36, -24, -15, 31, -49, 30, -17, -45, -23, -40, -67, -9, -67, -90, -58, -77, 7, -42, -42, 26, -10, 58, -27, 1, -16, -50, -21, -66, -43, 9, -5, -14, 6, 10, 6, 31, 15, -43, -17, -50, -86, -34, -40, -33, -10, 2, -10, -53, 3, -9, -11, 0, -61, -66, -37, 0, 29, -10, 4, 20, 57, 42, 64, 2, 41, 2, 62, 18, 61, 13, -8, 74, -6, 44, 17, 46, 46, 29, -29, 82, 11, -10, -26, -18, -39, -46, -18, -16, -22, 22, -19, -24, 7, -38, -29, -32, 25, -26, -25, -2, -55, -3, -20, 24, -14, 9, 46, 35, 8, 47, -16, 7, -61, -77, -17, -33, 25, -28, 19, -22, 40, 36, 36, -11, -19, -18, 16, 7, -1, 27, 18, 3, 34, 63, 32, 24, -12, 42, -4, 27, 33, -9, -14, -17, -38, 2, 12, -6, 48, 24, 64, 35, 30, 1, -11, 3, -7, -4, 53, -47, -16, 18, 1, -26, -10, 39, -63, -8, -10, -3, -16, 6, 4, 26, -8, 7, -8, 13, 20, -7, 6, -49, 28, 26, 4, 60, 4, 29, -8, -37, -13, -8, 15, 29, 11, -40, 39, -18, -16, -35, -74, -42, 2, -26, -38, 7, -4, -14, 19, 20, 26, -29, -55, -27, -14, -34, 36, 78, -12, 27, -14, -35, -2, -15, 7, 1, 42, -24, -55, -44, 19, 4, 41, 15, 24, -25, 25, 9, -54, -84, -3, -55, -43, -30, -24, 2]
1240Bj0J2n1N8OKl0k0K3m2O0K3L8j09%M7lJ2L8k9qnM9k6rn0K5J3qk7lK8Lm4K5
1275a0Rn8M3k3K5L6o5J6N4K2p9QJ1j5mJ4L5j6jpL6j9K3m6J0L4p4O0mlk1M1k4j7
1309iL7j3l9RM2j5o7N2k5L3m1j5L6lNm2O5K2l5j6P8n9k7J0R8p7pK4k0M8Nm4J6
1342B6Nl8K3m5N4l8K3m5K2L7nJ2kk0K0km3j3L1m0J3J0j1J7M5m5L4l0J5M4k6J5
1374D3j6l7n3P6K3o0kN6J6m6M6r5Q5j6qm1M1j1Jo3O6m1%L8k0ML6n7QL0r0P2l2
1407d7N9J4L5n4o1K6L0l2RJ4K2l3L1l1P1n2m7J3M7K2k3L7n0K0m7J7k3K5L6l9K1
1438A0OJ4l0Lj5j8lQN4k4k6l9N1l9O9n9P3l8J3jqL9J2q6Q5K2j03L7OqOm7Q1n4
1472iJ7J9m2k7N5rm9P3J7o0mJK8o5O5k8mL6o5L1J1j2M8k3oL8l9P1m6k2k8K8Ro
$$ y = [2, -8, 4, -47, 11, 17, 19, -11, -31, -8, -50, 10, 33, 71, -38, -38, 9, 6, 18, 56, 27, 19, 14, 63, 37, 28, -22, 3, 16, 8, -19, -22, 6, 9, -35, -10, -1, -59, -16, -39, -14, 22, -43, -27, 27, 49, -30, -22, -11, -26, -30, -16, 19, 3, 2, -5, 31, 12, 35, -11, -1, 33, -41, 19, 15, 12, -9, 32, 8, -9, 28, 15, -24, -15, 27, 12, -55, -3, -28, 5, -36, -51, -15, -18, -13, -55, 10, 32, -3, -19, 59, 0, -27, -17, 81, 4, -3, 21, 1, 49, 54, 10, 26, 31, -7, 16, -29, 25, -13, 10, -35, -13, 24, 19, 31, 29, 9, 29, 27, -16, -29, 2, -38, -25, -15, -26, -9, 36, -9, 25, -5, 10, 54, 28, 43, 27, -10, -63, 13, 36, -24, -26, 30, 46, 0, 46, -49, 36, 20, 12, -29, 12, 1, 2, -61, 5, -36, -36, 2, -18, -14, 22, -35, -27, 3, -87, -15, -47, 12, 26, 61, 7, -54, -28, 2, -30, -21, -7, 15, -18, 13, -18, 53, 1, -46, -33, 14, 36, 13, 50, 0, 20, -27, -10, -33, -8, 28, -11, 10, 16, 30, 0, 3, -12, -30, -33, -25, 29, 5, -21, -60, -9, -48, 21, -38, 35, -3, 10, 9, 1, 40, 52, -34, 51, 73, -30, 7, 13, 5, 11, -36, 45, -9, 8, 27, -15, -42, 13, 4, -45, 28, 45, -15, -19, -18, 10, -55, 10, -18, -22, 14, -51, -20, -9, -21, 27, 4, -2, 36, -3, 68, 22, 0, -28, 0, 9, 3]
1506Cj5K0J09j32k4N1O6n9k4m6Q1J2l3l0N8p8L7m1O6Ln2o4J29J8j4l6jL4k2l6
1536b0O%J0K3m3M5m7P3j02J00p3J4MQk0M0k8j2k3k0N0kL8o5J1PL0Pl2PQk0OJl4
1571e3nQ8l7Oj5RJ8OJ4J0j8J3J2J0o7Ql5L7l3L2K8k5k3j1J0P4p1L5k7j4L0m4j0
1604d8K0j5J00j18J04p6M2j9J4j4J1N6m0K5o0J3K2lnk6Rj7pK7OK0l4rJ0OO6n4
1636Fm0L4K0j3m1Qk1rL0N4l5K7p9L9ML5k8J5k2M0m3K3Lk9nJ9J8RJ6m3K9j2k2L2
1670A9p5N0K5J6l6J7l1K0KPm1J5j4K1j0J8m0M9omK4jl5j0O3j9rol6oO1RljL2r7
1706c2K9k6L7k8L3k1Qk1K0LM1q5M9jm7J9OL5j8j7K0j3P1n9j5K3j1ql0O4k4J6m
1739A4J0k1l7L4J6K6l1Ooj1JrK2K2m2n3N6J6k0%k8J7J2k2QlK9l1qL7k6nK6K8m6
$$ y = [3, -12, 8, 117, -15, -39, 12, 78, 19, -5, -51, 30, 42, 9, -21, 37, -41, -4, -45, 21, 24, -28, -92, 37, 55, 41, 5, 4, 38, 16, -20, -14, -14, -4, 19, -24, 21, -26, 47, -55, 45, -28, -14, -10, -2, -22, 18, -10, -22, -45, -65, -15, -17, 21, -44, -33, -26, 4, 11, -21, -14, -6, -26, -20, -19, -53, -58, 30, -7, -1, -16, -7, 11, 17, 31, 41, 23, 36, 48, 58, -9, -1, -36, 1, -32, 0, 28, 3, -20, -31, -21, 53, -18, 17, -10, -24, 6, -38, -48, -28, -43, 57, -61, 43, -33, 9, -10, 4, -10, 1, 57, 17, 42, -18, -5, 17, 14, 9, -17, -8, -25, -32, -5, 1, 21, -13, -22, -12, -6, 60, 6, -34, 0, 20, 7, -34, -26, -47, -56, -26, 28, -7, 20, -59, -20, -16, 19, -9, 6, -16, 24, -19, 4, 7, -22, -27, -8, 10, 19, 35, -8, 21, 9, -13, 19, -56, -6, 19, 35, -1, 16, -15, 5, 7, 14, -27, -12, -26, -5, -15, 3, -37, 12, 6, 2, 26, 25, -10, -20, 43, 24, 15, 9, -27, -33, 28, 37, 34, 33, 65, -32, -3, -29, 8, -20, 13, -8, 0, -21, -1, 2, 43, -42, 7, 6, -41, -22, -16, 19, 1, -16, 4, -9, 62, 3, -12, 11, 0, -8, -38, 26, 2, 18, 14, 24, 3, -34, 0, 16, 42, 11, 17, 11, 0, 1, -8, 14, 36, -6, -59, -3, 13, -7, -7, -35, -18, -6, -28, -20, -23, 6, -25, -33, 4, -22, -27, -1, 27, -19]
1774a9mQM0j3M7p2M0j3J0M2j19O3NK1l4M8o0kL2j8j7k4M5K0k4pj8mJ1J7l2K8k8
1807c1K9j1j5K9m3M6qQj5j3N0j6j3J4j2k8M9K6m7L4j4Oj5n5M8k6N0Pp8JM7OK4
1840C4n1NJ2qj9L9LM1n0l8k8L7J5K6K6p4J1K5p2Q9Kk6KN2m1Pl7J1P7j15qN4Ok0
1874a3j7N4m7L8J4m6N3n6j0N5k0j8m2O4k6L5J0Rn1j1M6mk4K8k4Rmj1Kk2R2n6M
1907A1ol1J4P0q6Jj1N9p2R7m9J4J6l7j7J4k8P2n3m2P4l7J3j5R7r6oM6mJJQOo3
1941c9N0Nm7OK3k1N9m8KO6Ml5L5o0jk9K5K7m3K1k6K3qK3k6k4K7K1m1l4R1lj4J
1975A0oj5K7m6M5L5o9L3jk1J5l7lM3Mj0k7N2m6K4J6j7L6m1qm4O7k8J1k4J9qJ4
2008@K3NN0p6K3o4j0M8N6rj6j0j5j8O7n2K4J4l1M3l8k5O7J5p1Oj4j0K7m0jJ0r
$$ y = [-19, -23, -15, 25, 12, 59, -13, 27, 14, 24, 66, -53, 10, 15, 36, 2, 50, -10, -12, 20, 2, -15, -39, 6, 26, 2, -5, -23, -27, -16, 1, -31, -3, -31, -2, -13, -28, 1, -42, 4, -4, 4, -11, -24, 26, 10, -3, 11, -1, -29, 20, 46, -1, 33, 19, 25, 10, -45, 3, -23, 27, 34, -44, -43, 4, 10, 34, -17, -12, 0, -8, -27, 12, 15, 56, 6, -32, -60, -23, -8, 18, 44, -30, -19, 6, -66, 23, 25, -1, 1, 53, 12, 19, -18, -7, 70, -45, -53, 1, 7, -13, -30, 24, -23, 15, 29, -17, 36, -20, -30, 25, 5, -13, -55, 9, -17, 18, 28, 37, -14, -25, 21, 17, -7, 21, -3, 6, 2, -9, -7, -29, 63, 7, 11, 5, -26, -12, 58, -28, -27, -38, 21, -51, 46, -3, 11, 27, -10, -27, -13, -41, 31, -22, -64, 10, -27, -14, -29, 68, -28, -34, 12, 8, 9, 10, 18, 24, -39, 11, 16, -31, -25, -2, -23, 36, -12, -10, 56, 60, 25, 60, 0, -1, -30, -5, 22, -21, 0, -26, -3, -11, 12, -14, -38, -11, 10, -31, -65, 26, 23, 9, 10, 4, -11, 16, -30, 15, 50, -19, 14, 13, -8, 7, -30, -33, 10, 14, 4, -23, 29, -17, 7, 23, 6, 42, 1, -7, -51, 16, -12, -1, -25, -6, -14, 0, 23, 28, 78, 2, 25, -39, -49, -1, 55, 46, 30, 20, 5, -13, 54, 2, 26, 40, 9, 52, 14, -11, 56, 71, 0, 6, -8, -18, 9, -31, -32, -22, -31]
2041c1j3J8jK2QLK8j0k4L6ro7Q1k7L0K8l9l0nPK4mkJ8n2M0p0N3Nmj1l1j2mMLK7
2078a1lK7jm0K6k5J5Rm4M2k3j3M9rl7M9J7k2J3k0JOo7O2N3p8M1Mj1nJ9%l6%K3
2113A1Qj7Pk6k5O2o2%K9j4K8KpooK5j9K0jpQNn5O1k2l4K1k9L3RQ8o4J1Np4M1L
2150IK5k3J1l6kj7K8qK7j4o2J07j6k7k9mJ5oK9m5O9m8K7l0N5L5j02jJ21q4L1m8
2182a3L2m3L0N8q0k8O8l1L7k2Pl2O0m6kK8Pn2K0K9n9P5m6Lk2P3q0N2n3KO2J8k5
2215B7Km9K0L6Kk6L4p0O6m6k8K2K8J5q3M0J6k9L5k0M3l8j1P2o2j1K8j2NJ1j3k8
2247b4M7jj2p%K0j3nL9n3Rj8oN3K3qp3M0nM3k0jm8j5M0L3l5k9J9j2j2RK6qJ9n2
2283c7O3m8P8j13N4K1n1JQJ5Mk0J2O4j4k7j5P3k0l2l9M0oPJ7k6M2joo4NNj6O2
$$ y = [-31, -44, -26, -27, -5, 3, 6, 34, 24, 0, 36, 27, -40, 41, 14, 44, 72, 33, 3, -2, 5, 29, 25, 23, 41, -11, 29, -41, 12, 17, 13, 2, -29, -41, -45, -41, -38, -11, -14, 13, 12, -28, -2, -27, -12, -3, -47, -5, -28, -41, 8, -1, -38, 11, 28, 6, 19, -1, 0, 6, -61, 1, 54, -24, 17, 21, 10, 5, 24, 24, -12, -12, 11, 19, 2, 9, -17, -42, 20, -42, -42, -13, -27, 1, 3, -4, -10, -16, 9, -10, 10, 9, 2, 10, 15, -40, 21, -1, -35, -14, -43, -10, -1, 87, 23, 34, 39, -35, 6, 9, 34, 11, 22, -14, -16, -33, -5, -13, 14, 0, -62, 45, 29, 2, -27, -31, -16, -22, 7, -38, 31, -17, 10, -20, 35, 70, -32, -33, 88, 4, 35, -13, 19, -24, 6, 64, -16, -44, 24, -7, 30, 8, 15, -17, 43, -3, -5, 23, 30, -22, -2, 27, -32, 43, -3, 0, -22, 51, -29, 23, -30, -28, 34, 52, 27, 29, -20, 0, 36, 38, 12, 46, -24, 42, -4, -32, -10, 18, 33, -50, -10, 6, -23, 12, -8, 35, -3, -14, 58, -4, -15, 13, 1, 6, 17, 4, -24, 23, 22, 10, 3, 3, 23, 10, 5, 44, -9, 0, -18, -24, 29, 52, 44, -29, 11, 6, 49, 29, 28, -20, -35, 5, 38, 3, -26, -7, -19, -31, -22, 4, -4, 15, -37, 26, -22, 56, -57, -3, 18, -33, -32, -24, -9, -5, -25, -13, 51, 37, 10, -5, 68, 48, 16, -23, 17, 11, 18, 35, 9, 51, 50, 44, -20, -15, -10, -26, 36]
2317C6k6j0j4k3M1Oj0J0j8Nm0J3M3k7L4n0O0o2O2k3oj5mJ1l1M7L4l7lk6L5l6j2
2350c6N0m0J0QK1j3J2L5j06K3QK8lk5J6m3N9pj5J5k8j3L6k3O4kJ0l2j8j3M5l4
2382a1J4Nj9M2j7rK1l8NMj1L0rJ0j7N7q4LO6Jj03L4J3m2Q2Nq8%M7Mk8O9m0oK0
2417A0Nk3NJ0j6N2o2P9n7%L2k0L2m3J5J0l8pNN7j7l4J2l0N2j9r2R5m1J8M9j07
2449f8M8qJ5J9J3j7k6ML0j0oO8r0P1k7J4l9rJ8J0%p9Q5o4P6l7J4l9M8k0km7O5
2482A0k8k8L4l8L5K9m0n8O1K3k4J1J2j2K2k4Q8r3K1NJ9l1J4pk5n2j7R7J8J3n2
2513a7K9Mj0M8r2O3o9J6PJ5J8m4J%oK9Jm6O9o5P4j6k8J7J3Pk0K6l6o1Q1rOJ9j6
2548HLMKM1mn1k8M5m4NoN7n2J0l0N8J6k3Pn5M3J6o4P5l6l5L4rL4m2J1j8M2k9N0
$$ y = [36, 10, 0, -14, -37, 4, 10, 0, 10, -8, -3, -43, -30, 13, -14, 20, -30, 30, -32, 30, 7, 1, -14, -18, -7, -38, 9, 43, 6, 3, -23, 12, -24, -36, 14, -26, -16, -8, 13, 0, 12, 47, -59, -36, -28, 0, -3, -28, -12, -55, 4, -3, -18, -3, -31, -44, -8, -31, 33, 31, 41, 9, -9, -22, 23, -11, 3, 8, -11, 31, 14, 5, 26, -12, -7, -3, -14, 16, 7, 17, 0, 57, -27, -24, 42, 43, -60, -26, -13, -55, 27, 32, -56, -56, -9, -5, -33, 36, -4, -10, 10, 15, -8, -3, 7, -9, 43, -19, 60, 3, 3, 35, 15, 47, 4, 19, 29, -9, -16, -11, 46, 29, -5, 7, -23, 29, 10, -82, 13, -28, -10, 39, -68, -20, -28, -13, 6, 19, 2, -24, -20, 10, 0, -6, 62, -28, 43, 16, 30, -9, -18, 0, 10, 10, -69, 16, -48, 28, -9, 5, -34, 14, -6, -8, -55, 10, -18, -46, -12, -50, -15, 14, -26, -84, -23, 0, -24, -13, -1, -13, 9, -15, 73, -20, 1, 6, 25, -6, 8, 1, -24, -76, -93, 4, 22, 35, -17, 12, 16, 6, 54, -38, 25, -44, -28, -21, -6, 12, -32, -31, -31, -37, -8, -7, -53, 16, -49, 25, 9, -19, -2, 11, 18, -2, 24, -12, -73, 8, -1, 5, 24, 8, 11, 15, 17, 58, 54, 3, -25, 20, -24, -19, -25, 32, -20, -10, -40, 18, 34, 11, 18, -37, 6, 22, -42, 33, -3, -38, -4, -13, 21, -21, -10, -28, 14, -15, 35]
2583C5jj4rM4k3j4k7J0lK4m5j3O7rNk9mL9o1M9n2M1q3L8QK2L3m9N3m1l6J9J0m
2617b0K9pk5LP5n5rj0P6l4OK8q8Q8mn8O6o1On9M0J5J5jj6JL3n4L6Km6QN2k1l6
2652b5J5J0J5k4j2N4k6O7p5M7ol6K7Nm5Oj5O6l9Qj3N5j08J18j37O9J7K0o9K0M
2683gJ8oJ8m1j3nN5k3rJ7k3L6pj1lN4n5j4K5K6l3rJ2J6mMM0m0%Ro8M9K1n8J8l
2719a4K4k4L4j0k0m5O2n3N9l8j7L9Nl0P7m7N2m8rj6L5k6LJ7l6O0k0m4K8J1loJ3
2752A3pm8N4k4L8qq9M2N2l3%n3J08l7n4OM9l2JlL0k5l1K1K2KP2r4J6j5J1K6Lk1
2786hO3n7J3l9J3N9K4o5l2P4m6J9m5L2oL1l0j0Ll6P3n5K6n2O5J7m9L1m2m0O4L5
2818C0rk5J0pJ9L7m1L5Np3lL4L1J9J2n8OL1o5J3m4K9J9m4L2J7l6N0m5L0l8J3J0
$$ y = [35, 34, 20, 11, 55, 32, 18, -9, 1, -2, 22, -23, -36, 31, 22, 27, -2, -6, 33, -28, 21, -31, 10, -73, -35, -27, -5, 28, -21, 32, -9, -45, -26, -16, -20, 9, 2, -23, -20, 55, 0, -9, -19, 57, 23, 29, 57, -31, 57, 53, -5, 61, 0, 6, -53, -13, 2, 17, 16, 0, 1, 34, -20, 16, 18, -28, -20, 32, 11, -25, -10, 0, 15, -9, -21, 33, 7, 74, -1, 46, 40, 4, 31, 36, -9, -3, -18, 48, 9, 17, 4, 59, -49, 69, -68, 1, 18, 38, -31, -11, -7, 11, 5, 23, -18, -31, -36, 19, -4, -13, 4, -19, 17, 10, -1, -4, 50, -5, -19, 6, 32, -1, -10, 2, 18, 14, 18, 58, 18, 18, 27, -41, 8, 29, -29, -11, -14, 10, -14, 20, 10, -10, -55, 7, -46, 13, -25, -42, -3, 2, -28, 49, 2, 54, 6, -3, -19, 16, -10, -7, 10, -26, 34, 14, -30, -2, 9, 6, 0, 13, 6, -42, 12, -12, 26, 18, -71, -29, 23, -10, -10, -63, 45, 8, -46, -40, 9, -23, -22, -25, 5, -20, -51, -30, -8, -6, 66, -28, -12, -27, -16, 10, 13, -8, 55, -2, 11, -28, -15, 44, 68, 3, -29, 45, -1, 18, -27, 5, -1, 30, 0, -10, -7, -43, 30, -25, 1, -51, 14, 31, -18, 13, -29, -69, -5, 30, 21, -4, 6, -1, 18, 55, 14, 49, 54, -19, -22, 12, 43, 62, 74, 16, 22, 53, -12, 1, -43, -14, 5, -39, -7, 10, -26, 24, -21, 9, -29, -16, -6]
2851fJ0qK8p6P1J3l1Kn0O6Jj4Qj0K3k2%J9j2K0k1K9o5mL9k1J%j2RqMJl8O4m1j
2888c2K5PPk3M9k8k4K8k8K4K1kmm2M0M7q9M6%k6L9LJ8m1kL0m7rO3l9j1L6l8K4
2922B2L6m9k5QL7m2K2K1n1N0m8J1L4l2J6ml8N2nmk7N1l1L1rJ0m4L9r6O0rM4m3
2955a3L0m7J2J5l9M8l2m%QN2m9l7M1n6N3j2M6k1m4O8Ll8O6J3q6J7K3l7P7q2P5
2987E0k2Kpm3M9j2m3M1M9o9PM1l5p1L0L6K4l2l3L9oo1N3j0j8P7o1L5j9K7k8j9
3019b9kJK5m1N0K8k6j4K0J8m0J4k2L8j2jK1J5p2R7q4K8l6O6p1K9L5n8L8rm6K4
3051a6KKO3k4j2J4n0J0Qn3R1m5M3k8j8K2l3L2k0M6q8J6M0Mk1NJ0j7k7O7O2p2m7
3084c4Kj0N5J5j4l7k2P6o2J9K5k1kL4n3O4j1j9L9n5O7k6n1L7l2R7r5PLL9k8L1
$$ y = [-6, 4, -4, 24, -52, 19, 32, 1, 3, -47, 19, 20, 6, 14, 4, 27, 5, 5, 24, 12, 32, 11, 40, -25, -29, 10, -11, -10, -10, -22, -13, -21, -17, -16, -54, 10, -31, -32, -7, 0, 7, -16, 33, 5, -19, 9, -19, 5, 26, 24, 20, -22, 18, 65, -24, 22, 22, -4, 35, 38, 56, 15, 13, 43, -4, -13, 50, 11, 0, 36, -2, 22, 58, 9, -16, -8, 29, -13, 9, 30, -21, 29, -19, -8, 26, -6, 10, 6, -32, 20, 15, 11, -16, 35, 4, 35, 26, 36, -8, 31, -65, -5, -14, 30, -13, 17, -30, -18, -3, -42, 6, -26, -30, -30, -22, 30, -19, -56, -15, -71, -18, -30, 16, -5, -49, 19, 22, -16, 50, 63, -23, -6, 17, -20, 57, -25, 50, 28, 30, 23, -20, 29, 17, -26, 15, 64, -5, 2, 43, 8, -63, -33, 3, 27, -5, -38, 1, -5, -66, -13, -23, -41, 36, -25, 10, -9, 18, -10, -29, -31, -30, -5, -46, 4, 32, 6, -8, 12, 30, -10, 4, -18, 20, 8, 7, 28, 43, -29, 68, -16, 12, -24, 42, -29, 0, 35, -23, 15, 6, -40, -16, -14, -12, 51, 27, 15, 29, -21, -11, -3, -56, 35, -10, 33, 5, -13, 9, -24, 8, -12, 34, -54, -38, 2, 6, -15, -10, 0, -17, -44, 23, 85, 13, -34, -32, -42, 13, 28, 14, -23, -45, 31, -31, -12, 13, -8, -10, 24, -29, 35, 24, 5, 44, -11, 56, 30, -21, 16, -16, 81, -14, -7, -4, 35, 7, 38]
3116C8m5L5k7j7N2k5p8L9P5j13M9J6L4l8k0K4rJ3n9N6J4Mj7l2jL7N4m7m0J00j05
3147c3K1KJO4j9J5q1rM6lo9Q0Nk5K1m6L1J3l3K5m0M2j3j6L3k3lM0n5K2L7J3l1
3180A2k7k8K4J8J9lj5K6Mmm3K7J6m9L1l9N6j4j3j4K8k0j5P6o1l%N9n7J1M7j4n7
3213b2J2p0O3K7j0L4l1oJ1m2Oj0M2L8m9J5kJ2jm9mP5l1K6o7K5J4Pn7L1k6K6j7
3246c0N4m9k9N6p7P4k5K9J2KJ2J0n4j1K2O1Lk6m6l7O9K3j03O1K4NJ5n4J9M2k0
3277C2p7K9M7n9P3r3N3j6K6m8nJ7j6L6n2L9j7L5J9k4j5M4mj2j1l0j4O3J4pk7K2
3309B2k4j9%J0o5O0J0j9j7L5P1l3p4O8m2j4O6n8lJN8o0lPN2k8L6n1J8j5j6O1K0
3342E4p1j4M8J2l5L6k6Ok0K8k9k5P7K0p0J3J0j4K2k7j5pM7p7K0Q3p9rM1jjrl1
$$ y = [38, -7, 28, 1, -16, 36, 11, -67, -28, 47, -66, -17, -1, 33, -5, -25, -1, -10, 3, -56, 0, 14, 18, 1, -31, -32, 5, 59, 12, -28, 72, -33, -12, -10, -9, 55, 36, 51, -30, -39, 7, 4, -65, 15, 20, -5, 16, -30, 1, 14, -19, 6, -34, 8, -5, -21, 12, -11, -14, 26, -29, -7, 30, 43, 12, -15, -43, -19, -1, 18, 15, 0, 26, 30, 26, -17, 10, 26, -23, 8, -31, 25, 11, -2, -16, 12, -8, -23, 53, -8, -11, -11, 48, -9, 2, 49, 35, -22, -10, -80, -17, 10, 0, 34, 3, -3, 8, -34, -28, -38, 4, 42, -7, 8, 6, 18, 17, -32, -36, 39, 8, 34, -33, -8, 6, 13, -44, -13, -39, -13, -30, 24, -25, -54, 2, -75, -1, -26, 3, 15, 17, 29, 39, -15, -26, -4, 57, 60, 34, -12, -49, 20, 43, -60, 1, 25, 30, 45, -9, 10, 52, 32, -45, -16, 31, -28, 45, -48, 5, -11, 15, -33, -38, -21, -37, -1, -53, -14, -31, 4, 23, -1, -16, 28, 24, 12, 1, -29, -43, 20, 34, 27, 0, 22, -2, -21, -21, -11, -76, -16, -6, -25, -42, -7, 64, 31, -43, 25, -17, -31, 35, -23, -26, -25, 33, -27, -30, -23, 29, 1, 37, -14, 4, -11, -27, 34, 54, -17, -31, 17, 29, -6, 30, 4, 10, -10, 18, -11, -36, 41, 61, -9, 4, 14, 0, 22, -5, -20, -27, 20, -57, -37, 46, -33, -42, -1, -2, -3, -12, -43]
3375d3K9O5l9nl1l4O4o6P6mLk3J1l6N9n2P2j1k9j1K2N5n6J2j8L1m1K2k5L7p5R0
3407D9j8q7R0k1Pnm5J7K6j9L2p7N5Pk3QK6n3j1L3k6N0j8Rj5K3j6rP1j6lJ8m7N
3441A7k6j4k3M6m8K9OnL9j4J4n4M3k8j4lM4k3k9K8K0j4mKP2m3J4j7j9J8J4Pl3
3474Bj2N8o0KJ8k1K1k4j2K7Lj7KK6j9Kl0lK6k9N8l7M3l1L1J4k0m0L8l4L7n9N5
3507A5K7jm6J9m6J5l%K7L6o8K3MN4r5L4L1l8L4j9nJ2kK1k4oL3n5J9J2p3L4M4j9
3541fK8k4L2m8K2l4N6nlOK2j1n0J6nQM6n1M0RK6j09joO2Nk9LO0j59J09n7P3N%
3576C0qq8Q5qK1l2M2l9K2m8N8j4l5j0J1O7j0Qo6N1J7p3L0Ll4mP1q9J5J8K8Pl5
3609iQJ7m5kLM7l5J8n0M0l8M4k5O5k1Pj3PpPl7J0j8lN0j9l0N8k9j3O0k5Mo0M8
$$ y = [-43, -14, 51, 12, 7, -24, -58, 6, -60, 16, 12, 15, -8, 3, -33, 26, -26, 46, 35, 6, -5, 17, 72, 16, 28, 10, 41, 0, 22, -3, 34, -41, 49, 31, -56, 34, 13, 20, 15, -30, -13, 13, -6, 26, -51, 4, 11, -12, -4, 22, -31, -42, -9, -35, 15, -3, 6, -9, 14, -2, -11, 60, 44, 41, 59, 12, 17, -9, -23, -46, 0, -48, -19, -13, -18, 21, 7, 21, -33, 10, -18, -32, -35, 9, -14, -43, -15, 5, -9, -13, -11, 61, 18, 32, 15, -4, 14, 28, 35, 2, -10, 48, -12, -10, 8, -13, 8, -16, -28, -1, 2, -15, -13, 13, -6, -4, -34, -37, -11, -40, 18, -19, 24, -7, 24, 38, 18, -22, 16, -18, 19, -40, 15, 42, 41, -5, 14, -32, -17, -20, -20, 7, 43, -25, -2, 2, 56, -39, -5, 26, -12, 22, 3, -2, 10, 8, 29, 5, -1, 32, -23, -4, 8, -65, -31, 13, -6, 22, -2, 30, -18, 4, -30, 26, 21, 18, 24, 46, 35, -15, 1, -4, 4, 50, -1, 39, 48, 74, -35, -36, -42, 20, 25, -4, -1, 59, -100, 9, -48, 25, 30, 30, 22, -66, 19, 11, 32, 0, 42, 3, 25, -23, 35, 21, -14, -24, -13, 54, 44, 52, -14, 37, 54, -19, 11, 14, -20, -24, 47, -42, -27, -9, 19, 26, -9, -1, 16, -29, -31, -28, 19, -16, 2, -48, -8, -46, -2, -27, 38, 17, 24, 11, 18, 11, 18, -19, -9, -27, -30, 20, 1, -29, 29, 0, -13, 47, 22, 26, -34, 14]
3644A4rKm1mpO2k7K6K9k9o6M6J6k8L0J9K2n6Rom1N1k1L0k5PK1o4O6n3M1j8QL6
3678D0n4L5l8QL6k6Q5j26L0J7Joj6l1jN0k6K0l3J6L9n9l4Q1L5n5k6Q9J4q7K0l
3710eN2K3l8p3K6PK3l5N6o3K2m9P9k6rk0rO1l0J1K0j0k1K5q4K1L6Mj2p0Q8K1N
3743B6qj3J8J9j7Qn8j3R0o4J4qJ6mk0L9n1L4mj0J8k3ooJ0K4j9N5n8M7j5l0K0J6
3777B7l8k7JOL1j4M6Om7%L6LK8n2rk9M1L0m3J7K4l4Qk2j7M7k3%mm4N8k0k0nRP4
3813D4o9N0Nn8M4k5J8J7j9pJ7j9L3J3j6k2J7Qj6p1P6k1Qj0J3k1l3L3%N5q5L1j9
3846b9P5m6J0n8j5M9M8l0m6O1m6L3k4J4pqK9n1N0J6JLj2p1K8J0N8n8J3J9nK8k4
3879A5j5QL5k5L0n0J0K2p8P3m6oJ4J5%k2k1J7m3L4kJ7j1MO6lj1j0q1O9KN4k3r1
$$ y = [14, 5, 7, -34, -38, -45, 17, -10, 16, 45, 16, -50, -4, 12, -16, 14, 33, 55, -1, 8, 2, -39, 12, -9, 21, -4, 3, 24, -40, 26, -27, 14, -4, 4, 40, -14, 21, -17, -9, 27, 1, 86, -40, -10, 7, 8, 2, -14, -45, -46, 4, -22, -2, -35, -19, 20, -39, -73, 8, 43, -12, -38, 51, 65, -22, -2, -5, 47, 70, 32, -41, -15, -8, 15, -20, 36, -27, -5, -54, 25, -1, -10, -30, -39, 22, -8, 3, 23, 13, -8, 17, -67, -46, -10, -6, -18, -88, 0, 21, 26, 18, 5, 23, 42, 25, 33, -25, -38, 52, -12, 2, -6, 10, 6, -14, 25, -26, 8, 4, -6, 12, -11, -17, -23, -13, 11, -8, 47, -11, 36, 21, -9, 11, 27, -11, -38, -37, -31, 0, -14, 32, 38, -9, -9, 27, 30, 58, 6, -3, -32, 9, 39, -4, 13, 37, 3, 11, -11, -28, 19, -4, -4, -8, -52, 6, -14, -34, -39, -30, 44, -25, 25, 30, -28, 16, -9, 9, 26, 7, 0, 17, -2, 31, 44, 28, 6, 23, 31, 15, -56, 20, -1, 7, -3, 10, -11, -44, -11, -11, 44, -41, -10, -29, 46, 0, 10, -48, -63, -14, 34, 4, -42, 19, -27, 6, -18, -4, -11, -19, 10, -41, 9, 25, 26, 29, 17, -54, -26, -16, 42, -16, -3, 16, 11, 39, 15, 0, 8, 43, 18, 48, -2, 8, 30, -48, 25, -21, -27, -13, 2, 2, -20, -41, -24, -67, -33, -35, -18, -29, -25, 41, 38, 27, 17, -64, 5, 7, 61, 38, -53]
3913e3K5L5J5p5R6jl5k8RPnl6j2L2J4k4N4k9J2p1O3LmJ8J8n4J8m8N5jN%J2Pl7
3948a5J0l4J3L8QlJ8m6J9J2rj2L7n8M0K2p5K2L0ok9k2O1j7k6L8n6P5om4m7L5q
3981c5N3kmpL8k1m6J2M6j8m1M6kp6R5Nl4J5j0m7P6n2J0K0Lo3mkj6P0ln9J04p6
4015b5K8l6L4K6j3kLk4lL5m5PO3j2lm8Q3n0j5K2Jp8JM2L6o1JM8k1k2M0m6j4K2
4049b6k2KN9J0m4n0O2L7q0pP1L4l0oj8qM2j0j5pM5m5L0J8K5n9l7K5Jl7K9L5lj0
4083A1L2m2L7lp6M1nK9n2NRK3Jj9k5J1M3k8K6oL6l5rn7L6K7L9o1L1Pp3Q6k3n8
4117d2M5J9n3L6k2K3j2k8M4j0m1M4qom0j2P3j4L5o9N1k6j9L2K5j0oo5O2lK3o6
4149d0K8qL3ql7K1K0O6o4l1K8K9k9O1o6J1Pm3jK2L5l3L6k9qol3J7J1j4qN5j7o2
$$ y = [-53, -28, 7, 22, -53, 43, 42, 7, -21, -12, -5, -10, -46, -58, -26, -12, -36, 18, -11, 1, -70, -7, -4, -8, 10, 28, -26, -8, -56, -1, -2, 3, 3, 15, 22, -15, -5, -39, -26, 12, 20, 17, 35, -11, 8, 20, 11, -1, 36, -22, 18, 40, -35, -13, 17, 11, -18, -40, 21, 4, -22, 16, -40, 35, 29, -15, -62, -27, -35, 18, 16, 12, 5, 43, 22, -24, -12, 34, 16, -25, 21, 19, -57, 38, 43, 9, 24, 14, -33, 43, -9, 1, 21, 24, -39, -43, -45, -61, 9, 6, -53, 51, -25, 3, -33, 1, 27, 14, 12, 15, -9, -12, 23, -22, -15, 48, 36, 33, -15, 68, 18, 3, 25, 26, -52, -51, -9, 27, -34, -33, 15, -6, -28, 12, -34, -48, -26, -48, -46, 13, 23, -21, -71, -9, 28, -52, -59, 12, 46, 16, 10, -8, -16, 26, 16, 1, -6, 39, -6, 24, 42, 67, 8, -29, -4, -3, -40, -11, 24, 21, 11, 43, 1, 38, 35, -41, 0, -5, 24, -28, -23, -14, 9, 10, -9, -34, -23, 20, -8, 18, 12, 48, 13, 4, -53, -17, 10, 49, -12, 19, 26, -47, 39, 16, -42, 3, 22, -31, 5, -17, 6, -6, -34, 10, 0, -41, 3, -5, -11, -51, -63, 10, -4, 31, -38, 13, -13, -32, 0, 25, 15, 9, -56, 6, 3, 26, -40, -12, -20, 13, 5, -32, -11, 9, 75, 11, -20, 8, 37, 8, 69, 3, 14, 21, -22, -23, -1, 34, 1, 37, 8, 0, -6, -39, -22, -11, -25, -33, 22, 5, -57]
4183e7N2J1K1j6J1J2o2K7j5K2J4j8K1n2O5q1RL1L7r9J8P6m8J6J6k2%k4M6k2L2
4214B1j4lL0j4l9j8M9J3p4L7L5j7Nj1mm9O8m1M4k9K3l2pM2m3Ok7N1m3J9L2L0l9
4247Ap6M7L4L4j1p1J4mJ5J0Mj0K4K5n7J5kqJ4L4k9j6M2n1O4om3K4n0K3O5l8o0
4280d3M7k3O0m2K5p3J5%L7oK6l9M6j3m4mQ9p5K9k1J0J0j8Mn8R5Rn7K2Ro6P3Kn9
4314c3L6NkK8j5j4LJ0j8L9j9n0K8j4K1o6O2k3J1O1j7n5L3m6K3j0PK5p8J31k6j6
4346B1m2OK5k3j6j3O4j1j1lKpM6j9p7O3j1j8L4j3qJ9m0N9lLl7m5Q1q1N4k8rJ8
4380b0j5RN7m3mJ1pK9J1k1lJ2Rj7j2%Oj2NM4m8k8K9L8L0n1p4Q9j3o7M6JK2j0l4
4415c1M9j4l0PJ3l7M8j4k4Q5o5M6j7l8K1J8q0N8qNO7k8knj1J3m5M3mo4L2j2L0
$$ y = [-57, -5, 6, 27, 11, 22, 34, -28, -1, -16, 6, 20, 2, 23, -29, 36, -45, -36, -5, 32, -67, -49, 27, -21, -5, 11, -11, -11, -35, 11, -11, 21, 7, 4, 34, 20, -19, -37, 12, 25, -49, -12, 23, 6, 11, 0, -4, -53, 15, -26, 18, -11, 12, -20, -27, 15, -28, -22, -49, 2, -41, -22, 10, 40, 1, -75, -28, 6, 40, 29, -42, -28, -32, -17, -7, -3, -13, 11, 36, -21, -6, -8, -16, -2, 32, 3, -13, 29, -22, 42, 36, -7, 17, -33, -10, 55, 17, -43, 4, -19, 41, -1, 24, -49, -34, -34, 3, -3, 23, -16, 30, 17, -27, -31, 58, -17, 12, -9, 1, 11, -7, -3, -61, 34, 43, -14, 8, 17, -49, 24, 26, -33, 3, 8, 6, 34, 19, 5, 8, 18, 0, 39, 20, -30, -2, -16, 5, -61, 1, -22, -11, 50, 33, -22, 11, -35, -12, -22, -15, 10, -68, 63, 37, 21, -21, -15, 10, -13, -29, -42, 22, 11, 0, -3, -1, -8, 38, 19, -58, 5, -6, -24, 10, -3, -11, 8, -32, 27, 24, 27, -10, -55, 26, -55, -1, -29, -38, -20, -35, -26, 31, -12, -16, -5, -12, 17, 28, 7, 4, 16, 25, 8, -4, -4, 2, -10, -5, 39, -9, -37, -8, 30, 60, 9, -65, 24, 11, -56, -10, -9, 13, 3, -31, 18, 4, -26, -19, -6, -43, 5, -9, -33, 52, -13, 33, 16, -22, -1, 17, -63, -5, -13, -8, 59, 31, 29, 24, 13, 26, -19, 24, 20, -44, -12, -24, 6]
4448Fl1K1Nl8L6j2j0K4L3o7L3Lk4J5jj0l1Q8l0NpqK0nj7j5K0Nj6O7j08P3m6J4
4482hK1J7l1O0o0j6M2P2j25kkRM5j6k8k8L9k8M7j2jN6p2K5L3j1p4M1l2KN6l8L2
4515A3j9J7J5m3M2l0J0JRn6N3J5pl8J6k6K3K3n1O4o4J8L2l6K0J2K1j3q9N4J7j9
4547a6L8k6l0J7J5j2QK1k9k7O6N1j22R4k1k3l0K7lJ9l0L4o3J0O3r6L8J7K3K3l2
4578DJo1O5k6M6j3j5K1np9N5J1QnMok8L1j4M8m1n2N3jk4N5m2jj0mM2lJK4r6N2
4614em2O3n6O0j5JJ3nj8j1J0M4K0l1p8J11o5Rk7PL1K0m1K2N1m9j0J2mk7pj0O7
4647D0Jm4j4kJ4J0K7m9l4O8o4L6oM4j11N4J3lN1n2qK4pL1j2mL8o5K2L7lj8PO2
4681H3j47Q3Mm1K5K5J4o2J6n3N4n2L1k0P7ok1j5JJ5m7M3k3J9L4o2J8M2M4q0m3
$$ y = [6, -25, -4, 1, -37, -1, -13, -23, 1, 34, -33, 0, 3, -21, -6, -7, -17, -48, 40, 10, 15, 8, 0, 20, 15, -2, -17, 3, 8, -8, 59, -49, 24, -22, -8, 13, 30, -1, 59, -1, -17, 25, 97, -28, -30, -32, -23, 22, 6, -22, -50, -11, -39, 8, -4, -5, 51, -21, 4, 37, 26, -48, -7, -39, -37, 19, -19, 13, -6, 11, 26, -17, 25, -5, 5, 6, 15, -41, 12, 27, 20, -18, -2, -28, -5, 18, -33, 31, -33, -15, 17, -19, 1, 13, 34, 21, -68, -14, 3, -16, 22, -4, -34, -17, -2, -14, -6, 15, -14, -41, 25, 76, -46, 48, 27, 4, -26, 1, -2, 17, -13, 21, -42, -32, 31, -65, -27, -10, 13, 36, 4, 5, -56, 9, -17, 29, 16, 1, 22, 17, -62, -7, 4, 12, 7, 11, 5, -23, 8, -6, 42, 1, -51, 2, 1, -23, 32, -10, -11, -21, -25, 17, 14, 15, 39, -57, -5, -47, 16, -40, 20, 5, 6, 19, 14, -4, -15, -5, 39, 59, 28, -50, 61, -4, 5, -22, -15, 16, 36, -5, 17, 68, 19, 9, 21, 17, -10, -17, -27, 40, 41, -3, -17, -19, -5, 5, 32, -17, -51, 17, -47, -11, -17, 27, -84, -30, -17, -20, 31, -21, -29, -5, -12, 19, 7, 3, 41, -24, -2, 35, 32, 14, 21, 83, -64, 19, 23, -18, 7, 32, 46, -16, 0, -53, 1, -51, -20, -40, 37, 31, 10, -5, -4, 11, -36, 7, -16, 3, 37, -25, -7, 35, 79, -1, -44]
4712d4L5R3j05P9o1rL2l8L3k6M9m6J9j8Jj4n3N9L4m6K2j8K7l3OJ9j4L9j7rk2R3
4744F7p2K4j0o8N7k1L8Nl5LJ2j8pQM1j5k0L9k7l0L7j5Lj5rL7k4J5j1OK5J4l8l
4778gJ0qj6M4j13Q2%NJ5J8k9M2l7K1k2m4P7J7k3kn4KL2l4K8J3Nm2J5j5oK1JJ6
4812A2l5L2j7k8R7j06J24n2m2m4Q3J5k9j8m7Q5l8oK7knjqm0j5O3NO7n5Rl1J6J2
4845B8j08P5J9KL9k2Rk4m3K1J1J3l5l3J2M6l0oK3L3rn0K5L5n9L8Ql5K5m1N1l9
4877b1O1j4j8J7p2L0l7N2k1P9n4J7n1J9L6n3K8qj5K8K3l3Rk7j3M5k7k4N0L4lm5
4909hM2l6m3KK6N8k3k9J9%Jj5J5LJ0Rl5Rk4K1j9M2j6L1l7k7K6OL7k0Np2M4k2K
4944a8N4p8N3J0k6K6jm6N3K1j8l3k5N7Mj5n8mK0K8J0K0k5Mk6qJ5k3M0k2K5n1P2
$$ y = [-44, -9, 84, -21, 58, -3, -12, 20, -18, 15, -11, 38, -8, 11, -7, -6, -20, -73, -14, 20, -26, -4, -22, 5, -28, -22, -3, -17, 22, 5, -4, -26, 67, -5, 19, 9, -59, -2, -23, 15, 20, -15, -12, 0, -18, -25, -17, 24, 9, -11, 28, 1, -29, 8, -7, -4, -19, -28, 9, -15, 0, -11, -5, 20, 34, -4, -7, 3, -5, -21, 23, -90, -8, -8, -3, 12, 30, 1, 43, 6, 27, 5, -39, 38, 55, 32, 30, -24, -22, 10, -24, 4, 17, 22, -20, -5, -20, -26, -5, -4, 12, -23, 9, -8, -36, 61, -45, 79, 27, -15, -59, 24, 39, 10, -8, -55, 30, -8, -14, 13, 11, 6, 5, -3, -43, -58, 5, 10, 77, 22, 31, 0, 16, 28, -80, -5, 14, 16, 55, 33, 42, 18, -25, -4, 7, 20, -15, -48, -36, 10, -20, -26, -3, 30, 21, -29, -4, 31, -28, 10, 18, -17, 8, -33, 18, -21, 40, 26, 8, 25, -47, -17, -54, -2, -23, 56, 2, 19, -32, -13, 23, -30, -2, -10, -25, 3, 26, -7, 2, -25, -38, 7, -20, -44, 6, 40, 37, -8, 34, -2, -45, -43, -17, 41, 18, -11, 8, 8, 9, -6, 9, 12, 22, 31, -4, 5, -19, 2, -17, 25, 9, 40, 3, -24, 2, 8, 45, 25, 30, -42, 2, -20, -18, 36, -42, 11, 21, -5, 21, 20, -26, 27, 48, 30, -3, -28, 29, 33, 18, -40, -44, -24, 4, 14, 34, 9, 13, -13, -21, -6, -29, 11, -11, 14, -37, 35]
4977C5m2j7K7k7J3K8J4l3k4N3l6QN1m1J8k8j8K9Q9p3nJ8l5k2MQ1j19K8OJ5k0J7
5009fM5n1mKN3n5N3j51Q3M8%m2l9J3L9J5k2M2n7l4J10n3j3LO1l6J7l1M0jpnk0
5042cj1L7l8J8k3L8j0r3Q6L5qk7K8m1J6mJ6jlK0m5M8n8L8j5J6L4p2K7j0k7L4J8
5075B0rM9p4KJ1K8k0K5J2m2L1p0kR0o9%j3K1N3k3kpk1K5k9K4J0kn0K4mNk0J6L5
5110B4j3L5p8NM3k1PJ7Oj5L6m3j0L2Ll7L4j2m3KJ0J6m2j5P7o0O1kn3L2m2L4mk0
5144c6N3qj8K7M2p7L9m3L8N9n2l5K2m4l3R1j4k0J6L3n4j5L0mRPQro0M8j0Lol8
5178e1O5K8l9%l4K3No4Q0l0K7okk1L1M8n6KJ5okok9L8k4RoJ5k5Rj1j8M6J0j4K
5214I%On5QO2o2M0j1n2R5m9J7j0L2m2k7O0l7rP1qjkj7mm5O0K1m4qJ7M1m5pj0J1
$$ y = [35, -7, -24, 3, -24, -11, 17, 31, -2, -26, 27, -9, -1, 50, 9, 27, -1, -19, 10, 99, 26, 21, 39, 4, -18, -14, 67, -52, -24, -18, -3, -23, -6, 39, -12, -16, -14, 39, -16, 37, -114, -31, 17, 17, -25, -64, -51, -12, 3, -19, 23, -34, -68, 42, -11, -24, -21, 40, 4, 21, -10, 30, 29, 22, 17, -3, -14, 23, -15, 3, -20, 18, 8, -85, 1, 36, 28, 1, 29, -12, 4, 0, 16, 15, 12, 32, -13, 35, -23, 15, 0, 16, 50, -22, 5, -5, -32, 2, 20, 11, 60, -14, -12, -1, 27, 7, 32, 44, 2, 33, -37, -39, 51, -18, -18, -31, -10, 43, 20, 18, 11, -10, 15, -14, 10, 20, 18, -32, -8, -12, -7, -27, -11, 24, 11, 46, -32, -27, 16, -5, 2, 19, 25, 10, 46, 3, -7, 25, 28, -9, 25, 13, -30, -28, -18, -2, -44, -59, 18, -42, 19, 17, -36, -4, -46, -12, -16, -36, 17, 9, -9, 18, 60, -17, 22, -21, 17, 76, 24, -11, 11, -33, -66, 25, 11, -9, 7, 40, -14, -29, 1, -3, 6, 13, 21, 12, -48, 0, -10, -7, -13, -51, 14, 42, 3, 3, -31, -8, -3, -67, 13, -17, 10, 4, 2, -19, 12, 60, 4, 6, 21, 15, 13, 7, -22, 16, -8, 1, -5, 10, -15, -6, -17, -35, 11, 21, 7, 9, 9, 15, -40, -32, 30, -32, 8, -3, -55, 40, -9, 8, -2, 30, -12, -39, 21, -16, -25, 46, 38, 37, 35, 18, 14, -31, 29, 50, 6, -2, 15, 56, 11, 4, -6, 5]
5250En2P4l8L8K5o8kJ1jK5L4o3KL3K0m1J7j3j4L2p1L7LQPJ1K1j2o4K8k4K6L7k7
5284DJ8rk0K3l8k5P1q0N8j6k2P3n8N8l5qk4K8k2K5%k9O6M7q2k2M0l7lO2m9Ok6
5317b6QJ0K9qn4N5j7o5M8j3N4J7l9M0r1Q7p5O0qk7kJ4ML4k9M0l2k3mK5j6QJok8
5352b9M6J4j6K3o8K6J0k4m1P9k4M2o6NP7q0L4l1L5L0k6J6n1%NL2j9M2o0j7L7j7
5384a6L2J7n0L6l0l8M4K7l3J9j8K5k0prJ2Ml4L4Nk0m5M2mL8K4l0K9j3m9j0R6q3
5417b5l6O1m8O4jN7p0RJ0l7K0K5k2J5P7p9J5J5p1K6%KlK2J6m2kjK6Lkjk9L9m5
5452a2qK7k7K9j4L0j5j5k9qP2l8K8N4p1L0jk8Rk9O6Ok9k2l5M6m3O7k9l3L0M5p5
5485b2N1n4O1n9OOJ9ln8M5j7J0K4k1K0Rn9pM2M6n3J5m2K2L2NJ2j1kl8N0k8K8P
$$ y = [5, -47, 27, -11, 27, 52, -16, -18, -7, -8, 17, 51, -12, -10, 23, 43, 2, 19, 6, -8, 24, -47, -10, -7, 1, 8, 19, 40, 28, -36, -8, -32, -6, 31, 4, 22, 13, -7, 16, -22, -47, 24, -56, 2, -14, -36, 37, -21, 37, 2, -6, -30, -2, -24, 1, 1, -28, 38, 85, 3, -19, 21, -16, -19, 43, -6, 0, -26, -18, -8, 21, 13, -41, 14, -3, -68, -20, -33, 21, 38, -1, 39, -52, 35, -40, 20, 12, -15, -17, -3, 1, 35, 6, 46, 14, -9, -13, 12, -4, 4, 5, -1, -29, 17, 31, 15, 38, -30, -4, 6, -18, -59, 20, -4, 38, -28, -23, 54, -26, 8, -23, 12, 42, 16, 32, -19, -19, -14, 18, -1, 41, -19, -36, 1, -16, 16, 33, -17, 19, -11, -49, -5, 22, -11, 8, -10, 15, -5, -12, -21, -9, -5, -39, -5, 0, -20, -65, -23, -27, 11, 35, 5, 34, 21, -28, -38, 58, -25, -61, 0, -48, 16, 15, 72, 2, 11, 21, -16, 4, 29, 7, 22, 99, 20, 35, 50, -21, 5, 5, 7, 4, 26, 42, 0, -2, -3, 23, 26, 24, 23, -6, 33, -12, -20, 7, -20, 9, -5, 25, 10, -5, -34, -42, 30, -8, 20, 74, 3, 33, 32, 4, 13, -16, 50, 56, 27, 5, -30, 16, -27, 40, 11, -22, 8, 53, -22, 29, -25, 36, -23, -17, -11, 8, 5, -53, -8, -25, -15, 9, -12, 8, 17, -42, -49, -7, 39, -14, 1, -41, -19, 13, 18, 30, 19, 17, -21, 29, 1, 29, 36]
5519C6m4l6O0k2K5l4J5k9L4Ll8N7j2l1K0j4l5P2qJ0k4pJl8N5K2j7L1n3k7QnR1
5552F6l4j4j0l1PL9M8j12Q3l4m0J7j5k1K6k1P1n7R0l8nLk3Q3j41N9N1n8o8M8J7
5583a4j8j3R2r4O1j7k5M5rll7P5k7M9o0k6P2rl1l9J2m0Q9L7j18L7lLK3Mnrl7J8
5617a7L2Rm2J7J1l1N1mn9J2K2k5J8J6Pk9NJ8j9k8M3N4p7J3rLO1n0KLj7l7M3K4
5651B0Pl9k4M9K6pp9N1J3l0l1R0n7k8M6o2J8ML2j4J4L8l1k8M1K4n3ok6Q6l1j8
5683elJ9k2m1N5K0m3k1Q9k8J7m4Jk4M9k8qk2K7M3qk8j0N5n9j0K8oj6M9qj8k4Q2
5717E8k3p3J7L1N2n7k0K5l3L0L0p0N3J5p4J9K3J3k4oL4m2j1M3J0J4j8k2N2k4m6
5748b4N1m4J6%Oj0j2J09o7k7lL5q1K1Q2p6N5l1m1Q4m2j0N0q7M1LK%l7j3O1mPm3
$$ y = [36, -8, -44, 16, -6, 19, -15, 0, -29, 5, 8, -30, 27, 15, -16, 4, -10, -45, 27, 19, 29, 5, -2, -1, -39, 16, 38, 21, 52, -1, -28, -20, -25, 66, 32, 18, 8, -23, -16, 23, 71, -41, 42, 8, -32, -15, -30, -51, -25, -46, 25, -32, 58, 20, 15, 18, -5, 78, -63, -4, 47, -11, -79, -31, -14, -32, -45, 47, -47, 14, -3, -28, 17, 8, 5, -32, 43, 16, 65, 5, -21, 51, 42, 11, -28, -16, -56, 33, 70, -48, -11, -14, -11, 12, 16, 11, 2, -35, -17, 15, 24, -18, -1, 10, -21, 30, 26, -33, -21, 1, -24, -6, 10, 17, -12, -7, 11, -8, -36, 7, 61, -16, -3, -12, -9, 52, 2, 4, 7, -10, -47, -4, 20, 27, -12, -36, 13, 39, 32, -47, 4, 17, -13, -44, 46, -11, -39, 7, -55, -37, -33, -1, -15, -1, 37, 6, -22, 19, 43, -10, -16, -42, 44, 13, -5, -8, 11, -11, -52, 3, 23, -20, -41, 48, 20, 37, -7, -6, -30, 19, -9, -17, -39, -12, 31, 23, -5, -15, 40, -19, -29, -1, -7, -23, 26, 18, 0, -24, 58, 35, -38, -21, 10, 62, 5, -15, 10, -23, 7, 37, -33, 20, 35, -39, -20, 3, 16, -8, -14, 20, -22, -33, 10, 20, 34, 16, -6, 46, 22, -24, 27, -17, -1, -1, 5, -5, -17, 92, 25, -2, -5, 30, -51, -30, 52, -24, 31, 0, -41, 43, 1, -9, 41, -46, -5, -2, 0, 0, -37, -50, 11, 7, 14, -29]
5782b9L5l0K6J5n1L5n2N0MpMk8K0%lN7o2J1K1M9o2k2kM2rK5l8NJ6K2m0j5Ll3M3
5817@L3m4pM7jn0KN6m4JK4Jj4m8K4Lj7ON5k7J7J3l6M0Kj2J7n3LK8l6O2k6m6mJ9
5853a2L8o3L8k7M7m9Lj1lM7k0P3p6J2L8Oqn8P2m5N5qm6Mj2k7K8J4n4R5m0k4K2
5886IK2m7K4m8KJ5L5J5m2M5Lo4%K3J4nK5l1N5k2o9J8M9oj0k5K2K0m8M8m6qL4k2
5920a5N9k6n9L4LK6l6mK2m1oL3j6J3pml0K3J4M6j8j8N6nj7j5n2L8K5k5m3O1n2
5953c6N4k2j5J7J9j2M2m1j1QoK4Lm5M3j5L2k4j3rJM1l4J6K5r6Q7l6L%j6PK5J4
5987C0L1p3MO1k7nK5j13R9o1M9kn7M9L3j9J6k0m6N1o1j0Q4n1L5l2L3o8J9J5J5
6018DK4n8j4PM1j8ljRqk0K5K0rK2k7J7K1j1n3N6J7k2l1j7O5k8k8M7L2p8M7m9J
$$ y = [-29, 6, -24, 2, 17, -34, 1, -51, -1, 3, -4, 0, -28, -8, -8, -11, 46, -16, -5, 16, 65, 3, -19, -21, 21, 12, 37, -1, 4, 20, 42, 2, -13, -10, -43, 0, 33, -11, -18, 29, 28, -22, -20, 36, -8, -7, 17, 18, 4, -44, -20, -17, -34, -28, 27, 0, 17, 30, -6, 34, 36, 24, 41, -12, -9, 19, -17, 45, 19, -27, -31, -12, 26, -37, 1, -26, 21, -28, -25, -36, -39, 8, -12, 61, -15, -3, 35, 41, 33, -25, 47, 2, 57, 49, 3, 7, -5, -32, -4, 10, -44, 51, 11, -13, 9, 31, -16, 8, -40, -38, -23, 12, 27, -15, 30, 33, -31, -31, -8, 6, 1, 26, -5, 50, 28, -41, -23, 26, 20, 10, -15, 7, 27, -21, 27, -19, -27, 7, -15, 44, 18, -41, -7, -4, 22, -14, -18, 4, -37, -43, -10, -26, -13, -20, -24, -54, -31, -17, 29, 11, -7, 49, 44, 27, 12, -40, -2, 23, -2, -45, 16, -36, 18, -4, -19, -2, 17, 5, 47, 6, -5, 3, -3, 21, 24, -21, 22, 7, 39, 15, 2, -7, -6, 35, 1, 17, 42, -54, 33, -3, 0, 0, -16, -9, 16, 30, 61, -12, -8, 53, 26, 21, 46, -67, 32, -29, 20, 18, -39, 10, 43, 24, 40, 20, -26, 25, -36, -46, 38, -13, 22, -10, 23, -45, -26, -11, 4, 28, -30, -44, -37, 4, -14, -17, -18, -9, -17, -37, -12, 8, -1, 21, -6, 11, 32, 21, -32, 24, 41, 19, -12, -29, 36, 8, -20, 27, 59, -19, 28, -21, -20]
6052b0J3o4Q1JQJ9kl7Qj5Jj1L2n3J5j7L5j7M3l5j6oK5j4M2j9K0o5M1pM5Mm8N8
6086D5n4l2O5n8O2lk0l3J3K8j9rM3o0NoM8o4Q2omK6o7O6q3P3k6m%K0m0j8M6l6
6120b0L0j7m6N2J1Onk9O9o3K5pK5K6o0Rl9J3k9LP9o2j6O7m1J4k2K3J8K6m7k8P0
6153C5j7J2Jj3j9m4K0qL1rnJ2L4m0M8p9N6J9k9k6nRL7k5N2m1J9m4K0m3P9j9l2
6186a4oqj3L9Lk1JOOoj1P0q9L9K3k1L0%K1m3oL2m6K1L7p2OjL7MRl4P2o7%J3k6
6223a5N0l4ll3K3ML4n2L9k0k4mM5K8l6lJ9k9rL3o9M1J4K6k2kJ7m8NP8k0j4l3L3
6257A9k2Rl1K4K4m2M4j9J1n2lM3L4m1k5K1J9jKm1oJN3mlj2J6J4o3N8m2M6n6P0
6291D5o9N3l4%m6J39j33M3qMO0o8Rl0J05q3JNpK1Ol1L1Pm6J3RqM1m0pN4K7n8l2
$$ y = [-20, -7, -71, 10, 11, 19, 38, 36, -1, 7, -8, -7, -18, 14, -39, -24, -41, -6, -23, 20, -15, -31, -37, -12, -26, 16, -3, 17, -48, -7, -14, 31, 35, -13, 45, -9, -41, 24, -34, 28, 25, 5, -28, -15, 13, -6, -15, 28, -32, -27, -33, 15, -49, 33, 27, 23, 49, -18, 48, -35, 38, 12, 8, 8, 28, -12, -30, 16, -20, 10, -7, -53, -1, 10, 16, 11, -18, 51, -12, 13, 6, 31, 57, -3, 6, -33, -20, -49, -46, 33, -29, -45, 22, -19, -5, -27, -4, 14, 40, -7, -35, 35, 18, 30, 31, 18, -1, -45, -25, -33, -2, -11, -16, -4, 30, -10, 38, -41, 15, 34, 5, -21, -26, -17, 20, -5, 47, 6, 25, -19, 1, -42, 37, 18, -14, -20, -28, -41, -2, 1, -20, -19, -13, -7, -13, -24, 46, -43, -4, 19, -2, 28, 28, 49, 6, 0, 32, -14, 7, 44, -28, -22, -23, 14, 18, 27, -7, 65, -2, -2, 11, -15, 35, 1, -2, -35, -12, -8, 26, -26, 13, -7, -31, -35, 10, 38, 2, -1, 18, -11, -20, 13, -56, -15, -1, 25, 3, 1, 18, -30, -25, 53, 33, 19, -14, 19, -3, 6, -25, -1, 23, -19, 25, 6, 17, -35, -38, 5, 39, -2, -27, -6, 13, 12, 14, -27, -33, -32, 21, 17, 14, 2, 18, 32, -31, 27, -15, 31, -25, 45, -24, 29, -5, -5, -51, 88, -45, -2, -10, -6, 54, -14, -5, -35, 70, -13, -12, -7, -14, 7, 13, -18, 13, 20, -26, -13, -4, -12, 29, -11, -18, 36, 63, 5, -27]
6326b7J2J6K6J2J1j8n6K5M1l1L9p5j7P4k1k1L6k0Oo3O2k4k6N1o8R5m4Nl8M1mN
6358DpJ9K7m3M1l5J6j7j9K5OOm6j5Q2m1K9o8O1l2k4L8OJ3l1J7rnn2Q2n0K7J9k4
6392@QJ0K3mrj5J3k5J6m2P6j3p5L1N0k4NNn4k0M6k0O0p0%K3L7KJn7J3j0PJ2K7
6427B7j0J1j8lM0l0m0qJ6K3k1n9O9j5M2Jn7J5K4n5N6M3Lp8K7PK2m2%O1om8M5m9
6461gNL8o5N5k2m2J2J6j2rK1m2j1O3K5k6L4j2k7J2k8N0j8J2Qk6K2k8rm3R7j9n2
6494b8M6k7m5K7M1lj4k6%m3R6m9J2NkL7j2On6O3l5j0J3k3L5kJ7j8OpN0m8M0k8
6528A8n9L9J2m6O9Om3k5N5n7N7m3K4NJ0m8L9L1l1k7k7P0j5K7k7On7L6k5M7L5l8
6560A8mJ4o0M3l0j5L1K9L0n5kqlN4n0L7m3N1n9J0L7j0l2J8J9l4K5jJ1l2N2l9j9
$$ y = [-27, -15, 1, 27, 39, 50, 32, -24, 1, 42, 11, 50, -25, -42, 32, 11, -10, 26, 6, 12, -51, 11, -13, -39, 12, -56, 39, -5, 0, -38, 3, -1, 4, -3, 16, 43, 0, 41, 6, 22, 5, -14, 11, 17, 23, -23, -38, 44, 3, 32, -36, 25, -7, -31, 7, 13, 26, -5, 12, 3, -2, -54, 28, -22, 5, 24, 0, 8, 18, 41, 37, 28, 13, 26, 1, 17, -25, 51, 38, -37, -6, 44, 20, 25, 30, -24, -44, 2, -18, 42, -28, -28, -5, 32, 34, 35, -22, -9, -19, -12, 0, 27, 17, 28, 10, 7, 47, 17, -23, -31, -15, 8, -13, -72, -3, -18, 24, 25, -32, -17, 7, -48, 8, 51, 54, -24, 3, 10, 32, -10, -10, 51, 45, -3, 42, -7, -2, 36, -29, 26, 4, -38, -26, -10, -22, -31, -10, -52, -63, 0, 25, -1, 33, 21, -6, 6, -22, 28, 10, 22, 30, 4, 26, -2, -11, -54, 43, 24, -28, 18, -9, -54, -27, 14, 11, -3, -29, -29, -72, 24, -25, -13, -8, -10, 27, 15, 21, -35, 28, -7, -17, -4, -27, 8, 6, 23, 5, 11, 4, 54, 6, 46, 18, -41, -2, 10, -36, 33, 39, -4, -29, 26, -31, 26, -17, 7, 12, 22, -26, 13, 44, 13, -14, -41, 29, 14, 41, 14, 20, -37, -1, -26, 21, 56, 18, 14, 28, -32, 11, -19, -34, -3, 26, 56, 1, -1, -9, -12, 42, -8, 29, -14, 37, -22, -12, 25, 15, -17, 1, 20, -14, 11, 10, 21, -11, 41, 2, -17]
6593a7J6L1p8O8lkkLk2L6JPm6L3m1Nl4R1J1p2qM2o5K3l2K8K6%K2k4nk7Q2p4J8
6628il2M5jlM6n8N1pn6J2j4L1l2J4k1K8M7jm0K2Ol4J2J6K5o0NJ4l5N3J0Lo4L6
6662IJ0m6O4q6K5lM4m7O8k6l0LpM6m9P3Qn3pL0nl%j7k7L5K0%k0o8O9k3L9n1K2
6697cj0QJ6k7k5K6m5R0l0K7l7KjM8l6pkK3l0PK3j0J7k8N5l7l4N8p6J8qN2j7m3
6731c6J4nk3N6J0m4L8jRk4L5o3N2PPl3Kl0RK5l7J3RRm9N0pM6k4p7O9K0lj5K1n
6767B5On7K6n0P9k2qJ8j6L8o4NK7m0N5k6L6k5l9J00r8RQqO1k6j3l5M1L6k6K4j05
6800f4K0J7L6L3o6L4Pqornj0N9l3k1M1m2L2j0m0PN2m5K5k0k9P9rL0o3kp%J7J5
6835A5m3M4J8K3o9L7Pk1j1oK9k1j7k8J5RK9j6K4j8J0m6OJ1LL1k6N0p3L3Qpk0K
$$ y = [-17, -1, 30, -48, 20, 17, 15, 13, 16, -6, 30, 31, 38, -8, 25, -16, -11, -45, 46, 57, -15, -23, 19, -46, -23, -55, -27, -1, -1, 21, -3, -8, -35, 47, -27, -9, -41, 4, 3, 0, 46, -12, 39, 32, -24, -12, -26, 5, -27, -13, -34, -6, 41, 40, 0, 22, 28, -6, 6, 22, 47, -13, -8, 6, -29, 24, 34, 37, -27, 9, 19, -27, 37, -49, -24, -27, 17, -30, 38, 12, -18, -15, -22, 24, -25, 48, 56, 3, -4, 26, 21, 18, 18, 1, -26, 9, 29, 29, 9, -59, 10, -13, 26, -25, -3, -13, -5, 11, -16, -41, -15, -60, 30, 0, 27, -10, -8, -9, 39, 3, -4, -6, 17, -13, -6, 17, 7, 24, -4, 51, 14, -20, 38, -38, -20, -28, 24, 7, -36, -22, -27, -50, 6, 16, -28, 10, 9, 18, -6, 29, -34, 18, 25, 32, -1, 1, -29, -20, 5, -32, -19, -10, -1, -50, 0, -7, 39, 15, -62, 7, 27, 24, 9, 30, 25, 31, -26, 0, -50, 29, 7, -1, 17, 1, 39, -25, -20, 7, -33, 22, -4, 32, 7, -32, 68, -30, -21, -13, -21, 40, 14, 1, -34, 7, 43, 17, 41, -64, -44, -27, 9, 42, -24, 10, 17, 9, 3, -6, -11, -21, 38, 5, -16, 25, -17, 15, 5, -35, -28, 24, -21, 4, -16, -45, 34, 25, 55, -8, -10, -17, -17, 0, 15, -28, 16, 34, 57, -12, 25, 32, 11, 0, -6, 23, 2, -15, -43, -28, -19, 10, -6, 18, 0, 10, -36, -30, -19, -16, 15, -11, 39, -34, -1, 7, 0, -20, -18]
6869a8lM3o3j9J07k7K8j03O6K9m5j2J1J9Rm5J2mk0Q6k8k4m6K3O2l6qOM3p4nN3
6901A7m3mM7o9R0l1km2P1k2K2o9QJ6j0J4MQ1q9N0j1Jk4J8L1n2k2J4JnL9n9N9L
6935C2nj7M0o5OL1l3j2L7l8K9L9p7Q2j0n0L6k5J9L5k5o1M4j9J3QKn2%M8m8J2j4
6968c8N6n2M6m3Q3jj05M7j7m6Q6m3J6oK5K0m0j2L5Qp8L9K7L3%k7k6jj6N5J9o3
7000a9K3K1K7qm4qj5k1O9J2n8n5O2M2k5K5Kr1L2MN2l0k0L0k1JK6K1p3L2pJ9j2
7033gj3j1J3K7k6O7m2k0j6N0Pl2k6K4l0N0j8J4j6J1lj0l6k6P3n2M7k6M1L3o8j6
7065c7M5n1kQO9o5K9N7j1m6J1NL4k9o0KL9L6k8n5L8M7qn2PM4j08J25o1j4J7%L6
7098B2l5J0k2Q2n3k6K4n1O0j1nj8J6L0n3O3m0j8M8n6N4m3O8n2jl3O1j4n9P0%J
$$ y = [-18, -21, 22, -41, -60, 47, 20, 48, -55, 11, 40, -5, -17, -6, 13, 22, -23, -11, -15, -35, 51, 23, -1, -47, -24, 38, 2, -6, 0, 43, -31, -36, 17, -26, -30, 17, -52, 38, 7, 5, -37, 34, 12, 34, -35, -27, -11, -21, -7, -3, 78, -11, 39, 28, 29, 5, 23, 54, 2, -20, -6, -5, -10, 29, -30, 29, 32, 27, 10, 50, -15, -9, 22, -11, -23, 14, -24, 5, 44, -33, 49, 39, -11, 25, 0, 19, 54, 29, -32, 12, -7, 6, 14, 16, -36, -36, 12, -36, -24, -38, 18, -34, 12, -31, 52, 51, -54, -7, -24, -70, 16, -27, -11, -17, 8, 28, -12, -24, 11, 19, -59, -20, 7, 40, 40, 13, -13, -14, -30, 25, 44, -19, 4, 25, 52, 44, 0, -8, -23, -44, 25, 37, -21, -76, -14, 28, 3, 28, 30, -61, -29, -25, 27, -3, -23, 7, -14, -13, 13, 34, -39, -7, -14, 5, -7, -20, -31, -18, 9, -17, 50, 8, -12, -28, 22, 29, -3, -29, -5, -35, 15, -3, 11, -5, 6, 3, -7, -43, -69, 4, -48, -1, -27, 14, 47, -21, -37, 8, -43, -45, -37, 32, -33, -4, 53, 42, -4, 7, 12, 46, 17, -43, -41, -2, 34, 6, -49, -11, 36, 28, -24, -17, 27, -81, 44, -17, -31, -14, -14, 22, -13, -3, -25, 57, 4, -22, 2, -49, 11, 0, -5, -23, -7, 23, -30, 33, -7, -25, 23, -33, 21, -22, 46, -6, -7, -40, 21, 7, -52, 18, 18, 19]
7130A9lk8NL7n2L7On3J2LK1L2n2L3m4J0J4qM1Nr9J05m6K4k2J1l3N2K4p1J2K2l2
7163a8N7l0j7L4k6L1o2M7ooK4l4l7M0k8M7MK4n5J5N8q7L9l0qj8P1n3N3m7k2O0
7195B0k4K3K1Kk5l2J4m9N1j2LL9J4n0mNK8m3J0K0k8Okn2N1K2k7L9k0%Mk6N1l5
7229fppM9k7k2j3M3j0NJ3p6K1M5mJ5l4N3j18J01l6m4L7lK2L1m4lM6Pk8K1j4nj9
7263a1rK3j9j6J6l5oJ5M0K4nm9OL8J7o6M0J7J9k2k2o2M3Q5l3m4Rk5J7L5j6l8L4
7296@l8K6J7lL8m6M2j0n6L7k3K0J1p2O9J9o6M7k2K8n7M4k9LOK0j7QloN2m7Qj2
7330a2L9n4rJ7L2m6M5k7K1Kj9mpK2lk9L9l9LJ9MJ2k4K6J8Kq2N8k0M9k4jK0l1P9
7365G6q3l5N9k2M9l3L9p1L4J9k7Pj8lQl5N0l5K9Kk5M7l0%pJjm8Q2k1J0J8j4jl2
$$ y = [19, 16, -12, -7, 30, -22, 15, 21, -32, -20, -17, 4, 36, -16, 17, -27, -17, -3, -11, 30, 35, -64, 41, -5, 19, -3, 8, -25, 27, 51, -20, -8, 14, -18, 39, 9, -8, 26, 0, 31, -31, 16, 10, 4, 28, -6, -43, -3, -31, 16, 20, 44, -11, 4, 62, -25, 14, -16, -24, -42, 29, -24, 29, -18, -40, 20, -4, 19, 40, 42, 17, -15, -1, -50, 1, -11, -8, 31, 45, -5, -9, -4, 24, -19, -9, 11, -17, -11, -13, -65, -14, 8, -19, 20, 0, 0, 4, -22, 29, -6, -13, -20, 29, 2, -20, -33, 10, 0, 5, 18, -58, -37, 8, 4, 19, -15, 38, -80, 21, -15, -59, -22, -25, -3, 28, -16, -19, 27, 34, 6, 27, 13, 8, -11, -20, 3, -16, -32, -16, -51, -57, -42, -2, 22, 17, -32, -26, 12, 29, -37, 3, 20, 39, 17, -5, -67, -24, 61, 28, -16, -7, -32, -15, 20, 4, -34, 0, -38, -12, 5, 2, 40, -6, 36, 26, -30, 7, -16, 4, 15, -57, 12, 31, -35, 12, -10, 18, -39, 5, -24, -21, -15, 5, -12, -4, -7, -13, 39, -8, 0, -12, 27, -27, -36, -19, 13, -33, 12, -15, 6, 8, -11, -15, -22, 0, -3, -32, 7, -32, -29, -10, -6, 6, -18, 8, 26, 28, -54, 4, -16, 33, 9, 8, 28, -3, 76, -7, -42, 17, -5, 44, 11, 50, -21, 13, 32, 5, 12, -6, -9, -1, -36, 14, -21, 8, 10, -15, 32, 2, 2, -5, -4, -5, -53, 29, 8, 18, 36, 22, 21, -11]
7400a1PL1K3o0K0J2k0Qj0m2K0k3L0j5qO7p3L1j3P4k8l8J4n4JR2l0JOkj8K2L1m4
7434Amj9j9J7J7j5Jk3J1m0O3jQ%M8m8rJ6K9J0p5M%K6jlmM4mn2L3Lj2k9J5Pl4K9
7472a0l0J6J5J4O3k6n3oO3l4n5j0M8P0l1J0m5J1j2J6l1OM0qk4J9l5M7RJ6l0m0
7504a7rk8N6p0J10l3PJ2j1oLnk2l1N8mj0K6k9l0J0qO8l1j2J2M7l6j2pJ6k1l0P0
7538C3m9L0l6K7K1Kk4K2k1m0L9l4L1j6j6M4K7k4J3n8J4K1m7O1N0j15K9N2k7kn0
7569d3Q3Onj2j9K6Oj4k0kN5p7MoL6m2J0J8l1K9j9J0K1Jm2M3nk9M5K7j9o8N9L4
7603F0o3j4K2qJ3l4K6Pk1M4n9L4j6rO8p2N9l0pmlk6M9jOm3J2k1L8L1q1N6j3k8
7637b8k8j2P1J3qk8P6k0n2O1o2MM7J3k3l1J0kJ4n6L1Kn4O7jl7l1M3K0k4K9j9R
$$ y = [-11, -4, 27, 50, -10, 10, 22, 2, 10, 0, -42, -22, -45, -15, -30, -38, 29, -44, -13, -26, 48, 20, -18, -4, -58, -57, 35, 5, 6, 12, 10, -8, 14, 45, 1, -3, -22, -41, -24, -7, -22, -21, -44, -33, -73, -10, -11, -3, -3, 45, -3, -12, 4, 33, 43, -32, -28, -28, -2, -3, -6, -10, 34, 30, -22, 11, 14, 2, -27, -12, -5, -39, -10, -40, -24, -9, 5, 68, 42, -11, -17, 46, 12, -43, -53, -5, 65, 34, 44, -1, 10, -2, 14, -17, -11, 29, 21, -3, 16, -19, 28, 37, 53, 23, -17, -26, -54, 2, -68, 42, 9, 16, 28, 17, 11, 14, 9, -13, -44, 14, 10, 0, 26, -3, -33, -23, -31, 37, 6, -6, 6, 53, 17, 5, -2, 14, -7, -37, 33, -16, 14, -22, 5, 26, 28, 4, 26, 5, -35, 4, -30, 1, -15, -31, 13, 40, 16, 29, -29, -15, 6, -41, 20, 70, -45, -16, 36, 9, 7, -43, 40, 46, 41, 29, 10, 36, 42, 28, 8, 6, 61, -16, -12, -18, 18, -24, -14, 4, -27, 2, -17, -7, 14, 15, -27, 16, 11, -18, 27, 54, 35, -33, 26, 60, -3, -17, 5, -3, 10, -24, 2, 9, -12, 32, -27, 7, -9, -18, 50, -22, 37, 7, 0, -4, -7, -33, 16, 15, 21, -22, -10, -31, 7, 38, -43, 13, 0, -28, -56, -68, 3, 16, 8, -20, 56, 36, -16, 45, -17, -13, 34, 47, 24, -7, 3, 1, 15, -41, -10, -8, -62, 5, 4, -33, -64, -21, -1, -25, 4, -15, -6]
7670fJ4j8K7k3K9m1L4M7l9j2l8L3o9L6J1K0k8JK3k0L6J9p8P9o1l1P3Lpm5QM6m8
7703b5K0Pl3K2mJ6pl5L8j8L5l7K7j1l1K0K0l0k6K4M3N2p4k2k8QM5J5Mk0jQK0j9
7737CQJ6%k1pK5l0n6P9k1m0M7Rk0K1o7N0J5J8p5L9L0M6o8jM3o0M7k1Kj3k3%J2
7771a3OJ5l2J5K2L2m7k5N4n1P2n5m4N2Nkk6M0j0OL8p2M6l7Lj8J0M6l5k5K0L4J9
7804D3J7J5q6j5J5k0Q6m8rK5k9pL3N5r7K4Lj3k9M4K1q9M2%m8Q3j2o0O4l4N0n7
7836c3R3k5j7k6K4k9MK1k2N3o3J0M5l0K2n7N7l2J3l7M7n4K7J5n1O1l8N9m8LJ0
7867B%n3P2n6L6NMm1L2j3k1NK4M8j04K7P6k7L7o6K7lk1L2Ok6K6J7m0pJ5n0N7p
7901A3m4J4lO1l6J6j9K9j9ll8J2J4l3k3N8O2k2m4Jl8K2K0J8J3J4m4K7k4mK2J3
$$ y = [-6, 8, -10, 17, -6, 23, -18, 16, 63, 24, 12, -26, 7, -62, -26, -15, 5, -23, -22, 1, -19, 17, 36, -42, 37, -24, -55, 18, 21, 14, -31, -23, 23, -25, -5, 2, -31, -9, -13, 3, -4, -39, -1, -19, 16, -21, 6, -5, -36, -16, 4, -26, -52, -28, 15, 67, -7, -29, -57, -49, -4, 11, 15, -5, -6, 2, 22, 3, 11, 27, 27, 6, -1, 24, -6, -62, 17, -4, -44, 3, 12, -8, 13, -54, -4, 11, 29, -46, -7, 23, 69, 1, 0, 43, -17, 30, 9, 11, -2, -25, -25, -13, -7, 8, -24, -9, 13, 45, -2, -27, 27, -24, 48, -7, -51, 1, 6, 4, -22, 18, 8, 14, 52, -20, 26, -11, -8, -26, -16, 30, -5, -30, -10, 24, 43, 60, 75, -11, -26, -11, -31, 55, 7, -2, 23, -6, -13, 20, 75, -22, 2, 5, -8, -37, 7, 28, -61, -19, -19, -67, 16, 4, -56, 8, -26, 24, -33, 60, 35, 18, -8, 16, -13, -9, 12, -10, 43, -20, -10, 35, 5, 27, -30, 27, -5, 8, -29, 18, -36, -9, 6, -45, 16, -22, 37, -11, -8, 2, 2, -51, 21, -35, 1, 6, 10, -31, 1, -12, -33, -28, -4, 44, -60, -33, 43, 16, 53, -13, 14, 11, -10, 22, 28, 2, 28, 45, 5, -2, 13, -37, 20, 13, -31, -17, -20, 41, 5, 21, 2, 31, 12, 9, -29, -17, -3, -36, -59, -1, 61, 39, -5, -4, -42, -20, 0, 18, 31, 45, 1, 28, 4, 0, 22, 35]
7933C5k9Lj6j2Q1m3lk3k6R4o2J9k3j4j3L2j0J7k2LO0q5L4l6P4k0k3nlL7Mno4j1
7967e5P5Lj7Pq4N3klM9KpL9j11L4L0K8pRn9OnN2m4Ml6L3k6N9l8J5rLk5K9J9j2
8003IlL0k6J8L8r4PO0k7J0o4J5J2j1L0M1j7m1M7l9m1K8OL4k5j1L2k8k5Q9l7NK8
8036E0m2lK3n2j1L5J7m0nP0j5n1K6l5O2k1J5pj9%J7j8R1o3oL8o6K2jOm6L2J8J6
8070C7p8P8p2O0m2M7j9n3N4Oj1jJM3l1Mmm7M3n5M6j5j9N9j1K1m6L9j2l2Jqm7J01
8104C7k7j6OL0k4N6q7k4O3LK0q8Q8j6l6J2JM3j3p6L6qL8n7L1j7J2J2k8O0m8j6
8136c3K7M7n9J9j9j4k0K5N2k4j4mJ6K2J8m5L7L2q5J4M5l7mp3O8PNJ1j3%l6K2L7
8169B4j1k0Nl6O8n7L8k2m1N5k6m8J07n3K8K1m1KK8k7M4l5
$$ y = [35, 6, 9, -7, -19, 62, 19, 16, -7, -33, 61, -1, 18, -5, -19, -32, 0, -10, 7, -15, -12, 48, -37, -3, -39, 35, 15, -8, -13, -16, 21, 25, 20, -44, -55, 20, 23, 6, 13, -71, -18, -20, -23, 26, 28, 21, 60, -51, -17, 13, 41, 34, 43, -16, -10, -15, 37, -7, -3, -39, -6, -32, 27, -11, 4, -5, -2, -27, 2, 21, 9, 6, 36, 10, 28, 66, -28, -21, 39, 12, 22, -42, -27, -15, -26, 4, 45, 28, -13, 34, -5, -46, -18, -12, 22, -3, -14, 18, -10, -35, 54, 17, 22, 50, 8, 5, 28, -24, -35, 0, 17, -23, -28, 42, 27, -24, 2, -33, 29, 8, 23, 16, -3, -3, 14, -4, 87, 24, 18, 56, -10, 12, 11, 17, -29, 3, 21, 37, -41, 37, -35, 25, -17, 30, 11, -42, 12, 18, 7, 6, 7, 50, 19, 23, 19, -28, 15, -40, 6, -9, -28, 31, 20, 41, -5, 34, 22, -10, -9, -17, -64, 37, 10, -6, 0, 30, 6, 62, -25, -49, 14, 17, 37, -51, 37, 21, -15, -3, -2, 41, 28, -48, -12, -20, 18, -39, -8, -25, -13, -1, -29, 31, -17, -33, -6, 41, -18, 1, -18, -32, -52, -27, 25, 1, -13, -17, -1, 21, 39, -6, 31, 63, -22, -8, 37, 0, -4, -77, -9, -2, 3, 14, 1, 1, -35, -13, 24, 13, -7, -2, -38, 30, -27, 11, -11, -52, 3, -23, -71, 36, -17, 11, 32, -9, -7, 21, -6, 38, 3]
8191C
$$ Imaginary data points
##PAGE= N=2
##DATA TABLE= (X++(I..I)), XYDATA
0@%%%%%%%%%%%%%%%%%%%%%qJ6j6J6j6J6j7K5l2L2l9M7m8N6o4P2q0Q8r9J07j20
42f4J36j52J68j84K00k19K43k68K95l26L58l97M41m86N38n98O68p51Q50r70J122
63F04j316J575j947K520l541N898k1108j2594J7625j4260R202O583L622L308m541
78h370o85P723l449L49m088o67R243k786k109N636M410N414M71j794K622L342
94A5262l721k494n379Q57K336o836r09L450J422L781j18j513N958m25k448k409
110F814n494L761m038n472K048o27L176K755k075L519M529q6P40l677J203J167
126H243n399j101j772j36K278q51j028L782K379J23m5j651K092j595l383j741
142A95k732n72K04l038n3L570n64J455p08J5K504k410o38j130j420J496j246k372
$$ y = [0, 0, 0, 0, 0, 0, 0, 0, 0, 0, 0, 0, 0, 0, 0, 0, 0, 0, 0, 0, 0, 0, -8, 8, -8, 8, -8, 8, -9, 16, -16, 16, -23, 24, -24, 32, -32, 40, -40, 48, -51, 56, -64, 72, -80, 88, -96, 104, -115, 128, -140, 155, -171, 187, -210, 231, -255, 283, -315, 353, -398, 452, -518, 604, -712, 863, -1084, 1436, -2105, 3793, -17315, -29909, -12284, -26544, -17342, -10759, -7137, -3829, -8370, -9055, -1332, -4781, -4432, -8520, -9187, 56, -2730, -4839, 797, 5207, 10621, 11092, 9298, 11920, 15262, 11541, 9047, 3668, 4525, 6861, 25, -884, 2566, 3988, 7769, 7651, 6138, 12096, 11671, 9223, 6814, 1320, 5081, 1043, -4429, -2381, -3008, 168, 2923, 848, 4367, 8896, 8810, 9550, 5873, 7076, 8243, 2844, 1743, -29, -165, 2113, 1262, 234, 4016, 6395, 6518, 6473, 4822, 6914, 5319, 1936, 195, -2537, -3109, -2905, -5943, -5996, -2426, -2990, -1535, -2243, -2228, 276, -2134, -2772, -3902, -5322, -3826, -5072, -7444]
160g444K640J070O17J843q02K862P44j63L36j290J467P12j890J36J668o97J326
177C135m72m62J826m81p3r54m50Q53q41j992Q29k17o07J137k093L94M95j098o13
196a684j128L90L80j121R9J035o10J813j26q67J998m13k49o46m56M23q5n36Q80
215i03K40Q44J705j068J142J010n65j36q08o33l08q60p97K59m98J485J68m14J977
234A840j16L5k9q23m55l96j340l67n12M9J035p34J358J236R9J076j4l14J21o06
254A143j205k56r02L87j35l83J524J67P35R06q1K00K78q20p04o01q04O6j061M93
274a053M04p8J178J43L1Q58O0p94j3q49k84m71p91N20l49M65O79p9M76Q41l61
295E33l2J10p61J11p35j12j50k52O79l7O2P47K32k85N43m42j66Q1p20J35l99K33
$$ y = [-7444, -4804, -3734, -3117, -1274, -2076, 786, 1530, 1367, 1703, 413, 1880, 2592, 702, 838, 2506, 1809, 3135, 2663, 2201, 4027, 3546, 3473, 2519, 2069, 2922, 2081, 89, 918, 701, 94, 1231, -862, -468, 27, -1071, -1684, -2812, -2422, -2042, -3163, -3064, -2029, -2639, -826, -952, -1819, 179, -234, -483, -1129, -1585, -1162, -1247, -1783, -903, -663, 181, 1886, 818, 1960, 2970, 2405, 2269, 1461, 828, 520, -340, -1137, -878, -1376, 109, 277, -137, 1840, 1724, 1759, 1730, 907, 452, 56, -1284, -1651, -2163, -2114, -1079, -1813, -455, 781, 880, 1956, 1942, 1628, 1749, 1143, -62, -318, -1220, -833, -968, -1351, 173, 340, 1075, 1981, 1900, 2100, 2378, 1558, 854, 253, -551, -485, -1546, -1053, -649, -727, 451, 594, 625, 1483, 1543, 749, 736, -113, -397, -868, -1659, -1139, -1488, -1023, -344, -423, 53, 894, 533, 501, 611, -150, -39, -774, -886, -1036, -1288, -609, -646, -584, 163, 395, 110, 653, 211, 45, 126, -594, -459, -858, -625]
317f25K90k17M38N17k04L32K39o13M58m62l05K1k74L75j91Q4N09R0q9N12m85p5
339C25K03p02k1k38j3N5p5K84L22r1L27J37m87M04m11m71O4l93O5l5M6K49L08
362a48J10N47k96J22J58n87m2k80k71j3j17P9J76J13L10L07j93M73k86l38P8n59
384f57j97j41k07K5J49J00M31k6K31L67m61K74k74l64P6k26j13k0J56K68K53Q9
406b67O06j0M0K94l34kK1k32j50K12j37K80J52K32M65j78L88o5k72R3k22l86M
429E32n8j94K58j36L41oQ0K14l73L5r3l78k19k6k76O6M6q4L54pL08l7k8J51k30
454B40k19lj77j55K58k01K72J92J75K49n5K42mj30j21Rm19O1o3j74K72m9K28J13
478E41J03O8p3j32m0k81k92J21m29PJ54o2K44MK58R0Mkn3j79pq4k56J56r2J64
$$ y = [-625, -335, -552, -114, 403, 199, 531, 770, 157, 615, 153, -152, -131, -405, -30, -221, -137, 372, 462, 373, 885, 400, 325, 528, -174, -195, -433, -446, -391, -466, -182, 140, 49, 376, 513, 26, 430, 19, -452, -388, -781, -716, -751, -705, -456, -148, -38, 509, 213, 335, 493, -94, -136, -416, -687, -700, -817, -738, -562, -449, -139, 168, -25, 448, 162, -176, -98, -657, -854, -995, -1202, -1177, -1028, -928, -497, -523, -292, 75, -386, -112, -386, -750, -674, -900, -1013, -1033, -877, -609, -356, -267, 339, 329, 369, 663, 329, 327, 348, 116, -34, 178, 41, 321, 473, 705, 1170, 992, 1380, 1315, 1043, 1136, 914, 528, 532, 474, 280, 538, 402, 743, 737, 817, 1031, 658, 693, 600, 222, 3, -23, -299, -233, -187, -271, 83, 76, 384, 347, 319, 470, 240, 21, 18, -159, -314, -56, -257, 15, 207, 382, 631, 576, 818, 814, 684, 563, 572, 153, 214, 151, -23, 249, 200, 428, 541, 644, 712, 639, 507, 467, 186, -106, 15, -414, -407, -253, -315, -71, -67, 191, 281, 285, 283, 230, 51, 44, -40, -296, -140, -232, -68]
504f8J73R8K39N7P8Q1m1j44M6l61jJ4j75N4J0P0J5P0O9%j26r8j04l15J29k58l8
531e26Q7m3P7R7O1P3N5lQ5j69K7M3r7J51J9M6R1J87P5J65k7K5kp3J38j36l4J4
559D06n8N8R3rn4J44j18K1j64r5r1j91N1j42KN0N2m8J29Mk4P2j45M8k18m0J22
586a45j95J27M9O9J50J06P6J27j1j2k8j92P4k46L9m1P8J9J49M4L7J12o7P4j62
611B31p8n6j29q2n8o8J20R0n3K43PJ06L4r2J4j56J9n6r5m1R3l1J42J35j5J84r5
638C13J12L5j03p0n0j26J0r7k0J12%J33j0OR1p0m7q5n5q0pj09o6J48j03J67qK7
666D8L3k8P3q7m2l3J9j45J22o7j1J26jR0n4K3j5Jl3Mk8JO0j13P1Mj4O6m8M5j1
697E6k6J1l4j06M0K6K8%p3J08L9Ll2pj6o4l2J9k7n8Q6L4L3R2l1O5p6Lo8m8L1k5
$$ y = [-68, 105, 203, 442, 499, 577, 658, 617, 473, 519, 158, 157, 171, -4, 50, 60, 130, 145, 215, 284, 284, 158, 60, -44, -359, -230, -488, -526, -439, -482, -405, -308, -247, -174, -119, -122, -37, -206, -179, -136, -233, -82, -63, -17, 74, 261, 336, 501, 474, 499, 497, 424, 562, 426, 392, 406, 348, 406, 499, 490, 436, 580, 462, 483, 319, 224, 133, -58, -7, -149, -147, -97, -45, -93, 36, 40, 16, 88, -57, -9, -227, -267, -145, -340, -213, -164, -95, 55, 161, 237, 364, 353, 341, 313, 121, 195, -51, -12, -53, 25, 44, 193, 237, 274, 386, 319, 393, 231, 153, 97, -32, -114, -172, -240, -120, -30, -83, 160, 167, 273, 307, 215, 229, 73, 92, 36, -59, -100, -7, -38, 104, 239, 224, 408, 313, 425, 460, 357, 287, 237, 111, 121, 24, 4, 116, 116, 249, 239, 245, 336, 266, 219, 134, 79, -1, -8, -117, -183, -35, -138, 29, 21, 48, 81, 53, 126, 39, -3, -36, -17, -162, -40, -107, -118, 8, 7, 97, 43, 66, 51, 52, 19, 23, -5, -4, 56, -57, 14, 18, 4, 70, 22, 67, 56, 30, 41, 7, -99, -59, -33, -5, -5, -78, 30, 69, 72, 40, 33, 17, -47, -79, -60, -87, -145, -59, -25, 8, 100, 69, 134, 58, 61, -7, -55, -24, -49]
729d9j0j2M2l7N8K4k3J54o7l0N4j00r0ml6M9K2j1M0J7O6J17k6q1l0j0j8n1k6l4
759a02m9K7j9P8P4O5k0J8j0ml5l3l5lk4j0n4J07O1N1k7O5q4%L0p3L0q0OMj2L6
791b2j9L2M5k5OM6o5J2k2k0mj2Oj1K5P3k7J2J5K3l3K1l0l9j1J5O5n6K9O3p1j2
823IP1n1Q4o5j3q8RJ5q1N9QM2j7kM9K3q5l1Om6N7l8J1NK9j3J4J22r8Q6k0j0n6
856a5k9K2j6M7l2M9K5j7N2m5O3p7O9o4l8J0rk8m1Q1k5J7M1N1r0O6n0J1p7N9k5
887a5K2m1k8J00l3L8Jj6N2k0k9k3qNp6M0k1J6L7M3J4j8k9J9J3mk9m7K9m9k6J02
919A9q3K0NJ00m9j9MJQl6Pl4J2oL8l9Q3J8J1LmM6k1q6L9k0L1j4j6N1k2K2K5j8
953G6qL7k0l2n5k2K8j1pO9j0l9M4m6K5K6q6K2L7n2mrJ3L8j4n9Q5K8k5j2L3l6R
$$ y = [-49, -59, -71, -29, -66, -8, 16, -7, 147, 80, 50, 104, 4, -86, -90, -126, -77, -55, -66, -26, -9, 57, 174, 148, 67, 37, 27, 9, -42, -68, -102, -151, -124, -143, -65, 9, 74, 54, 72, 62, 58, 23, -10, -45, -48, -72, -82, -136, -29, 32, 83, 56, 121, 37, 37, 67, -6, 24, -56, -50, -46, -58, -22, -41, -9, 36, 11, 17, 63, -2, 10, -12, -32, -36, -48, -42, -53, -28, 45, 18, 30, 45, 68, 35, 56, 26, -13, -24, -9, 56, 0, 29, 92, 21, 9, 80, 29, 113, 48, 35, -53, -44, -29, -110, -51, -43, -1, -18, -20, 29, 52, -33, -64, -58, -104, -47, -85, -74, -69, -40, -53, -39, 83, -15, 71, 51, 41, -15, -44, -22, -38, 9, -23, 26, 51, 34, 86, 41, 104, 27, 96, 32, -6, 4, -5, -33, -74, 7, -18, -1, 40, 91, 1, 67, 17, 28, -49, 10, -15, 7, -34, -62, 38, 5, 43, 44, 28, 80, 60, 31, 8, 0, 5, -71, -31, -52, -36, 1, 44, 58, 40, 11, 30, 43, 39, 10, -37, -8, -57, -83, 19, -64, -44, -39, 61, 12, -7, -3, -2, 6, -30, -23, -57, -45, -51, -13, -52, 31, 49, 60, 63, 59, 105, 84, -2, 37, 17, 48, 34, 18, 69, 47, 69, 94, 76, 68, 105, 85, 53, -2, -24, 4, -7, -14, 55, 45, 6, 50, 4, 29, 55, -31, -9, 28, -24, -28, -37, -24, 14, 0, -59, 26, 54, 29, 17, 50, 14, 23]
986B3Rm6N1k7m3L6K1Q1j01J01j3o9j7j4j3K2n7P9k0M3l1Pm1K8LJ2k0m1N6m0kN5
1018C2p2O6rJ8Qk2M1%m6J1oK2r1qM1mj6O4N7n4J8k5J8l3K4m4L0p6O9k9J4l5O1
1051B4j7m3M5o5L3Qn0J3J0L7Mmj8M8l8M9o5L3rl5M0n8L9j0K1L2k0J3l4J6LM7j3
1084C6Pm5K3n0QkK3J5j9K8l4L7k7K4mj7l5L8m4K5j5K7K7k9l5K4N1j3m6j2J1j3
1116c6JjnJ2Lm0J19j9km8mJ5K7m1j7L2L8n5M9nm5J0mNk0N7k2J7J3o3K8Lqk0kO4
1152C6o1k7M9QqMo2L9L3l7LJJ9O7m3Lj2k4J8j1k8M6k4MM1rk3L7J4k9k6M8l8K1
1186B9J4m5pJ5M8n4K2n2J4J8L1k0p7M6J4K1m3oK7j0j9L0j9k5K5N8n9L0J3j0k5
1217a6O4m4mkm4L1L4l4K8K4j6l7pJM7m1L2j6KM8p1K2J7k5qjj5K3Kk2L8k8M2n9
$$ y = [23, 32, -14, 37, 10, -33, 3, 24, 105, 4, 105, 92, 23, 6, -8, -21, 1, -56, 23, 3, 46, 15, 22, -19, 9, 12, 24, 4, -37, 19, -21, -23, 32, -40, 26, 17, 35, 43, 21, 62, 62, 16, 27, 21, 43, -48, -56, -15, -19, -35, 29, 86, 32, 50, 25, 43, 10, 34, -10, 20, -56, 13, -16, -2, -37, 24, 7, -36, 9, -56, -23, -15, -65, -52, -42, -5, -1, -5, -23, 25, -13, 36, -29, 4, -5, -40, 0, -58, -19, -29, -8, 24, 4, 17, -17, -1, 2, 49, 36, 43, -2, 21, -29, -21, -23, 0, 15, -4, 24, -10, 27, 0, 24, 20, 3, -32, 6, -38, -13, -28, -1, 26, -3, -38, -14, 37, 24, -22, -34, -23, -36, -35, -36, -41, -29, -26, -66, 53, 34, 32, -16, -20, -5, 22, -19, -36, -4, 34, -21, 28, 23, -22, -12, -16, -11, -31, 26, 4, 21, 34, -29, -1, 2, -6, -26, -28, 36, -25, -52, -3, 5, -3, 1, -61, -22, 11, -26, -23, -22, -3, 64, 21, 24, 12, -12, 6, -5, -33, 13, -11, -7, 34, 25, 2, 39, 53, 24, -2, 46, 8, 29, 43, -2, -9, 6, 54, 0, 22, -30, -16, 2, 33, 13, -64, -18, -4, 17, -26, -32, -5, -15, -34, -4, -23, -48, -23, 35, -24, 6, 19, 9, -16, 48, 4, 0, -2, -46, -15, 19, -15, 13, 37, 21, -16, -23, -22, 25, -16, 16, 0, 2, 50, -21, 1, 18, -7, -15, -16, -31, -8, -6, -28, 10, -18, 24, -35]
1251c5K3L0j4RL0k6qPJ9k8J3n5O5l8pK7Nk1M1o6nQ5q3N1Rl8j5K7l3N8k4K4QL3
1285F8q6j7O2m6m1R3k0mj6Lk8L8n0M7M8m2j5K4l8J9l6M3n4O0k9L1n1K4N3n7J7
1316@%K2K2q8J8n4N7L3j8M3jk9mKk6oj0qM4j9L4PJ2p9M3l8Q8o7K0k2OJ5J1O4p6
1351dmm8P1p8P7M7p8K7Pm0J0j0J5J8PJ5m5j9J2K5%J4Rk3K4l9j9J7k5RL1nJ3k0
1385ikK7j3J3rM1q5J9K5j7Ol5J2M3K2l8qPMK4ko4jL6K9k5j7j7l5P5k5M3j3J9j2
1420A8j3o1P6J6m9J8J1kK5n4rj5OK5L5j5J6o0K0K6j9k3P2n2J7m4K9k7J6N8n3L6
1452B4k9K7k0Kj0NM7j4o2J7L1n5J6J4N7k8k4MJ3K3M5r4j1PM1p4L3N3l4nJ4l4J3
1485hR3n6j1mJ8Jl7M7mm8K6o8M6kJn4P0o2R9o5j4M8Mk8k9M2pl7L3j0J5QL9o1L2
$$ y = [-35, -12, 18, 4, 13, 43, 17, 9, 16, 35, 7, 20, -35, 30, -8, -15, 12, 17, -4, 37, -29, -34, 51, -32, 19, 28, -10, -25, 2, -31, 27, 3, 27, 35, 68, -18, -35, 27, -19, -60, 33, 13, 9, -7, -4, -32, 6, -44, 3, 51, 9, -6, 18, -20, -1, -37, 6, -48, 12, -17, 14, -37, -13, 40, -17, 0, 0, 22, 44, -44, -26, -80, -23, 10, -8, 35, 34, 5, 1, 3, -23, -29, -39, -47, -3, -22, 12, 19, 31, -48, -5, -43, 45, -22, -2, -24, -18, -3, 8, 72, -4, -8, -56, 15, -63, 14, 61, -17, 10, 17, -23, -13, -23, -8, 10, 17, 32, -13, -32, -20, 5, 5, 19, 28, 5, 29, -10, -29, -12, -37, -28, 3, -2, 11, -9, -11, 16, 3, 16, 7, 48, -37, -18, 7, -10, -4, -39, -27, 16, 38, 0, -8, -1, 3, 27, 25, -39, -40, -4, 25, 0, -17, -34, -69, 6, -19, 24, 11, 30, 18, 5, -56, 20, 36, -13, 5, 16, 14, 39, -15, -24, -39, -33, -8, 27, 12, 28, -32, -12, 14, -5, -28, 44, -8, 9, -35, -6, -33, -17, 41, -12, 24, -5, 22, 2, 4, -6, -1, 46, 32, -30, -13, 18, -37, -21, -7, 50, 22, -2, 2, 15, 38, 83, -11, -22, -15, 26, -48, -15, 38, 4, -1, 13, -21, -8, 85, 29, 18, 14, 32, 33, -4, 43, 39, -9, 17, -51, -5, -7, -6, -60, 10, -52, 47, -18, -32, 16, 20, -8, -37, 5, -2, -39, -6, -16, -1, 7, 46, -15, 17]
1520A7j9mm7L4P4q7Qj5L2L0J6o2Q4o8k9qP2m0KJ1JK3m0l5R2m9J0K5n7L7l6J1K6
1553Ij4kK2L3l2m9K9n2P7L1p0O6p5RL8K4r0M5m6L5J8mj7l2rL8j6qK3L9j9jm2O1
1587A9j2j9K2j0rj0L1l8L0n9MP8k7k6K4lM0k9j0qM2j6M9o9O8j26L3P2q1L3J8r
1619Bj9mJJ8j6J09r5m2L5L3p7L1M6n4L1j3j5K2k0N5k2j1LL2J6o3j9pK6J9J8j8
1651BJ7J7m1k5L7k2L2l8J3OL0L8k3l5Ll4L2l7K7l9R2l6JK8m4rKj0K8nl3j0j4R
1685d1K8j2K7K7n5k3M5qL3n0K7J1o%Ll8M0L8n0O4m8K1l5RmM2o9K9l1k5J7K3j2
1718b3M0m4RL2n9L9l0PM4m4M4j9m2Q5n3jM6j2o0OL9oK2l2J2L8r4O7l0K0k5J8J3
1751Gl2L4jl7L3L1l1k7kJ0L6m5J2l2N6n1MQ9l2k5j5O1n8mJ4j7NpKJ3J6o2P4J7
$$ y = [17, -2, -6, -53, -19, 55, -32, -24, -39, -7, 23, 39, -23, 61, -7, -36, -44, 28, -12, -10, 1, 2, 25, -15, -50, 42, -7, 3, 28, -29, 8, -28, -17, 9, -5, -7, 15, 48, 16, -33, -4, -56, 21, 52, -18, 48, -27, -18, 20, 44, -46, -1, -47, -12, 6, 2, -15, -47, -56, -18, -34, -42, -19, 20, 1, 0, -42, 19, 7, -12, 10, 0, -9, -19, 12, -26, 4, -55, -51, 27, 0, -26, -2, -5, 35, 6, -4, -12, 30, 14, 63, -6, 62, -64, -31, 41, -40, -7, 11, 2, -17, -21, -20, -2, -18, 91, -4, -46, -11, 22, -55, -24, 22, -32, -1, -14, -29, -7, -27, 28, 6, -5, -2, 30, 46, -17, -36, -43, -17, 2, 20, 2, 19, 36, -5, -30, 7, -15, 17, -21, -8, -2, 28, 66, 43, 8, 11, -23, 9, -28, -1, -40, 52, 16, 17, 45, 1, -8, -6, -16, 12, 7, -26, -36, -50, -41, -13, -25, 2, 29, -26, -49, -4, -12, 21, -29, -2, 9, 3, 3, 6, -32, 8, 46, -4, 60, 12, 33, -2, 7, 3, 45, -24, 5, -26, -51, -34, -11, -23, 17, -27, -18, 14, -45, -6, -36, -29, 15, -29, 15, -4, -46, 39, -14, -15, 31, 19, -41, -35, 4, -2, 20, -12, 0, 38, -56, 11, -19, 1, -24, -6, 7, -25, 9, 8, -29, 4, 35, 4, -23, -25, -15, 21, -24, -12, -44, 12, -39, -35, 54, 22, -3, -18, 43, -15, -19, -5, -22, -17, -24, -22, -9, 7, -55, 19, 36]
1785C6Ll9Ol7L5L1k6%o6N5j2N6k2n3RL0k7NK9j0PJk3jK4l9O2j8lm7M1PKk2K7n5
1821c4O6n6K4n9P6qJ5m5lO8kjk3n6J1j3M1Kpk8J5JrJ2Rn6M7LK9k3M8%l4k6l4K2
1857b8M6j1K8l7j0L8m3J9nK6k0Rn9qM9k6MM%K8J6l3k5lM0nj4l6P3pNk3k8L3L5
1892C2K8m8j4K2m1L7J2pl9k0L7K7kj9m4OP9n0qML2N1o1j4L1k4Pm2L1L9j2k6n%
1926aMj0N0qo3QN9r2L5M8l8j4%%M7j1l5P7j01O1j5k9M4k4j1M2m2nkL7RmL7r8K5
1961b0P9l4j4Mm3KJ2K9j8KQl0M0k6QM3r4M2J9J3k3j6M3Mj11J20j7JQm4Pj6Rl1
1995d4L9J0L0q1P7m9j7KN0o0L0k9j2L5L0m8M3M9j10N7orR1m0q6P0jm4%N8k8j7
2027a0l6K4L9k6K4m6N0o6jN0k5jN4k4k1O8q9O0n3OK3j0lN1n1L9lk4ll9M1k0qP3
$$ y = [36, 39, 0, 6, -31, 4, 35, 9, 9, -57, -2, -14, 42, 20, -33, -24, 6, -21, -16, 13, 3, 10, 11, -12, -13, 11, -28, 34, 16, 13, -34, 7, 14, 16, -6, 21, -34, 32, -24, 0, -59, 17, 9, 24, -21, -24, 44, 42, 41, 18, -38, -27, -40, 1, 3, -4, -32, -17, -16, -25, -13, -4, -60, -13, -10, 19, -4, 44, 44, 10, -16, -50, -28, 18, 7, 35, -2, -12, 26, -17, 2, -3, 23, 3, 12, -47, -55, -6, -32, -28, -24, -24, 4, 20, -13, -38, -41, -1, -6, -20, -56, 17, 10, 15, -8, -36, -3, 32, 60, 12, -2, 20, -21, 16, 28, 21, -18, -38, -1, 26, 24, 5, -39, -33, 46, -4, -12, -8, 24, 75, 14, 0, 31, 7, 14, -28, 3, 42, 30, 4, -1, -1, 3, -7, 43, 35, -28, -20, 39, -53, -18, 30, -8, -22, -22, -22, 25, 14, -21, 56, -45, 16, 1, -28, 16, -8, -19, 23, -19, -24, -26, 11, 20, 16, 53, -45, -20, 59, 25, 11, 15, -28, -26, -14, 15, -3, -1, 7, -23, 17, -9, -1, 42, -52, -10, 9, 22, -1, -17, 26, 30, -81, 39, 22, 23, 31, -13, -6, -22, -13, -44, -5, 5, 35, -46, 31, -18, -35, -33, 17, -43, -13, -42, -54, -19, 11, -37, 6, 55, -55, 2, -4, -13, 78, 38, -48, 22, 21, -23, -23, 35, 7, -10, -46, -22, 17, -9, 15, -31, 19, -47, -48, 2, -23, -24, 30, 6, -15, 53, -36, 24, -29, -23, 0, -10, -13, 38, -13, 26, 23, -1, -4, -43, -2, -22, -30, 43]
2061D3M1j17P2l9N3l2k7O1o4L3j7j7l7M5l2K4L7l1OrK3j8j01J32n0MK2oJ9j3j3
2092hJ3k2K6j3l3OM0K5%qm1l4M6M5m6L0p1L2Q6qp8OQJ7kp%m0N6k1k6L7k4RL1k1
2128A0k1%J1Qk7OrM4l1j7N7k1m3PL7j4j6L2N4r3j4L8J1j7L7K0n4K6p6N5jMOk4
2162a5k9N7l8M5Ln4jJ1K0j3Rp9R3QJ7J5n3j8J7k9N2l9M1m4KO2o2QK9Rl3J3j0J9
2196A3l5M0nNk3l7N5m0J1K0lj9j1J5K8Qj1J2Mj2QK2k1Pj6K3m8l4N6p1O8j3m0j
2230d5P3l2j3L1l3J7K6j9j9K7k4K1mq0J12l1j4j8L7k4L4Nm5pK8j2K7j4K2l0jO3
2262E8o6M9n5Ok3l0N3lk1O9n2K6L5o1j3LM5l8nj7N9k0J6J2k8j0K2J2j9L3m3J7
2294A1M2k0l6J4k2M1j3NoMJ6q9N0M6L4q2l6O1j7%RJ4k2k4mL0J1%ML7q8M8J0r4
$$ y = [43, 84, -33, 39, 0, 53, 21, -6, 55, -9, 24, 7, -10, -47, -2, -34, -10, 27, -4, 2, -7, 16, -2, -103, 29, -21, -17, 5, -1, 18, 5, -8, 5, -17, 9, -4, -37, -31, 9, 34, 34, 26, -15, -49, -3, 42, -4, 26, -45, -13, 73, 65, -13, -7, 1, 18, 16, 9, 9, -31, 25, 4, -22, 15, -9, 0, 31, 10, -11, -11, 0, 8, -19, -13, -22, 22, -9, -26, 31, 10, -33, -26, 11, -3, -19, 13, 67, -26, -40, -2, 9, -8, 29, 49, -5, 21, -55, 0, -1, 3, 9, -15, -44, 13, -25, 20, 23, -31, -32, -21, -1, -14, -5, -84, 9, 17, 34, 49, -4, -22, -5, -34, 18, -21, 20, -24, -22, 40, -22, -14, 15, 24, -9, 4, -6, 13, -22, 18, 13, 18, -5, -42, 13, -27, -16, 4, 1, -18, -29, -14, 14, 22, 11, 23, 27, 15, 23, 45, 24, 31, 15, 38, -10, -44, 12, -59, 9, -4, -44, -45, 28, -4, -17, 14, -19, -2, 24, 5, -14, 13, -11, 10, 6, -74, 38, 7, -7, -25, 12, -12, 22, 27, -18, -25, 3, -9, 18, 4, 26, -4, -5, 58, -8, 41, -14, -8, -31, -61, -8, -11, -32, 37, -15, 11, 46, -15, -28, -25, 20, -18, -23, -40, 19, -1, 15, 27, -1, -11, 11, 23, 4, 37, -6, 11, 53, 33, -3, 11, -11, 30, 17, 22, 16, 20, 36, -53, -3, 43, 77, -5, -41, 20, 3, 3, 12, 26, 4, -20, -24, 6, 17, 17, 21, 58, -30, 18, 28, -66]
2328f6K0J4O5Nl5l0K5M6%p1j6J8l6R3l3K2k5J3L4krn5J7k7KJ2J1rJ2J5QJ8j7%
2362A9Qnl4M5l5l8L7n6K9P7n0J4k5L0k9m7O3oK3n1M7n0MN4k1pK5m2J5M4m6pR5
2395H0p0J7n4L1K9rj2j6j7O4l7j5m4K2rM2pK9n5K1Koj1J2K9l1M0r1P1k0m0N9n9
2428e5P0o4J3N2l0pL7k1k4m2Q9k3lK8j2m4M6j7OL7Nn6kJ0k2P5r0K1N4k0rj0k9
2461c7Q0pj9m7L3M1o2M5k8K2%l2K7l9M8n1m9J19o4J7L5l7P9r2Oj9K5o7J04L5n8
2492HqOm2K3PM2l4J5k8RJk3M1K1l7K9l1j5K8k6J2Jj8kj5P8m5Kj4J6m6O8ol8qN7
2528B8l5J1pm1J06o5k5rM6L1p3K7L0l5N7m1K4qn6J05l7o0M2l5J3l0M3J1rOrm1
2560c6J03k9l9j8K2k0kkQ3m5J0om4J9kOKJLm7J2L9lq4R6J0K0k7l7KJ9k0jK3l4
$$ y = [-66, -46, -32, 33, 38, 3, -27, -2, 44, 44, -27, -43, -25, -61, 32, -1, 21, -4, 9, 43, 41, 32, -23, -6, -33, -31, -19, -8, -17, -5, 10, 18, 36, 19, 19, 27, 22, -12, 33, -2, -40, -3, -59, -30, 47, -3, 11, -14, 16, -13, -60, 3, -3, 20, -31, 16, -34, -30, 24, 3, -4, 21, -21, -6, 38, -8, -15, 80, 10, 27, -27, 4, 33, 24, 12, -4, -21, 43, 6, -9, -53, -31, -40, 2, -5, 24, -31, -10, -8, -14, -25, -13, 16, -15, 25, -66, 5, -15, -55, 4, -55, 15, -49, -36, 16, -14, -21, 16, -5, -29, -71, 18, -5, -8, 20, 8, -36, 10, -7, -1, 36, 41, -15, -17, -7, -29, 46, -44, -23, 31, 11, 2, -8, -37, 43, 36, 17, -30, 3, 44, -18, 27, -1, 21, 21, -11, 16, -23, 25, -26, -75, 44, -20, -3, 32, -5, 74, -18, -12, -31, -6, -73, 31, 66, 8, 0, 6, -36, -13, -6, 36, 2, 17, -11, -2, -1, -24, 17, 38, 1, 30, -1, -16, 12, -14, -2, -1, -19, -21, -36, 42, -3, -1, -15, 1, -45, 23, 17, -21, -29, 28, -7, 4, -3, -44, 62, -3, -28, -37, 9, 40, -33, -6, 24, -11, 46, 5, 29, 21, -35, 70, 33, -27, 15, -20, -7, -37, 6, 17, 8, 14, 5, -36, 67, 38, -1, -19, 3, -17, -19, -21, 62, 17, 27, 21, -23, -4, -6, 0, 2, 3, 6, -41, -29, 10, 7, -77, 19, 29, 49, 22, -15, -13, 6, -14, -15, 8, -26]
2595b6J2l2K8lK8lr6M1P4p4L5JN0k9Rk1jL3l9O7k9PJ4k6Km9O7k4j1m5L9K3k4Q0
2629G8q1nj0J8M4m6LN0r4Q2Kj04R4N5r6J3m8M6NmQn5J5J6N0l9M8q2K3KK8l1J2
2662cPk4K1M0l9K2J9ll7Qo2P2m3QK4l3j4L4km6Q5n1J8k3J6j0RQj1M6p2k5J12j2
2696C9K0q8K7KJ5J0j4j4j9L9k7J2%qL7j1K2n0l6K7oM6n4N2j5mj7J4L2q8R5o5L5
2729Hm4oK2JK7m3O8n6O7m6qO4l9pP6l1l9J9Nl7M7m5N3n0j8j9O9o3j8O0oJ6m6r
2763b8j3L1p1L2KOL8j7j3J0k0P0q0L6K9k0k7K4K5%PJ8o6ORk1L5ql3J6Q7o6Rqk6
2798b7j2Q1m8J7l8J9J4Mo2M5L9j00M1M1k8qnO4l2N4l2o1L1L8Pn6k0K3j2L7l5N1
2830C0k0o9P1K5l3m7M0l6J9N9Ro7O6l7l4j9j0M1PJ6kk7l5J4O1k5L9j3J1k9j8l
$$ y = [-26, -14, -46, -18, -21, 7, 4, -92, -51, 23, -51, -16, -15, 35, 6, 15, -6, -7, 26, -13, 54, 25, 32, 46, 20, 22, -27, 40, 16, 5, -40, -1, 22, -2, 78, -3, -8, -18, 0, 44, -2, 1, 51, -43, 39, 41, -63, 31, 86, -10, 3, -45, 1, 6, 2, 10, -45, -30, -14, 36, -3, 45, -37, -14, -12, 16, -15, -3, 4, -20, 1, 41, 2, 24, 43, 40, 3, 11, -51, 21, -22, -14, 10, -23, -37, -3, -5, -51, 34, -17, 1, -22, -6, -16, -7, 1, -10, 36, -36, -61, 51, 39, 59, -29, -2, 0, 15, 25, 11, -3, -22, 17, -10, 2, 2, -6, 31, 20, 42, -8, -44, -17, -23, 23, -31, 21, 6, 2, -15, -1, 31, -57, 38, -27, 8, -36, -42, -20, -19, 8, -35, 33, -23, 44, -2, -10, 54, 15, 8, 84, 53, 14, 33, 38, 1, 48, 3, 56, 6, -12, -31, 38, -25, -43, 17, 11, 27, -19, -28, -41, -10, -81, -49, -47, -41, -3, -20, -33, -23, -43, 27, -53, -17, 12, -8, -35, -11, 14, 14, 21, 39, -27, -21, -12, -33, 2, -6, -39, -23, 64, -2, 7, -1, -27, -39, 42, -6, 11, -27, -8, 6, 10, -52, -7, 32, -68, -27, 14, -14, -22, -27, 37, 5, 59, 27, -34, -3, 35, 42, -14, -34, -11, -23, 14, -21, 30, 10, -59, 12, 37, 4, -43, -3, -39, -20, 39, 48, -19, 47, 10, -24, -43, -53, -12, -5, 11, 9, -18, -53, -39, 22, -3, 36, 23, 34, 5, -13, -16]
2862a6k0J4K8MM8l6m5PM3k9J0L2j7j1j8k1K9jMNM5n9j6N4m7L4j3%J9lj6j2J8l2
2896a8J1J1k3L5qJ9j9J2l0Qk9N9l8L0m5L2J8j0K0k7k4j7P7m1k1l8N0J6k7J8j5
2927a4N7p9R5p5j1M5mK7p0qKJ5rM1J8m0j2rL4j1QL0p2M3k0O9n7J6n7N6j7K1kk1
2961a1j9L5J5l0K4m6K3J1J3k4P2n0l4K7Qk1L2k7Jl1K5K8m2J0L3J0ok5MJ3j3K5
2993C0m7L6Jqk7M0l1m0M1k8J2N3n7mL8NNj2nk7P9j1o2J5kK5m9k7O1Ol3K3Qk0J6
3028Dk9qJ0J2M1Jm5%J1m9Q5k1m2Q1k8rmrm2k1P3JL0l1k4rL1j0K8m3j8N1k9J8N5
3063F1n8j4O4r9Q0o1m2J03rj8rJj0k4K6jOJ8J4k7k3K8M6q7N5L3q0N2j2lO3p9N
3096aJ4kn0K5N0J2r9O7kJ1l0k6O1l5rj2K3rO8n8l2L4l2L8J1m6K8%Q4o1l4L6l4
$$ y = [-16, -36, -22, 6, 10, 58, 22, -23, -16, 27, -2, 8, 40, 23, 12, -6, -27, 2, 1, 5, 10, 55, -4, -20, 34, -13, 21, 8, 8, 27, 24, 8, -4, 14, -18, -7, 4, -19, 16, 8, 27, 8, 20, -10, -2, -31, 28, -10, 20, -25, 7, 25, 15, 35, 8, -16, -33, 44, 3, -18, -56, -6, 10, -17, 1, -14, 43, -36, 59, -16, -27, 18, 14, 41, -29, -37, -35, -20, -29, 12, 30, -10, -22, -31, 3, -8, 0, 30, -42, 1, -19, 50, -7, 9, -48, 8, -9, 12, 10, -11, -30, 5, 20, -10, 14, -32, -9, 2, 15, -9, 63, 13, -21, 6, 14, -7, 25, -2, -1, -32, -7, 21, -21, -11, 22, 32, 26, 1, 5, 18, 5, 30, -17, 19, 20, 12, -15, 25, -6, -46, -5, -33, -21, 32, -25, -29, 9, 14, 19, 7, 2, -25, 54, 43, -19, -4, -6, 19, -30, -57, 4, 10, -23, 0, 8, -12, 4, -25, -33, -23, -11, 30, 31, -14, -14, -3, -52, 33, 12, -30, 51, 23, 14, 10, 1, -41, -62, 11, 12, 42, 11, -13, -22, 9, -1, 27, -16, -34, 17, -12, 6, 61, 3, -11, 53, -46, 34, -27, -69, 34, 25, 7, -2, -1, -11, -35, -9, -10, -4, 14, 28, 1, -22, 6, 52, -35, 20, 53, -27, 25, 13, 10, 73, -6, -1, 13, 11, -39, -14, 36, 48, -51, 16, 14, 25, -5, -31, 30, -5, -14, -26, -3, -12, 56, -2, -34, 0, -32, 6, 17, -29, -1, -1, 83, 22, -12, 24, -10]
3129a0l1P8n9L7j9Rl5J5l2O6K2m5N2n9K9k0k8P1o5N9Nn5l2J00j00k7P0j2K6kj7
3160iK8J3k0j0m7K6J6J6J7m4kMK1J9l2Kj6Mk2OO3j9j9j2J0K3o3N7L2k4Jj1k8n
3194b5M4l7j0L2l7K2l6%L9j7K7k3qJ7N3l2l3L5J9K6%k9lJm8PjJj4J3j1k2O0Nm1
3229b6J6Nk2Q1r8M0k0P1l7j4Qj9j1p0J02L0q1j4K1J2jN3m3kmj4P4m4Pk2L4J5m2
3262a5J1kO4n2k4J1%rJ5N4j03Q5k1L0n4M9n5L7n8N7j5j4n2J3Q4l7J9kl3nN3m3
3294a2l0N8o2NM9qN1r9R0p1J8l3O9j6o0N6J1N9p9j3k2N5l5%J1L8o5K6N%L3n8P
3327b2L2qk3N2j8k0jL1Op0M7j1j3M0l9M2qr9J05l5J9nN7j5k3l3j9J6j8N8n4L2
3359Cm7Q7k6p6K8L0l2J2J6OJ3J8o1N8L8p8M0l1jjM6j07J15n0j3N3l0m3L8J8j5
$$ y = [-10, -41, 37, -22, 15, -4, 5, -30, -15, -47, 19, 41, -4, 48, -11, 18, -2, -30, 41, -24, 35, 40, -15, -47, 53, -47, -74, -4, -16, 10, 8, -9, 19, 32, 12, 2, -45, -19, -3, 13, 30, -14, -16, -12, 9, 28, -4, -2, -18, -14, -36, -30, 33, 14, -5, -17, -7, 16, -47, 10, 42, 18, 19, 8, -20, -25, 19, -18, -28, 4, -33, -11, -47, -47, -8, -25, 2, -21, -29, -12, 41, 9, -24, 11, 30, 56, 56, 27, 24, 25, -23, -16, -17, -16, -30, -17, -28, -50, 10, 15, -26, -10, -5, -27, 54, -44, -4, -24, 47, 10, -4, 4, -15, -26, -96, 6, 36, -45, -59, -38, -26, -27, 26, -17, -19, -23, -37, 37, -7, 0, -22, 12, 27, -15, -4, -6, 58, 6, -18, -7, -7, -16, -1, 53, -50, 35, 14, 44, -10, 39, -16, 21, -37, 20, 5, -9, -61, -48, 36, -1, 18, 16, -17, -22, 31, -12, -42, 16, -46, -41, 8, 0, 51, -48, 42, -29, -11, -44, 25, 9, -51, 5, 16, 75, -4, -17, -39, 16, -19, -19, -8, 30, -35, -9, -4, -4, 29, -29, -22, 10, 2, -21, 31, 13, -7, -8, 23, 29, -41, 6, -5, -18, 22, -17, 25, 17, -82, 23, -12, 7, 2, 59, 44, 21, -12, -31, -15, -33, 25, -29, 3, -44, 43, 17, -59, -31, -1, -33, -21, -5, 1, 14, 32, -29, 29, 67, -11, 29, -2, -3, -4, 42, -65, 50, 0, -13, 40, 10, -33, 5, 23, 8]
3390Hl3J8k0Qj0PK9j9L7m4j0P7Lj6l3MJm3Q3o3J9Jj8k4R1m6m7L3QK3J2J0qj9j9
3425@Nk9K1l4J3N4mn3N5K6r2k6K9kO1k1K4k9nJ3jQ3p8n3M5j9L7J9J7r7L4N3m1
3458Eo7N5K4L2r1M0J2J0k0kPn3M0Pj3P2k8n8L8j1M9k3k6n8M5K3oJ4M3r4M9qL8
3491D5j3j6n1PN1m5N5j8k9l4Q0l7K5j6J0j4m8Q1j2nPK9l6n5kJ9j0M4M0p1R2r4
3523b1N4n6l3PJ3N2k0k4OL2o6QNM5j3LJ0J5J3j3l1MoL7m1M1n8M0j5K6m8J4k1P5
3557C4m1l3J8L1Qj5k9L5J8n8k4P7l0M3n6J9K2rn2R8k9qm9J5L5km1PKPmJ3JN0j4
3592C9n9Q7j06K2M5k1l3N1k0k3ML9m6L8qm3L3J2qK5r4Q7lm8j8N5K6r5R4j0n6L4
3624@j7K8J7j1J2Ko0J9J4K6j5p1N0k2L6k8OK7ok0M0j0p0M6m9L4L0O4m8o5M4O4
$$ y = [8, -25, -7, -27, -19, -29, -22, 7, -12, 25, -19, -29, 48, 51, 35, 2, 6, 7, -36, 47, -16, 3, 4, -14, -38, 53, 7, -40, -7, 1, 24, 36, 46, 38, 19, 0, 5, -24, -3, -37, -24, 30, 26, -27, 28, 54, -38, -64, -35, -37, 24, 3, 27, -2, -7, 6, 5, 88, 10, -43, 2, -17, 20, 39, 56, -41, -7, 46, 5, -62, -7, 17, 49, -42, -2, 10, 20, 0, -2, 5, -48, -8, -1, -14, 58, 30, -28, 10, -1, 48, 25, -1, -59, -14, 9, 3, 17, 60, -34, 15, 7, 45, 32, 16, -35, -28, 23, -22, 33, 15, -14, -48, 32, -5, 20, 4, 14, 0, -48, 33, 21, 16, 23, 52, 16, -39, -41, -22, -32, 12, 52, -19, 73, -21, 33, -23, -56, -49, -36, 16, -4, -28, -22, 10, -56, -48, -43, 2, -11, -8, 2, 17, 30, 17, -14, -10, -16, 21, -20, 21, -37, 3, -12, 14, -34, -20, -41, 34, -7, -40, -22, 9, 17, 2, -27, 8, 26, -32, -56, 21, -9, 34, -22, -3, 19, 10, -42, 56, 27, 19, -30, -15, 20, 18, -23, -16, -14, -7, -11, 2, 3, 53, 39, -20, 67, -39, -17, 28, 7, -26, 25, 5, -18, -14, 25, -21, 17, 9, -34, -1, 11, 3, 28, -66, 21, 18, -30, -48, 7, 33, -62, 32, 22, -34, 0, -17, 11, 28, 17, 29, 31, -29, -10, 4, 30, 15, -56, -6, -28, 8, -20, -14, 13, 7, -13, 27, 17, -53, -7, -56, -22, 8, 72, 24, -41, 3, 67]
3656F7p5l3L3O4r2K4QO5n1k9J1j3rOMjL5L8o7j5k4N5l7l0N0n0N6J1p1J07j3o9
3688d5J9nL4l1N1Kkn4K4j3J2k7K6K7jr3Q9n6K5K9Ll3J7N4j0n9LK8j9L9m1k9OO4
3722C4n2M1J6jl8OJm0K6K0jOl8M4n8N7k2K8k3L6kj3n1%l7M1L5M7j14M3J8ml5p
3756c7O5j2%k5J7o2jL4L4l7L2k9J0j8R3j8n7k%K6p8L4O9o8QN9m4k4M8l1L0o5M7
3789bl2Q2n5%K0l1O3rm0k3P7k5k7lj9P1j9l8J2k0L0M8p0L3n0M0J6n6M9%j7MJ9
3822B8l1O0n8kL1n7L5j3j8QM3j0n4K2M6k8Kjk3j2J7j3K2K2lm2M1n2N6o4jO9l7
3855a7M5n7K5l2J7OK8l4J9Ok2N3p3N1k6rK2K7j4j0o0P4p8M1L5ln2%O1k9K9l4k
3888a3jj8N4ok6M3m1MRk0P7r9L8j7RJ4rRL1Nn4L4l8O0l5Lpk9J9J5J6Lj4k6J1o
$$ y = [67, -8, -41, -8, 56, -36, -12, -4, 61, 10, -19, -8, -21, -30, -24, -20, -21, 14, 52, -15, -30, -54, 1, -36, -66, -16, -66, -10, 1, -70, 37, 24, -45, -26, -31, 3, -28, 23, 25, 23, -31, -7, -20, -8, -35, -9, 18, 17, -76, 13, -43, -18, 11, 14, -19, -2, 52, 42, -17, -14, 14, -5, 34, -7, -36, -30, 34, -18, 23, 39, 38, 0, 6, 7, -33, -7, 13, 12, 18, -20, 24, -34, 23, 1, 29, 6, 42, 40, 27, -24, -24, -61, -20, 15, 62, -52, -9, 9, 5, -30, -37, 28, 16, 16, -9, 8, -54, -55, -21, 13, -24, 8, -21, -11, -29, 64, 46, -11, -13, -13, 13, -65, -31, 38, -30, -22, 37, -7, -31, 17, -14, 16, -49, -2, -34, 48, -7, -7, 13, -18, 45, 36, -4, -27, 50, 25, -2, -5, -24, 47, 28, -10, 2, -18, 12, 60, -10, 23, -27, 13, 29, -27, 22, 22, 5, 9, 28, -3, 57, -1, -3, 28, -29, 6, -7, -25, -17, 26, 16, -38, -16, 30, 2, 4, 3, -20, -32, -15, -28, -6, 16, 13, -29, 12, -40, 16, -48, -49, 20, -17, 28, -29, -4, -36, -19, -13, 15, -19, 0, 6, -16, 37, -36, 15, -11, -20, 2, 29, 15, 5, -55, 19, -59, -18, 17, 14, -38, -38, 23, -6, 23, -11, -13, -14, -32, 22, 16, -10, 33, -8, -4, 5, -15, 62, -37, 1, -16, -7, 7, -2, 7, 38, 43, -11, 23, -15, 45, 10, 13, 6, -23, -4, 11, 27, 30, 16, -10, 1, -5]
3924eN9r1N7k5j8K4k2L9Ol7Nj0j8O5k5k5L5J8m3O9k1l9NL5p3K6Rk0O5q4J5MO5
3957D5o6Kk2N4K2k0J8j5l2R6j23J2J7j0J6k3L3KJ2ml7K8k3J0L3m3M5Rjjn6O0l5
3990CK3nL6n4M5n9j4K9L0nn9j1J9oOM6J2j6m0L0m2J4j1j1K3M0l9j4L6J0nKj4j4
4024a5K4m2P2l5mL0o7K0N8qk9L2l4K6J2k9J1Rm8m5O9m0PL7j0j5j2n0R8oNp9O8
4057A0m1%l3J09p4rM0MK7l5Ol1M3k1K9j5l3K1J9l9K2l8M2j3ONL0j8q1N5oJ3M3
4090C7j2L4j01K8Kj2M5n2K8ll3N0l9K7Kj4J1kk7nO0qMPM8j22O4k9J6k3N2l7K3
4123A9q2N4Rj4j5K2O6j21O2L4mJ7l2qjK9%r0P3l5J9j8K0j6O1j25P2rJ0K4j9j0
4155hoM2rL4l2p0M3J6j3k2M7k9ok6M4k7M1n5Q2k5Kk5k6K2k4O5p2k0K1P0m7jJ6
$$ y = [-5, 54, -37, 20, -5, -23, 1, -21, 18, 24, -13, -8, -18, -36, 29, 4, -21, 14, 32, -11, 58, 37, -2, 3, 38, -35, -9, 0, -20, 45, -39, -24, -20, 45, -21, -19, -41, 13, 35, 15, 33, 18, -14, 82, -41, -29, -12, -22, -6, -29, 4, 6, 18, 14, -23, 5, -18, -8, 25, -18, 27, 36, 35, 34, -22, 38, 3, 26, 21, 57, 3, 48, -11, -25, 4, 34, 29, -30, -41, -22, -28, -22, 24, 36, 20, -20, 10, -32, -18, -29, -40, -17, 23, -16, -30, 6, 16, 11, 13, -1, -15, 9, -33, 39, 4, 0, 30, -37, -17, 41, 33, 4, 36, 2, 28, 40, 11, 22, 31, -17, -62, 7, -33, -26, 11, 1, -14, -26, -76, 22, 16, 21, -58, 10, -31, -31, -64, 45, -29, -38, 2, 6, 33, -2, 4, -27, 16, -5, 24, 9, -24, -3, 16, -23, -1, -39, 3, -10, -4, 1, 31, 13, -68, -13, -19, -6, 37, 25, 59, -42, -14, -12, -24, 21, -31, -3, -6, -39, 11, -28, -1, 1, -13, -2, -4, -31, -36, 24, 16, 20, 27, 75, -47, 17, -12, 4, -19, 33, -4, 19, -63, -9, 0, -14, -29, -7, 59, -62, 0, 34, 30, 47, 15, 7, 6, 35, 35, -55, 18, -17, 2, -16, 4, -12, 49, -76, -4, -13, -3, 21, 2, -8, -14, 28, 19, 53, 21, -49, -6, 10, -3, -25, 22, -7, -13, -39, 5, -22, 19, -36, 46, 21, 23, -2, -28, -6, -30, 35, -37, -57, -36, 34, -13, -14, 2]
4188Bk5K2K0Rq7M6L6k2L0k0m7R1o9K6k0l5O6k9PK3k7Pl6K7j5M7k0J3m6kL0PQJ7
4222C4J3n1n9K7M0K6pk4k1N8k4J4k5k8L6n6M8K0k3jk2O4Ll6QMoNMl7n6R6l9M0
4256B5j1Pm2k5O1m4Nl9N1K6QM1r8L5mK5oJ2pp3O0K2o4M7K0q6O4Mjl4J0j4J5J4
4290Dj2k5N6k6J8m0oJ5oL6k2jl9L2K8ro1N8L8o7P0k1pj6k3Q2p8M1qM5o5M0k3K
4324A0L1l1Rk8M8p2K4Rq%Jjm2Q9j2J3k2j5mj6M6k7%m9M1k0L6L2n4M1m0Qmk3M9
4359A9k4J3MJ5j5n3P8l7j5j3J6O2p3N6n4M5m2K7k6j1j4K4K6j9J3J4K9l3r2N3J3
4390a4j7L8M0p1O9pn9j9J04q8K7L9l6j5MOl1J2M6k7K9o3nP8m5L0Nn0JO1ml7L3
4423C4Lp2N2J6k8K6l4j3L0LoJ5l5J9J5n4K0j9N8n5J8m2O5K1m6P1n6m5O5j1o6K3
$$ y = [2, -23, -1, 19, 28, -59, -13, 23, 1, 31, 11, -36, 55, -14, 12, -8, -43, 23, -6, 1, 24, -3, 4, -32, -5, -20, 27, 7, 20, -26, -28, 2, 9, 17, 34, 47, -4, -63, -36, 4, 30, 23, -1, -22, 36, 12, 26, 1, -27, 9, -47, 1, 21, -2, -3, -25, 39, 42, 6, 14, 18, 12, 17, 21, -16, -72, 24, -15, 25, 14, 21, -21, -46, 15, -29, -24, -63, -12, 14, 22, 63, -35, 0, -4, 21, 15, 27, 20, -53, 7, 29, -35, 12, 32, -54, 10, 14, 13, -21, -11, -25, -10, 4, -8, -33, 23, -3, 15, -25, -31, -16, -22, 14, -8, -9, -48, -16, 12, 3, -58, 0, 38, -29, 41, 20, 13, -3, -26, 56, -22, 19, 11, 56, -9, 31, 8, 10, 41, 10, 19, -9, 39, -33, -9, 0, -8, -8, -7, -8, -50, 39, 27, 40, 18, 3, -1, -17, 29, 2, 2, -47, -6, -26, 10, 42, -12, 29, -11, -3, -7, -30, 19, -5, 8, 12, 27, 12, -41, 37, 0, -15, -28, -12, 50, -23, 33, -21, 24, -18, 9, -17, -28, -42, -18, 8, -11, 2, 16, 45, 12, -80, -27, -14, -31, 7, 47, -24, 45, 38, -21, -40, 64, -24, 3, 42, 6, -9, -5, 1, -30, -18, 28, 1, 30, -33, -38, 40, -5, 25, 30, -20, -19, 42, 38, 1, 34, 37, -35, 17, 33, 5, 31, -3, -16, 14, 17, 11, 26, -9, 10, 25, -29, -9, -28, 30, -25, -7, -49, 16, 37, -9, 62, 6, -39, 26, 15, -51, -28]
4455b8J6M0o2QK6k9R2r3J3PJ5J9p4M2J4M1m1L4k8k2M0n5L4k0J4l3K1m1O6k6N7
4486D7j14P5%Ml1Mj4RN4n6PPN1r1O7mk5RL1l8j7m0O2J8m6J1LJ2Kj8k6N2k9L6l0
4521a8M7o4O6%j7l3k8N7J2m4M3ml2l4O6L4q5N8K9k7k9J4n1O7j6k3JrM1K4l0j4
4553AJP5q3K5n1N2l1JKL0m6lnO6n0L2Pn5M7Oqj8K1k1pJ1j1J8Rm6j5M9j7pJ0ML9
4590C2n9K0mM1k0m4N9j5M5o3M5k8m9O4l9nQJ8mRL3r7N1K0QK7p6rM2l5M4l8M2m
4624A9J6m8l8O8nJQK2k7oK7m0j9rK2J5j1M3m2l3M8Kql0J7P2j07K7Kj0mN6QLk9
4659A0l8j6L2L5Nm5L4k8j1J9j5O9k3j4J1n3OK6l2R4q6J1j2%M1K5m5K0J0J1j2p7
4691d8M2J5lk5K6J2k3k7K7k1j4O2l6qO4o3O1m8N4k1n8m1R8Lqm4N9o7L6n9O0qK0
$$ y = [-28, -12, 28, -34, -26, 0, -29, 63, -30, -17, -10, 5, 24, -50, -8, 6, 47, 6, 40, 12, -10, 30, -25, 9, -11, 3, -30, -9, -50, 16, -10, 47, -67, 8, 8, 12, -19, -15, -29, -20, 34, -22, -15, -8, 43, -48, 19, 15, -10, -1, 30, -8, -25, -65, -3, 15, -31, -20, -17, -5, -3, -21, -47, 5, -24, 12, -18, 29, -35, 31, 31, 14, -19, -47, 10, 22, -22, 21, 17, -15, -49, 17, 51, -34, 24, 53, 26, -3, 11, -40, 27, 11, -12, -11, -20, 21, 45, 15, 1, 2, 77, -6, 19, -32, 20, -11, -10, -8, 22, -24, -27, -32, 34, -16, 16, 23, -32, 15, 21, 13, -5, 16, -5, -12, -1, -12, 6, 15, -31, -46, 3, -14, -21, -11, -7, 32, -27, -7, -11, 30, 10, -34, 25, 10, 55, -8, 37, 9, -40, 24, -15, -20, -12, 6, 2, 11, 44, -53, -2, 18, 26, 53, -23, -32, 10, -25, 19, -19, 23, 19, 35, -13, -51, 17, 12, 13, 21, 43, 16, 10, 37, -3, -22, -31, -9, 6, -5, 38, -4, -37, 11, 13, 5, -25, -8, 64, -43, -16, -14, -24, -28, 28, 36, 39, 10, -28, -44, -12, 23, 28, -17, 17, -11, -22, -3, -18, 51, 28, 14, 25, -28, -22, 4, -28, 66, -20, -9, -21, -21, 20, 45, 0, 20, 30, 41, 29, -48, -6, 9, 6, -19, 7, 19, -4, -31, -4, -25, -39, 23, -13, -21, 43, -20, 41, -7, 47, 26, -32, -73, 25, 28, 20, -24, 35, -32, 4, -55, 5, -3, 17]
4724A7k3J4n6M3K2JL1Jl5k7QNJ2l8J8Kj4M2%k0j5J7k7O4o4N7pl3L0M6j00L3Pm7
4758c6N6l7K7qK7k1n1Q8n9N8k4Qk0MJ7m5PK1j00Q6k7O0k0j4K1K9l7o7R4Rp8N1
4790A9JRl1Nq9R4k8J7ok6J0L0Qk1M8pQk1n9R2nn3jPm8N2RjN2p5K3jK1l6M5J8j09
4827d9j6R2nm6K4j4MPqJ2k4K5J6L1k0m1j7O3l6Kk0Q6p4O4o9m3O0j2K7J2m5M7m5
4860a2J1L7m4nmM0l2j9j6L2M1m1K7J8n8P0k8L5j9k5m1M2J3k5k5j9PN0J2J4m9l1
4892d4O4m2l3P0l9P0p2j1K8K5M7p5j4J2J1jk9K5rJ2PM7k6J4K7j7l9j1K0NrL9j
4925E1j1LJ2o6k9M6mJ6J3j9oRo5O3k5qO9q6j8K5J2O9l8J4p3P0m1J4J4j6L8l7M3
4958C9j7M6l6m0J1K1j0J2J7p5O5k6JnK4l3Pmn1M2K5n0M6K3j5k5J5JjrOJ2Nm0J
$$ y = [17, -6, 8, -48, -5, 17, 18, 49, 50, 15, -12, -4, 1, 13, -25, -7, -5, -19, 23, 23, 3, -12, 5, -22, 42, -22, 35, 28, -5, 25, 71, -29, 4, 11, -36, 20, -17, 10, 2, 29, 8, -43, 45, -14, 44, 20, 28, 8, 12, 29, -16, -9, 12, -88, -2, -29, 31, 11, -3, 18, 47, 10, -57, 37, 46, -32, 19, 20, 29, -2, 3, -86, 8, -20, -3, -9, -35, -25, 5, 13, -8, 40, 33, 41, 20, -39, 53, 48, -5, -6, 1, -47, 5, 14, 13, 65, -10, 13, 12, 33, -3, 42, 60, -49, -65, 27, 22, -24, 0, -14, -10, -3, -11, 1, -23, 2, 18, 49, 29, -12, -29, 34, -2, 0, -20, 66, -8, 56, -13, -56, 4, -8, 19, 31, -14, 33, -12, -1, 36, -8, -13, -17, 23, -9, -28, -44, -12, 29, -12, 15, 33, -25, 45, 17, 52, 33, 8, -33, 9, 22, -3, -28, -47, -40, 10, 22, 36, -13, -44, 20, -22, -55, 15, -24, 46, -26, -37, -9, 16, 63, -12, -26, -14, -3, -4, -33, -8, -17, -5, 2, 49, 23, 37, 64, 47, 8, -3, 17, 22, 13, 52, 51, 40, 43, 55, -11, -40, 6, 2, 18, 31, 12, 6, 15, -50, 13, -12, -20, 49, -37, -55, -30, -18, 51, 13, 27, -46, 24, -17, -3, 11, -5, 33, -4, 39, 22, 68, 32, -8, 3, 24, 14, 26, 43, -32, 33, 7, 8, 3, 27, -6, 1, -3, -54, -12, 13, -37, 9, 32, 17, -8, 7, 8, 7, -2, 4, 16, 21, -19, -18]
4993a8J9k7J3MkO2rJ5m0j4j9oKL0k6L3j3l8L1k4J8j6N7p8RJ9M0k8j7K8nKJK0l7
5028a4J8K5o7K8nJ8k3J1Ml2J5OP3n1rL0n3M1k7ll1M9j2J1Jj8k4J5J6jj0O5n8J
5062a1K9m0M7k3PM8j9k9n0M4k9N0Jj09J01l1j5L6L9kl3qL6p3J5K6L1l4m2L5K9
5093B6n6kN4pj8J1m0K4l5N9oL8o9RL1Om4mj9rM0J0L0j2mpj1k9K8n1P6mj9L0n3
5128b7m3L3QN7l9Qnk3O9Jk0l9qJ1N1n1N4Nl9M7k8Jm0L4j1l2K6k7N3m3J5mM2j17
5162h1R6J2k6J7Pkj4k0J5L9J5q2P1l3L3m2m3K8K5o2mK2O0j6K9k3k3J6km5O4Pm8
5195a0k0mqL6k0K0P2r1K7k8N8m8L5JOn1L7mj5P5j23R2j6ll8K3l5L1J7n1J6L5l0
5228a4M5n3pJ7K5k4j8K7PM4m4Mj1J3JjlK9o4J5K0j2pN1m2l3L8j4J1Mm6N2J2l6
$$ y = [-18, 1, -26, -13, -9, -11, 51, 42, 57, 17, 3, -16, -22, -20, 10, -16, 17, 4, -34, -3, -27, -9, -25, 32, -46, -37, -18, 22, -6, -23, 5, 0, 2, 3, 23, -14, 4, 29, -38, -10, -15, 3, -20, -9, -5, -37, -22, -16, 57, 6, -3, 27, -26, 15, -12, -15, -46, 3, -9, 2, 3, -15, -39, -24, -8, -9, -19, 46, -12, -11, 18, -22, 25, 2, 9, 57, 38, 9, -41, 3, -26, 24, 25, -84, 17, -14, -29, 7, 46, 44, 11, 3, 39, -34, -19, 7, 38, 4, -38, -3, 26, -30, -32, 22, 15, -3, 8, -32, -8, -43, 16, 10, 48, -21, -12, 19, 25, -19, -23, -42, -51, -11, -1, 29, 17, 13, 6, -5, -34, -6, -57, 19, 15, -4, 26, -27, -70, -37, -29, 28, -11, -3, -8, -31, 38, 39, 19, -20, -28, -17, 34, -17, 37, 42, 3, 50, 22, 23, -17, 17, 6, -26, 0, -27, 26, -17, -2, -6, 36, -81, 15, 27, 1, 18, 25, 23, 9, -11, 4, 43, 58, -24, 47, 14, 47, 5, -38, -10, 15, -47, -51, -29, 31, 15, 44, 21, -2, 14, 12, -33, 31, 38, -10, -30, -34, -42, -6, -26, -6, 66, -25, 2, -26, 32, -16, 19, 20, 26, -25, 12, 8, -7, 68, -55, 37, 21, 18, -20, 3, -32, -1, 16, -35, -19, 16, -14, 31, -22, -29, -12, 13, -11, -29, -2, 5, 49, 5, 9, -2, 11, 12, 11, 8, 37, -27, -12, 8, -4, -11, 40, -2, -35, 3, -11, 0, 4, -42, 10, 22, -14]
5262a4K6l4L7J0p6M4J9n0M0j3Nl5L2rN7kn8K3m0M6K2Pj2l9M8j8m3K7j4M4j7m7
5294c4J6NnM8p9NQKJ1L5nnJ0j4Nl8L3K5j2jJL6p1K3loJL3pJ1Rj01J05j4j9J0J7
5331C5n8K0J1j5O6k3o1M0J1k9K4l0M9k5j4%M1qj6K0n0QRNKJ6o3L0J9K1j1n6MJ9
5365il5O9jm2j6M4j2M0m9k7P6l6j1J1k5M0Lm5lK3K6K6n6lM1k0m2kP4q3K4l1M9
5398bj3Ok1L3l0Q4r6J8K5j9k1M8M3m6Jl4K6j4JK5J6l5N3m7J0mjL4p0j6M4j7K3
5431Dl5N1k8K0o4M4K4j5Kl4N0j2pj2K7n5J2N7l8J4Ll9N6m1L1nJ8m4L5j3K7%ok5
5465Bk2l2J04k1m8PJ8k9Rl6P2m2pL7m6N1%l7J3L7m4O8m1%j6n3M6QRl3K3m4RO5
5499B7l4M6p8J2j6M9k5M9o4K7L7j12Q0JK4l3j1K3j0j0N1j2o6K2j0P5oJ1n0K2l4
$$ y = [-14, 12, -22, 15, 25, -51, -7, 12, -38, 2, -11, -6, -41, -9, -18, 39, 37, -21, 2, -38, 8, 30, 37, 25, -14, 34, 16, -27, 0, -14, 30, 13, -34, -18, -13, -18, 30, -49, -44, -36, -34, -23, 12, 7, 2, 12, -2, 3, -35, -2, 23, 11, 10, 11, 47, -24, -1, -4, -10, -9, 24, 17, 28, 37, -64, 41, 27, 8, 18, 35, -23, -3, 8, -7, 59, 36, -25, 15, 26, -3, 21, -9, 40, 15, 1, 1, 42, 34, 18, 38, -12, -4, 5, 10, 12, 28, -35, -5, 14, 35, 24, -32, -28, -9, -44, 25, 24, -18, -34, 10, -2, 38, -11, -38, 38, 2, -9, 2, -23, 17, 20, -25, -28, -5, 21, 47, -9, -12, 29, 9, -33, -35, 39, -44, -20, -51, -2, -15, -9, -30, 3, -27, 57, -39, -21, 4, -15, -36, 12, 55, 9, 10, -24, 2, -12, -11, 14, 30, -5, 48, 1, 11, 7, 6, 40, -30, -46, -2, -19, 4, -31, 20, -8, 12, -52, -8, 16, 1, 3, -31, 19, 7, 0, -12, 15, -40, -28, 29, -9, 5, 8, -31, 25, -16, 15, 10, 28, -16, 19, 6, 33, 33, 27, 2, -20, -52, 52, 31, -17, -10, 8, -21, -12, -48, 24, -18, -25, 12, -34, 17, 17, -20, -7, 30, -14, 54, 13, 13, -3, -56, -10, -2, 7, -26, -3, -47, -38, 27, -7, 39, -39, -27, -43, 6, -19, 30, -34, -7, 30, -82, -2, -1, 23, -10, -21, 2, -8, -18, 33, 21, -45, -23, -33, 42, 36, 47, -3, 19, -15]
5530a5J2jq7Q4K5jjk3L0Jn6L2N7n8Pk4L1n3JM2K1k6K0j2o2P1k4J7M3n5M8k6Qj2
5564A4L8m5k9M1J0N2r7PJ5P1p2m6L7L1j9J9l2n6O5l3KP7o0l6P2jl5KM2k2j7O6
5596F1q0J6l5M1j8J1Lj4L0J4j3j4o2P8k2p0J19J8j2j8j3qm5j5L8m0P8o5K2K3K2
5627C0m6J3j0K3J5n7M9K0Pq6L5L2k4K7J0o5L4nj8N0o6L3K7l2n5Q7k9lj5pJ5j8
5659b9PL3j3J9M8p8LK2MQn5jkK2Qj2K5m5P0mk9L6l5j9J7l1M1J0n2KM0ol1J4K6
5694A3J2p3K0K8l8K0KK5o3L4K7Po6K6P5o5L0OK6m9MnJ0l8J7n9P2L1r4K9M9qo8
5727f3R2l5%J0l5L6j6N9p1l6R1k2rL2ko1N8l6Jj3%nL2Lk7l8M9J1k9M6j4l3kN7
5761C0n6N1q5M6k7K3oMM3nj7n8P8jm5P0j19Q6j6Nk9NM7k7m3L8K0ql0PP3p6J3J6
$$ y = [-15, -3, -4, -91, -7, 18, 17, 16, -7, 23, 24, -32, 0, 57, -1, 6, -18, 13, -40, -39, 3, 24, -2, 18, 6, -56, 15, -9, 8, 51, -4, 44, 18, 26, 14, 52, 7, -22, 19, 29, 81, -16, -9, 6, 77, 5, -41, -4, 27, 8, 27, -5, -61, 4, -29, -27, 50, -10, -46, 26, 25, -10, -8, 34, 12, -5, 61, -19, -3, -38, 3, -15, -4, -1, -15, 15, 29, 16, 2, -60, 18, -4, -74, 45, 63, 51, 33, 20, 12, -33, -48, -10, -50, 28, -37, -15, 8, 30, -16, -3, -13, 10, 25, -32, 17, 37, 44, -42, -7, 25, 1, 28, 38, -27, 7, 2, -16, 34, -32, 1, 28, -4, -59, 28, -1, -4, -19, -26, -11, -29, -22, 11, -2, 17, 65, -13, -10, 12, 16, 24, -31, -32, -34, -12, -4, -16, 9, -36, 34, 30, 1, 37, 2, -17, 0, -31, 10, 20, -32, -30, 10, 4, -27, -13, 13, 25, -48, -28, 0, -38, -18, -16, 9, -54, -20, 7, 14, -52, -26, 49, -16, 14, 20, 46, -3, 1, -4, 6, -32, -15, -74, -2, 29, -65, -36, 13, 5, -63, 29, -6, -6, 4, -31, 5, -11, 48, -23, -59, 32, 10, 1, 33, 31, -30, 28, -8, -7, -20, -20, -25, 7, 10, -17, -55, -6, 5, -24, 22, 8, -25, -27, 30, -26, 25, -60, -14, -41, -18, -24, -20, 23, 18, 1, -57, 21, 20, -25, 45, -74, 12, -4, 1, -28, -23, 24, -3, -46, -8, 12, 4, -26, -19, 54, -22, -9, 7]
5795Gl6oQ8j5l6k4J9K4Lrko7R4l0j4J8j4j0mJ5Mk0J5l0P1o1k2P2k3l3R5r1K4j7
5829a5%P9q7jpPk1L8j8m9M6J1k2M5L5o9J0R4n8K4n3k6K7j9nQ9p7PoJ7k9M9l7J6
5863eLk3J8k5j3J5rM1j6Pm8K3K1l1J6%k8L3rM6o3P4m0j5rL7k5OJ3L7l1k5J9N6
5897E0k3j2mlj2LoK5J7o4l2R9K0p8O2k0l4K3j0j7M9o9J00q1J6k0O7ro8R3o7M8
5929D3Jl7K1j7Pk0K7K7o6K2M0j1j3j7K5n7K8p6O9P7o4j1LL7j7n6K9L7m4K2L1m8
5961hO1J2o1j6K9k2J0pJ0lqL5l9K1r4R6l9L0K6p0Q5m5Lorl3O2J1m6MjL3l8K8K2
5996C3Jj1K8n8J8M2%p3K0J4J4j6jk9j2O8k9LJ4k6J9j9K4j5n7j7N9J5m4MO1l7j
6029hjPk1%M2j00R0k8oO3k1k9N0%n0K3j0K5m4lN3k5nJj0m9nL5K2l1M4j4l4M3K2
$$ y = [7, -29, -35, 53, 38, 2, -22, -3, 21, 24, 15, 13, -54, 40, 10, -4, 14, 0, -10, -14, 1, 5, -15, 0, -30, 41, -20, -42, 30, 7, -26, 69, -22, 2, -15, -15, 64, -23, -24, -31, -24, -45, -7, -25, -74, -28, -17, -39, 6, 41, -28, -18, 76, 18, 42, -11, -37, -10, -29, -34, 55, -22, -15, -21, -4, -33, 16, -21, -5, -2, -25, -7, -32, -45, -30, -39, 2, -14, -7, -55, -32, -11, -42, -26, -26, -54, -21, -30, 16, -47, 27, -13, -28, -37, 0, -25, -19, -6, 31, 0, -25, -6, 50, 27, 15, 11, 8, -4, -1, -7, 18, 35, -29, -61, 38, 58, -20, 42, 22, -12, 11, 1, -16, 33, -36, 64, -17, -1, -21, 46, 37, -31, 62, -5, 43, 44, 7, 28, 11, 18, -2, 25, 52, -14, 8, 48, 37, 24, 7, 32, -25, 3, -73, -4, 73, 9, -2, 1, 38, 21, -35, -6, 31, -13, 9, 40, -8, 53, 65, 4, -12, 17, -5, 5, -2, 8, 5, -3, 32, -7, 14, -80, 16, -23, 7, 33, -37, 48, 3, 6, 0, -9, -42, 20, 31, -15, -11, -12, 21, -17, 11, 33, 34, 23, 51, -7, 11, 53, 53, -20, 0, 14, 28, 12, 11, -18, -30, 38, 9, 12, 26, 0, 19, 0, 24, 9, -48, -65, -6, 9, -35, -31, 30, -7, -8, -9, -2, -23, -23, 19, -81, 9, -19, -25, 38, 17, -12, 38, 38, -12, 11, 1, 26, -18, -21, 32, 7, 2, 3, -7, -56, -61, -26, -4, -35, 9, -5, -39, 4, 26]
6064B6J0L9o1k2NK0m7M9j0n6K9L2K3l6pl5K7K5N3m9j6nl5M5o5J9O5j5p4N7k6M
6096c1j1M1K5n5L8l1Kl0P7m5%K4L6q4K8M2j5l3M4L0n6%k7Q7n0k0lOP3r5K5P2o0
6129Dj9j0L4Qn0J9j3jN7l7L3k2m7O2l6k6J3J1NJ0J3m0Po5O9N6p2KL4O2m4oJ4o6
6163d1P1m3R0r0m8N0ojl2Q1l8M4l2QNmMo1K9kQJ8j7l9L1J8J5n6j0O2k9NL1K0L2
6198G3k2r8O7j4j3k2L7K1lo3M4j0k2N7J3l2K7k7J7o4O2l8k0N2n1J9j8l4P4p5K9
6229c4K7k6J7J7l2K4%K7m3k5Q5k2l2L9kK6k4j3qm8j4L5k0L7k1Q7q1J6RL4j6k5
6261fn1M5Qj7L9p6L3NJ6MK9j8Km6J6rM4Jj4k1J3nM2j9kk1jk5P5l4j6K3J7n2K8
6296Glj2P3q2K7M9p8JJ9K6k0K5k0j2NJ2l2l8L4P8k6o4P2Qj6n3jj0O5m1m1M4L8
$$ y = [26, 36, 75, 14, -8, -3, 17, -30, 19, 9, -47, -18, 14, 37, 1, -6, -41, -14, 11, 64, 15, -1, -6, -41, 4, -61, -42, 23, 8, -66, -9, -35, -31, -42, -1, 24, -31, 7, -24, -22, -52, 25, -20, -20, 4, 40, -44, -16, 26, 11, -22, 22, 52, -4, -4, -31, 56, 6, -14, -17, -11, 62, -33, -8, 64, 4, -15, -25, 9, 17, -33, -14, -27, -28, 29, -8, 25, 3, -44, 18, -18, -44, -31, -20, -15, -5, 8, -32, -25, -90, -21, 35, -37, -35, -1, 61, 17, 11, 25, -41, 30, -13, 77, -13, -61, -11, -17, -18, -50, 31, -7, 37, 5, 13, 18, 14, 18, -43, -14, -16, -8, 10, -7, -46, -15, 3, 18, -38, -48, 14, -15, -10, 21, 41, 73, 51, -47, 20, 6, -7, -29, 8, 29, 26, -37, 7, -3, -25, 32, 45, 13, 40, 13, 30, -34, 28, -10, -30, 22, -29, -10, -28, -62, 12, -63, -34, -7, -33, -16, 1, -31, -7, -7, 20, -23, -48, 37, 15, -17, 22, 20, 46, 22, 9, 1, -47, -61, -26, -46, -9, -30, 57, -24, -8, 1, 35, 19, -6, -57, -12, -4, -21, 18, -58, -25, -20, -4, 0, 29, 11, 13, -33, -17, -26, 18, 19, 5, -16, -3, -8, 34, 15, 13, -8, -9, -34, 41, 7, -9, 14, 31, -21, 7, 4, -8, 65, -17, 10, 59, -19, -18, 1, 27, 7, 32, 12, 0, 5, 17, -15, -53, -19, 59, 33, -31, 41, 49, 33, -20, -21, -31, 34, -7, -48, -4, 34]
6329C4ppj1kJ0m8qQ1m6k3P9q1J7k4L3N6p1KJ9m2Q6j7k7pJ3k9QK2j9KQj3l3O8l
6364B0k1N0j3J4l8K1l4l9K0M6Nn9K1Qk0o%J8J2k7k2K3K4ML0n8M9n8KmM6m3O1J0
6398D2k2k4Q1n9k3L9jl5J0k3L2j1Rj5l9k5O3L0j8LkL1o6Kn1J6L1mjk6M4L6p6N3
6432ANQjm1MK3J1m7M7MJ5rJ8Mm9m6O7l0P4m9n2N5m0M1l3K6j9RM1k9n1L0Pj0M0
6467B4n1L7NQk0j3m5J0J0L1L1L4k6m8L9jmj2l3M2j9k3J3k6K6J3m2M6kJ6m7O5j3
6500B5j2jk0j2M4k8J1m9K9k4M9n%M5p0O1p1K4K7j0k1L7k8nM4nj8rj0L4m8L9qJ6
6534C1m6k5M6n8M3Mj9J9k6K8M2p8Pj5K7K6qM0l5M6l0l5K4k5l9Q2m1M0k7OQk5L0
6567A7m5llR3p5m3M1KL3L9j8l2k4lL6l1K6n4N6j1J0n4L2J7j5%l0jQ0J0j4po1M0
$$ y = [34, 27, 20, 9, 7, 17, -31, -39, 42, -4, -27, 52, -29, -12, -36, -3, 53, -18, -16, 3, -39, 47, 30, 3, -4, 9, -20, -12, 10, -9, -7, 1, -12, -45, 23, 20, -1, 49, 36, 50, 12, 33, -1, -40, -20, 26, 31, -28, -7, 1, -19, -25, -25, -7, 5, -22, -44, -21, 3, 7, 37, -21, 28, -30, -28, -32, 14, -29, 32, 42, 20, -4, 77, 18, -5, 34, 33, -2, 8, -15, 17, 6, 15, 0, -39, -64, -1, 29, 11, 14, 12, 43, -23, -21, -72, -56, -25, -29, -30, -56, -12, 24, -52, 1, 6, 14, 13, -28, -24, -1, 10, -37, 10, 14, 29, 20, 38, 42, -7, -53, 14, -16, 58, 9, -43, 12, -28, 13, -20, 6, -13, -4, 37, 8, -43, -13, -6, -16, 24, -27, 10, 15, 23, 3, -10, -55, -45, -35, -4, 27, 61, 35, -13, 26, 25, 21, 9, -24, 18, -1, -24, -11, -37, -11, 2, -40, 6, 4, 20, -27, 38, 25, 13, 12, -8, -20, 24, -4, 7, -42, -13, -37, 12, 7, 7, 52, -18, 43, -28, -4, 23, 13, -8, 29, 1, -4, 40, 35, 17, 8, -2, 32, -16, 23, 15, 31, -15, -40, 6, -52, -9, -5, -24, -5, -31, -3, 39, -39, -32, -47, -20, 6, -2, 38, 3, 49, 19, -16, 8, -17, -56, 26, -15, 25, -2, 4, 12, -13, 17, -28, -31, -34, 59, -16, -59, -18, -16, 17, 56, 38, 6, -18, -21, 15, -16, 10, -44, 12, 1, 11, -43, -11, 6, -9, -9, -39, -40, 40, 50, 36, 29, -32, 8]
6601HNj8Nl1O6l8L7Qm8k6PK5J1n8N0k4L8j5m5O0NpJ5k0PNm6%j4R2p2L1m8K4mN0
6637C5n9M3k5m2K4mN0k8M2j02K6k4Q0j5P2m2l2j8M2k8L9o6L0mPK5k8L1n6j4N5
6668A4K5nk1n6oJ0J4L4m1L1N5j2rj0l2j4M8Lj0Kk4RJ1m7O7l8L3Qk7k5K3m1kRK8
6703DJ2l6j8K1j2j1M2J7k4OkJ3K7j08Q5Pj3kJ1Pj1k3Nk2MO5j3k5K0k1L4q6N1m1
6737c7J4LOJ6J8Jn3mL3M3r0M2J8k7N5n9k0L6L6qk9K2pn8N4n4P6m8rK7k0J2K4Q
6771B1k1oJl6N6k2lLM6l6qj3j1k1J2N0J2oK3j23P1L3L3n5L4K1p3K2k0J1J1n8P2
6804B0l0qj9M9%l0K9J4k5Qj4n2L3j7j3K5N1m9K2j6Km0M4%J7j6l8P2j9%KM6n7j1
6838b0Q4o7ML3o7Q4l0j0J6q2O3l4KnL3K7l4o3L3M4k1pPj4L5m1J0Pl7N0m3K7l8
$$ y = [8, 13, -5, 0, -31, 35, -3, 34, 42, -6, -32, -25, 0, 11, -47, 3, -21, 17, 2, -43, 17, 22, 15, 30, 10, 17, 22, -24, -24, -38, 54, -18, 13, -35, -11, -15, 35, -24, 19, -6, -48, -24, -28, 22, -6, 36, -66, -40, -64, 16, 1, 73, 31, -1, -19, 23, -5, 34, -32, -2, -6, 1, 26, -2, 29, -27, -41, 14, 39, 34, 13, -43, -49, -39, -25, 9, -32, -1, 54, 42, 33, 23, -9, -23, 25, 28, 18, 20, -4, 5, 16, -31, 36, -2, 31, 39, 12, -13, 10, -31, -33, -24, 4, 16, -20, -38, -17, -29, -40, 2, 19, -5, 1, -1, 12, 39, -69, 16, 23, 10, 8, 19, 26, 15, -8, -3, -25, -21, 44, 31, 6, 26, 5, 39, -47, 4, -37, -23, -20, -14, 2, 20, 21, -32, -36, -3, 40, -50, -8, 10, -17, 38, -21, -41, -5, 31, 23, -6, 16, 9, -49, 5, -49, 27, -21, -30, -3, -23, -11, 13, 21, 0, -6, -5, -41, 15, -7, -10, -7, 39, 3, -5, -18, -29, -50, -38, 12, 24, 18, 41, -82, -11, 22, 55, 0, 34, 55, -18, 4, -16, -5, 6, -52, 20, -10, -18, -37, 12, 12, -18, 11, 25, 0, 8, -6, -58, -25, -42, -55, -30, 21, -28, -6, -22, -20, -60, -16, -16, 1, -15, -53, 19, 0, 0, 2, 48, -9, -20, 64, -3, 1, 34, -33, 51, 21, 11, 27, -55, 8, -26, -24, -29, 4, 31, -3, -66, -33, 11, -10, -17, -10, -24, 11, -30, -20, -13, -50, 0, -43, -16, -54]
6871e4Q7o7qR7n6J8k8M%K6Ko5K7lJ8K0j5ll8M3j9O0p3M5j2Rl0k9N7j3k9L7n4J8
6905b8L2k0J4MPj0RJ8qn4M6oJ5j9l1Oj3O0l6J8J3K9J4k4Nn1L1rKpJ2j1n2P8j4
6940B0j6J1k0j1J5M6j5k8J7k2j1k3k2L1nJ9nL0l7k3O0N2r5KQL3J1l2MK4%J1q3
6973e4M6j0n6K5M6J1j1mj6K8L5m9J1l7L0J1k1jK9ml0qK2JOL6pLN5q6n1Q8j1J4
7007D1j1l9Jl7P3k4qM1j4q8P3k1O0o4K4k8O1pJ4l3Mm7%k0K6KJ2M5q8M4J4Lqoj6
7042b1nk6Q0J1m0J1m0L6O2j7j8jl1MoL6po4K6K8j5k6N8n6L6k2l1L4ok0N8l3J4
7075IL1q0L4l7Q3l3O2m8l1L6l5j6J3NqK9Lk9NnJ3K9ol4PL6l5O3n1K4po0Ok6O7
7110A4LL9m0n4L0K9j0k6Qk0l7P7k1J0K1k1J0k7J6K2%j9Kj7O0m7K8k1j4J5k2L6
$$ y = [-54, 33, -34, -42, 55, -1, 17, -11, -7, -7, 19, 21, -44, -17, -20, -2, 18, 3, 0, -38, 5, -14, 46, -27, 18, 6, 15, -15, -44, 13, 0, -29, 8, -46, -28, 4, -16, -2, 2, 9, -1, 8, 26, 18, -36, 10, 4, 19, 0, -31, -25, -38, 22, -14, 4, 17, 46, 60, 36, 41, -10, 21, 12, 14, 7, 19, 8, -44, 34, 20, 4, 15, -5, -16, -1, 45, 30, 2, 19, -3, -14, -37, -59, -28, -33, -14, -19, 11, -26, -49, 11, 63, -32, -30, -22, 11, 22, -10, -6, 18, 18, 29, -54, -8, -18, -74, -49, -3, 8, -3, -7, -23, 5, 40, -9, 2, -35, -5, 6, -15, -16, 13, 9, -21, -29, -7, -6, 0, 36, 29, 32, 87, 1, -50, 38, 27, 41, 30, -9, -8, -45, 28, 4, -4, 37, 23, -65, 8, -13, 47, -17, 7, -21, 40, 33, 47, 14, 18, -29, -29, -49, -23, -21, -9, 36, -52, -8, 6, 9, 1, -5, -21, -26, -52, 28, 39, -1, 10, -30, 6, 68, 51, 33, 32, 1, 5, -1, 35, 28, -36, -10, 18, 3, -23, 35, -21, 15, -7, -38, -4, -10, -30, 28, -5, 9, 40, -40, -6, -43, 40, 7, 69, 21, -10, 26, -9, -25, -12, -7, -15, 14, 17, -12, -7, -12, 1, 30, 24, -10, -3, 33, -2, 61, 10, 34, 27, -33, -27, -53, 14, 17, 56, 16, -38, -8, 21, 11, -15, -7, -27, -64, 13, -8, 2, 23, 2, 12, -15, 1, 23, 23, 4, 6, -11, 49, 2, 30, 9, -5, 10, -12, 24]
7142B4kK1m5J1J5p0k1J8L4LK7k5QJJ0%L4j8k8pPJ7J5j7k9J7l4O4j2J8p0N6nj1
7176FK2l9mL1j2j3MNj9L4j1Rm6j1RL6pM2j4n0J2K7l3J3kjK7k3J1qJJ0K1o4M4J1
7212A8l9%l8M2j9NP7p6M4lm7P9p4O6l1l2L4m8J4KJ3K7l4RPkL5m0J8NL1j2r4L8
7246b5J8QM3l9pm1L2k0K4O8m9Jl4J3ROj9O8q3l2N7j1mK5m2L6K6m7m1M6Ln8K7j8
7280f0P6k0oJM3m4n0P7k2k3%O4m6JJ2Jn0L2pM0l4k6J08j10M6j4J5J4p0L5K9K3
7312C5n8LM7j6j1Kk0M7K9l4j9k6O4k4o6M6lk5M3K5nk0o1K8J1L5l7k9OK9j9L9J0
7345B6mK%l3L2l6L8p7K7M9j9j8J9k3L0L7r0M9K5n5L7l4L2k4jL2j7K8n0J4kK0P
7378B1o0Q7p6k5P8n5K4k9M9Pl5k3J5M0k9Mj0RL0p1L5k7K9Ln6R7k8lOj8mJ8K1l7
$$ y = [24, 22, 43, -2, 9, 24, -46, -67, -49, -15, -12, 15, -10, -2, -1, 9, 9, 43, 25, -3, -10, -3, 14, 29, 12, -17, 0, -34, 30, 18, 36, -34, 22, 17, 6, 28, -11, -15, 16, 4, -9, -5, 0, -19, 15, 4, 13, -33, -44, -35, 1, -6, 36, 22, -28, -16, 11, -22, -9, -11, -12, 15, -8, 3, -5, -4, 6, 27, -37, 7, 18, -21, -21, -59, -17, -36, -31, 46, -30, 14, 11, -36, 43, -31, 35, 4, -28, 6, -42, -28, -26, -13, 14, -20, -11, -4, -6, 29, -11, 7, 12, 43, 31, -63, -25, -7, 1, 44, 5, -2, -43, -11, -31, -7, 61, 12, 13, -21, -8, 1, 7, -12, 56, -27, -59, -2, -13, -17, 8, -34, 2, 28, -19, -60, -14, -11, -69, -42, -60, 16, -4, -10, -9, 34, -10, -60, 17, -5, -28, -28, 36, -10, -9, 3, 4, -46, -14, -21, 19, -15, -41, 67, -43, 3, -11, 4, 18, -52, -17, 12, 35, -23, -20, 27, 11, 0, 2, -18, 29, 58, 24, 5, -21, 43, 19, -47, -1, -4, -29, 14, 39, 34, 14, -47, -19, -8, 27, -10, -39, -33, -4, -23, 16, 26, 22, 24, 24, -9, 23, -13, 25, -52, -25, 24, 5, -13, 6, -17, 13, 50, -40, 9, 34, -21, 16, -18, 14, -10, -11, 21, 4, 32, -18, -4, -6, 14, 21, -39, 48, -28, -53, 25, -30, -6, -35, 14, 21, -14, -37, -22, 18, -11, -7, -17, -8, 22, -49, -14, -41, -12, -9, -65, 32, 4, 1, 7, -11, -15, 3, 24, -13]
7412a3K3NNl2NK0rJ1pmkk3J6K3o0J7N1jPk0n5j0NN9J0m3K0QK4m6nM4m1QJo1N2
7449a8J4oK4l2M0L6k0rm3Pk1l6N3N0q9N8k8RK8p4R9J3q1qL2p7J65j09jJ3M2mn8
7482c1M4K7m0l8L7K2%j8J5l4N2o3M3n0P2Lj4n6N6mn0L0m8N0m1M1o6O9m9k3R0m5
7514a9Ol8K5K0mO%k4k5OM9J0pl3L6K7l5m6R1o9J7m7N5jl3O8j00K7N3m0j3N0l7
7547b5M8O1r3k7J02r9K6j6%O7r6K1K8l1K5M9k5ql5%N4o7M6k2m1Q1Kl9M5l6L3N2
7579H0no8l1J8J8L7o7LN3n0k0J1K0m7L1L0ML5k6p0O2k5k2O7o4J16n5m1K4l0j4
7610b6L2K0m6k1K1L2l9L5k2L8N5n9Om8j7R8p6PJ9Rl0K1k0pn0N3k%rJ3J6oN9o3
7644gjL1l0J9ln2J9N4n2pO6r2P5j3j3JLnK0l1k1k4K9J7K9J6o1M6m5QJ4Mn3L3J7
$$ y = [-13, 10, 15, 20, -12, -7, 13, 4, 15, 8, 4, 2, -21, -5, 18, -42, -25, 26, 25, 32, 12, -43, -53, -48, 11, 21, -22, -2, 6, 30, -16, -21, 23, -18, -10, -9, -70, -18, -4, -10, 14, -18, 22, 58, 38, 29, -14, -7, -28, -64, -11, 39, -50, 8, -20, -11, 17, -57, 42, 55, -26, -34, -2, -79, 86, -23, -24, -11, 31, 27, -31, 13, 40, 0, -38, -1, 21, 21, 3, 18, -16, 36, -27, 16, -34, 38, 41, 27, -29, 27, 23, -27, 3, -45, 5, -36, 5, -61, 8, -41, -64, 26, -19, -13, -51, -26, -6, -10, -4, -4, -28, -53, -47, 2, 12, 5, -28, 8, 35, 0, -46, 45, -24, -7, -54, 1, 0, -33, 35, -65, -38, 15, -25, -38, 12, -25, 23, 84, -9, -36, 66, -33, -7, -23, -23, 44, -52, -31, -3, -34, -9, 40, 15, 7, -28, -28, 26, -41, 5, -17, -58, 23, 25, -14, 31, -5, 28, 80, 75, 7, -24, -6, 12, 49, -18, -15, 38, -12, -32, -21, -1, -48, -17, 13, 17, 52, 26, -44, 18, -7, -29, 38, -26, 90, 35, -6, 18, -12, -26, 6, 26, -20, -41, -20, 12, -27, 8, -14, 24, 79, 20, 26, -22, -39, 59, -17, -10, 9, 18, -12, 9, -11, -18, -68, -15, -17, -17, -26, -13, 3, -3, 56, -7, -8, 23, -7, 12, 9, -43, -24, 30, -22, -29, 37, -55, 20, 7, -6, -5, -2, -7, 13, -18, -39, -63, -34, -17, 12, 28, -33, 13, -32, -24, -10, -6, -59, -26, -9]
7679iJ8j8O0m7L6j3k0l9J9POMJ5K8j23J15j2m0N9l0K9l4J9l2K4k6%Qn9lM7k7M9
7712A1l5J8k9k1j2Q6l8O5l0j3J7rj7J7K2J3r8oQ3p0M0N7j13O9mMM5q0L1l3NP3
7744D8n9M6Ln3j2oN1k5kL7j4J6o0O5j2l1j0M5L1o5qL2Kjm4J0N1m3O6j5m4Om5P4
7778C4Mn3N0l2K2k6KJ0pj0lJl5L6l0M3l6J1M6n2O2%n9N7n5l0M9j1MOo4J29j00
7811c7O9l9Lj0PK3n7K4L6j7Qm1L0ln8L4rO7m0j7K4jK6l9l4L8JM0J5l6k9K6J4N7
7845G5o5j4lM2k8J3Np2O3m4Q8n7KLj1L4J6l3n2J08r9L4k7M6p7M5rJ9k8j6M1Rj1
7878cj9J2m4N0Ln1K5K5j6l7P0l1lPK5M2q9J1j5N9l2N6k5ql2M5m7K9QKNn9N6ol3
7913b0K2K8j5n3L6k3P0p1M6J2Qo9J9Qk9N5j6m0LL4l2L5j5J8JJ9k6l5LK3J7RJj
$$ y = [-9, 9, -9, 51, 4, 40, 27, 7, -32, -13, -6, 0, 4, 19, 47, -76, 39, 27, -13, 46, 16, 45, 11, 30, -2, 22, -4, -4, 4, -55, -58, -11, -38, 11, -24, -6, -35, -56, -68, 18, -20, 45, 15, 2, 19, 10, -7, 10, 32, 45, -53, -59, 24, -46, -6, 51, -62, 7, 3, 7, 52, -28, 3, -30, -25, 48, -11, 35, 38, -15, -27, -33, 18, -7, -9, 28, 14, 30, -30, 35, 23, -8, -18, 27, 58, -7, -15, 17, 19, 18, -26, -16, 35, -8, 58, 43, -1, 5, -40, 34, 38, -15, 35, 3, 25, -1, 1, 11, 4, -6, -9, -8, -43, -7, -37, 6, -30, -19, 27, -25, 37, 37, -22, 35, -20, -50, -1, -12, -8, -2, -66, 63, -37, 32, -7, -4, -14, -7, 16, -41, -17, 19, 2, 10, -31, -1, -4, -62, -28, -37, 30, -10, -27, -3, -4, 22, -17, -51, -13, -12, 28, 43, 7, -22, 4, 18, 75, 10, -4, -7, 35, 7, 20, 25, -47, 16, -28, 60, 3, 5, 8, -3, 31, 47, 14, -38, 70, -29, 5, -22, 24, -53, -8, -17, 2, -26, -42, -1, 8, -3, -22, -10, -54, -4, -1, -52, -27, -2, -18, -55, 15, -16, -19, -12, 13, 55, -34, -23, -38, 21, -11, 45, 20, 12, -20, 25, -22, 7, 15, 17, 22, -37, 19, 13, -20, 2, 30, 15, -38, -2, -25, 45, -26, 20, 32, 40, -29, -10, -2, -31, 24, 8, -32, -29, 5, -27, 8, -7, 11, 12, 31, 5, -30, -27, -4, 13, 22, 23, 22]
7947B2l5M2l6M0o1M3j3j1l4KL4K6ol9J1m3j5O4J7n0M9OL7k9n1K3J1M4o4M5n3P0
7979D6Rrm8k9L5M7o7rL1J1j6J2m6N2l1QM2k7k5J1k8QqJ6J9m8M3k0QPL5j01J20
8012D8q2N9k8nj3M5l6L8lm1M2m1K2N2o5PpJ2Mn6M4k5L1l3K8k3M3nOn9J3N8k9L9
8046D0k0l4m1M5Rjl3JM2m3L6J1Oj1qj4K4m3oL0O5m2Qk5J7m2M1J2o2L5J9om2K0
8080a2J9k7k0O7l3LqJL8j9m0N1q4L8J3J5k4m3M8O3o7K9J8k3l7N0jpL7n5l6N6m2
8113c2J5K7k6K2Rk2l3N5qJ5lJ6m3J6jm5Q6o5L0n2P6k0m4M6l2O5n6K2j3K2l8J4
8145CJ3m1M8k5K1l5m0R3J0n8K7l3L9oj6K3l3l4N7j8M6m1N6rj1l6MJ3j1nl2K7L0
8178B6Jl4L1m2L3K6p0KJ3l4O4pn6
$$ y = [22, -13, 29, -7, 33, -28, 15, 2, -9, -43, -41, -7, 19, 13, -26, -15, -58, -73, -9, 8, -42, 7, 13, 50, 21, -30, -7, 4, 48, -16, 29, -24, 46, 55, 46, -2, -31, 4, 51, -16, -25, 6, 17, 1, 13, -33, 19, -12, -4, 38, 11, -14, -3, -31, -23, -31, -15, 4, -44, -1, -21, -13, -6, 29, -72, 48, -34, 25, -3, -8, -21, 24, -12, 26, 23, -18, 24, -17, 5, 57, -8, -1, -8, 4, 8, -48, -4, -29, 2, -31, -3, -26, 17, 12, 18, -41, -28, 30, 1, 40, 20, -14, -55, -10, -1, -2, -35, -34, 8, -35, 1, 12, 18, 7, -1, -15, 9, -34, -40, -10, 55, 13, 21, -4, 13, -29, 12, 24, -38, -3, 16, 10, -32, -12, 7, -20, -40, 27, -6, -3, -11, -10, 28, 9, -31, 20, -64, -26, -13, 2, -22, -65, -17, 46, -21, 8, 26, 3, -34, 16, 15, 8, 45, -10, -46, 10, -32, -17, 10, -16, 6, 15, -7, -40, 15, 7, 22, 19, 35, -8, 8, 7, -38, 48, -17, 13, -39, 37, 17, -27, 19, -13, 52, -4, 18, 5, 27, -11, 3, 16, -25, 23, -2, 19, -16, -56, 37, 47, -11, 16, -17, 22, 16, 0, 23, -10, -44, 13, -5, 41, 0, 56, 47, 36, 0, 4, 17, 6, 1, -31, -4, 26, 27, -7, 24, -18, 15, 41, -29, -27, -14, -48, 16, 9, -47]
8191d7
##END NTUPLES=NMR FID
##END=
