##TITLE=1H_K-385/3
 DMSO-d6
 32 sc, 
 14.02.2022
##JCAMPDX= 6.0         $$ Bruker NMR JCAMP-DX V2.0
##DATA TYPE= NMR FID
##DATA CLASS= NTUPLES
##ORIGIN= UXNMR, Bruker Analytische Messtechnik GmbH
##OWNER= root
$$ XWIN-NMR		Version 3.5
$$ Mon Feb 14 11:42:33 2022 Russian Standard Time (UT+4h)  she@DPX200
##.OBSERVE FREQUENCY= 200.131346
##.OBSERVE NUCLEUS= ^1H
##.DELAY= (6, 6)
##.ACQUISITION MODE= SIMULTANEOUS
##.ACQUISITION SCHEME= undefined
##.AVERAGES= 32
##.DIGITISER RES= 18
##SPECTROMETER/DATA SYSTEM= spect
##.PULSE SEQUENCE= zg30
##.SOLVENT NAME= DMSO
##.SHIFT REFERENCE= (INTERNAL, DMSO, 0, 15.7039)
##AUDIT TRAIL= $$ (NUMBER, WHEN, WHO, WHERE, WHAT)
$$ ##TITLE= Audit trail, XWIN-NMR		Version 3.5
$$ ##JCAMPDX= 5.01
$$ ##ORIGIN= Bruker BioSpin GmbH
$$ ##OWNER= she
$$ F:/spectra/data/she/nmr/H-F/1/audita.txt
$$ ##AUDIT TRAIL=  $$ (NUMBER, WHEN, WHO, WHERE, WHAT)
(   1,<2022-02-14 11:41:22.64 +0400>,<she>,<DPX200>,
      <continue with go, POWCHK disabled, PULCHK disabled
       configuration hash MD5:
       00 E9 B6 7A A2 85 ED C7 34 08 36 98 17 FE 4E 26
       data hash MD5: 16K
       B4 E1 50 B0 6D 4E E4 18 10 9C 87 F4 AE 1D 3B 47>)
$$ ##END=
$$ 
$$ hash MD5
$$ E9 D7 48 47 42 4F 01 85 A4 AD 8B 7E B1 8C 66 6F
##$RELAX= 
##$RELAX= 
##$RELAX= 
##$RELAX= 
##$RELAX= 
##$RELAX= 
$$ Bruker specific parameters
$$ --------------------------
##$DU= <F:/spectra>
##$EXPNO= 1
##$NAME= <H-F>
##$PROCNO= 1
##$TYPE= <nmr>
##$USER= <she>
##$AMP= (0..31)
100 100 100 100 100 100 100 100 100 100 100 100 100 100 100 100 100 100 
100 100 100 100 100 100 100 100 100 100 100 100 100 100 
##$AQSEQ= 0
##$AQ_mod= 1
##$AUNM= <au_zg>
##$AUTOPOS= <>
##$BF1= 200.13
##$BF2= 200.13
##$BF3= 200.13
##$BF4= 200.13
##$BF5= 200.13
##$BF6= 200.13
##$BF7= 200.13
##$BF8= 200.13
##$BYTORDA= 1
##$CFDGTYP= 0
##$CFRGTYP= 5
##$CHEMSTR= <none>
##$CNST= (0..31)
1 1 145 1 1 1 1 1 1 1 1 1 1 1 1 1 1 1 1 1 1 1 1 1 1 1 1 1 1 1 1 1 
##$CPDPRG= <>
##$CPDPRG1= <>
##$CPDPRG2= <>
##$CPDPRG3= <>
##$CPDPRG4= <mlev>
##$CPDPRG5= <mlev>
##$CPDPRG6= <mlev>
##$CPDPRG7= <mlev>
##$CPDPRG8= <mlev>
##$CPDPRGB= <>
##$CPDPRGT= <>
##$D= (0..31)
0 1.2 0 0 0 0 0 0 0 0.06 0 0.03 0 0 0 0 0.0002 0 0 0 0 0 0 0 0 0 0 0 0 
0 0 0 
##$DATE= 1644824342
##$DBL= (0..7)
120 120 120 120 120 120 120 120 
##$DBP= (0..7)
150 150 150 150 150 150 150 150 
##$DBP07= 0
##$DBPNAM0= <>
##$DBPNAM1= <>
##$DBPNAM2= <>
##$DBPNAM3= <>
##$DBPNAM4= <>
##$DBPNAM5= <>
##$DBPNAM6= <>
##$DBPNAM7= <>
##$DBPOAL= (0..7)
0.5 0.5 0.5 0.5 0.5 0.5 0.5 0.5 
##$DBPOFFS= (0..7)
0 0 0 0 0 0 0 0 
##$DE= 6
##$DECBNUC= <off>
##$DECIM= 32
##$DECNUC= <off>
##$DECSTAT= 4
##$DIGMOD= 1
##$DIGTYP= 9
##$DL= (0..7)
0 120 120 120 120 120 120 120 
##$DP= (0..7)
150 150 150 150 150 150 150 150 
##$DP07= 0
##$DPNAME0= <>
##$DPNAME1= <>
##$DPNAME2= <>
##$DPNAME3= <>
##$DPNAME4= <>
##$DPNAME5= <>
##$DPNAME6= <>
##$DPNAME7= <>
##$DPOAL= (0..7)
0.5 0.5 0.5 0.5 0.5 0.5 0.5 0.5 
##$DPOFFS= (0..7)
0 0 0 0 0 0 0 0 
##$DQDMODE= 0
##$DR= 18
##$DS= 0
##$DSLIST= <SSSSSSSSSSSSSSS>
$$ [...]
##$SUBNAM2= <"">
##$SUBNAM3= <"">
##$SUBNAM4= <"">
##$SUBNAM5= <"">
##$SUBNAM6= <"">
##$SUBNAM7= <"">
##$SUBNAM8= <"">
##$SUBNAM9= <"">
##$SW= 18.0517287032376
##$SWIBOX= (0..15)
0 0 2 0 0 0 0 0 0 0 0 0 0 0 0 0 
##$SW_h= 3612.71676300578
##$TD= 16384
##$TD0= 1
##$TE= 0
##$TE2= 300
##$TE3= 300
##$TEG= 300
##$TL= (0..7)
0 120 120 120 120 120 120 120 
##$TP= (0..7)
150 150 150 150 150 150 150 150 
##$TP07= 0
##$TPNAME0= <>
##$TPNAME1= <>
##$TPNAME2= <>
##$TPNAME3= <>
##$TPNAME4= <>
##$TPNAME5= <>
##$TPNAME6= <>
##$TPNAME7= <>
##$TPOAL= (0..7)
0.5 0.5 0.5 0.5 0.5 0.5 0.5 0.5 
##$TPOFFS= (0..7)
0 0 0 0 0 0 0 0 
##$TUNHIN= 0
##$TUNHOUT= 0
##$TUNXOUT= 0
##$USERA1= <user>
##$USERA2= <user>
##$USERA3= <user>
##$USERA4= <user>
##$USERA5= <user>
##$V9= 5
##$VALIST= <valist>
##$VCLIST= <CCCCCCCCCCCCCCC>
##$VD= 0
##$VDLIST= <DDDDDDDDDDDDDDD>
##$VPLIST= <PPPPPPPPPPPPPPP>
##$VTLIST= <TTTTTTTTTTTTTTT>
##$WBST= 1024
##$WBSW= 4
##$XGAIN= (0..3)
0 0 0 0 
##$XL= 0
##$YL= 0
##$YMAX_a= 15292
##$YMIN_a= -10734
##$ZGOPTNS= <>
##$ZL1= 120
##$ZL2= 120
##$ZL3= 120
##$ZL4= 120
##$ABSF1= 10
##$ABSF2= 0
##$ABSG= 5
##$ABSL= 3
##$ALPHA= 0
##$AQORDER= 0
##$ASSFAC= 0
##$ASSFACI= 0
##$ASSFACX= 0
##$ASSWID= 0
##$AUNMP= <proc_1d>
##$AZFE= 0.1
##$AZFW= 0.1
##$BCFW= 1
##$BC_mod= 2
##$BYTORDP= 1
##$COROFFS= 0
##$CY= 11.3945322036743
##$DATMOD= 1
##$DC= 2
##$DFILT= <>
##$DTYPP= 0
##$F1P= 2.36226072786647
##$F2P= -0.459571619588291
##$FCOR= 0.5
##$FTSIZE= 0
##$FT_mod= 4
##$GAMMA= 1
##$GB= 0.15
##$INTBC= 1
##$INTSCL= 1
##$ISEN= 128
##$LB= 0.24
##$LEV0= 0
##$LPBIN= 0
##$MAXI= 10000
##$MC2= 0
##$MEAN= 0
##$ME_mod= 0
##$MI= 1.114404
##$NCOEF= 0
##$NC_proc= 0
##$NLEV= 6
##$NOISF1= 3.799351
##$NOISF2= 2.8
##$NSP= 1
##$NTH_PI= 0
##$NZP= 0
##$OFFSET= 15.70392
##$PC= 1
##$PHC0= -16311.23
##$PHC1= 11.20079
##$PH_mod= 1
##$PKNL= yes
##$PPARMOD= 0
##$PSCAL= 0
##$PSIGN= 0
##$REVERSE= no
##$SF= 200.130013532006
##$SI= 16384
##$SIGF1= 3
##$SIGF2= 2
##$SINO= 400
##$SIOLD= 16384
##$SREGLST= <1H.CDCl3>
##$SSB= 0
##$STSI= 0
##$STSR= 0
##$SW_p= 3612.71676300578
##$SYMM= 0
##$S_DEV= 0
##$TDeff= 0
##$TDoff= 0
##$TI= <>
##$TILT= no
##$TM1= 0
##$TM2= 0
##$TOPLEV= 0
##$USERP1= <user>
##$USERP2= <user>
##$USERP3= <user>
##$USERP4= <user>
##$USERP5= <user>
##$WDW= 1
##$XDIM= 8192
##$YMAX_p= 0
##$YMIN_p= 0
$$ End of Bruker specific parameters
$$ ---------------------------------
##NTUPLES= NMR FID
##VAR_NAME=  TIME,          FID/REAL,        FID/IMAG
##SYMBOL=    X,             R,               I
##VAR_TYPE=  INDEPENDENT,   DEPENDENT,       DEPENDENT
##VAR_FORM=  AFFN,          ASDF,            ASDF
##VAR_DIM=   8192,          8192,            8192
##UNITS=     SECONDS,       ARBITRARY UNITS, ARBITRARY UNITS
##FACTOR=    0.0002768,     1,               1
##FIRST=     0,             0,               0
##LAST=      2.2672688,     0,               0
##MIN=       0,             -10734,          0
##MAX=       2.2672688,     15292,           0
$$ Real data points
##PAGE= N=1
##DATA TABLE= (X++(R..R)), XYDATA
0 0 0 0 0 0 0 0 0 0 0 0 0 0 0 0 0 0 0 0 0 0 0 0 0 0 0 0 0 0 0 0 0 0 0 0 0 0 0 0 0 0 0 0 0 0 0 0 1 -9 11 -14 16 -17 22 -23 27 -29
56 -29 32 -33 41 -44 48 -51 64 -76 92 -114 158 -248 474 -2275 -8021 -1303 11032 15292 5081 -5443
76 -5443 -4780 4328 8195 617 -8347 -7326 -244 4769 2717 -4955 -8840 -2442 6536 6857 -1596 -7279
92 -7279 -1896 7679 8576 27 -7271 -4380 4017 5422 -2608 -8454 -4397 3813 6613 2661 -2187 -3007
108 -3007 324 4404 3774 -2573 -6648 -1780 5796 5111 -3035 -7382 -2609 4229 4497 -1220 -5007 -1878
124 -1878 3986 4744 -404 -4608 -2976 1849 4176 1854 -2176 -3147 567 4714 3684 -1876 -4721 -1250
140 -1250 3242 2214 -2998 -5401 -1910 3421 4356 117 -3596 -1782 2706 3236 -870 -3644 -1713 1896
156 1896 3252 1515 -1442 -2716 -533 2718 2478 -1415 -3544 -571 3527 3044 -1425 -3845 -1289 2506
172 2506 2232 -1676 -3957 -1835 1530 2033 34 -1224 -367 1668 3030 2087 -889 -2599 -519 2449
188 2449 1772 -1868 -3309 -683 2140 1498 -1466 -2715 -669 2051 2033 -616 -2318 -1079 1335 1850
204 1850 326 -1105 -828 791 1966 1058 -1257 -2203 -294 1984 1525 -1014 -2058 -289 1863 1503
220 1503 -964 -2291 -698 1619 1434 -757 -1803 -510 1045 1171 142 -870 -1036 2 1276 1017
236 1017 -796 -1592 142 2192 1638 -767 -1693 -104 1465 868 -1112 -1853 -546 947 695 -683 -1285
253 -1285 -567 553 1056 568 -496 -805 325 1542 965 -785 -1328 141 1436 824 -824 -1294 -110
270 -110 1105 762 -686 -1349 -413 760 631 -456 -977 -456 399 769 318 -529 -783 139 1148 771 -542
289 -542 -954 176 1270 812 -588 -1067 -63 894 465 -754 -1093 -248 548 405 -220 -559 -346 213 669
308 669 422 -460 -759 105 1012 559 -626 -808 251 1017 585 -439 -677 31 632 323 -499 -719 -181
327 -181 352 364 -126 -600 -598 -49 466 229 -446 -508 321 992 563 -336 -497 182 751 416 -407 -609 -47 490
349 490 252 -387 -561 -130 230 230 -110 -442 -424 64 510 362 -294 -487 85 588 235 -462 -452 275 807 486
371 486 -188 -397 -26 219 -9 -395 -443 -174 160 320 147 -285 -400 35 441 147 -434 -460 109 498 227
392 227 -211 -163 281 576 281 -231 -377 -66 246 213 -49 -191 -112 53 41 -223 -591 -542 -51 374 242 -141
414 -141 -122 313 535 290 -145 -202 125 333 77 -322 -371 -62 172 162 19 -55 -65 114 193 0 -291 -315 49
437 49 320 101 -307 -303 57 250 52 -165 -130 149 298 101 -156 -159 7 205 234 99 -106 -156 6 102 -75
460 -75 -293 -237 104 223 -32 -320 -296 -20 151 86 -56 -3 221 393 263 60 -5 132 216 157 -33 -288 -352
483 -352 -218 -131 -228 -373 -234 88 258 147 5 60 265 361 183 -63 -144 -68 -21 -125 -197 -153 -23 122 155 26
507 26 -149 -146 57 152 89 -11 56 222 196 -74 -293 -323 -150 -36 -67 -88 -17 186 286 253 131 22 36 65 15
532 15 -131 -248 -179 9 95 4 -122 -121 -13 -2 -100 -166 -80 138 279 208 62 -11 -7 10 -37 -105 -102 -10 120 155 64 -22
560 -22 -18 101 109 9 -98 -82 5 17 -78 -143 -126 -38 -1 -37 -123 -58 55 175 173 158 81 44 81 38 -59 -155 -90 40 59
589 59 -19 -128 -141 -63 -61 -84 -92 -3 120 199 177 87 40 59 61 17 -62 -102 -79 18 69 7 -41 -16 21 9 -74 -119 -100 -8 44
620 44 68 23 40 65 77 -7 -99 -107 -74 -12 12 18 -5 50 86 69 27 -6 33 70 58 22 -31 -30 -7 -1 -45 -105 -96 -60 -20 0 -14
653 -14 -15 34 101 94 65 10 35 59 26 -14 -75 -48 -41 -13 -66 -102 -62 -12 28 32 -13 -13 18 14 1 -14 -20 7 60 54 40 19 23 38 42 -6
689 -6 -20 -19 3 30 -13 -46 -47 1 -10 -33 -64 -49 -17 -15 2 -10 -18 2 55 47 3 -18 6 37 26 33 3 11 9 34 1 -36 -26 -4 1 -8
725 -8 -28 -47 -23 12 4 -11 -2 20 56 50 22 26 20 14 24 -2 -13 -33 19 -10 -26 -59 -54 -31 -33 -45 -56 -53 -28 5 24 3 24 26 74 57
761 57 28 12 17 18 20 21 7 19 56 33 12 -2 -8 -10 16 8 -31 -26 -28 2 -11 -25 -21 -14 10 -3 9 1 -5 15 36 7 20 19 7 14 -13 -43
799 -43 -28 3 4 23 -22 -1 -6 -3 2 -17 0 15 57 61 57 32 41 21 9 10 21 1 3 -12 -1 -35 -21 -43 -21 -3 -42 -27 -25 -15 10 22
835 22 -2 5 24 8 -37 -15 -3 32 44 57 41 51 50 10 16 -18 -19 -3 10 11 11 1 -8 7 -13 0 -4 -9 4 -7 -2 3 24 34 19 1
871 1 -30 -33 -18 -23 -46 -19 -15 0 15 18 -36 -9 -8 7 14 -10 11 45 24 18 5 30 12 12 28 24 14 7 19 3 3 10 -2 17 -5 -3 -26 -29
909 -29 -9 -1 -1 -37 -17 -25 -30 -14 -15 -4 12 28 27 7 10 -16 -1 -13 4 8 4 24 20 6 15 4 11 12 -10 -5 7 -12 16 8 7 17 -9 26 -5
948 -5 7 -2 2 13 21 2 -8 10 3 -27 -21 -34 -19 -25 -25 28 2 0 15 -5 3 -2 15 6 -17 11 18 12 36 40 34 52 28 12 13 -4 -5 -7 -12 -19 -24 -11
990 -11 -11 -25 -3 -20 -9 -12 -9 0 0 1 19 3 -22 5 -10 0 -10 6 -11 -1 13 10 18 6 7 19 12 2 4 10 13 22 4 9 14 8 9 -5 -5 -7 14
1031 14 9 -11 -14 -11 0 -46 -23 -25 1 -8 -40 -22 -24 -25 6 -13 -26 -20 -13 -2 9 -6 10 30 9 24 19 12 23 5 13 18 20 3 4 -3 1 -1 5 -3
1071 -3 6 -8 20 9 8 12 20 15 -6 -11 -5 -1 -28 -7 -27 -10 -17 -3 -15 -27 -2 -13 -9 2 6 21 11 23 15 5 15 5 27 17 9 26 7
1108 7 21 9 -1 1 0 -6 4 -23 -6 -16 -7 0 6 -19 -13 2 6 -5 4 -12 -16 4 -14 -7 -1 -8 11 -1 8 20 -10 -1 9 0 -2 14 17 19 16 22 17 9
1150 9 -1 -1 12 1 -8 -7 6 1 -7 2 5 -1 2 -16 -8 -5 -14 -9 -10 1 -2 -4 -12 0 -1 -4 -10 9 -12 22 22 4 6 8 21 28 -1 3 23 17 22 15 -4 32 15
1195 15 26 11 15 11 3 -4 -6 -7 -6 4 -23 -4 -24 -26 8 0 -29 -28 -7 -8 -23 -16 -1 -13 -1 12 12 9 11 -18 -6 -3 32 -2 5 5 19 -2 -2 2
1235 2 4 17 22 -13 3 -2 4 5 -4 12 2 -27 -23 -16 -29 -27 -7 -17 -2 0 -11 -14 -24 -9 -2 -23 -4 5 21 35 16 5 14 15 -7 8 5 5 -1 4
1275 4 26 15 18 16 6 -19 7 14 10 -4 8 -4 3 -7 -7 -39 -22 -2 -14 -19 2 -2 -14 19 -6 -4 1 -6 6 9 8 -3 -2 23 8 7 42 28
1313 28 9 9 23 4 8 36 13 21 -5 -3 -1 -9 4 14 -25 2 -18 -47 -13 -13 -15 -3 -5 -16 -23 -24 -10 -17 1 -3 -9 -11 -16 -10 -6 11 -6 19 2
1352 2 -1 2 -11 27 12 -3 1 22 -3 2 0 16 17 16 15 18 8 2 4 -20 0 -10 -28 -20 -26 -17 -20 -13 -30 -5 -9 1 -19 0 -18 -11 -22 -20 -6 10
1392 10 -1 -9 13 -11 17 12 3 -9 18 16 30 23 14 1 14 8 -14 -10 -13 -19 -12 -5 0 18 -7 -10 -17 -8 -34 -10 -5 -10 -16 -38 -26 -18 -18 -5 -1 -11 -3 9
1434 9 11 9 1 0 7 21 -3 -4 12 9 -18 3 2 3 -5 -5 6 -5 -2 -12 9 3 -10 -9 -13 -21 -12 -29 -29 -28 -18 -25 -33 -6 -6 -9 -12 3 -4 -30 1 -3 -4 -5 -8
1479 -8 -6 0 4 -5 24 1 -3 2 17 -22 -11 -17 -14 7 15 -24 -8 14 11 -8 -14 -20 -3 -20 -48 -22 -20 -17 -27 -26 -16 -6 -14 -9 -9 -13 4 -4 6 -15 -12
1520 -12 14 -17 -5 17 1 17 7 -11 9 6 19 21 -6 -5 -4 -26 -4 1 -11 -12 -15 -2 -7 -17 -11 -13 -34 -24 -19 -20 0 -3 -21 -33 -8 8 -7
1557 -7 0 -2 -10 5 -2 -2 -3 6 23 33 -8 17 16 7 -25 26 11 12 1 2 -4 -4 -6 -3 27 7 -16 -2 -7 0 -20 -1 -4 -20 -12 -34 -30 -27 -30 8 -9 0
1599 0 -14 -14 -4 6 4 4 10 -13 15 20 25 24 21 6 13 20 1 12 12 11 -12 2 7 5 19 19 -2 1 -7 12 -14 5 -3 -6 -2 -26 -6 -23 -14 5 1 -10
1641 -10 5 -3 -28 -4 4 5 7 29 23 6 12 6 25 18 14 25 25 37 -1 7 12 13 19 11 -2 -5 -16 0 -25 9 -13 -11 -26 -10 -16 4 -27 -24 2 -6
1681 -6 -5 -11 0 -3 9 5 0 -1 2 6 -10 6 12 19 -4 -6 14 40 12 17 4 12 16 -13 9 -6 -10 0 -1 -4 0 1 -8 -8 2 -21 -15 6 -28 -17 -19 -26 5
1724 5 -24 -4 6 -12 12 2 -5 11 -6 16 24 17 9 25 10 8 19 8 1 9 10 -22 -20 16 20 -21 -11 -10 3 -4 4 -14 -3 -20 -14 -16 -29 -10
1762 -10 -18 -46 -7 -14 -4 -10 -12 -1 1 -5 6 13 -7 0 21 27 22 -6 11 11 15 -9 13 13 8 22 5 14 2 12 -3 -7 6 -16 -3 -27 -5 -11 -12
1801 -12 7 -15 -21 -1 -20 -1 -7 -1 10 -8 -14 -8 2 18 7 19 16 17 5 13 -5 5 2 14 17 3 20 26 25 -1 8 -4 20 -14 -5 -20 -16 -5
1839 -5 -1 -3 -38 -26 -31 -18 -15 -4 -11 -15 -26 -6 -18 -4 -34 4 -9 -3 2 10 -4 2 11 3 6 26 28 9 14 8 8 -12 3 6 -8 -21 4 5 -12 -5 -10
1880 -10 3 7 -16 -24 -20 -3 -21 -10 -30 -15 23 -2 15 16 10 8 11 -9 9 14 6 19 27 10 25 30 -14 21 24 21 20 13 -7 21 6 17 14 31
1918 31 8 -8 6 -23 -4 9 -6 -23 -7 -22 -12 -15 -13 -27 -19 -21 -29 -12 -13 3 -13 -11 -4 -1 16 -12 6 9 14 16 19 18 15 27 -5 14 -2 23
1956 23 17 25 3 17 25 -20 10 10 -23 -23 -7 -26 -9 7 -8 -5 -17 -11 -21 -3 -2 2 -6 -12 -3 9 -3 -5 1 20 14 13 31 22 28 44 31 31 8 19
1996 19 15 32 8 28 14 -2 22 1 1 -11 -28 -13 -5 -9 -3 -20 -26 -14 -13 -1 -1 -12 3 3 1 -17 9 -2 -6 1 8 2 24 22 4 31 29 14
2034 14 32 11 35 30 25 31 44 16 13 6 19 25 -10 4 -15 -10 -9 -11 -19 1 -11 -6 14 10 11 17 19 -11 -17 -1 2 11 5 22 3 11 17 26 36 7 3 -2
2076 -2 17 6 17 28 35 20 11 -2 9 18 18 -12 -7 -6 15 0 -10 10 18 -7 -8 3 -11 8 -8 -3 3 -7 -1 -4 10 -27 -12 2 -8 9 -2
2113 -2 12 10 22 9 16 10 19 32 10 13 13 -6 18 12 1 1 22 -10 -1 14 -9 -13 -29 -15 11 -22 -2 -7 -14 0 -14 -9 -2 11 -2 -3 9 2 6
2152 6 -3 13 13 12 12 16 7 19 10 42 21 16 15 1 32 24 24 21 -3 -1 -8 -5 -2 9 -22 -7 -17 -22 -18 -32 2 -2 -23 -22 0 5 5 15 -4 10 20 6
2194 6 -10 -3 -6 3 15 36 23 35 12 18 20 10 8 14 -3 18 17 5 19 2 2 19 -8 -9 -5 8 -16 -2 -22 -17 -16 -7 6 -26 -9 9 -2 -26
2232 -26 -6 -1 -15 3 2 6 -8 11 10 11 -8 13 7 7 26 18 33 11 22 6 15 19 12 12 7 -7 -3 9 -7 -2 -3 6 -1 -7 -2 -8 -13 -9 -38 -4 1 -9
2274 -9 -5 -7 -7 10 11 12 9 12 20 12 -3 9 23 7 16 14 10 -4 17 16 -4 21 -10 -9 -4 -6 -6 -6 1 -7 -21 -22 -7 -20 3 -23 -28 -14 -24 -13 -11 -11 -14
2317 -14 -14 2 -13 6 2 -6 14 22 30 32 8 13 45 25 14 27 54 17 17 29 11 11 4 11 11 12 -9 -11 11 -4 -8 3 -14 -15 5 -8 7 -14
2355 -14 -1 5 4 -2 7 13 14 12 7 30 20 20 31 11 30 8 29 39 8 20 20 19 4 -3 14 32 5 12 14 2 -12 10 -12 -20 7 -21 -12 -12 -11
2394 -11 -25 -7 -4 -6 -7 5 -4 -29 6 4 4 13 11 11 -7 19 20 35 2 39 -5 11 25 11 9 -5 11 26 4 17 -8 1 17 17 -9 -4 26
2431 26 -23 -9 -17 -16 6 17 -5 -17 1 -7 -8 -7 4 13 14 -12 5 6 33 -2 21 6 18 17 21 29 41 0 8 24 -12 -1 18 20 38 13 -15
2468 -15 -8 7 -9 12 2 -8 -2 -5 -14 -22 -11 -10 -10 -2 -7 -11 -4 -24 -20 -17 7 -8 -7 -6 2 23 5 32 10 10 1 9 30 19 -3 14 1 1 23 17 5
2509 5 5 3 -4 -2 -23 -24 -17 -4 -17 -23 -12 -34 -31 -17 -27 -6 -6 -9 -21 -18 -2 6 -6 -13 -10 -4 -1 5 21 30 31 4 10 13 12 16 3 7 14 6 -6 11 25 16
2553 16 -20 -7 6 6 -2 -2 -25 -16 -23 -22 -7 -20 -13 -30 2 -15 -10 -2 20 -4 0 -11 6 7 4 -3 10 29 0 21 4 29 6 18 2 1 2 15
2591 15 7 14 6 -4 6 8 24 -1 -12 -4 -21 -14 -4 -25 0 -14 -11 -28 3 -8 -2 -3 -8 0 -10 8 20 -6 6 4 2 3 11 26 2 7 1 21 22
2630 22 21 6 8 10 6 -3 4 5 8 4 22 4 2 11 -3 -2 -2 -2 -4 11 6 -21 -5 3 1 -13 3 -1 17 16 6 1 16 29 1 -1 17 15 10 9 27 22 22 21
2674 21 11 21 21 21 13 13 16 -10 1 -14 -21 7 -28 1 -21 -15 -10 -9 2 -7 -6 -25 18 4 19 3 -4 -2 -9 10 -1 21 17 15 23 21 1 29 23 40
2714 40 14 22 38 17 10 7 10 18 13 3 19 8 -5 -7 1 4 -11 -5 -17 -11 -8 -33 -22 10 -8 6 -4 -2 -13 6 -2 -20 1 -4 5 4 8 7 38 24
2754 24 26 38 9 7 23 20 32 19 2 3 14 7 3 11 11 23 7 -3 -5 -20 -5 -14 -12 -11 -8 -5 6 4 -9 1 -17 -3 23 -2 -6 42 1 2 16
2793 16 6 12 6 5 19 24 17 -3 15 11 -12 6 14 14 13 11 7 22 21 -3 -3 -25 -6 -14 -7 -16 -8 -16 -7 -21 -15 -9 -17 2 -5 3 2 -19 8 15 4 20 1
2836 1 21 9 3 28 24 26 10 22 12 28 -4 -6 10 8 2 -20 -18 -14 1 2 3 -5 -14 -21 -3 -32 -18 -17 6 -6 1 23 11 17 -2 -6 20 11 17 13 16
2877 16 3 -10 20 4 -2 8 24 15 18 8 4 6 10 13 -7 -4 2 3 11 -16 -4 -6 -21 2 -18 -10 -8 -20 -23 -16 -17 9 -24 10 -25 -10 12 -2 7
2916 7 22 21 7 10 29 16 34 21 18 18 2 18 31 -6 3 13 4 -1 -1 -2 -17 15 -4 -6 9 12 -6 -11 3 -14 -28 -19 5 13 10 -6 -2 6 30
2955 30 11 8 26 13 13 -1 27 28 11 14 27 30 7 31 18 31 26 4 33 38 25 17 14 2 7 15 -18 -12 -13 -8 2 -3 14 -12 0 -4 0 -19 -22
2994 -22 -12 11 11 1 -1 10 21 8 18 8 22 12 11 29 17 20 14 23 5 15 30 2 19 25 27 4 10 -11 -27 2 18 -1 0 -7 -18 11
3030 11 -16 -3 -6 -6 -5 8 1 5 7 -14 -7 34 19 10 15 20 7 22 17 35 8 8 10 13 4 -5 3 33 36 27 33 17 -4 -14 2 -14 -7 -1 -4 -15 -11 3
3072 3 5 0 -15 -20 -1 -14 6 -14 22 2 2 -23 18 1 10 14 6 28 8 33 25 14 18 10 34 17 5 5 9 -2 10 8 14 0 3 -11 0 -7 -24
3111 -24 -2 -4 -33 -8 -6 -32 -18 -20 2 -3 -22 1 1 -15 -7 4 -4 38 3 26 22 28 16 12 13 9 12 22 11 19 -2 7 8 26 7 5 5 -8 -4 7
3151 7 -22 2 -9 -13 -5 -18 -25 -31 -2 -20 -24 -26 -13 -1 -14 -1 0 -10 -3 16 6 14 18 -3 17 16 11 24 25 20 28 24 10 0 21 20 6 3 6 -3 0
3192 0 12 -27 -12 -25 -14 -24 -34 -19 -3 -8 11 -6 -25 -10 -5 -14 3 -21 -6 6 9 17 30 24 23 16 27 20 26 15 15 5 23 17 15 26 21 14
3230 14 20 6 -9 0 -17 -9 -2 -13 -19 -37 -19 -18 -28 -30 -45 -10 -33 -10 -8 -24 0 -14 -9 -15 -1 7 0 8 30 -3 12 12 9 18 -3 14 19 -6 9
3269 9 -3 1 -3 8 -1 -7 -6 8 -9 -14 7 -22 -15 -23 -1 -15 -4 5 -5 -15 -23 -2 -14 -18 9 3 4 4 10 12 11 23 18 43 29 13 23 16 24 6 19
3310 19 25 10 -4 13 7 3 -15 0 -2 -14 6 -5 0 -6 13 -7 -17 -27 -23 -21 -9 -6 -13 -5 -2 -6 5 14 18 2 16 15 14 19 20 12 17 23 19 18 32 8
3352 8 8 9 36 15 24 41 8 -1 12 -9 -21 -30 -5 12 -21 -15 -34 -17 5 -12 4 -21 -1 -17 4 10 -25 -4 7 14 -3 1 9 -8 15 15
3388 15 18 18 32 1 15 12 18 6 -1 -9 4 2 -2 -3 -7 -4 -13 -17 -23 7 -11 -1 -2 -2 -13 -9 -4 8 -17 9 4 -1 2 -2 7 -3 -8 11 3 3 -4 -1 25 10
3432 10 21 20 22 19 27 5 10 23 -8 11 1 -18 5 8 -11 -3 -10 -20 -4 -10 -9 -6 -11 -22 4 -20 -4 -3 1 6 -4 5 -12 17 23 6 7 23 13
3471 13 20 4 20 5 16 22 30 2 32 14 16 29 4 1 -7 9 0 2 11 -5 -6 -35 -8 -17 -14 -15 -24 -32 -21 -39 -21 -11 7 5 1 -2 12 6 14 22 24
3512 24 41 25 -2 37 20 20 8 36 23 29 31 19 11 14 18 1 -1 4 5 21 -14 0 2 -5 -7 -7 -23 3 -5 -4 7 3 1 8 9 -5 9 13 23 -5
3552 -5 15 22 14 17 18 26 29 15 27 21 5 17 37 27 -2 -1 24 3 -12 4 10 -5 1 -1 -1 -5 -20 12 11 14 9 -7 -2 -21 -8 -5 -3 6 -14 36 -6
3593 -6 24 32 8 17 10 15 39 9 9 24 44 7 26 34 27 18 32 16 18 7 14 6 12 -18 23 -24 3 4 -11 3 -20 11 -5 -28 -30 29 25 -5
3631 -5 19 10 21 -3 30 6 23 17 1 18 9 16 7 42 22 1 9 31 10 -6 33 7 28 14 12 20 -2 1 -6 -3 -9 -21 -6 -3 -11 -20 1 1 16
3670 16 1 -16 0 3 10 8 -7 10 14 34 14 13 8 14 29 23 16 29 21 30 16 16 7 39 28 9 35 15 14 -7 1 15 -18 -14 -11 -10 15 -17 -7
3709 -7 -12 -5 -21 -7 3 -20 -17 11 6 13 2 -1 13 13 28 42 8 16 13 30 25 26 25 8 4 8 10 19 -6 -3 4 10 13 -15 -5 -22 -18 -17 12 5 -8 20
3751 20 1 -9 -29 3 -7 15 -5 -12 11 4 -1 -13 9 14 10 28 16 27 19 12 0 41 32 15 17 6 31 10 17 19 7 4 -20 -3 -12 -15 0
3788 0 -5 -27 -20 -22 -8 -21 -18 -21 -18 -10 -1 0 7 1 -13 -11 10 6 11 10 -2 2 3 16 12 8 29 20 23 9 8 7 13 2 24 -4 -4 -6 3 1 -14 1 -11 -7 -4 -21
3834 -21 -24 5 -34 -7 -18 10 8 -3 -26 13 8 -19 0 1 5 10 22 23 8 31 25 18 27 15 16 2 18 28 -6 15 7 -13 12 17 15 -4 5 -21
3872 -21 -26 -26 5 -20 -1 4 -26 3 -10 -13 -12 3 6 2 -24 20 9 -2 6 14 8 17 22 9 1 38 26 21 17 20 22 -6 4 5 24 14 -2 -13 10
3911 10 -19 15 0 -2 -3 -24 -6 -12 -23 -9 -26 -12 -4 -27 -2 0 10 0 21 -18 -19 15 7 22 33 16 57 41 35 27 26 24 25 10 18 -1 7
3948 7 5 4 3 -4 12 -2 -10 -5 -18 -13 -15 -4 0 -8 -9 -21 -22 -14 -11 1 -1 -13 -1 24 12 13 11 9 8 -9 12 12 6 36 14 0 22 31 21 5 6 29
3990 29 0 -9 7 -19 12 -12 1 -14 0 -14 -12 -10 -5 -11 -24 -6 4 -23 -16 -15 -19 -7 10 23 8 12 11 13 5 16 10 4 5 21 35 17 13 25
4028 25 31 39 19 -16 4 2 -4 -16 0 -13 -10 -4 -34 -12 -26 -23 -1 -16 -11 -9 -26 10 -8 -16 -14 1 -5 5 -17 0 1 29 17 7 2 29 14
4065 14 21 43 32 2 23 22 28 33 19 22 -3 12 14 8 -10 -23 -18 -11 -4 -5 -6 1 -18 -26 -6 -6 -2 -30 10 7 -11 21 2 3 -1 -11 17 13 -2 18
4105 18 12 4 18 34 30 27 24 29 32 7 9 17 13 5 2 6 -19 -21 -34 -17 1 -27 6 -16 -23 -16 -13 -23 -9 0 -2 -12 1 -6 -13 -25 -1 -2 -3 4 10 2 -1 -3
4149 -3 17 12 11 -2 17 26 19 22 6 -5 4 -3 -5 8 -2 -11 -9 -2 -21 -4 -18 -11 6 7 12 5 -19 -1 -3 5 -13 -32 20 2 4 17 10 -9 12 30
4189 30 11 11 -1 7 14 31 8 19 10 19 12 1 12 14 44 -7 2 -17 6 0 6 9 16 -22 -2 -31 -6 -11 -7 -21 -19 -6 -16 -10 1 -10 0 1 10
4228 10 2 20 13 20 18 36 30 7 19 9 38 19 21 21 25 10 20 12 9 2 -10 -2 -5 0 -22 -12 -1 -9 -4 -1 -5 10 -6 -10 8 8 1 -3 6 -7 6 19
4270 19 11 14 13 4 14 5 8 -8 11 -5 -7 19 23 24 13 21 -10 1 7 1 -16 -5 -19 -12 -10 4 0 -13 -10 -21 -3 -23 -38 -7 11 9 17 15 -8 7
4310 7 -5 34 3 23 32 12 13 6 27 -5 22 5 10 18 0 30 20 36 7 12 16 11 15 20 -1 -16 0 -26 -15 -15 -16 -12 -21 -4 -15 -5 -16 -4
4348 -4 3 -25 -20 -20 0 6 -3 8 16 26 19 22 6 16 1 20 9 6 10 13 6 -6 15 23 11 13 17 14 11 -28 0 1 -12 -12 -12 -4 -1 -9 -15 -26 -17 -2 -10 -13
4392 -13 14 9 13 3 10 11 8 15 18 27 26 21 28 17 19 6 15 35 11 11 15 7 -2 19 6 -1 -8 9 1 -14 -6 -11 3 -6 -19 -3 10 25 -12 12 -19 -5
4434 -5 -10 -6 3 -2 8 1 -6 13 6 7 14 28 15 23 26 9 24 17 14 1 -5 17 1 7 19 7 2 -10 6 6 0 -23 -11 -19 -24 -6 -11 -40 -7 1 -17 -16
4476 -16 -16 -18 9 6 16 3 10 13 12 4 4 30 29 28 32 26 11 35 21 5 18 0 6 15 3 6 -9 4 -9 8 -6 -3 -31 -17 -24 -13 -18 -13 2 5
4516 5 -6 5 -11 -4 -12 3 5 -7 -4 4 26 20 20 3 12 -2 13 16 9 21 25 -8 3 -3 11 -18 -10 -18 16 -16 -1 -14 -5 -12 -15 -24 -47 -16 -20 -24 -45
4557 -45 -30 -1 -15 -25 15 -8 2 1 12 10 3 8 7 27 37 24 25 30 19 18 19 3 18 -12 -5 5 0 -2 0 6 -14 -15 -23 -20 20 -19 -18 12 6 -12
4597 -12 -13 -15 -12 -11 6 12 -4 -11 5 4 -7 24 24 6 32 -1 26 30 20 31 9 26 33 30 4 15 25 18 -7 -7 -6 5 -14 8 -14 -17 -9 -16 -2
4636 -2 -25 2 -17 -7 -14 -1 -15 4 11 3 -1 7 5 -11 19 -12 25 7 19 12 20 20 28 37 22 20 19 15 28 27 8 6 12 -10 -7 -10 -5 -8 7 -1 8 -25
4678 -25 -10 5 -20 -20 -4 -9 6 2 -1 -19 7 16 1 -2 4 18 15 20 -1 21 13 35 26 15 21 22 33 12 24 12 -3 18 22 -1 7 9 9 6 0 -11
4718 -11 8 5 -4 -15 -12 15 -8 -25 -14 1 2 16 0 17 20 13 14 18 32 21 8 0 -7 22 20 22 20 35 13 31 9 -7 16 18 5 11 -18 -11
4756 -11 -5 -18 11 1 -10 -7 4 -23 -7 -22 -5 -15 -23 -19 -16 16 3 -36 -4 -3 3 23 8 25 21 11 37 33 25 22 25 6 42 11 22 34
4792 34 34 34 9 14 3 34 -5 21 12 -17 -28 -17 6 7 -25 -11 3 7 -11 -10 -11 -9 -4 10 -4 11 6 15 7 8 23 11 15 17 28 10 13 20 10
4831 10 17 6 7 30 20 15 -6 -2 11 16 -4 -3 -24 -13 -7 -8 -11 -26 -11 -4 -13 -26 -10 0 -7 -4 -7 -17 -8 -6 -7 9 19 14 16 6 28 27 21 14 5 14
4873 14 37 18 16 12 10 23 8 12 8 14 -6 4 -14 -18 -7 -22 -5 -20 -28 -22 15 -14 -40 -10 -6 2 11 -3 -8 4 6 0 23 -6 -3 13 1 14
4911 14 20 -3 10 18 20 18 0 20 14 23 8 16 3 2 15 -10 -12 -16 -24 -6 -9 -14 8 -5 -12 -22 17 -15 -5 -7 -9 8 13 12 -13 -8 -8 0 23 -12 12
4952 12 17 16 22 27 11 14 22 4 14 15 -9 -10 13 15 6 9 5 -4 -21 -11 -17 0 0 -12 -13 -5 -30 -28 -8 -12 -6 -2 13 -8 -18 2 -1 10 17 18 -7 19
4994 19 32 8 14 25 18 16 16 -4 24 4 15 14 11 2 26 -7 9 0 -25 -5 -4 3 -13 -3 -2 -10 -24 -16 -14 -14 -35 -13 -19 -2 0 -23 5 -1 20
5033 20 13 5 16 12 21 3 1 14 14 7 16 -2 19 5 3 24 15 -4 8 -12 -28 -9 -19 1 -8 -32 -16 -10 -19 -18 -16 -19 3 -15 -14 2 2 6 5 -4 0
5074 0 16 1 2 19 8 -3 20 31 10 3 14 3 13 -13 3 11 4 -22 4 4 -5 -2 7 -14 0 -17 -6 -33 -26 -16 -26 -23 -23 -19 -2 -12 -20
5111 -20 9 -8 5 -5 -3 6 -1 13 24 38 2 17 7 7 30 28 16 16 25 16 4 18 23 17 0 12 3 -15 -19 -15 -27 4 -10 -18 -26 -20 6 6 -3
5150 -3 2 -8 -25 3 5 8 3 2 0 3 11 3 15 10 6 29 16 -11 9 3 29 23 1 6 2 -5 8 3 -5 16 -26 -6 -17 -32 -8 -17 -24 -9 -25 -25 -12
5191 -12 -21 -24 -9 -21 -7 -16 5 19 3 12 20 -3 6 -16 -6 5 -1 15 9 5 18 12 27 12 -21 7 -3 -7 -11 6 -9 -16 -13 -6 -26 6 -27 -15
5229 -15 -15 -21 -16 9 -10 -28 -19 -20 -8 0 -21 -12 13 1 4 34 10 7 3 26 16 13 10 0 13 3 13 17 4 8 -1 -2 -24 -1 -18 -10 -21 -21 14
5268 14 -24 -14 -25 -25 -32 -12 4 -1 -1 -19 -23 -14 -18 -23 4 5 8 7 -6 8 10 9 21 1 17 17 8 23 1 -3 -8 26 7 0 15 -15 -10 -10 4 -18
5308 -18 -12 -1 -4 -10 -13 -15 -4 -20 -15 -10 -6 -26 -11 -1 -19 -4 -10 12 11 7 -24 5 1 16 4 3 -2 10 12 29 26 -3 26 16 14 1 0 3 -19 -4
5348 -4 -18 -13 -6 -8 -26 -2 3 -19 -18 -19 5 -14 -12 -11 -7 -11 -7 -22 -1 0 -2 32 -1 2 11 17 13 9 1 21 23 16 12 -5 16 9 14 7 10 -4 2 9 -18 -1 -11
5393 -11 -22 -11 -10 -11 -12 -2 -17 -6 -9 -16 -6 -7 0 -21 -9 -23 -6 0 13 7 21 2 5 -2 3 7 13 10 29 11 12 -20 -6 9 -5 0 13 1 17
5432 17 14 -4 -19 2 -16 -27 -12 -20 -6 11 -1 -29 -31 -1 -19 -23 -15 -21 23 -17 -16 -13 6 6 23 -1 5 40 26 11 7 2 13 -11 7 30
5468 30 0 0 -5 15 1 6 7 11 -9 12 -15 -3 -19 -22 -1 -3 -19 -22 -26 -24 4 -6 -13 -4 -15 3 -3 -2 6 12 3 7 21 16 13 -6 19 15 29 36 7
5509 7 40 18 6 5 -3 7 -2 -3 5 -6 0 -5 -1 -4 -21 -5 -7 -14 11 -13 -4 -2 -1 -1 -11 0 -3 10 -15 2 12 10 3 7 19 14 7 -8 16 10 19 4
5551 4 20 7 -4 20 10 14 12 1 -2 -16 -17 -6 -19 -21 -1 -19 -38 -15 -8 -31 -26 -6 -11 8 -20 -5 0 -18 10 1 8 -16 6 9 14 21 -1 3
5589 3 14 10 24 19 31 2 8 23 5 2 -1 25 11 20 -21 -15 8 -1 2 -24 -13 2 8 -7 -7 -24 -16 -1 -15 2 0 3 15 14 -2 19 17 3 8
5628 8 42 28 35 26 24 23 28 6 22 11 15 7 6 16 18 -5 4 19 13 24 -1 7 -3 -6 -14 -17 -4 -17 1 -9 0 -2 -2 9 0 -4 14 8 13 13 7 23 8
5671 8 10 19 24 26 30 23 17 15 19 29 4 22 28 17 -7 11 11 -10 -8 -6 -20 2 -26 -17 -14 -6 -20 -9 -2 0 -14 4 8 -3 -11 5 18 13 22 -3 15 6
5713 6 6 -4 12 6 18 31 15 15 1 6 14 14 9 19 -3 -29 15 -16 21 -19 -10 -10 -21 -8 -8 -15 -40 -6 -2 -12 -4 -20 13 5 -18 26 16 38
5751 38 17 3 -4 6 15 9 34 27 24 -2 13 17 7 9 15 -2 6 -4 -4 -3 6 -12 7 6 7 6 -30 -17 -26 -20 0 -20 -7 -3 -10 10 8 0 14 -1 27
5792 27 15 4 21 -4 3 20 13 21 28 17 24 35 14 13 30 5 24 10 -9 1 16 1 -6 -12 1 0 -10 -22 -9 -21 9 -10 -12 -2 -15
5827 -15 -6 -5 -6 -32 1 0 5 -18 6 1 16 1 27 8 10 33 17 20 33 6 12 25 23 12 2 8 -32 -17 -5 13 12 9 18 -11 -9 10 -23 7
5865 7 -18 -21 8 -1 -8 22 6 -7 -18 -4 -9 13 13 4 17 27 9 14 18 20 12 10 24 16 28 7 10 25 16 17 8 5 2 -20 8 -5 26 14 -16 -5
5905 -5 11 -9 3 -5 -23 7 -4 -16 -11 -15 0 -2 7 -3 9 4 1 7 14 15 5 22 15 0 14 -1 12 25 1 14 23 13 13 6 7 -2 0 -7 -19 -11
5945 -11 -22 -22 1 -3 1 -6 -1 -19 -35 -15 1 8 -9 -9 -12 8 29 5 17 -6 23 24 2 17 7 12 5 17 32 34 19 19 25 -9 14 4 -16
5982 -16 2 -14 -11 -18 8 -7 10 -3 -18 2 -19 -19 9 -8 -2 -29 1 4 -11 1 5 3 14 8 10 27 27 24 26 20 15 2 4 11 28 9 22 -6
6020 -6 7 8 -2 -19 -6 -24 -24 -24 -14 -10 4 -11 -19 -9 -50 -17 -24 -22 -19 -1 -4 -19 -24 -13 -1 -15 16 -10 13 7 18 -2 -5 5 4 -3 -7 26
6058 26 24 1 -4 11 16 8 8 6 -7 -10 -29 -44 -24 -33 -8 -15 -31 -16 4 -3 -23 -18 -12 -21 -15 -26 -13 -20 -13 5 -2 16 0 -4 1 -4 8 7 -8 -2 20
6099 20 -4 10 -3 11 4 6 -1 -19 -16 -1 -20 -25 -15 -2 -36 -28 -20 -4 -16 -29 -24 -45 -19 -23 -17 -20 -14 -12 -17 9 7 -2 11 -10 20 12 17 6 7 24
6139 24 11 21 17 25 8 4 8 -4 -2 -2 -6 -11 -4 -1 2 -1 0 12 1 -6 5 -9 -11 -8 0 0 1 8 -18 -20 6 -8 -8 3 13 -3 3 5 -6 19 8 8 19
6182 19 25 21 16 17 13 13 23 8 -1 16 -7 4 -4 -25 -29 6 -10 -22 -17 -14 -15 -38 -17 -36 2 -14 -13 1 -14 5 13 3 8 5 -4 11 4 -3 23 25
6222 25 5 13 12 17 18 18 2 18 -3 -1 4 9 5 -14 5 -17 0 -16 -29 -7 -9 -19 -29 -13 -8 -9 -14 -36 -12 -18 8 1 19 9 20 18 9 6 27
6261 27 10 6 4 5 27 17 6 15 15 11 10 12 15 21 8 8 19 -7 -13 11 -11 -9 -9 -14 -34 -17 -20 -22 -29 -17 -6 13 -9 -16 -13 -5 2 -2 -23 -20 16 0
6303 0 11 4 38 8 1 0 0 22 14 1 12 0 -4 -4 -2 -8 -5 -11 -22 -17 -14 -6 -6 0 -17 -13 -37 -37 -44 -27 -25 -15 -9 2 -7 -9 0 -14 -3 19 -4 9 -19
6346 -19 -6 9 -12 4 19 -5 25 10 -5 -7 -6 7 0 -15 -5 0 -16 -8 -11 -9 -20 -6 -18 -9 8 -28 -9 -26 -26 -9 -27 -8 12 -9 4
6381 4 -4 10 18 7 2 2 12 3 6 22 30 32 30 -2 14 34 32 43 15 8 1 2 17 4 -3 9 -5 -1 2 -24 -14 -25 -23 3 2 -21 -28 -20 -6 -12 -20 -1
6423 -1 -6 -13 1 13 13 0 40 35 3 11 18 32 15 18 6 18 6 27 19 22 6 11 18 12 25 5 3 -12 -27 -14 -16 -31 -14 -9 -1 -2 -16 -10 1 -13
6463 -13 4 10 10 -13 4 7 -13 3 17 3 26 18 46 11 15 31 14 40 -2 31 35 20 20 10 13 -4 13 7 0 -4 5 -6 -9 -7 -13 -3 -5 -18
6501 -18 -8 4 -30 -15 3 -4 -15 -13 -21 -4 18 1 6 9 29 10 8 21 7 5 12 21 7 8 7 31 38 -7 -4 21 -7 22 -7 -49 -5 -19 -25
6538 -25 -23 11 -24 -19 1 -6 2 1 -36 1 -2 -16 -7 -4 4 -12 -13 9 10 21 20 23 15 6 18 16 30 41 13 4 16 -1 6 11 -7 3 1 -5 -14 2 -18
6579 -18 1 -22 -23 -19 -10 -16 -12 2 -6 -27 -16 -18 -8 0 5 4 21 1 -2 6 43 13 11 14 9 24 -5 8 -3 22 10 2 5 13 4 -13 13 -11 7 6
6619 6 6 -15 4 -7 -5 -24 -23 -21 -7 -1 -16 -7 -13 -4 -21 -10 -9 30 -8 4 -7 6 34 17 23 -1 5 -15 17 11 19 4 -1 -17 -1 4 -8 19
6657 19 -10 -1 -9 -8 11 -13 -5 -21 -3 -23 -3 -37 -6 -1 -10 -5 -9 -7 -24 -8 -17 -37 -29 -18 -7 -2 12 11 0 -3 9 -6 13 25 1 9 -4 14
6695 14 2 -6 15 14 19 -2 2 -7 -2 -5 -33 -26 -28 -8 -31 -27 -14 -33 -12 -5 -13 -4 -8 -16 -7 -15 -12 9 6 -1 14 -25 13 12 33 29 8 5 4 13 9 9 -1 14
6739 14 23 8 -16 15 -2 11 -7 16 -7 -28 -24 -25 -4 -2 -12 -32 -18 -28 -9 -23 -13 -24 -4 9 9 -19 0 -10 -3 -6 16 12 12 25 10
6774 10 5 4 -8 8 24 11 21 -1 0 7 -15 12 16 -1 -15 3 17 -9 -11 13 -12 10 -5 -2 -16 -14 -17 -4 12 1 -15 -24 -19 -25 -11 6
6810 6 3 24 -14 8 18 16 3 22 1 -3 10 -5 7 17 7 -12 4 15 10 3 -11 1 10 2 -3 -10 -13 -14 -13 -36 1 -3 -10 21 -2 4 10 -10 21
6849 21 5 1 18 -5 11 7 13 4 -4 12 8 6 18 7 9 22 22 15 0 0 -21 5 4 5 8 -2 -19 -7 7 -18 -3 -8 -24 -14 8 -2 2 -10
6887 -10 -5 0 20 -7 7 -13 -6 -9 25 -5 28 -4 28 17 18 6 11 13 21 22 14 17 2 8 13 26 8 9 -1 10 -11 2 -8 -1 14 1 -34 -11
6925 -11 -7 26 8 -8 0 13 19 2 -2 -1 -11 -10 2 -4 -6 6 6 -3 33 8 17 1 22 19 18 20 -1 20 -2 5 6 2 4 4 -3 -5 -23 -23 -3 -22 -10
6966 -10 -18 -8 -14 -7 -25 -18 17 12 -12 4 7 24 24 -13 8 13 27 2 14 28 15 21 22 9 0 6 20 10 7 0 6 -10 -20 -4 -5 5 -4 9 5
7005 5 -6 -25 -19 -5 7 2 -14 -13 -2 -10 1 -5 -9 -10 6 -1 6 21 3 15 4 4 1 3 0 14 -3 6 -4 -6 15 -7 21 -12 20 11 7 -25 -18 10
7045 10 -17 -8 0 -5 3 -10 -10 -20 -2 -14 -26 9 3 -9 -3 -14 4 11 13 -2 3 17 22 -6 -3 11 -9 16 3 28 5 6 -6 6 11 30 0
7082 0 -9 -11 3 -5 -10 17 -6 -3 -9 -9 -17 -20 -20 -3 -10 -14 -11 -12 0 -17 5 -8 11 22 -5 14 13 1 -7 18 3 32 40 12 16 3 19 16 -8 29
7122 29 -10 6 -21 -2 8 -12 -39 -21 14 -22 -16 -20 -27 -28 -12 -17 -9 -24 -27 -23 -33 -14 -7 4 12 9 -3 5 -3 19 12 8 19 0 16 13 14 2 19
7161 19 -11 -2 9 0 6 20 9 -17 -18 -15 -10 -10 -26 -15 -7 -6 -28 -25 -18 -34 -30 -11 -6 -6 18 16 -19 5 -9 12 11 5 5 17 17 15 -3 10 -1 20
7201 20 36 -1 -6 -1 11 3 20 -7 -1 -14 -2 -5 1 -16 -19 -27 -8 -4 -8 -11 -23 -11 3 -19 -18 -20 1 2 -4 2 -8 1 0 32 16 18 -8 12 -3 11
7241 11 8 6 15 17 20 -2 6 19 10 -13 3 2 13 -4 1 -14 5 -9 -37 -10 -28 0 1 -8 -11 12 2 7 -13 -13 -2 5 23 7 16 6 22 22 25
7280 25 -3 -4 21 25 1 20 4 7 14 31 24 4 -10 15 -19 -3 21 -4 -20 -20 -6 -27 -11 -27 -12 -11 -23 -27 -5 -1 -11 0 2 12 -2
7315 -2 10 17 10 12 2 0 13 -4 26 5 -1 8 18 -11 5 4 22 1 28 19 17 6 -15 -12 1 -18 -13 -5 -18 -19 -19 -30 -28 -14 -12 -5 -15 6 11 1
7355 1 -4 -3 -1 -3 4 10 12 7 12 10 27 -15 8 24 -5 10 4 0 14 -4 -5 4 13 12 6 29 -2 -21 -6 -16 -25 -11 -13 -20 -2 -6 -11 -12 -1 -6 -6 23 -13
7398 -13 -4 10 -10 1 5 10 8 -1 19 -3 -4 2 -7 10 20 -6 17 -8 7 1 -9 1 -13 -21 6 -16 -10 -7 -1 -17 -19 -11 -19 -31 -3 -20 -17 -4 13
7437 13 -9 -11 5 11 26 8 10 10 15 -2 17 5 6 9 -7 31 23 20 29 21 10 6 13 12 -2 21 -5 -8 0 -5 -17 -15 -13 -5 12 -29 14 -16 -7 -4 -9 -31
7479 -31 9 -4 14 -5 6 -13 -3 20 21 14 4 13 5 3 12 18 -9 6 20 7 6 14 0 6 21 -7 -17 -21 11 6 16 7 11 -12 -16 -25 -2 -17
7517 -17 -26 -26 -11 -10 -13 7 8 7 -4 -12 8 10 16 -2 0 -3 1 21 7 10 10 15 13 11 7 18 -12 -11 1 2 1 0 7 -5 2 8 -5 -14 1 -9 -34 -19 -4
7560 -4 -6 -20 -9 -26 -2 -7 -23 -22 -1 -6 19 -8 4 2 -4 -5 18 -4 1 -5 14 44 0 9 19 -2 14 -10 -18 -3 -8 -2 -16 -13 -21 0 -1 -3 -12 -8
7600 -8 -11 -3 -22 0 -14 -10 -9 -7 -14 -9 5 6 18 -1 -5 -10 7 -6 7 0 7 9 17 18 0 8 8 -3 -14 1 8 -10 -6 -32 -25 1 -25 -3 -12 -16 -30 -19
7642 -19 -12 -24 -9 -11 -17 -5 -12 -17 -13 -16 -2 -16 11 6 6 11 -4 5 11 21 0 13 28 -9 -6 -5 -4 -3 2 19 -1 -5 -30 -19 -14 -5 5 -13 -19 -13 -12 14
7684 14 -14 -7 -15 -3 -6 -17 -21 -6 -16 -9 -2 21 4 7 5 0 8 17 1 1 6 14 4 -5 16 2 10 4 -5 4 4 -12 0 -8 0 13 -6 -26 -36 9 -11
7725 -11 -7 -8 -24 8 -8 -7 1 -16 -3 -21 5 -14 1 -7 -3 21 18 -17 10 -1 22 3 7 13 26 12 -1 5 -3 21 3 5 8 2 3 -10 -5 -10 -6
7764 -6 -14 -15 -3 -23 -30 -26 -8 3 7 -5 -9 -8 -16 4 -2 10 -3 -8 3 1 -18 4 9 7 11 9 -6 4 6 -13 2 12 11 22 -2 15 -18 3 2 -5
7804 -5 -13 -17 2 -19 -9 -16 -14 -22 -18 -16 -16 -16 -2 -9 -17 -26 -8 0 15 -4 14 5 22 2 34 14 13 9 10 4 4 7 21 4 -6 3 3 -2 -7 1 2 2 13 7 -19
7849 -19 -7 -20 0 -20 -3 -20 -1 -12 -34 -3 -22 -38 0 -18 -19 12 -2 -13 -10 9 19 13 1 19 25 6 5 7 7 6 2 -12 -1 -7 7
7884 7 -6 -13 11 -2 7 8 -3 -11 -3 -20 -20 -4 -25 -12 8 -13 -14 -12 -7 -19 0 1 0 -9 19 11 26 17 -1 19 22 0 12 31 24 9 -3 3 25
7923 25 1 4 -1 -2 9 16 -8 -10 -4 -12 8 -12 -9 -20 -15 -21 -16 -17 -21 -20 -6 -14 -8 2 -9 -13 22 1 6 -7 -1 -17 10 3 -16 19 7 26 41 -21
7963 -21 25 -9 3 27 9 -4 -6 -23 -17 -15 -19 -17 -22 -21 -21 -29 -15 -30 -22 -18 -15 -10 -1 -12 -7 -18 9 1 12 14 -6 5 2 6 -15 6 22 6 0 -15
8003 -15 -7 -9 -16 18 2 -11 7 -5 -5 -3 1 -4 -27 -22 -9 -28 -25 -13 -27 -25 -2 -15 -40 -18 -21 -7 6 -5 1 -4 -8 -4 5 22 14 10 -2 16 37
8042 37 30 6 16 13 4 11 1 1 3 -7 13 -17 -15 -4 5 2 -10 -27 -14 14 8 -23 -15 -4 -11 11 -22 -9 -18 -22 -6 -28 10 -4 0 -5 8 8 5
8081 5 16 6 32 23 4 18 15 10 11 21 20 14 6 14 20 0 13 -2 4 9 0 -10 -10 -6 -17 -29 -24 -22 -8 -2 2 20 -1 -1 2 8 20 12 4 10 7 2 17 -3
8125 -3 19 -1 27 2 -2 -4 11 3 16 15 0 14 -7 5 4 -1 -27 -5 -28 -12 -16 -9 -7 -16 -19 -5 -6 -5 -19 -11 -7 8 -13 -3 24 -2 -6 -4 20
8164 20 11 3 7 3 9 8 29 11 7 28 11 7 23 26 1 13 19 17 17 11 2 8 19 -24 -5 -10 -20
8191b0
$$ Imaginary data points
##PAGE= N=2
##DATA TABLE= (X++(I..I)), XYDATA
0 0 0 0 0 0 0 0 0 0 0 0 0 0 0 0 0 0 0 0 0 0 0 0 0 0 0 0 0 0 0 0 0 0 0 0 11 -31 32 -32 32 -32 32 -32 32 -32 42 -55 64 -64
48 -64 64 -68 80 -96 97 -112 127 -134 146 -170 186 -208 240 -273 314 -372 454 -568 751 -1094
68 -1094 1964 -9355 -10734 6748 3797 -4199 -7921 1156 10139 10180 1295 -4388 -3450 4218 8204 2695
84 2695 -6493 -7291 -204 6346 2940 -6325 -9365 -1252 7311 5612 -3946 -7077 950 8882 6342 -1984
100 -1984 -6460 -3386 2283 3501 -1507 -6167 -3737 3865 7141 2247 -4098 -4281 1065 5478 3579
115 3579 -2691 -5359 -362 5663 3776 -4103 -7057 -1100 5221 3863 -2044 -4543 -1336 2963 3208
130 3208 -762 -4167 -2861 1664 4094 1755 -2277 -2970 1182 5467 3871 -2504 -5269 -771 3895
145 3895 1693 -3811 -4408 397 4051 2694 -1137 -3130 -1718 1324 2504 198 -2677 -2031 1690 3655
161 3655 1228 -2622 -3183 368 3628 2253 -1979 -3108 617 3883 2208 -1768 -2841 -368 1940
176 1940 1090 -1920 -3633 -2022 1133 2205 396 -1482 -802 1615 2946 1505 -1342 -2198 315 2981
192 2981 1766 -2087 -3140 -28 2610 1129 -1821 -2133 36 1611 949 -911 -1985 -1008 1035 1899
208 1899 686 -1170 -1285 579 2080 925 -1709 -2164 449 2587 1198 -1638 -1843 509 1925 736
224 736 -1141 -1474 -268 1029 1011 -305 -1470 -864 866 1440 121 -1512 -1434 229 1498 704 -1109
241 -1109 -1277 731 2271 1149 -1033 -1315 406 1490 606 -912 -1353 -395 591 505 -575 -1309 -775 498
259 498 1107 376 -829 -965 390 1569 787 -1042 -1237 552 1707 569 -1034 -896 455 1042 383
276 383 -574 -869 -338 442 587 -155 -962 -770 341 955 207 -972 -937 370 1280 476 -861 -748 649
295 649 1285 413 -627 -607 144 632 326 -446 -837 -365 451 551 -167 -784 -539 306 746 172 -753 -758 248
316 248 961 322 -709 -617 504 1064 367 -473 -464 189 548 318 -210 -444 -165 328 400 -152 -798 -752 10
337 10 546 119 -692 -592 433 916 241 -565 -324 472 685 181 -331 -331 45 371 300 -130 -466 -293 197
358 197 333 -109 -565 -408 280 596 99 -588 -573 110 448 52 -386 -119 483 685 326 -187 -367 -139 181
379 181 132 -176 -365 -150 250 352 0 -433 -390 111 372 -46 -581 -483 191 502 119 -239 -86 295 377 93
401 93 -163 -177 93 417 441 154 -196 -234 -12 66 -263 -610 -430 119 388 38 -337 -115 315 471 156 -107
423 -107 -65 59 140 -14 -221 -281 -71 255 295 18 -239 -138 129 214 -7 -298 -193 177 264 -61 -376 -244
445 -244 132 249 68 -136 -119 63 151 80 -92 -73 100 299 276 38 -201 -168 102 198 -6 -218 -184 110 100
468 100 -233 -448 -302 -23 57 -24 -99 -49 84 249 288 187 123 216 347 244 -78 -313 -296 -110 -70 -240 -375
491 -375 -191 98 168 61 7 124 275 279 115 -94 -150 -114 23 33 -61 -99 -15 93 40 -150 -239 -114 120 264
515 264 145 24 38 155 75 -163 -340 -280 -140 -53 -60 -53 8 154 299 240 121 -20 -4 73 56 -67 -121 -14 153
540 153 151 -53 -199 -190 -85 -58 -111 -82 38 135 209 109 -32 -139 -91 -2 -8 -99 -113 -7 102 102 16 -40 27 121 131 18
568 18 -48 -30 16 27 -72 -163 -134 -94 -33 -86 -103 -24 99 192 207 105 22 15 80 56 -27 -47 31 87 63 -79 -186 -192 -135 -101
598 -101 -99 -53 -5 81 149 111 31 -12 29 60 35 -27 -77 22 96 124 18 -38 -23 5 -33 -121 -105 -41 54 110 108 61 25 32 13
629 13 -46 -98 -111 -38 -8 -2 -33 -42 0 70 70 11 0 28 78 64 11 -19 -32 -17 -8 -53 -107 -104 -48 -2 -17 -30 -8 60 79 81 35 46
663 46 55 68 85 5 -48 -43 -19 -23 -61 -102 -52 -6 16 20 -50 -60 -26 -17 -25 -58 -28 22 43 28 5 -24 25 54 20 -5 -34 20 37 24
697 24 -3 -33 -19 -9 9 -20 -70 -69 2 16 2 -22 -27 11 24 12 -20 -32 -12 10 12 5 -21 -23 5 16 -19 -42 -28 -1 5 1 -56 -52 -30
732 -30 -5 -33 -4 -18 -1 30 55 45 11 26 60 60 30 34 25 37 40 28 -5 -44 -19 14 -32 -44 -51 -35 -29 -8 -20 -1 18 8 -16 -11
766 -11 -38 -22 -23 14 17 -7 -3 6 13 -12 -27 1 4 30 12 -5 2 -13 11 -3 -14 -36 -4 30 8 13 -7 22 34 43 2 -4 -6 -7 9 -32 -36
803 -36 -11 -12 -21 -34 -52 -62 -50 -54 -58 -27 5 7 21 32 -6 -12 4 27 30 11 14 22 27 23 4 2 -6 8 5 23 -35 -6 -3 6 12 3 -9 -18 -35 -58
843 -58 -71 -37 -10 -10 17 35 18 12 -11 0 -27 -21 -11 -5 12 -16 -29 -32 1 -31 -10 -30 -18 -8 12 10 16 19 48 27 43 5 -10 -4 -4 10
879 10 -1 11 -15 14 -18 -13 -33 -34 -18 -14 -16 -11 -33 8 -8 -12 5 1 -2 13 -4 -9 14 3 25 18 9 20 0 20 28 12 17 15 11 8 -11 -34 -29
918 -29 -40 -7 9 22 13 31 30 8 17 7 -14 -5 -15 -3 -5 -4 2 0 -35 -4 -23 -27 -14 -11 -14 -13 9 14 14 3 9 14 15 1 16 34 21 29 63 28
958 28 21 14 -1 -2 0 -11 -14 2 7 -9 -5 -8 7 10 -16 -18 -13 -18 -25 -16 -7 0 -16 24 8 23 16 -5 4 3 -17 11 2 -16 16 -4 13 -15 -18 -12 12 29
1000 29 34 7 54 33 22 38 -4 16 -2 1 -35 -11 -34 -5 -11 -8 11 10 -20 -19 -19 -31 -18 9 -7 -14 4 -11 8 -1 -6 -2 37 15 22 25 1
1037 1 25 13 -5 5 20 25 3 28 37 4 19 5 -2 -18 -9 -21 -4 -2 -12 -11 17 -11 1 3 9 -3 -10 -5 0 2 -14 5 -2 -8 -37 0 5 -13
1075 -13 13 8 2 26 31 41 23 19 26 3 -3 10 -3 18 24 2 4 12 -15 10 -11 0 -8 -4 -1 -17 -24 -30 -22 -14 -23 -4 -2 -6 -19 13 -5 14 -6 -8
1115 -8 -5 8 18 19 -1 19 11 17 21 18 10 -1 27 36 1 -5 -13 10 10 6 -14 3 7 1 8 -3 -1 -17 -32 -12 -8 5 -30 -11 -14 -32 -12 -19 -11 -21 -2
1156 -2 -26 -3 11 5 4 28 -6 24 1 25 21 10 9 8 23 11 12 9 -9 -23 4 -10 -13 -17 -17 -11 -19 -31 -8 -1 0 -17 -13 -4 -6 -4 -14 -8 1 -7 -15 -1
1198 -1 -12 -2 -10 0 35 8 29 10 37 -3 10 20 31 24 22 10 17 16 9 2 -14 5 -14 10 -18 -3 -27 -29 2 7 -43 -9 -2 -1 -4 -19 -24
1235 -24 -14 -25 -11 0 -4 -2 8 -1 -2 20 19 8 37 15 1 -4 5 -1 1 3 -4 27 -8 16 -22 -6 -21 1 9 -2 -8 -11 -11 -17 -38 -14 -5 -12 -11 -26
1275 -26 -20 -26 -11 1 -20 -6 -16 -5 -33 0 -7 -12 -1 -3 15 7 14 -2 19 29 7 -7 -10 -4 -7 11 5 18 12 13 -7 -2 -10 -16 -21 -4 -37 -25 -12
1314 -12 -31 -37 -32 -10 -20 -35 -6 -10 -4 -11 -1 4 -6 -14 0 13 -8 26 11 1 -8 6 3 -2 0 -3 16 1 7 21 14 -4 -1 1 -13 -20 -4 -15 -5
1353 -5 -13 -17 -11 -18 -28 13 -16 -7 -27 -8 -13 11 -11 2 7 12 -9 6 -10 7 11 19 13 14 10 8 6 6 -11 -8 5 -8 8 5 -8 11 -14 -16 0 -2 -8
1394 -8 -14 -9 -14 -20 -11 -1 -25 -26 -8 -7 -10 -23 13 -25 -2 20 -8 0 18 0 6 25 18 9 9 7 4 10 15 22 18 19 10 32 1 -4 6 2 0 -16 -10 4 -14
1437 -14 1 -11 -16 -30 -19 -9 -19 -19 -17 5 -5 4 -2 -13 -10 4 -12 -12 -6 -10 16 14 27 14 8 -3 17 -4 8 3 31 12 5 15 17 13 9 -16
1475 -16 3 6 -5 -14 -6 0 -1 2 -14 -10 -9 -32 -13 -1 11 -2 3 -7 5 2 -12 -4 29 16 2 15 27 22 28 10 40 12 9 19 -6 -1 14 -14
1513 -14 5 8 3 17 -8 -8 -1 -19 25 2 -11 -3 -23 -7 -27 11 -17 -10 -18 4 1 -5 3 -3 5 12 2 -2 22 -7 -8 13 18 21 11 20 9 19 -3
1552 -3 20 6 8 8 -12 -6 -13 8 5 -10 -14 -10 12 0 -13 -9 -31 -21 -18 0 -18 5 -6 -3 -1 12 20 21 18 -5 -4 9 6 -1 2 17 14 26 19 24 18 3
1594 3 9 29 -5 -4 -7 3 -24 -4 2 -4 -10 -3 -4 -7 -18 -20 -13 -35 1 -21 -28 8 -29 0 -23 -15 10 7 9 4 9 -5 25 20 8 6 -21 14 16 -6 38
1635 38 6 -4 1 12 1 0 -2 -14 13 -26 -13 -6 -17 -14 -21 -9 -24 -17 -38 -26 -35 -24 -21 -6 -9 -44 -1 -7 -6 -15 7 12 20 10 7 7 2 -3 12 14
1675 14 17 -1 11 5 -1 18 4 0 -13 -6 5 6 -11 -4 -23 -21 2 2 -14 -28 -15 -19 -23 -15 -15 3 -10 -10 -8 2 -5 -11 18 11 18 -8 0 17 19 4 14
1716 14 34 17 0 12 4 9 13 6 9 -11 -7 12 -23 -10 5 -12 -8 -14 -43 -12 -30 -13 -12 -24 -15 -28 -31 8 -3 -6 -16 9 3 3 8 10 5 -1 11
1755 11 25 25 12 16 16 1 11 10 21 11 1 -7 -2 10 -3 -4 -3 -17 -9 -35 -23 0 -18 -12 -20 -21 -9 -10 -10 -16 -12 -17 -12 -3 -7 -2 4 23 3 8 -1 24
1797 24 20 17 19 16 12 3 12 12 7 -10 -1 20 12 15 4 2 -14 -33 1 -10 -21 -21 -25 0 -17 -16 -15 -26 -12 -12 -20 -21 3 -9 -27 -5 -8 6 10 -8 -4 3
1839 3 13 24 16 19 -1 27 20 0 19 -11 12 9 20 8 13 -4 -12 -5 -7 -19 -5 -1 -6 -9 -16 -31 -35 -26 -15 -14 -24 -16 -10 -23 -20 -2 -7 -19 5 0 2
1880 2 7 6 17 5 15 -5 19 20 5 20 16 21 -8 12 -3 15 13 -16 24 -7 -4 -30 -13 -2 -6 -23 -19 -11 -32 -16 -10 -12 -9 2 -14 -7 10 -22
1918 -22 -1 -7 -23 11 1 20 17 14 6 -11 8 10 31 12 14 16 7 28 11 18 -7 11 3 -1 9 7 -6 -27 -38 -2 -16 -12 -43 -13 -3 -12 -17 -7
1956 -7 -12 -9 -12 4 -17 20 6 -7 8 1 6 21 10 6 -3 -8 7 -3 27 -5 15 7 8 5 15 -9 -4 -27 -20 -30 -21 -9 -9 -3 -42 -20 -17 -27 -14
1995 -14 -1 -42 -16 -17 1 -11 -22 12 -19 -1 9 -14 -14 5 18 11 -2 8 24 24 14 1 4 12 9 11 2 12 19 -1 10 8 -14 -5 -20 7
2031 7 -10 -27 -19 -17 -9 -19 -12 -2 1 -6 -12 -20 -5 1 -18 -2 2 8 6 2 14 34 -2 33 -9 9 11 22 14 6 -5 1 12 3 -11 -11 7 -24 -4 -37
2071 -37 -14 -13 -17 -26 -33 -21 -26 -16 -12 -11 -14 -34 -16 -14 -12 -8 -7 15 6 -13 0 2 31 30 4 19 19 3 21 23 -8 2 9 -13 10 -12 -16 -2 -9 -21
2111 -21 -21 -1 -8 1 -31 -14 -8 -36 -55 -25 -17 -37 -15 -21 -22 10 5 4 -17 -3 17 17 -8 -10 -2 4 5 12 28 12 -1 16 25 9 -2 -20 13 12 5
2150 5 -17 -11 -4 -27 -4 -21 -19 -5 -3 -27 6 -33 0 -4 -34 -32 -22 -17 -15 -26 -9 13 3 1 -16 -9 -1 24 2 -1 -16 2 22 6 2 6 17 0
2188 0 5 1 5 13 -14 -13 -14 -16 -37 -27 -10 -14 -27 -21 -8 -8 -42 -30 -17 -32 -20 -20 -10 -14 0 -4 29 3 0 -4 -20 8 -4 -2 18 4 25 21 14 17
2228 17 -10 4 -1 7 11 5 7 15 -7 0 -23 -24 -23 -11 -10 -28 -15 -7 -3 -31 -33 -22 -12 -28 -23 -4 -2 -22 -5 -8 9 -4 15 9 -3 23 -4 10 21
2267 21 37 13 -22 8 1 1 0 10 -14 -16 -14 -4 -3 -17 -7 -19 -4 -20 -14 -25 -31 -5 -14 -17 -20 -28 -11 -27 -11 -11 -22 2 5 -19 -11 13 -11 -12
2305 -12 -13 -5 11 28 9 13 25 -7 6 -5 3 12 1 -11 -2 -14 -8 -7 -10 -8 -16 -29 -29 -9 -13 -14 -32 -8 -24 -22 -12 5 -34 -21 -9 -11 13 -8
2343 -8 5 0 -2 0 -7 20 -8 12 19 18 9 -3 22 1 4 7 18 2 -19 -2 3 -13 -11 -10 1 -7 -12 7 -14 -23 -17 -27 -9 -22 -24 -3 -3 -14 -6 -3 1
2384 1 -3 -14 11 5 -5 6 12 -10 11 27 18 -5 6 3 -2 1 21 5 -11 -2 11 -12 -13 -24 -2 -30 -33 -9 -20 -15 -23 -14 -31 -12 -41 -20 -4
2421 -4 -6 10 -13 5 -8 -14 -2 31 5 2 23 12 17 33 20 15 6 14 16 17 9 -8 2 5 4 10 -18 -2 -9 -32 -33 -18 -16 -15 -13 -19 -44 -34 -31 3 -20
2462 -20 -8 -10 -20 -6 -7 -14 -17 -1 -11 1 14 2 23 0 22 24 3 7 0 17 -15 6 -3 0 -2 -13 -4 7 10 -17 1 -18 -3 -25 -23 -10 -13
2499 -13 6 -34 -25 -10 -19 -18 -20 -4 -10 -22 -21 10 -5 -2 6 1 15 9 17 0 38 16 10 16 28 5 23 -3 0 7 2 7 -7 -19 -10 -13 1 -6 -20 -10
2539 -10 -8 -27 -31 2 -14 -34 -15 -4 -16 -29 -17 -17 -3 -10 -13 -15 -14 7 8 11 12 38 14 3 10 25 1 8 16 5 13 -10 0 3 -10 6 -5 -11
2577 -11 -10 -21 -6 -40 -10 -12 -13 0 -14 -6 -15 -20 -11 -14 -8 -19 -22 -17 -20 4 16 0 8 7 18 13 15 10 12 41 24 29 26 7 3 -9 2 6 6 -12 -4 -15
2619 -15 -11 -4 -37 -13 -9 4 -16 -20 -9 -21 -19 3 -15 -9 -2 -7 -27 -4 -4 24 1 4 16 9 -7 19 18 5 25 17 24 21 17 17 13 16 12 0 8 0 6 -7
2661 -7 -2 11 -9 9 -12 -8 -25 -20 -22 -17 -31 -3 -20 -8 -11 -19 -6 14 1 14 -5 -3 19 14 20 4 14 7 8 20 22 11 21 7 26 31 17 -6
2699 -6 -7 5 -19 -4 -18 -6 -12 -7 -30 -34 -23 -29 -29 -18 -23 -16 -32 -15 -11 0 9 -3 3 0 11 -2 19 8 1 24 9 6 15 33 8 9 29 17 6
2738 6 13 -7 17 21 -5 1 -6 -7 -8 10 -27 -6 -1 -19 -9 -35 -25 -13 -11 -9 5 -31 -20 -17 -2 1 -5 -5 2 7 2 0 9 25 5 9 40 8 15 23 -4
2779 -4 -3 -5 8 9 1 15 -4 -4 -12 5 -25 -7 -22 -14 -32 -9 -25 -30 -21 -18 -15 -24 -11 -21 -12 -1 -5 -27 0 14 1 -13 25 -9 12 25 -2 -1
2817 -1 19 23 3 15 0 3 7 7 -11 -1 -11 5 -7 -12 -27 -7 1 -10 -27 -23 -26 -20 -24 -44 -43 -18 -47 -19 3 -14 -3 8 15 -5 -3 -12 -23 30
2855 30 5 13 19 6 13 11 10 22 22 34 19 5 14 14 0 -11 1 6 -5 -30 -29 -14 -21 -14 -4 -8 -15 -27 -16 -3 -32 -9 -32 -34 -4 6 -22 -4
2893 -4 31 2 2 18 27 11 15 -5 4 4 15 15 9 10 17 21 0 3 5 -6 -11 12 -25 -20 -21 -23 -7 -16 0 -20 -30 -14 -26 -18 -20 -7 -19 -15 -38 -2 -14
2934 -14 -2 -9 10 25 5 11 20 19 14 15 20 24 22 21 31 12 18 8 -2 17 -26 -18 2 5 3 -23 0 -7 -10 -20 -26 -11 -13 5 2 -7 -14 -29 -6 -22 -4
2975 -4 3 1 -3 4 5 10 9 14 14 12 24 9 -7 -15 5 24 19 11 -1 2 -7 9 -10 -23 -13 6 -4 -29 -26 -8 -23 -11 -16 -9 -30 -16 -11 -26 -1 19
3015 19 -14 1 -2 -9 4 3 16 8 16 14 28 38 11 28 19 21 29 17 4 -4 14 21 11 3 15 -7 -2 -9 -29 -18 -7 -46 -40 -40 -6 -17 -18 -2 -6
3054 -6 -24 -12 -16 10 3 8 2 13 0 17 26 4 34 13 8 24 28 15 4 18 21 11 16 -13 19 23 9 5 3 -9 -17 -8 -15 -20 -2 -9 -24 -30 -19 -29
3094 -29 -21 -3 -20 -9 4 0 -15 -9 1 2 0 24 4 -13 14 4 14 27 13 15 30 23 14 -8 21 5 15 7 -1 22 2 1 -11 -13 -17 -1 -26
3131 -26 -40 -11 -13 -23 -13 -21 -11 -16 -22 -32 2 0 -6 -24 -13 -5 -1 -3 1 18 -2 28 19 27 8 12 13 24 1 -9 12 27 -1 7 -4 -6 14 7 -10
3170 -10 -10 -26 -28 -26 -10 -19 -18 8 -19 -9 -2 -10 -16 -23 -10 -14 -3 16 1 23 3 26 12 16 17 9 9 5 18 16 4 8 18 19 4 -10 5 -13 -13 -15
3210 -15 4 -6 -35 -19 -9 -27 -9 -14 -47 -32 -32 -10 -25 -38 -40 -18 7 -17 -18 6 -4 -14 -3 -2 7 -3 4 15 32 8 6 5 -3 1 -6 16
3246 16 12 6 17 -6 -2 1 -1 -18 -4 -22 -33 -27 -35 -16 4 -29 -32 -36 -30 -17 -11 -3 -16 -15 -13 1 -2 -5 -6 8 23 17 -5 -3 1 16 20 10 16 15 0 -2
3288 -2 12 4 -8 -6 -5 -15 -10 -26 -26 -18 -16 -13 -14 -34 -23 -7 -9 -17 -33 -28 -27 -9 -23 2 -17 12 8 -19 -4 13 18 -13 24 14 4 21 14 12 17 34
3328 34 9 14 19 36 -7 -2 1 -12 23 -13 -20 -18 -24 -27 -7 -29 -43 -26 -12 -33 -20 -22 -17 -22 6 6 -15 -11 -15 -16 15 12 -2 19 9 21 22 -24 21
3367 21 -3 34 4 32 45 7 12 -2 7 5 22 13 -13 -2 -16 -8 -25 -6 -14 -18 -16 -25 -15 -37 -23 -21 -3 -27 -8 -9 -14 3 15 1 29 20 -2
3404 -2 8 20 9 9 20 24 7 2 18 10 28 20 13 3 8 -7 -21 12 5 -12 -2 -4 -34 -14 -22 -17 -14 -18 -22 -1 -7 -14 -6 11 -10 4 13 0 -6 15
3444 15 14 8 -2 5 19 9 5 31 29 4 22 22 37 2 20 26 15 -13 -5 -6 -16 11 -6 -3 0 -2 -26 3 -21 -14 -27 -41 -6 -18 -17 2 -14
3481 -14 -6 3 20 8 14 1 31 37 19 27 14 10 20 14 17 10 33 29 21 0 22 15 -2 8 8 4 3 -13 -27 -28 -4 -13 -12 -21 -2 -14 -12 16 -8 -12 4
3522 4 4 -4 -6 2 -1 26 29 -1 36 4 16 5 -14 0 4 12 22 26 29 18 13 21 10 2 28 24 2 2 4 -15 -7 -15 -9 -12 -32 -4 -25 -21 -13 -2 -10 -22
3564 -22 -3 9 -14 1 -1 -13 -3 22 22 38 18 23 32 21 30 19 29 15 29 26 27 6 19 38 11 9 -10 -5 -4 -7 -16 -6 -5 -21 -30 -7 -4 -24
3602 -24 -23 -14 -5 -3 -23 -16 -3 -13 6 -5 14 4 -19 6 15 24 19 10 9 23 2 -4 24 19 5 2 -6 7 3 9 -11 19 -5 -5 -11 -14 -18 -48 -17 -12 -30
3643 -30 -33 -17 -10 5 -5 0 10 -1 -2 -2 8 -4 -9 6 -2 -7 14 19 28 3 28 13 22 -4 33 15 5 -1 18 3 -5 7 3 2 4 -21 -10 -32
3681 -32 -25 -14 -24 -33 -5 -1 -30 -27 -9 -5 -22 -25 4 7 4 4 0 17 14 25 27 16 27 -4 13 5 18 4 14 26 -4 8 -4 6 -2 3 -11 1
3719 1 -19 0 -22 -14 -14 -31 -6 -20 -22 -16 -24 -26 -23 -25 -15 -6 -23 11 -3 -2 -7 19 -4 8 4 0 17 32 6 37 23 26 8 34 6 26 6 11
3757 11 24 8 -7 -9 -1 -18 -19 -23 -11 -46 -20 -27 -46 -24 -9 -26 -24 -31 -19 6 6 -20 -23 5 -7 -7 -3 30 19 30 29 16 30 42 33 17 1
3794 1 11 20 8 21 5 5 2 1 8 -20 15 9 -10 -11 -14 -21 -27 -28 -1 -21 -22 -36 -17 -19 -9 3 -3 -22 8 -14 5 18 -1 7 25 40 15 4
3832 4 3 28 44 8 24 41 21 13 -2 -1 -4 2 -8 4 -8 -14 12 -24 2 -4 -3 -21 -10 2 0 1 -6 8 -11 3 -3 -9 5 -7 20 16 13 32
3870 32 28 11 35 26 34 11 20 32 21 20 23 17 11 14 11 23 19 -2 22 -21 -8 -10 -16 -3 -6 -15 -15 -1 2 -15 16 -20 -16 -8 5 24 2 15 -3 16
3910 16 13 12 15 39 25 12 29 14 44 38 26 49 15 30 24 13 20 7 -11 10 19 15 -4 -9 -1 -29 -7 -22 -24 -20 -15 -45 -11 -20 -2 1 17 4
3948 4 -6 8 -24 -3 1 1 10 8 17 22 12 20 31 21 27 11 39 36 2 -6 10 0 -2 -4 2 2 -10 -26 -23 -15 -19 -18 -8 9 -15 -17 -9 1 -14 -5 6
3989 6 4 5 18 17 -1 8 25 12 19 23 16 18 16 13 15 22 24 -8 19 20 14 12 -7 -13 -8 -10 -15 -14 -5 -6 -19 -25 -21 -31 -1 -10 -3 -17 -31 -12 -7 -17 -16 -13 15 9
4035 9 -16 8 11 -8 -3 -22 39 7 17 34 17 25 -1 16 0 27 -1 14 2 -22 1 2 -19 -9 -11 -16 -33 -2 -8 -16 -14 -17 -25 -29 -33 -25 6 -28
4073 -28 -5 -21 -3 15 15 6 22 12 37 7 40 39 19 3 37 29 30 1 7 12 6 -7 2 -8 2 -18 -15 -16 -34 -11 -13 -7 -11 -19 -19 -33 5 -13
4111 -13 -10 -6 -1 0 3 -2 -6 24 -2 -19 24 20 33 35 3 22 3 10 16 11 25 10 35 8 -4 -1 -12 8 6 -5 13 2 -9 -25 -33 -14 -9 -15 -20
4150 -20 -14 -15 -6 -25 -18 -29 -25 -9 -4 -3 13 6 12 25 19 25 5 16 9 26 28 11 29 35 11 28 22 14 20 -1 15 21 5 1 -3 -5 -25 -1 -13 1 5
4191 5 -2 -3 -10 0 -13 -12 -20 -11 2 -11 -3 4 25 19 6 12 -5 20 21 10 2 7 28 14 13 8 5 29 20 37 12 6 -3 8 6 -10 -6 -17 7 -12 -21 -17
4233 -17 -28 -21 -12 -4 -12 -23 -39 -13 -4 -7 -10 -3 -12 12 -7 0 12 17 22 11 16 20 58 22 13 20 35 42 22 22 19 6 15 3 5 11 5 -12 -7 -15 -33 -2 9
4276 9 -13 -21 -14 1 -23 6 -25 -9 -21 -12 2 9 7 11 8 6 33 15 22 29 28 3 25 44 36 23 16 16 25 11 17 6 10 -3 1 -3 5 -17 -16 0 -5 -10
4318 -10 -23 -19 -26 -19 -36 -15 -7 1 -1 -11 0 -26 -12 -4 23 31 6 24 19 10 19 16 14 31 21 28 11 29 4 10 20 11 -2 -6 4 -5 -6 -3 -9 -12 -12 -24
4360 -24 -20 -10 -27 1 -18 -19 -19 -14 -21 -3 3 16 15 5 -16 -14 -10 -12 21 25 -7 25 -5 -12 22 20 11 5 -7 7 14 15 16 10 3 -12 -7 13 -3 -23 -34
4401 -34 -27 -10 -27 -19 -6 -23 -19 -27 -20 0 -14 -13 13 16 -5 2 0 15 -4 33 11 12 -1 10 36 19 6 16 7 9 21 10 18 9 -6 0 -3 -15
4439 -15 -4 -23 -24 -10 -34 -9 -23 -28 -47 -17 -22 9 -7 -4 -14 -11 9 -10 0 8 -9 -8 -4 20 19 22 31 0 13 32 12 22 18 19 14 3 9 21
4477 21 20 34 -8 -9 -18 6 -10 -8 -20 -22 -22 -16 -3 -13 1 -9 -3 3 2 -6 -5 10 26 19 19 23 3 7 31 25 15 8 26 32 31 34 4 10 16 9 -2 10
4519 10 1 4 0 -21 -18 -11 -11 -12 -13 -37 -15 -11 -2 -10 -42 -21 -6 -10 -9 -14 -6 1 -9 11 9 15 3 2 20 4 25 21 40 20 14 23 36 26 21 10 10 33
4561 33 3 22 -20 -29 -24 -2 -15 -18 -17 -10 -27 -29 -5 -14 -34 -25 -16 -21 -3 0 1 -26 -11 3 10 19 -1 8 12 28 21 21 36 18 44 29 25 26 18 7 17
4602 17 15 8 17 -6 3 -8 8 -6 -16 -3 -19 -33 -16 -19 -30 -22 -19 -7 -24 -10 -3 -20 20 -17 2 14 9 24 1 5 5 9 32 27 2 19 20
4639 20 26 6 5 15 37 16 7 -5 5 11 7 -13 -19 -21 -18 -24 -25 -20 -14 -19 -8 2 -17 -6 -4 3 5 -10 14 11 13 18 9 9 2 13 25 23 4 9 11 35 27
4682 27 32 14 47 36 0 12 -7 -8 -20 -11 2 1 -2 -37 -14 -24 -40 -21 -22 -18 -27 -27 -20 -37 -20 -23 -14 3 11 -17 0 6 8 24 -4 13 29 11
4720 11 40 19 24 10 -3 22 4 10 2 -7 -2 4 -13 3 14 -10 2 -26 -25 -6 -12 -24 -28 -18 -3 -21 -23 -13 -24 -6 -10 -11 -8 11 -2 13 19
4757 19 10 14 18 24 15 9 14 7 22 17 18 3 23 16 20 10 6 7 -1 -1 -20 -8 -20 -12 -16 -14 -16 -12 -17 -28 -20 -43 -4 -34 -36 -7 4 -28 -30 -1 11 3 11 2
4801 2 5 18 27 11 22 26 4 4 12 22 21 11 -2 18 14 -6 -15 -10 -7 13 -12 -12 -26 -10 -24 -33 -1 -19 -17 -8 4 -9 -12 -20 -27 6 10 19 11 10 -13
4842 -13 8 2 22 28 21 30 30 30 21 5 0 30 18 7 25 -3 -6 -33 10 -8 -19 -13 -15 -17 1 -5 -2 -2 -16 -18 13 -6 -17 -35 -29 -15 -14 5 9 -11
4882 -11 7 6 36 29 32 18 16 24 27 6 42 27 38 29 15 14 17 -7 10 -4 1 -3 1 4 -28 -15 -28 -31 -19 -7 -14 -2 -5 -5 -11 -12 6 8 4 1 -8 0
4924 0 2 -5 9 10 21 19 37 20 23 33 28 2 25 17 12 23 13 -3 11 4 3 -4 -1 -1 -34 0 -17 -25 -26 -33 -16 -26 -21 -6 -44 -11 -20 -11 -1 7 6
4965 6 10 9 14 17 7 17 13 29 17 34 38 29 4 5 22 14 18 12 -1 13 7 -5 6 1 4 -25 -37 -16 -13 -17 -29 5 -33 -35 -26 -27 -28 -47 -12 -17 -13 6
5007 6 3 9 -2 11 15 16 5 17 16 9 11 19 17 20 29 22 23 7 14 11 8 -3 -15 1 16 -14 5 8 -24 -30 -14 -22 -22 -16 -29 5 -13 -21 -16 2 -13 -8 -3
5050 -3 -13 -15 0 3 38 10 20 23 29 14 13 22 18 13 7 -12 -13 -7 -8 -4 -7 -5 7 -3 -7 -15 -13 -9 -18 -24 -25 -13 -24 -11 -17 -1 -4 -21 -13 -6 -22 -14 -5 -5 -1 -1
5096 -1 10 12 -3 30 13 21 35 26 41 28 20 6 18 15 3 5 -9 -12 -2 1 -15 0 -9 -11 -24 -10 -13 -11 -9 -30 -14 -7 -24 -13 -34 -18 -3 0
5134 0 5 7 3 12 -9 4 35 19 31 15 15 43 11 11 26 19 10 25 1 2 3 0 -2 4 -1 -1 -1 -11 -3 -1 -28 -39 -24 -3 -6 -16 -6 -27 -2 -14
5174 -14 1 4 4 11 -2 16 24 24 4 39 22 27 26 22 23 32 25 30 18 35 18 4 5 21 10 -5 -22 5 -15 -25 -17 -23 -24 -16 -22 -19 -21 -18 -10 -30 -12
5215 -12 -23 2 5 8 -4 -10 14 11 10 22 12 3 -18 35 2 24 22 16 4 7 11 1 6 11 5 -8 -15 0 -38 -2 -19 -32 -15 -27 -21 -3 -24 -19
5253 -19 -30 -7 -21 -23 -29 -12 -11 15 1 -17 -2 -4 16 9 7 26 18 16 29 15 28 12 30 11 8 12 22 22 10 -2 13 -14 -2 -28 -21 -1
5289 -1 -10 -8 -9 1 -14 -31 -17 -19 -26 -16 -8 -22 0 -4 14 -4 -9 0 -13 13 9 11 36 32 23 25 17 18 8 -1 -10 9 6 14 -14 3 -4 -9 -14 -13 4 -25 -18
5332 -18 -19 -20 0 -21 -33 -10 -22 -30 -21 2 -8 -5 -1 -1 13 12 17 8 25 14 25 22 17 23 30 34 23 33 43 36 33 14 16 -1 15 8 3 -24 -22 -13 -7 -13
5374 -13 -28 -4 -13 -16 -30 -21 0 -20 -16 13 -6 -4 1 -4 9 -8 -10 3 35 11 8 13 4 24 11 16 13 28 9 16 22 13 0 26 2 5 7 -10 -33
5413 -33 -8 1 3 -7 -32 -4 -26 -22 -1 -15 -12 -18 -4 -22 -9 -21 4 11 20 31 15 8 8 1 14 25 35 33 27 24 19 28 0 23 4 27 7 4
5451 4 -8 10 0 -18 -4 -8 -13 7 -19 -29 -18 -8 -15 -7 -18 -5 -2 -9 7 3 -2 -2 17 -5 13 16 30 19 29 26 36 33 30 36 13 24 0 20
5489 20 31 19 16 4 14 -5 14 13 -10 -5 -5 -15 -5 -28 -21 -16 -8 -7 -9 -21 -21 -21 37 -17 -28 3 16 1 -8 9 -1 40 26 8 29 36 11
5526 11 25 6 9 42 8 15 17 23 28 18 3 17 12 0 -20 -16 -34 -14 -25 -19 -17 -1 -18 -8 2 -26 -25 -14 -20 -8 28 -5 -3 7 19 17 15
5563 15 16 24 35 25 29 30 5 23 12 13 24 15 25 13 24 5 -3 2 -26 -24 -13 -4 2 -23 -20 -16 -6 0 0 2 5 -33 -1 1 -13 26 -7 -9 11 22
5603 22 20 27 45 32 26 31 19 18 36 18 27 38 8 8 -2 13 13 -9 24 8 -3 7 -7 4 -9 -13 4 -30 -13 4 -22 -13 -33 -2 -24
5638 -24 -21 -2 -5 6 8 -6 12 14 1 9 10 10 40 50 9 25 22 23 31 10 9 9 1 -6 -8 0 -14 8 27 -9 4 -36 -2 -15 -5 -23 -19 -7 -17
5677 -17 -3 -20 -4 1 -1 -2 -12 6 -3 -11 22 29 12 23 32 28 14 30 23 33 39 7 13 27 17 12 16 5 9 -9 -8 -9 5 -4 -11 -20 -9 -7 -19 9
5717 9 -8 -27 -25 -10 14 -20 23 10 6 4 -7 22 23 25 5 24 25 7 18 21 23 38 36 16 7 14 22 16 12 5 22 -9 18 -1 22 -26 -21 -7 -13
5756 -13 -13 -8 -3 -35 -26 -20 -11 -23 -9 -5 -15 8 14 29 6 16 19 -9 22 22 17 34 9 17 10 20 18 30 24 20 9 15 6 0 12 12 -23 -13 -21 -17 -4
5797 -4 -15 -5 0 -21 -23 -23 -2 -33 -18 -21 -4 3 -3 -3 8 30 29 19 17 31 27 44 17 22 21 9 29 27 11 10 30 29 2 27 1 8 12 4 15 -5
5837 -5 -24 9 -4 -8 -11 -10 10 -5 -15 -3 -11 17 -12 6 -7 0 -3 18 -3 14 34 22 24 24 30 17 26 35 20 26 19 13 13 6 30 13 -12 -11 -7 -6
5877 -6 20 -24 2 -24 -18 -20 -12 -14 -14 -33 11 -24 -26 -21 2 1 -11 14 -5 -4 21 23 33 -1 22 41 26 43 39 26 27 31 36 42 34 40 17 8 10 10 -8
5918 -8 -18 2 -10 12 -17 -32 -9 -18 -21 -15 -5 -8 -20 -28 -8 0 7 5 15 23 11 13 20 24 18 17 27 23 4 46 30 15 17 18 13 19 39 -1 10 0
5958 0 1 -4 -3 -13 -15 -4 -13 0 -10 -31 -34 -17 -16 -16 3 -17 7 -6 0 12 2 -5 2 0 -10 22 11 6 -6 6 22 39 0 30 25 16 30 23 -7
5997 -7 2 22 4 4 2 -3 -14 2 -31 -20 -13 -23 -20 -13 -9 -36 -23 -17 -10 -22 -8 1 -6 -17 -8 -14 -3 10 18 2 28 9 16 11 17 27 5 23 16 46
6037 46 16 25 10 10 15 22 14 -2 9 -3 -15 -16 -18 -10 -14 -8 -4 -24 -25 -40 -27 0 -20 -9 -22 -11 14 2 10 9 -6 -11 17 19 16 20 21 31 22 16 21
6078 21 29 14 29 0 19 15 -13 7 10 11 -18 -11 -4 2 -39 -21 -2 -49 -23 -15 -31 -10 -24 -32 -20 -36 -1 5 5 7 10 -6 22 18 3 1 4 25
6116 25 35 23 24 23 13 19 21 11 5 18 3 3 6 -7 0 7 -26 -2 -34 -29 -26 -40 -19 -17 -31 -21 -44 -11 -31 -21 -32 -8 -17 -14 -2 -19 -19 18
6154 18 8 21 4 14 20 19 17 10 14 14 2 20 14 -6 8 -1 -12 -7 -19 -3 -7 -23 -9 -22 -2 -9 -7 -13 -43 -24 -12 -17 4 -2 5 14 2 -4 -3 19
6194 19 10 -5 26 6 36 7 23 18 14 26 25 23 17 14 4 11 -6 15 22 10 -6 -9 -4 -21 16 -14 -20 -12 -22 -16 -32 -3 -1 -28 -11 -5 20 14 -9
6233 -9 10 -4 6 11 23 -1 14 31 32 7 31 27 36 41 6 13 28 26 30 5 -9 -2 3 5 4 4 -1 -10 2 -18 -6 -18 -27 5 -20 -13 -16 -9 -13 8 -17
6274 -17 5 11 -2 9 5 15 21 22 11 18 22 22 13 28 22 19 15 3 22 11 2 5 -4 20 1 -6 2 -4 -5 -15 -15 -21 -23 -10 -21 -12 10 -8 -5 -12 3 -7
6316 -7 8 1 4 8 2 17 3 29 21 26 24 17 21 20 11 26 3 30 4 17 -5 15 -15 -7 12 -1 -6 -12 -33 -20 -35 -16 -11 -4 -15 -32 -14 -34 -18
6355 -18 -12 -13 -19 -2 -9 -13 -5 -12 11 4 12 3 7 27 17 39 14 7 13 17 3 19 -9 0 17 -12 14 -4 1 -6 -9 -4 -23 -14 5 -43 -27 -41 -23 -21 -10
6396 -10 -23 -13 -6 1 -1 -17 6 0 0 10 -7 20 15 24 21 22 40 27 44 -1 34 39 48 20 12 6 22 6 15 5 -3 -18 2 -11 -4 -22 -12 -17 -11
6435 -11 -11 -25 -13 -9 -20 -6 -31 -14 -2 4 8 1 9 -3 6 20 23 10 1 4 17 6 2 14 29 31 29 47 18 19 8 16 3 5 -8 2 -12 -25
6473 -25 -11 -20 -45 -16 -12 -10 -19 -26 -30 4 -19 0 -13 -17 -2 -12 4 14 18 10 25 17 23 12 16 19 38 27 28 10 0 8 -1 20 9 26 9 1 -7
6512 -7 -11 -16 -20 -25 -15 -28 -3 -5 -37 -28 -15 -4 -18 -4 -8 -12 2 -12 9 10 24 10 19 12 -4 21 10 22 25 8 23 16 8 2 10 24 -6 7 11
6551 11 -15 6 4 -17 7 -13 -10 -2 -24 -26 -38 -5 -11 -8 -15 -4 -7 -6 -8 -20 -23 11 25 21 1 5 44 38 26 19 37 44 42 28 21 30 10 12 17 18 -13
6592 -13 -2 4 2 6 17 14 -24 -20 0 4 -20 -7 -37 -14 4 4 -20 -2 -31 0 -17 22 4 9 2 7 34 25 12 6 25 17 26 23 8 -3 18 15
6630 15 23 37 33 19 19 -4 7 0 -10 -18 -43 -4 -4 -8 -17 6 -33 -42 -19 -31 -26 -8 -11 -15 -18 -16 -1 -6 5 -5 9 3 15 29 20 16 15 37 12 18
6670 18 13 17 34 15 17 24 7 10 1 21 11 -11 4 -31 -12 -4 -15 -22 -12 -17 -19 -23 -23 -6 -19 -14 21 -16 14 4 18 2 46 0 10 18 12 19
6708 19 0 32 13 36 29 28 19 22 8 5 21 6 -2 7 -11 10 -1 -5 -13 -18 -35 -9 -30 -29 -13 -40 -29 -15 -12 -8 -12 -9 -9 5 7 -1 3 2 9 18 18 27
6750 27 35 11 17 31 23 31 30 10 23 11 10 -2 17 -3 13 -4 -13 -5 -5 4 -29 -20 7 -31 -12 -39 -7 -8 -11 -8 2 4 -1 21 -8 -2 8 -4 30
6789 30 18 11 26 23 -2 1 42 39 27 26 17 13 20 11 -4 -16 -4 2 5 -10 -2 -31 -20 -15 -28 -9 -17 -10 -19 -12 -16 -11 -16 4 -1 -7 0 2 7 1 21 16 24 15 30
6834 30 26 22 29 41 9 16 21 5 9 -2 12 -12 9 -10 6 -3 -34 -23 -33 -25 -24 -31 -13 -8 -12 -15 -18 -31 -24 -9 -18 -14 -27 15 1 19 12 2 0 34
6874 34 31 19 6 8 22 22 22 12 23 14 25 22 18 12 -6 8 -6 20 -16 -18 -3 -30 -17 -19 -22 -24 -35 5 -20 -18 -12 -29 -22 -14 -14 7 3 -5 -2 -9 21
6915 21 14 18 7 17 43 -1 14 4 10 19 21 18 4 21 0 -9 -13 -3 -13 -17 -10 -30 -2 -23 -31 -30 -2 -28 -24 -30 -28 -12 -29 -19 -24 -4 0 4 3 0
6955 0 5 20 -1 6 -5 7 26 7 13 27 24 16 15 26 22 27 18 -3 11 4 4 -6 -28 -27 -21 -30 -8 -15 -12 -20 -8 -20 -32 -32 -17 -22 -13 -26 -21 -10 -5 8
6997 8 -4 -7 4 25 5 -3 -3 -4 21 25 2 15 25 10 10 13 10 1 19 -2 -5 -1 -11 -30 -17 -36 -22 -20 -17 -23 -46 -50 -23 -23 -22 -36 -11 -6 -11 0
7037 0 17 10 -7 -9 3 13 4 36 19 20 24 21 26 15 7 7 17 6 14 10 -5 -5 -2 -23 -17 -22 -15 -9 -11 -27 -24 -6 -44 -40 -21 -35 -37 -26 -25 0 -21 -7
7079 -7 1 -7 3 -18 -3 13 27 8 30 7 21 7 24 43 9 14 2 5 -6 16 -7 -17 -2 -7 -19 1 -4 -11 -27 -19 -31 -33 -28 -31 -17 -28
7115 -28 -25 -14 -5 0 -5 -26 0 9 -10 0 20 22 21 15 13 33 11 25 27 27 13 9 24 4 -1 18 -11 -5 2 -3 -6 -8 -9 3 -29 -25 -7 -7 -20 -20 -31
7156 -31 -18 -5 -23 -31 -19 -12 -37 -15 -5 4 4 6 27 19 3 31 21 20 11 8 4 19 18 24 8 9 11 13 8 18 -8 -3 -6 -15 -2 -17 -9 -33 -19 14
7196 14 1 -17 -30 -7 4 -4 -16 -5 -4 -4 3 29 15 4 15 21 10 29 22 52 14 10 9 7 20 18 6 28 10 -7 -10 1 -1 -5 6 -10 -3
7233 -3 -7 -9 -13 -20 -10 -21 -12 -22 -22 -3 -2 -2 -22 -10 8 5 -19 16 -7 2 38 33 15 -1 28 26 18 19 26 50 16 32 21 5 -9 3 6 4 -4 7
7273 7 -18 1 -13 -18 -3 -31 -6 -20 -21 -3 -21 -5 -21 -15 2 2 0 1 5 12 18 17 33 10 12 17 22 19 27 12 33 24 6 3 42 22 23 16 2 9 7
7314 7 7 -16 -17 -8 2 -20 -20 -22 -23 -5 -5 -19 3 -28 -12 -29 -2 -8 -3 -1 11 15 2 15 11 31 44 9 23 37 47 23 36 31 29 -3 25 38
7352 38 -1 1 5 -9 6 -9 -18 -35 -18 -4 -20 -25 -23 -23 -38 -20 -37 -7 -6 2 -15 -17 -22 10 -3 -23 1 -7 -1 28 26 22 14 3 16 16 16 14 17 16
7392 16 15 16 15 12 3 -19 -8 -9 -12 -10 -10 -5 -21 -12 -10 -20 -32 -46 -21 -25 -29 -19 -19 -6 -22 -1 -9 26 -13 -10 10 13 15 17 22 26 36 23 27 8 31 16
7434 16 5 5 14 11 -5 -18 9 -10 -10 -25 -17 5 -22 -12 -21 -12 -22 -28 -33 -18 -2 -5 -18 -15 5 4 6 8 9 34 17 -1 12 25 3 26 25 27 20
7473 20 31 26 28 1 -4 8 10 -5 2 -12 -10 2 0 -6 -29 -34 -41 -5 -14 -7 -11 -11 -23 -8 0 -21 -6 -11 -15 0 -17 13 16 3 13 16 15 13 5 27 -8
7514 -8 15 8 16 28 3 15 21 20 11 -13 -3 11 -3 -26 -10 -19 -14 -28 -21 -23 -29 -18 -33 -24 -33 -17 -36 -23 -20 -16 -11 -14 -10 -10 13 -1 -4 15 0 20
7554 20 10 8 -5 6 10 1 -2 36 -3 8 21 0 -18 38 -11 -8 -11 -18 -15 -25 -26 -25 -37 -20 -2 -20 -9 -8 -21 -15 -3 -13 10 -6 7 12 10
7591 10 32 20 12 36 16 22 17 20 17 29 11 15 -4 12 10 15 9 -2 -10 -15 -6 -4 -18 -6 -12 -9 6 -5 -30 -29 -17 -26 -10 -20 -8 -15 -17 0 -21 3
7631 3 -12 13 5 24 8 20 24 23 6 9 28 16 31 12 28 11 3 3 2 4 -8 -5 -15 -16 -7 -12 -22 -37 -19 -5 -39 -21 -18 -24 -16 -5 -4 -7 11
7670 11 -16 -15 10 -18 7 13 11 28 26 7 14 21 16 24 6 27 17 10 20 20 -2 25 -19 -20 13 11 11 -11 -28 -31 -16 -16 -19 -34 -19 -14 -41 -13 -25
7709 -25 -38 -14 -32 -10 8 -1 -1 -3 6 4 -8 20 4 4 14 15 17 11 14 11 11 24 14 -1 -7 -6 11 -15 -3 2 -1 -8 -36 3 -5 -8 -10 -21 -28 -21 -22 -21
7751 -21 -34 5 -26 -8 -7 -24 5 7 11 26 -6 32 20 16 13 -2 25 18 34 19 9 26 36 18 23 9 3 5 12 -14 -18 -33 -23 -11 -23 -17
7787 -17 -23 -20 -28 -8 -31 -1 -31 -17 -24 -4 -1 9 -4 23 15 0 15 10 33 12 15 32 31 14 30 50 32 37 19 6 5 17 6 -3 -9 -8 -9 -15
7825 -15 -11 -10 -19 -23 -17 3 -26 -26 -16 -10 -14 -10 -9 -18 7 -1 -2 9 5 10 -3 37 26 23 13 41 36 43 31 38 26 27 13 11 14 9 4 36 4 -5 26 -14 -6
7868 -6 -10 -16 -21 -23 -3 13 -1 -6 -1 -16 -9 -2 17 13 26 19 9 14 8 -3 16 23 37 21 31 30 33 19 27 46 17 25 14 10 19 13 3 2 6 -4 1 -17
7910 -17 -6 -6 -9 -3 -16 -4 -23 -3 -30 -19 3 -16 -8 -22 -1 -1 17 -2 24 17 23 24 38 46 32 27 5 30 38 21 37 8 23 2 18 35
7946 35 -5 21 28 -8 -6 -10 -10 -9 -15 -19 -22 -5 -12 -26 -22 -26 -17 -19 -13 1 -22 16 -1 -1 -1 6 7 31 29 20 19 5 49 59 30 30 50 15 25 -1 13
7987 13 18 0 0 -5 6 -14 3 -23 3 -3 -23 -15 -8 -37 -7 -4 6 -17 2 2 -3 -10 -7 9 14 1 3 32 12 30 17 42 57 21 37 35 58
8024 58 29 42 23 28 41 22 19 21 26 -6 -1 5 7 15 4 -33 -5 -21 -10 -3 0 1 -6 -12 1 21 1 6 6 15 15 26 34 18 45 36 34 23 36 23
8064 23 33 27 37 31 35 38 31 13 20 -2 23 22 21 7 6 -12 -15 3 -14 11 -20 -12 -19 -5 -26 -8 5 -11 1 -1 9 -2 18 13 9 17 33 11
8102 11 45 31 19 48 29 31 36 38 30 26 13 6 12 -2 -15 -18 1 1 15 0 -8 -19 -21 -3 -16 4 3 2 2 21 -9 -3 3 -3 3 -2 18 23 16 45 16
8143 16 30 18 29 25 35 40 31 33 8 22 25 17 8 9 18 -10 -10 -6 -4 22 -20 10 1 -22 -36 -33 0 -12 -18 -8 -6 -8 -10 -2 30 14 20 17 31 11 25
8184 25 27 13 37 41 19 36 47
8191D7
##END NTUPLES=NMR FID
##END=
