##TITLE=1H_K-385/2
 CDCl3, 8 sc, 
 2.10.2020
##JCAMPDX= 6.0         $$ Bruker NMR JCAMP-DX V2.0
##DATA TYPE= NMR FID
##DATA CLASS= NTUPLES
##ORIGIN= UXNMR, Bruker Analytische Messtechnik GmbH
##OWNER= root
$$ XWIN-NMR		Version 3.5
$$ Fri Oct  2 10:48:38 2020 Russian Standard Time (UT+4h)  she@DPX200
##.OBSERVE FREQUENCY= 200.1315066352
##.OBSERVE NUCLEUS= ^1H
##.DELAY= (6, 6)
##.ACQUISITION MODE= SIMULTANEOUS
##.ACQUISITION SCHEME= undefined
##.AVERAGES= 8
##.DIGITISER RES= 18
##SPECTROMETER/DATA SYSTEM= spect
##.PULSE SEQUENCE= zg30
##.SOLVENT NAME= CDCl3
##.SHIFT REFERENCE= (INTERNAL, CDCl3, 0, 15.7039)
##AUDIT TRAIL= $$ (NUMBER, WHEN, WHO, WHERE, WHAT)
$$ ##TITLE= Audit trail, XWIN-NMR		Version 3.5
$$ ##JCAMPDX= 5.01
$$ ##ORIGIN= Bruker BioSpin GmbH
$$ ##OWNER= she
$$ F:/spectra/data/she/nmr/H-F/1/audita.txt
$$ ##AUDIT TRAIL=  $$ (NUMBER, WHEN, WHO, WHERE, WHAT)
(   1,<2020-10-02 10:47:06.73 +0400>,<she>,<DPX200>,
      <created by zg, POWCHK disabled, PULCHK disabled
       configuration hash MD5:
       00 E9 B6 7A A2 85 ED C7 34 08 36 98 17 FE 4E 26
       data hash MD5: 16K
       92 88 C6 9B 7E D2 4B 8F 1F F7 5D 13 FC 99 1D 35>)
$$ ##END=
$$ 
$$ hash MD5
$$ EF 64 5A 2D 51 90 FF 40 39 2C 62 94 61 C6 33 00
##$RELAX= 
##$RELAX= 
##$RELAX= 
##$RELAX= 
##$RELAX= 
##$RELAX= 
$$ Bruker specific parameters
$$ --------------------------
##$DU= <F:/spectra>
##$EXPNO= 1
##$NAME= <H-F>
##$PROCNO= 1
##$TYPE= <nmr>
##$USER= <she>
##$AMP= (0..31)
100 100 100 100 100 100 100 100 100 100 100 100 100 100 100 100 100 100 
100 100 100 100 100 100 100 100 100 100 100 100 100 100 
##$AQSEQ= 0
##$AQ_mod= 1
##$AUNM= <au_zg>
##$AUTOPOS= <>
##$BF1= 200.13
##$BF2= 200.13
##$BF3= 200.13
##$BF4= 200.13
##$BF5= 200.13
##$BF6= 200.13
##$BF7= 200.13
##$BF8= 200.13
##$BYTORDA= 1
##$CFDGTYP= 0
##$CFRGTYP= 5
##$CHEMSTR= <none>
##$CNST= (0..31)
1 1 145 1 1 1 1 1 1 1 1 1 1 1 1 1 1 1 1 1 1 1 1 1 1 1 1 1 1 1 1 1 
##$CPDPRG= <>
##$CPDPRG1= <>
##$CPDPRG2= <>
##$CPDPRG3= <>
##$CPDPRG4= <mlev>
##$CPDPRG5= <mlev>
##$CPDPRG6= <mlev>
##$CPDPRG7= <mlev>
##$CPDPRG8= <mlev>
##$CPDPRGB= <>
##$CPDPRGT= <>
##$D= (0..31)
0 1.2 0 0 0 0 0 0 0 0.06 0 0.03 0 0 0 0 0.0002 0 0 0 0 0 0 0 0 0 0 0 0 
0 0 0 
##$DATE= 1601621226
##$DBL= (0..7)
120 120 120 120 120 120 120 120 
##$DBP= (0..7)
150 150 150 150 150 150 150 150 
##$DBP07= 0
##$DBPNAM0= <>
##$DBPNAM1= <>
##$DBPNAM2= <>
##$DBPNAM3= <>
##$DBPNAM4= <>
##$DBPNAM5= <>
##$DBPNAM6= <>
##$DBPNAM7= <>
##$DBPOAL= (0..7)
0.5 0.5 0.5 0.5 0.5 0.5 0.5 0.5 
##$DBPOFFS= (0..7)
0 0 0 0 0 0 0 0 
##$DE= 6
##$DECBNUC= <off>
##$DECIM= 32
##$DECNUC= <off>
##$DECSTAT= 4
##$DIGMOD= 1
##$DIGTYP= 9
##$DL= (0..7)
0 120 120 120 120 120 120 120 
##$DP= (0..7)
150 150 150 150 150 150 150 150 
##$DP07= 0
##$DPNAME0= <>
##$DPNAME1= <>
##$DPNAME2= <>
##$DPNAME3= <>
##$DPNAME4= <>
##$DPNAME5= <>
##$DPNAME6= <>
##$DPNAME7= <>
##$DPOAL= (0..7)
0.5 0.5 0.5 0.5 0.5 0.5 0.5 0.5 
##$DPOFFS= (0..7)
0 0 0 0 0 0 0 0 
##$DQDMODE= 0
##$DR= 18
##$DS= 0
##$DSLIST= <SSSSSSSSSSSSSSS>
$$ [...]
##$SUBNAM2= <"">
##$SUBNAM3= <"">
##$SUBNAM4= <"">
##$SUBNAM5= <"">
##$SUBNAM6= <"">
##$SUBNAM7= <"">
##$SUBNAM8= <"">
##$SUBNAM9= <"">
##$SW= 16.880792210976
##$SWIBOX= (0..15)
0 0 2 0 0 0 0 0 0 0 0 0 0 0 0 0 
##$SW_h= 3378.37837837838
##$TD= 16384
##$TD0= 1
##$TE= 0
##$TE2= 300
##$TE3= 300
##$TEG= 300
##$TL= (0..7)
0 120 120 120 120 120 120 120 
##$TP= (0..7)
150 150 150 150 150 150 150 150 
##$TP07= 0
##$TPNAME0= <>
##$TPNAME1= <>
##$TPNAME2= <>
##$TPNAME3= <>
##$TPNAME4= <>
##$TPNAME5= <>
##$TPNAME6= <>
##$TPNAME7= <>
##$TPOAL= (0..7)
0.5 0.5 0.5 0.5 0.5 0.5 0.5 0.5 
##$TPOFFS= (0..7)
0 0 0 0 0 0 0 0 
##$TUNHIN= 0
##$TUNHOUT= 0
##$TUNXOUT= 0
##$USERA1= <user>
##$USERA2= <user>
##$USERA3= <user>
##$USERA4= <user>
##$USERA5= <user>
##$V9= 5
##$VALIST= <valist>
##$VCLIST= <CCCCCCCCCCCCCCC>
##$VD= 0
##$VDLIST= <DDDDDDDDDDDDDDD>
##$VPLIST= <PPPPPPPPPPPPPPP>
##$VTLIST= <TTTTTTTTTTTTTTT>
##$WBST= 1024
##$WBSW= 4
##$XGAIN= (0..3)
0 0 0 0 
##$XL= 0
##$YL= 0
##$YMAX_a= 382160
##$YMIN_a= -287438
##$ZGOPTNS= <>
##$ZL1= 120
##$ZL2= 120
##$ZL3= 120
##$ZL4= 120
##$ABSF1= 10
##$ABSF2= 0
##$ABSG= 5
##$ABSL= 3
##$ALPHA= 0
##$AQORDER= 0
##$ASSFAC= 0
##$ASSFACI= 0
##$ASSFACX= 0
##$ASSWID= 0
##$AUNMP= <proc_1d>
##$AZFE= 0.1
##$AZFW= 0.1
##$BCFW= 1
##$BC_mod= 2
##$BYTORDP= 1
##$COROFFS= 0
##$CY= 11.3945322036743
##$DATMOD= 1
##$DC= 2
##$DFILT= <>
##$DTYPP= 0
##$F1P= 16.9975609425685
##$F2P= -3.02152046262296
##$FCOR= 0.5
##$FTSIZE= 0
##$FT_mod= 4
##$GAMMA= 1
##$GB= 0.15
##$INTBC= 1
##$INTSCL= 1
##$ISEN= 128
##$LB= 0.24
##$LEV0= 0
##$LPBIN= 0
##$MAXI= 10000
##$MC2= 0
##$MEAN= 0
##$ME_mod= 0
##$MI= 1.114404
##$NCOEF= 0
##$NC_proc= 0
##$NLEV= 6
##$NOISF1= 3.799351
##$NOISF2= 2.8
##$NSP= 1
##$NTH_PI= 0
##$NZP= 0
##$OFFSET= 15.70392
##$PC= 1
##$PHC0= -10332.18
##$PHC1= 19.60089
##$PH_mod= 1
##$PKNL= yes
##$PPARMOD= 0
##$PSCAL= 0
##$PSIGN= 0
##$REVERSE= no
##$SF= 200.130013532006
##$SI= 16384
##$SIGF1= 3
##$SIGF2= 2
##$SINO= 400
##$SIOLD= 16384
##$SREGLST= <1H.CDCl3>
##$SSB= 0
##$STSI= 0
##$STSR= 0
##$SW_p= 3612.71676300578
##$SYMM= 0
##$S_DEV= 0
##$TDeff= 0
##$TDoff= 0
##$TI= <>
##$TILT= no
##$TM1= 0
##$TM2= 0
##$TOPLEV= 0
##$USERP1= <user>
##$USERP2= <user>
##$USERP3= <user>
##$USERP4= <user>
##$USERP5= <user>
##$WDW= 1
##$XDIM= 8192
##$YMAX_p= 0
##$YMIN_p= 0
$$ End of Bruker specific parameters
$$ ---------------------------------
##NTUPLES= NMR FID
##VAR_NAME=  TIME,          FID/REAL,        FID/IMAG
##SYMBOL=    X,             R,               I
##VAR_TYPE=  INDEPENDENT,   DEPENDENT,       DEPENDENT
##VAR_FORM=  AFFN,          ASDF,            ASDF
##VAR_DIM=   8192,          8192,            8192
##UNITS=     SECONDS,       ARBITRARY UNITS, ARBITRARY UNITS
##FACTOR=    0.000296,      1,               1
##FIRST=     0,             0,               0
##LAST=      2.424536,      0,               0
##MIN=       0,             -287438,         0
##MAX=       2.424536,      382160,          0
$$ Real data points
##PAGE= N=1
##DATA TABLE= (X++(R..R)), XYDATA
$$ [...]
1742A75N5l99K09q4L19m51O68L00m59j24L39j92p4N57l10KK31K19o33j7L25n31
1764A25p7Q3n16n35N12n89n20R91o2lk18O87m95L2N67J59l01K25L88r45O98j25
1786H1m80Q08j30J44l30L51k06k79J8O18n39m15M27q17J61J65j45N6N12k2n35
1807e57O76L2J79j88R92l29n49L30j32k66J21N52q78M61j43m29J82K2L54k93q
1828A29P2m08J36M5j13k71N10o05K65j66L04j00J3M99l27K92j44kj71M90j34j73
1850A41j15j48k1k91P87n97Q2N81o52LmK36n21Q24l83j39J07lo8j98O29m6J07
1873C11k17r1j64k07L83j87M74k92J06L64k85J36l22K21J57o8m38k0K32j65L80
1894C08l93J61j90M86m58K88J32k70K17m8o8o61M64m84m0J60J93lK56l6k37K63
$$ y = [175, 230, -169, 40, -44, 275, -176, 492, 792, 333, 209, 548, 356, 282, 839, 529, 531, 762, 981, 348, 331, 656, 125, 48, 131, -385, -920, -408, -997, -1517, -526, -588, -591, -809, -122, -617, -585, -18, 141, -160, 65, 453, -492, 206, 81, -399, 409, 279, 423, 93, 444, 238, -41, -23, 595, 56, -359, 68, -749, -588, -423, -568, -512, 0, -22, -557, 119, 151, 330, 142, 1134, 805, 256, 586, 454, 188, 309, 861, -17, 444, 301, -128, 54, 76, 430, 137, 129, 201, -207, -71, -26, -139, -410, 100, -505, -240, -406, -102, -202, -189, 310, -17, 275, 131, 129, -42, 448, 314, 141, 26, -122, -143, -434, 353, -244, -162, 419, -233, -230, -234, 2, -519, 305, -78, -217, -110, -113, -181, -379, 250, 204, 311, 94, 3, -161, -368, 15, -172, 302, 10, 116, 480, 195, 331, 9, 230, 387, 319, -119, -139, 93, -72, 308, -85, 76, -114, 372, -86, 202, 334, 64, 281, 233, 165, -496, -32, -516, -556, -396, -203, -206, 50, 14, -223, 40]
1916D0J75L4p5j98K21r00M55K12l15J3K08j12J19L63k07RJ03K39n96J14l41J9
1938d20J68P4j44k45M82m29N36j30M23n6l43Q32l67k6J20j95Qj34L05k61K60q37
1960c79K36j01L78R2m47M33k68K26m30J09k84K95J75k08P0k17K39l32N65J43j48
1981A47k06j1L62k90N93n23J96K18n25l05j07M28k05k0P2Q6k06K91J34o33M25
2002g9k18L63k76J07J15r1J23q8K91k60L22m46J58j00j43N58k32l1k20K84l55
2023b18k54K32N0Lm33J80k66N1J31k01M34K5O9J52L8N08l74k3J0K27m05J89m24
2046b99j04K30J04l25M48k9j53J36K0K8j12m5Nl81J70Rk50J91L20n08N83q5m2
2069h9J51J81K03n36N34k02P7j94J15l06j58M42o90N21n47M61j11O5K45k64J60
$$ y = [40, 215, 249, 174, -24, 197, -703, -248, -36, -351, -338, -130, -242, -123, 240, 33, 42, 145, 384, -212, -98, -439, -420, -252, -178, -322, -567, -85, -514, 22, -108, 315, 259, -84, 748, 381, 355, 475, 280, 288, 154, 459, 198, 458, -379, -143, -244, 134, 226, -221, 212, -56, 170, -260, -151, -435, -140, 35, -173, -103, -320, -81, -413, 152, 295, 147, -59, -70, 292, 2, 595, 72, 268, 486, -39, -344, -451, -23, -228, -248, -176, -90, -296, -5, 129, -504, -79, -297, 66, -210, -103, 12, -79, 44, -44, 247, -13, 309, -137, 21, -79, -222, 336, 104, 73, -147, 137, -218, -472, -240, -190, -187, -620, -440, -706, -655, -524, -725, -291, -266, -197, -45, -7, 501, 127, 104, 114, 341, -64, 125, -299, -403, -173, -69, -394, 54, 25, -128, 8, 28, 56, -56, -101, -96, -477, -307, -298, -548, -357, -37, -545, 38, -47, -89, 62, 243, 446, -90, 444, 242, 319, 125, 240, -66, -224, 218, -472, 49, -498, -37, -148, -83, 162, -102, 58]
2090E8l72N04m83M59k79j5rj04K98k85L38K73k5m3J43k06J57m4k02K76j80m10
2112a51L6j76L89j89J43k96J91l90K23K0j92K36o5K21k86M37k99J46r1M9K49q0
2134A25L20q44P22l34R2K36l00K84l10K42l07J84j87J88l9l05K06l24L50j34K26
2155I1K29j2k5m5K85n3K83n28N51k29n5m1m80K63KL34n07K53m3p1N7l46M07j41
2179A79P3J1l54M4j62K58K57k53j14J11l23K32P7K73K52l23K27l56K14l51K68
2200B40k67N5Q9l89K86k02K38k9J98n6k23J67j40p0RO1l26M09k8K5j84n0L27k25
2224h5J78K54p6p5j27K7k00M00r3r6k04M5J28j10L57j27J20m45M12j24m3K09n7
2247B68K68n35J42OR6r8j00L12Kq0k09J35o1%j84O2L37j84n0j94J72j17J35k64
$$ y = [58, -314, 190, -293, 166, -113, -128, -137, -241, 57, -228, 110, 383, 358, 315, 458, 252, 409, 365, 163, 439, 259, -151, -115, -291, 98, -91, 52, -244, -53, -443, -220, -200, -392, -156, -221, 0, -286, 151, -148, -2, -93, -44, 205, 125, 445, -399, 323, -11, 81, 317, 17, 301, -9, 233, -74, 110, -77, 111, 72, -233, -27, -351, -1, -135, 91, 320, 308, 283, 238, 523, 470, 753, 225, 776, 547, 492, 451, -29, 234, 236, 570, 63, 316, 273, 202, 259, -87, 320, 179, 252, 263, -91, -47, -209, 49, 306, 53, -61, 50, -273, -41, 36, 309, 561, 238, 465, 109, 323, -28, 240, -27, 28, 117, -272, 14, -188, 50, 21, 219, 163, -60, 107, -33, -103, -94, -33, -359, 50, 22, 47, -137, -187, 140, -85, 93, 347, 271, 196, 69, 96, -104, 296, 203, 107, -97, -52, 76, -34, 323, 196, 316, -129, 283, 159, 116, 325, 268, 536, 1, 143, 149, 245, 147, 47, 359, 361, 281, 72, 207, 146, 146, -38, 24, 361, 177, 127, -67, 105, -12, 123, -141]
2271a41K78pj58J6K16j36k52J09R8J04k65K42j35j49L41l03J86r7k51J96k69O7
2293c10K52J67j89kk4j9J04j22L64l53K28j19k04K08k54K15j05J83k54L55o4L67
2315D24l62N7J98j10k38j83M28l17M7j33K68K36n89L32MK99l60K64n6L7J59q47
2337d42N12k97L03J01q7p3Mk5O4J07j99J33J46m84J12K81j09j36K53l67K48j49
2359a04J69m8O6j91N2J94r9o4l06L49K89m07k28L31k14nJ46nRJ47q8P2j61K16
2383A20j3m1j29J21J27k44J85m11N39j57M12o26J21m4nj31K24O6j97J25j4N6O3
2406A47k08K31k88O6j97J89M7j56L50m11M52k56L67k32k15L15k81J26K48l45J59
2427A08l9l07J8K39j57L54l22Qn1J80l4k88O2J46k57J76K51l92K59K5j07Pj1K11
$$ y = [-141, 137, 130, -28, -12, 204, 68, -184, -75, 23, 127, -138, 104, -31, -180, 161, -142, 44, -53, -304, -108, -377, -310, -58, 109, -80, -82, -106, -125, -21, -143, 221, -132, 96, -23, -227, -19, -273, -58, -163, 20, -234, 121, 57, 424, 62, 119, 317, 207, -31, -214, 214, -103, -56, -189, 79, 315, -274, 58, 62, 361, 1, 265, 209, 246, 405, -442, 70, -227, 76, 177, 90, 17, 21, -4, 60, 167, -32, 101, 247, -237, -125, 156, 47, -89, 164, -203, 45, -104, 65, 17, 83, -108, -56, 138, 39, -25, -331, 18, 307, -100, -328, 3, -211, -216, -70, -75, -66, 81, -7, 65, -96, 120, 107, 66, -63, 58, 185, -59, 126, -285, 254, 97, 509, -117, 4, -40, -45, -176, 48, 114, -83, 42, 28, 84, 147, -61, 170, -118, -52, -249, -60, -13, -169, 181, -230, 222, -34, 333, 101, -114, 201, -80, 46, 294, -51, 108, 69, -238, -220, 19, -138, 216, -106, -98, -149, 31, -3, -291, -229, -83, -340, -164, 87, -305, -46, -21, -128, -121, -132, 79]
2451G9m8P8m2p6K04J58j08n28L52j23K07q8j2q6j9K69l98J77K26Pn8J05k10k74
2475b08K59nm1K84k26k80M47j08J97L6J91l27r6K31j41J17j26j38L01k66j30K13
2497A84O2k24J29J27k41J25j2J50j09J35j14j2l73K23j37J81J83k17j39L27Qp2
2519A84l01K13KJ41j02j16p6J60j69k5M33l62J80k95Q5L79j24J50n19K06j44J44
2541D4k98J94JK95J52l06K4o3J2j18J10n0NJQ2R8l24m1O1J48Qj09qj11K82k08
2567a19L4K2L47r8l80J98k36K18k9%k3K21j46j29Q9r5O0J1K50j88j09j70M9L34
2591A11J29m00M0J48j56qJ55p9j30J62L18n61J59r6N14k82Q7N8j24J59j6l65K85
2614A08k70P9K12k03o6K77l60K57j10N8r3Q8J3j30R2qJ07lQ1l44R1mp2J43j49
$$ y = [79, 31, 109, 67, -9, 195, 353, 245, -283, 69, -54, 153, 65, 53, -33, -52, 217, -181, -4, 222, 229, 171, 276, 66, -208, 51, 46, 5, 289, 63, -217, 230, 122, 319, 355, 546, 219, 123, 354, 213, 330, 204, 66, 367, 101, -29, 184, 246, 22, 151, 278, 37, 162, 150, 300, 191, 326, 212, 200, -173, 50, -87, 94, 277, 60, -79, 248, 256, 184, -117, 96, 98, 239, 137, 21, -55, 105, -64, -89, 344, -18, 162, -133, -48, 331, 207, 357, -162, 44, -100, 44, -254, -60, -59, 236, 388, 82, 106, 43, 55, -63, 47, -3, 2, 3, 85, 183, -141, -182, -121, 27, 35, -74, -82, -193, 89, -119, -85, -63, 284, 186, -194, 4, -232, -14, -43, -43, -66, 155, 9, -120, -31, -126, -66, -55, 195, 7, -102, -272, -223, 111, 240, -160, -120, 28, -128, -136, 19, -60, -190, -28, 290, -271, -112, -208, 306, 24, 111, 169, 45, 204, 188, -177, 108, -162, -83, 129, -74, -140, 137, -223, 34, -76, -18, -111, -23, -10, -140, -48, -56, 51, 48, 129, -215, -124, -128, -200, -57, -206]
2639b06K14R9jm01J51p2J03J24Km6l41K57J1j57K1j30J93K6J25j80j04K63m5K56
2663A62l71L31l07N4MK36k67R0j66J87L0q9L17m89K52K12l89J30k21J18K15K7
2685F6Q7j65q2k18L68l38J51N7n0M7K5K5J12j97K84o3j45k67M00k3n7J85j69l1
2709BJ65l40K11j2j69L35m91K01m4J60M8M1j58lK15k23o7M5O4O1o0J04j45J39
2733G9k13K11k55K73l0j26R3N3k13n6L97m74L8l5R2K55j16j7K5K19k32k5k11L37
2757F9l95J80M04k79L8K2o7J9m8n7j31n8K52Oq5O1o9J29L5ro0p0L6Q5K33j23n3
2784F5K84k10l3l79Q4J24k4j19L40o4k06J5J01q8J10K61k90K1LJ33Jj68j6J09
2808E4qK2k33R1O2k90J54L7j31L3R9J14o0j54K26j44kN0lp3J07r6J94k5j07J56
$$ y = [-206, 8, 107, 106, -295, -144, -216, -113, 11, 13, -33, -374, -117, -106, -263, -242, -372, -179, -153, -28, -208, -312, -49, -94, 162, -209, 122, -185, -131, -127, 109, -158, -68, -234, -47, -17, -106, 211, -278, -26, 186, -203, -73, -294, -176, 39, 66, 153, -12, -94, -312, 56, -282, -131, -74, -124, -77, -52, -27, 85, -112, 172, 109, -36, -303, 97, 74, 17, 202, 33, 2, 167, -173, 38, 26, -143, 192, -299, -98, -142, 18, 66, 107, -51, -54, 161, -62, -129, -84, -20, 41, -19, 85, -60, 79, -134, 77, -178, 95, 65, -61, 32, 85, -128, -184, 213, -261, -223, -258, -166, 89, -27, -44, -19, 200, -32, -57, -268, 69, -326, -146, 258, -21, 17, 39, -28, -9, -57, -114, -245, -303, -51, -45, -130, -69, -138, -9, 26, 17, -43, -113, -77, 8, 241, 118, 65, 349, 139, 106, -273, -189, -65, -89, -208, 132, 68, -138, -123, -22, -110, 0, 261, -29, -8, -5, 128, 129, -39, -55, 54, 46, 68, -165, -74, -12, -302, -148, -111, -242, -209, -110, 4, -56, -210, 16, -128, -130, -80, -83, -156, -49, -145, 49, 24, -83, 73]
2834G3M4j26K86j65J46j58l33J73J33k19K27o3k4n9j05L88k53J67l21L03k66K25
2856G3j51K28l67qJ81R1k8r7K08j15m5R7k39K55j88j70J50L2r1M0Rk92J76J23
2880a28J72p2O3k2N0j05j1j43J33M4k34J39L69n19K16J22j52L2k0l2m7O2J91k11
2904a03q3K54k1k9R6k88L2J80p7j46K81j6k24J84P8j68p2%J04n6L9m3O3M4q6M0
2930a7K5j52L7J41j47J60l7Q6j40K29l91J91m6j12K71j38J72j86n7K1R3j64K37
2953G6k8M9l60K81N3k00K57l12K28k6l53K82o4M2R2j71K28j46N0k51M72k65L12
2976B46l67R6M27l34j54p5J11N4k9j92K23j14L94k88m3K92j69j14Q0P5k28j12
2998b21K97q5N5j03pL6k26L47j29M3Q8o9k81J55J25J87P1k51P6k74J78ko1J14
$$ y = [73, 117, -9, 277, 112, 258, 100, -233, -60, 73, -146, 81, 18, -6, -65, -170, 218, -35, 132, -189, 114, -152, 73, -78, 150, -217, -225, -44, 47, 19, -78, 130, 15, -30, 67, -172, 83, -105, -275, -125, -93, -184, -144, -135, -427, -251, -128, 44, -28, 35, 13, 63, -42, -53, -196, -63, -19, -253, -114, 255, -264, -48, 74, -78, -46, -66, -98, -145, -83, 108, -103, -186, 68, 47, 18, 114, -174, -142, 38, -39, -185, 96, 80, -144, 40, 118, -50, -122, -122, -18, -74, -35, -78, -15, 29, -57, -17, 8, -144, -107, 34, -113, 47, 10, 96, -44, 185, -206, -15, -61, -173, 98, -40, 132, -54, -111, -90, 3, -161, 76, 48, 97, -263, 18, 71, -129, 128, -184, 44, 18, -335, -53, -117, -75, 17, -154, 74, -72, -22, -273, 199, -66, 246, -121, -25, 402, 68, -86, -161, -50, 4, -25, -217, 6, -108, 286, -2, -45, 247, 78, -36, 44, 119, -109, -221, 76, -9, 46, -57, -64, -28, -254, 93, -36, 7, 95, 26, -255, -100, 25, 212, 283, 32, 108, -166, 12, 10, -51, 63]
3022F3q8k32L11o6P9k4q1J48o42L43M03j54J94K2m50O7LJ27r9L52k25o6%Q4j64
3047i5R3j21R0j28L45k39k22N97l68K01J10l50J04j18K1J56j43K16m8o7K8K09
3069B71k87j7P7k0L8j01P8j95L29l05k3J80L40k96k1R1ol12j2L18l54K12n6o1
3093a32M9N4j54QL01n9j1j6j58J61j49k89Q9L83l15J98J00j27K63k60P4r4K56
3116A72lm4n6j89q2J55J57l0K5j44Jm9K56k32j18L14j11j6J45r0o4j85L68r7j33
3141e0j67J47j76M82k76K68k14n7q7P4J64j0J52j71Q1j25k6j29K50J25m20J46
3163a9O6j10M9j06J10L3j22K68j72j13P3K62m75L85k67N8J12q0J55j13J0J67j22
3186D9j87L1J54m6p2J04n6J09j43PQ3j00J83k27J11o4J54l74L80J17l31J65m5
$$ y = [63, -25, -257, 54, -12, 67, 43, -38, 110, -532, -189, 214, 60, 254, 276, -174, -107, -104, 23, -76, 276, 51, -15, -15, 69, -95, -2, -123, -33, -161, 184, -55, -277, 320, -48, 153, 263, -87, 17, -101, -80, 76, -67, 149, 101, 34, 62, 271, -16, -33, 44, 24, 62, -39, 39, -156, 173, -132, -155, 25, 365, 69, 48, 139, 133, -179, -191, 127, -227, -15, -71, -132, -83, -29, -183, -175, 126, 67, 56, 40, -118, 43, -106, -395, -306, 77, -238, -40, 60, -67, 196, -64, 10, -84, 172, 169, 125, 69, -120, -202, -47, 110, 80, 105, -39, -38, -87, 169, -63, -181, 133, 22, 6, 151, 61, -3, -188, 180, 83, -50, -217, -70, -246, 236, -40, 228, 14, -43, -130, -56, 108, 98, 250, 79, 160, 35, 9, -120, 130, 255, -165, -19, 47, -63, -14, -120, -10, 23, -99, 169, -3, -116, -43, 219, -256, 129, -138, -80, 32, -48, 107, -6, 4, 171, 49, -138, -107, 47, 1, -71, 33, -23, 86, -57, -50, 33, -67, 116, -111, 0, -64, 90, -284, 96, 213, -118, 47, 2]
3209BK8k5J74j30k9j21K27l13N35m82n4L57J08l40K5j0J11k8j21J12m1L01j5m12
3233a41J31j2K79j20l14L22r4rl7Q1m5l06L8J41J01P4j23P9r3J78k17J05O3J36
3257B17j92lPj84J87j4l15J14N2M94m45K22k09k4K05l0j14J26j87R1Lk24L21j75
3281g7j83J51K70j67j6QJ77l41K26R3k30M07m78J40J08j95K94m66L04K9J8j21
3303d9K28j28L8j31p3J40J71l19j44L52jN3j88j25l4N0J59qq8j49J68l8J29J2
3327B5M7O1k74K35k10J2J96k28J27p1J19J95m12j02O76m90M0OK0K9J00k66J53
3350a2j08J5J39J41k48LJ14j06J44L5k54J54K05j95Q6l25Q7J29J48k32L33j04
3372A49k3q0J05Nl50P7R2M1p8j30Q9R8jRo2O9pK03l29K22j84p4k7L56j60j19l5
$$ y = [2, 30, 5, 179, 49, 20, -101, 126, -187, 348, -134, -188, 169, 277, -63, -38, -48, 63, 35, -86, 26, -15, 286, 271, -141, -10, -22, 257, 137, -177, 145, 51, 42, 5, 86, 41, -265, -227, -86, 15, 89, -34, 45, -48, 130, -87, 18, 81, 217, 25, 22, 29, -155, 32, 18, -297, -183, -131, 363, -82, 140, -69, -93, 112, 82, -32, 94, -93, -2, 1, -223, 98, -77, -260, -109, 161, -6, -22, -14, 163, -178, 48, 141, -89, 318, -160, -20, 88, -107, 187, -279, 25, 54, 72, -49, 179, 51, 89, -42, -115, 25, 196, -123, -267, 85, 84, 137, -51, -176, -210, -160, -1, -9, -97, -246, -78, -116, 13, 25, 72, 133, -141, 94, -116, -104, 92, -136, -9, -80, 39, 234, -178, -280, 396, -94, -54, -48, -28, 1, 101, -165, -12, -120, -105, 34, 175, -73, -70, 44, -62, 82, 117, -137, 17, 222, 27, 113, -212, -125, 4, 152, -80, 253, 149, 126, 46, 151, 156, -194, -117, -25, 16, -62, -192, -103, -5, -6, 3, -59, 10, 3, 206, -123, 99, -85, -159, -186, 170, 10, -109, -144]
3399a44J9J61J7M0L7N9j58J0m06N66k97J01k12L86k24r2lJ51j05k17M28k41J58
3422C4j6j5N6l36L90n3R4j39K43k07J4j1N20l22j66K42o11N04k04J25j25J34j11
3445D0J45nk1k30J21O5k1J57O6L48q67N7j53L03N8k31P0O9p0J25Q5K16k61j63
3469i7J25j02K82j88K3J19K0k95K96l02K51n3k06Q9L07l25K8J39n9J3k38R0Q7
3492Dj7J31j22j5J26kj98M12k47k12J40L3J35k94j14M13j10m3M4k20J92K2j54
3515i6J85J06j38J62k42k42L26j7kR0l44J36P6R1l51K14J94j62J07r9l64L39j8
3538d9MM6l5r1R5J3j26L21rk85J77q8j74K92j88J40J13k12K23j56n5K75l65J31
3562cj13J80K7j78M9R2j97K59l59L02p3P3J66l02j89J54K63j23n4J02O7k01Q2
$$ y = [-144, -125, 36, 53, 93, 130, 189, 31, 41, -365, 201, -96, 5, -207, 179, -45, -137, -140, 11, -94, -311, 117, -124, 34, 18, 3, 59, -277, 113, 60, 154, 15, 258, 51, 65, 54, 574, 252, 86, 328, -283, 221, 17, 142, 17, 151, 40, 185, 180, 159, -71, 50, 115, 94, 251, 317, 665, -202, -145, -298, 5, 63, -168, -98, -29, -99, 26, 111, 327, 66, -97, 28, -74, 208, 20, 43, 162, 182, -113, 183, -119, 132, 79, -127, -38, 269, -56, -28, 111, 52, 65, -173, -83, 4, -13, 118, -4, -19, 107, 105, -93, 319, 72, -140, 0, 33, 168, -126, -240, 173, 63, 20, 64, -156, 36, 58, -96, 89, 195, 57, 219, -23, -265, 61, 44, 42, 132, -212, -76, 0, 91, -260, -46, 148, -14, 93, -6, -370, -31, -49, -45, 1, -34, -125, -30, -17, -143, 178, 169, -116, 61, -27, -201, 91, -97, 43, 156, -56, 167, 11, -44, 231, -134, -3, -116, 64, 91, -87, -38, 54, -143, 116, -243, 59, -14, 59, 225, -77, -266, -112, 151, 28, -26, 76, 143, -58, 24]
3585B4J11R4k52N2j32J93m7k89N04k70J24l15K48J16j93K42j87J52l37K48k63
3606a77J72k63L63M1M66o20P92m95m70N1K42l91L22j88O5L39l78M16l44r8O0J97
3628A02j86M0J64m1k17J96l2m6kk0J61r3J79j30j06J23k5m2O3J40j60j56L33k57
3652a2j2j96K7L56j12o5r7Q1K76k59j80M69k12j35o5q2O1L85k75n7J76j61L78
3675B89k89J71l42J54K72k52k26M50m11K55j47J87j81J2p7K23p8P0k22j38K54
3696b6L3Nj18K93j1l28K90j88J50R3k3k37k28L65l81L10j13K66j65J26k59L7J93
3719H4k49J49j14K36k73K87K7l3L3j73J00o9k20M45l44l4J57j24J62M0P3j13J0
3742E7k8q9J46p2K4N4J0j75K6OJ86l06j9L82l40K63k6j48k4J59R6lj36J19j67
$$ y = [24, 135, 229, -23, 29, -103, 90, 43, -246, 258, -12, 112, -203, 45, 161, -32, 210, 23, 175, -162, 86, -177, -5, -268, 95, 136, 602, -18, 774, 279, -191, -140, 102, -289, 33, -155, -90, 249, -129, 287, -57, -155, -95, 102, -84, -44, 120, 79, -138, 58, 26, -20, -22, -42, 119, 26, 205, 75, -31, 92, 67, 25, 88, 228, 68, -88, 245, -12, -24, -220, -193, 163, 51, -14, -111, -30, 246, -13, -193, 276, 64, -71, -136, -218, -157, 228, -47, -104, 72, -89, 289, 0, 171, -171, -17, 255, 3, -223, 227, -184, 71, -76, 111, -70, -58, -135, 88, 10, 80, -142, -280, -26, 7, 12, -106, 187, 176, -152, 138, -50, 100, 193, 170, -67, -295, 70, -311, -1, -114, 152, -13, 113, -146, -109, 84, -165, -16, -130, 106, -167, 120, 147, 114, 147, -26, 74, 5, -215, 230, -114, -148, 9, -115, 47, 87, 160, 47, 57, 29, -60, 86, 14, 38, 92, 102, -73, -47, -41, 145, -161, -180, 202, -138, 125, 99, -49, -73, 86, 182, 179, 43, 162, -5]
3767eJ61j11j19K94j82O0j83J82k56L20k50R7j34L22p0j84J2J88n0p0n8j17M3
3790a10J68j33m6P8J84j16k9k6j03J41N3J68m55L90l87K01K89l04n9k15J89L3
3812h9L22j23n2j39J70p0k0R6p1o7k18J25K47o4P9l8k15l7J48J17j70J55k1K4
3836H9j57R4j74L04m8j67K61k07P9p4m4o2K0J31j02J87j17J62k08K36k69K08l08
3859a66L9Q1J16j08j90K48q6J25M5r8J4J93K74j028N11K6o8L23m07K64q8l9N0
3882C1N4l3N8L6kn4J8j20m8J39j86J19n8O0l1Nj3J97J39l83nK33j71K8k01m0K18
3909a0K08k18j04P7O1R2m21M20j4n3K28j70j81J52j77J80L8N7r4l55K99l1J04
3932H8p1p1M8j25J01Pj34O2J40j42kj7J86k09J79P9k16N3O9K37k91m8j59K85L2
$$ y = [-5, 156, 45, -74, 220, 38, 98, -85, 97, -159, 161, -89, 8, -126, 196, 126, -58, -46, 142, 92, 22, -36, -153, -110, 58, -75, -121, -43, 141, 25, -4, -30, -133, 8, 61, 229, -226, 164, -223, -22, 267, -37, -96, -311, -122, -89, 233, 110, 58, -81, 89, 19, -1, 95, 24, -43, -261, -136, 111, 47, 126, 88, -127, -164, -16, 101, -69, 86, 65, 89, -68, 26, -148, 156, 108, -59, 202, -5, 74, 0, -44, -106, -86, 45, -57, 130, 13, 175, -33, 203, -66, 142, -166, -127, -46, 70, -38, -228, 20, -66, 59, 104, 6, 20, 213, 487, -541, -30, -4, -72, 251, -156, 108, 20, -19, 31, 85, 52, 110, 146, 144, 90, 108, -12, -60, 79, -107, 12, -46, 14, -17, -12, -25, 172, 311, -72, -77, 156, -15, 13, -188, -228, -10, 198, -20, -124, -47, 14, 106, -315, 105, 91, 38, 266, 96, -85, 67, -110, 70, 108, 165, 71, -284, 15, -16, 88, 17, -54, -6, -131, -30, -23, -157, -95, 45, -97, -99, -116, 70, -139, 40, 119, -97, -44, 25, 262, -29, -77, -236, 49, 81]
3957H1o5k00J00M9j99K08J89K9o0P7k68L59m98O10m37k4K8M9J6N6m4l02Q9N2K6
3982g9K04P1k48R2j69K47j55J99k97K64k5nr3Nj16N5K68l49k1J19P6N9j67Q3p4
4007e6j75K45J2j58J10j27L85j31o1k4q4K54k60J84q5j47M4L46l02o5J72j97J55
4030C5j0P7M7j49k70K42j59J24K62j43J13l04K49q7q9R3K03l65J49l1J57m39L23
4053B8J91k94j93mL19j74Q3P0j08j15K37k24q8K69K8l5J11P2k56L21j27o4j71
4076a24j45L48j35J08p1PP6n3m44N52k62K17j27J28j87L18n1j67k7J8Q5j11J38
4099I1q7K03j91J38j17p7r4J73j2J26j8Q4k07j20L8N5k22P1j15L11m7N5j8QJ52
4124A80k72J75j1J01l01J02Q3n5K2K0j25pJ30k97N83j48j84L8q3j70M21K2j18
$$ y = [81, 16, -184, -84, -35, -234, -26, 163, 192, 132, 209, -59, 300, -198, 412, -25, -49, -21, 28, 44, 100, 56, -246, -157, -105, -79, 125, 196, -52, 40, -129, 118, -37, 162, -135, 129, 104, 99, 6, 11, -105, -50, 218, -131, -152, -33, 43, 102, -65, 18, -56, -231, 14, 26, -132, -22, -149, 236, 105, 44, 20, -64, 190, -70, 114, 29, -118, -74, 272, -30, -95, 77, -120, 35, 25, 102, 149, 0, -270, -28, -187, -63, 199, 56, 169, -135, 114, 27, -62, 31, 234, -131, 18, -13, 144, -295, 28, 219, -75, -268, -272, 47, -127, -44, 26, -82, -197, 40, -184, -272, -3, 25, -10, 101, 173, -83, 238, 111, 47, -124, -269, 79, -56, 52, -19, -12, 64, 11, -433, 119, -143, 74, -53, 75, -112, 206, 155, -12, -39, -21, 64, -47, 91, 4, 207, 16, 154, 37, -40, -134, 39, 27, 153, 135, 219, 12, -108, -70, -15, -237, -166, -281, 30, -17, 38, 20, 28, 180, -92, 83, 72, 173, -128, -26, 57, 2, 24, 44, -81, -88, 42, -255, 328, 180, -4, 34, -49, -219, 202, 224, 106]
4147A06j98k33L79k37J15M7j23j77K64J72k02J6p3r8K40R3r1q2l2k9M09j75k74
4170a83K10n7J60k11q7J93m0M1j56J94o8Q2k15J43L1mL7j51l8J18j38P8L28n2
4194B15k17m7M0J84j19j98J93l3Q3p8Q1l3J9j90K74k75n4K66p7o1m1Q4M4L2l1
4219F1O0k59P4K36k35j80J34P0m0P5J80j0k21k09K28r3N5J99k12J04l17M87j49
4242C8j4p3m9O8r1K36j10m0Q9Op1r6L51k46Q0j07R9j29Q8j62J69Q9l19L23p4k7
4268B8j19p0L02k22Q9o5K43k28L6PK55k06l0M8k72L89k25j8k70M59j46qK9KR7
4293A05p2P4m4O7M6j34J26k2jJ79m08J40j23k19L74p0J33l02K81l5j31m7M7K53
4317B17p4J16l94J14J14m8o4N1P5r5j26J14J57j78R5O3j16p2o2OK48r5j31o3L0
$$ y = [106, -92, -325, 54, -183, -68, -21, -144, -321, -57, 115, -87, -71, -144, -242, -2, 91, 0, -82, -114, -143, 266, 91, -183, 27, -30, 130, -81, -168, 25, -15, 26, -130, 64, -4, 78, -137, 6, 37, 33, 70, -81, -119, -1, -139, -61, 267, 215, -2, -49, -9, 175, 56, -142, 51, 18, 101, 23, 104, 71, 90, -100, 174, -101, -155, 111, 34, -27, -68, 16, 60, 92, 61, 121, -138, -64, 172, -63, -243, -109, -39, -79, -4, 176, 166, -55, -264, -36, -129, -74, 125, -87, 17, -300, 187, 38, 24, -49, -98, -30, -121, 115, 5, -35, 54, 60, -11, -107, 244, -2, 78, -29, 70, -59, 29, -133, 36, 125, -194, 129, 55, 28, -91, -161, 141, -81, 8, -57, 186, -42, -6, 1, 256, 50, 20, 68, -204, 185, -40, -58, -328, 131, -15, -23, 6, 8, 105, 33, 107, 63, 130, 176, 42, 168, 146, 145, 324, -84, 56, -67, -286, 88, 18, 151, -151, 130, 95, -36, -83, -36, 217, 143, 259, -135, -21, 93, 45, -19, 32, 107, 12, -114, 0, 157, -21, 74, 137, 21, -51, -113, -107, 141, 46, -85, -148, -118]
4342a18J75j51N5J63o8j30J05R3k75J91q0J40J36l49M19m48J9n9L9R4R4J25m1
4365A29j66q0L24k90R1k16J31K7j46O3J7J34m9L4J08N3k93R1L3J05k35L03k92
4388a24N6jN5M5Q9l75L70k92J36j2L61l98j48M04k42M3J19k68J23N00k46k20q3
4411a08k1J60l6Q4nk14j9K40l26O7O5J78n4l79M13Q9j90j6P4j89R9LL93m75J32
4436c5JJ96j79J30k06L5R3J20k02j16K15j74K8jOK37n4j37J41j10Mn4MoQ7J9k38
4463a96J82k03K18r4j5J07o6J70p3K6N1o0o2N3j17N3K71k70Q3j72K44k18k21K68
4487d1K11l33J54j4k8L53o67M15L4k16J82j43j8K86k01qj23J08K59k62J23M8q9
4510C0j29K0L52l54k59Q6J56J8J01j97K84r4Q5j71J94j6k50K61k94J23M2r8Q9
$$ y = [-118, 57, -94, -39, 124, 56, -74, 31, 124, -151, 40, -40, 100, 236, -113, 306, -142, -123, -182, -143, -49, 45, 170, 129, -37, -117, 207, -83, 8, -208, -77, -50, -196, -133, -116, 18, -31, 3, 111, 164, -129, -38, -5, 100, -135, 168, -124, -68, -69, -14, 31, 120, -255, 115, -177, -41, -53, 308, -90, -238, 166, -76, -33, 86, -182, -59, 441, 195, -25, -108, -129, 31, -5, 79, 74, -140, -159, 81, -245, -178, -113, 65, 11, -368, 45, 134, -56, -72, 2, -187, -88, -85, 308, -167, -35, -34, 162, -17, 113, -93, -58, 35, 155, -47, -163, 52, -122, -94, -95, -89, 148, 94, -43, 98, -12, -8, -62, -58, -64, 23, 42, -196, -14, -217, 1, -93, -108, -1, -67, 103, 30, 56, 107, 47, -15, 38, -79, -26, 245, -25, 58, -114, 130, -88, -309, -41, 170, -163, -9, -23, -51, 302, -365, 50, 84, -132, 50, -93, -111, 175, -26, -34, -157, -49, 210, -52, 71, 119, 30, -99, -79, 273, -81, -340, -254, -98, -80, 21, -176, 108, 14, 99, -72, 122, 106, -144, 117, -177, -54, -12, -110, -21]
4533b1M1J5P7K13j2k9j45j15j58M7M2J83n5J31j3k01J11j94K41j58j23K46L1q7
4557F7k17J65j58K98j00Q9j77j56K57Np3p2r4K27l03L44J89j55l00J88P5j72J58
4580H5l33J90r5K13NP8n4L3J27k47l0j74P2J80k02j8J21qj6L37m32J37J9o4K84
4605B08l67J43N5j75J71j58J23J21j21K76r0Kk02j94L63r7j10J42k20N5J72j23
4627b6o3J31k60J05j55L03P7j82j45J44l2k7K37j36J2M7j62J07O5J4n4r0J56j82
4651a16p0Q2q8K69j31o3j41Q7K08j77o2P2K71k7j50Q0j46K79l82j12N14k01l2
4674c6o7l3K6L2J64q7q8q6J05L0Q1Mj12q9K05j85L15m59K35K85l62o3M38M1k90
4699DK6j70K72K55j28l41R6o1K03j47j24JK0J15rM8k00J33L11l02P7L7p9k40J93
$$ y = [-21, 20, 35, 112, 325, 313, 284, 139, 24, -134, -87, -45, 138, 83, 214, 201, 0, 111, -83, 158, 0, -123, 123, 154, 67, -150, 15, -143, 155, 55, 144, -33, -189, 68, 73, 0, -72, -166, 61, -242, 102, 291, 136, -164, 24, 99, -73, 85, -248, -58, -153, 60, 65, 143, 89, 122, 249, 2, -28, -202, -130, 50, -152, -170, -49, -57, -73, 264, -168, -31, -12, -76, 208, -159, -16, 39, -136, 35, -123, 0, 121, 0, 276, 186, 188, -14, -208, 155, 58, -52, 90, -130, -75, 97, -26, -89, 42, -218, -113, -268, 35, 112, -70, -215, -71, -103, -130, 107, -29, -17, 30, -132, -25, 40, 54, 0, -90, 66, -116, -186, -104, -192, 77, -54, -117, -258, -171, 37, -140, -202, -130, 141, 114, -36, 44, -102, 177, -205, -317, 197, -4, -36, -103, -136, -110, -78, 86, -1, -89, -175, -70, -40, 41, 45, -67, -156, 49, -136, 179, -280, -45, 240, -122, -185, 253, 294, 4, 30, -140, 132, 387, 259, -82, 14, -47, 156, 9, -115, -114, -94, 21, 12, 60, -140, -7, 304, 2, 79, 116, 37, -203, -10]
4724a0K57j33j67j20J33K04k51J6K00o6k37K14J3j2N4j24m8p5K43j41R5J38m41
4747b58J43K67l15J22R6o8K00l05J97j49J1L2l1m3K26n0R4n0j33N0J4m6O2j79
4771a13j39K66j50L41p2K1j96j85K74n4J06n7J1r7R0q6R7j42O6P6K1k37o4J13
4795a10M8j24j1L05q7j10j62J18K08l41J26J9K30p0N0j18J40j3L2l0k32j46N30
4818B52m06M6J8J65p6j03j6j01K02j52J46j18K63M4k42q3l0K91NL2q1j05J20p1
4842@j39P5M2p0R8k8K52k16K50k91M2p8L31j56j37P4J16r2l45K34M6j71J72J43
4866A52k55J72m1k61J47L28k69l1M5K28j2j05k30J78m9J99l20N7R9j51L8k2p4
4889a77J86l5l7n9Q2j83J36j9Q0j00l0k2J89m0LJ25j87l15M27j97J93j99pK41
$$ y = [-10, 247, 114, -53, -173, -40, 164, -87, -71, 129, 63, -174, 40, 53, 41, 95, -29, -77, -152, 91, -50, 45, 183, -258, -115, 152, -163, -41, 55, -13, 187, -118, 79, -70, -59, -27, -58, -101, 125, 75, 169, 119, -14, 36, 50, 4, 66, -113, -252, 14, -136, 205, 133, 154, -42, -227, 47, -7, 99, 42, 53, -44, 46, -40, 57, -85, -19, 57, 78, -159, -223, -110, -62, -186, -197, 108, 21, -89, -251, -133, 75, -266, -140, -121, 109, 39, 89, -29, 111, 98, 130, 100, -132, -278, 252, -154, -108, -90, 75, -1, -104, -120, -221, -19, -171, -25, -143, 120, 164, -78, -161, -191, 100, 105, 137, 56, -49, 71, 0, -139, -64, -22, -92, 6, -22, 230, 14, 264, -27, 15, -63, 268, 112, -25, 49, 165, 73, -272, -38, 8, -163, 9, 152, -103, 69, 28, -233, -86, 242, -27, -58, -13, 215, 203, 98, -132, 46, -3, 196, -124, -67, 32, -119, -81, -103, -177, 9, -26, -63, -122, -40, -223, -87, -106, -26, -126, -156, -178, 11, -29, -26, 99, -88, -403, 24, -173, 20, -179, -186, 55]
4913E5j20K95j50k78R8P2R3r2p9K00Kj55q1k1J73O8K13m60K66j78jJ16Nj1l6M28
4939D22m34J20N6j38m4L12j74N5k00J18j16O6J50m01K68L4l4j0l1J69l53J55O6
4962E6j43O2m0j30K79o9M2R7m0o8o7P7J11m39J92J45N2m9l3K72l34l0P1J41j2
4987A43J9j88K01k31J43k62j8L39k5j16k8m6K46l69R5P7k72J67J37O8J82k96p7
5010a11K54l05K24j53O1J22p9o7n7J62K18m14J85J85j99j09J82l0o6k00J82K61
5032B46l60q1L91j86p7Q0J02k10mK00m3R1j54j88J99j29L7Q9J76k83J23J82l8
5055A63j70MJ11k92L15J5j6p4j97J8L8J94q0M3J09j59j07r5J36j41J80j12P0L1
5079a6j09L62j72j12N1J91m3j95k3K3pJ26k54m1J83o4K89m18K51J58j94M8K14
$$ y = [55, -65, 230, 80, -198, -100, -28, 65, -27, -106, 94, 96, -59, -140, -161, 12, 80, 293, -167, 99, -79, -80, 36, 41, 30, -6, 422, -12, 108, 164, 26, -18, 294, 120, 175, -25, 93, -23, 43, 193, -208, 60, 94, 60, 50, 19, 188, -165, -10, 56, -87, -25, -65, -195, 84, 15, 57, 154, 114, 46, -21, 56, 167, -272, -80, 65, 117, 68, 35, 307, -27, -57, 14, 155, 143, 162, -26, 175, -56, 87, -175, -193, 146, 121, 5, -23, -69, 177, -192, -97, -20, -292, -125, 12, 80, 262, -34, -111, 143, -162, 62, -91, -30, 92, 13, -54, -111, 51, 269, -145, 40, 225, 26, -83, 99, 69, 3, -197, -15, 246, -114, -195, 196, 10, -67, 13, 115, -95, -99, 101, 58, 149, -5, -193, 6, -123, -86, 3, 179, -104, 19, 201, 163, -7, -3, 108, -184, 131, 146, 130, 56, -141, -123, -85, 109, 29, 72, 181, 22, -85, -180, -44, -185, -5, -117, -47, -16, -125, 237, 65, -47, 4, 195, 152, -43, -66, -43, -50, 76, -178, -219, -36, -100, 189, -229, 22, 180, -14, 34, 248]
5102B48l21J58k74K9m4L68k00J38k37K74m8m5l4k1p0Q7k26K77PMp3j46L00l94
5126b43J20L15j56R1J9k20K7O8K2j79K95m5j64K41k99J57k96L19k46J43J25R2
5148A86J33n45Q3K40j71K6L7q1J94j00p6n5J35l9k97P9L69j04j52K2l6q9L06p0
5172ek8KL1J4Q3j25q0J3j9L47k11k35L59K20k41Q1k42q2M8J47N4j47p2K64Ol42
5198a60M73m95J86O9j07n4r9K26l66L52m5j49J04O2j46N36m09n3J10L5o7j94M07
5221B16j50P0k04J05Q3p0j06J40j71O6J14O9k07J96j88P2M6k00J85O9k63R9j7
5244d6J29r2J12k67J38o9J37j87K25k00J29K00j66J8Q9P9J6l67O1J73j12K16q3
5267A33l41M04k22J3J15l0k58J0K0K58j95L47l45J49k02K7J19k4J58m20K04n0
$$ y = [248, -73, 85, -189, -160, -204, 164, -36, 102, -135, 139, 91, 46, 12, -9, -79, 8, -218, 59, 66, 70, -3, -149, 151, -243, -123, 192, 36, 127, 146, -74, -47, 21, 43, -136, 159, 114, -50, 191, -108, 49, -247, 72, -174, -31, 94, 186, 319, -226, -143, 97, -74, -48, -11, -92, 102, 2, -74, -129, 6, -33, -330, -251, 118, 14, -138, -116, -152, -241, 65, -5, -33, -31, 0, 14, 97, -28, -108, -95, -114, 233, 22, -213, 146, 366, 125, 206, -36, -118, -70, 77, 131, -16, -88, 176, 182, -160, 313, -182, 4, 73, -34, -88, -187, 39, -327, 25, -20, -169, -65, -3, -149, 387, -22, -75, 35, 70, 3, -191, 216, 66, 136, -68, 37, 120, 50, -56, 84, -87, -21, 93, 162, -45, 151, -37, 35, 81, -119, 66, 135, -128, -29, -46, 83, -9, 103, -164, -26, -95, 42, -145, 80, -120, 9, 209, 43, 61, 150, 229, 245, -122, -61, 112, 0, 216, 133, -208, 196, -26, -13, 102, 72, -186, -176, -156, 102, -93, 254, -91, 58, -144, -117, 2, -22, 136, -284, -80, -130]
5289a30L76l11K50k18K60k98O2M9Q6k23J0Mp7L75k28p9l8o0L47l58j9L05l56M01
5313A30k50N8l6K59Q2n47L77J36k50n9M2Q1Q4J12j13mj67m9K44j55J17m9oP1J8
5338A26P7j09j59J80k9p1M2k21L40n2j29o7jr1J20J43j90J94j59J55k73PJ23J88
5362A44j32n5P6N3J47k91K17k09jJ69o9J33O6Q5n82M68k71J36k74L72k82J65P0
5385A35k69Q2J73j61j13J71o5p1J54Nk3j79L45k10o4J23j91L16j75j05L28n66
5407c60M26R0j4l03J1L34n7l08J94j0r3J23pR3o5j56N7j29J46P4J93k09J27j04
5431E3j11j98K62J14l03M24l19K1j39L43j85P1j5k7J14j63k42L52M8j89L5M18
5453C64k96j60J21K09J43m22J79j23o5Q9j69J23k97K98j25LRM1J00m6o2L09k24
$$ y = [-130, 246, -65, 185, -33, 227, -71, -9, 40, 126, -97, -87, -83, -160, 215, -13, -92, -130, -190, 157, -201, -220, 85, -271, 130, -120, -62, -98, 161, 243, -304, 73, 209, -41, -100, -58, 23, 107, 219, 106, 102, -65, -114, 130, -25, 92, 43, 37, 108, 126, 203, 94, -65, 115, 86, 15, 57, -164, 176, 124, -5, -72, -73, -164, -44, 99, -91, 103, -56, 99, -174, -167, -44, 144, 12, -43, 33, 86, 233, -58, 159, -50, -51, 118, 49, 182, 248, 333, -249, 219, -52, 84, -190, 182, -100, 65, 135, -134, -52, 121, -40, -153, 18, -47, -118, 36, 41, 18, -161, 184, -26, -90, 33, -158, 158, -17, -122, 206, -360, 66, 156, 142, -161, -150, 184, 127, -181, 13, 3, -90, 33, 26, 119, 54, -102, -45, -174, -28, 46, 239, 30, 157, 53, -58, -256, 6, 120, -183, 241, -78, -57, -196, 147, -38, 33, 18, -9, 105, -58, -300, 52, 100, -89, -54, 364, 68, -92, 29, 238, 381, -41, 138, 15, -50, 39, -130, -7, -304, -6, -131, -128, -119, -78, 22, -24, -86, 223, -1]
5476aL8Q6n2j8o5PJ44L7p5PJ07j21j77NL7q0P7N2n1j2J23p2Lj72J87k10L24k29
5504a01J73jj02O5J7J58k51R4j99K38k21j13L10j12k8K81k19P8P9j59j30J57J94
5527B08m9j53p4M0M2J65j62q6J78j4j60J00J54j80K7N6k40J83J33k15j0O5J21
5550A29k40J17J15j07J85k07L8l64K71n0M52l35l5k9R0J1k24L01j84k8K30j29
5572GL0j15j2K30l91L03j16J55j2M8p2k49K69Jjj47K17Q1l58J32j25K7R0K1O2
5597G5J10k12Mj01L07r9l7n2j03K27j40j42L6K43l19M14j91J24l52J55K55l82
5619a80QK20r2j85K12K50k92k62K47N2j08J65m7J08j32J7J06j05o6K32l30K02
5641B0P6l06M04l07K5N9K33Qk38Mj96L80k4j31p5n9K70j64K87j39k4p9J1Qk9L8
$$ y = [-1, 37, 123, 71, 53, -12, -5, 139, 176, 101, 108, 215, 94, -83, -78, -41, -121, -44, 8, -43, -55, 68, -4, -1, -173, 14, -196, 128, -101, 72, 71, -31, 34, 51, 209, -42, 52, -147, 91, -130, -243, 67, -45, -73, 208, -11, 67, 146, -13, -143, 14, 208, 159, 6, -68, -28, 14, 179, 17, -69, 109, 95, -65, 35, 189, 9, 36, 92, -148, 35, 168, -47, -57, 8, 129, -111, 6, 121, 14, 199, -8, 30, -334, -63, -113, 339, 4, -31, -60, 30, 41, -183, 118, -66, -94, 136, 7, 37, -78, -90, 140, -251, 52, -64, 91, 79, 127, 55, -194, 75, 76, 75, -72, 145, 226, -132, 0, -125, -98, -8, 13, 75, 185, -27, -23, -124, 183, 84, 47, -5, -108, 119, -21, -163, -127, 116, -203, 211, 20, 144, -208, -53, 202, -180, -172, 48, -44, -229, -17, 233, -59, -321, -74, -22, -130, 35, -12, 96, -36, -19, 87, -18, -84, 148, -182, 20, 96, -210, 194, -113, -88, -29, 204, 212, -26, -22, -218, 162, 138, 7, -68, -127, 143, -21, 266, 127, 103, 24, 35, 43, 14, 52]
5667E2kJk46L12j69J96k67k87N14l11M93k88p3K15o8p9m9L9q7L01k54M8O7n6r8
5692i6K23l84J7K30Kj1j65J17L10l72N2K13o9j05j73K88j85K75j06J32nm02O0
5715a54K09M0J63k44l4kL2N7j83J69q2J02o4o9R3J93Q0l63O5J82m41J63Q8O2K44
5740C06k81j24L6J98j7O4l20J27n8R2j55J08p9o9L1J97j44j19K46o3j88J93o0
5763g9Q1K02q9n0l62N63k42j02P5j02p2K84k14K39q8k60K35M1K14k1k47r9J15
5786B2q0L0Q0P8K7j7m04K92p5j16K62n5J6q1K24k91N3r2J96r6J31k18m3J69J69
5811A81p6j21J00k02K39j22O5k0J78l30k4K27q7L1o8j05L6j48K34K39o2k36R5
5834B4L05j63l17l4J92j08j50M68k65k7R8l32M34j4j61Q0j55l8Q0J41K9L7k42
$$ y = [52, 50, 51, -195, 117, -52, 144, -123, -410, 104, -207, 286, -2, -75, 140, 72, -7, -56, -17, -104, 197, -57, -9, 58, 2, -96, 127, -257, -240, -10, -8, -19, -184, -67, 243, -129, -77, 136, 67, -38, -211, 77, -108, 167, 61, 193, 188, -214, -154, 55, 95, 258, 14, -20, -22, 10, 67, -116, 53, -29, 73, 9, -60, 33, 226, 306, -57, 8, 190, -251, -88, 0, 62, 306, 25, -99, -63, 135, 118, 182, -138, -11, -69, 23, -132, -24, -103, -172, -141, 56, -88, -207, 39, -24, -212, -19, -79, 2, 204, 115, 65, -297, 266, 24, -78, -3, -105, -177, 107, -107, 132, 44, -216, 19, 60, 274, 253, 6, -93, 22, -58, -28, 52, 130, 157, 140, -264, 28, -47, -163, 99, 44, 60, -21, 203, -88, -35, -127, 69, -27, 104, -114, -157, 12, 181, 105, -16, 84, -118, 121, -1, 64, 44, 222, -108, -132, 95, 8, 39, -29, -134, -98, -246, -12, 227, 165, -71, 24, 329, 166, -151, -185, 7, -101, -251, 217, -48, -75, 23, -309, 125, 111, -50, 30, -125, -163, -83, 58, 87, 124, -118]
5857a18J14j33J68n6J0J09j20K32k92L57o8j67j6j39K04k21L23j77M9j04K7k0
5879c8j83L31J51m8m82J99p1R2J66k68L25q8j72P0k14J89J19k28J49K1J3k17O4
5902a20J61n0r7K29k91J15q6R1J38R1k0k11J54K7k28k5J77m9k5k52L47ql46L73
5926I5J42k33L8K7l3j56P6j63M5L25l7l98L69p4K3J99k99J47o2J89k71J15j41
5949g7J88k83j78N47j59R1k10l8K51j71K16l00N7p9K84j25m9M9q5R0j5J6j32J56
5973D4j10K23j09J70l03J55J8J33l45J85p6L24k99q2m1L2m3K96p8k44rP0L1P8
5997B0J10k58K45k49rJ45l09J3L52O7r2r9K18l3l61L9K25Q7l17L97k1j12J01m03
6021b44J74Q3K2j04J71K0l26K6L78j00j76n8J94k8J9rj50PO4R3p2k54M61j42R9
$$ y = [-118, -4, -137, 31, -25, -15, 94, -26, 206, -86, 271, 203, 36, 20, -119, 85, -136, 187, 10, 59, -45, -18, -38, -221, 110, 261, 213, -269, -70, -141, -49, 117, -151, 174, 86, -86, -16, -230, -41, 78, -150, -1, 20, 33, -184, -120, 41, -9, -106, 123, -168, -53, -139, -48, 90, 181, 161, -50, 104, 131, -97, -122, 55, 6, -19, -271, 76, 68, -278, 95, 237, 4, 42, 69, 36, -120, -44, -207, -162, 163, 126, -272, 97, 23, 46, 245, -54, 93, 31, 220, -51, 64, -77, 111, -172, -350, 197, 38, 129, -81, -119, 132, -39, 177, -123, -66, -145, 139, 14, -35, 14, -71, 19, 4, 20, -112, 44, -66, 157, 48, 218, -85, 70, 88, 221, -124, 61, -15, 309, 10, -72, -113, -81, -124, 172, 94, -150, -159, -89, -58, 20, 130, -128, 117, -132, -141, 4, -305, -292, 60, 127, 35, -64, 154, 121, -240, -201, 24, 111, -206, 191, 170, 58, 159, -244, -70, 13, 35, -69, 102, 122, -204, -178, 200, 100, -76, -134, 60, 32, 51, 42, -108, -101, -37, 56, -16, -270, 191, 49, 148]
6046A48k95m5K59p4k79L57kJ54l05L6n0j25J23L2J46k98O1j52L32k62K69r2pK19
6070A50j53J60l8n9j5J9J2j00M6O8j88L7k08O61m38j32R6K52j33Ok0j21J82Q2
6094A66Q3k09k4Kj88K08j57Q8j70K82Kl04L55j16O2Kk09Q0o4K92j88j92J18J40
6118E9K8j93n2J47kj83O0l9J45K5j38M0m2K23k36J72j71K32l38L63M6Ok43M2L
6143d6j05OJ82N4O5pk00QJ08K0j17J8q6o1J73N9Q9k29N1M8l5R6J0j61Mj21L38
6170A61j22MJ71k95J62n8q6K47J30k43l03O17m33j29J23RR8j23L3J35j1j33J65
6193A19n8o6o1p3N7J85j34l2L0j51L45j67J29l40L73L5l13K24k52J48j25q9L0
6216a86J95P0n0k77J00M04j90j01l3J20p4J04j69J59o7L9j44j9Nj1J08k4L60k16
$$ y = [148, -147, -192, 67, -7, -286, 71, 69, 223, -82, -46, -96, -221, -98, -66, 80, -218, -157, -309, 23, -239, 30, -62, -69, 150, -3, 157, 119, 60, 45, 64, 76, -24, 22, 90, -98, -61, -269, 392, -46, -178, -82, 170, 37, 43, 23, -98, 84, 166, 249, 40, 16, 18, -170, 38, -119, -31, -201, 81, 83, -221, 134, 18, 80, 82, -127, -47, -111, 181, -7, -199, -81, 59, 87, -106, -158, -11, -13, -196, -136, -175, -30, -5, -143, -103, -145, 78, -158, 14, -157, 75, -263, 100, 146, 152, -91, -49, -46, -151, -145, 37, 91, 156, 149, -51, -43, 65, 85, -32, -14, -100, -161, 12, 71, 160, -69, -18, 30, -5, 91, 101, -60, -56, -177, 161, 39, 43, 214, -81, 81, 23, -63, 184, 314, 71, -232, 385, -48, -177, -54, -45, 53, -70, -37, 98, 87, -46, 119, 61, -5, -66, -139, -82, 103, -31, -63, -33, -184, 161, -6, 123, -217, 156, 191, -122, 102, -150, -2, -127, -216, -186, 9, 79, 29, -248, -148, 256, 66, -35, -68, 52, -22, 82, -87, 72, 5, 44, -100, -119, -114, -125, -17, -41, 319, 103]
6240A03r4N1j32J37j50J31l5j83K54q4J29l13J10m3K89j35J01k33K60J6o7M7m09
6263b50Q3K80J6l5k85K58K5r3l7K53j05n0j62J38n7k63K01K07j14k5J14j40J34
6286I3k72K64m5p0k10J47k5O5P1J51j67J12n6k1r9N5N6n8m6O6j2J84k01J69m5
6311A06k04K31O4j83m4qK14l82K03J87k40j5R6pR7l34L67j44j90K63j43pJ17n4
6335a0J67K02k83k69K56kj8j2J14j28J18qk0k66J42J21l8j0j75K97r4k9n3Q9j90
6360i9J61J3K1j9n6rN1l5j27M33k82J4l0j53PQkp8L24k22n6N7J11k13J02J23q9
6387d5K28j28k29J75j12L97k85J43j71L1j26K90J6j96o6j90J21k8L62k49J4J46
6409I8j86K0J88k14J21K9r3J08Qk24J53j1j1k13M27j63n0P0j6l8Q0j13M5j26O7
$$ y = [103, 9, 60, -72, 65, -85, 46, 11, -172, 82, -2, 127, -186, -76, -119, 170, 35, 136, -97, 163, 179, 112, 159, -250, -167, 113, 129, 94, -191, 67, 92, -1, -38, 215, 110, 60, -102, 36, -21, -284, -83, 124, 10, -15, 99, -41, 93, -179, 85, 40, -30, -240, -93, -118, -53, 18, 169, 2, 114, 58, 37, -62, -7, 49, -9, -55, 11, -1, 183, -18, 151, 106, -98, 133, 197, 14, -30, -38, 176, -206, -3, 184, -56, -71, 25, 18, 115, -219, 148, 4, -186, 77, -66, -73, 44, -10, 157, 359, 76, -193, 63, 61, 43, 31, 145, 17, 135, 127, 107, -159, -17, 104, 66, 56, -119, 178, 84, 55, 2, 91, -99, 62, 75, 96, 77, 21, 12, 63, 28, -99, 334, 52, 66, 36, -117, -110, -102, -104, -182, 142, -80, -136, -79, 32, -181, -79, 44, -45, 183, 55, -174, 1, -111, 286, 1, 144, -27, 4, -122, 168, 184, -12, -78, -268, -147, -175, 187, -62, -48, 98, -88, -68, 120, -94, 27, 56, -37, 71, 79, -145, 8, -3, -14, -227, 200, 37, -13, 57, 41, 3, 83, -30, 15, -111, -44]
6434d4K0Nk0o5j02J80L3p4N4l1K6rL02m30J84q8k42J68L05m00K33P2L4J32n27
6459b84K42J7j5K06j46J34j28j95J72l1J82j12q2k6J2K05pj09J6N9j50j94L57
6482A23j02r2k5J73kj39P2N3RJ47m87K08qQ2J7J30q4j5j44K77l60J93r8K64o8
6507A24o2j81m0L55j45j98L10l37J91N0k22J77r2o3K6J1j15J32P7K36j58K9k33
6530a28j00L46l06J34J08n1J40jj90j07j02M92k50J05k42L83l70O9N2J2R6j05
6552a5K39k74J09J1j64K80J2k31J28n4J63k15j66K48r1ON0l28J99K02l1P2j16
6575C4J59k74l0O8P9r9j35J87rP2k16L06k0j31Q2l5k05J77m3j17M04m3M1r2k29
6600f9j09L78l6k3l14K11p7N5Q5k33R5J37j29j74L28j25J87j42j57K29Oj99J93
$$ y = [-44, -24, -19, -39, -104, -206, -26, 7, -67, -13, -44, -18, -27, 275, -155, 29, -59, -301, -133, 172, -228, 5, 77, 111, 243, -284, -42, -25, -40, 166, 20, 154, 26, -169, 3, -28, 154, 42, -40, -66, -54, 151, 144, 35, 51, 110, -40, -234, 123, 21, -71, -96, 77, 75, -64, 8, 61, 70, 217, -270, -62, -70, 12, 29, 159, 75, 60, -84, 193, -167, 26, -72, 192, 124, 62, -119, -159, 196, 51, -147, 163, -174, 17, 67, -155, 22, -70, -133, -107, -96, -211, -79, -2, 234, 76, 105, -128, -228, 118, -188, -54, 54, 3, 143, 142, -48, -155, -257, 235, -15, 90, -152, 231, -139, -70, -18, -6, 90, -15, 224, -50, 59, 70, -94, 186, 198, -33, 95, 41, 204, -11, -177, 71, -20, -14, 36, -292, -93, 109, 78, 150, 34, 193, -81, -111, -43, 36, -63, -198, -11, -20, 52, -164, 142, 122, -9, 73, 38, -167, 10, -33, -150, 254, 211, 252, 160, -69, -178, 200, 164, 141, -173, 38, -39, 16, 101, -132, -37, 100, -29, -203, 125, 0, 187, 45, -112, 117, 123, -76, 117]
6623A17j93L44l02j13K57l00K19k2J40k64M4%O8l49K29K52j19J96l47K37j55Q8
6645B7J16Q2l0K4j19j8k03R0N7lq2j16K97l30N0K37J48k88O5r6O1Q7o5r2K26k10
6671h5J27n7J8Q3L9p1M0K1p3J62m47J62K03j43L0n8k14K73J18j84R3k16K80q6
6695A5p0K98k98P3K8j99L62m11K62j53J30l8Q7K64o31J90J53K60j99j98l8K95
6717A82k80L1K28j18j7j76k40K33%M32l80J75J19k52N0P3o5O0k11M28n46L61n7
6740C0P2Mj41L13k72L8j6l0N6RN8j18o3j15M48k01RJ8K8J0p2j32l1L48m0m4r1
6767G5J5j93J14J31j38K33m37N16k55m4j7M1j78J09k1J6J0J6J31k25J43o8%j5
6791d1K12k64J3J44k46L69k61O7P9j46L43l92K03j62j09M83l55J22j34J08k19
$$ y = [117, -76, 268, -34, -147, 110, -190, 29, 7, 147, -117, -73, -73, -5, -354, -125, 127, 8, 204, -143, 94, -61, 27, 143, 225, 195, 219, 100, 82, -121, -31, 26, 23, -59, -175, 122, -208, -158, 79, 227, -61, 4, -92, -31, 56, -9, -101, 125, -85, 42, -15, 3, 86, 125, 54, 94, 115, 42, 204, -243, -81, 122, -21, 9, -49, -263, 10, 128, -56, 37, -179, 101, 15, -55, 243, -55, 18, 46, -153, 209, -202, 60, -93, 37, -1, 86, 350, -281, -91, 62, 322, 123, -75, -113, 182, -98, -67, 161, 43, 26, -150, -390, -157, -157, 275, -105, 70, 189, -63, -13, 60, -5, 55, -156, 272, -274, 87, 30, 102, 106, -35, 278, 6, 44, 28, -2, 54, 63, 121, 3, -60, -175, 273, 72, 81, 99, 127, 137, 65, -67, -98, 250, 210, 166, 75, 90, -103, 11, 142, 4, 237, -200, 316, 61, 17, 0, 41, -137, -28, -49, -33, -23, -7, 124, -101, 42, -26, -26, -41, 171, -93, -80, 64, -182, 187, -74, -7, 72, -74, 269, -123, 80, -82, -191, 292, -63, 59, -75, 33, -186]
6812a86J64j02O0J43o4j24J02J31j99n9j28M50j69J9J34j36NJ19k58K04o3k06
6834a63K29L9m3r1k0J1RJ79k91K56j29j01R8k66M72j40Rm6l34R8K96j4o7q2R4
6859Ck6J2J06k23J31m7O7J5M6o2j21K57J9Mj86J05J96k80J60q9J20k43j30L8K7
6884a01L9m4j00Q2K89K2o7k73L65l05j4P2k1J38j43j21J20J39q6J63k23K96j75
6907E2r0N0M7k29K90j1j79O8J45l8j95J67J16q0p1OR4l51J97q4M8J46k92K99j80
6932g5J06l8j33P9K08M7j46k97K33l7J6L48l85J95k24K65j59r4N14l75L2k21j8
6955a59L17j24n0L3LO8KQ1q5n5J16k36J74j9j83P5K09j63j2J15j81J49j96K16
6979I5m30K22n4m1L09k50j3o4M54J46m23K53j78p1J02j78J49q9J26P8l57K48J6
$$ y = [-186, -22, -124, -64, 79, 15, -109, -7, 124, -75, -134, -262, 188, 19, 38, 172, 36, 41, 160, -98, 106, 43, -163, 66, 105, 62, -29, -49, -38, -29, 150, -141, 115, -14, -115, -17, -283, 189, 49, 58, 12, -322, -224, 72, 58, -9, -91, 3, -23, -11, 95, -128, 3, -44, 23, 38, 84, 22, -99, 158, 177, 181, -5, 100, 296, 16, 176, 87, 207, -36, -166, -128, -101, -62, -106, -206, -124, 165, 187, 120, -153, 212, -93, -107, -35, -56, 82, -61, -182, -62, 77, -9, 154, -69, 227, 52, -38, 12, 59, -170, 120, 109, -70, -2, 143, 105, -90, 77, 193, 113, 42, 48, 142, -209, -12, -96, -48, 98, -194, 105, -75, 31, -7, -140, -61, 147, 194, 48, -249, -16, -53, -37, 311, -74, 121, -103, 162, 3, -91, 423, 48, 80, -141, -159, 158, 34, -16, 17, 20, 88, 90, 171, 86, 31, 147, -89, 85, 66, -117, -42, 167, 4, -8, 107, -74, 75, -121, 95, -335, -113, -167, -208, 101, -149, -162, -226, 228, 374, -49, 204, 26, -45, 57, -121, 28, -61, 65, 143, -214, 34, 50]
7002E0J53n9k09n2K42o4k57J64J67j31o3J05j06L51l08J78k47K2L8l9M6J04O7
7025A52l77Q2J21L02k19J12j28O8%j81K30j7j62Q8j4r1R5k40K24J39j84lp8J15
7049C4M3Pk89J08J55J44r2j21K91r9k31o0j2J30q8Q7J64j24k31J25J19q1Qn5m7
7074a15Q4J31m9k05K02J81k12j05J58Q0m32M37q5n9N8Ok99K8K93r7k09K30K1j59
7098a17L87k16j57j07M09n93K01J90K76p9k02rP6L3j99N8m1R4J85p6j39O4Q6j59
7122c5K09k21K24l4k92J02L3n2J74k0j88Q3J66n9j43qnn4R7L8o8kK40j82J33l64
7148b28M79l48N9N4j45J65j46J7J1Q9K4N9nk12j0K4k09K17J36O1k63R0J66k36
7172a51P2J3q5J85r4L2k1K54nj62n4j61L16j62n7J68k9j74L8P5J2Q8j7j12J11
$$ y = [50, 203, 144, -65, -117, 125, 61, -196, -32, 135, 4, -59, 46, -60, 291, -17, 161, -86, -64, -26, -65, -19, 85, 152, -225, -143, -22, 280, 61, 173, 45, 113, 113, -68, 162, 145, -17, 71, 57, -34, 61, -179, 45, 184, 0, -3, -81, 34, 77, 84, -205, -97, 58, 202, 110, -11, 280, 181, -50, -110, -122, 8, -80, 7, 171, 47, -184, -59, 60, -21, -13, -68, -115, -31, 100, 51, -154, 48, 229, 17, -88, 70, 150, -282, 155, 70, 11, 69, 75, -224, -196, 97, 0, -209, 21, 42, -117, 270, 54, -103, -210, 199, -394, -193, -3, 273, 194, -8, -17, 59, 92, -107, -49, -90, 4, 189, 113, -26, 38, 124, -35, 174, -47, 177, 143, -149, -47, -14, -66, 108, 88, -100, -17, 149, 90, -53, -61, -66, -120, -23, 15, -53, -55, 185, 3, 136, -228, 251, -97, -38, 16, -129, 36, -110, -93, -82, 7, 31, 90, 85, -127, -137, -113, -322, -105, 31, 92, -171, -81, 85, -151, -79, -66, -151, 34, -60, -28, -49, 205, 200, 38, -16, -177, 139, -23, -80, 88, 59, -115, -77, -2, 10, 98, 81, -31, 80]
7197H0k8J99l28k23K54k10K05o0k8R3j9J31r3K28m10K01J34q3l07K92J9Om22L24
7221d5q9K67r7p1L5j44K17k4M4p3M1j33K93j92k43K02q3J21n5Q6l01K55n0N6R4
7246A11j12J81r3k7k36L95n6l49L69j89k5j2J92j3j91J89Qj1k34J86j07K49k76
7269e1J85k8j89K17j63k0j87L79j2j47O5k31J40K0k11K34j94K18j9k4k3j73N4
7292a60J19J48P1k51j6p8J3J85J73k85l39L25J14p3o2L11r0k82J87l73J37Q5M18
7315B77k25M0k9k94K12K8j98J05l24M61k85J14J09m0p6j19P2K98Qk53J25J56k78
7338a16J32n3n6j14K78kk56J82k0J02m9Q1k08K15k37K37k0p9k08K80J4j05j60
7361a62M39k07j11J81k72P0N2R3n3O8r3Mk7J25k71J28N9r9j03J42N0J70l48J34
$$ y = [80, 52, 251, -77, -300, -46, -256, -51, -111, -139, -46, -65, 66, -27, 201, -209, -8, 126, 43, -264, 28, 47, 53, -369, -45, -134, 133, 36, -35, 0, -144, 73, 49, 93, 20, 61, -72, 221, 29, -214, -12, -95, 26, -29, 57, -244, 11, -39, 17, 111, -1, 180, 87, 60, -176, 219, 163, -186, 183, -6, -31, -43, 149, 136, -55, 134, 142, 131, -103, 83, -24, 225, -51, 134, 106, -83, 134, -29, -49, -236, 143, 131, -16, 49, -182, -42, -22, -233, 1, -193, 25, 6, -18, -41, -214, -160, -41, 107, 178, -73, -89, -167, -154, 31, 204, -81, -420, -95, 19, -54, -116, 195, 105, -177, 10, -363, -226, -141, 277, 52, 92, 63, -231, -19, 9, -189, -84, -408, 53, -232, -118, -9, -49, -125, -244, -172, 126, 134, -119, 6, 162, -116, 16, -37, -93, -207, 71, 69, -187, -5, -25, 77, 28, 109, -99, 116, -121, 116, 96, 17, -191, 89, 103, -2, -162, 277, 70, -41, 140, -132, -62, -10, 83, 30, 98, 5, 9, -18, 107, -164, -36, 23, -76, -179, -37, 13, 183, -165, -31]
7385c1K06r5p6J08o7n9n3J84j3r8j23J41k5J47K86k76j05j45K7r7K59Qk64P7r
7410i3K8l4K27q2j76j3J71j40J50r7J97Nj87J33m8o0J0j9l4R4j33J41qj29K75
7435A78j47k09L64j49M7j55J17j33J23N8k39K41l2M2k14O8l05K93k4j67J33M0
7457g0L2k7K50l6j17k92L12oj77K58k13J26j74K16k92K25o5j94J90j05L09j53
7479cn9J60J76m57M9O6Q3J04j24j06J27o3O8K44k2l43R1K28k48p7K68l04J49M4
7503E1J07k53R5mM5Q3p0RJ12j42j53M66n06J4L29q8n8R3m07J56J40j90K78K9p3
7528F3R6k22l9J32P4j39N2m8r8J15J31j2p3j11J62k09m5M4K01k58L37k33J14r7
7552f3O0j58L96l37R3k0J83j32j9K3r7K07n9p1r6KJ15J39k24K04l04N5J52q7O6
$$ y = [-31, 175, 80, 4, 112, 45, -14, -67, 117, 104, 6, -117, 24, -1, 146, 432, 156, 51, -94, -67, -164, 95, 103, -161, -84, -93, -65, -99, 128, 46, -130, -143, 28, -112, 38, -59, 138, 143, -44, 89, 41, -19, -9, -28, -62, 32, -101, 40, 32, -97, 178, 31, -178, 186, 37, 84, -71, 46, -87, 36, 94, -145, 96, 64, 106, -108, -40, -345, -52, -76, -243, -110, -70, -38, -65, 185, 149, 32, -260, 52, 46, -131, 127, -86, 40, -134, 82, -210, 15, -50, -244, -54, -159, 150, -3, -62, 98, 274, -183, -134, -68, 15, 119, -5, -111, 16, -47, 21, 265, 243, -100, -9, 219, -29, -106, 162, -142, 7, 51, 158, -95, 0, -4, 41, 124, 54, 63, 175, 33, -120, 346, -160, -146, 183, 95, 37, 130, -277, -121, 19, -171, 107, 136, 63, 159, -63, -102, 30, 104, -35, 17, -31, -129, -14, 117, 105, 32, -79, 83, -126, -171, -127, 74, -184, 153, -80, 34, -63, -3, -161, 235, -102, -9, -29, 154, 22, 3, 26, -71, 136, 77, 6, -90, -88, 27, 166, -58, 146, -158, -103, 49, -38, 28]
7577B8j05p9J64k75K60N5q6k19L34k80J08J99p7N4k62Q8M2J28J34j48l8l29L37
7600C3J97k94o5J07J52l01l1K86j12j94R2K3K77l72K14k34K85J50l97K15k05K60
7622H6j17P3K23j87J56k40K35J33m62L65k70nk6Qj67N0K04oR3j48n6K82l61O9
7646f8j06J19Q5K33l93J69m8l5r2k30K28J27J67l64K69j1J89l40L77k28k9J1m7
7669a7L6K1l2J43j66R2J07l15k6M16l05N9J18l88J69J54o2j9o9L6J82k36j48L11
7693F1J31l02J51mK83k16k23K93k96Or3K46N0k3k9Q0J72o31J75K90P2k43J51N7
7717A58j77J9j87J16q1J51O7j58n8J21K75l28M4J13J26m86M42n0k62K00k04PQ6
7740f6K08k63O3K8j51O2m1L8K86j85j52k3J59K24k54Q2j07L09l63K49j59J15j16
$$ y = [28, -77, -156, 8, -267, -7, 48, -38, -257, 77, -203, -95, 104, 27, 81, -181, -93, -51, 77, 211, 63, 25, -304, 33, 230, -64, -129, -22, 130, -171, -202, 84, -28, -222, -130, -107, 170, -202, 12, -222, 63, 213, -184, 31, -174, 86, -31, 42, 265, 78, 234, -6, 229, 362, -100, 265, -5, -10, -36, -28, -195, -145, 59, 53, 146, -2, -58, 224, -137, -68, -174, -55, 30, 263, -130, 39, -9, -44, -136, -366, -138, -11, 156, -208, 61, 50, 239, -101, 276, 48, 19, 30, -17, 19, 40, 8, 151, -15, 77, 184, -131, -157, 259, -46, 13, 131, -257, -88, 66, 4, -15, -84, -48, 134, -102, -250, 61, 192, -110, 41, 37, 320, 104, -119, 174, -122, -116, -209, 37, 87, 64, 35, 115, 287, -344, -169, 121, 193, -50, 101, 158, -19, 0, -187, -71, -152, -1, 66, -92, -150, -29, 246, -82, -38, 75, 201, -285, 157, 107, -155, 45, -159, -152, -66, 142, -121, -58, -30, -181, -119, -160, -122, 164, -21, -173, -196, -37, 187, -67, 15, -92, 217, -146, 103, -56, 59, -57]
7763e7j82L18o4o6J24k42M90m16J40m5J34J1j02k32K30j18j28l8J08J25L91k41
7785A40k28L76l19j71N8L59o1j94%J26j21J38J27j44J01l42J60K15j85j51j51
7806b67L29j4o5kr5O0J97k17j35K68k21K71pM1q2J21j88nj3j34J53r3j10K02k1
7831b7J24p1o3J75k49J58j01p7L9O7J74j76P7q1k67L81j51k15K17L07l25L46j12
7854A50n4l30J09K21p8K62k77n4J96k35q1L64r2J30k96J4jkJ80k81j32J45J03
7877c9R7j63j06L31m0j24p9K98q9k05K19k28J40k02mL13j01l6NJ23O3k7l60J49
7901f5n8N2J61k82L31k32K18m0j93J59m4J45r3p1o5j26K33k2J93l72J77J56l29
7924a67L24j70R7%q7J23k84J74Q2K2j37L47k96k75K49P5l36K01m9K43pj54K96
$$ y = [-57, -239, 79, 15, -51, 73, -169, 321, -95, 45, 0, 134, 145, 43, -189, 41, -77, -205, -243, -135, -10, 381, 140, -88, 288, -31, -202, -144, 215, 154, -40, -40, 86, -35, 103, 230, 86, 187, -155, 5, 220, 35, -116, -267, 62, 48, -17, -19, -114, -54, 143, -74, -209, 59, -162, 109, 102, 143, 61, 182, -6, -11, -24, -158, -5, -98, -208, -6, -27, 97, 26, -37, 138, -111, 47, -54, -131, -92, -25, 149, -27, 50, -31, -298, 83, -68, -283, -66, 241, -84, 262, 150, 96, -234, -125, 96, 18, 280, 3, -51, 145, -90, -171, 193, 101, 231, -65, -51, -52, -54, 126, -155, -287, -142, -39, 58, -105, -211, 120, 80, -44, -123, 175, 86, -119, 100, -128, 12, -190, -194, 119, 18, -18, -13, 110, 173, 146, -214, -65, -123, -71, 90, -192, 139, -93, 125, 85, -108, 51, 7, 152, 59, -12, -77, -203, 30, 8, 201, -171, 6, 162, -167, 157, -13, 84, 84, -3, 120, -164, 10, 92, 114, -23, 324, 28, -247, 2, 77, -259, -58, -107, 136, 129, -25, 271]
7947B71l45k12L06j24J61J10M6k35m1K8m1oJ41l5rJ22l5l12J87j74K52l8N1P5
7971A43R2m73K87J03o7l28J78J23Q6k46P8ll8j96L38p6p1lJ3K08l23J38o1L42
7995B44j11j80J28m4o1l6J12L6j68J20j0K76k01j19J22k14J72n5J1l4J4O5l28
8018b61K66r7J24j17J34j44N3p2JK29r9L0j76M92Kk40j96j55J97J51k68L60o8
8041A46j41k34K19j3p4P4R8q9k44J77r7j65M78p7o0L23k40j34j28N90l12j83l0
8064a16O8K03j32LP4J11m05m6J30M6J86j43N2M1k32M02l7k56M1k22J91J46l60
8087b55K71j76J19M1m01M34n7Q0q8j65J49%J24o8k7N6Q2k5m14L56Rl0O3m9L6N4
8113A19J21l52J14j71J78K2j31k4LK34l86K80J66j94J48Q0q3k38K32k08J30K1
$$ y = [271, -74, -286, 20, -104, 57, 167, 213, -22, -63, -35, -76, -82, 59, 24, 15, 137, 102, -210, -23, -197, 55, 17, 68, 143, 235, -238, 49, 152, 85, -243, -65, 58, 144, -102, -24, -27, -65, -261, 77, 1, -70, -73, -60, 148, -175, -37, -98, 244, 133, -47, 81, 37, -24, -60, 52, 88, -80, 40, 30, 306, 105, -14, 108, -106, 66, 11, 22, -12, 2, 67, -261, 5, -92, 32, -85, 49, -95, -42, -114, -113, 116, 17, 47, -129, 363, 365, 125, -71, -226, -29, 122, -146, 214, 146, 5, -229, -10, -23, -97, -23, 75, -14, -258, -81, -178, -343, 135, 58, -2, 321, 81, -53, -181, 409, 97, -86, -116, -48, 155, 23, 26, 100, 211, -194, -240, -110, -64, 122, -21, 31, 72, -160, 242, 205, -51, -10, -232, -41, 105, -255, 16, -160, -41, 0, -401, 33, -24, 56, -32, -197, -48, -48, 76, 8, -19, 37, 119, 94, -320, 36, 45, 15, 78, 29, 65, 119, 240, -112, 2, -169, 9, 31, -100, -124, -121, 113, -273, 7, 173, -21, 127, 207, 124, -114, 118, -90, 40, 61]
8135F1P2j41j37N0K22j45J38k69K19k28j66L34K0m7n9j45K05k96L36j27K03l39
8157b39L42J8k47J50J00rj96M8kR1M4JJ20j04M2l00J23O6j80J05K21l14j15L66
8181A31j18k05J13J37j93K28M1q4k4O6
$$ y = [61, 133, -8, -145, -95, 127, -18, 120, -149, 70, -158, -324, 10, 30, -17, -76, -221, -16, -312, 24, -103, 100, -239, 103, 121, -126, 24, 124, 115, -81, -33, -35, 56, 100, 101, 221, 117, 159, -141, -18, 48, -132, -27, 194, -120, -235, 131, 13, -192, -79, 58, -135, 93, 134, 50, 26, 92]
8191I2
$$ Imaginary data points
##PAGE= N=2
##DATA TABLE= (X++(I..I)), XYDATA
0@%%%%%%%%qQqJ6j6K4l2M0m8N6p2Q8j04J23j47J76k08K40k80L28l77M33m96N65
32C01o42P28q23R28j046J173j312J465j630J811k011K230k468K727l010L321l661
49a919M033m443M894n394N950o570P268q059Q963j0008J1235j2697J4474j6687
63h960J9534k3353K8770l7113N1760q5022K98865J32880k04107K08906j90914
74A91246j0273p615o8385J6779o9799J994O0505j48686J26109K3426j45987J37298
86A06612P477j13604P8249j0802m0268n60p7O935l9388r098P5744r9635K1010
99a7405J10499j22335J6759R7357j07977M852M5569o5352N287k8570O170j4253
111f9399p6259R7679n2439o7467J45062n4727m2702J17326k9899r102N3956o338
$$ y = [0, 0, 0, 0, 0, 0, 0, 0, 0, -8, 0, -8, 8, -8, 16, -16, 24, -24, 32, -40, 48, -56, 67, -80, 96, -112, 128, -152, 176, -201, 232, -264, 301, -341, 387, -436, 492, -554, 619, -693, 772, -858, 953, -1058, 1172, -1296, 1431, -1579, 1742, -1919, 2114, -2329, 2565, -2829, 3121, -3449, 3819, -4240, 4723, -5285, 5950, -6747, 7727, -8960, 10574, -12779, 15991, -21122, 30638, -54384, 244481, 377361, 173254, 382160, 191246, 180973, 173358, 104973, 121752, 51953, 53947, 114452, -34234, 91875, 115301, -30686, 106612, 114089, 485, 78734, 67932, 27664, 27104, 27027, 33962, -5426, -14524, 61220, -38415, -17405, 93094, -29241, -12482, 84875, -23102, -18250, 27319, -38033, -32746, -61316, -55146, -69399, -145658, -47979, -100418, -167885, -22823, -77550, -120252, -2926, -32825, -41927, 12029, 5691]
123E691K2639l0056L8665J1090q5797Q5824O064r3072P6168K1927p7193N1719
135C3669K0164m0973K0086R647J909l5129Q178L4923p3154M370O6575p7571l761
148c1067P8077o7394R796N1982k3503J2833J0935K9340j6805k1933O5782l4006
160F4037n2791Q1459m5077n7070O6016m1077l0027K5636j083j2196j3158L5641
172B0310l197m5210N0316J4856p1573M9415J3672o9391L1012J1743l7950M830
184c1167K5763o683j5606K3380L3429l6548J0483O1274n8335L175M8530n7241
196D54j1079L0880k9610k0371J2790N865j8800j3920N0156j9727k6865P0697k3687
209F783l0113N1770j2414l5032K8730L329k6691k145J9007l490l5859M1713J0791
$$ y = [5691, 28330, -1726, 36939, 48029, -37768, 48056, 54120, -38952, 37216, 59143, -18050, 33669, 53833, 12860, 32946, 42593, 44502, 9373, 17551, 52474, -20680, -16310, 50265, -27306, -31067, 47010, -20384, -10588, 41394, 17891, 30724, 41659, 70999, 54194, 32261, 98043, 64037, 11246, 92705, 47628, -9442, 56574, 15497, -14530, 11106, 10023, -2173, -15331, 20310, 17113, -28097, 22219, 37075, -34498, 14917, 28589, -40802, -9790, 1953, -35997, -31167, -5404, -12087, -27693, -4313, 29116, -7432, 3051, 64325, 5990, 9165, 57695, 454, -10625, 20255, -9355, -29726, -16936, -11071, -29871, -43791, 6365, -13362, -40227, 30470, 6783, -23330, 28440, 16026, -19006, 9724, 13053, -13638, -15783, 3224, -266, -36125, 5588, 16379]
222A6379m5189M3423J8163m8528K3243K7721m3635N848J9631j8019j9735J0262
234a0436J6901m0849J2922L8376m1367J584N0542l6732j0428M6420k2937j2791
246h795J6949O765k3654o793L1184k5352j8761M4649j3473l6546M8975m645l3746
259b3243L4142O318k1159P72K1473j5418k2142K7021L407l9676K5300K2658n1067
272c1614K3972K7147l5111P847K7808j2038j5451K1155M353k6336N447K9729l7673
285a0765q174M3643l7431j2854L7766j2930j8659K6891M956j9790O631K1234j3211
298G307k0098L9241j2990l5660L7586l659l5861K4375J3875k8511J2051J7409
310A5065r840j0141K3450J0213l5417K4525J6551m2812R039K4178l6487j067K7979
$$ y = [16379, -28810, 14613, 32776, -15752, 7491, 35212, -8423, -2575, 17056, -963, -20698, -10436, 6465, -34384, -21462, 16914, -24453, -22869, 27673, -9059, -19487, 26933, 3996, -8795, 8154, 14919, -8735, -15528, 15656, -9696, -28457, 16192, 2719, -33827, 15148, 10503, -23243, 10899, 17217, -3942, -3170, 18303, 2885, -19257, 7764, 11171, -28505, -3205, 19453, -31614, -7642, 19505, -15606, -7759, 20049, 8011, -7440, 13715, 18068, -8268, -2821, 26908, -10765, -18939, 24704, -12727, -25581, 12185, -745, -19404, 7487, 12443, -7347, -716, 20518, 7307, -12791, 26450, 13460, -22200, 15386, 11727, -24134, 241, 14116, -14395, -2344, 15065, 5225, -4916, 18534, 28747, -6670, 17855, 34406, -8406, 633, 24811, -11676, -12743, 15236]
323A5236k1448p228J7167P733j9907R088K9148k9740n306L3154k7242k3738L4674
336A1591j8429k3680K4619l024j6181M964K3411j1878r978L4433l549k8989L0099
349A3409L045m0047K4876M021k9166N595J0801j2581j2263K1795N116k1401J8115
362h685K3169l3543R884K9210l3304M359K0996j7376j0824J5334J238j7432Q987
375g987K2422j5716o466L9117j9288j2669L7635j3046j6629K0222k285k2244L375
388F441O902j4349j4724K1009l351l0686L0794K336k7670K4601J0951k2493R217
401a022J3730j5568n610J0535M412k4207J2196J7547l2764J0840K3409k4317K317
414h502K6396j7172m921J5117m665j2056o17J6550k3260j0615K5258k1602j5151
$$ y = [15236, -6212, -13440, 3727, 11460, -8447, 641, 29789, 49, -5257, 27897, 655, -23083, 11591, -6838, -30518, -5899, -8923, -25104, -20140, 3271, -8607, -18585, 15848, 12299, -16690, 13409, 16454, -23593, 1283, 5304, -23862, -18267, -7466, -20047, -32310, -10515, -5399, -26800, -8685, 14484, -19059, -9175, 20035, -13269, -8910, 12086, -5290, -16114, -780, 458, -16974, -7987, 14435, -1281, -7747, 31370, 12082, -587, 37048, 24002, 7373, 27595, 25310, 3066, 6441, 13343, -1006, -15730, 5279, 1928, -28758, 2036, 4372, -23298, 1303, 12254, -10239, -1022, 12708, -2860, -8470, 2065, 6477, -17730, -5534, 12013, -20751, -9911, 13498, -10819, -8502, 17894, 722, -4199, 10918, 6253, -5803, -6420, 10130, -13130, -23745, 1513, -20089, -35240]
427c5240K9513r682j4989K9028n42p548J1748J4641k604p802K5808m278k2362
440E691K2856J784l0738K0073P767k5380J3167P984r748l611J3937L276j8756
453H302J1292R797k9268J4J8923l2754j389J8486k0034k619J2896J890p502J1018
467i48J7797j0014k528K7038j4588j6740K9240j7186j6812J5920q928j6061L384
480a0426N788j0937o096J5354j003k2054K2046K478k7449K0201L965k0915O944
493b2104R296j3133j876J3092K502j0271J2124J9150k1573J0848K2664k0844M601
506D476J9224j5456p213J2818p800j0744P05Q808j4171r390K2583j7279j1336
519b4775K5052q379j2986K0152k037j2539R593M427n149p437J7213j800j9001
$$ y = [-35240, -5727, -15409, -30398, -1370, -1912, -9460, 2288, 16929, 14325, 6523, 32331, 28053, 5691, 28547, 30331, -407, 19666, 27433, 2053, 15220, 23204, 13456, 9845, 23782, 27058, 8302, 19594, 29391, 123, 137, 19060, -13694, -15083, 3403, -16631, -19250, -6354, -4464, -11966, -948, 16849, 6835, 4307, 31345, 16757, 17, 29257, 12071, -4741, 11179, 2251, -13810, -10426, -4638, -15575, -21671, -6317, -7320, -29374, -7328, -4850, -32299, -12098, -8133, -29048, -22104, -12808, -25941, -27817, -14725, -12223, -22494, -10370, 8780, -12793, -1945, 20719, -125, 4476, 23700, 8244, 1031, 13849, 6049, -4695, -3990, 4818, -9353, -18743, 3840, -13439, -24775, 277, -8102, -21088, -936, -2973, -15512, -5919, -1492, -6641, -14078, 3135, 1335, -17666]
532a7666K1632K370j9689J7256R887j9276J0990P937j1947k077O606M88j7443
545a0932Q219O799k3727L043J5713k0430n15K0361j4919j55J3319n44n398O098
559c068J3774j1729k718J8453j1435j2575K3428r452j3699J9131n051q405N354
572B008O351n770m890J3438m040j6857J3705J320k4482J4095L034j8153P460N898
586f883p863k169J2037J919q286R012J1388j7154L244J7444k0583J642J3730j3248
600e770m979R930l003p989N716P423p477n912J7832j1904j0744J9932j0349j0320
614a7614J2989k247j0967O644M612m481k212J1631J030j4633J7267J309j6579
627a3251J3402M597j4524M920O500j0899m41N846O37r250O426R128j6683N610
$$ y = [-17666, 3966, 6336, -13353, 3903, 13790, -5486, 5504, 13441, 1494, -583, 6023, 6511, -10932, -2713, 4086, -19641, -16598, -885, -21315, -21830, -1469, -16388, -16543, -3224, -3768, -9166, -3068, 10706, -1023, -3741, 14712, 3277, -9298, 14130, 4678, -9021, 10110, 5059, -3346, 2008, 8359, 2589, -2301, 11137, 7097, -9760, 3945, 5265, -19217, -5122, -2088, -20241, -12781, -6883, -14746, -16915, -4878, -2959, -11245, -2233, 9155, -7999, -4755, 12689, -7894, -6252, 7478, -5770, -10749, -819, -3822, -11811, -6095, 1328, -6149, -12061, 5771, -6133, -16877, 3055, -7294, -17614, -4625, -6872, -17839, -11195, -6583, -11064, -13276, -1645, -615, -15248, 2019, 3328, -13251, 151, 4748, -9776, -4856, 1644, -9255, -9696, -3850, -3213, -12463, -6037, 3091, -13592, -7982]
641g982J2502j4092M81J4569j1824l413J0256n213m004K951Q214q902j935J5257
655F865r386n852J6912m166j0082J4855l515q322N566K130n137m968J0953m041
669A812j0782J1450J715j4062J1456O660j4044Q175M460o930r91O577l74q774
683c652O664M106j2692J477J1900j4227P65J2812j0828j000P933j587o193N433
697I11N064q009j659R272q356q861J5535p539p839J1777j954o388N883N568n805
712b400R01Q754j967j0107R787K95j5128J0212J609j1529M269N876p986K21Q788
727A595j609m348N703O203j2952L738Q489j3746P57Q614q971m005R215l811l593
742h721N674N779m908j108J2771r016l832J2271n958p819R450k065r762O042J491
$$ y = [-7982, 4520, -9572, -9091, 5478, -6346, -9759, 497, -4716, -8720, -5769, 2445, -6457, -8392, 6865, -2521, -8373, 8539, 4373, -5709, 9146, 5631, -2691, 2875, 5005, -132, -5100, 5853, 1812, -8970, 2480, 4195, -9867, 1589, 8249, -5795, 2380, 6840, -90, -1081, 5496, 5122, -3652, 3012, 7118, -5574, -4097, 7803, -6424, -5659, 7153, -3675, -4675, 3258, 1671, -4522, 911, 5975, -2034, -3693, 5579, -2777, -11638, 3897, -3642, -11481, 296, -1658, -8046, -2163, 3405, -2400, -1499, 7255, 5288, -4819, 4968, 5263, -9865, 347, 1956, -9573, -5304, 572, -7414, -7193, 1595, -14, -4362, 1341, 7544, -5408, -1670, 6819, -6927, -6170, 2444, -6527, -10532, -1317, -5128, -8721, -3047, 2732, -2176, -3284, 9487, 471, -3361, 8910, 2952, -4867, 4583, 2518, -7244, -1202, 289]
757B89m299j040R013k297p757J1696qr644Q041M453j1691M752L731r574O1M659
773C85q81p036O770L758r664M598Q748q583M79J1501q765j937O894l652m756K746
789F05L764q193k08P905o872n246J1740l430p331J1631k799o029L874L553n537
804b573j359P054m554n763O953J859j0741R554M300r076O231N116m811k18P652
819I624k777m446M905K194r696L20P736j1473P17P403p269k836O928j612m901
834e183N616K407m603r74P051o736n250J0030n239n372O927N8o790N279L650m393
850c522K110N861j069o563P315j109r539N836J088r346J260M194p770N90N107
865e557j238k800M920M028q045M728N843o557K28P693n731k361P717l118j830
$$ y = [289, -4010, -5050, 3963, 1666, -6091, 5605, 5597, -4047, 3994, 8447, -3244, 1508, 5239, -4335, -4274, 385, -496, -7532, -762, 2996, -6668, -2070, 6678, -1905, -1426, 10075, 1310, -627, 6267, 2615, -2141, 605, 4369, -3824, -4032, 3873, -2999, -8245, 3495, 65, -7266, 4365, 1566, -4463, -589, 2964, -2573, -3932, 3122, -1432, -7195, -242, 1617, -9124, 430, 4730, -4346, 1885, 7001, 2190, 1972, 9624, 6847, 2401, 7306, 9500, -196, 124, 7860, -3613, -2896, 4507, -2762, -5598, 1330, -282, -5183, 433, 2840, -1763, -2737, 4314, -2422, -7672, 2358, -2881, -8253, -1326, -1268, -8058, -2779, 871, -3522, -1412, 4449, 3380, -3183, 4132, 3023, -6516, -680, 408, -8938, -7678, -3484, -11254, -10664, -5557, -6795, -9595, -4675, -647, -8692, -3964, 1879, -4678, -4450, 3243, -2488, -4849, 2868, -250, -2080]
880b080M113M029m356J164O738n485k012O966k622p086P288k472p285L670J78
895G48m242j074N919l723m002O402M59o276N989M230p816M815K718m929K71M503
911C992j523m014N409N60n491J727N511p323N51O939p153j246L558k406m531L922
927a518O78n296P19M007l849l510Q741k843l458P655q69l885L940L136m194J788
943A242L988k639l372M746m8p476O049J224o406K348L163n524NM666l148j558
959b740K730J245o262J599M901p377J358N495m173k035O851k352j688N102J218
974C872k691R9N242n933j928N855l743m239M725q72o003N021K79l022J014M158
990A834k318l846N855j957m789L876K160o652K874L596n602J875L722p37k063
$$ y = [-2080, 2033, 6062, 1706, 2870, 9608, 4123, 2111, 9077, 6455, -631, 6657, 4185, -3100, 570, 748, -3494, -4568, 1351, -2372, -6374, 28, 487, -5789, 200, 4430, -3386, 1429, 4147, -782, -511, 3992, 2469, -1545, 3864, 4424, -1067, 660, 6171, -1152, -601, 6338, -815, -2061, 1497, -909, -5440, -1518, -840, -6136, -5417, -1410, -5259, -8769, -28, -2871, -6329, 1326, 457, -3428, 512, 3648, -546, 1242, 5230, 2591, -781, 3965, 3917, -3559, 2490, 3714, -2692, -344, 2819, -2705, -2700, 1966, -1182, -2740, -10, 1235, -5027, -3428, 1473, -5904, -4546, 949, -3224, -5259, 1592, -760, -2448, 2654, 3872, 1181, 1280, 6522, 589, -1339, 4516, 773, -3466, 1259, 387, -5616, -595, -316, -3338, -2324, 1834, -484, -4330, 1525, -432, -5221, -1345, 815, -5837, -2963, 633, -4969, -3094, 628, -109, -2172]
1005b172M740R25n114K959L008m915r51O034o181j619M527l457k315L040J850
1020C59l795K030L383l330j387O030j937m720O606j993m313L067J105l340R17
1035a318M023k801j508L911P37m621M705K133n959L317J328m180l98L554k968
1050d5j429L021j39l388J210M797n336J219M855l724j260M125j853l176M367n34
1066B710l027K17K776l268k359N723l134k076M433k36m267L368J756l710K130
1081A036J548j687l268L591p75m899M224Q76l888J789L028m149J327L792k178
1096C67o31K044Q11m645J988J940m347J78L776l632j473M927l243J01L084R50
1112B195k257Q33L011l438q93L039j040l681L816j275m136L737K22j765R05L194
$$ y = [-2172, 2568, 3493, -1621, 1338, 4346, -569, -1520, 4514, -1667, -3286, 1241, -2216, -4531, -1491, 359, -3436, -1406, 1977, -1353, -2740, 3290, 1353, -3367, 3239, 1246, -3067, 0, 1105, -2235, -1318, 2705, -96, -1604, 2307, 3044, -1577, 3128, 5261, -698, 2619, 3947, -233, -631, 2923, -45, -1474, 1547, 1408, -1980, -770, 4027, -1309, -90, 4765, 1041, -219, 3906, 2053, -1123, 3244, 2710, -317, -100, 2676, -592, -2951, 2772, -362, -2438, 1995, 1759, -2508, 860, 2616, -1094, 1036, 2584, 897, -2371, 1220, 445, -4454, -230, 646, -3242, -1453, 1575, -2574, -1247, 2545, 367, -264, 1780, 2591, -2054, -66, 1874, -2473, -2295, 1481, -2151, -3624, 1303, -1940, -1839, 1245, 2195, -62, 771, 3782, 344, -549, 2490, 1450, -2231, 1585, 310, -3826, -89, 133, -1632, -727, 2467]
1128B467j802j149L391r33k716K126J953o012K433J093l819Q86K290j566o76L608
1144A574n18j839Q93K854l149l95M392m777q00K262j731k010K969M03k493J872
1160d93J224j426j794M938j436k590M335j629k416K290P91l655J870J791k007
1175b07q21J767N94l640M005N91l170J750J757k923J5L358k868P9J595j89k579
1192h86J243K581l389J044L061j989j337L924j906j608L093j005j420J34J176
1207B716l113o58K836j776k044K901j9l798L132K76k002J250J482j455j463K766
1223A031j186k097J910J303l394J089K196l510J629J889j306n79K271o26k731
1238b111J703P18k404j005L017l227j021K978j970m81K549R56j647J938J494j407
$$ y = [2467, 665, -484, 2907, 1974, -742, 1384, 3337, -2675, -242, 851, -2968, -2082, 208, -1358, -2034, 1574, 1056, -783, 110, 2964, -185, -580, 3812, -965, -1765, 497, -1234, -3244, -275, 128, -2365, -493, 731, -695, -2489, 2449, 1013, -1577, 2758, 1129, -1287, 1003, 1794, -1861, 9, 1800, -207, -1028, 739, 1333, -2307, 1698, 2289, -881, 869, 2626, -297, -282, 3076, 208, 287, 1882, 1693, -886, 357, 2938, -451, 593, 3654, 1665, 328, 4252, 2346, 738, 3831, 2826, 1406, 1540, 2716, -397, -1055, 1781, 5, -2039, 862, 843, -2955, 177, 453, -1549, -299, 1183, -272, -1735, 1031, -155, -2252, -342, 961, -2433, -1344, 852, -2658, -1029, 860, -446, -1025, 1246, 620, -2111, -408, 310, -2094, -3099, -82, -3309, -4330, -1352, -3322, -3803, -1254, -298, -1945, -7, 1487, 80]
1254H0l27K367m21k813L677j446j956K065P78j773J310K034j956l6J456k20k862
1271d3K168N65l458J700J80k491K34K073j633l10K630m42p62M46K288k287O90
1288A548K441k410p70J888j092j797K764j116j464N30P62j389j527K985j531j664
1304a842J733l38k549J509M66k456J585P63q60p46K199k19j378K529J126j839
1320c17N47K262k687R21J494j802k73P91j94k464J003J166j956L5J863j474j508
1337b593K665j735l71J736k42p04N54J253j943J02K102l10j618K147M36k531K453
1354A401Pq97O99J500j506j091J304j359j274O72R61k769J010P70k260Q48J571
1371d13l15o20J837o32n34N80J248j423n97K474k115o5J036k29n10J626J16j044
$$ y = [80, -247, 2120, 1699, -1114, 2563, 1117, -839, 1226, 2004, 231, 1541, 3575, 1619, 1583, 3039, 2819, -43, 2125, 2690, -768, 932, 1112, -1379, -1145, 928, -705, -1015, 1615, 1173, 411, 857, 3145, 858, 1548, 3989, 1579, 809, 2697, 1605, -192, 2572, 1456, -8, 522, 1284, -105, -1632, 1353, -178, -1842, -109, -447, -2996, -1487, -1021, -3477, -1892, -1129, -1989, -2735, -536, -755, -2133, 396, 1522, -317, 230, 2492, -195, 726, 2220, 418, 145, 936, 742, -1722, -719, 447, -1509, -1474, 389, -1085, -2593, 72, -1663, -2034, -298, -540, -1244, -690, 563, -1380, -1278, 824, 514, -1104, 1043, 1479, -1052, 1401, 1408, 511, 1210, 2710, 1204, 113, 1417, 58, -1216, -544, 417, -2352, -1342, -572, -2832, -1984, -413, -728, -1348, 489, -143, -677, -97, 1151, -272, -869, 1605, -510, -575, 461, 232, -278, 1348, 1464, 420]
1389D20J245K12q46j087J805j298j752J700q39j512Q23O85j473J709Q54j089K55
1406a88J141N64j860J862K10j537M47Q89j793j59K047j731M67P73n5j124L55J539
1424A847j890M35J027j082r29J276q15j460K016q72o84M78R29j035k26K063q74
1441B04o01J324K4k103J694J63j238P17J49q03n10P57k71q65J375L12j199M61
1459d10J449k223P72R58r66j18Q24l26j273R36N9o63K15J526j350n49J872j430
1477f97R1Q62M42r23N19L61j306K08O82J20j584J928n16j305J193N45m86J35J176
1496A445r11P7M42o98o78N94R11k398M00R64j144O76J209j109K68J348o02n13
1514B81J77J074j207k56J316j750j13N52k87q45J885o66j81O52K49m60o35J699
$$ y = [420, 1665, 1877, 1031, -56, 1749, 451, -1301, 399, -440, -1952, -1129, -444, -1917, -208, 646, -443, -188, 953, 1517, -343, 1519, 1729, 192, 639, 1528, -265, -424, 1623, -108, 359, 1132, 1077, -47, 308, 1847, -43, 392, 1419, 337, -592, 684, -131, -1591, 425, -447, -1131, -653, 276, -759, -985, 1078, 204, -397, 927, 951, -1152, 542, 705, -533, 184, 333, -470, -980, -223, -494, -1359, 16, 328, -871, -410, 1039, -1184, -412, 546, -420, -538, 286, -40, -1313, -377, -318, -981, -766, 760, -590, -1139, 733, -697, -606, 256, 698, -225, 294, 655, -651, -443, 239, 359, -1225, 703, 187, -1118, 75, 620, 134, 269, 1445, 534, 611, 1053, 355, -323, 271, 1182, -1216, -816, 148, -996, -320, 889, -220, 48, 1396, 794, 281, 458, 1532, 325, 69, 1385, -365, -478, 74, -213, -1058, 827, 161, -20, 632, 881, 421, -214, 1485]
1532A485j111j105J092m15j329M98N09j131J336J7j08k58Q10M9l07O66L87p30
1550C55Q4P45j608K40J060j466Q13o0L2r16R05M34p38L9J178m49j159J077j234
1569f68k72J342p66K2NJ171j551J245k49O6O67M93j25j599J133l49l30l0N36j068
1589c27l43K62J96r97N00Q52j096L09O18r95P27J35j11l93J068l57p66M77J8l30
1609e53j37J489j367r4O83k81j33N85m2p84N36n5r16k19P76k46r47R90n61l08
1629a584N32L85k34Q13M77l23N84O6J59k49O24J1j042K87L1l10m60J276q50K39
1649D32M49j27l20o2P72j105j45M78p41m09N73k86j69J065l43K3P73j80p2M46
1669A052N50o96l56M00m8j292O10Q7q32N73j83n72j75N58m33k70M76J43m57m80
$$ y = [1485, 374, -731, 361, -54, -1383, -885, -376, -1507, -171, -154, -262, -520, 290, 339, 32, 698, 1085, 355, 439, 1184, -424, -184, 876, -590, 223, 163, 195, -721, 184, 618, -120, -81, 1097, 648, -511, 566, -668, -940, 402, -364, -342, -337, 834, -717, 528, 279, 345, 1012, 1505, 1380, -219, 914, 565, 235, 205, 741, -327, -670, -408, -212, -1209, -709, 143, -953, -644, -26, -1021, -294, -159, -270, -663, 405, 48, -718, -241, -223, -553, -690, 799, -568, -662, 21, -260, -393, 192, 150, -634, -98, -153, -1069, -1288, -512, -758, -1705, -715, -1276, -1584, -1052, -667, -901, -88, 389, 66, 650, 716, 875, 626, 1250, 1261, 219, 506, 537, 227, -233, 1043, 193, 432, 881, 754, 434, 372, 1144, 39, -106, 372, -369, -778, -205, -491, -660, 405, 62, 85, 858, 678, 606, 1052, 1602, 906, 550, 950, 902, -390, 220, 307, -525, 48, -135, -707, -882, -324, -757, -1027, -551, -408, -865, -1345]
1689a345Q94j143M61K63k21M01L38k1l61P71K09J66j15P60n50o38R86j105K08
1708d2K36j64q20N28n87l45J08M23K29r03J112q0n66O69J34pL97K71p41M42L46
1729F40n00K55qN64l47M05k2p32J87M65n46k4N10r80J48m28J05k97q0M10l38o8
1751f81J01J65k90R90j14k5O89k40j7j01P40n45k55L60m32k72J9N09q09Q52J08
1772G52o28r0L10k14o56P96l93k68q4K40p52K78O63l25M10L31J36j01L55M03p78
1793C85N65j83k7j109O27n04r4M98j65m0j08O6l74P0J62L76l74J22k48o66O20
1814d01j80N8L21j56J33j9M39m63M34p3M08l95J84J19n71K89j51K04k04J82p13
1835e55P1M55l53L67m47Q61m28j83M28j75J91J33K54q37O73m29K64l54N51k30
$$ y = [-1345, -451, -1594, -1133, -870, -1091, -690, -352, -373, -734, 37, 246, 412, 297, 1057, 507, -131, 855, -250, -42, 194, 30, -790, -262, -849, -1194, -1086, -663, -434, -1337, -225, -305, -871, -202, -68, -75, 322, 593, -148, 294, 640, 140, 395, 387, 951, 604, 1009, 987, 255, 442, 907, 361, 337, 847, -133, 15, -413, -308, -605, -685, -275, -613, -681, -580, -415, -705, 285, 171, 146, 835, 595, 578, 477, 1217, 672, 417, 777, 345, 73, 92, 601, -208, 644, 752, 124, 34, 344, 130, -526, 270, -123, -391, -475, -235, -987, -709, -46, -371, 39, 370, 506, 405, 760, 1163, 385, 950, 767, 740, -369, 258, -246, -340, 158, -7, -47, -155, -89, -463, -393, -231, 145, -229, -107, -355, -1021, -401, -581, -523, -202, -358, -225, -244, 195, -268, 166, 93, 501, 106, 290, 409, -162, 127, -24, 180, -24, 158, -555, -484, -29, -382, -15, -462, 399, -29, -212, 216, 41, 232, 365, 619, -218, 455, 26, 290, -64, 487, 257]
1855B57J98J76j19l07j63M35m38L33K07l37K14l34q7k54K19J93l11L06k98k23
1875c33j08M46r0L81J93n51K68j10k21l42J44N41n28j97K24O9m42P57k03KM43
1896C43l75N1N2J28l40p1O8ln09R3L58l86N72m79L38nJ53r3O4J51J06n4n27L14
1920e1n94L50K53j81L05J33l1l98L38k95L57L6J98k40m12M4j46J31j24J45rR0
1942a01q3m33L95O9M77p41N83k54l01K21q3K60j53M10o91N55j23k62L13n2J71
1963A77l43K32j05j8k90N1N4k79N83o74J95k75J12K22K6K86m16J27k4N7j07L78
1985c1N3j80M05l11p5M5L67o3k57J7m0P1p3L36l47L94J55m39m1j54K65j50J93
2008A40k19J94k46J63L2P7K91j5L37j78J82k2q4q0k5l8L1r4o93L33j1k28N67o55
$$ y = [257, 455, 631, 512, 205, 42, 477, 39, 372, 579, 242, 456, 122, 35, -219, 0, 193, -118, 188, -110, -333, -441, 5, -85, 296, 489, -62, 206, 96, -125, -467, -323, 218, -310, -507, -283, -214, -656, 101, -102, -100, 343, -32, 19, 71, 199, -141, -212, -144, -147, -656, -563, -205, -591, -19, -498, -160, -165, -12, -105, -41, 110, 216, 162, -365, -51, -645, -295, -42, -223, 82, 215, 184, -214, 124, -171, 186, 222, 420, 180, -232, -188, -334, -203, -327, -182, -191, -101, -184, -617, -222, -153, 324, -417, 166, -88, -389, -168, -251, 9, -144, 266, -425, 130, 7, -255, 58, 6, 177, -166, 66, -39, -57, -347, -296, -242, -521, 62, -612, -417, -692, -580, -358, -332, -46, -462, -335, -359, -302, -409, -31, 22, -158, 247, -64, -139, -94, 273, 210, -47, -30, -70, 1, -72, 264, -83, 311, 466, 27, -14, -168, 97, -53, 140, -79, 115, -131, 32, 64, 141, 432, 417, 754, 576, 758, 736, 652, 572, 547, 509, 540, 446, -247, 86, 75, -153, 414, -241]
2032b41K69N6lm38J89M8r4K37l58K81o05M10k47K24J50J32k6j47L62l31M88l21
2054C5R3k6l66K76n72K56k04J73n0K17j76k53L53m6K98K9L76n96Rn6J29p7L73
2077A95L3m4J62m1n4L91n6J20k02k74K5R0j84K51k46j3J59m83L80k88P7J08j31
2100b5O13l31J17j53Q7q1K14j00nK61k93P8j47K90k39N2O3k47j0k09M11n29K44
2123F1L0j99j70P3o6L2J48j48K92l85K33J05k27L49k1K68m03K48r5m1J32k15L18
2146C19k07q6n16O28l76O6k2R2L68m77R8j37M48k07j9J91k10P9l20K68j92L37
2168A25p5R6L13R7j48k54M85l01Q7k70j00K56n69K12n5J29j44J47j15l6J69q0
2190c1J64K4J30n36K71j81M2J56j48K20k30L79o46N72j27l13M85k00L76q83O55
$$ y = [-241, 28, 84, 81, -357, -168, -120, -214, 23, -335, -54, -659, -249, -496, -272, -122, 10, -16, -163, 199, -132, 356, 35, 128, 102, -264, 12, -560, -304, -508, -335, -385, -168, -344, -597, -244, -290, 8, 37, 413, -183, -174, -230, -101, -178, 195, 228, 184, 346, 305, 251, 642, 586, 706, 504, 230, 255, 345, 161, 412, 166, 153, 312, -171, 209, -79, -2, 106, -25, 588, 257, 374, 221, 308, 227, 441, 341, 336, 597, 304, 382, 235, 525, 286, 338, 401, 154, 144, -65, 346, -183, 61, 91, -108, -278, -205, -271, -239, -91, -239, 53, -332, -99, 6, -221, 128, 107, 375, -28, 220, 125, 84, 216, 1, 319, 112, 26, -490, 138, -238, -172, -194, -102, 266, -211, -113, -250, 198, -9, -28, 163, -47, 32, -288, -20, -212, 125, 50, 146, 459, 556, 408, 154, 639, 338, 425, 155, 55, 311, -258, -46, -101, 28, -116, 31, -84, -120, 49, -31, 133, 157, 287, -249, 22, -159, -117, 39, -109, 111, -119, 260, -386, 186, 59, -254, 231, 31, 407, -476, 179]
2211A79l67L78k64j2Q6l34L13l28L8K68J78j23O7j04R4r8J89j11K92k41J37k97
2233f0L57j68k03L02Q4n1k60J50m6J60l20J50k2o0j33O0l9k85L00q4L47k19J19
2256G9l32K71Q2j44L75l03K15j67m7k07J17n8K71k4l55K79k97J05K26l1K6K0J14
2279B15k24L0J56k8Mm5L4k09J86k84L36k88OL50k13P0q9K72k46L33j68K5J66l68
2303B1nR5J93K8j54KK69m21K45p9J64J07p2J6n24J8Q3J51j04%L77l82M52j96l10
2328b6K27P1j67j02Q2Q8K21l72K83m21K97j08l03J10P1K72m27N55k14l2n4j14
2350f3J04l04K82r7l9J58j63J81n0r9K10J41j38J89J22m35M55l97J72k4p9L6J1
2373A73m2R2J30rj11m18M01j23M0j0j58K84l93M92l72n1K69L5j12j09N2Jk16P5
$$ y = [179, -188, 190, -74, -86, 0, -334, -21, -349, -311, -43, 135, 12, 79, -25, 69, -29, 160, 49, 341, 100, 237, -60, 297, 129, -74, 228, 312, 261, 1, 151, 105, 265, -55, 95, 73, 13, -120, -60, -99, -384, -84, -168, 179, -40, 79, -253, 18, 100, -44, 331, 28, 243, 76, 29, -178, -61, -119, 152, 128, -227, 52, -245, -140, 86, 55, 81, 101, 215, -9, 21, 177, 149, 153, 108, 142, -67, 119, -165, 171, -117, -111, 239, 26, 96, 7, 279, 33, 366, 198, 223, 389, 21, 16, 111, 304, 332, 178, 180, 449, 28, 273, 194, 358, 465, 393, 409, -115, -97, -14, 137, 33, 33, 410, 28, 480, 284, -26, 201, 272, 105, 3, 85, 173, 394, 22, 305, -116, 181, 73, -230, -120, -49, 223, -204, 351, 137, 105, 51, -63, 41, -263, 19, -78, -117, 41, -122, 59, 9, -90, 120, 261, 123, 312, 434, -1, 454, 57, 229, 205, 126, 162, 173, 131, 223, 353, 344, 233, -185, 216, 93, 133, 123, -35, 249, -144, 348, -24, -75, 194, 229, 117, 8, 60, 61, -155, -80]
2397h0M04k35m3M7J59k37j24J77l0j67q2qJ32j44J16k03L93l13K83k6j54J45n16
2420e06O63K2k44J48Kl66L68l32p1L35L3q9P2K49k04m4L09k06m8l13l9L27K50
2443C16j82n3K9l06N04j24K7j58j20K45j41p4j44R4m9K40R0J43l41K43j03LRl4
2467A14J03j4o0j99J67k52J21J35p1J78l70P6K1l59M49j88K20J01j83l98R1K05
2489a13J31J19r5j23p6J94k04N0m6K50q2p4n0%r6%K64q9j21k23R6M35m44L75o3
2514A5p5K77N6l46l00M36jO8k88K60p8J57p7k40M14j88K3J73m48o2J30J93k37
2537a38K66k29J40j43p5J94j56J45J21j45Q5k18J24r0N0R8J43j31j73K4J04j89
2559a93j63L80n3k08j10l1mJ18QQ7L32m78J83k14M70k17J38j93n7P0j38o4L5K92
$$ y = [-80, 324, 89, 46, 93, 252, 15, -109, 68, 38, -129, -211, -219, -87, -231, -115, -318, 75, -238, 45, 19, -135, 10, -506, 157, 179, -65, 83, 85, -281, 87, -245, -316, 19, 52, -37, 35, 284, 80, 36, 345, 139, 91, -222, -261, 66, 316, 134, 81, 110, -196, 308, 184, 211, 53, -67, 178, 37, -37, -181, -87, -136, 104, 194, 337, -4, 239, 136, 139, 148, 114, 217, 203, 143, -56, 111, -141, -20, 115, 44, 222, -148, -72, -51, -410, 39, -149, 71, 172, -11, -409, -318, -113, 18, 137, 42, -81, -157, 37, -167, -117, -163, 87, 5, -69, -119, -119, -215, -215, 49, -40, -161, -384, -288, 147, -297, 78, 15, -60, 217, 273, -73, -373, 63, 62, 130, -158, 102, 24, 181, 104, -136, 278, 90, 113, 286, -162, -224, -94, 99, -138, 128, -101, 39, -104, -179, 15, -141, 4, 125, -20, 65, -153, -29, -119, -69, 29, 172, 41, -132, -108, -4, -193, -356, 24, -29, -237, -347, -378, -382, -264, -256, -169, 163, -315, -132, -346, 124, -93, 45, -148, -205, -135, -273, -337, -302, -10]
2583a0l6k37L50j35J88n0l4p0K23j15j21r7O7K21l1k18l16K71J54j14P3j29L46
2606A80O5k16p8K95l03J62q6k33J97jj01MQ9K30m53K35P6j34P3Q0r5K32k46n2
2630h0r4j48J28J47P1n1J8O3p3lj75J94j64J45P4j57K72m88N97m53K24m11M89
2653A25k69o5J13J80p3qO9k82K88j99Q9j54J63K8P0N6k72j04J99O8j04L05m5j6
2677A62p3P0%j35j72K94J41m65K20J63l08n1L17j96J00p2Q6k56K96j12M5p2r8
2700a16M1k7R1k54R9j08M66l18m4Q2M8L36l98K67n01L44k58J64J7l7Q9k35K83
2723C1l22M7K27l66L81l33N42k61J1j40R1j05J18K29k94J67K44k73l2P7l24N41
2745B56j18K3r2j79J17l3p4J18j13R3p4K48k28K88j37j48JK2l9q8j05J19N0j2
$$ y = [-10, -46, -283, 67, -68, 120, 70, 36, -34, 189, 74, -47, -144, -77, 144, 113, -105, -421, -150, 4, -110, -37, -166, 180, 245, 29, -49, 246, -57, 105, 19, -214, -17, -18, -119, -115, -26, 204, -249, -14, 62, -72, 1, 81, -14, 218, -28, -80, -174, -322, -194, -47, 24, -27, -9, 54, -19, -22, -197, -3, -167, -22, 52, -105, 167, -321, 276, -177, 47, -364, 125, -144, -209, -96, 84, 11, 3, 72, -210, 78, -121, -32, -186, -23, 5, 75, 131, -141, -245, -46, 22, -82, 223, 178, 162, 89, 159, 159, 24, -148, 146, 287, -178, 42, 205, -103, -154, 163, -33, 67, -5, 81, -175, 121, 9, 54, -18, -116, -75, -102, -11, -265, -166, -274, 192, -126, -170, -88, -40, 296, -102, 165, -336, 8, -250, -86, -69, -106, -17, -252, 31, -291, -244, -17, -383, -2, -335, 207, -54, -43, -183, -92, -197, -79, 150, -144, 23, 267, -6, -38, 39, -285, 256, 138, 161, 69, -110, 7, -26, -100, 18, -95, -2, -76, 172, -56, 232, 95, -53, -52, -30, -69, -157, -262, -143, -93, -105]
2769a05j16L26m75L27j32M33m42J12Q0l47K24R9K95k90l5K0J58k10P8J85l12K81
2791A54l01M04l78K8J12j83k7K02j58J34J18j12q8K70k42J06Q5j82K99j43k50
2812a52K46Nj43K22M0j89J8o3K00k44L6q4k4L2N4j25K07m9J1j12K03m9Q5j64J44
2837A05p4J23k00J99j73m7J49k55M5J24j68L52j47o9J46L5k97j03J81j36J65o5
2859a10J33k02q9J92K01k75J88j29J19lJ32j26jm2j61K02l8l18K33J91k22J96
2881G1k60J14j04OJ39k35K06J12J18m04L63L7j07j30J18r3l35O63l29J4K26j38
2903E2l8n2J97j43N8o3J44N0j75p6M5k17J24K83l74K00o8l33L98K6J8l9rn2K0
2928b4m7J18m8l22M52o7r6P1L01m37J8j73K74p2Q1k56j19L45q9J89j15j33O1M5
$$ y = [-105, -221, 105, -370, -43, -175, 258, -184, -72, 8, -339, -115, -16, 279, -11, -46, -26, 132, -78, 0, 185, -127, 154, -147, 257, -121, -93, 19, -164, -191, 11, -147, -13, 105, -7, -95, 175, -67, 39, 124, -58, 241, 98, -152, 94, 99, -44, 178, 218, 29, 47, -16, 184, -60, -24, -108, -132, -100, -46, -171, 36, -13, -2, -114, 89, 40, 125, -39, 105, 31, 154, -46, 153, -20, -67, 82, -173, -128, -4, -172, 180, 33, -36, 110, 145, -152, -255, -74, -210, -45, -110, 23, -179, -268, -76, 125, -150, 38, -91, 28, 25, 157, 31, 30, -12, -173, 29, -9, -327, -94, 97, -125, 71, -189, -75, -179, -173, -34, -269, -63, 49, 167, -237, 126, 163, 56, -74, 44, -49, -384, 279, -50, -36, 190, 52, 14, -38, 159, 16, 74, 11, 155, 205, 30, -46, -1, -218, -94, 189, -185, 15, -53, -386, 12, 38, 56, 17, 8, -44, -24, -71, 47, -1, -323, 129, 62, -34, 37, 338, -99, -81, -254, 20, -52, 29, -227, -346, -1, -90, 99, -16, -149, -88, -43]
2952d3K6J5L15j74k97M18k89L6N3j50L04l31J50O8L7k0l20K60j08j3K02j7k38
2975a16o5oJ82J34j99J50l5J49p7j58k8j40mM72l43L9P4m14O52k68j05K05j70
2998g1j2J27o4r4L4L2O0q7K03r1kR9p2j58K34m8j43k4k0q3J83o9J33K85j42m11
3024b01R5J18L1n6j63j53N44j47k54M22k97K79p6k9k52R4j24J30j3J19M5p0j96
3047a54K91j9J62k49J95j29j03mm9n7O0K16j55pm3J60J16l92K5L39k6k25j28K7
3071a49R6J58k99K06j09J22m9nn3O6J82k30J27l20K11M2oj54L26n1r9J30j57J32
3095A17j03n3PJ83l9l0n3j02PM8L2o3K17k53N0K59m78J73M5q8K06k85J80j18K18
3120G7K82k25j82NK40m86N16k78L7j0p2K08q6J76l91L84k57K09k43J99k34O6K64
$$ y = [-43, -17, -2, 313, 139, -158, 260, -29, 7, 60, -90, 214, -117, 33, 101, 138, 118, -202, 58, -50, -63, 139, 122, -116, -181, -187, -5, 129, -70, 80, 45, 194, 117, -41, -69, -209, -213, 259, -84, -45, 29, -385, 267, -1, -106, 99, -71, -83, 44, -20, -114, -80, -48, 12, -75, 128, 37, 35, 134, 62, -96, 138, 90, -53, -77, -97, -180, 3, -66, 67, 352, 210, -201, -106, 12, 43, -13, -176, -329, 215, 68, -186, 236, -61, 218, 142, 113, -139, -45, -169, -39, -52, 67, 112, 42, -154, 137, 118, 280, 31, 226, 97, -6, -10, -59, -116, -56, 160, 5, -2, -45, 115, 231, -161, -136, 203, 177, -48, -176, -149, -53, 105, -194, 12, -97, 25, -24, -29, -82, -16, 166, -64, 63, -257, -46, -4, -10, -164, 162, 111, 12, 142, -15, 117, 14, -39, -32, 151, 112, 82, 29, -73, -66, -18, 14, -49, 168, -85, -35, 224, -254, -81, -36, -124, 82, -203, -23, -141, 77, 359, 134, -48, -43, 197, -289, 227, -51, -14, -24, -96, 112, 26, 202, -189, 195, -62, 147, -96, 103, -131, -65, 199]
3143A99l20p8K33n5k33K64o5l9J29j01n5Q6J39l20M39m51K40n9j32K47M9p1J50
3166A96k08Q4l21J73Q6ln5J25n2M8Mk21l7K34j0K68k57j92J88j59J0J71k40M32
3190B64k07j45J60lR6j02N8P4j74n6j78R7J44j59J9L7J21k26mJ64K99l29L4j35
3214a51O6J1J96m0Q6o4l23L79j97J95l11R2Qr1R1l0N6k54N13l83j03L21k60K79
3238H6k11M13j55k03L03k58O2m0j87n3L61k06Q5J39k13L42l22R1j11K9J27j06
3260b7p9K18k9k25r9N33k31k30J27N3P0j0L7k01q7M12n34M00j00r7L01j31j65
3283i4j3M7J10r6j15J1L90l77J35J21k71J88J5k63L30P2j84p7%K15Q0m5j90L04
3307B93n00k1L82n6j10M6K23k98j67J06j69L08K7q8O7j12K30j57K7J12j57Q6K10
$$ y = [199, -121, -199, 34, -21, -254, 10, -55, -94, 35, -66, -121, -35, 104, -216, 223, -228, 12, -47, -179, 68, 117, 46, 196, -12, 72, -249, -76, 10, 7, -48, 77, 25, 73, 77, -144, -181, 53, 43, 311, 54, -138, 50, -109, -99, 72, -168, 264, 57, -88, 72, 69, 165, 63, 121, 195, 21, -35, -213, -116, 28, -131, -112, -75, 46, -180, -184, -20, 279, -50, -16, -151, -85, -74, 122, 82, 168, 104, -219, 160, -37, 158, -153, -61, -53, -144, -53, -83, -27, -281, 232, -151, -254, 67, -193, 86, -125, 288, 133, -70, 233, -25, 37, -3, -190, -243, 118, -88, -3, 136, -77, 265, -57, 34, -77, -48, 79, -27, -106, 112, 83, -142, -241, 292, 61, -169, -42, 11, 81, 71, 108, -93, -180, 232, -302, 98, -2, -99, 202, 71, -94, -107, -60, 50, -46, -161, -150, 240, -137, -2, 119, -152, 36, 51, -212, 118, 190, 6, -71, -71, 144, 224, 179, -11, 293, -207, -228, 154, 98, -12, 34, 257, -41, -208, -102, -271, 37, 64, -24, 43, -69, 161, 4, 31, 143, -14, 72, 282]
3330B82m97J83J34r0P4j26J50R7k61J78l4m93M22j33Q2J2j83J94j2k40L12L2J39
3353B22n6j06q1rO0R4l22Q6N2pJ35O8Lm04K04J62j18l23O22j96k35J33M0J92l11
3378i5n6k29R3J92K25j7j07j47j0N0J8K62j58k29J47O4j53R2K39j48PJ2j42N3
3402c7o0J99r3n0O3o5O5J37k02m3J93r6j52pM7J70OO1l71M23k35r1K5J13J49r
3428A40j8l29L66l67N77o96P34l91K4Nj060J343n87N45j43m6j78o0J95r9J0J88
3450A53o2j20k8m9o1K10J36k64J24J2l17M96k59J52j62QL7k15K16m0k15np2M72
3474A47r4nj69J38j51L25j97j67M97j74O7J9j53L09n15j96J50k7J87j16Q7J3j63
3497a88L03l19l8L59J5p4j15J12n8r1J34j86J77j79M14m1K3j36q7M42n48j01M68
$$ y = [282, -215, -32, 102, 12, 86, -40, 110, 207, -54, 124, 90, -403, 19, -114, -32, -20, -203, -9, -21, -261, 51, 83, 222, 166, 60, -21, -30, 30, 124, -198, -112, -60, -67, 68, 136, 139, -265, -61, 101, -17, -340, 282, 86, -149, -16, 24, 216, -95, -151, -380, -287, -95, 130, 113, 6, -141, -151, -101, -83, 179, 21, -208, -61, 3, -150, -58, 181, 33, 40, 52, -90, -37, -97, 102, 9, -41, 22, -43, 22, 159, -43, -86, 107, 11, -141, -148, -101, 69, 75, 136, -235, 188, -47, -138, -113, 0, 149, 140, 122, -207, 159, -208, 369, -327, 407, 16, 40, 45, -1015, 328, -259, 286, 143, 97, -81, -141, 54, -45, -35, 153, 91, -29, -57, -106, -167, 43, 179, -85, 39, 51, -266, 230, -29, 123, -39, -31, 6, -209, 7, -33, -248, -253, -325, 147, 53, 48, -121, 17, -134, 191, -6, -173, 324, 150, 217, 236, 83, 392, -123, -319, -169, -196, -9, -125, -38, -25, -188, 115, -204, -242, 117, 132, 58, -57, 55, -3, -94, 40, -146, 31, -148, 266, 225, 248, 112, 25, 467, -81, -182, 286]
3520B86m42M0J20J09l13M06j33q0J55l7j82oK46m06M43j72j14KJ3j22J97n0k8
3543f8K1J30M2j59P2l85K74j00J68J63j83k9r5J20k8j04K11P9j93JJ56R8j03M5
3567A33j06o9k40J90R3N54m26l12L59j34Mj53J52q8K0K4J60j70j07p2K06q6j09
3590a77L41k97l6L41j48j41Q0P1M7K0m85L11j75J14J45l6N4j84K55k48l24k83
3612g55J017l28k3K62o7j27k00J23J24Q6k52L51j4j86lK13k86J38Rk5M4j38L91
3635C54k96oJ6j38L04k18o8o0J01PJ67l14K66j82K4k9Q7p2J52j16N9j02J4N2j00
3660i8J42n2m6J03j85k9j8J04r9K87k57J35J41l17J95j09L8J65j02j3J25o8j60
3683a18J66j65K79j7j38O3J03k40O2R9N4j55j29J4J84o2k52K15K83k17m2R6k17
$$ y = [286, -156, -116, 4, 113, -200, 206, 73, -7, 148, 111, -71, -77, 169, -237, 206, 34, -80, -78, -65, -187, 10, -40, -68, -47, 83, 125, -34, 38, -347, -73, -173, -5, 158, -25, -54, -149, -29, -57, -161, 50, 129, -64, -63, 93, 191, 88, 133, 27, -42, -282, -92, 1, 555, 129, -183, 176, 42, 46, -107, 45, -43, -23, 1, 161, -9, -116, -188, 18, -68, -177, 164, -133, -169, 172, 24, -117, -37, 34, 81, 101, -384, -73, -248, -134, 11, -25, 29, -155, 100, -148, -472, -755, 262, -66, -89, 173, 106, -21, -221, -98, 26, 112, -140, 211, 197, 11, 8, 221, -65, 73, 82, 57, 101, -37, 354, 58, 52, 68, -70, 234, 16, -52, -112, -11, -4, 163, -151, 115, -67, -43, -72, 15, -57, 95, -21, 38, -64, -50, 2, -98, 44, -8, -54, 49, -136, -165, -183, -79, -178, 109, -148, -13, 128, -189, 6, -103, -65, 100, -2, -15, 110, 42, -118, 48, -117, 162, 145, 7, 70, 173, -67, -5, 94, 148, -7, -136, -122, 62, 0, -252, -37, 246, 29, -13, 83, -134]
3706a34K43q2m24M9M31k64%K97K7j92j38K38J6j14J95m3k29Jl8K86k92K18Qq4
3730b5J67k87J58M8j63J16O0J84l66j19J97J83P3l10J1j15K66k0j8K79n08N2K2
3753a15L98k44J05l07K4K86R9k01j19J69r1p6J55l72K09P2J18j67k2O7Q1Jn9O5
3777G6j18k75L31r8J69j94m8K73Mn9j01l9j26jL94j43j40R1J48n0J79j42n7K7
3801A01j13r2J68j92R0%Q1R9Jk13R7j04J49p5J58l90K60k24K63j24k21K93m2J6
3825a4l3J10j92N5k5K19r9L26k30j18N3l7j60J02j18J44j38J74J71j06o4J60l52
3848a72K50j09J30j94K30k97J52J29k22J11J66q3K7j54Q8j09j11J13J9j55L13
3869A22m43J352n80k39nj40J87m57K90r0O1k10O8M3L03m98J36K23J52k23j76j9
$$ y = [-134, 109, 27, -397, -348, 83, -181, -181, 116, 143, -49, -187, 51, 67, -47, 148, 105, -124, -123, -161, 125, -167, 51, 59, -25, 142, -145, 13, 61, -102, 14, 74, 258, -108, -227, -30, 153, 226, -84, -73, -188, 78, 58, 40, 319, -189, -137, -115, 283, 39, 144, -163, -139, 147, 246, 45, -74, 95, 4, -72, 83, -289, -80, -8, 110, -57, -79, -12, 69, 70, 11, 76, -42, -317, 14, -84, 85, -109, -157, 116, 120, 61, -40, -79, -205, -206, 188, 45, -95, -4, 144, 94, 273, 131, 74, 101, -12, -104, 64, -128, -38, -38, 43, 142, 143, -70, 27, -77, 72, -3, 155, -235, 25, -199, 64, -60, -281, 12, -30, -14, -47, 63, -129, -74, -99, 120, 21, 347, 117, -1, 52, 15, -145, -43, -161, -17, -155, 19, 190, 84, 20, 180, -172, 78, -31, 99, -95, 135, -162, -10, 119, -103, 8, 174, 91, 118, -36, 52, -57, -168, -55, -36, -191, 122, -321, 1031, 451, 212, 207, 67, 254, -203, 87, -3, 58, -152, -84, -41, 262, -236, -100, 123, 275, 52, -124, -143]
3891a43K70j67j3O1j63L8K04j01K84j41j43Rj55K00l34L24jo3J13j45O9r6M8Q4
3915C9N9j31rMJ5N9l54L91q9j3l57J04K20Q1pL3j39J31j01J40j07N4M1K5k04L52
3941B37q9j03j22k8j4K82K9l62J63R9Lm1R0O0l35K82j48J24%j13J63l26J47R8
3965I6m12J31L5L8K89r1k92K64J03l63N4K35J14m41L48m9l14J89L1R9%r8K59l50
3989a25K61n28L76k79L56n2K58k73QL6J53j20k7j32P0M6J20k32L21k26j95K39
4011E5J73Qj19j59j65K15J63k65L0L5j10Q5P5L8j17O9k27L13j79J17K78j81j48
4034a6k16L49j20j89K13j24K7P3K68l99J47l4L11k37k16O1K32K12m77J41N6k54
4056a92J35O3P1R7l32L5Q9j05M54l46P5KK99n17p6K09KR9mk5NR8J31m37K35K23
$$ y = [-143, 127, -40, -53, 8, -155, -117, 87, -14, 270, 129, -14, -5, -160, 40, -294, 30, 29, -34, 79, -66, 3, -93, -45, 39, 98, -33, -42, -38, -23, 36, -318, 73, -16, -29, -386, -282, -62, 19, 12, 45, -94, 37, -64, 76, -31, 23, 64, 89, -115, 237, 148, 45, -77, -105, -119, 163, 192, -170, -7, 92, 95, 54, 144, 204, -131, 151, 3, 127, 127, 14, 177, -149, -2, 96, -316, -185, -150, -112, 177, 86, -206, 58, 161, -202, -148, 87, 201, -240, 108, 59, -255, -66, -35, 64, 64, -34, 225, -125, 136, -392, -16, -295, 61, 9, 267, -6, 2, 38, 191, 71, 44, -88, -18, 28, 148, -84, 237, 11, -184, 55, 228, 236, 117, -42, -207, 8, 171, -94, -64, -29, -139, -54, 21, 59, -58, 11, -216, 97, -82, 35, 313, 132, -16, -232, 117, -3, -192, 21, -103, -76, -3, 265, -134, 13, -21, 290, 53, -163, -102, 130, 342, -135, 6, 62, -192, -57, 6, 77, 174, -158, -123, -34, -139, 315, -31, 44, 46, 345, -172, -248, -39, -37, 62, 58, 33, 38, 136, 267, -170, 65, 288]
4082B88k17q5nn9L12j57K6Q1J8l93J6K82P7k7p4o1M8J05j66J45k06l20L60k3j15
4107a50M61l58l5P6Q8o7j55J39j5M6LM7n8Q0P9l70J23J99j57k4j03K10Jp9K6p5
4133f8m4L47k85J93k37M4N2p1m3K2P1N6J39k27m6J07p6K85o9j24o1mm7L6K2J0
4159a8J5K18j49K11l57L00l67P1o9J6M9r8K25k1o9K04r8m2k9M2j12r7J22J17k7
4184C7j82L61j22k45J95j36N6k9L1J02J3j05K41m01N2j74L76k22K98k01j06j24
4206b85J95J04j96P5pJ83k3j87J87q8j5k20J09J08P2J37l59K5R6r8M88j69k28
4229i6Q4J98o8j73J75j94J52pP7j89R0j49L22j08k17J51Q8q2R7l98L09k24K09
4252D7j75J56Q5j73J88J4R8l60J44K2j16M9J60j56l4P1J28p7j12K04k52Q3j19
$$ y = [288, 71, -14, -19, -78, 234, 77, 103, 184, 202, -191, -175, 107, 184, 157, 83, 22, 70, 175, 9, 154, -52, -372, -12, -35, -150, 311, -47, -82, -6, 82, 15, -140, -1, -16, 30, 33, 80, 22, 102, 181, -189, -66, 133, -24, -48, -151, 59, 60, -19, 7, -68, -112, 235, -50, 143, -94, -50, 2, -69, -112, -90, -19, 37, 176, -51, -97, 10, -66, 219, 150, 26, -35, -39, -86, -50, -28, -18, -3, 215, 66, 277, -80, 220, -147, -76, -145, -129, -80, -178, 47, 26, -43, 161, 63, 21, -8, 34, -78, -175, -53, 64, 37, -145, 216, 94, -151, 44, -92, -36, -65, -34, 68, 81, -24, 217, -184, -132, -306, 70, -152, 146, -55, -161, -285, -90, 14, -182, -107, -114, 69, 46, -141, 46, -42, -57, -277, -168, -60, 12, 149, -210, -185, -89, -187, 301, 132, -96, -12, 186, 118, -55, 120, -74, 78, 71, 148, -41, 49, -100, 222, 114, -103, 48, 136, 54, 151, -247, 62, -162, 47, -128, 28, 113, -60, 128, 142, 240, -120, 24, 46, -70, -21, 139, -17, -51, 20, 148, 71, -41, 163, -89, -6, -125]
4275a25J09j07J03q7k1K12k69j09M1K95m0J45k4m6q9k58L31P4j11L0J70k51k81
4298c08M86j39l5J64j23k87N20k32j18K11l30m2R4K20o1J32O3j52K7k60K56p8
4320HJ76n7j27J43l52K89n5mn4J66l01q3L18Pk4r9K6K4K91n03q8K47QLK67m95
4346b69M20k79J05N9K78l74m7J08O0l9K30q0q3j64K85o1j49m2R8M0l33M53m45
4369b29K49k8k14J39J22J40l7q5j73j50N38j19j75L37j67k38N3L6J8L3J55l84
4391a79P6K25j53j01J78j12K37l06j9K32j53k09M18j19k82R5J61M2j08n8K28r6
4413cn2K57l79L02j71j6M6J32Q8m80L10j18L7J34j60K26k16J83k47J52l3J84P1
4436B47k63j22O7j45R7JR1m5k97N50j78Q8j25K34l53L14j67R9p1o9n4j53Q0J59
$$ y = [-125, -16, -123, -20, -107, -128, 84, -185, -294, -253, 42, 2, 147, 123, 77, -12, -270, 61, 135, 24, 54, 224, -27, -308, 178, 39, 4, 168, 45, -242, 278, 46, -72, 139, -191, -233, -139, 81, 20, 152, 215, 63, 90, -170, 86, 8, 184, 127, 0, 143, -209, 80, 25, 21, -33, 133, -168, -251, 67, 74, 50, -49, -23, 1, 292, -211, -299, -52, -44, -41, 226, -269, 151, -128, -23, 36, 314, -60, -107, 1, 61, 22, 252, 172, 89, -75, 210, 149, 0, -42, 56, 96, -237, 216, -229, 20, -8, -222, -83, 39, 179, 142, 57, -116, -266, 272, 153, -22, 315, 148, -90, -37, -1, 17, 50, 205, -179, -103, 122, -31, -132, 46, -66, 171, -135, -154, 78, -75, -284, 134, 15, -267, -172, -11, 31, -77, -135, 93, -3, -55, 202, -177, 125, -46, -62, -16, 116, 204, -276, 34, -84, -47, 87, -73, 153, -63, 120, -127, 25, -8, 176, 247, -16, -138, -71, -216, -119, -118, -27, -72, -369, 181, 3, 91, -34, 200, -153, 161, -6, 93, 22, -47, -101, -254, -174, -15]
4460a5k9K5j47K41o0j43L40l25n0L6K32k86K37k68L66k9l2L6r5j59J38K2j41J17
4484A1J50l71n5L36j54J67k14J13j32J51k4J5J27p8k21R0K39j18O9l02J21K52
4506A72j23p6P9J09k83L4K61j58k2j42K3j62K77K1j2k9j21Q7R0j50K42K63n13
4529a33J80p9J16k59M59k62m3M7j01J54J40l7j35j88J49l7m22N10P4P0m05O2J56
4552A6p9q7J71N2j23M4mN9p3J09k6J87k34q8K48m04K07J9L3k80J21m3L53j00j5
4577F3k47J77J29j60J72j25N8j78Kl5N4k7K24r9j4N9Pl6k37M97j35m49L42n2j94
4602b04L31j40J1k0j65J87N7r9k5J8j26K49J86j24m01N88j79j39J37K7j50J73
4624A92j54n9j05j07P6J42k6J34k00O8J22n8K5j16J14n8J8K23j29n8K33k22k77
$$ y = [-15, -44, -19, -166, 75, 15, -128, 212, -113, -163, -127, 105, -181, 56, -212, 154, 125, 93, 129, 34, -125, 13, 35, -106, 11, 161, -210, -265, 71, -83, 84, -130, -17, -149, 2, -22, -7, 120, 42, -179, -89, 150, 32, 101, -201, -80, 172, 49, -27, 52, 161, -122, -88, 173, 15, -7, -149, -126, -288, -11, 10, -2, -31, -152, -65, 25, -125, 117, 380, -133, 47, -32, 84, -175, 284, 22, -21, 26, -75, 79, 219, 182, 47, -141, 8, -29, -451, 59, 133, 203, -202, -140, 16, -63, -150, 21, 73, -50, -6, -10, 49, -24, 85, 59, 246, 12, -76, 172, -232, -25, -6, 27, -253, -132, -175, 178, 78, 63, -184, -7, 122, -38, 134, 9, 67, -111, -109, -144, -90, -117, 107, 8, -6, 53, 60, 24, -213, 284, 149, -300, 42, -10, -204, 127, -13, -2, -22, -187, 0, 57, -42, -67, -49, -175, 74, 260, 136, -265, 323, 144, 5, 142, 169, 19, 192, 38, -21, -126, -233, -157, -15, -41, 93, -107, -39, 83, 25, 50, -66, 48, -10, 8, 231, 102, 44, 277, 55, -222]
4647b22J50p2K76J01m95J71J80j99J16j95K29o6J96j13k5j34kj2N35l34n3j2r9
4670g9m9J97J36l42j9J95J02j92N5n5K4Q8mj49K04o7n5J85k8j76J08J2K6j03L0
4695D4j1O0Pj04K49qk35mJ28l45L01l9pJ17o2J42j81j30J54k16J16M4o9M0K09
4720B00k6k49NN1J23j7p7j11R1k79K83j19p8K52j00jP2k67N13k17j74K46p6J69
4744B14k48K26q3j48J48k74K16q4J82j71R7Q8k42P1q4L09k54K7M0j15J51N4m5
4767G5q5J7k27L35k13L3J04p8m76N34R0k18R2oJ54j44j0R3K19l36L03k92o1J02
4791Ej23L22j38n2l70k0L17J2K37k52j43J53K5J16j26J42k73L16N2l35K20k6J13
4814A72J01k64J02j51o8Q0K10k22J83j31K4L7n4r4K5Kk0k16K60j44L82Ll12J31
$$ y = [-222, -72, -144, 132, 233, -262, -91, 89, -110, 6, -189, 40, -26, 170, 57, 32, -102, -104, -116, 419, 85, 32, 20, -79, -128, 69, 205, -137, -156, 39, 141, -51, 4, -51, -27, 61, 57, -92, 112, 45, -10, 175, 147, -29, 79, 91, 117, 14, 44, 33, 93, 100, -4, 245, 237, 2, -2, 126, -219, 82, 43, 36, 153, 91, 233, 52, -78, 76, -140, -24, 20, -49, -9, 200, 174, -75, -70, -19, 104, 87, 10, -101, -10, -289, -6, -125, -203, 49, -51, -52, 20, -247, 266, 49, -125, 121, 45, 214, -34, 192, 109, -39, 109, -165, 51, -33, 149, -22, 75, 163, -79, -8, -92, 217, -37, -10, 30, -85, 66, 120, 75, -10, 7, -220, 115, -98, -65, 39, -39, -515, 19, 109, -109, -17, -23, 131, -13, -23, 70, 289, -47, 256, -36, -97, 5, -118, 204, 66, 14, -356, -376, -59, -47, 190, -62, -205, -52, -27, 89, -37, 105, -168, 148, 200, -135, 85, 59, 172, 273, 9, 111, -40, -108, -28, 182, -40, 143, 12, 36, 73, 19, -75, -50, -48, -68, -284, -24, -168, 214, 217, -95, 36]
4838C6R8J46k25Q2j84j2j16J60n2l3k7J48j64K00j12o5O9P1k21K46nj57M8J32
4862F3j44N9Q2o3Lj56J14J24k4j26J03j17r3k7K34o4J40j27R8j41J34j22J50j3
4886H7nk94J37J88k51J54lM0K4K96l48l1k7J23no9j26Q3L6k19L17j37m8M3J42
4911A07j47m3N7K21k48p9K62j86K9j21M21j16j05j7k09L2M36l07k20M87j46mO4
4934A68j04k8J7m32N36q0J4M7j1n2l6Q0N3j95J86j01n1Q5J5k27M6K85m89K69O6
4959F1Ko7J40k41K5J1K46j82j20J16J52M9k84L3K42m06J65j29K76O8j38l8Q6l8
4983B9jj92j24L94m0j41K01k49J66L5l7K6k35K27r2j7J51o2j73k28L97L7m6L9
5007F5q2l0J19j01K2o9%J25L3lm34M28j49J58k7j01k23L12q5%J44k31J52ml08
$$ y = [36, 134, 280, 55, 137, -47, -59, -175, -15, -67, -100, -127, 21, -143, 57, -55, -120, -51, 20, -201, 45, 40, -117, -69, 63, -81, -22, 60, -3, 0, -156, -42, 82, 58, -68, 35, -82, -175, -202, 32, -32, 108, -19, 79, -62, 72, -50, 100, 87, 82, -212, -75, 113, -138, 16, 13, 53, 77, 373, 25, -6, -33, 90, 85, 16, -110, -27, 9, -210, 107, -30, -78, -35, 107, -40, -83, -26, 195, -53, -132, 130, -56, -27, -148, 273, 157, 52, 35, -174, -142, 294, -13, -233, 254, 108, 104, 168, 64, 36, 53, -379, 157, 77, 91, 138, 127, 75, 39, 119, 172, -23, 163, 62, 11, 96, 111, -116, -70, 215, -274, -5, 61, 63, -4, 136, -105, -80, -69, 177, -5, -125, -9, 143, 192, -92, -59, 183, -223, -58, -187, 89, 157, 19, -19, 67, 29, 28, -164, -288, 106, 66, -75, 126, -123, 43, 78, 41, 67, -168, 59, -33, -50, 101, 39, -134, -362, 35, 72, 26, 65, -17, -47, 72, -29, -7, -76, -76, 49, 82, 79, -355, 73, -76, 82, 55, -46, -269, 43, -42, -42, 102, -129, 23, 19, -289]
5032b89L76j08k1O2q9J93j92Q4j5q3j33K26p2K13J41n28M69l89K78q1j37K74l98
5055b19L29j14K12n24k0L24M5l00L18r4M8J8j41K26j25n6lP3j14M8p5K34j81O3
5079b8k5J89k31K32j51j35L50j62QM7J8k04J81j3k3n0k8q1R8j43K78j82M06l86
5103c5k4m5J35L2j04j2Q8j98m2L82j23o5Q2k05J08J12J27l15J35J35N7j58j49
5126h2K15j27n2l49K77j10M31m59J61r7K17q5k0q3L61k46j00R6K15J49k23k08
5148a19J89j42J36j63K36p6k97J3L60k65N9p3qO0R2P2J0j1k06J10k97L53j97J16
5172d8P2k41K14O7n1j28RJ12n0K5K10k13J73k14l2K75j98Q5k36K74p0O4k53L82
5196B28m56J2J89j63J08kJ9P7l3J73l95K96p6J52k32J34R4j17k89L12k8k0j1Q
$$ y = [-289, 87, -21, -42, 20, -69, 124, -68, 16, 1, -82, -215, 11, -61, 152, 293, -235, 234, -155, 123, 42, -95, 179, -219, 110, -4, 208, -316, -336, -12, 33, -267, 51, -43, 5, 23, -118, 108, -17, -73, -76, -3, -117, -69, -144, 90, -91, -28, -53, 136, -95, 137, -14, -149, 201, 39, 47, 94, 112, -92, 89, 76, 53, 3, -25, -106, -8, -151, 127, -55, 351, -35, -59, -104, 31, 63, -41, -53, 35, -163, -205, 177, 54, -11, 71, -134, -26, 86, 213, -102, 33, 168, 225, 67, -82, 133, 6, -46, -395, -118, -228, 203, -256, -95, -192, 25, -60, -80, -163, 198, -48, -148, -52, 163, 312, 89, -119, 70, -72, 64, -99, 137, 61, -236, -223, 137, -128, -69, -142, -150, -90, 2, 74, 84, 73, -133, -23, -320, 33, -164, -48, 24, -217, -3, 64, 13, -115, -106, 6, -44, -19, 191, -22, 151, -63, -95, 180, -18, 67, -169, 105, 35, 99, -154, 228, -228, -216, -27, -190, -82, -84, -65, 12, -21, 152, -243, 53, -23, 129, -103, 31, 125, 8, -281, 31, 3, -17, -28, -20]
5220b0k05K10J22J4L6k6l16K48j27O5R5k6N8k29K18j24j63L09j28j05j52N7J66
5243b3J39q4j7k0j28K68O5j80j03l37J31L33J3K59j95l4j82L21j7o6o4m0n0R5
5267H4r6J19J58K2k22p5j53L87k18R8J13l45L0J43k02K77k78J87j83P7M8p8L1
5290g6J18M5k74J23OK05j50L6j56J57lQ6j71K4k35N4O5K43k46J35K58k31rK41
5314B45j13j9j22K13j24j05J58k94K03l2K69m01J79r1J57k94J77l6M5j3o8n7K29
5337A06o3k0j65L33k92K11q7j21j52L44j00j51P3J09o0J9k49K77k3j33J98o9l2
5360d7j26Q0k89L13K40j85r3J58j13j06NK04o3N3n8l6NJ03p0m4Jp1O3n3R0k4J05
5387D2k37J03J83q8P6J55k45n4K48l33J06l18N10k02k5p6P6q3K75Pk20J77k59
$$ y = [-20, -225, -15, 107, 121, 157, 131, -185, 63, -64, 1, 96, 70, 128, -101, 117, -7, -170, 139, 11, -94, -246, -189, -23, 116, 32, 15, -5, -133, 135, 200, 20, -83, -420, -289, 44, 57, 316, 121, 87, -95, 226, 209, 143, 79, 39, -11, 84, -12, 107, 265, 287, 65, -10, -163, 224, 6, 104, 217, -128, -98, 45, -157, 120, -158, 29, -154, -77, -29, -107, -76, 42, 87, -187, -64, -58, 147, -3, 33, -123, 34, 31, 117, -54, -30, -265, -211, -146, 97, -149, -14, 244, 13, 4, 245, 132, 113, -9, 204, 80, -25, 133, -161, 42, 10, 279, -122, 57, -34, 123, -171, 6, -30, 15, 2, -66, -123, 106, 43, 23, -142, 191, -101, 110, 23, -98, -250, 94, -6, -157, -84, 25, -35, -16, -265, 12, -11, -144, 54, -15, -47, -173, -93, -382, -69, 171, -14, -107, 51, -62, -168, -163, 41, -22, 31, -27, -63, -58, 45, -25, -69, -68, -139, -76, -129, -39, -63, 42, -195, -92, 91, 3, 79, 234, -11, -65, 183, -150, -44, -362, 148, -54, -79, -155, -79, -162, 113, 120, -100, 77, -182]
5410a82K27m6J56k00J58j95K30k6k5Pj57K00j44J2l4J00j48J17k4l9k07J92J0
5433a8j20J54p3j24j4O7M04l11K5Q9k70K20l9mj0K28k15P5P2k89R1J7K83k31K
5458IJ18j85K51k04j62K60j56J30%q7K43k97J16l6j48J21M1K6J69k39O1J53j81
5481CP0K2j38M54n70J35J29j79J97l9m0J32l64j5M26k08J80l25J48J50k59J18
5503B7k5m3K62k76R0k26J14J2N7K28j68R1l9Jj0j98J68j25L7J2o0j41J75No2O3
5529c1J21K3j85K9N2N9rj94J42j2K52k65o5K29k61R9R0M6j06n7O9q7q8J51p3l6
5555a07K32l30M16r6j37k5J29l93N88j21j57Mj13K46J36j25q9J50l09J79m1J73
5577B10l6r9l0J70m41L86l55J36J81n0o6k21K52j10M8o0J39j71J28j2O6j26QO1
$$ y = [-182, 45, -1, 155, -45, 113, -82, 148, 122, 97, 104, -53, 147, 3, 15, -19, 81, -67, 50, 26, -13, -220, -28, -18, -138, 16, -57, -181, -195, -128, 276, -35, -10, 79, -191, 29, -10, -14, -24, 204, -11, 64, 136, -153, -62, -45, 238, 7, 9, 127, -58, 193, -11, -173, 87, -69, 61, 61, -26, 217, -80, 36, 0, -148, -27, 14, 40, 209, -30, 31, 184, 3, 73, 95, -43, 411, -159, -24, 105, -74, 123, 84, 44, 176, -188, -203, 223, 15, 195, -130, 18, 168, -91, 27, 2, -41, 221, -55, 35, -191, -77, -65, -8, 220, 52, 143, 104, 105, 95, -103, 65, -60, -23, -11, -71, -212, -37, -32, -94, -31, 90, 113, -72, -43, 9, 68, 59, -135, 7, -5, 247, -18, -83, 146, -115, -16, 74, 120, 14, -43, 26, -61, -149, 2, -71, -107, 125, -205, 211, 115, -22, -47, 82, -311, 277, 156, -1, 3, -110, 136, 272, 147, 58, 208, -101, 78, 37, 210, 174, 75, 45, 215, -226, 160, -195, -59, 122, 72, 6, -215, 37, -73, -25, -85, 54, -117, 11, -1, 65, -61, -53, 8]
5601HK06o9l20M37m77K38k01K98l68O09k27k85J56N7P6q0Ql5M8n2j87J35r1J95
5625G9m4k29M62k9n94L87j9J19j72m0L20j86M5j61J2J40j24k64M17j29J7k04K4
5648a73J65K3L0k29j6J17J33j64r5k02K30J17J71j17K0p2M4k9J08l1RNJ23j75
5672hO5m9k8P3j33K80l28rQ9N8J58j10j62r6L1l1J59j07r2J65L29m24K06L6m08
5697c36M04j28J62R4k14j29R9J49k20J20Pq9P8q6Q6J0R7P6j86m09M97j96K56k23
5721h1L33j69m00L2K70n7K6J49j0Q1l04k2J01j05J74j02R3O8r3PM9l9P5R5k9k64
5747a22J7P4J6n8K04p5N6k85J75M6j98J38l7r3J6K42j59j78J39P2j55K79O3l27
5771a50j9K73j59J95k24LP8j1m3k07K33j31J87k30L4J8J30p7M03k93O0J26n4k51
$$ y = [8, 214, 145, -175, 262, -215, 23, -178, 120, -248, 361, 134, -151, 5, 62, 138, 58, 66, 31, 79, 27, -160, -25, -116, 79, 35, -194, 268, 239, -355, 32, 13, 132, -40, -80, 240, 54, 99, -62, -50, 90, -34, -298, 119, -10, 7, -197, -173, -8, 15, 45, -184, -200, -83, 50, -114, -209, -411, -181, -64, 107, -10, 10, -62, -18, -47, 61, 30, 39, 44, 167, -8, 57, 8, -20, 53, -80, 200, -128, -137, -48, 10, 168, 58, -104, -200, -169, -200, -41, -148, -240, -75, 254, -170, 36, 72, -336, 68, -60, 102, 196, -18, -147, -48, 101, -119, 1, 8, -81, -3, -89, -3, 7, 104, 180, -6, -415, 82, -114, 142, -81, 252, 83, -317, -285, -15, -72, -46, 103, 93, 174, -130, -152, -51, -156, 18, -84, 9, 77, -16, -9, 40, 1, 76, 171, 142, -122, -105, -31, -15, -73, 131, 56, 112, -173, 2, 48, -150, -12, -49, -142, -126, 116, -43, -221, -82, -10, -165, 114, 177, -150, -169, 104, -55, 140, -84, -81, -3, -14, -57, -264, -31, -162, 25, -205, -171, -153, -23, -100, 303, 10, 70, 196, 142, -109]
$$ [...]
8191g5
##END NTUPLES=NMR FID
##END=
