##TITLE=1H_K-383
 CDCl3, 8 sc, 
 19.11.2020
##JCAMPDX= 6.0         $$ Bruker NMR JCAMP-DX V2.0
##DATA TYPE= NMR FID
##DATA CLASS= NTUPLES
##ORIGIN= UXNMR, Bruker Analytische Messtechnik GmbH
##OWNER= root
$$ XWIN-NMR		Version 3.5
$$ Thu Nov 19 12:05:49 2020 Russian Standard Time (UT+4h)  she@DPX200
##.OBSERVE FREQUENCY= 200.1315066352
##.OBSERVE NUCLEUS= ^1H
##.DELAY= (6, 6)
##.ACQUISITION MODE= SIMULTANEOUS
##.ACQUISITION SCHEME= undefined
##.AVERAGES= 8
##.DIGITISER RES= 18
##SPECTROMETER/DATA SYSTEM= spect
##.PULSE SEQUENCE= zg30
##.SOLVENT NAME= CDCl3
##.SHIFT REFERENCE= (INTERNAL, CDCl3, 0, 15.7039)
##AUDIT TRAIL= $$ (NUMBER, WHEN, WHO, WHERE, WHAT)
$$ ##TITLE= Audit trail, XWIN-NMR		Version 3.5
$$ ##JCAMPDX= 5.01
$$ ##ORIGIN= Bruker BioSpin GmbH
$$ ##OWNER= she
$$ F:/spectra/data/she/nmr/H-F/1/audita.txt
$$ ##AUDIT TRAIL=  $$ (NUMBER, WHEN, WHO, WHERE, WHAT)
(   1,<2020-11-19 12:04:13.75 +0400>,<she>,<DPX200>,
      <created by zg, POWCHK disabled, PULCHK disabled
       configuration hash MD5:
       00 E9 B6 7A A2 85 ED C7 34 08 36 98 17 FE 4E 26
       data hash MD5: 16K
       86 0F 30 BF E9 A5 21 C9 F5 4C 77 99 E1 AD 4C 6B>)
$$ ##END=
$$ 
$$ hash MD5
$$ 49 9F 87 3E 9E E5 7D BF 6A 43 0B 99 80 E9 BE 13
##$RELAX= 
##$RELAX= 
##$RELAX= 
##$RELAX= 
##$RELAX= 
##$RELAX= 
$$ Bruker specific parameters
$$ --------------------------
##$DU= <F:/spectra>
##$EXPNO= 1
##$NAME= <H-F>
##$PROCNO= 1
##$TYPE= <nmr>
##$USER= <she>
##$AMP= (0..31)
100 100 100 100 100 100 100 100 100 100 100 100 100 100 100 100 100 100 
100 100 100 100 100 100 100 100 100 100 100 100 100 100 
##$AQSEQ= 0
##$AQ_mod= 1
##$AUNM= <au_zg>
##$AUTOPOS= <>
##$BF1= 200.13
##$BF2= 200.13
##$BF3= 200.13
##$BF4= 200.13
##$BF5= 200.13
##$BF6= 200.13
##$BF7= 200.13
##$BF8= 200.13
##$BYTORDA= 1
##$CFDGTYP= 0
##$CFRGTYP= 5
##$CHEMSTR= <none>
##$CNST= (0..31)
1 1 145 1 1 1 1 1 1 1 1 1 1 1 1 1 1 1 1 1 1 1 1 1 1 1 1 1 1 1 1 1 
##$CPDPRG= <>
##$CPDPRG1= <>
##$CPDPRG2= <>
##$CPDPRG3= <>
##$CPDPRG4= <mlev>
##$CPDPRG5= <mlev>
##$CPDPRG6= <mlev>
##$CPDPRG7= <mlev>
##$CPDPRG8= <mlev>
##$CPDPRGB= <>
##$CPDPRGT= <>
##$D= (0..31)
0 1.2 0 0 0 0 0 0 0 0.06 0 0.03 0 0 0 0 0.0002 0 0 0 0 0 0 0 0 0 0 0 0 
0 0 0 
##$DATE= 1605773053
##$DBL= (0..7)
120 120 120 120 120 120 120 120 
##$DBP= (0..7)
150 150 150 150 150 150 150 150 
##$DBP07= 0
##$DBPNAM0= <>
##$DBPNAM1= <>
##$DBPNAM2= <>
##$DBPNAM3= <>
##$DBPNAM4= <>
##$DBPNAM5= <>
##$DBPNAM6= <>
##$DBPNAM7= <>
##$DBPOAL= (0..7)
0.5 0.5 0.5 0.5 0.5 0.5 0.5 0.5 
##$DBPOFFS= (0..7)
0 0 0 0 0 0 0 0 
##$DE= 6
##$DECBNUC= <off>
##$DECIM= 32
##$DECNUC= <off>
##$DECSTAT= 4
##$DIGMOD= 1
##$DIGTYP= 9
##$DL= (0..7)
0 120 120 120 120 120 120 120 
##$DP= (0..7)
150 150 150 150 150 150 150 150 
##$DP07= 0
##$DPNAME0= <>
##$DPNAME1= <>
##$DPNAME2= <>
##$DPNAME3= <>
##$DPNAME4= <>
##$DPNAME5= <>
##$DPNAME6= <>
##$DPNAME7= <>
##$DPOAL= (0..7)
0.5 0.5 0.5 0.5 0.5 0.5 0.5 0.5 
##$DPOFFS= (0..7)
0 0 0 0 0 0 0 0 
##$DQDMODE= 0
##$DR= 18
##$DS= 0
##$DSLIST= <SSSSSSSSSSSSSSS>
$$ [...]
##$SUBNAM2= <"">
##$SUBNAM3= <"">
##$SUBNAM4= <"">
##$SUBNAM5= <"">
##$SUBNAM6= <"">
##$SUBNAM7= <"">
##$SUBNAM8= <"">
##$SUBNAM9= <"">
##$SW= 16.9725356469052
##$SWIBOX= (0..15)
0 0 2 0 0 0 0 0 0 0 0 0 0 0 0 0 
##$SW_h= 3396.73913043478
##$TD= 16384
##$TD0= 1
##$TE= 0
##$TE2= 300
##$TE3= 300
##$TEG= 300
##$TL= (0..7)
0 120 120 120 120 120 120 120 
##$TP= (0..7)
150 150 150 150 150 150 150 150 
##$TP07= 0
##$TPNAME0= <>
##$TPNAME1= <>
##$TPNAME2= <>
##$TPNAME3= <>
##$TPNAME4= <>
##$TPNAME5= <>
##$TPNAME6= <>
##$TPNAME7= <>
##$TPOAL= (0..7)
0.5 0.5 0.5 0.5 0.5 0.5 0.5 0.5 
##$TPOFFS= (0..7)
0 0 0 0 0 0 0 0 
##$TUNHIN= 0
##$TUNHOUT= 0
##$TUNXOUT= 0
##$USERA1= <user>
##$USERA2= <user>
##$USERA3= <user>
##$USERA4= <user>
##$USERA5= <user>
##$V9= 5
##$VALIST= <valist>
##$VCLIST= <CCCCCCCCCCCCCCC>
##$VD= 0
##$VDLIST= <DDDDDDDDDDDDDDD>
##$VPLIST= <PPPPPPPPPPPPPPP>
##$VTLIST= <TTTTTTTTTTTTTTT>
##$WBST= 1024
##$WBSW= 4
##$XGAIN= (0..3)
0 0 0 0 
##$XL= 0
##$YL= 0
##$YMAX_a= 116004
##$YMIN_a= -79813
##$ZGOPTNS= <>
##$ZL1= 120
##$ZL2= 120
##$ZL3= 120
##$ZL4= 120
##$ABSF1= 10
##$ABSF2= 0
##$ABSG= 5
##$ABSL= 3
##$ALPHA= 0
##$AQORDER= 0
##$ASSFAC= 0
##$ASSFACI= 0
##$ASSFACX= 0
##$ASSWID= 0
##$AUNMP= <proc_1d>
##$AZFE= 0.1
##$AZFW= 0.1
##$BCFW= 1
##$BC_mod= 2
##$BYTORDP= 1
##$COROFFS= 0
##$CY= 11.3945322036743
##$DATMOD= 1
##$DC= 2
##$DFILT= <>
##$DTYPP= 0
##$F1P= 15.9154993809931
##$F2P= -4.1035820241983
##$FCOR= 0.5
##$FTSIZE= 0
##$FT_mod= 4
##$GAMMA= 1
##$GB= 0.15
##$INTBC= 1
##$INTSCL= 1
##$ISEN= 128
##$LB= 0.24
##$LEV0= 0
##$LPBIN= 0
##$MAXI= 10000
##$MC2= 0
##$MEAN= 0
##$ME_mod= 0
##$MI= 1.114404
##$NCOEF= 0
##$NC_proc= 0
##$NLEV= 6
##$NOISF1= 3.799351
##$NOISF2= 2.8
##$NSP= 1
##$NTH_PI= 0
##$NZP= 0
##$OFFSET= 15.70392
##$PC= 1
##$PHC0= -11048.05
##$PHC1= 5.8009
##$PH_mod= 1
##$PKNL= yes
##$PPARMOD= 0
##$PSCAL= 0
##$PSIGN= 0
##$REVERSE= no
##$SF= 200.130013532006
##$SI= 16384
##$SIGF1= 3
##$SIGF2= 2
##$SINO= 400
##$SIOLD= 16384
##$SREGLST= <1H.CDCl3>
##$SSB= 0
##$STSI= 0
##$STSR= 0
##$SW_p= 3612.71676300578
##$SYMM= 0
##$S_DEV= 0
##$TDeff= 0
##$TDoff= 0
##$TI= <>
##$TILT= no
##$TM1= 0
##$TM2= 0
##$TOPLEV= 0
##$USERP1= <user>
##$USERP2= <user>
##$USERP3= <user>
##$USERP4= <user>
##$USERP5= <user>
##$WDW= 1
##$XDIM= 8192
##$YMAX_p= 0
##$YMIN_p= 0
$$ End of Bruker specific parameters
$$ ---------------------------------
##NTUPLES= NMR FID
##VAR_NAME=  TIME,          FID/REAL,        FID/IMAG
##SYMBOL=    X,             R,               I
##VAR_TYPE=  INDEPENDENT,   DEPENDENT,       DEPENDENT
##VAR_FORM=  AFFN,          ASDF,            ASDF
##VAR_DIM=   8192,          8192,            8192
##UNITS=     SECONDS,       ARBITRARY UNITS, ARBITRARY UNITS
##FACTOR=    0.0002944,     1,               1
##FIRST=     0,             0,               0
##LAST=      2.4114304,     0,               0
##MIN=       0,             -79813,          0
##MAX=       2.4114304,     116004,          0
$$ Real data points
##PAGE= N=1
##DATA TABLE= (X++(R..R)), XYDATA
0@%%%%%%%%%%%%%%%%Kj0J6j6J6j6K1k9L2l4M2m9N7o6P4q8J00j12J27j43J60j79
38i5K03k27K52k82L14l46L83m25M69n18N72o30O93p62Q40r24J021j132J252j391
58g33J550j734J955k222K550k969L526m306N495p558J2246m7587j7929o437j5660
73g9813K4444j2584o446J8173O628j3106J5860J0790M589j6865K5172O195j2613
86b9576J8784O977o541Q982J1114j5026P561R779n978p227N78J4117k3257K467
100g246J3879j1730j410J1099p597l960J5308o288J532L623J2932n807j1918K1720
114B4137j0428r253J0509q06j0864O084j971j1621K798m51m01j3980J1776J056
128c415j9154Q897L032q681j611R906q099R31N649q34j175M727J2867j2683N539
$$ y = [0, 0, 0, 0, 0, 0, 0, 0, 0, 0, 0, 0, 0, 0, 0, 0, 0, 2, -8, 8, -8, 8, -8, 13, -16, 16, -18, 24, -25, 32, -34, 40, -48, 52, -60, 67, -76, 84, -95, 108, -119, 133, -149, 165, -181, 202, -223, 246, -272, 300, -330, 363, -399, 441, -483, 538, -594, 658, -733, 817, -917, 1038, -1184, 1366, -1603, 1923, -2383, 3112, -4446, 7800, -39787, -57716, -64153, -79813, -55369, -67953, -74399, -56226, -49598, -62704, -46844, -36054, -31465, -48330, -23158, -16963, -29576, -10792, -3815, -10356, -1374, 9740, -5286, 2275, 12054, 6076, -1151, -573, 13544, -9713, -7246, 6633, -5097, -6507, 4592, -3005, -6965, 8343, 2055, 3587, 7210, 20142, 14335, 2417, 24137, 13709, 4456, 14965, 14159, 3295, 9379, 7408, -4213, -1415, -1866, -2267, -16247, -4471, -3415, -22569, -13672, -10640, -19321, -20932, -11026, -19125, -18194, -12545, -13379, -14554, -9827, 3040, -9643, -4104]
143d104J1181q296m070P949J198j0274Q204l269n263p74M431m685n566J4269n854
158d923n007N659M755q295K759J0510o532L650M921R97n546J0315K427q558Q995
173A6127K432m871o239R721n745p115O857k638n938L37N138j0604L824M978m610
188A654l047L424L059j3229N235K371p424o64M424n193m669P581m771k13K504
203h958N071n911j336J1310q955n18N921p52n098M356r1o004L781P52J86l227
219i473R276m81p204R097J521l290K255P046o303K239J184l201k060J411M439
234F456r741N585K521p033Q62N275q92l324O497k573k034M60L325l815k271Q570
250G868o362j800M499j067n011L873K401n955K967n7j427m873O708j517m338O006
$$ y = [-4104, 7077, -1219, -5289, 2660, 3858, -6416, 1788, -1481, -6744, -7518, -3087, -7772, -13338, 931, -4923, -9930, -4271, 484, -7811, -5052, 5458, -1074, 2576, 7497, 8494, 2948, 13263, 15690, 7132, 16127, 18559, 13688, 7449, 17170, 11425, 4310, 11167, 8529, 2591, 2928, 8066, -2538, 1286, 6264, 1654, -1393, 2031, 5090, -8139, -2904, -533, -7957, -8621, -4197, -9390, -14059, -6478, -11249, -11462, -8958, -3887, -9798, -11134, 176, -8779, -9297, -3376, -4128, -9226, -4870, -4961, -10965, -7184, -6432, -6246, -9473, -197, -678, -7882, 1215, 2736, -554, 1701, 8747, 2444, 4683, 5867, 2666, 606, 2017, 6456, -3285, 2300, 4821, -2212, -1350, 3925, 3033, -291, 6206, 3633, 1599, 2059, 5384, 1569, -702, 7868, 1506, -294, 4205, 3138, -1873, 2000, 4401, -1554, 1413, 1356, -71, -4944, 1764, 247, -4091, 1915]
266A915J87l607L73N806n775K84L965k696k347k80K192p842L580K801m297P76
282d965L872l42m811P592m70k346K147L033m037k451N251n663q00K470R14m939
298e545K221M158o269L433L146j23k772M837j205m471M073n73j532j953N936n073
314a712j883N436k506p36L102L472m723L366J449k876l82K217R68o297N047j166
330B776n287J949K310k739r50N447l965M2J378J070l226Q68M455o195J294K382
346A609k219k903M757K33l155M219n08p53k405M833k867l347M629l134l376O97
362c690J812n287K770K478j726M59J315K394m584N075J098l354J700J825k981
377f96k237M836l086j65J629J339k391JL811m466J180K422j008l195K586m04m499
$$ y = [1915, 2102, -1505, -1132, 4674, -1101, -817, 3148, 452, -1895, -2175, 17, -7825, -4245, -1444, -5741, -4965, -1093, -1435, -6246, 1346, 876, -1470, 677, 3710, -327, -2778, 2473, -3190, -3990, -1520, -606, -5545, -3324, 834, -5435, -2002, 1144, 1021, -1751, 3086, 1881, -2590, 1483, 910, -622, -2575, 3361, -1712, -3595, 1841, -665, -1401, 1701, 5173, 450, 3816, 5265, 2389, 2007, 4224, 5192, -1105, 3942, 2776, -2511, -562, 1748, -991, -1941, 3506, -459, -417, 961, 2031, -1195, -327, 4128, -2067, -773, 1609, -610, -3513, 1244, 1477, -1678, 2541, 2033, 1280, -1125, 3708, 841, -2506, 2123, -1011, -4387, -3690, -1878, -7165, -4395, -1917, -3643, -3184, -1869, 525, -4059, 1016, 2114, -1240, 460, 2285, -696, -2933, 1903, -1183, -1348, 281, 1620, -771, -770, 3041, -1425, -245, 2177, 1169, -2026, 560, 156, -4343]
394d343L125P70l32r20M047j005j834M667m56j71R11L489m450Q09K300l041J0
411C576Q99J497m299K770k8k960J008J214j140l323L917l458k925J104k73k870
427e291j44L103l860Q32J396J16j098K951K468m317L361J23j976j316K564k198
443c286k530K333j793j313m54L389k755J253L713j865Q4J712R83l126L047Q06
459A98k017J62O83J39k926M586m88j145L015Q34j492M74L052l022R62N94l07k932
477C70K87J305m131J873J230j355j057K358j019j945L080n67k04m36K620k925
493e16p01L141j766l6J280J247l870K090M58k308L22K53Ol237K290j369k317J023
511d010J011j103m76L476k682L50J834N28q19J434J699l162J903J24n60r54K525
$$ y = [-4343, -1218, -448, -780, -1700, 2347, 1342, -492, 4175, 3719, 3548, 4459, 7948, 3498, 4307, 6607, 3566, 3576, 4475, 5972, 1673, 4443, 4415, 1455, 2463, 3677, 2537, -786, 3131, -327, -3252, -2148, -2421, -5291, -5435, -2332, -6192, -5360, -3964, -3848, -4946, -1995, 473, -3844, -483, -360, -2336, -3652, -1088, -3286, -5816, -3483, -5276, -6589, -7043, -3654, -6409, -5156, -1443, -3308, -3224, -1512, -529, -3655, -608, 198, -1819, -1657, -974, -835, -3761, 825, 337, -808, 2207, 3041, 1549, 2023, 5075, 2053, 3015, 3609, 3302, 370, 657, 1962, -2169, -296, 934, -421, -1478, 880, -139, -2084, 996, 429, 225, -211, 2409, -516, -1217, 1924, 158, 122, 1402, 2649, -1221, 869, 1327, -981, -659, -406, -400, -3637, -1347, -2716, -5033, -4010, -2999, -4102, -4578, -1102, -3784, -3434, -1600, -1072, -1891, -457, 1242, -1920, -17, 107, -453, -1407, 1118]
528A118J0k182L175m20m82K70K367r66n66K282j716j165Q0R12l175J190J261k391
546c98M32P97N1j592L286J95j446J186L54j084j626K713k552q53J210p74j590
563a691Q1J351k172J272N76j37j276J138L18k840K508j37j211j23J359j556n55
580c095K332q32K91L96J525k339K32J636j864M55P95K3k515K083k40j538J487
597a168R00k60j380L042j940o07J768l12p77M37J966k816P15P62j48p23J275J442
615B176k560J917K03j078O7J748r89r83K122j914j18p52J803j118k62K049j908
632D03k20P56N78k309K016M59j501M61j77p31q51J896j222o66R97N41j363M5K457
651A569k121L72O96r51p82O59L37j481J309Q05j118k28J002o0j373K881j535l9
$$ y = [1118, 1128, -1054, 2121, 1701, 1219, 1489, 3856, 2890, 2324, 4606, 2890, 1725, 1805, 2717, -458, 732, 1993, -398, 34, 831, 882, -710, 2576, 2771, 1325, 2511, 2865, 1781, 155, 2868, 316, -537, 673, -101, -1691, -1610, -259, -2431, -1159, -583, -720, -1996, -858, -540, -3380, -872, -1009, -2220, -2343, -984, -2540, -3095, -763, -1595, -1304, -908, 617, -1722, -1490, 146, -1718, -1263, -468, -445, -2960, -877, -1117, -2655, -1168, -268, -528, -1908, 1134, -806, -1413, 355, 43, -734, -297, 1669, -1147, -432, 330, 182, -541, 734, 2176, -384, 1533, 1736, 658, 725, 2473, 1484, 501, 2623, 709, 591, -161, 1642, 524, 262, 2311, 403, 183, 939, 1517, -792, 1224, 1683, 182, 643, 466, -265, -1116, 780, -442, -1108, -111, 430, -933, -888, 1569, -552, -180, 516, -435, -1217, -558, -221, -1702, -393, 412, -706, -934, 68, 8, -1365, 1516, -19, -58]
669e8J14L42j113k80J152j292K75J246J86j891K092M88j317J950J03n8j726J604
687A817p18j181J321p8m47j342J869k328J636O32o75P6J69J494k866L086j142
704A323o8r90Q60R49k065J351j537l31J5P55q96o28J269j209R07o53P11j138J468
723I3O69k048P72M38jj547J800n5j265R16J79j029l08J990j182j74J120k1j223
742h76M43J406k420J717L90j190k87J093N61j420J482l18j133O29R39j118j87
759b89J288k96Q02j38Q24j365J40J428j652J70M58k76k039R86K7j119P93J24J46
778A2m82J091l64p81J644n04k32l50J194j790N28M17j212J193m80K70j659O92
796h13P36q59m14J410l86j410J225j464m1L53J166j292N43J283j587P71J11L49
$$ y = [-58, 56, 398, -715, -995, 157, -1135, -860, 386, 572, -1319, 773, 1261, -56, 1894, 1997, 1939, 213, 1817, 1099, -82, 1239, 1161, 714, -628, 1241, -1087, 549, 1181, 506, 582, 751, 2245, -621, 2465, 1323, 1255, 265, 1125, 2074, 9, 1360, -177, -508, -493, 262, -634, -1262, 7, -1202, -295, -948, -237, -1375, 93, 762, -1286, -514, -76, -77, -1624, 176, 121, -1144, -228, -49, -1078, -1386, 604, -578, -752, 368, 347, -876, -433, 973, -1447, 270, 660, -530, -817, 276, 837, -583, 899, 581, -552, 77, 1016, -102, -289, 999, 703, 1505, 1367, 2191, 826, 966, 2394, 742, 912, 1370, 1094, -945, 41, 68, -1051, -258, -134, 12, -470, 621, 257, -524, 1120, 616, 384, 34, 1228, -562, -34, 383, -829, 364, -116, 154, -1505, -813, -77, -936, -1350, 60, -326, -1736, -511, -1975, -2016, -1663, -497, -1789, -1246, 37, -1550, -779, -668, -319]
814c19r31K020K74j538O04M67k09p56J513j190m08J067o36l16k94J507j273L73
832d5P56q28o31M51R96j349R18L55r02O5R07J0n43J297m02j31j73M88q57j66P82
853I98j114m4j62L73j573N78L76q78J008J08l4p11J087k90n39J009J0n71k78R58
873C11p65j15J055l05j59Q7M81j325R12Jn05k8M28k68j058R38k18l59O40Q49p64
894a67k57J110p88L20J37P49j000M65P09r75K41J59R3p04J152j95r60R15k86K5
914G43m34R42r29j84M50m95l64N7N92r45N29M20n79k23P84j72l43R96m36n33K6
935i8K07l97l44J086j114k25J27K74q18N75N29o33L66N8M58j014P53Q1p75P27
955a77L7j01q76Q69n56j58Q64n08J11k29M73p81O72L39o02K4J91L84j027N33R1
$$ y = [-319, -1250, 770, 1044, -494, 110, 577, 368, -388, 1125, -65, -473, 594, -42, -358, -652, 855, -418, -45, 711, -117, -748, -297, 699, -650, 268, 623, -279, -214, 693, 703, 160, 1457, 1055, 924, 751, 1239, 382, 216, 998, -116, -160, -322, 51, -1522, -944, -568, -1446, -438, -330, -364, -1075, 12, -278, -817, 192, 202, -369, -647, 311, -454, -569, 486, 181, 22, 109, 590, -735, 177, 178, -327, -355, 73, -195, -1253, -315, -533, -892, -252, 597, -167, -424, 686, -102, 218, 355, 1104, 104, 569, 1278, 303, 544, 703, 796, 92, 1244, 1049, 89, 1004, 718, 743, 309, 1251, 322, 138, 588, 93, -271, -214, 378, -567, -38, 382, -197, -420, 364, 192, -151, 845, 409, -124, -98, 109, -288, -632, 454, -660, -885, -758, -484, -1302, -727, -198, -831, -465, -407, 51, -963, -210, -129, -904, -177, -140, -241, -1117, -248, -804, -962, -98, -606, -495, -724, -251, -1032, -360, -21, -623, -599, -408, -24, -1051, -518, -427]
976d27J0J87J99p6o70J049q81J01L09K84m24pO14j022O23L32J93o99M87L82r05
997c41M91J2J22n79R15n52n28Q02o29J95k70Q69o91J08M58n02m9J60M36p42N51
1018B36k32o73J6l1L81o86Q67p55O5L37M78m78k20J344q30J50J10L8n29L09K09
1039A06o22P79m52R4o01R85l85r1O71j25k38j32M67m16p3P32n02J98l17L41m98
1060g9L51L85o80L42K75m8p33N75J3l37K32K19l32k67N27m34J84J6K36o18M25
1081B52J37n66N01j98j62n28Q23j64q13P73j91k2j4M99n97N6M10l54k12Q8L16
1102C4m92K82Q4q57M65K52J02o93R86j84l89l8L25P3j60N86k63l8k15j9l08K38
1124b29K52K9n8N9M0m30N87J46k89M21j39j29j08K28J19k99M57l53K1l62N54n89
$$ y = [-427, -417, -230, -31, -107, -777, 272, -609, -508, -199, 85, -339, -346, 268, -754, -131, 201, 394, -305, 182, 564, -341, 150, 162, 284, -295, 620, 68, -460, 342, -287, -92, -362, 507, -184, -76, 382, -120, -169, -9, 427, -315, 236, 4, -669, -653, -684, -303, -989, -122, -877, -812, -475, 3, -475, -695, 649, -181, -31, 79, 117, -412, -103, 106, -516, 263, -189, -95, -696, 289, -96, -187, 484, 359, 121, -11, 456, 40, -33, 699, 197, 395, 78, 419, -79, 272, 657, -23, 319, 594, 546, -187, 388, 401, 64, 296, 515, 183, -84, 443, 9, 193, 209, 445, -173, 252, 389, -177, 324, 126, -36, -564, 259, 95, -718, 55, -136, -158, -172, 327, -270, -214, 196, -158, -370, -282, 34, -458, -176, -92, -949, -484, -232, -130, -823, 163, -21, -410, -448, -123, -50, -210, 376, 113, 75, -140, -159, -467, -229, 23, 52, -6, 53, 93, -337, 250, 396, 107, 528, 389, 260, 152, 380, 499, 200, 657, 304, 325, -37, 517, -72]
1146g2M58J18m27j06O0M74j215P85j24l6k2J76m6n84P52k94J70k75M65m35mL74
1168A92n93M10n0j15k31N7K81o54L89J42J87l36K51j56l04K08j7L7r9K61l17L33
1190a24K6l09M09q4M63o41L45R7k44O6L77j21k87P33o28o1K4Q8n84L94K57l60
1212a64K79k08J77j46o7N70l63N51l04j29m3J47J9n30Q08l24j9m57M90k14J15
1233A88O6l76K90o44N02j49k61K98n34M18L6j57K13j34J24j55l63l9M72j175J339
1254d1p93L57L57J02j80q6N87n51L07n8J94l31L14m3n05M30j59p6o6N32j99k54
1276a62L85l25K97o4M34n58L52J7l41K78L5Ll02M22k46l95N58l44J39K0oj24J01
1299A74m6k45J68l97O87l19n5k70L13j93J97K37m29K91m45J90r1n4J80n20O70
$$ y = [-72, 386, 504, 77, -29, 31, 505, -710, 75, -49, -85, -107, 69, 23, -561, 191, -103, 67, -208, 257, -178, -182, 192, -401, 9, -41, -156, -387, -330, -49, -703, -314, -172, 15, -321, -70, -226, -530, -322, -339, -302, -401, -140, -457, -124, -98, -407, 2, -82, 381, -260, 85, 182, -62, 4, 381, 260, -27, 706, 78, 17, 41, 129, -455, -61, 196, -164, 115, -93, 84, -62, -129, 441, 78, 629, 325, 196, 153, 300, 319, -211, 597, 273, 254, -203, 287, 73, 188, 254, -122, 168, -476, 26, -123, -384, -86, -620, -202, -166, -323, -110, -244, -120, -275, -638, -677, -205, -1380, -41, -834, -477, -120, -18, -198, -284, 303, -248, 59, 1, 195, -136, 178, 135, -370, 60, -99, -175, -241, 291, 92, -162, 223, -102, 195, 131, 565, 7, 359, 376, 35, 313, 348, 351, 49, 471, 225, -170, 388, 44, 183, 203, 197, 73, 174, 128, -117, 51, -346, 341, 22, -33, -303, 10, -183, 14, 251, -178, 113, -332, -142, -233, -287, -107, -627, 43]
1320D3l40l3L8J66k55K37k1k34Q1K22q9m03N43q6k00J43L6j89j61M20l85M73k6
1343b0J93k10QJ96l86L7K61k09K61ml2l11M53j63J18k70M60j24l03M85k02K6l00
1366c6K90k27p5J84k70j87K91M7k72L76l95j22N60j86mm1K55k57k85P6J86P4k86
1389c04M93n79M18k20r7M4O3K67l77j7J68k97PL4O1m3O86n29L4k69N22j04j03
1412a42K59l20J51j07L28m26N18k02j88L8Q7J64l15J45K78l66J91%q2j04n6K41
1434I2J35k67J49K09k81N76n04J45k42L64J40j42j88p9L54m90K76l14M28o24J93
1455g0KN34k02r7L1k44k03M86l87L41n2k4l56JK65N9J5j9P0k05M86o93P8J04L83
1480C03k94m30M68n55j29N43J70K29k93j36K5M58n97J1k95R04J97m88o44O64l22
$$ y = [43, -297, -330, -292, -126, -381, -144, -165, -399, -318, -96, -185, -588, -45, -131, -331, -188, -152, -341, -502, -82, -467, 6, -20, 173, -37, -29, 167, -219, -182, 79, -130, 131, 127, 95, -216, 237, 74, 192, -78, 382, 258, -45, 440, 238, 264, -36, 254, 27, -48, 136, -134, -321, -30, 17, -255, 121, -274, -396, 164, -22, -26, -67, 188, -69, -354, -278, -92, -18, -304, 189, -390, 28, -192, -289, -245, -182, 85, -292, -309, -141, -438, -431, -397, -336, -379, 307, -222, -188, -457, 65, -39, -142, 117, -203, -52, -159, 169, -257, 261, 59, -129, -91, -4, 160, -155, -10, 268, -98, 93, 93, 11, -93, -149, 92, 227, -40, 109, 318, 37, 613, 109, 254, 12, 376, 516, 374, 186, 107, 461, -29, 247, -67, 361, -263, -70, -68, 466, 264, 167, 198, -46, -249, 237, -150, 191, 139, 115, -241, -240, 25, 84, 99, 80, 150, -55, 431, -262, -184, -80, 303, 9, -421, 47, -508, -637, -94, 76, 305, 12, -124, -99, 359, -238, -227, -522, 382, 579, 91, -553, 111, -211]
1501b11J00k23j30N52K64m62K92L4M95k39p27J177p30l54P8M75l88O76r68M0L55
1522A06q5Q7N68p25K86K74L14o12L10K56j544R54q52O42k52N84n17L09l06J5K18
1543C0O9o6q0l3L14k44j03J17n8L4q6J16q2p7j12J32l3k46L50j83j86K20j39K72
1567g4j24K46n01L61r4J59K59j20L48p28L25j09j6K24q6R5m54L95m17K74k05K59
1589A7J81j68L17r2L4m32L65j54K24j57j47M9m60P82o60L37MkK39j63k82J89K67
1612B88r1j96K23l60J2k4J89l00K52l65J32j83M25m6l93K74j04J07j57K81n9j86
1634b81L20j63J28j43K12l6j38J44j96K14j48m3j46K18J27k52J81j51K63j84K32
1655A58J3j13N5N%j1m3ml8k13K67n2O9J02n2k5p4J30M0L7m2K84n5m75N00l65j58
$$ y = [-211, -111, -334, -464, 88, 352, -110, 182, 216, 711, 472, -255, 922, 192, -162, -84, 391, 3, 679, -289, -249, 106, 21, 108, 676, -49, 237, 511, 825, 213, 523, 779, -765, 189, -663, -21, -273, 311, -206, 103, -203, -188, 30, 99, 33, -47, -80, 234, -10, -113, 4, -54, -20, -106, 10, -72, -149, -261, -129, -162, -408, -58, -241, -427, -207, -346, -74, -198, 48, -453, -92, -186, -27, 232, 112, 460, -268, 57, -52, -68, 156, 70, 165, -289, 106, -311, -37, -242, 17, 198, 30, 347, 255, 289, -143, 222, 68, 292, 135, -12, 37, -423, 359, -301, 36, 40, 38, 277, 114, -168, 21, 288, 197, 1, 224, -136, -124, -148, 41, -259, -7, -372, -240, -423, 2, -44, -437, -163, -267, -160, -317, -36, -95, -281, 39, -124, 4, -139, 73, 37, -101, 43, -153, 61, -87, -130, -276, -58, 69, -183, -2, -153, 110, -74, 158, 171, 58, 113, 118, 118, 107, 64, 60, 22, -191, 76, 24, 93, 195, 143, 118, 44, 174, 214, 251, 209, 493, 438, -37, 463, 98, -60]
1682f0j32L79l47k46K34K4L14m14J52K90l82j33K54O9o7O3j91K13J22k20r4J50
1704b2K11m56P6J61j16k00R7m7J56K40k87M6L6J09j54j70M29j07L6n1j46J19K3
1727a7L16l48J83j41K65oj90J22N5J28k54R8j3K2j27j25K64j83J23k82P4n9L2
1750f3J67k8O3k34M05k06Q8l8o7K81j86k64m4K43k69M47j97r8K97l98K86l20J28
1773gq1O6k22R5K4j73K90k64PK4M0J55k54L23k25K03j50L54l51J33J5j86L55l23
1797a52P2L5QJ57k07J07M9J72l21M26k64J48k65J01l9LK50k41j8q3K82j21K3J85
1821C07J59j92j90K38j92J45j52k43L58m60L74Np6j43J26J84j62j00l05M05k08
1842a22K16j24q7J25K0N4m17K72J10m6j74K13n0j28M33j74j94L3J31r8r2l1rP2
$$ y = [-60, -192, 187, -160, -406, -172, -148, 166, -248, -96, 194, -188, -321, -67, 2, -65, -2, -193, 20, 142, -78, -172, -22, 189, -267, -191, -30, -146, -346, -249, -296, -140, 100, -187, -141, -105, 4, -150, -320, 109, 2, 38, -13, -159, -40, -17, 299, -49, 134, -7, 258, 252, 62, 184, 239, 367, 113, 211, 198, 220, 93, -32, 232, 49, 172, -110, -36, -95, -63, 104, 76, 139, -95, 310, 104, 192, 154, 87, 368, 182, -82, -126, 117, -152, 295, 98, 0, 297, -101, 185, -135, -7, -88, -22, -244, -149, -125, -298, -8, -272, -265, -241, -201, -46, -300, 23, -202, 1, -149, 205, -146, -13, 2, -184, 171, -152, -80, -45, -37, 120, -87, 20, 69, 241, -80, 346, 82, 230, -35, 66, 27, 30, 280, 39, 21, -62, 220, 99, 122, 307, 466, 274, 84, 322, 130, 275, 123, -120, 238, -222, 152, 157, 81, -62, 64, 248, 86, -14, -319, 86, -122, 94, -30, -117, 8, 28, 82, -335, -63, 47, 1, -173, 40, -10, -138, 295, 121, -73, -40, 91, -7, -99, -130, -139, -67]
1866f7j87L30k78J25K05k08o0J87k7mk2j87K57j40q5M0N3j71J76N6J50k54K52
1889A41k59K40j04R7o7J99K1m03K15j00M11l26J47j2k87J69q5R7j03K29l55L51
1911B16k85r4J59j49K56l08r3J45J57J36n06N99m9k17k29L45j39j4j72p7J60k83
1933d42M46m37J53L34j37rk80L83j59J38j87K16k99L84j32J16j20j00J80j20J10
1954C8j83J77J72k83K00q7NP7p4P3j10j07K36J27l02N7Nk8J34k08J30QN1k85J7
1979a60J13m5L89m01L6oL1M53o0j85j96J82q7K91n92K00j58M5O4l3pK59m89J24
2003b32L33k22j07J38k01L26k98K19j54R7mKQ6N8K20l79R6l19J91J29K49k16Q
2026B0o3j5K35l58J10K44K4k80L2K69k10M06j87k48J03o6o0j44L15j06k5K37k43
$$ y = [-67, -254, 76, -202, -77, 128, -80, -140, 47, 20, 16, -6, -193, 64, -76, -161, -121, -68, -239, -63, -7, 143, -111, 141, -118, 122, 18, 115, 48, 247, 268, -135, 80, -20, 391, 65, 212, 200, -87, 82, -3, 94, -9, 220, -135, 216, -69, -163, -4, -153, 103, -205, -298, -153, 4, 140, -366, 233, 184, -33, -262, 83, -56, -70, -242, -319, -159, -442, 4, -433, -280, 54, -83, -92, -372, 11, -148, -10, -197, 19, -280, 104, -28, 88, -32, -132, 48, -72, 38, -145, 32, 204, -79, 121, 34, 39, 116, 42, 115, 5, -102, 134, 261, -41, 16, 21, -7, 127, -81, 49, 57, 108, -177, -160, -47, -92, 297, -104, -68, -74, -43, 410, 350, 165, -31, 151, 64, 355, -237, -37, -195, -150, -86, -119, -126, 133, -356, -232, 101, -121, -228, -90, -291, 35, -263, -44, -198, -101, -105, -103, -17, 41, 261, -118, -22, -341, -150, -21, 228, 12, 20, -43, -58, 177, -181, -71, 173, 197, -83, -51, 218, 8, 414, 227, -21, 82, 16, -44, -188, 127, 21, -4, 233, -10]
2049a0R9l6m5L2L41m50J63k2k3O2k76M29m04K57k75K37k11m6%l7L12k65J46q9
2073a11O1k58O3K35J04k04p6J2J08k39J93o2N1Q5n0J27nk38J35P2j35J82l0k80
2097b60K08n2m7J96J24l27K78j74n0N9n1J60k32J56k23K01j3J10J92l39J92Q7
2119A95j46j60M24l07K46p8j75J19j45J04l6Oj55K42k93o6J67j74M44l61J46R4
2141I1Jl0q7J6r1K61l28j7J25k20J80j39J59J28O0m47K08k07O3J45j9k8j34L18
2165Hk54n3L56K3l05M1L55j00k39K10l16K24j85J81l7NL4Ln9K93j26j0r0o9J04
2190fp5J88K8J57k01l0J86l59L05q9k43K62l41M91k72k19K51r9J05p5K10J05k35
2213D4J0P1k77M36l01K66k36r7J43k81K03Q1k08N7Rj32P9J68j33q7L78l65L06
$$ y = [-10, 89, 53, 8, 40, 381, -69, 94, 72, 49, 111, -165, 264, -140, 117, -158, 79, -132, -178, -178, -215, 97, -168, -22, -111, -50, -308, -245, -10, 94, -110, -186, -174, -66, -305, -112, -174, -123, -38, -88, 39, 34, -204, -69, 3, -132, 50, 20, -260, -52, -104, -151, 45, 169, -158, 120, -54, -104, -45, -96, 64, -168, -12, -235, -34, -47, 63, 255, -84, 108, 195, 49, -111, 313, 6, 252, 174, -1, 118, -27, 77, 41, 47, -108, 134, -159, -225, -58, -232, 212, -149, -3, 91, 92, 62, -25, -9, -100, 161, -167, -184, -59, -279, -99, -238, -79, 49, 109, -338, -130, -337, -274, -129, -148, -176, -310, 8, -246, -299, 57, 80, -225, -184, 171, 71, -168, 42, -274, -50, -235, -54, -91, -86, -52, -49, -108, 185, 59, 49, -41, -110, -6, -81, 107, 135, 292, 91, 61, 247, -112, 193, 104, -139, 123, -218, 273, 1, -218, 33, -66, 39, -36, 174, 279, 44, 54, 125, -152, 284, -17, 249, 13, -84, 59, -222, -19, 62, -146, -89, -80, -212, -133, 35, -98, -185, 193, -172, 134]
2236A34j21jj3J57k85L08j49j68jq6Q1J87j68K8J66P3k25J07q6K03k21L50j10
2259A60j35k9J73j03q0J12R1m0r8J05k62J78j19j52N47l99Q2K77l47J52l31R5
2281a23j94P00n30L76kk76m2j17M49l76K72%k24J64k52K5P5K06k73L01l95K00
2303c6J74j71P4r6k86K26Qq7K02P4j55J36l97L30k64K12p0q4K52l25M68k02N7
2326D0r8M8J32k06Q2j35K08j90pnM54k47k38K05k48L52q2KJ74p3Ol15L30m0p5
2351G4n3n5K19q2N5p1K05m41J74j47J57m4K93k85J93j78L0q6k0r1J69k32K25N4
2375F3k09m3J51l0O8R6l0j93Q9q6J9N7j6M0j95J07O2j13J65k40J40J7J90n8j30
2400g9J82l14L36J35k20L5qk40j00L01p7J78j01j5K88l73K93k55M7J38Oj48m0
$$ y = [134, 13, 12, -1, 156, -129, 179, 30, -138, -139, -225, -144, 43, -125, -97, 69, 142, -83, 24, -62, 141, -80, 270, 160, 25, -4, 169, 66, -14, 98, 189, 149, 51, 156, -106, 72, -47, -199, 348, -51, 31, 308, -39, 113, -218, -123, -317, 383, -147, 229, 227, -49, -91, -208, 241, -135, 137, 137, -87, 77, -175, -150, -75, 131, -142, 159, -236, -36, 138, -33, 41, -55, -341, -115, -107, -194, 8, 82, -73, 63, -334, -4, -268, -56, -126, -210, 42, -283, 185, -17, 40, -58, -10, 122, -84, -2, -137, 71, -119, -126, -131, 323, 76, -162, 43, -205, 147, 65, 67, 241, 168, 174, -141, 189, 149, 74, 21, -34, 185, 103, 158, 87, 292, -149, 25, -122, 35, -9, 284, -1, 192, 14, 44, -42, -62, -153, 16, -216, 9, 63, -146, -189, -38, -68, 0, 96, 66, -127, -38, -124, -105, -48, -64, -24, -219, -112, -50, -163, 2, -238, -98, -81, 109, 51, -79, 103, -211, 125, 260, 40, 75, 67, -173, -273, 28, -49, 129, 28, 13, 301, -72, 221, -34, 13, 151, 157, 9, -31]
2423c1O3J9QJ5r0j9J3J55kk87M46l07j28J14j15m4L83j61n0q0OO4r1K9J31j16
2449g5P4m5Q1L4l42K40k93K63J33l63J02J93jL04m30K29k15L49k51k65M16j72
2471c4J50l7r9k90K25LJ77q5Q8j29J15l6%m2R9J37k23q2K22j05J54j25pN0N8K4
2497B08m8j06j99M34m19L14k56J66J4nj10j14K15O1l17R0K2j30J67j13m5J66j18
2520a23p1J86J28j13l1l50L58j9j62J40P5K21l66n4L39p7K8k87L29o9l91J36Q9
2543h4P0j30K25k5j2J0J71k03m1J11J9k44L09k50O9K68N8m06P8j03K24j86J27
2566E5P7j57J38K46k20l05K05q9k58O57l70J75j13J30j80N8j01P2R8j85J96r8
2588C1n2J44p7k68J70j51j63K16R1j97L19j08j04L50j63l0mq9p7M4j61O1l9L83
$$ y = [-31, 32, 51, 59, 74, -16, -35, -22, 133, 131, -156, 290, -17, -145, -31, -146, -190, 193, 32, -18, -98, -92, -28, -119, -90, 41, -75, -1, -46, 35, 69, -273, -33, -326, -63, 70, -293, -191, 2, 1, 305, -125, 104, -111, 238, -13, -278, 138, -34, 116, 79, -20, -310, -85, -82, 95, 10, 98, -31, 84, 48, 48, 6, 105, 242, 19, -63, 159, 54, 208, 83, 76, 126, 184, 208, 160, 54, -145, 289, -130, 184, -72, 94, 108, 103, -7, -121, 94, 155, -162, -72, -50, -180, -13, -126, -171, -5, -123, -194, -8, 120, 7, -24, -374, -16, -35, -197, -57, 18, 239, -127, -181, 158, 81, 109, -178, 151, 82, -309, -173, -84, -14, -144, 81, 56, 44, 54, 225, 22, -19, 92, 111, -133, 176, -74, -5, 263, 321, -85, -7, -110, 114, -72, 55, 132, -25, 113, 359, 139, -166, 39, -50, -308, 349, -21, 154, 41, 171, -9, 49, -52, 20, 118, -67, 129, 31, -21, 123, 46, -222, -52, -203, -366, -150, -59, -256, 63, -45, -149, 201, 38, 8, 4, -85, -162, -118, -279, -218, -257, 126]
2612A26p8K12j77k10J46l91K73NM0J8J51l4l54J54j24L3j08K49q8J23L6Mm8n9
2636a01J36j00j3N8K69j93j33J66r8J56k30N6j00L0K55p7J82k37j3Nj57K33j0
2659H4J50l9k53jl5J23j26j12J99J62r9r5K2L39k85k62K17l0mK26k57q1Q7p6K04
2684E8j25pJ45j07k16K25J47k32K52j67n8J1jj5K4O8K19j57j13l8m2K03O3j06
2708C1J5j19J33L3k62K19J96o0j92J45J66l48J09r2J71m0l5K2p8O0p8J91j34K2
2732G5j9L9n3j68L03m49K43J0k66Q8J93r0J31L0k86Q9K51j25OK00l20L18l74M52
2756B78k94k20R1J02L7k7n2m7K05J14n6L0j17n17J12L38N5l7j46J43j56n1K15
2779@m8J27j50P1oK64k56r9J33J0q9R4k52J27O8J10p7k10K94r1J86k33j5M3K4
$$ y = [126, 48, 260, 83, -127, 19, -372, -99, -94, -54, -36, 115, 81, -273, -119, -243, -210, -318, -69, -157, -34, 2, 6, -42, -101, 35, -65, -78, -20, 249, 56, -77, 89, -9, 147, -83, -27, -127, -97, 158, 81, 263, 26, 13, 18, -139, 94, 84, 234, 195, -58, -59, -94, 29, -97, -209, -10, 152, 53, -42, -20, 319, 34, -228, -11, -41, -45, 181, -76, -157, -70, -146, 58, -67, -74, 71, -36, -252, -27, 120, -112, 140, -27, -85, -74, -75, -90, -66, 2, 221, 64, -49, -87, -129, 74, 137, 31, 46, -73, 60, 93, -169, 50, 246, 186, -6, 139, 305, -43, 66, -26, 145, 105, 70, 92, 14, 74, -4, 187, 53, 75, 56, 95, 42, -126, 177, -272, -29, -19, -285, -197, -4, -94, 37, 67, -219, -130, 121, -4, 2, 202, -118, 200, -174, 278, -16, -236, -145, -43, -6, -33, -85, -132, 73, 187, 131, 161, 44, -473, -361, -23, 32, -5, -151, -8, -164, -215, 0, -48, 79, -71, 0, -6, 258, 2, -97, 36, 46, -43, 51, -201, -74, -6, 104, 27, -183, 111, 20, 206, -27, -42, 1, 25]
2804B5L7k71L54m58M51j45j32J36K23k31m0N6k03K17k50N22k37N4j75j58K96p0
2826Ak97K69K2l9j68K70m7J24l2k81J11l4K49j93J80l92M84j17k03J14l9q1K88
2849A89L2j22k22M5jJ83k72J34J38o6r3J53j5p4Q8k63M31J6k62J39l85M57k01
2872B9jJ25O8k26j10M24l64j53J84J13k70J97j2j85L34j75j5J55j62L6J0o4R2
2895C0j21J65J04l08L20k55j95K27j72L19j41j20K55Q5l83L34r3oj21k4K24l47
2917b23K28q0J86j27k23K72Q1O3l35J77j31L37k03J5m1o0q0J98r0R6P6o8o4j58
2941a54M78k26l25K67N8l3J90j8J6m08N1K35n34L42k5K16l21RJ95l01M21k97J42
2964b2jJ5p1L16m68J56nJ16P5k83N24m56R2k45K49pK09j2j46k7L7Lj59K08m06
$$ y = [25, 62, -209, 145, -313, 138, -7, -139, -3, 220, -11, -51, 5, -198, 19, -231, 291, 54, 108, -67, -225, 71, 1, -296, -27, -5, -44, -212, 58, 11, 135, 103, -178, -67, -101, 148, -45, 135, -257, 227, 110, -93, 21, -18, -99, 189, 221, 99, -123, -78, -79, 104, -168, -34, 104, 38, -55, 98, 83, 9, 97, -166, 265, 281, 19, 158, -227, 230, 29, 28, 153, 221, -5, -115, 309, -55, -208, -24, 89, -181, 16, 4, -181, 153, -22, -37, 118, -44, -8, 2, -62, 30, -91, 74, 178, -130, 190, -65, -260, -33, -205, 114, -27, -147, 108, 193, -190, 144, 51, 45, -76, -100, 124, -223, 5, -75, 111, -16, -239, 33, 114, 177, -158, 19, -112, 225, 22, 37, -4, -64, -144, 54, -36, 60, 136, 68, 4, -154, 324, 98, -227, 40, 98, 65, 255, 237, 253, -155, -104, 131, -403, -61, -86, 130, -191, -182, 13, -288, 133, -164, -22, -23, -8, -79, 237, -231, -75, -80, 36, 111, -172, 352, -104, -12, -257, -8, -15, 194, 182, 36, 9, 46, 49, -110, 98, -308]
2989c08J37J94J14q8j38L89k41j29L6k76L62R7J52n73K06q9M3j54K29P5M6q5n0
3012e1K15o1m8j45rr5L92j73j5J61k41J95j90R5j06J06J18k58L37j45k59m4K75
3035E4r5J67oj34J13k12J22p1j86K35K3%M1k00J05J87j16k32J3L92r6j20r2K23
3059A15k19K52o8k48J66j76J23K30j31J6L60l57M0m0j23j5rj3rJ60j22J18r4M7
3083CK3n0R2J24k37o5k6L7L7K21j78Q6j57j78k3K84o3K1L21j55q2j0Rl25K43q1
3109a29J10l8M3J64n3N6j00qJ96r5J91j35l69K32j04j46r4J80r3l7P7K76N0j91
3133a7K5R3k69l2J18K91l90P0K44k92O9Mo4L23j72J7k35o4N5M68m40J39oQ4o8
3158d9J27r1J43n2o4l0k1Qo2l4R8o9K91k36OQ1K2NMK13k64m0J48j97J5P7j21J67
$$ y = [-308, -171, 23, 137, 49, -89, 300, 59, -70, -34, -310, 52, 149, 301, -272, -66, -155, -112, -266, -37, 38, 84, -1, -51, 164, 103, 55, -90, -99, -194, 198, 25, 10, 171, -70, 125, -65, 30, -76, 30, 148, -110, 227, 82, -177, -221, 54, -41, 126, 120, -14, 99, -113, 9, -62, -248, -13, 10, 10, 51, -149, -44, 143, 27, -205, -192, 200, 104, -16, -108, 115, -104, 148, 80, -168, -2, -178, -55, 175, 44, 60, 420, 63, 103, 63, -60, -75, -84, -97, -106, 54, -68, 50, -44, 3, 26, -24, 68, 192, -45, -110, -136, -99, -62, 159, -19, 67, -90, -268, -291, -7, -70, -49, 272, 117, 35, 25, 34, -291, -48, -129, -19, -57, -14, 150, 97, 153, 53, 45, 241, 146, 337, 202, -167, 65, -39, -185, -279, -99, -192, -229, -152, 124, 174, -17, 8, 101, -168, -200, -82, 209, -181, -111, 133, -159, -90, -86, -150, 173, 1, 18, -217, -281, -226, 242, -198, -59, -65, 19, -49, 78, -13, 130, 78, 14, -16, -37, -29, -91, -125, -27, -96, 195, -41, -35, 46, 68, 73, 77, 290, 26, -14, 134, -63, -48, 29, -92, 75]
3186G5n5j8k66M14j35N6j86N6l6J28J5J0K2m01M20nj16j27Q9q1M5J97Pj99lP6
3212a8k6k75L49j8j27K14K4q9j98M5L0J43J8k04L9K31k23l0J70j91K27k09N3k3
3236h8P3j0n2J73l79L39j97J56J24l08J90l30K56K56k39l9o0M92l70r7J22J41
3258A53j53j28K72m5q1R8j54o1j89L32j47Q3O1k34M66k17l0J78j07j07P9k42N1
3281a22R1L7N7J31l00J58k79J86O6o7K35j48m7J07j81J42j40j5J96J26l68K96
3303A61l35L60k42K96j98j7J8l97M09k85N47m70mN6K20j29J2O8j66L29j68k08
3325a43J61j23J7J35o8K39L2m3l12j43K39n3L1K00k83J59j24K1j13J82J05m8J16
3348A84j17K9m7J83j76Q8j30J29k07k9j68J15R0k8J57l85K69N7q8R0l12J12L43
$$ y = [75, 20, 2, -264, 150, 15, 71, -115, -59, -95, 33, 48, 58, 80, -321, 99, 94, -22, -149, -60, -141, -96, 101, 108, -91, -94, -18, -44, -319, 30, 12, -115, 99, 123, 34, -164, -119, -89, 54, 72, -132, -93, 138, -85, -115, 55, -136, 91, -118, -65, -88, -15, -25, -77, 96, -283, 56, -141, 15, 139, -169, 21, -309, -53, 203, -36, -75, -135, 357, -13, -110, 12, 153, 0, -128, 144, 99, 18, 116, -38, -99, -288, 44, -103, -20, 41, -193, 273, 56, 26, 204, 97, -10, 69, -173, -122, -31, 6, 63, 194, -106, 52, -227, -41, 25, -42, 193, 45, -2, 105, -76, 66, -74, -89, 107, 233, -135, 161, -174, 186, -56, 240, 42, 25, 43, -354, 55, -230, 317, -153, -157, -101, 119, -10, 2, 70, -96, 233, 65, -143, 18, -105, -88, 47, -21, 218, 250, 207, -105, -248, -9, -62, -31, 169, -114, 45, -79, -58, -171, 11, 116, 68, 184, 67, 96, 49, 232, 56, 144, 14, 143, -64, -93, -261, -146, -56, -84, 73, -312, -43, 14, -74, 16, -296, -184, 159]
3371A59k23j22J34q7J62o2j5K63r7p5J25k12O1r1l7K67l77J24J02Q9j55R1oL1
3395D9m0l8O5Q3j64J17O4k02J48j22J18k24J04nJ40P2j73j67L19j29M5J59k30
3418a1n8Mm7P2J11n0k0J33j94Q9k54J31J91j88j52L21K9N1k45J78j1P1r6m3k8
3443a6R3k70L27k64MN3m5L24n4jj16J18o6K2j4q5O2j47j45M39q7j26J52P4k55
3468b3J12k9K2p7O0Q6M6p1pn8j10r6p2Q7J73O6k13J8L07j91q1K69p6jr7L3j26
3495d9n0n7J00K49p4m75K69N2J29p8K32l90K13p3m3J82l03qJ64J49j25J16j23
3518Gj24M2K58j96Q0K56l82P6o7Or5R9Q9m8K7l4Q1j94J47l01L54M6j91K27P5l72
3544a34J7J06J32j4q2%P1M3l17J03J12m6M28j67p0k49n6J95o2J63j86J78l09K29
$$ y = [159, -64, -186, -52, -139, 23, -39, -54, 209, 112, 37, 162, -50, 11, -80, -117, 150, -227, -103, -1, 88, -67, 24, 18, 49, 9, -29, 36, 119, -45, 72, 136, -66, 82, -40, 78, -146, -42, -47, 93, 165, -8, -175, 144, 15, 60, 219, -11, -69, -65, -112, -40, 71, 21, 1, 134, -60, 29, -225, -94, 97, -91, -243, 78, 107, 158, -87, 91, 80, 151, 55, 12, -16, 77, -193, 134, -130, -126, -73, -118, 206, 152, 151, 35, 153, 87, 109, 95, 10, 72, -75, -220, 219, 132, 6, 158, 232, -23, 89, 60, 82, 5, 65, 151, 197, 126, 119, 61, -49, -145, -217, -130, 43, 109, -104, -86, 221, 30, -51, 218, 142, 141, 44, 77, -49, -99, -156, -56, 193, 119, -356, -87, -35, 94, 16, 248, -142, 71, -2, -45, 137, -166, -174, -10, 139, 14, 130, 7, -117, -75, 183, -13, 67, 323, -59, 17, -50, -44, -139, -40, 49, 1, 28, -6, 75, -119, 28, -273, 81, 127, -64, 163, 238, -134, -117, -11, 121, 107, 25, 25, 96, 139, -178, -75, 37, -9, 419, 252, 182, -67, -123, 72, 10, 173, -13, 165, -144, 85]
3568H5KP3j16j36p0l7L2K18J31q4m8N0j19r2j0L4p6J80M7J00j74J83j61L4O5j60
3594d9J78k29L27k62J87p2n9j34J50J51k96L11j65j10J25k42K27k75M18j93o5
3615g7J00J50q8j18J50m11L30J13j63j50L99k44rJ18j80q4L35o0j52r5J10O4J51
3638A89On9o1l3K10q1l76J94q1NM0J46j31K38m17K09Q9J33j44j55L86n69L20p2
3662a4K74r6k43K70l31q3K33k15L79k31J87j87k04J79j47K48j36N19n60Q2J58
3683H2j98K36M7j68l5Pj06K1LJ35K47k43p3O2Q5l12M12j93Q6JP5k19R5J75k05
3708A7J47k33M2O4j61L58m51N01j20j03j7o9Q9j02R9l30L64k77Q4L98l41q1K35
3731A13k60J26O2k32J26j18J00N5j03L03p6j33l0R5K2j10l4K15j54K6j46J00K93
$$ y = [85, 87, 160, 44, -92, -162, -199, -167, 51, 182, 98, 50, 100, -19, -111, -121, -87, -163, 17, 64, 164, -10, 173, 12, 46, 111, -49, 129, -100, 227, -35, 152, 80, 21, -113, 37, 188, -108, 203, 38, -72, 53, -189, 38, -237, 181, -12, -77, 23, 173, 85, -33, 117, -294, 36, 149, -14, -164, 235, -9, -18, 100, -80, -164, 171, 111, -41, -136, -26, 38, 189, 195, 136, 75, 42, 252, 171, -205, -11, -92, -87, -47, 99, -32, 206, -211, -2, 87, 220, 76, -79, 307, -262, 58, -14, 260, 164, -79, 191, -140, -223, 10, -205, 174, -57, 130, -57, -261, -82, -229, 19, -117, 402, -158, -76, 82, -116, 120, 167, -1, -36, -29, -135, -114, -111, 24, 271, 28, -45, 17, 102, -210, 202, 9, 95, 96, 171, -48, 47, 222, 17, 164, -69, -27, 37, -124, 234, -217, 284, 164, 61, 44, -25, 64, -38, 61, -269, 95, -182, -98, 300, -41, -122, 113, -147, -21, 41, -191, -65, -183, -83, -28, -131, 172, 96, -37, -67, 28, 50, -60, -94, 121, -33, -7, -153, -53, 240]
3754B40k76j11J76rJ36j46k46L58j28L0k97L23lj06j23K63j62J18m1R7j01P3k99
3777b34J26l4K36p7J08J16m15L49j0l99K96j49J76K3r3J07K4j74Q2r9J84L5r6
3800H2R6k0m8j19J55j29O9k11L14j85L3j17L04l09O0j65M6k4L66k67O8Q8j10K81
3824B58k67j94J71k0qn6K84j62p1o6J45kJ74nj46m1O0k19M5M0J29l3J67l87K35
3849C1j39L1M8J48j35NN2l95N63m14L95k80j62K19qj68K93l27K60J9K1j42q2K31
3873F4j57J45j79L6Q5P6j52J41J14k34J04o2J58J5J9j22j33K5j74K36q4l5N8J46
3897I0j57k3J20pj08k5J47J90m7j64j42Pn3O8K11k9r0M8j66j15L44j02j79J45
3921c7p1J43L6k8Ko2M5O9k3R0k32J42p7n6j99L40k40L7k3M33k53j40J49q1n6O0
$$ y = [240, -36, -147, 29, 20, 156, 10, -236, 122, -6, 24, -273, 50, 47, -59, -182, 81, -81, 37, -4, 93, -8, 65, -234, -108, -142, 94, 17, 125, 241, -174, 175, 165, -234, 62, -87, 89, 112, 19, 126, 150, -24, 58, -41, 143, 178, 82, 178, 158, 110, -9, 146, 17, 86, -125, 189, 4, 37, -80, 224, -85, -25, -190, -144, -168, 198, -69, -1, 87, -23, 258, -9, -203, -32, -52, -60, -116, 168, 6, -65, -131, 14, 12, 186, 181, 35, -6, 54, -165, -120, -80, 49, 16, 183, -204, 31, -108, -77, -29, 119, -16, -11, 41, -354, 209, -205, 190, -90, -252, -33, -41, -209, 84, -243, 17, 36, 57, -85, -167, 64, -93, 52, -127, -91, -6, 70, -82, 59, 173, -61, 43, -19, 139, 154, 173, 51, -82, -57, -231, 5, -79, -114, -56, 90, -67, -90, 30, 23, -85, -110, 37, 227, 180, 16, -126, -119, -172, -104, 107, 78, -12, 36, -130, -245, 99, -3, -182, -37, -108, 35, 71, 43, 45, -17, 28, 97, 74, 164, -68, 74, -3, -59, -258, 82, -158, -121, -144, 289, 36, -104, 45, -36, -92, -32]
3947c2Q3J92m57K80J07j65rO5o7q5N4M9r8p9L26j72J32l78J72P0J4k63L64N2l33
3972a78J81o9r5Q2J40K61m24J53j39O5K35j85J25J81o84M00mr7Q4p3Q8j5MJ34
3996A70k07Q4j06p1K90j95k9k79M28k11L0M5J25k04P8J23J8J74k03j58J52l20
4018b66K25K36j82o5J56j2q8Nl7K86l37j17N97l20j07J55p8N4k5k42j84J49J58
4041c9q4K18j63N9j83J46K02m1m9k66K92L7j34l33L85rj59L9J02MK13n10k5K80
4065a8M3j91J12j49Q6K37l9j44J29j35j00K28j48J05l77M04q9L2J82j1j43j7j51
4088a54K79k08J16j12j59J18L15k35J67JM4pj98R8n1r5l6J88j03O8jJ49l38K19
4112F5Ql37L96j59J09J24m9j43J62Nj36j70K96l68K44j03J80m65K46J92l40P3
$$ y = [-32, 51, 243, -214, 66, 173, 8, -1, 64, -3, -88, -34, 15, -83, -162, 164, -8, 124, -254, -82, -12, 2, -261, 103, 155, -178, 3, -66, -161, -79, 61, 322, -102, 51, -88, -23, 212, 27, 152, 333, -351, 49, 45, -52, 32, -41, 47, 32, 36, 170, -37, 47, -59, -130, 160, -35, -64, -343, 85, -126, -96, -51, 74, -130, -52, 71, 89, 263, 60, -98, 54, -266, -41, 195, 13, -52, 104, 92, 4, 9, -28, 258, -79, -196, 401, 81, -26, 129, 51, 105, 80, -162, -346, -197, -39, -123, 95, -68, -9, -192, -46, 156, 115, 66, -200, 92, 129, -5, -338, 47, 38, -121, -82, 20, 24, 237, -273, -298, -18, 25, -166, -54, -203, -117, 120, 81, -63, 66, -69, -169, 59, -89, 16, -361, 43, -46, -14, 168, 157, 14, -3, -154, 125, -83, 33, -79, -238, -120, 195, -40, 127, 128, 172, 165, -33, 65, 14, -81, -117, 71, -32, 36, 35, 184, -154, 65, 73, -264, 132, -27, 82, 206, 157, 14, 176, 181, 45, -125, 171, -197, 47, -56, 124, -341, -95, 97, -243, -170]
4134a70J11R5p1Qj51N1J75M3k14j12M17k37J06J4o7Q2j84m1J41J60o9J22j11j73
4158g5j4K99j68N1j88m1M46l51J17L4n7K5o6j35K29O3j4k86K01P1m2q4P7j27j87
4183b22J16j06J98rnQ9l07J62L3r5K83m41N64m14j68J52M17j73p2K5l9m0Q2j79
4207a49J11J77p9q2q9K09j32j06K01j83J39k32J86K4K67k67R4j36P0o2m3L53l06
4230c5M8j14j7O5K72o0j49R7J30k08j1o5N2q5PK19l35O3L2P1j30N3J44r4J86m3
4256I3o1n0M8L1n2q1J88l0k14J62k8j9O5p1K02m0k65K26n0J01j90Q6k19R2J09
4281C3J35j34R7j52J62q2j87J6OM12k05k08K26L6k37J31J56k40k49N44j43j81
4303f4J66q1L6J7N3l04K88k82K60j42NJ59O7k12K84r5k65J05J93j72N8O6l49K07
$$ y = [-170, -59, 36, -35, -27, -178, -127, 48, 91, -123, -235, 182, -55, 51, 65, -2, 80, -104, -145, -4, 156, 87, 209, 98, -75, -89, 210, 42, 93, -95, -136, 310, -41, 76, 110, 53, 78, 12, -123, 106, 169, 155, -131, 70, 141, 99, 15, 92, -35, -222, -106, -212, -14, -23, -28, 61, -246, -84, -51, -146, 137, -304, 260, -154, -322, -170, 247, 74, 2, 27, -12, -52, 30, -149, -38, 139, 60, -22, -111, 98, -34, -140, 61, -122, 17, -215, -29, -5, 262, -5, 89, -47, 23, -39, -82, 271, -35, 13, -101, -118, -53, 219, 159, 10, 107, 237, 29, 18, -47, 5, -80, -73, 146, -189, -126, -94, -23, -153, -100, 44, -50, 136, 93, 32, -18, 30, 61, 9, -72, 116, 86, -128, 34, 6, -13, 52, -19, 183, 143, -122, 104, 54, 155, -35, 51, -168, -76, 33, 168, 34, 131, -21, 141, 59, -128, -112, -106, 306, 101, -107, 119, 155, -82, 49, 205, -35, -284, 260, 117, -64, 102, 21, 57, 74, 127, -177, 111, -171, 89, -53, -48, 111, 178, -34, 250, 155, -110, -5, 188, 16, 74, 140, -209, -2]
4327bj35l7M5J18j32J51M7k7j46J39j46O4q4K53m7J48j46j69P1J96l63P4p7L66
4351A61k23J49nP2k88j7k6K77k17O8M3k6j1q8J5J03K3K36k84j00k7K74k10J48
4375D7m3j8j05N01l63n1J83L8o8j42m5j53J72NJ98k11J63Oj84l9M9l7J94k2k51
4400a76J78J09l69L44k56PJ32J04r9j29j46K77O3j28j47N8K77K61j3l52k66L76
4422A05jl56J50m22K76M89Q1m25m59O63J69o4%l04P8k48N97l98J86k19K13j79
4444f8l4M47l72J88l48R5K24j65j68J80K02l57k26Q36o80K52K07m58J05K35l19
4465b24L02k03K53j23Q7k11nL66k32J78k65Q8j42K24K76l69L8L91l55R5l97j1
4487b39J77k61J06j13O80k70J38m00L35k40J97j7r3L27l18k83N19m32k08M60k21
$$ y = [-2, -137, -174, -129, -11, -143, 8, 55, 28, -118, 21, -125, -61, -145, 108, 61, 209, 63, -106, -35, 161, -202, -128, -205, 161, -62, 87, 82, 154, -134, -151, -177, 100, -117, -49, -6, -32, -43, -131, -116, -13, 10, 246, -38, -138, -165, 109, -101, 47, 4, -14, -119, 382, 19, -32, 151, 189, 121, -21, -66, -219, -47, -42, 156, -55, 108, 114, -70, -109, -60, -97, 97, 75, -176, 2, 111, -258, 86, -170, -163, -31, 73, -26, -155, -301, -24, 39, -89, -236, -178, 99, 360, 347, -5, -271, 105, 104, -252, -102, -524, -248, 241, 322, -103, -562, 101, 270, 206, 206, -98, -20, -268, 329, -69, 117, -102, 111, -68, -102, 345, -27, 161, -187, -92, 132, -33, -201, -21, 181, -176, -402, 434, -246, 6, 213, -245, -140, 95, -224, 78, -125, 128, 5, 92, -119, -124, 242, 10, 188, -77, 11, -131, 93, 369, 0, 38, 429, 74, 169, -228, -239, -62, -323, -217, -330, 350, 80, 218, -182, 153, -87, 110, 93, 0, 327, 9, -274, 245, -187, -395, 65, -156]
4508a56J18J55P3l9j2j99r8L08p1j39L04m56l28M56N2K24n83L05J38Q0n5l31K45
4531iL1j68L06k00K49k16R5p8nk2j3k22O9O5K19r8n3J11J27k94K41N0l32P7J73
4556A03j73L5J00j47j0J03j30m2P0J64lj45J53j82K71m36K76rqK51k46LR9M5k34
4581i2K22J93k46j9k1k35K55k48M7J95J22n1l95K18M9k81M02q2J07k49K74m05
4603b40K19m0oqm2J42o4K23j94K18k15r7J21R2p4O9j02K3P3k83J84P7O1k0k60
4628a43K91k52J17J09j35L49n12K81l91L07m3J41j76R0R6N5j97K03j72P2J7JQ7
4651A95m64L28k9k41M24k49j2K08k85n5K25j23j52Q3L7k60l2K93J93J25l15N2
4673e4K34j55J58q1k4j20m6J97k89N3K3M12k74K84m04J3N6m1J7J78j15J3N7j32
$$ y = [-156, -38, 117, 190, 151, 139, -60, -158, 150, 79, -60, 244, -212, -540, -84, -32, 192, -391, -86, 52, 132, 77, -254, -9, 22, -146, 160, -40, 209, -7, 88, 10, 5, -17, -30, -252, -183, -118, 101, 3, -50, 61, 188, -106, 135, 185, -147, -70, 103, -70, -35, 65, -82, -92, 11, -119, -161, -91, 73, 70, -75, 78, -104, 167, -269, 7, -2, -10, 241, -5, -2, 97, 142, -92, 130, 323, 77, 58, 37, -198, 57, -191, -144, 51, 173, 122, -273, -55, -6, -287, 115, 33, 140, -109, 165, -240, -21, -61, -67, -75, -117, 25, -39, 184, -10, 208, -7, -104, 17, 109, 35, 104, 2, 25, 98, -185, -1, 76, 137, 117, -143, 148, -104, 13, 122, -13, 336, -176, 105, -286, 21, -22, 119, -57, 33, 129, 184, -13, 190, 18, 90, 107, 108, 195, -269, 59, 30, -211, 213, -36, -48, 160, -125, -180, 45, -78, -230, -147, -110, -370, -402, -109, 84, 209, -106, -54, 180, 25, 183, 102, 78, -42, -88, 109, -180, -127, -104, 308, 34, 318, -86, -73, -17, -58, -41, 137, 22, 35, 92, -40]
4697d0p5K7L6L02k70K55m93J52K27j07K10k70M82l09L0j87kL61k95m3M7P8j25
4720iL9r2Q0p3K84m01J05K24L0k55LKP6j49J86J57j44K0rr2Q5r6j74M09j93j47
4746a34J12J66j48j33%K41l51J53RK1J11J4j56J44Rl51q4M24K7Rm7N1k21J88K06
4771B60j20R8k40j35L41k08j27M07q4k24j65J22K20l04K87j09K8P6j38M01k55
4792A31qj82K06j24m5O3p6Pj93J18J31j27K71j60K3j31K4J56j58n5P0m4J51rj87
4817a48m5K03K61j90P7k53J07j71L70k42j03J25l9p2j12J39j20K96N1j17P0L9
4839A26%M5l8j83J76k25M7J67k79J40R3k40J94J32k78N8j07J15M2j08P3J98l27
4862a79K00r0m6L07q1j18J14j26k35L57j16o6O8J2L27k13L0l13K4J18m8KJ81j90
$$ y = [-40, -115, -88, -52, 250, -20, 235, -258, -106, 121, 14, 224, -46, 436, 127, 157, -30, -32, 329, 34, -9, 38, 116, -9, 30, -62, 18, -55, 229, -172, -67, 157, 187, -68, -65, -63, 13, -136, 50, 207, 63, 83, 74, -18, 67, -29, -203, 206, 13, -134, -22, 144, -4, -137, -137, 104, -247, -94, -85, -64, 47, 61, -95, 49, 58, -293, -377, 47, 74, 83, 36, 87, -134, 54, 260, 140, 238, -2, -137, 204, -4, -131, 276, 192, -32, -197, -75, 145, -159, 128, 19, 47, 123, -15, 386, 131, 123, -59, 147, 23, -22, 41, -35, -28, -221, -103, 28, -99, 172, 12, 35, -96, -72, 84, -74, -129, -59, -103, 48, 39, -148, -193, 10, 271, 81, 158, -95, 12, -159, 211, -31, -134, -9, -48, -120, -232, -93, -213, 83, 134, 17, 87, 126, 126, 171, 133, -50, 126, -99, -52, 115, -164, -24, 69, -171, 23, 155, -123, -65, -172, -57, -15, -123, -50, 148, -179, 21, -69, -115, 192, 111, -7, 107, -19, -254, 103, -13, -79, -11, 1, 328, 115, 145, -168, -144, -26, -74, -72, 109, -81]
4886h1mJ93p1o7q0J71k38L76k80n6J93j82Q7Q9o3L15k57j89L10k40J52J05k02
4909a9j29P0K6J21J69m35L17k09K3q3m5K00o7L3k61J86L0J17p1O0K8R0k69J73
4933E5o8M00n18K14k0J06r1k39J58l6r3R1k31M89j23j00l1J72q7j70j58K38J9
4956b3l2j74R9j15L60n32M77k01J55K64j46J36k24k16P3J92j55L47m23M9L90k55
4978D6j02j3L92m48L8J09P9J06m21O36n58qJ49o7J89k67J93j04k0r0J33K06j17
5001F1j75J80j19j30K70k92K80k67J50rOK59k2n3P2L1l89J80K57k17r3o1J05k27
5025b03O00l96kN5J07k18N9O6j58j07J96J66o5k6r3j61K47k91j91M89Q8p8R7j
5049A80j70oP2l2m2j2J95l04N6q6O9R7k14k1K27K10r6j30R0j86L6R3J13l23M8
$$ y = [-81, -85, 108, 37, -30, -110, 61, -177, 199, -81, -137, 56, -126, -39, 50, -13, 302, 45, -144, 166, -74, 78, 183, -19, -148, -78, -52, 69, 238, -197, 120, -89, -66, -149, -194, 6, -61, -28, -289, -103, -73, 44, -27, 33, 61, 151, -118, 55, -13, 387, -131, 83, 63, 169, 78, -161, -3, -39, -132, -41, -272, 217, 94, -6, -37, 135, 48, -122, -280, -42, -23, -55, -229, -130, -245, 115, -417, 60, -141, 14, 278, 132, 268, 44, -172, -99, 93, -62, 285, -138, -89, 301, 46, -56, -69, 323, -125, -87, 22, 101, 207, -214, 422, -136, -144, 5, -62, 127, -140, 53, -51, -71, -161, -28, 178, 61, -114, 66, -53, -183, 87, -205, 75, -192, -42, -51, -45, 214, 192, 139, 211, 242, -147, 33, 290, 73, -20, -81, 24, -203, 397, 1, -1, 54, 161, -57, 2, 68, -90, -197, -1, 165, 100, 74, -19, -180, 67, -224, -415, 74, 162, 84, 181, 180, 10, 4, 76, 44, 2, -10, 185, -119, -63, -149, -80, 17, -197, -218, 9, 219, 123, -7, 83, -103, -67, 26, 139, -184, -136]
5074a36J25j31J77M8r6j18K96n11L94k64L36MN4l13L08j47J5n6n9M58m71L9M67
5097D19m64lJ48j99q7M1K12j16J79k63p2K05o5J75o5Oq5l5K72m50J74J06j73K43
5121A03j48J46j2L9J0Nr9J12N4j62j19j38J24J16K36k16j09L6n8J49p7J13q4R
5145C0j32Q7N3j94O5R3M1o2o9j19O7K10p7J60o4q8J61l71j38L07n0n0L7J07j0
5170fR6j73K52k78J35r0j44M5J11o0K08q7o2L16m22L74K81l65m77M8L01M06q83
5193d74P11m6l01J10n6K33j90J38M6j46o1N6l9j82K08QpJ4J5j18j19K17J01j68
5217e0Q8j19J07n2J49n8n8J10R9l60K76j65l23L95J14j06o3o5J67p4j64J54j85
5240a83q4M51k65M0nK29Q5n6l98J33R0j32K58k05J04j68J47k34K37l7j39j06J57
$$ y = [-136, -11, -142, 35, 83, -13, -131, 165, -346, 48, -216, 120, 124, 178, -135, 173, 26, 41, -15, -74, 384, -87, -48, 419, -45, -48, 100, -99, -186, -145, 67, -49, 130, -133, -205, 0, -65, 110, 45, 51, -34, -69, 203, -247, -73, 33, -140, 103, -45, 101, 89, 128, 138, 143, 44, 156, 210, 48, -71, -209, -85, 31, 267, 51, -58, -22, -80, 69, -8, 105, 21, 30, -102, -15, 38, -156, -91, 2, 43, -19, -88, -207, -140, 70, -7, 153, 89, 1, 162, -209, -347, -40, -90, -140, -103, 4, -6, 90, -83, 169, -109, 26, -64, -208, -163, -52, -112, 96, 9, -53, 263, -159, 215, 496, 131, -346, -298, 3, 409, -474, 237, 191, -110, 0, -56, 177, -13, 125, 171, 25, -36, 20, -19, -201, 7, 15, 8, 22, 37, -81, -200, 17, 118, -50, 38, -81, 26, -26, 123, 65, 7, 117, 216, -144, 132, -33, -356, 39, 153, 47, -16, -81, 86, 12, -152, 2, -183, -267, 184, -81, -41, -46, 183, 268, 212, -186, -53, 37, -95, 163, -42, 62, -106, 41, -193, 44, 7, -132, -238, -81]
5263h1N3q4P6Qp1K17L0k36o0p2J56r3J99J55k81j1K79j36j29K4m3K23r1J09r5
5288D6p8j78L67j31j70K11j37J7J16j6L7o9n5l21N38j66l2j98L99j38j01o4N4
5311f9K53J13r4o4Kj13n9p4L28j70mj60j5J43j2K5K67j54j80M3N3j54J08J39j72
5336b0N5Q7N0j54J33rMj53j3K0J74k81Q6K04j28N6J4l5r1J88o0j69k06P6K43J73
5362B44j24k2n7oj28L6k2J03j73J34N1P5k92J53j33L26L2l17j7J51OL0%k1j6k3
5388a0l7J92Q6l41p2K32k25K81l0j46J12p6J69k06J02j09l7J78j46J82k29L07
5410A77n2j23p3J40P5j9r1j24R3K7k8J16j38j54M5J04k2M8J3j4L8J05k67K54J26
5435B56m70J12n8L68j83j71K75l09L61m2Q2j10j37n4J56K30m6l41J00j12O5k11
$$ y = [-81, -28, -112, -36, -28, -99, 118, 148, -88, -148, -220, -64, -157, 42, 197, -84, -95, 184, 48, -81, -57, -100, 123, 32, 141, 46, -32, -210, 157, 26, -144, 67, -70, -53, 63, 47, 84, 15, -40, -361, 177, 11, -21, -219, 180, 42, -59, -123, -69, 184, 297, 203, 139, 141, 28, -31, -105, 223, 53, 49, -111, -126, 17, 5, 30, 297, 143, -37, 6, 59, -95, 13, 152, -20, 35, 122, 172, 18, 151, 142, 146, -7, -20, 0, 174, -107, -21, 183, 55, 111, 125, 90, -1, 187, 127, -42, -248, -172, 71, 244, 120, 98, 41, 35, -93, -57, -79, 24, -149, -15, 36, 111, -181, -28, -161, 165, 197, -120, -137, 14, 20, 50, 50, 29, 13, -10, -47, 145, 231, -110, -182, 50, -175, 106, 76, -70, 42, -34, 135, -71, 31, -78, -115, 63, -83, 99, -130, 177, 125, 2, -71, 69, 144, 125, 34, -90, 3, 30, 2, 118, -20, -174, -129, -25, -47, 1, 14, 0, 38, 143, -124, 130, 256, -214, -102, -160, 208, 25, -146, 129, -180, 181, 139, 221, 111, -26, -80, 76, 306, 260, -81, 19, -93, -28, -239]
5457b39J78o1J03P5N5j50J42j4j03M9j68J28Q0k11K58N4n1m15L25L1Q6j25K05
5480B32j96M7k54L61k13jj37K50j3m0k19L14k08j22N9J46J15j15j5k2J6j77J59
5503c3j3P2m6J7J15m4k9j37l2J55K33k46K9L7p5Q1j22K08k37K3p5J25J3j16j2
5528a09j6j3J54%J35j49ql6LM3Q8k29P9N7j7O2K03k78L7J37l74K61j92o5L47j64
5554d4J32k12j29M61j83J40K14n31j5K14K9j00O7nl27L47k32J60o4J4K5m7J62
5577G6j53N4j2J61j67n4L16r4nj66K37q3n1J28k42j72q4K91m9M5q8P9J40P5p2
5602A10L2j15l30M03k05r9J74O4k38J19J62M0m2R1j47n5J34r0J27q7j92K03j4
5625D5Q2k60m9J57n5LM6J95k42j57K28K40k54Q8J96m12J61J08j44j17J50K8k7
$$ y = [-239, -61, -122, -19, 56, 111, -39, 103, 89, -14, 35, -133, -5, 75, -136, 122, 176, 125, -290, 35, 66, 152, 27, 232, 36, 83, -171, 190, -23, -24, -161, 89, 76, 36, -183, 131, -77, -199, -140, 6, 121, 6, -9, -31, -15, -192, -33, -46, 26, -20, -3, 112, 68, 39, -98, -130, 25, 258, 12, 41, 78, 3, 84, -38, 170, -67, -44, -119, 6, 19, -97, -109, -125, -138, 16, 16, 151, 2, -6, -42, -39, 4, 92, -137, -58, -1, -18, 44, 247, -31, 6, 143, -231, 30, -162, -227, 120, -44, 88, -124, -253, 208, 25, 165, 379, -152, -167, 47, 76, -24, 43, 38, -289, 58, -174, -14, -78, -64, -39, -86, 76, -77, -23, -35, 126, -41, -95, 221, 127, 122, -44, 193, 110, 59, 187, -55, -227, -311, -20, -69, -24, -112, -33, 107, 182, 110, 142, 27, -303, 100, -105, -204, -30, 34, -204, -85, 77, 117, 75, 166, 19, -36, 98, 8, 135, 48, -144, 59, 45, 127, -133, -182, -25, -80, -77, -31, 164, -78, -235, -7, 233, -21, 67, 263, -149, 12, 120, -24, -141, 9, 37, 10]
5648A0j86K29j91K11J41j91L4k09R1J38Pom9j90J45j04K46m1j02qj01M17n15K29
5672Ep9o5K83lj59J29l62L14L9j20n0L7J83j54n3R7j5p7J46k36Q9j16L41j70j07
5697a03O2n0j9J84O2k55M7K1RJ85j34J58k1k44K36k63K48j58MO7r2J60P9J20l38
5722c5J13K7j39J44o7j17Q2Q8m4k14j5L08J7k99L17N7l10L19n20J91m7j4M73j28
5746A87l74K56k9J8j27N3L8K9o6l2NN4J41j33j89L75k19O6J25l0k19q3j0J55P6
5771F7J50l61q5K17k08K14p2J96J67k49r5L8J81m33L52NQ7j12l1K01j46j37k78
5794c32M47n0J8j35j27K52o7J33k05J38j20J70j43Q5n8pl4K3J14j47o9J19j40
5817a35j23K93j58M13k53n0j3M6k57l6J90J08j27L6J37k14J87j67N8j68l8J07
$$ y = [10, -176, 53, -138, 73, 214, 23, 57, -152, -61, 77, 84, 78, 29, -161, -16, -120, 126, 85, -17, -25, -126, 291, -224, 5, -74, -139, 144, 141, -18, 111, -251, 63, 102, -18, -68, -31, 152, -2, -55, 42, 27, -50, 96, -140, -51, -167, 174, 4, -103, -41, -91, -110, 74, 136, -119, -72, -51, -42, 143, 9, 167, 146, -98, 138, -125, 123, -35, -31, 36, -56, 104, 183, 303, -35, 78, 105, -34, 110, 43, -74, 8, 96, 52, -162, -177, 131, 148, -151, 166, 223, -87, 232, -288, -97, -144, -158, 315, 187, -187, 69, 40, 58, -69, -16, 22, 51, -15, -47, -42, 12, 153, 20, -169, 206, -13, 53, 178, 148, -71, -154, -164, -9, 67, 217, -144, -229, -12, -220, -6, -78, 118, 285, 36, -59, -21, 160, -273, 79, 84, 171, 59, 28, 229, 83, -54, -332, 115, 65, 83, -52, -179, 73, 6, 139, -66, 72, -48, 122, -21, 64, 6, -1, -35, -12, 102, -45, -114, 5, -135, -258, 35, -123, 290, 37, -13, -26, 20, -237, -273, -83, 25, -102, -66, 71, -143, 44, -123, -65, -233, -271, -164]
5839a64J38k6Q2k41K20q9J0r4P9K05j37j46p1K88k88K99j54l0K6Q7k2R9m7j57
5863a33P9O8P3k03J92k19L63%k70k40L07J93m42K99k38K93l9O4K64l20j19j25
5885a53K07o2o3J77j70jk9K17J04j47J05p6p3r3K06O3m25J43o1O4N4j98K63Q7
5909A39j34l4K87j38l75L04k84J76J8k0O5J90j28P5j25l7j7K0J11K3j92k4K89
5932A89p2k36K11J38k71k23L01Oj40j73M23j72P2o6p0J92j74K08j32n8M0r3L25
5955B25k56J12J13j82o1J18jo4M4j4o8j23o0J40J15k21K71M6j69m6Q6k62K55R0
5979H8J98j42l50N0K27j47R1j71j46M18j18j20KM75l95k3N7K13j73k22K56k37
6001a69O0J97j00J16l28K01J70j62n0M8oo1M43m34n1J56j81o3j73K45J7K98k71
$$ y = [-164, -26, -52, 30, -211, 9, -80, -70, -164, -85, 120, -17, -163, -234, 54, -234, 65, -89, -119, -93, -6, -28, 71, 24, -133, -54, 14, 87, -116, 76, -143, 220, 220, -50, -290, 17, 210, -232, 67, -171, 122, 83, 147, 411, 91, -28, -153, 54, -8, -71, 106, -64, -65, -94, 123, 227, 80, 185, 109, 36, -57, 149, 212, -213, -70, -131, -67, -13, -211, 52, 139, 5, -29, 258, 120, -255, 49, -235, -59, -41, -61, 4, 194, 66, 141, 16, -21, -38, -18, 93, 116, -76, -100, 189, 117, -119, 92, 230, -41, -264, 37, 43, -97, -270, 153, -19, 53, -13, -83, 109, -65, 143, 11, -47, -7, -100, 225, -31, 81, 194, 12, -49, 69, 68, 4, 48, 34, -34, -157, -217, -77, 38, -183, 88, 134, -35, -81, 5, -257, -2, 88, 286, 144, -206, -156, 71, -76, 15, -156, -302, 116, -2, -122, -120, 355, -40, -63, -6, 207, 34, -188, 68, -169, -109, 88, -12, 104, -224, -23, 147, -15, -65, -17, -23, -84, 359, -75, -126, 30, -151, -214, -387, -142, -125, 173, -98]
6024i8L42j90j41J04k3J72k41M0J13KJ11Jr0K0p8k1k4NP5K73l40m9LJj2K2P5j51
6052i9j59J97Q8j12j8p8J78P1R4j17L16n07K75J33j28p1j1J29m56M94k75RJ4M2
6076Ij64K73k98K99j40p4J57j3r7O7M1o7p3L19j68r2M0k1j6l1rl9J92J3K7k64
6102a29M16m20M3J14Pj67KK01j57J69L0l6M4j29J13j21p6m6J46J11l94O15n69
6125b33O4L44k66K5L85j81O6k88r0ML1m3K48j80N46n06J06K57m87L31j78R2n0
6148cNPJ55j93K42j80O3j65N6l06J93K31J2j63M47n80k7L2K95k09k02K95k08K19
6172A6j74M32l52p1J08K78j84L8j17o0K02j91k8L38j74j9J01q9J10j11o0j36m9
6195a92JL25p9O2j4j00j5R7l09K08K72j83k32n9J07K03K08j69M1j92j7o9LL9J81
$$ y = [-98, 244, 54, -87, 17, -6, 166, -75, -35, 78, 80, 191, 192, 102, 122, 44, 23, -1, 4, 79, 352, 12, -37, -34, -33, -45, -23, 52, -99, -258, -61, 27, -85, -103, -181, -3, 68, 162, 45, 361, -146, 129, 262, 134, 63, 52, 181, -275, 219, -56, -47, -33, 9, -155, 118, -180, 119, -21, -95, 62, 49, -48, 19, 60, -7, -80, 239, 71, -21, 19, -2, -18, -49, -58, -97, 95, 108, 135, -129, 287, -133, -90, 24, 31, -136, -134, 67, -90, 79, 109, 73, 117, -12, 101, -20, -96, -142, 4, 115, -279, 336, -233, -169, 175, -91, -66, 319, 138, 204, -84, -174, -170, -139, -182, 66, -114, 432, -74, 32, 289, -198, 133, -45, 47, -3, 2, 9, 164, -29, 213, 33, 96, -69, -13, -319, -126, 105, 117, -46, 401, -179, -206, -174, 121, -88, -290, 5, -203, 16, -158, 274, -78, -149, -41, 237, 53, 91, -26, -86, 116, -75, -103, 235, 61, 42, 143, 54, 164, 53, -7, -143, -192, -191, 134, 55, 117, 103, 3, -12, 85, -224, -16, 256, 73, -159, -218, -111, 92, 300, 131, 172, -20, -37, -106, -103, -64, 117]
6220A17m8J3J09o1l25MR2j37K11J50M3j67j34J44J5j75k18N69j25m0R7o7K2k1
6244F8q8L0r0K15m03N45k45K3j61J35N4n9j3j85p0K63j78J62rM3p6M7j13k3j03
6269b31J06J35j60J08K52k69M9j1j70N22k09k02o5K93j68j05J70r9k72K54L2J41
6291A01l6j35J08P0%k01qK57r4j15K8l17K86r7J87R4k65j13R3J11K00k20m5j02
6315b13L82k22k2p1k7J55n8K3P1K7m8Q5o9k16J38p2oJ43R5r7J18p9j48J80K7j31
6341c5n4J74l50K71K7k18N8J42j73K0M12j25J40k43k26k9K11K17j21r7J07k87
6363a79M26j53KO5j93M9l33J98K51j13j45P3J20j55Q1O1O3m8m5J43j82j59K66
6386I3j88K25j62J61l05J22J86Pj25J68j55K70j35l58M11l89J7O4k37K55J4k00
$$ y = [117, 69, 82, 191, 130, -195, -191, -99, -236, -25, 125, 168, 1, -133, 11, 26, -149, -367, 202, 77, 37, 134, 67, 89, 68, -20, 10, -80, 135, -268, 277, 32, 55, -106, 29, 83, 24, 11, -174, -244, 19, -159, 3, -6, 37, -39, 8, -105, -128, -231, -125, 10, -150, -42, 210, -59, -10, -21, -191, 331, 122, -80, -145, 148, -20, -125, 45, -54, -326, -72, -40, 101, 65, -70, 38, 108, 108, -93, -101, 156, 62, -53, -25, -342, -56, -153, 34, 128, -137, -250, -157, -46, 154, -66, -111, -213, 169, -53, -75, -146, -173, -18, -76, -53, 18, 45, -3, 82, 13, -203, -65, -137, -143, 0, 95, -2, 116, 37, -111, 69, 96, -35, -89, 85, -265, 6, 33, -185, -127, 15, -158, -138, 274, 149, 289, 46, -180, -209, 2, 219, 98, 1, 108, -179, 247, 94, 96, 161, -32, 17, -316, -118, 133, 20, -125, -52, 68, -87, -6, 55, 118, 70, 25, 168, -14, -173, 93, -95, 130, -32, 129, -176, -54, 132, 139, 14, 182, 27, 297, 162, -196, 215, -174, -157, -93, -330, -75, -61, -261]
6408b61L05k42L37n2j03j37L82j27l70K36m7K14k33J41k56K94K7ok00J52l44K56
6430c4j3J73r5J3m7j64J15j34R8K74k02J15K6j97K3J62k4p2m5j0K43o9J43j40
6454A39j46j14j94M38k54P5k0PK26l8Q6m49n6L74p9j43K73k08L33k27k3m7R3j47
6478a01J6O3K28k88j7j37J88j0J83k24J41J95n75M57M9j34j72M6K48j48R7k75
6500a70L15R6k97J0J38l08J03p8J01K3K7L1L4J35k69m7K43r7P6l5j60Q7j07J13
6524c6j41K51j61L09q6j98J67k07J21N9j63l2K09p7j24J19o9J01r6K28k42j04
6546a72K99r7k16L50j79rq2M78k70k00J20Nq9J83j21J25j28JQ4l29L43j26j8K49
6570B01l18Q8K59j34m6l27K56J67k15L4K26k04k56o2J60L7J88k65J23J90k31J66
$$ y = [-261, 44, -198, 139, 87, -16, -153, 229, 102, -268, -32, -79, 135, -98, 43, -213, 81, 108, 102, -98, 54, -290, -34, -47, 126, 31, 44, -3, -167, -52, -186, -88, 186, -16, 99, 125, -72, -49, 113, 89, 17, -28, -38, 205, 136, 279, 139, -7, -121, -315, 123, -131, -56, -76, -69, 157, 119, 205, -244, -300, 74, -5, -148, 125, -83, 250, 23, 0, -47, 46, -101, -85, -22, 206, -82, -99, -236, -48, -58, 125, -99, 42, 237, -338, 119, 168, 34, -138, -92, 156, 8, 105, -170, 145, 241, -56, -46, 92, -216, -113, -191, -90, -67, -40, -9, 25, 160, -109, -156, 87, -10, 66, 31, -129, -42, -149, -36, -177, 74, -87, 222, 136, -62, 105, -102, 19, 78, -85, -117, 92, 15, -109, 10, -59, 42, -54, 174, -68, -172, 127, 30, -186, 164, -15, -24, -106, 372, 102, -98, 22, 27, -62, 121, 0, 125, -3, -2, 82, -247, 96, -30, -48, 201, -117, -29, 230, 96, 50, -277, -21, 146, -69, -35, 191, -13, -269, -331, -171, -134, 54, -211, -88, 102, -129, 37]
6592C7j95K26j3Q1O6j03M2k62L20m0j41K0p7J0K62j60r8J34k23k56M36j62J99
6615A03j41J96q7j57m3J25J44j47N0m9N7k13K67p2N1mJ11j42QK0l5o1k91M55j90
6640d5m2J83j64J48k32J11j34K57k15J74m3q9L14l33j08K49L2p7K64j54N7m11
6662b58L38L1j69l0J55j49QMJ87k30J83l75P14n34j86M59l17L77k50J56r4l2j70
6685a82M64k2k79p7K34l03O2J42o9p0M1N11k79k92K16j22M0k13K45k39K48J58
6707B14k45J37QRm8j44M8J97l18K40q8P0J27j44j35r0J21N7j25K24o6J11O2k46
6731b4j12K69j80J33j22j00M0M86k35q8L0j19p8J39j42M53l70N4N3N8k19M38k21
6754A43m04J75j2qL50p3l00J96j62J98m2o7K75j17l01J14J08j92J74o4r4O5p7
$$ y = [37, -158, 68, 55, 136, 202, 99, 141, -121, 199, 159, 18, 38, -39, -29, 233, 73, -25, 109, -114, -370, 66, -96, 103, -38, 158, 71, -86, -129, -4, 140, -7, 43, -6, 51, -162, 105, 33, 84, 80, 191, 49, 57, 77, 42, -19, -310, 145, -45, -87, 96, -68, 80, -152, -41, -175, 82, -133, 41, -2, -91, 223, -110, -218, 31, 63, -14, 250, 96, 153, -258, 80, 111, -58, -88, 67, -82, -74, -70, 117, -113, 70, -305, 409, -125, -311, 148, -169, 208, -42, 114, 20, -12, -182, 282, 260, -19, -96, 138, -165, -103, 39, -30, -100, -59, 452, 173, -119, 97, -25, 15, -198, 47, -192, 56, 214, -31, 106, 114, 123, 75, -69, -21, 176, -142, 98, 10, 80, 207, 63, -72, -162, -41, 16, -109, 115, 49, 160, 222, -24, -136, 133, -47, 86, -36, -136, -96, 390, 155, 67, 97, -22, -100, 39, -103, 350, -20, 34, 87, 145, -74, 364, 143, -261, -86, -98, -106, 244, 171, -129, 67, -95, 103, 61, -6, 269, 152, -149, -35, 73, -119, 55, -9, -103, -38, -115]
6777a15K08l7K00n82K51J70j92J54K1pj50L37j55j99J57j61K03Rj16j29J71K27
6799B65l54J25M9J51j98L9k4L3j05RK9K8k38K25j46J95J6j27q5r6Q5P2J02J6j7
6824D9j57J63p6j0m2K18j78K39j87k5RO2k2m80O76j78J49j85J07j23k15K07K9
6847C0J5j19J26j38j12K94j41J88k87N7J93l7k6k00K92jq8l22L04j26M7k2j5K65
6871A77j52L5k01M6N7J16l4l8l8K03l19J35k42R4l6j5J75k3K00l26J45J20k0p0
6895a1J92l74jJ13P6J42j15P9l26K59J52j4k09J62k65K68l2j71k16K23N0O2Q6
6918A30j86j90L57p8k66J59K00j19q3K8J79j58j56J36R2J46j67J74k50R6k94K3
6940b27K80l54K42L34l10K25j95n0O1q9L50l99N1q1K79j98P4K10j45j5K14j30
$$ y = [-115, 93, 56, 256, -326, -75, 95, -97, 57, 78, 71, -79, 258, 103, -96, 61, -100, 103, 112, -4, -133, 38, 265, -89, 36, 85, 236, 38, 77, 53, 86, -19, -10, 19, 47, -191, 34, -112, 83, 99, -28, -113, -209, -124, -52, 50, 66, 49, -108, 55, -21, -31, -73, 145, -33, 206, 19, -6, 3, 65, 43, -437, 239, 61, 210, 25, 132, 9, -206, 1, 30, 45, -74, 52, -86, -198, 96, -45, 143, -144, -87, 106, 69, 43, -157, 135, 134, 46, -276, 28, -98, -51, -73, -88, 177, 25, 60, -141, -95, -38, 78, 44, 6, -32, 171, -148, -13, -255, -161, -197, -212, -37, -60, 140, -186, -41, 79, 59, -11, 181, -193, -194, -81, -5, 137, 22, 101, -225, 34, 186, 172, -37, 125, -140, 128, 96, -75, -291, -68, -18, 44, 130, -56, -246, 111, 33, -233, -74, 126, 7, -76, -48, 131, -27, -183, -47, 45, 191, 24, 198, -52, 44, -250, -227, 53, -301, -59, 275, -35, 190, -5, -55, 6, -83, 267, -132, -81, -162, 117, -81, -7, 203, 58, 43, 257, 127]
6962A27k6k45K47k1N3j16j03L54j55j55J05O9o1Q7m65L38j6KN9j80J96N2m00J26
6986a28R1J02k92K05j10J34m1Q7j68K80k12qL07j39j58r3J97O1k26o6M41k25n0
7009a1J10P6j85k9M7J09l2k35j95L10K24r2k18K42l8o8J40j44n4j7j64J44Q8k88
7033b80L35o4J34k08K0j06J47j9n5J11j69J07j67J5K72nO0Rj17l4J10J07k1j42
7057D0j19L47l35P9P6K1l45P4%J39K88j38p3l28M50k42K1J14q7q1L95m47l8Q5
7081a04R4j39Q6M4R2J42l12N9J4N7lJ9j7q0K7O5L9p2m4j36Q6K69k19J79j06j85
7107a45J45k77K86J00j31J29j28j3K99l35L93k62j19M8n8P7J61k72J70j29j5j88
7129b64J41K15J21P4j93N8k62J49k63j72N24j08n7J01k03Q4K42j92K67j87pj08
$$ y = [127, 101, -144, 103, 82, 135, 19, -84, 270, 115, -40, 65, 134, 73, 160, -305, 33, 17, 19, 78, -102, 94, 146, -254, -128, -37, 65, -227, -22, -132, 2, -39, 48, -120, 160, -52, -60, 247, 108, -50, -143, 54, 115, -111, -177, 264, 39, -11, 99, 175, -10, -39, 8, 117, 85, -150, -345, -35, 189, 97, -121, 121, 83, 15, 155, 11, -43, -60, -224, -80, 8, -280, 55, -9, 125, -83, -63, -169, -22, -41, -96, 15, -154, -47, -214, -199, 73, 68, 128, 137, 20, -14, 96, 203, 182, 40, -79, 268, -67, 12, 88, 109, -236, -162, -162, -23, 265, 127, 54, -274, 176, -66, -45, 69, -18, -99, 296, -151, -189, -104, -10, -149, -63, -19, 73, 215, -97, -38, -24, 33, 30, 49, 32, -48, -21, 44, 83, 11, -33, -169, -83, 186, -33, 146, 40, -145, 0, -277, 9, 109, -22, 107, -21, -34, 265, -70, 323, 61, -58, -10, -68, 9, 170, -102, 68, -61, -76, -264, -123, 92, 213, 287, 94, 152, -110, 39, -224, -396, 128, 20, -37, 64, -139, -55, 187, -5, 262, 75, 68, -40]
7151d0K13l0Rl6j21J93n4O2l24qK28L7k75J23N0J55k77j69M31k35K56j23j15J17
7175F7j91J24J53J16m88L05kl73R6K90j81N1J10L3l2K7J40m28K04J17l35K13j26
7198a10k06K03J13K13k96K6K43j02j69J54n4L00r9j27j03P9J3kJ44k94J83k02
7220i3K12k04K9J04j27m8J37j0J01N2l00Q6p0Q1O6Q5M4q9N2L8p4j81Q0J25l0k97
7246b31J88O2J95k27q5M33k94R4j55R5j66L5J67l8m4O0k33j23O6J75J83n1j57
7269e1q3K42j50K6j8l2n7J33O6r0j09M7J67l04L20L7j02R0l11R7K8K10q2J19m69
7294b76J50J42o2J51K2l3l72K20k7L26l43K77j44O5o7R2j64J35j35L8j73O6K80
7317A68l37L21k21K36k19K14k46K43n9j05j26J19J44k14K28j62pp9j7J74j3q4
$$ y = [-40, 173, 143, 152, 116, -5, 188, 134, 196, -128, -136, 92, 129, -146, -23, 27, 182, -95, -264, 167, -68, 188, 65, -50, 67, -124, 0, 153, 269, -219, 86, 84, -289, -193, 97, -84, -33, 77, 110, 78, 105, 245, -183, 21, 138, -197, 16, -110, -316, -113, 0, 213, -83, -57, 186, 84, -85, 69, 15, 315, 216, 89, -14, 65, 78, 76, 220, -74, 109, -93, 119, -85, -56, 48, -79, -127, 10, 0, 101, 153, -147, -61, -131, -50, 16, 101, 145, 56, 108, 146, 72, -109, -29, 96, 66, -231, -43, 19, 214, -13, -98, 335, 41, 135, -20, 75, -91, -56, 111, 73, 29, 89, -144, -267, -201, -26, 157, 106, -51, -134, 108, -42, -16, -34, -66, -123, 10, 76, -14, -123, -76, 91, -213, 107, 144, 42, 132, -179, -82, -54, 156, 74, 193, -276, -126, 16, -46, 105, 127, 94, -278, -58, -85, 241, -102, 175, 31, 96, 29, 121, -43, 92, -43, -5, -178, -112, 168, -169, 152, -69, 167, -52, 162, -84, 159, 100, -5, -131, -12, 132, -82, 146, -16, -23, -102, -119, 55, 42, -42]
7339d2J74j61J9q0K06q7l4Q7j28J2J25r2j27J45K57l72M9j21K58j09J13l01N71
7362C62n07K47k3j39j15J43R3r9K0J39j4j23J32m64J43L24k46J76j0j52L50k57
7384b0J58j74N4M3Q7l00R3J47k02R4Q8p5j33M27m60J79o8J35l5m5J42n0J28k07
7408FO8M7n2p0J11q4K33o02M05j46R3L3n4j7mj47R9J56j10K09k95J40j66R6n8
7433a09J54J4j20K4l3K28k02R7M0j22q2J56J15j06o2L26l11k03N5j94J67K45l49
7456b72M99j87m0J8R0m2j34J91j57J16p6r7J90k77K44M7j71K02l29J67K05j49
7478C8j23M3J60j6n8m8J16q6k1K07m0o07L98m5J96l47m1L17k78J41l8K02K05l56
7502h1OJ81LJ13K7j60n7j74M79m63J49K99j48j60j2J58j40j49O6q2j43P7M1J49
$$ y = [-42, 132, -29, -10, -90, 116, 29, -5, 82, -46, -34, 91, -1, -128, 17, 274, -98, -49, -170, 88, -21, 92, -209, 362, -145, 102, 79, -60, -175, -32, 61, -38, -18, 121, 107, -16, 116, -348, -205, 119, -127, 49, 39, -113, 237, -20, 138, -36, 18, 61, 148, -152, -59, 88, -114, -20, 68, -7, -140, 287, -173, 6, -62, 73, 38, -7, 135, 85, 213, 6, 74, 121, 69, -1, 110, 26, 259, -343, 62, -84, 9, 42, -12, -29, -33, -180, -81, 75, -35, 174, -121, 19, -147, -51, -109, 45, 59, -61, -37, -70, 158, -44, 53, 93, -29, -111, 45, 160, 54, -8, 318, 7, -196, -141, -335, -168, 77, -272, 227, 40, 0, 18, 108, 66, -68, 123, -34, 82, 6, -91, 99, -178, 66, 113, -58, 144, -185, -18, 187, 38, -85, -42, 118, 102, 44, -4, 112, 26, 5, 212, 172, -435, -37, -82, 114, -233, -274, 43, -235, -94, -132, 70, 275, -81, -75, 106, 109, 222, 249, 89, 32, -142, 337, -126, 23, 322, 174, 14, 2, 160, 20, -129, -63, -145, -288, -211, -170, -21]
7526b1oJ54j6n4l6J12L2Qj58q3K9%J77k03K7L09m41J95R9p5K14Nl20K37k13N1
7552B3o3k6K06m4k25Q2j54K4L73k41O3k7j5NL6j34J53R4Mk9j62Q8O6rj89K08k21
7579a14J40K56k26l2j5j28K50M0j86J24j34LK7J42k30l3K15k6l33L15qL0j96L18
7603A99l72M8L7N2K6J44j81P3j32j5K39l9m43J67M26j45r3K25N5k65j75L74l76
7626a71N7J26m9J4j49K33j92l4K89j21K65l73J17J46j60m6P0j28K94l65L56K0
7648A99m71K77J4K36l58J12n8N8j00k9J66j40K10J34j37Q2k64J40M7k13ML3J74
7671A16k65K28k37L24l16L13k68L9j03L81n37N17m62L59l00J24J37k45K35q9j01
7692a50J74L7m4O0j65O1Q8k3O0l38K31J15O3r8m9J79k41R1J39k79O6K27l51O0
$$ y = [-21, -27, 127, 111, 57, 21, 133, 165, 173, 15, -68, -39, -39, 138, -65, -38, 271, -170, 25, 124, 49, 263, 268, -52, 185, -28, 23, -40, -66, 140, 96, -129, -47, -201, -177, 196, -45, 18, -9, -24, -19, 17, -117, 36, 130, 134, 105, -57, 31, 97, 88, -101, 107, -114, 26, 282, 56, 24, 9, -119, 131, 171, -15, 109, -25, -22, 5, 147, -83, -116, 99, 73, -260, 55, 47, 77, -119, 199, -173, -125, -88, -36, -10, 134, -47, 26, -106, -121, 118, 79, -364, -197, 229, 84, -9, 216, 271, 6, -169, 205, -171, -114, 12, -37, -23, -172, 61, -131, -165, 124, 3, 268, -105, 12, 158, -2, -48, 22, -106, 188, -177, 179, 199, -272, 5, 19, 255, -103, 9, -49, 9, -91, -120, 46, -94, 116, 250, 113, 195, -69, 71, 118, -95, -91, -58, 116, -149, 79, -158, 166, -150, 163, -105, -66, -169, 212, -325, 192, -270, 89, -211, -87, 50, -195, 40, -49, -150, 24, 61, 17, 77, -88, -27, 61, 38, 98, -240, -9, 106, 169, 71, 22, 201, -40, 51, 190, -89, -23, 204, -147, -87]
7716h7N4J66k31m7J79j21RJ44p3J2K48j80j75L04l43k58M86Q3k87K14k28J15Q1
7739F5p9j89M46l37J08R9j81P0J10r7j25j36K77j01M8J69oK2q9m6M8l2j64K42
7763A22k99L09k30P6J9k2m7J46j9r7QJ30m2m1j29K43k46j3J58N3j63k00K98N2
7787F6k66M33k2j24q5O0j80J50nm5qJ34m7k01L13k02J26n5k03K14M8j33j47M56
7811B77l19M5K74j59Q4l70K08k0j3j73J93n9J64k32j27R9J61O6j56J30n8p9r0
7834a54J10N7l36M60j25j02j16J25l7J26j20K81n4m2n6%j15N9J37r8j62J98j89
7857a53KJ1P8N2L1J7J89J12k76j68J82j34K95l05l7K14o0l2K39j72ml16L22J20
7881B07q9J55l02O1r8N0l8J69j43j57J95J6j13O8J5P3j20K9K22k92K01j78L7j53
$$ y = [-87, -33, 133, -98, -145, 34, -87, -78, 66, -7, 5, 253, 73, -102, 202, -141, -399, 87, 170, -117, 97, -131, -16, 65, -14, -203, 243, -94, 14, 113, -68, 2, 112, 15, -110, -246, 31, -70, -22, 147, 141, 163, 74, 28, 76, 44, -120, 122, -177, 132, -98, -22, -3, -25, -72, 74, 55, -42, -34, 96, 54, 13, -116, 127, -119, -132, 26, 79, -84, -284, 14, 66, -200, 233, 211, 87, 2, 62, -118, 32, 27, -18, -26, 108, 61, -140, 173, -29, 97, 42, -161, 53, 101, -32, -179, 277, -42, 3, 277, 118, 202, -168, 40, 20, 7, -166, 27, -32, 132, -100, -227, -128, 33, 99, -57, 73, 15, -64, -154, -44, 13, -323, 137, 12, -90, -206, -81, -118, 8, -112, 169, 115, 73, 17, 17, -98, -39, 98, 0, -162, 36, -153, -151, -140, -62, -10, 21, 38, 227, 339, 63, -105, 77, -57, 238, -67, -104, 110, 50, 18, 257, 85, 81, -235, 87, 207, 118, 273, -29, 32, -66, -16, -54, 115, -28, -185, 10, 26, -87, -19, -4, 69, -51, -22, 200, -92, 109, -69, -32, -185]
7905a85q1M90k01k82K20J36j87J36P1l1k35J00K09j53j76L42j60J24k65o9J34
7926f3j33M97m74J0N5O9j37j04P1L88k50k9L12l41J03n4K81j96Q5J53j84q2k42
7949b65L43j84J6M8j44J91j29K4L38l98O1p3L36m02K23K37k07j18J56j02J38k51
7971a62L73l2K65l49j64K7j6M81m68M8R4K14n83L97Q12r11R8m37R19j72k21j4
7993A99j30j05K92k85k53M04K91m75l7j95M82l28J47K49m40R4P3p0R1r8J8K1R0
8016C5k18J68K2k9n0k9N4O6pr5K91k01R7J0l3l44K36M0R3j18KJ16k47M7N7J8M5
8043B6J35j93R6nk88K93m3K1n4J55j60J15j19K46j51J72m95K32%nR3j54J35M4
8067I6m7r2Q5J21j68J7j7Q0j60j11J48K31j55%M0m5J04k73Q7p7J26k3n3J2K3J05
$$ y = [-185, -266, 224, 23, -259, -39, 97, -90, 46, 117, 86, -149, -49, 160, 7, -169, 173, 13, 137, -128, -197, -63, -196, 301, -173, -163, -108, -39, -176, -280, -209, 179, -71, -100, 212, -129, -26, -80, 201, 5, 90, 243, 59, -23, -265, 78, -106, -90, -42, -186, 5, -124, -100, 238, -160, -99, -172, 164, -238, -15, 222, 15, -103, 53, -49, 89, -162, 211, 179, 444, 95, -69, -42, -58, 423, -45, 3, 97, 311, -272, 125, 937, 26, 124, -313, 606, 434, 213, 199, 69, -36, 256, -29, -282, 122, 413, -62, -99, -294, 188, -140, 7, 256, -184, -90, -17, -87, 4, -94, -76, -55, 35, -183, -15, 7, -22, -72, -101, -47, 19, 12, -83, 208, 7, 104, 114, 81, -263, -27, 13, 106, -12, -10, 106, -141, -94, -37, -19, 26, 161, -32, 64, 59, -229, 64, 21, 42, -12, 143, -17, 98, -21, 225, 74, 246, -249, -17, -17, -22, 71, -83, 52, 96, 49, -43, 42, 163, -5, 12, -5, 75, -85, -196, -48, 183, 28, 28, 68, 23, 127, -146, -59, -136, -10, -33, -86, -74, -51, 54]
8093E4k53J27J77J17k45p8q0J38J63k60J97n5J27Q2j51q5J3m9m4J90l1k2L1j82
8117a19L6P6j01RJ63J11j10O2j22J01j91J74k6j87K67k75K85J6l86K26J09j34
8139a6Q3N7q4J47k81J1J11p6j42K60L3l69K62J14j21N4j57L1M4o9L6K25j87l53
8163c87J84J77J14j5O7j15k7Q8j50j95M00n9k82K32Qk0j8J60o5Pj79O9k29K38
8187Cj17%J88j69
$$ y = [54, -199, -72, 105, 222, -23, -101, -181, -43, 120, -140, 57, 2, 129, 211, 60, -25, -12, -61, -105, 85, 54, 32, 63, -119, -83, -7, -108, -99, 64, 175, 65, 127, 5, 106, -85, 89, 63, -124, 143, -132, 153, 169, -217, 9, 118, -16, 67, 124, 40, 187, -94, -83, 28, -48, -190, 70, 103, -266, -4, 110, -11, 43, -114, -83, -39, -108, -72, 153, -34, -387, -203, -26, 88, 73, 140, 25, -2, 86, -64, -259, 141, 82, -200, 32, 40, 20, 2, 162, 97, 104, -75, -6, -235, 3, -114, -114, 74, -95]
8191i5
$$ Imaginary data points
##PAGE= N=2
##DATA TABLE= (X++(I..I)), XYDATA
0@%%%%%%%%%%%%%%qJ6j6J6j6K4l2L2m0M8n6O4p2Q8j03J18j35J52j71J94k19K47
36A31k79L12l48L90m35M83n36N95o59P26p99Q83r75J074j183J303j436J582j746
55i17J933k143K382k660K986l373L846m434N188o200P635r851J3762k2748Q4448
70F9854M6150n2562L1174k8784j6624j7368R314k1172p982l75k151j7462J5704
83G716P81j8588K1383L747j3051K77J0381j509j6264J3164k152q017m04Q126j3493
98g903M130J2831j4416j632Q353k17j8504Q455O759j2944K419L744j362r024J3568
113e743l086m252J4119N190p482K179J7830j2996L72J1022o50n336J976N501j2172
128F472M605K698o703m231J0662n727j5085J4557m145o895J023N134m458m510
$$ y = [0, 0, 0, 0, 0, 0, 0, 0, 0, 0, 0, 0, 0, 0, 0, -8, 8, -8, 8, -8, 16, -16, 16, -24, 24, -32, 32, -40, 48, -55, 63, -72, 80, -91, 103, -116, 131, -148, 164, -184, 206, -229, 254, -282, 313, -346, 380, -419, 464, -511, 563, -620, 683, -753, 829, -917, 1016, -1127, 1255, -1405, 1581, -1792, 2054, -2380, 2808, -3392, 4243, -5608, 8154, -14594, 69854, 116004, 63442, 94616, 65832, 49208, 31840, 41154, 19982, 12000, 11625, 9474, -7988, 7716, 8497, -10091, 11292, 15039, 1988, 2265, 12646, 11137, -5127, 8037, 5885, -2132, -2536, 5590, -7903, -3773, 9058, -5358, -6990, 1363, 1146, -17358, -8903, -2144, -15088, -12669, -8925, -10287, -19311, -5743, -8829, -13081, 1038, 6228, -1254, 925, 18755, 5759, 6131, 17153, 16503, 11167, 13143, 18644, 6472, 11077, 13775, 7072, 2841, 13503, 7776, -7309, 7248, 3103, -3792, -2769, 2365, -2093, -6603]
142f603Q135k813j684P749Q344j2419J0991P682j4351N786K541j329q814K504
156E719j416j0779j449K292q245l540J4181j2780N48R921l628k569K143Q701q080
171h981p8M568l190o598Q365L8r464J4458j966l497L647O878j609l738J0025j746
187G112n292J157L847j1662L674N760j0669M100K164n84n378O833L480n468L774
202B848L894k579n980R339p460k855P219l185m042N71O269q896J599O164j706
217A200k875M782J351q632P016L29m253N39N806m485n722R867l780j370K937M762
233G472n234m6N948o243K11K464j38p068N276n24p579L666J579j455k593O641
249B377k664l642M635K34l117J69O232q300P70L286m420j724K750L618o052L719
$$ y = [-6603, 1532, -1281, -2965, 4784, 13128, 709, 11700, 19382, 5031, 10817, 13358, 12029, 3215, 5719, 4303, -6476, -7925, -5633, -13878, -17418, -3237, -16017, -15469, -5548, -9176, -11745, -9602, -901, -8981, -9059, -4491, -7681, -14279, -5914, -5876, -15340, -882, -2848, -6345, -2698, 4180, 2571, -1167, 8858, 7112, 1820, 2977, 6824, -4838, -1164, 4596, -6073, -1973, 191, -393, -5771, 1062, 4542, -926, 2848, 6742, 4163, -1817, 7522, 62, -2793, 4426, 1241, -2801, -2230, 4039, -4857, -3258, 2906, 1200, -1675, 3107, 4458, -4174, 2842, 3171, -1082, -543, 5263, 778, -4944, 4923, 1143, -227, 2710, 7472, 2238, 2192, 8140, 1897, 2108, 4572, 4434, -2634, 2642, 2118, -5461, -1795, -216, -1671, -4264, 2377, -287, -3929, 706, 940, -2177, -2008, 4224, -4076, -3306, -20, -4440, -6164, -3414, 204, -5848, -2129]
265b129K048k935r88N471k129m258R125n096k457J589K414l055l04O295l826n03
281g38K179K048o498N516J949o851M405J74k168l531N492l6l859M605K129l231
297A585n20O591o701J699M016l829j349M53J406o581K726K214k909j781M488j062
313D46n235P388k385j067K408K223l564j997N067m658r27K240J685n512K559K382
329A053n767L825J918m64j971M916j416l969L456j98k315j563M663n576j311L184
345a535j917j295K282L426m859L786K353k307K04L275Q91m383M664j293l048N08
361G52K328l004j125M889m664m80J186P87l383J621L361m087R63J881l15l129
377b419N187j82l211M323p29j408j694M174k748j677L411j360k663N65K964n707
$$ y = [-2129, -81, -3016, -4004, 1467, -662, -4920, 4205, -891, -3348, -1759, 655, -2400, -2704, 3591, -235, -738, 1441, 3489, -3009, 2507, 4456, -2395, 2010, 2184, 16, -3515, 1977, 1941, -1918, 2687, 4816, 1585, 1065, 7656, 955, 2654, 6670, 2841, 1492, 1945, 3351, -3230, -504, 1710, -1199, -2980, 1508, 446, -4789, 2599, 214, -853, 1555, 3778, 214, -1783, 3284, -1374, -2301, -61, 1624, -3888, -1329, 1053, -4714, -889, 1029, 565, -1406, 3510, 2094, -1875, 1581, 1383, -932, -2495, 2168, -3408, -4719, -1535, -3452, -4747, -2465, 961, -3898, -112, 2241, -66, 138, 3413, 4304, -79, 4585, 3292, 244, 752, 3080, 76, -1049, 3840, -824, -1304, -118, 669, -2714, -1093, 2268, -1819, -856, 1025, 710, -2419, 2768, 2586, -625, 3698, 2969, 1561, -133, 4041, 1293, -384, 3027, 1667, -996, -431, 2533, -3174]
393c174L227J599l194Q9R21k73m311L382l56k259J14K905k654j802N562l151J004
410b371K563J625j914J071L369k831J419K284M3l139K792l61m538L209m17j493
426A311j246K628k323k051K952l70j505J081L540m582J329K109k339R0J378J219
442C221l423K694j52j798J64K441j083k114M050k664j131R66M17k127L25K655
458B441l824M58O26L28k202K479J629l297K465M7q09j076L475j163j003K609j101
475B082o70l33K798l082O16K412k410j138P57M41l787K559J1k076J74Q71n39k245
493c559L617p46r19J699J249k133O5L158k793R64J628r5k008J219R99k977J596
510I64O31j119j960K796j877k261K487j085l16n37K242k257m14K332r93l38J542
$$ y = [-3174, 53, 1652, -1542, -1453, -532, -805, -5116, -1734, -2090, -4349, -4235, -1330, -3984, -5786, -224, -3375, -2371, 192, 1817, -97, 974, 4343, 1512, 2931, 5215, 5258, 2119, 4911, 4550, 12, 3221, 2804, 1311, 65, 2693, 370, -1681, 1271, 901, -604, 477, 4017, -565, 764, 2873, 534, 624, 2002, 3221, -202, 2492, 2340, 542, 706, 3147, 2064, -50, 4000, 1336, 205, 1171, 1588, -539, -214, 2441, -1383, -925, -299, 29, -2173, 306, 1935, -1362, 1103, 1150, 341, -735, 2740, 1577, 574, 3183, 2082, 1412, 1079, 3877, 795, 1411, 3823, 1413, 275, 1032, 1473, -2314, 245, 256, -1820, -1646, -775, -1314, -3559, 58, -688, -1607, 92, 1341, -792, -727, 2431, -362, 602, 2230, 2135, 127, 1346, 2345, -632, 964, 1595, 476, -1484, 1312, -565, -2826, -339, -1424, -1740, -2277, -35, -2292, -2706, -374, -1367, -1705, -163]
527a63J634l159K366M46j670J364Q53J45k031K833j028j490J064J479j535l49
543G59L104k901J37R89P9j726J200J336l495Q71L23p85j690K848j93k303K917
560A470p14m07k24K521j817o4J517j629j134L8J133l156J571J115k470L19R74
577i57n5j530L142Lj030R23O62q79j142K905j876J22J023K82j640N00J904k388
595c1J264M18k53j479J965q1k266K004L54j106m10J831j715p20J577o29j44p4
613E05J051k436L49J397j509K77Q30J30j623J575m18j337J372M54k44j512J950
630H11j458j183J320L11j534J056J011k866Q69P26j91q72J796J71j175J274l9
647B7m55o09J945j426n58J248j437k46K63J136j614J295J813j789L29J055r4j412
$$ y = [-163, 1471, -1688, 678, 1124, -546, 818, 1671, 1816, -215, 2618, 1590, 100, 1164, 2643, 1108, 759, 3863, 962, 1099, 2088, 2167, 441, 1641, 2977, -518, 353, 676, -109, -1799, 1049, 856, -1447, 1470, 756, 349, 125, 2646, 829, 765, 2282, 653, -481, -443, 690, -2466, -895, 220, -2250, -1931, -957, -1012, -2542, 600, 603, -427, 496, 1158, 279, -863, 2042, 166, 288, 1311, 1593, -47, 453, 2357, -31, 1233, 1651, 1398, -81, 1884, 1803, -463, 1541, 1895, 789, 379, 2210, 495, -225, 1352, 723, 579, 505, 1556, -880, -531, 866, -643, -366, 464, 594, -1029, 546, 128, -1209, 163, 617, 373, -1139, 811, -647, -1830, -510, -199, -1733, -677, 334, -2532, -1663, -937, -1128, -2000, -204, -33, -1208, 66, 27, -428, -1037, 908, -518, -1076, 172, -1265, -1511, -1248, -112, -1726, -431, 1382, -407, -78, 977, 883, -529]
665e29K052M11j806Q13K44q50j673L045j402k73n02J126r83j23K124j102Q12K22
683A606l74o31J08K72j506J234k28k63j556J466J7r00K086j251m21J76J219j839
701g85o1J106j244n8N99J081k167K044j30j185P58K85J59j035J569j616l10J011
719B1P7n09q56J859k036M44M31N70o18Q62M96j335J434k49k78o69J456m54j225
738e79J346n07n41L58J155j161j86J311j402P38K76M75j140N02N24j725m24K65
756g15N71j641J926n00n02L38J146m90j273J979k42o22L28m20n77K30Q81j678
774a261J323l81O07j219L20N42j989J821q06n82K86O91k36j601K233n69k85R17
792a89R26j196M12J215p22l2M09j72j675J650m57o42o4N74j407k6J039p18J65
$$ y = [-529, 1523, 1934, 128, 941, 1185, 335, -1338, 1707, 305, 32, -470, 656, -327, -450, 1674, 572, 1384, 1606, 1232, 601, 709, 981, -525, 709, 481, 218, -1338, 128, 145, -755, 1331, 80, -341, -165, 1054, -785, -846, 260, -984, -1042, -443, 638, -1529, 515, 385, -800, -42, 243, 402, -633, 936, -680, -990, 21, 98, -411, -1267, 592, -1444, -1000, -569, 1, -617, 245, 741, -594, 840, 591, 313, -356, 1100, 646, -579, 767, 260, -281, 77, 1232, 71, -115, 1196, -206, 532, 808, 1283, 143, 645, 1169, -556, -980, -715, -144, -1785, 141, -359, -861, -523, 623, 133, -1140, 839, 597, -25, 303, -117, -694, -464, 417, -1261, 62, -319, 288, -931, -611, -69, -2058, -237, -1043, -1625, -1339, -648, -884, -2485, -252, -821, -1106, -189, 737, -459, -47, 1168, 446, 414, 823, 651, -1024, 626, 169, -473, -537, 37, -1370, -1396, -357, -1075, -910]
811i10J003j94k58K46J170j977O97O09m2m99P82L09j588J242M6q3r8J072m27r75
831A25J373q34o68L96N67j707L91O82j321L5L65L30o05J536lr23O16K27K22o87
851A17J497r52l65N06l10K6l83J094j339M24M36o02n92K69M72j400J232k53m39
870e62l21J031k29n97J318Q9n18M49N70j032K31J190j089L02k97M52j064N74O2
889E59n02M04J87K23j224J313m82m64O93l24J6o00Q55j051J73O70j61l09N40Q06
909A322j476J254j5l54r3J034r38q03O59m94k48j7P38r17k46J199j053K01L53
928A06M14r21Q39J11p81J56K01J87q13R63l93o53M57Q0j09l00J306q45k12O3j9
949a63l87J01R92j304O45J59j08k82P84Mn82J300n27n1k73L87j75o04R57m72R4
$$ y = [-910, 93, -101, -359, -113, 1057, -920, -223, 386, 344, -155, 627, 936, -652, 590, 636, 553, 455, 1527, 1100, 125, 1498, 664, -4, 392, 959, -748, -357, 325, -996, -961, -596, -266, -871, 665, 662, -261, 355, 582, 804, 117, 1614, 662, 297, 803, 493, 519, 136, 1230, -109, 315, 751, 149, -443, -174, 298, -1102, 130, -123, -562, -883, 148, -81, -678, 640, 729, 211, 660, 1230, 198, 429, 1619, 530, 832, 535, 987, -77, 497, 559, 57, 461, 648, 871, -353, 960, 478, 14, 707, 383, 399, -201, 654, -397, -224, 446, 285, -24, 516, 1322, -154, 1100, 1085, 731, 638, 1672, 734, -69, 590, 96, -152, -169, 569, -348, -594, 605, -448, -247, 106, 520, -401, 438, 549, -232, -76, 125, 312, -501, 462, 69, -584, -127, -47, -156, -456, 850, 5, -207, -144, -163, -550, -449, 543, -761, -116, 43, -65, -347, 437, 441, -141, 1159, 632, 581, 308, 695, 520, -84, 873, 401, 495]
970D95k88K98p24N61Q06j083N33P2J86r42L37K69o10L54M1l34m01P16o36J2O99
991C61j99N2l88N13q86M96K19j32k80J48K00j079R37m70J21K01M07k67m48P92
1011B98o39L97O4K34m16R8M24p70K28J44K28p60P91l8o84M93k13K26n25Q17n85
1032a88k05K26j90n9J30R17o59J63M64k33k71K56J96n91P36j74k46l63L71k2l22
1053f4O54j89j10l3L18n25K43P73j001O03k88q4p90L63M98o74Q6P9%n28Q37q2
1075H6j76M23k17j24j88M83n83J67J52k72j01p8L68m92M97o4R6j82J88L9o30N84
1097b4l24M2K63L15k42l14M71n17N21l56N08n11L23K3n82P21j49K41k45K02k64
1118A02r1L7L34k21j7O88n38J58K89n07p0k12L37l27Q5j43j9j42M29J90m28L83
$$ y = [495, 207, 505, -219, 342, 1148, 65, 598, 670, 856, -86, 251, 520, -90, 264, 305, -29, -430, 286, -350, -338, 361, 162, 214, -174, 339, -547, -51, 168, 36, -244, -96, 104, -975, -38, -508, -387, -186, 221, -46, -494, 298, -341, 56, 120, 354, -62, 36, 460, -310, -82, 62, 290, -470, 321, 283, -401, 92, -121, 105, -420, 397, -188, -393, -167, -357, -416, -286, 631, -28, 135, 599, 366, 95, 351, 547, -44, 692, 518, 272, -91, 280, 258, -64, 590, 401, 291, 258, 576, 51, 294, 1067, 66, 669, 381, 297, -493, -130, 368, -306, -220, -141, -141, -669, 168, 86, -90, 333, 116, -8, -196, 287, -296, -129, 23, -249, -350, -428, -60, -552, -55, -119, -23, -205, -17, 22, -608, -24, -348, -306, -43, 272, 30, -284, 187, -330, 191, -165, 343, -168, 155, 178, -404, 317, 168, 409, 164, 366, 102, 11, 48, 382, 161, 144, 832, 294, 452, 741, 234, 164, -48, 289, -38, 47, -96, -115, -257, 172, 362, -66, 317]
1140C17r2l7L6J06q9k35N61o93N3k99J39k83j10P26m75K72k20K59n85M09j62r3
1162d95L95k13j17o47P26j66l5N65l11L22j94J00Km1J88Jj13qQ1l33N55k42j81
1185a61M07L4k06j65M99o47K61p9N03k23j70K81m52M32K54j76k31M91n2n45M23
1206D78j05K84m04M89n21k42K40j09o2j77M11n41M7Q7j20nK50P6k37L43Oj61l47
1229c20O2L20o49O18m34K40R6m09L33l00Q82r88O10l71L68R4k16j60j31k11L43
1250b23j67J62j75P9O89m39R5J63k10L55k59j1L59k59j23L03J38p57M99J30J27
1271D76j12j0j42l56Q02m15k38L29K6m52j22O41m26j6K58L70n36J09J12m24L45
1292B19K07k16M3j28j61j94J60k39L13l07J79k30n9J9K16J34l21N79o77K40l89
$$ y = [317, 225, 188, 224, 330, 241, 6, 567, -126, -73, -372, -233, -516, -626, 100, -375, -103, -323, -64, -649, -240, -402, -495, -100, -313, -430, -1077, -351, -517, -552, 13, -298, 24, -170, -70, -68, -109, 79, 80, -33, -41, 40, -293, 262, 20, -161, 246, 280, 74, -91, 408, -239, 22, -57, 446, 223, 53, 334, -118, 314, 568, 392, 161, 652, 600, 55, 478, 373, 657, 253, 742, 221, -21, 219, 110, 48, -129, 282, -259, -212, -125, -245, -250, 0, 76, -161, 182, 188, 27, -320, -258, 62, -587, 31, -403, -163, -67, -476, -143, -443, 439, -549, 61, -310, 58, 152, -64, -224, -355, -566, -223, -390, -228, -403, -324, 365, -74, 21, 184, -26, 329, 70, 59, 418, 159, 36, 339, 477, -280, 219, 349, 476, 364, 354, 212, -144, 658, 243, 5, 334, 360, -92, -214, 427, 1, -15, 243, 613, 77, 186, 298, -126, 219, 426, 210, 253, 125, -36, -230, -70, -309, 4, -303, -124, -354, -413, -394, -178, -44, -365, 214, -463, -223, -612]
1313f12j96J99J42L31j82K27o1m03K81M9P4K18J32j99Q1j08r7J51j71L37l49K36
1335H0j66K10j75J89o1j37N14l93K02k51L06k32q1K23j53O8J0J79k34J24J01k09
1357A14P5k71M05n20N38p7k44J94l1mj97K56k52J36j65M06m13l40M69m83L91j41
1379a54j13P0N3k00k90O44l0j0p9rj33j26M36j59J14k3K59n97J55lk44L49J16
1402B6N6k97K81J01l07J07J8M31k22j05j49J96R1j95m4R6N58l88J60o9J37l85
1424I7P7L46m96L92m10J69k65J82K82j29J61K2l77j90K41k50K87J21k65j74r0
1445b69k9K38j77J2k0M38m31K64l43P17m99K58j59j90K3j2N6l57j11L29L04m72
1467d30K09K05k38J26L70m88N42j09k18k10M6M32J72q20N02j87k05M96o13Q29
$$ y = [-612, -808, -609, -467, -136, -318, -91, -152, -555, -274, -225, -151, 67, 199, 0, 81, -27, -124, 27, -144, 193, -156, 80, -86, 124, -51, 138, 77, -60, 454, 61, 263, 12, 318, 86, 5, 228, 75, 143, 153, 332, 98, 222, 323, 114, 189, -82, 323, -197, 341, 264, 20, 214, 183, 179, -18, 238, -14, 122, -43, 363, -50, -390, 79, -404, -13, -154, -267, -197, -144, -344, -634, 10, -20, -30, -109, -118, -251, -377, 59, -100, 14, -9, 250, -347, -192, -195, -439, -90, 26, 82, -215, 66, 167, -140, -33, -15, 416, 194, 89, -60, 136, 227, 32, -12, 84, 642, 254, 414, 345, 482, 97, 174, 520, 24, 416, 6, 175, -90, 92, 374, 245, 406, 428, 51, -139, 102, -148, 139, 260, -5, -179, -269, -298, -60, -237, -225, -245, 193, -238, 26, -317, 400, -99, 159, 0, -190, -167, -179, -123, -480, -591, -262, 42, -430, -221, -16, -254, -128, 242, -246, 296, 187, -31, -241, -195, 237, 409, -411, 91, -96, -301, 195, -418, 411]
1487D11o76N36j26R2K08n21O30P0m62k6O3J80l54R02p06M4l74K91J51n27QL60
1509A74J41k32P89r83J80l69l8Q71n34J224j210q21J334p73J1M61j37m91Q92l69
1529A20m51l4P57o73J52L33o71K9K38n6p1L47l88J10K25j43j41k3J78L8M8J38
1551F2l67K59j7K51k13R4l2J02j77J94k03j47K92m56K18J47J6k63J60M47l29J04
1573A42l46K88K18l57K42p7j24N5R2J7m4Nj05J35L27j38k76J85m21J30O1j71K62
1596A00j34M12m85K18k38m8K89j61J33m09L42k81K83k73R2J59n13O49j35M0j69
1617a29K68Rj84J62l53L11l47L82l37J12O9j88L7Q4k17n5K57M47k81%N3J05o65
1640d60Q53l11K33l9l11K76j45K85l49L39j03K67m04%L35k45Q0j01l7j01kMj28
$$ y = [411, -265, 271, 145, 237, 445, -76, 554, 624, 162, 136, 199, 379, 25, 927, 221, 265, -109, 182, 333, -194, -186, 174, 315, 83, 872, -111, 69, -300, -338, 533, -1, 1223, 13, -808, 526, -247, -236, 225, 88, -403, 489, 120, -331, -365, 392, -281, -129, 204, -467, -438, -200, -256, -327, 20, -368, -258, -33, -176, -317, -340, -162, -124, -76, 62, -305, -46, -63, 188, -25, 69, 37, 139, -38, 156, -47, -194, 98, -358, -140, 7, 23, -240, -80, 367, 38, 142, -204, 84, 302, -55, 187, 110, -14, 41, 133, 150, 106, 111, 6, 141, 468, 330, 54, 239, -182, -52, 9, -162, 100, -34, 378, -107, 111, -127, -175, 114, -47, 86, -323, 19, -262, 21, -252, -160, -1, -514, 135, 0, 40, -129, 139, 148, -36, 126, -227, 84, -263, 119, -218, -106, -37, -225, -188, -104, -321, -376, -119, 328, 47, 47, 100, 205, -460, 393, 82, 315, 276, -35, 241, 96, 381, 32, 371, 268, 535, 131, 131, 466, 221, 301, 200, 163, 62, 60, 64, -64]
1663f4M12j79k08J04j07j62N7K65j22p6j73L80k60j84L24M27j19n0o03q8o7N51
1685E8J00j62j79M1LR9r8n8j66L14l7Nn3r5j04J55q4K75P0m16K61J66j70J07k52
1710b20L52j9K8J27m68N24k80N50m68J06J10k78O1j28oj06J49K2J50k89K15J9
1732A51k99O23n26O3K00k63K12n5r4j7J45J46k92k06J10J8o1K84l02j39N28l03
1754g7k2R2j82p1J48k4K2l87L07j73P7O2K79j60m6K84k40K05J3l02J03j24L78
1777A62k53J94m44K22J25nl6j49K18l68N11j93P4M46m32r8L2K98k26K01P3n27
1799a75M67K7j05k81M95j50j13J9pk19K89k6k99J14l3J21n8N4j90mK19k70L03
1822A78j38j75j1N2L18j38l0j71J10k48L39k37J76l3N6k3l56K17k06K66J70k68
$$ y = [-64, 348, 169, -39, 65, -42, -204, -147, 118, -4, -80, -253, 127, -133, -317, 7, 434, 315, 265, -338, -426, -493, 58, 158, -4, -183, -142, -139, -40, -138, -196, -362, -48, -85, -80, -133, -228, -332, -177, -261, 14, 84, -332, -71, 95, -75, 32, -220, 132, 113, 141, 268, -200, 324, 44, 594, 126, 232, 342, 64, 125, -3, -9, -115, 34, 56, 206, -83, 132, 151, -148, 475, -51, 12, 212, -51, 161, 106, 12, -5, 140, 286, -6, -212, -102, -84, -145, 139, -163, -302, 226, -77, -99, -7, -189, -260, -112, -136, -114, -501, -194, -367, -290, -228, 51, -109, -155, 129, -111, 94, 107, -195, -92, -216, 162, -91, 103, -341, -119, 6, 1, -35, -184, 34, -334, 177, -16, 58, 504, 72, -26, 6, 304, 78, 279, 352, -175, 292, 319, 214, -67, 428, 278, 165, 184, 177, -42, 247, 221, -78, 36, 3, 124, 66, 120, -70, -74, 145, -125, 178, 40, -135, -146, -94, 224, 86, 56, -115, -5, -253, 86, -151, 25, -8, 48, 25, -331, -114, -320, -54, 116, -152]
1844a52J0o1J2k13N77k05k6M1M9l5j28N8J77O4l83K23p4k65N55k00J29J61n5N1
1868C10l53J46j08K13j53M9j92J28K0K12k74K28j73P6j18J89k33J1j2k3K50k35
1890d2J71o3k00m6L25m76L57k40L12%q2Q3k36N6P9J50Ll74K30j43J88k29L08k35
1914a04J40O9m19N61p13O97l14K26n49M08l77L15K18l60J87k43K66O8JK3o3K70
1936C07l97R8j5J22k31q6L41l30M98k57%k96M77n1k63l6K98k28P6k4J10r3J26
1959A46n8Q8j96r5P2p3J42K1j54r3L86m40M76l45l2r1K96r5O8K14n41K39j65L03
1983G3l27K00P9k22P4j01K3j86M80r3p7J11j08Jj40L00k67L36l08k7K85r6J31
2006A41r4K4m9N7n9j96M66j64k05K04j27K1J07j28j22J49K9K6r3J41r4l2J42j10
$$ y = [-152, -142, -203, -191, -404, 173, -32, -58, -17, 32, -3, -131, -73, 104, 168, -215, 8, -66, -331, 224, 24, 153, 314, 259, 310, -43, 103, -5, 208, 55, 104, -88, 40, 60, 272, -2, 226, 53, 129, 11, 200, -33, -22, -34, -57, 193, -42, 129, 66, -134, -180, 145, -331, 26, -214, 98, 98, 16, 99, -137, -81, -2, 148, 151, -223, 7, -136, 52, -177, 131, -104, 36, 105, -314, 247, -466, 231, -83, 143, -406, 2, -375, -60, 158, -202, -15, -258, 8, 76, 77, 100, 37, 307, -90, 8, -7, 115, -116, -202, 139, -191, 307, 50, 50, -246, 231, 180, -83, -119, 179, -49, 27, 3, 113, 20, 146, 88, 176, -20, -115, -43, -116, 26, 47, -107, -200, 186, -254, 222, -123, -155, -246, 50, -45, 23, 237, -304, -65, -230, 73, -254, -54, 25, -197, -123, -224, -201, -387, 93, 0, -77, 34, -74, -73, -213, 87, -180, 156, -152, -179, 106, 10, 141, 47, 71, 22, 79, 20, -176, 290, 126, -79, 125, -2, 19, 126, -2, -124, 25, 54, 80, -13, 128, 34, 2, 144, 34]
2030C4K79j74Jl2r0R8J63j97m4J13k6j73O6M0K5m2N1l26J30K46K6j76n1p5O7R1
2056B4l53J42mQ5N6j00J31QJ76k04J13j9m3m4L2j33K5P3j84L82k66L7K64m04J36
2081g0J21j89K1K11k8r5l8J38o7J77J4k12J49r6O4O8j32J44l17L04Lj44j03J32
2105E5j7N9j19k5lj79J82J31k26L24k54K36m9m12J49J25j68NK46m69M35k49K75
2128E2R7l22K00R8k22LJ56l16J85k36K54j37R2K9j25R2N6j70J47q3R8j25J29P8
2152C0j91L61j83j77n8K79l07K64J32k6k55N3P3J42j79l8l2L42m40K94j62r6J0
2175a64L62j05j40L4m7J77k32Q3J90k87MQ3J50k08n9j03K84M1j34j72K07k32K19
2198d9K94l69O3Q6l2j25J13J41k7p8J00k87L31l40R5m0K08o8k9j55J82j22l1J9
$$ y = [34, 313, 139, 140, 108, 18, 116, 279, 82, 38, 151, 125, -48, 18, 58, 83, 41, 92, -234, -104, 142, 168, -8, -59, -134, -67, 24, -329, -187, -191, -106, -50, -150, -19, -11, 165, -39, 74, 55, 12, -32, 0, -133, -108, -35, -219, 163, -103, -66, 198, -206, -70, 51, -138, -117, 94, 66, -29, -67, 71, 4, 181, 195, -17, 132, 36, 100, 168, 36, 180, -137, 167, 170, 26, -77, 55, 38, 97, -22, -47, -50, -229, -47, 84, -142, 182, -72, 164, 115, -297, -148, -23, -191, -186, 60, -409, 26, -223, 52, 149, -173, 27, 125, -97, -94, 62, -254, -69, -305, -51, -188, -96, -67, -192, -100, -44, -214, -67, -150, -52, -177, -48, 30, -161, 200, 17, -160, -218, 61, -246, 18, 150, 124, -131, -78, -5, 137, -42, -80, -112, 230, -210, 84, -78, -174, -164, 198, 93, -47, -13, -60, 117, -115, -32, 158, -129, -125, -42, 108, -100, -159, -262, 22, 63, -71, -243, -36, -268, -49, 245, -124, -61, 25, -7, -132, -19, 122, 95, 17, 117, -170, 161, -179, -84, -124, 84, 16, -13, -168, 14, -108, -139, -120]
2222a20J56j78K48q9j07J50k48K87r2o7P1Q1j12k9Q9k20R9R5m5M9j52K51L7j7
2246A37j08J38J9k06K13k15K89l29L4jK04L8k00L08m12N0P9P2q1M7r2n5K77l03
2270i7J94l1k44L36l94J81j02J27m2J92m9n4KJ8k74R9K51m0O8l86M09k59k6K5
2294i6o8J69j41n9L73l35L90k52k2O0n5j85K10J96l61J45N2J49l23J00J38j73
2316h8N7k5K37m12L36n8p0J84j19p9q7L62l40L47j58oj97J88j02J41q5M1O7j66
2340c2l3J42k83K33k11J96J46P1p2p9k30J92k67k68M89J81l33K23j37k6p1K11
2362D2j88J56j75K95k60o5M9m6L80l25p8O5M4J00j12M8l8n7J81r6k05L22J28j78
2386a3J09j82J51k33M05m79M50j85k89K90j64L73j73N1J56l47R9mL25m21L9Q8
$$ y = [-120, 36, -142, 106, 17, -90, 60, -188, 99, 7, -60, 11, 92, -20, -49, 40, -180, -81, 14, -31, 18, -134, 117, 154, 137, 29, 167, 186, -20, 193, -22, 267, -62, -28, -29, 175, 213, 13, 321, -91, -41, 38, 110, 29, 76, -16, -71, 206, -97, 97, 66, -178, 158, -236, -55, -157, -30, -72, 120, 71, 17, 19, 37, -237, -138, 113, 73, 141, -245, 164, -95, -121, -96, -164, 5, -136, -195, 178, -157, 233, -19, -41, 19, -36, -221, -11, 185, -176, -31, 21, 170, -153, -53, 85, -88, -31, -56, 181, -231, 105, 47, -23, 161, 42, -37, -124, 238, -102, 245, 87, 81, -116, 72, -30, 111, 26, 67, 134, -32, -65, 77, -206, 27, -184, 12, 158, 229, 157, 78, -152, 40, -227, -495, -6, 175, -158, 65, -72, -98, -169, 42, -146, 10, -165, 130, -130, -195, -146, -192, 188, -137, -215, -150, -106, -6, -118, -70, -108, -165, 16, -80, -285, 37, 165, -13, 96, -86, 65, -168, 237, -242, 208, 23, -266, 24, -140, 233, 60, 111, 267, -80, 19, 15, 340, -81, -42, 46]
2408D6m4j19m5K88j01N0j5J66k29l8J73k40J27P4j70j4J36j1k23L49j47K39m53
2431b01J92K49l22k66Q7K06j09J29j03p7J27K99m09J15J08r0K30k77K16k99K87
2452I2l27L87l56r6L76j47J80k72J84o9L28l11M3j6L68j93j39j5r4R6p8q9P6n3
2476a25K19J92q0K3k84M33l68j6J55Nj73J8L8O5j96P4L40j46k06j7J30jj4mj30
2501f8J79j41M7k13J88j45P7M39m77r5K23R5k00Q7J36k64Q6J89k53J78k05L78
2523B41m03J18j83J68J12k43L69l48J57J06k1j29j21R5j4N3l30L10K52j40Jk39
2545a89no9N39l43l7J6K49j93K8J11j75J83j04m2M28k10j80K11j68m04M31j45
2567f8L76l94L1J7j61M2j7M21n8l13K49k48K60j16J85l05J17r2R2np7M2r4K16
$$ y = [46, 2, -117, -162, 126, 25, 75, 60, 226, -3, -41, 132, -108, 19, 93, -77, -91, 45, 34, -189, 160, 13, 252, -201, -9, 240, -82, -348, -261, -55, -164, -35, -138, -215, -88, 211, -198, -83, 25, -65, 165, -112, 104, -195, 92, -235, 152, -204, -300, 76, -71, 109, -163, 21, -48, 280, -31, 12, -4, 364, 171, 32, 17, -77, 19, -59, -148, -72, -125, 94, 286, 206, 229, -55, 378, 10, -6, 149, 154, -19, -1, 37, 102, -94, -20, 320, 174, -32, -49, 81, 80, 66, 62, -68, 111, -30, 17, -196, -8, -153, -76, 363, -114, -209, 14, 109, -91, -4, 132, -132, -46, 143, -110, 68, -137, 241, -162, -44, -227, -59, 53, -190, 179, -169, -12, 94, 73, -56, -177, -82, -96, -43, -373, -63, 189, 49, 50, -189, -194, -263, 276, -67, -104, -88, 161, -32, -4, 107, -68, 115, 11, -31, 397, 187, 7, 218, 50, -354, 77, -68, 308, -86, -55, -38, -199, -157, -174, 247, 189, -124, 125, -123, 137, 21, 206, -99, 18, -74, 18, 13, -64, -22, -116, 100]
2591A00j77P3j7j13R0K60l75L04M4l3m76L19K35N0m00J45j34J30O5j01j71Q2P2
2614b8q7P8J62n8j22M78j68j74O8j08o5J66k28l2K85j47l33M19k20L80l83J94
2636G7k59m0M40k04ON4J71j09k17J76k14K1J60j06K14J9n1k28K12j86j7K39j95
2659c7R5J33j64j87L19k91K56l30K12p6q4J98k77M58k48mk5J44o1O6k86L35m24
2682b78M63p9m64L25o7k0K56p4j51K41J97m63K54l14K91k7j39L14l42K81J84o14
2704b26L09j01m1O7Q5k49J35J42j62K1L8J34j30N2J23l8j96J31j55J62j12n8m6
2727a15J50r7m6k2J82j90K27j64J32J81m08R6Q3Q9q9p8K72k37J2J2k1j11k5J29
2751c8M5j59L2K9J80j64P6j24J64J08j87l6j10J76L3r4K36j50L8K1j04J66J05
$$ y = [100, -77, -4, -21, -134, -44, 216, -159, 145, 189, 156, -320, -1, 234, 284, -116, 29, -105, 25, 90, -11, -182, -100, -28, -115, -37, 125, 67, -55, 423, 255, 81, 149, 41, -24, 142, -86, -118, 167, 20, -313, 106, -114, 266, -117, 77, -182, -222, 218, 14, 20, 74, 245, 136, -81, 95, -119, -98, 62, -44, 170, 189, 138, -90, 122, -64, -81, 158, -37, 58, 191, 27, -160, 159, -132, 124, -206, 6, -70, -154, 44, -233, 225, -23, -27, -52, 92, 31, 97, -189, 146, -278, 185, 106, -358, -33, -100, -120, 136, 62, -89, 152, 349, -114, 140, -174, 117, 90, -49, 265, -77, 204, 388, -226, 83, -18, -59, 8, 93, -156, -21, 121, -41, -20, 18, 152, 22, 74, 197, 159, -37, 94, -61, 101, -11, -69, -115, 35, -62, -108, -130, 52, -138, 89, -75, 57, 238, -170, -74, 9, 98, 9, -69, 203, -34, -22, -10, -31, -142, -167, -38, 7, -152, -120, -91, 89, -75, 1, -123, 41, 149, -38, -74, -184, -8, 25, -69, 167, 17, 55, 76, -28, 138, 243]
2774B43l86N9K85k39nP5m9R4l6k52J90J02l0j47K67j93L4N6l0N0o4K6j27m9L4
2799i2m5L0J55J7o9J89j56j34J13l2q4J5j53L99k09J78O3j69P4J5m7l48K32l18
2823c76N34j72P8m2l8J18k43J44j37m9J34j42j05J18K29m4Q2j71L10k05J21j0
2845A34j61N4Q3j8j50K34o1k75L24l58L57k78J31K05k37M09m05n1j90L21M1j29
2867b0J17j55j36J59k3k35L44l98L41j6j18K68k80j04M48j06j19k70K94l6R1k09
2889a63R8j84N08k54K2k7j84M52p1j19n9l7J31l19j23K51K11lk59N4J97p2j93
2912a43J88j1k70J58p4j28L75j75l6J19J11j42Q8j3O0j11N4oL04o17K75J09O3
2935A78j59n7m4J36K31l77J25K30r2l10Q0p6O24p53N41m88J81J08l57L33j87K99
$$ y = [243, -143, -84, 201, -38, -43, 32, -17, 77, 41, -211, -21, 81, 51, -96, 171, -22, 12, 68, 38, 88, 24, 50, -77, -126, -92, -137, -107, 48, 65, -4, 185, 29, -105, 8, -24, -108, -93, -246, 153, -56, 122, 185, 16, 90, 105, 58, -290, -58, -376, 158, -14, 64, 22, -16, 102, -141, 3, -134, -183, -49, -191, -296, -178, 51, 7, 89, -82, 228, 23, 144, 134, -27, 27, 110, 92, -58, 176, 115, -160, 164, -194, 163, -115, 16, 221, -16, 393, -12, -63, -253, 68, 109, -20, 97, -58, -194, -35, -58, -293, 51, -347, -6, -22, -140, 128, -152, -256, 192, 86, -33, -303, -9, -45, 46, -163, -65, -249, 259, 5, 27, 0, -184, 268, 197, 78, 19, -18, 113, -206, -329, -78, 133, 130, -129, -75, 122, 50, -143, 45, 34, -236, -78, -152, -280, 95, -80, -116, 3, 114, -28, 60, 47, 107, -4, 50, 44, 348, -269, 6, 115, 178, 19, -38, -82, 54, 285, -92, 33, 263, 171, -139, -59, -135, 489, -264, 277, -211, -30, 78, -279, 54, -133, 166]
2957A66k76J2K76k81j44Q3J23q7k4L27k91j07L16j19Q4Kk80K54j26pj40N08j60
2980A09k28k1J04j01L08k05j78J90j54K41j47J35nK8J78l00L39l26K5M6j22J42
3002E8J20j09j21L26l16L3J93R3j33j53K43k91J51l73K68m3KJ13J9j19M2J37o4
3025G6j22Nj90L25j65L16k21pL6o4O6j38nK1n2k5L42l84m3J23K97l26Q9K66l29
3050a09K43k32k14N73l53p7n1K11J23q1j40J01j07L29k83J40Q1k86L54k98K28
3071A52k7k40J83j56R9Lj9j99J04K32k05J69J55j15l15J26M34l16O0k74J37P1
3093E9o4J65l70L14j40J08J80j9j97L5j42J79j08J74j86Q6k89M5J65n3J6L2k3
3116c3j29K24P2k14K31q7J96j76J01r1n2j05K59m52K61o2k7K3j48K48m10M89o7
$$ y = [166, -110, -98, 178, -103, -247, -164, -41, -128, -152, 175, -116, -223, 93, -26, 58, 60, -220, 34, -92, -99, -239, 269, 109, -119, -140, -36, -137, 171, -34, -212, -22, -176, 65, -82, 53, 48, 76, 254, -46, 293, -33, -8, 38, -84, 58, 178, 69, -52, 274, -42, -9, 184, 277, 144, -9, 234, -57, 94, -279, -11, -54, -52, 61, 80, -39, 3, 140, 76, -46, -41, -231, 94, -71, 245, 24, 17, 53, -11, 55, -83, -88, -67, -119, -144, 198, -186, -229, -106, 191, -135, -46, 220, -109, 134, -98, -312, 261, -92, -169, -220, -9, 114, 33, -107, -6, -113, 216, -67, 73, 154, -132, 222, -76, 152, 125, -115, 68, -88, 11, 14, -5, -204, -100, 132, -73, 96, 251, 136, -179, -53, 381, 65, 125, -149, -12, 59, -5, 160, -210, 104, -36, 72, 252, 233, 36, 71, -71, 108, 0, 174, -12, 74, -215, -170, -5, -58, -42, -10, -33, -162, 62, 134, -80, 151, 64, 260, 84, 185, 94, 42, -63, 196, -256, 5, -57, -84, -61, -209, 39, -371, 118, 51]
3139E1r0l5J89r7L6J15k80M84o20L44o7pR6k42J41J57kl36K36j68r4K70j18r4
3163a31N3J7P8J55n0j02j26O4L00l07N4j3Kj45R3O9J27j16k91J09l8R3R4J53k37
3188i5Q9j3p1J02p4J87k47r9J30K00k44P6j23K50k80J95k57L83k25l1J62o6k40
3211b91R8j3M29n15K12L41k66j44K96k46J26L9n4K9j26j59M65j88J06j82QJ96
3233A61n12O09q0j9J9o9k03L46n19J57j32L44J3Ro5j11L53l69R2N7n6J6P5j02
3257A4q5j09L25k41K76l67L20m41J37J68j91J64%jJ88J83l14k02K19j28j65L08
3279E8J3r6K51l17J85J14j72k23J12K0J97J5k32j77J91L98l39o4Q6n9p0L45k71
3302c5J72l15O4m2L52l3j13K34k07m8K98l81j88K48J68k02o7J55p4j76J72j38
$$ y = [51, -39, -74, 115, 18, 54, 169, -111, 373, -247, 97, 30, 23, 119, -123, 18, 175, 173, -163, 73, -95, -189, 81, -37, -131, -78, -61, 17, 172, 122, 20, -106, -42, 258, -49, 5, -8, -6, -151, -58, 11, 138, 22, -269, -160, -198, -105, -11, 142, -95, -6, -19, -90, 12, -62, 125, -122, -221, -91, 109, -135, -59, -182, 68, -212, -17, -274, 109, -116, -147, 15, -51, -291, -193, -206, 223, -292, -80, 261, -5, -149, 147, -99, 27, 66, 12, 41, -85, -244, 221, 33, 139, -43, -35, 161, -351, 258, 178, 159, 178, 109, -94, 252, -267, -110, -242, 102, 115, 124, 59, -52, 301, -68, 24, 81, 25, 41, 116, 14, -71, -180, 145, -96, 180, -187, 133, -308, -171, -3, -194, -30, -30, -31, 157, 340, 26, -176, 43, -85, -250, 58, 71, -25, 226, -91, 94, 208, 36, -187, -75, -55, 142, 157, -75, -252, -61, 337, -2, -66, 20, -39, -109, 236, -35, 137, -178, -114, -156, 196, 163, 50, 284, 77, 29, 327, -54, -242, 6, 174, -28, -95, 60, -14, -190, -18, -156]
3324a56J29K37j90j34j92L63n3L2k5k05J14O7L9k6J00j08pJ19j63J06J06j3k3
3347A17L4l64J29N6O0r6N8PQ0J34k98O5p9j2J42N4j34k3J36p2l1K34l86K31j49
3372a07J55l5M4j71K0L52k65j4q6j3r4K25N9j40k0j47L05P2j37qO7K1l4m5L6M
3398D4k69N1K27oRL8K7k81Q7Q8j38K17j30m7j2N0JJ13k01L86l27Q6k42J93k6j0
3424g2R1k27K61m1lj91J66N5O1l8K91l60j57Q2K46k58KK73k94J60q6K88q8j12
3448D9k25K69K4l74L99k68L72j52k6O1j87J15n7P0q4J32l64M89k28p3K67k43M3
3471IO9L6j77Q6rK01l11L19m36N7m0J42P7j83L26m71M11J45j04M0k25JJ60j83
3495f0J33j39R5k44J62k80M22mJ4j42q5J13j94J24o3L45j12j14J51j55K7J7NJ20
$$ y = [-156, -27, 210, 20, -114, -306, 57, 4, 36, 11, -194, -80, -13, 26, 0, 100, -8, -15, 104, -59, 47, 153, 140, 117, 151, -213, -84, -28, 32, -64, -6, 1, 81, 215, -83, -18, -97, -109, 33, 87, -47, -70, 66, -6, -37, 197, -189, 42, -107, 48, 13, 57, -114, -94, 258, -7, -21, -107, -120, -214, 11, 70, -70, -90, -237, 68, 140, 3, -5, 62, 83, 49, 4, 40, 44, -225, -174, 53, 47, 56, 94, 121, -160, -73, 15, -123, 94, -36, -83, -95, -45, -44, 69, -132, 254, -73, 13, -229, -36, -62, -72, 19, -208, 53, 12, 9, -182, -16, 39, 100, 62, 353, -7, -164, -82, 164, -94, -92, 181, -113, 47, -39, 249, 161, 49, -176, 93, 117, -257, 142, -126, 246, 94, 68, 129, -58, 57, 0, 70, -14, 118, -246, 243, 15, -58, 209, -34, 9, 78, 114, -63, 23, 14, 215, -96, 223, -213, -156, -196, -54, 23, -160, 166, -305, 106, 251, 147, 187, -38, -37, 123, -60, 73, -66, 29, -215, -53, -333, 89, 85, 99, -43, -128, -15, -209, -85, -148, 197, 85, -29, 122, -33, -6, 11, 16, 136]
3519A36Ll74K96N3j15j5q0k18K85j81L92k60p1K21N6r5k81M82k37J99k86k6p9
3542a95LK09M4J7lP2k08J35m0K17k17k6p5R7O2L5k78J47n1K03k2P5j82pp3k0J77
3569I6l7J22N8l82N9K38p3k4Q0J4j44Jp8K78k91K02r4j64K92k41K52k65L9L1R1
3594F0j75J39jL4J7N2k02J95J09m13J05K32l36K98j2q2J2l95Q8L0K44J41PR5k09
3619C3k3J35K7J24k01k70K58J7l53J95l8L5j64L02J18k08K6q0k9J74J62p1j51
3642A8J15J61l5k78k4K53j08j16m6J83k45L1J79J2n4k10J73J9N6k57K22J30j21
3665E8j03k82J88j62M35j58J01J78k44k30K92j82J36J2k20L64k01L1n8j3j27K86
3687A01J8j69L7k18K0K43k15J88o5K56j01j6j74O2J6n4L18m43K43j27M2L4K24
$$ y = [136, 139, -235, 61, 114, -1, -16, -96, -314, -29, -210, 182, -78, -149, 72, 128, 33, -248, 234, -3, 196, -90, -116, -195, -192, 17, 61, 78, 75, 147, -61, 74, 34, 251, 34, 8, -67, 30, 92, 127, -151, -4, -55, 148, 126, 201, 19, 12, -61, -81, 96, 59, 181, 239, -143, -84, 154, 81, 57, 137, 151, 7, 8, -70, 208, -83, 119, 25, -139, 153, -88, 164, -101, -62, -31, 60, -115, 24, 23, 57, 74, 126, -76, 119, 228, -185, -80, 152, -184, 114, 102, 20, 32, -363, -275, -245, -1, 140, 147, 242, 33, 10, 145, 172, 296, 95, -175, 83, 100, -253, -58, -96, -61, -225, 77, 195, -13, 13, -67, -96, 78, 240, 169, 18, 133, 294, 259, -19, -43, 210, 102, -14, -60, 123, -122, -91, 88, 100, 46, -164, 9, 28, 84, -173, 49, 179, 58, -45, -327, -139, -301, 134, -24, 77, 255, 11, -219, 73, -109, 27, 39, -181, 183, -18, 13, -45, -58, -185, 101, 119, -50, -13, -231, -211, 32, -183, 5, -60, 196, 95, 79, -95, -33, -17, -71, 247, -196, 47, -80, -38, -4, 220]
3710B20ll61M1P2PJ3J68l0l91K30k0O6l20K02J2K07j18j58J32P3L25k09k11j4
3734f7jn3J64J09q5j03J5j47K61k22K26j06R0k3o3j68O8J14j97J9K19M4n0J75
3758B19j49K2KqM1q5k09M9K35j05R9j61J02j70L23K7j65k49J90n3m8jJ57j48J83
3783I8l46M04k81j08K72k52K33j49K57k72r2M21j39r7p0K43k08k32L29K1j13K83
3805B02o9k75J57j71N2J15K5Q7r5n6J93k49j11M22l43J10K00j16o5J25j75j47
3827a84R2j29K42p0M5J7j91J69K38m15L57l12pP1K72k10n4J30l5p6J20k84m9M15
3851A52K8k01N9j18R8R7j98j5M28m67O2J15N5lN1j80k54K42K66k17l32N44j32
3874H0n8n4j85K46m7rk52J90L19l80L37q9k7k2Qj02m3M39m50J60p2K17r9J70j41
$$ y = [220, 217, -144, -103, -31, -24, -11, 157, 127, -264, -34, -54, 12, -308, -106, -94, 113, -5, -163, -31, 42, 367, 158, -53, -67, -68, -121, 43, 152, 67, -36, -21, -168, 93, -129, 97, -9, 81, 58, -5, -173, -105, 9, -188, -169, 50, 94, 44, 219, 70, 92, 94, 86, 127, 42, -167, -118, 117, 12, 111, -50, 52, -118, 205, 232, 67, -182, 8, -45, -93, -94, 63, -85, 98, -248, 156, -125, -233, 39, -213, 20, -129, 128, -144, -236, 185, 46, -51, -121, 122, -86, -318, 11, 32, -81, 202, 133, -142, 15, -156, -104, 11, 36, 123, 28, -28, 165, -84, -195, 227, -116, -6, 194, 78, 13, 138, -37, -184, -92, -221, 21, -49, -4, 13, -178, -9, 229, -186, 171, -141, -148, -77, 195, -15, -69, 61, 26, -50, 70, -214, -263, 152, 180, -21, 38, -80, 18, 115, -83, -98, 330, -137, -75, 40, 95, 92, 143, -37, -291, -49, 217, 0, -332, 212, 80, 22, -32, -217, 29, -18, -27, -279, -89, 230, -150, 187, 98, 71, 49, 57, -45, -88, 351, -99, 61, -11, 206, 107, 277, 136]
3899A36l77J75J36k08Rj2K48J08j46L1j57m8j17L47J46l14J1K5k04K67j45J30
3921D1J0j54K9J46K2N2l87L88j62l4k01K60r6J61j98Q9r8K78k07j17J70j06J13
3944an7L34n67L64m13M16r5j20j33N01l21P8L8l3mK3P1k95K27l2j66K44n4p8O7
3969fnJ14Q8k88n2J77p9P8p4p3m7L8J56Q8q7J32l55L64p8k99J04p2J92pK29j07
3995A31j36k5j2m8R2L2kJ09k02K66l5k79k5K54j28j16K38n0L5j8j03q2k77M10
4019B9k51M02k68J53K1J04k88L0M8M5J07j63M69m47j39L44l62J9j46J79J51k98
4041b61K90j1J95k82L15k47OJ09j25j18L55k81M04l18RN5j36j06R3K89l43K82
4063A74n2O8q7K5k51L60l28K24o6n6p5j52L78k10k25K26Jk6j6M6q6K03k88J93
$$ y = [136, -241, -66, 70, -138, -129, -141, 107, 215, 69, 100, -57, -105, -222, 125, 271, -43, -32, -7, -211, 56, -89, 41, 51, -103, -74, 72, 94, 146, -241, 147, -15, -49, -250, 10, -86, 75, -123, -34, -132, 146, -61, -178, -8, -114, -1, -58, 276, -291, 73, -340, 76, -19, -139, -272, 229, -92, -14, 24, -9, -13, 10, 81, -214, 13, -19, -185, 59, 5, -73, -6, -11, 103, 191, -97, -149, 28, -51, 27, -47, -120, -167, -129, 27, 115, 28, 160, -195, 169, 91, -208, -104, -176, 16, 9, 238, 131, -5, -30, -42, -90, 2, 34, 32, 141, -61, 205, 170, -109, -134, 120, -8, -124, 114, 64, 99, 81, -22, -104, -381, 29, -222, 180, -88, 65, 86, 190, -98, -68, -20, 25, 132, -31, 438, -9, -148, 196, -166, -147, -293, -114, 37, -261, 29, 18, 213, -69, 246, -1, 5, 114, -11, -129, 226, -55, 349, 31, 40, 95, -41, -147, -54, 235, -108, 174, 122, 190, 103, 128, -123, 237, -91, 133, 67, 11, -64, -216, 162, -48, -273, -47, -46, -72, -88, -42, -128, 75, -213, -20]
4087b0j30R3l9j07K79m8M9k29M25m65l6J76J12j92J71j63J15R3j78k5J53K6Pl79
4111c12K61q9L51k63j56L88k97J12P7M3o8k63L99k07PL0mJ55O3l39J94j53N06
4134D35m89m72P24p0j75K1J38K04k31l19L34j94M1k6K05N3l8k24nK39o4j19O8
4157C6j26J67k97M0K05J30k64J26m6q7M7j3j32K97Q2n7J89k86Lj65K48J44k53
4180a2j80K91L2l05J03K3l3J29k41K9J90m6J13J1j27L05l48J8J41k17J97j12J13
$$ y = [-20, -150, -57, -96, -203, 76, 28, 77, -152, 273, -192, -228, -52, 60, -132, 39, -124, -9, 84, -94, -119, 34, 60, 67, -312, -51, -140, 211, -52, -208, 180, -117, -5, 72, 115, 47, -216, 183, -24, -17, 13, 9, 164, 227, -112, 82, -71, 435, -54, -526, 198, 128, -47, -26, 112, 316, 85, -234, 100, -94, -53, -79, 126, 179, 141, -83, -88, 151, 87, -32, 36, -90, 77, -220, -180, 25, 155, -109, 17, -29, -116, -69, -82, -214, 83, 165, 108, 297, 11, 14, -151, 97, 241, -12, -192, 99, 131, -174, -71, -48, -81, 48, -193, -164, 26, -20, 93, 104, -23, 282, -66, -48, 93, -124, 73, -39, 74]
$$ [...]
8191f1
##END NTUPLES=NMR FID
##END=
