##TITLE=1H_K-382/2
 CDCl3, 8 sc, 
 1.06.2021
##JCAMPDX= 6.0         $$ Bruker NMR JCAMP-DX V2.0
##DATA TYPE= NMR FID
##DATA CLASS= NTUPLES
##ORIGIN= UXNMR, Bruker Analytische Messtechnik GmbH
##OWNER= root
$$ XWIN-NMR		Version 3.5
$$ Tue Jun  1 12:56:23 2021 Russian Standard Time (UT+4h)  she@DPX200
##.OBSERVE FREQUENCY= 200.131506
##.OBSERVE NUCLEUS= ^1H
##.DELAY= (6, 6)
##.ACQUISITION MODE= SIMULTANEOUS
##.ACQUISITION SCHEME= undefined
##.AVERAGES= 8
##.DIGITISER RES= 18
##SPECTROMETER/DATA SYSTEM= spect
##.PULSE SEQUENCE= zg30
##.SOLVENT NAME= CDCl3
##.SHIFT REFERENCE= (INTERNAL, CDCl3, 0, 15.7039)
##AUDIT TRAIL= $$ (NUMBER, WHEN, WHO, WHERE, WHAT)
$$ ##TITLE= Audit trail, XWIN-NMR		Version 3.5
$$ ##JCAMPDX= 5.01
$$ ##ORIGIN= Bruker BioSpin GmbH
$$ ##OWNER= she
$$ F:/spectra/data/she/nmr/H-F/1/audita.txt
$$ ##AUDIT TRAIL=  $$ (NUMBER, WHEN, WHO, WHERE, WHAT)
(   1,<2021-06-01 12:54:11.09 +0400>,<she>,<DPX200>,
      <created by zg, POWCHK disabled, PULCHK disabled
       configuration hash MD5:
       00 E9 B6 7A A2 85 ED C7 34 08 36 98 17 FE 4E 26
       data hash MD5: 16K
       77 F7 51 D6 5C 18 BB 53 60 D6 04 8F BA 50 BE FC>)
$$ ##END=
$$ 
$$ hash MD5
$$ 76 FC 1F BF 77 1A 37 8C B2 65 48 E7 8D 1A C5 DE
##$RELAX= 
##$RELAX= 
##$RELAX= 
##$RELAX= 
##$RELAX= 
##$RELAX= 
$$ Bruker specific parameters
$$ --------------------------
##$DU= <F:/spectra>
##$EXPNO= 1
##$NAME= <H-F>
##$PROCNO= 1
##$TYPE= <nmr>
##$USER= <she>
##$AMP= (0..31)
100 100 100 100 100 100 100 100 100 100 100 100 100 100 100 100 100 100 
100 100 100 100 100 100 100 100 100 100 100 100 100 100 
##$AQSEQ= 0
##$AQ_mod= 1
##$AUNM= <au_zg>
##$AUTOPOS= <>
##$BF1= 200.13
##$BF2= 200.13
##$BF3= 200.13
##$BF4= 200.13
##$BF5= 200.13
##$BF6= 200.13
##$BF7= 200.13
##$BF8= 200.13
##$BYTORDA= 1
##$CFDGTYP= 0
##$CFRGTYP= 5
##$CHEMSTR= <none>
##$CNST= (0..31)
1 1 145 1 1 1 1 1 1 1 1 1 1 1 1 1 1 1 1 1 1 1 1 1 1 1 1 1 1 1 1 1 
##$CPDPRG= <>
##$CPDPRG1= <>
##$CPDPRG2= <>
##$CPDPRG3= <>
##$CPDPRG4= <mlev>
##$CPDPRG5= <mlev>
##$CPDPRG6= <mlev>
##$CPDPRG7= <mlev>
##$CPDPRG8= <mlev>
##$CPDPRGB= <>
##$CPDPRGT= <>
##$D= (0..31)
0 1.2 0 0 0 0 0 0 0 0.06 0 0.03 0 0 0 0 0.0002 0 0 0 0 0 0 0 0 0 0 0 0 
0 0 0 
##$DATE= 1622537650
##$DBL= (0..7)
120 120 120 120 120 120 120 120 
##$DBP= (0..7)
150 150 150 150 150 150 150 150 
##$DBP07= 0
##$DBPNAM0= <>
##$DBPNAM1= <>
##$DBPNAM2= <>
##$DBPNAM3= <>
##$DBPNAM4= <>
##$DBPNAM5= <>
##$DBPNAM6= <>
##$DBPNAM7= <>
##$DBPOAL= (0..7)
0.5 0.5 0.5 0.5 0.5 0.5 0.5 0.5 
##$DBPOFFS= (0..7)
0 0 0 0 0 0 0 0 
##$DE= 6
##$DECBNUC= <off>
##$DECIM= 32
##$DECNUC= <off>
##$DECSTAT= 4
##$DIGMOD= 1
##$DIGTYP= 9
##$DL= (0..7)
0 120 120 120 120 120 120 120 
##$DP= (0..7)
150 150 150 150 150 150 150 150 
##$DP07= 0
##$DPNAME0= <>
##$DPNAME1= <>
##$DPNAME2= <>
##$DPNAME3= <>
##$DPNAME4= <>
##$DPNAME5= <>
##$DPNAME6= <>
##$DPNAME7= <>
##$DPOAL= (0..7)
0.5 0.5 0.5 0.5 0.5 0.5 0.5 0.5 
##$DPOFFS= (0..7)
0 0 0 0 0 0 0 0 
##$DQDMODE= 0
##$DR= 18
##$DS= 0
##$DSLIST= <SSSSSSSSSSSSSSS>
$$ [...]
##$SUBNAM2= <"">
##$SUBNAM3= <"">
##$SUBNAM4= <"">
##$SUBNAM5= <"">
##$SUBNAM6= <"">
##$SUBNAM7= <"">
##$SUBNAM8= <"">
##$SUBNAM9= <"">
##$SW= 16.9725357007746
##$SWIBOX= (0..15)
0 0 2 0 0 0 0 0 0 0 0 0 0 0 0 0 
##$SW_h= 3396.73913043478
##$TD= 16384
##$TD0= 1
##$TE= 0
##$TE2= 300
##$TE3= 300
##$TEG= 300
##$TL= (0..7)
0 120 120 120 120 120 120 120 
##$TP= (0..7)
150 150 150 150 150 150 150 150 
##$TP07= 0
##$TPNAME0= <>
##$TPNAME1= <>
##$TPNAME2= <>
##$TPNAME3= <>
##$TPNAME4= <>
##$TPNAME5= <>
##$TPNAME6= <>
##$TPNAME7= <>
##$TPOAL= (0..7)
0.5 0.5 0.5 0.5 0.5 0.5 0.5 0.5 
##$TPOFFS= (0..7)
0 0 0 0 0 0 0 0 
##$TUNHIN= 0
##$TUNHOUT= 0
##$TUNXOUT= 0
##$USERA1= <user>
##$USERA2= <user>
##$USERA3= <user>
##$USERA4= <user>
##$USERA5= <user>
##$V9= 5
##$VALIST= <valist>
##$VCLIST= <CCCCCCCCCCCCCCC>
##$VD= 0
##$VDLIST= <DDDDDDDDDDDDDDD>
##$VPLIST= <PPPPPPPPPPPPPPP>
##$VTLIST= <TTTTTTTTTTTTTTT>
##$WBST= 1024
##$WBSW= 4
##$XGAIN= (0..3)
0 0 0 0 
##$XL= 0
##$YL= 0
##$YMAX_a= 246033
##$YMIN_a= -79997
##$ZGOPTNS= <>
##$ZL1= 120
##$ZL2= 120
##$ZL3= 120
##$ZL4= 120
##$ABSF1= 10
##$ABSF2= 0
##$ABSG= 5
##$ABSL= 3
##$ALPHA= 0
##$AQORDER= 0
##$ASSFAC= 0
##$ASSFACI= 0
##$ASSFACX= 0
##$ASSWID= 0
##$AUNMP= <proc_1d>
##$AZFE= 0.1
##$AZFW= 0.1
##$BCFW= 1
##$BC_mod= 2
##$BYTORDP= 1
##$COROFFS= 0
##$CY= 11.3945322036743
##$DATMOD= 1
##$DC= 2
##$DFILT= <>
##$DTYPP= 0
##$F1P= 15.9154993809931
##$F2P= -4.1035820241983
##$FCOR= 0.5
##$FTSIZE= 0
##$FT_mod= 4
##$GAMMA= 1
##$GB= 0.15
##$INTBC= 1
##$INTSCL= 1
##$ISEN= 128
##$LB= 0.24
##$LEV0= 0
##$LPBIN= 0
##$MAXI= 10000
##$MC2= 0
##$MEAN= 0
##$ME_mod= 0
##$MI= 1.114404
##$NCOEF= 0
##$NC_proc= 0
##$NLEV= 6
##$NOISF1= 3.799351
##$NOISF2= 2.8
##$NSP= 1
##$NTH_PI= 0
##$NZP= 0
##$OFFSET= 15.70392
##$PC= 1
##$PHC0= -11478.56
##$PHC1= 15.60099
##$PH_mod= 1
##$PKNL= yes
##$PPARMOD= 0
##$PSCAL= 0
##$PSIGN= 0
##$REVERSE= no
##$SF= 200.130013532006
##$SI= 16384
##$SIGF1= 3
##$SIGF2= 2
##$SINO= 400
##$SIOLD= 16384
##$SREGLST= <1H.CDCl3>
##$SSB= 0
##$STSI= 0
##$STSR= 0
##$SW_p= 3612.71676300578
##$SYMM= 0
##$S_DEV= 0
##$TDeff= 0
##$TDoff= 0
##$TI= <>
##$TILT= no
##$TM1= 0
##$TM2= 0
##$TOPLEV= 0
##$USERP1= <user>
##$USERP2= <user>
##$USERP3= <user>
##$USERP4= <user>
##$USERP5= <user>
##$WDW= 1
##$XDIM= 8192
##$YMAX_p= 0
##$YMIN_p= 0
$$ End of Bruker specific parameters
$$ ---------------------------------
##NTUPLES= NMR FID
##VAR_NAME=  TIME,          FID/REAL,        FID/IMAG
##SYMBOL=    X,             R,               I
##VAR_TYPE=  INDEPENDENT,   DEPENDENT,       DEPENDENT
##VAR_FORM=  AFFN,          ASDF,            ASDF
##VAR_DIM=   8192,          8192,            8192
##UNITS=     SECONDS,       ARBITRARY UNITS, ARBITRARY UNITS
##FACTOR=    0.0002944,     1,               1
##FIRST=     0,             0,               0
##LAST=      2.4114304,     0,               0
##MIN=       0,             -79997,          0
##MAX=       2.4114304,     246033,          0
$$ Real data points
##PAGE= N=1
##DATA TABLE= (X++(R..R)), XYDATA
$$ [...]
1800G5m1j53Q9PK8k50K4J3n0J86o9J35j36L95k89J02l72O5K30l67k8lK12J60P4
1825C7K28J4k47R0k70n5L2J08j38l3K95K47l33J97p9l52Q6R0k3J7K3J89j11O4
1849G6p4K54k46N6j16j63lJ40j4l04J23J05K6o5O4J36L8k09O5j82m62N31m4q0
1873c48p1J37r6N2m7J32j1O%k17l9J82r0L8K95l0l2P8k2j97N7j35o1O0O5K8o3
1900c29L37J7%j17J19l08Q3k7l25K09N2L42k11K98k2p6j75L9q0J41%l28K13J50
1924Bj54K14K09j67j61o4K92k21l82L62k26Q5n7J49L0Q6L8J08l69j4m7L3J6k17
1948d55K64K89M3l23L11N4k32q8j3j35j8m7P6J7K06N0q5j72K14j75K65l81n1n2
1972d38J17M7K9j53L07J73k10J97j27j98p7J42J3p5K17J8K51L7l14K44o9O9k32
$$ plain form
1800 75 34 -119 -30 -23 5 -245 -221 -208 -258 -72 -141 -6 -142 253 -36 66 -306 -241 -11 -378 -406 -409 -197 -37 37
1825 37 265 279 32 122 -148 -203 -171 -63 -201 -234 61 308 -25 172 93 -259 -173 -83 -106 -89 -66 123 12 76
1849 76 2 256 10 66 -50 -213 -216 -76 -90 -394 -271 -166 -140 -205 -141 -5 33 -176 -111 -293 -755 -224 -268 -348
1873 -348 -419 -282 -378 -326 -373 -241 -252 -246 -246 -463 -502 -320 -410 -372 -77 -107 -139 -61 -83 -280 -223 -358 -419 -359 -294 -266 -329
1900 -329 8 25 25 -92 27 -281 -198 -225 -550 -341 -289 53 -158 140 118 42 -133 -94 -174 -33 -33 -361 -148 2
1924 2 -152 62 271 104 -57 -121 171 -50 -432 -70 -296 -211 -268 -119 -89 -3 35 143 -226 -240 -287 -254 -238 -455
1948 -455 -191 98 141 -182 129 183 -49 -137 -150 -285 -303 -350 -274 -257 -51 -1 -86 -258 -44 -219 46 -335 -386 -438
1972 -438 -321 -274 -245 -398 -91 82 -128 69 -58 -256 -333 -191 -178 -253 -36 -18 233 270 -44 200 131 200 -32
1995c2nj26o5J36OJ93q0r5O8PJ47k32k04J84j72M5o8K01K19k3q7J44ll8j88J44
2021G6q5k24m6L98k47J63j07K5Q7k25J46r1R5J74l29n4j5J93R9j00J73k85K94
2044A15k07p2j76J35MJ91q4o3J84l2K74o7m15J35J13NJnl66M71o9k94n3M68j42
2069E1K8m1k79M46k06k20K93p4J55K22l74Q0j85O1J74l62L72j56j69J64J75k3
2091A32o3O5J3j24j30k26R8J05k5O0J26k84M10K16l03Rk28R4j04K51j83j80R5
2114a76J69J41m1n6k20J71p4j06M1M2j22j00L47j21j2P7K22n22K48J86j27r7r6
2137b26J07J1l2Q6K71j28Mk29M1j2PK30p5j04J17JK12k20J67l1N4k82p9j93k43
2162e46M64J44j38OK13l48J63n6N5k34J60J35j82m5K75j0J99j98o7J04j60N3j17
$$ plain form
1995 -32 -37 -163 -228 -92 -86 107 27 -68 0 7 154 -78 -282 -98 -270 -225 -293 -92 127 104 17 161 158 120 -68 76
2021 76 -9 -233 -279 119 -128 35 -72 -47 40 -185 -39 -130 -35 139 -190 -244 -259 -66 33 -67 106 -179 115
2044 115 -92 -164 -340 -205 -201 -10 -94 -157 27 -5 269 202 -213 -78 35 40 41 36 -330 141 72 -222 -275 193 51
2069 51 79 38 -241 205 -1 -221 72 -2 153 375 1 81 -104 -43 131 -231 141 -15 -184 -20 155 132
2091 132 69 134 147 23 -107 -333 -235 -130 -155 -95 31 -253 157 373 70 79 -149 -55 -159 92 -91 -271 -176
2114 -176 -7 134 93 37 -183 -12 -86 -192 -151 -109 -231 -331 16 -105 -117 -40 182 -340 -92 94 -33 -130 -226
2137 -226 -119 -108 -140 -54 217 89 93 -136 -95 -107 -100 130 55 -49 68 69 281 61 228 197 251 -31 -110 -303 -546
2162 -546 -82 62 -76 -70 143 -205 -42 -98 -43 -277 -117 18 -164 -209 66 56 255 57 -10 94 -66 -13 -130
2185a30m8m3J20J90j91J2L51j98m0K47k03j48J2K1Mj99L29l78J31M5K5J25k60
2208b26K04O4r2j43r3Q7J73j48J23K07m2k42K28J4k52P8%J06l16J63L95l06Q1
2231F3j3j12J66l4j64m0K00k25O6k0j0K97m8q7j84J68J14l55j01L22j17K14l7
2254F3q2M7K91k80J23n7k57L41j16j45l1k2L05j13j37K50k14K29l18pJ59j61j75
2277c07K10L9L25P3k71P6l0l8P3k09J82j27J91k32m4J83l5N5j75K00l41J00j23
2300b25J08k05L84r0O3p6j5j39J38k25Q9j39J34L3J08J88l21Q2OQ3n3L53m39p7
2324b35J72j13Q1J14j06J84o4k09O4n4M59j62k77J11k33J80q0J43PJ64l74K44
2346A6K07k19K63m54k7J06J49J03m64J89j6M06j76o5M8J9n38L44K23Q2r8J04N
$$ plain form
2185 -130 -178 -221 -101 89 -102 -90 261 63 23 270 67 -81 -69 -48 -44 -243 86 -292 -161 -116 -91 34 -226
2208 -226 -22 42 -50 -193 -286 -199 -26 -174 -51 156 114 -128 100 114 -138 -60 -60 46 -270 -107 288 -18 63
2231 63 50 -62 104 70 -94 -134 66 -159 -93 -113 -123 174 126 39 -145 23 137 -218 -319 3 -114 100 63
2254 63 -19 28 319 39 162 105 -152 189 73 -72 -103 -125 180 67 -70 180 -34 195 -123 -130 29 -132 -307
2277 -307 -97 -58 267 340 69 145 115 77 150 -59 123 -4 187 -45 -89 94 59 114 -61 139 -202 -102 -225
2300 -225 -117 -322 62 -28 35 -41 -56 -195 -57 -282 -193 -332 -198 -165 -57 131 -190 -108 -102 -19 -72 281 -158 -235
2324 -235 -63 -176 -95 19 -87 97 33 -176 -112 -166 293 131 -146 -35 -268 -88 -168 -25 -18 146 -228 16
2346 16 223 4 267 -187 -214 -108 41 144 -320 -131 -147 259 83 18 66 85 -453 -109 114 196 98 202 207
2369B07j83j5j76L69o70K19L0J2Q3J06N62n18K47r4j91L03l74J27J53K64j46m35
2391a20L45j8O3k07r2r3L05l43L06k91O27j45j52K48l27o07M28K10k02k9o31R24
2413A99k61J8M25l37L83n57j85N70N9o5o15K14o2L19L20j227Q21q8K65o15J99
2434b20M89l82K82N26n09m54o4O10j01m7l57M47R8m07k65J85J52m8L82k91M72
2455D98n62o4M21j8j18l57PL21K71j94N08r83M70l61M18K53l07O3j37k62o2J18
2477g7K52O63j076M16qK2k30k96N19q44n3O99M06q44R27n59n2J65L67o36k40N29
2499E0r2nN82k81N1n16k0N46k44J05j43P3k70J76J90nk91M25j63l62J79O7K02
2522B54J8l5k48mk97N77l43K36k71J64L9M1p4J95l08L5Rm5K1qK8j80J14J30j69
$$ plain form
2369 207 24 9 -167 202 -468 -249 -219 -207 -124 -18 544 26 273 179 -12 291 -83 44 197 461 315 -120
2391 -120 225 207 270 63 -29 -122 183 -160 146 -145 482 337 185 433 106 -501 -73 137 -65 -94 -725 199
2413 199 -62 -44 381 44 427 -130 -315 255 314 249 -366 -152 -214 105 425 -802 19 -69 196 -419 -220
2434 -220 269 -113 169 695 186 -268 -332 278 177 130 -227 220 318 -89 -354 -169 -17 -65 317 26 498
2455 498 -64 -128 293 275 157 -200 -193 128 399 205 713 -270 200 -161 257 510 203 266 129 -133 -195 -77
2477 -77 175 838 -238 178 170 192 -38 -334 185 -659 -712 -13 393 -451 476 -83 -135 30 397 -239 -479 50
2499 50 -42 -47 535 254 305 -211 -231 315 71 176 33 106 -164 12 202 197 -94 331 168 -194 -15 52 254
2522 254 272 237 -11 -15 -312 265 -78 158 -113 51 90 131 57 252 -56 -21 -12 -57 -36 -44 -16 -196 -82 48 -121
2547a21R09r65K29j40O41n97j58N56k50N6O0o6m6j82J55l10L45k10J83k61J45
2568b7J80J20l70Q2j1L10J63k35n73L18N05q44K20L91j89J91j41o6K0l17M67l77
2590a83L95l07j89L66J3N3j00j96J21m7K41k69k3j6M07j93k37o0K44r1l2p0K34
2613F1j24q1K94l93K63j8r5M80j98l12L2K14L9k82Q8l0J61O9k05J74o8j05P3l4
2637CJ32j61K56l14l2m6j2M3O7K25J05k38j73J23J11m2o9p4R4q3J50j90N8N0j40
2662a57K04l5l13J80J83k00Q1QQ4M6j04QR1k12J27n3J46K6j16K73j91j41J51J42
2686B28J48k72j03J61k81P3J06J3j54J22q4j35L10j4o1j53J72j9j95K74q6j5m1
2709fJ71k93KK77k42K85j30j56J16r7N8O9K7p6j92M7R1q7j7%n3p5L3K90j16k2
$$ plain form
2547 -121 788 -177 52 -88 553 -44 -202 354 104 160 220 154 108 -74 81 -229 116 -94 89 -172 -27
2568 -27 153 273 -97 -15 -26 284 447 212 -361 -43 462 -382 -162 229 40 231 90 24 44 -273 194 -183
2590 -183 212 -95 -284 82 95 148 48 -148 -27 -74 167 -102 -125 -141 266 73 -164 -224 20 -71 -103 -173 61
2613 61 -63 -144 150 -243 20 2 -93 387 189 -123 -91 123 162 -120 -32 -62 99 168 -37 137 69 -36 37 3
2637 3 135 -26 230 -84 -116 -162 -174 -131 -64 161 266 28 -145 -22 89 47 -22 -96 -2 -85 65 -125 -67 -17 -157
2662 -157 47 12 -301 -121 62 -138 -57 -49 35 81 -23 -15 76 -136 -9 -62 84 110 -6 267 76 -65 86 228
2686 228 376 104 1 162 -119 -46 60 73 -81 41 -43 -178 132 118 57 -96 76 57 -138 136 50 35 -6
2709 -6 165 -128 -126 151 -91 194 64 -92 24 -73 -15 54 81 5 -187 -140 -49 -136 -153 -153 -206 -281 -248 42 -74 -96
2735i6J05m1J27k11O6o7j16l0O3J8K84K2N9n4r5J4J3J70m26L48j64N7j18j18J32
2760e8lk11M05j37j71K03J46l24k5K07j29M3K09j51p7J54j10j55Q3K08l56K56
2782Go8K20j24K37k31Q2n3r8K2j21j10K43l2o3N4k11P1L8L9R2j16r2K82l18J67
2807h3K00n5j03m9Q1J90m5l87P8J65J49j25m5M9L3r1Q1R7q7p9m7K33j48pq9J10
2833B6J30Q6k72l3k1O0l7r2L26j15l93J58J51Q8N0j13m6j1p0J11J97p3q6P6j50
2858e3M24m31l0K15j82k11K80N9k03k5K68j77K89k42J22o9M82n49R1k32Q0p0M1
2881a23M7l0K72p0k88K51r6J02k60K34J17l8l56M51n07M50k25K59k8p4K40j76
2903A52K35l09j94R1J04k38J19l12L69l31K45Q9l7J9j77J70r9K08r7j61L38M3
$$ plain form
2735 -96 9 -32 95 -116 -50 -117 -233 -263 -200 -182 102 124 183 129 34 48 61 231 -195 153 -11 46 -72 -190 -58
2760 -58 -61 -272 133 -4 -175 28 174 -150 -175 32 -97 -54 155 4 -73 81 -29 -184 -101 107 -249 7
2782 7 -61 159 35 272 41 123 70 -28 -6 -127 -237 6 -26 -89 -35 -246 -175 -137 -98 -6 -122 -214 68 -250 -83
2807 -83 117 62 -41 -90 -9 181 136 -251 -173 -8 141 16 -29 20 53 -38 43 140 53 -26 -73 160 12 5 -84 26
2833 26 156 242 -30 -63 -84 -24 -61 -153 173 58 -335 -177 -26 62 112 -1 -47 -58 -128 -17 180 107 21 97 -53
2858 -53 371 -60 -90 125 -57 -268 12 71 -132 -157 111 -66 223 -19 103 34 516 -33 58 -174 -94 -164 -123
2881 -123 -76 -106 166 96 -192 59 -37 65 -195 39 156 118 -238 213 -294 156 -69 190 162 88 328 152
2903 152 387 78 -116 -25 79 -159 -40 -352 17 -314 -69 20 -17 2 -175 -5 -104 104 7 -154 184 227
2925B27k2%o5k01K35l12k5N2J74l2j00N5P1n2l3R2J19n21L41k01J89k9P7P5l13
2950a99J06J46J4j77J38m1K00j31J82j27n1n4J72qq2J36j37k73J54r0J31m7Q8
2973E0j22J18j96K21j5qk22J28N0K2j28J83l52K09K77k51L5j5q6J66r7O2j43M4
2997g0%l37O00j06J4J36k02Kj00J31r2R1k04L00J43l55j02K43o4k90K17K8J56
3020A39n9J0r5J8k5J30L7m1k29J84p5m2J17j00k83M44k58K48j02k9J51n1Q3k59
3044h7q3K31j5r1J6j71P4K10j21RR8n2J30j86R6pj31l4J88j23J12p2o9q2R2J2
3070e6J71k36J41J29k69J01p2K39l88K08k6J73k13J24K83l43J07kr8K02j15j03
3092d3J18k62L14k47K94j95j12L17j2k51J29j65mK92k7m4M0l70J91M8J66p9O9
$$ plain form
2925 227 205 205 140 -61 174 -138 -163 -111 63 31 -69 -14 57 5 -28 64 183 -338 3 -198 -9 -38 39 114 -199
2950 -199 -93 53 67 -110 28 -13 187 56 238 111 60 6 178 170 88 224 87 -186 -32 -122 9 -38 50
2973 50 -72 46 -150 71 56 48 -174 -46 4 26 -102 81 -271 -62 215 -36 -1 -16 -102 64 -33 29 -114 -70
2997 -70 -70 -407 193 87 101 237 35 37 -63 68 -24 67 -137 163 306 -49 -151 92 28 -262 -45 -17 139
3020 139 80 90 -5 13 -12 118 155 114 -115 69 -6 -48 69 -31 -314 130 -128 120 18 -11 140 89 172 -87
3044 -87 -170 61 46 -45 -29 -200 -126 84 -37 -28 70 18 148 -38 58 51 -80 -114 74 -49 63 -9 -78 -160 -68 -56
3070 -56 115 -121 20 149 -120 -19 -91 148 -240 -32 -58 115 -98 26 309 -34 73 71 -27 175 60 -43
3092 -43 75 -187 127 -120 174 -21 -133 184 172 -79 50 -115 -119 173 146 102 142 -228 -37 11 177 98 167
3115A67k59K01l68J29L92l04k3O2P7M9m6j78N01l23r6k03L57j12j5k1j5N0j61
3138a39K30k99K00OJ4j19l4j2J78m4J34m4J19j20l66K37N3P8R0j7j47j18J08O
3162fj28K40pp7L3k19k7K39k39O9J48R9N1j08l1k14R1J62K02l30n2l1K20p1j21
3187a07Q6K6L34M0m40m9K59j29m7j62L08k00J61k49K36k8j17J31j36J88p6p2L5
3210hJ4j46J05R7l06K53j55L41j30j44K59k48J27j00j94L46k19O4R8m4k2j3M4
3233A9K15k84J28O1Q3l1Jj94p0j7j88J40K95m77K80K4P7k34N6J07n5J48l3o0J92
3258A83k36J54j19K59l11J50o6M0J05k42QJ84k29J67Q3r3k75L83j02K28j36j2
3280A23k37K43n9m7M7j3r5Q7j79r8N06k85K8j46P2o7K21L3m1j74rJ90J88j3k33
$$ plain form
3115 167 -92 109 -259 -130 262 -42 -65 -3 74 123 77 -101 400 77 -19 -222 135 23 8 -13 -28 22 -139
3138 -139 91 -208 -8 -2 12 -107 -141 -153 25 -19 115 71 190 70 -296 -59 -6 72 162 145 -2 -120 -12 -6
3162 -6 -134 106 99 22 55 -164 -191 48 -191 -122 26 125 176 68 37 -177 -86 76 278 -52 -104 -135 85 14 -107
3187 -107 -21 5 339 379 -61 -110 149 20 -27 -189 119 -81 80 -169 67 39 -78 53 -83 105 29 -43 -8
3210 -8 6 -140 -35 62 -244 9 -146 195 65 -79 180 -68 59 -41 -235 111 -108 -44 54 10 -12 -25 19
3233 19 234 -50 78 139 222 191 192 -2 -72 -89 -277 -137 158 -319 -39 -15 62 -172 -116 -9 -64 84 51 -9 183
3258 183 -53 101 -18 241 -70 80 14 54 159 -83 -75 109 -120 47 130 37 -238 145 43 271 135 123
3280 123 -114 129 70 23 70 57 -38 49 -130 -228 278 -7 21 -125 -53 -120 101 134 93 -81 -90 100 288 275 42
3305D2j19M8j25J38J29NP2k97K4L28l30J73j15m8J74j28m1k02Q7K54j50p4L8J61
3329D4r0l4Q1J04j22P0j70J46k6m0kK19N1m08L19j91o9K83L9k70K30k81R6n2j25
3354a98K4J21O4n8J52j34n9J26K3k8J70j76J44j00j05K04k17K73k03K38k86Q4
3376E9K7J02l39K5K7M6K15k46o1R9K49j76j6mJ11j60M88n72L93l72J42k24L18
3399A31l54L34j77j69M01p4J24l26n8J19OK01j91k6J30J7r0j22L84k75R4j30O9
3422A8J92l11jj39K96p5J29K7k22Q2J6n3J11M1k98L73l91J39l3O3o0P1j83P2L06
3447A70l99Q5R9JK00j86J34m7j48J6J15K77l53L00j78Q7p7l44K50p7J29K6pq9
3471a6J55j69J17k3k39J94J7LQ2j67P7J31k11rJ59l50K65J27j4k58J75pj95J09
$$ plain form
3305 42 -77 -29 -154 -16 113 118 190 -107 -83 245 -85 88 -27 -75 99 -29 -70 -272 -185 69 -81 -155 -117 44
3329 44 -46 -80 1 105 -17 53 -117 29 3 -37 -39 180 231 -177 142 -49 -118 165 204 -66 164 -117 -21 -73 -198
3354 -198 -174 -53 11 -47 105 -29 -88 38 61 33 203 27 171 71 -34 170 -47 226 23 261 -25 59
3376 59 86 188 -151 -126 -99 -53 162 -84 -145 -46 203 27 11 7 118 -42 446 -126 267 -105 37 -187 131
3399 131 -223 111 -66 -235 166 92 216 -110 -168 -49 -43 158 -33 -59 71 88 -2 -124 260 -15 79 -51 18
3422 18 210 -101 -102 -241 55 -20 109 136 -86 -4 12 -41 70 111 -187 186 -205 -66 -99 -36 -96 -25 -208 -136 170
3447 170 -229 -144 -45 -44 156 -30 104 57 -91 -75 40 317 -36 264 86 173 96 -248 2 -75 54 80 73 -16
3471 -16 139 -30 87 64 -175 19 36 39 121 -46 31 162 -49 -58 101 -249 16 143 129 -129 46 39 -156 -47
3495d7L6K3R2j30J68k56K15k38J40j22j7J51P0l8p3K07k20r2K54q8j11J61j82
3518i7l3L77l15J42J68l65R6n0L7j7P5j34r5M4J42l23M01n4M4mJ64r1k37J99j9
3543E5j25j5l2N2N4j80K96J03r9j55m6J18m4K3j07K08q1jj21J59j1l3O5j95P9
3568c3k9k20L19P6j32Q8r8J32m8p2k40L30l3j52J82k01J09j7R3j1N9L8k12J70
3592I8k38J17m7J0J4j46K71k16K01j61L4J1L16k15j42J06P5n7p3k0M6q5K54m90
3616c37J18K98K35m12J06K23l17nJ66r7R0j27Q1J41j8j48J7M5l81K90J80l39J87
3639dK21k21K00l33K05k32J63l17L43j96o4L55n1j60J3j22J31n3O4J58l18J61
3661e7p5J54J90l5j0j28j53J49r4Q4k56M08j02r9R4n6J46J13l11r2K95%r6q2K85
$$ plain form
3495 -47 -11 12 104 -26 142 -114 101 -137 3 -119 -136 15 85 47 -26 181 -39 -131 123 35 -76 85 -97
3518 -97 -130 247 -68 74 242 -123 -27 -77 -40 -57 18 -116 -211 -167 -25 -348 53 -1 43 39 203 112 -125 74 55
3543 55 -70 -85 -117 -65 -11 -191 105 208 109 -46 -92 26 -18 5 -102 106 25 24 -97 62 51 18 83 -112 -33
3568 -33 -62 -282 37 113 -19 69 -29 103 55 -17 -257 73 40 -112 70 -131 -22 -39 54 43 102 140 -72 98
3592 98 -140 -23 -70 -60 -46 -192 79 -137 64 -97 -63 -52 264 49 -93 13 88 31 -42 -62 -16 -101 153 -337
3616 -337 -219 79 314 -98 8 231 -86 -91 75 -22 68 -59 22 163 145 -3 14 59 -322 -32 148 -191 -4
3639 -4 217 -4 196 -137 68 -164 -1 -318 25 -171 -235 120 69 -91 -78 -200 -69 -122 -58 100 -218 -57
3661 -57 -132 22 212 177 167 39 -114 35 -59 25 -231 177 75 -24 70 14 160 273 -38 -130 165 165 69 -13 272
3686B72k93Oj03k0K50J60k74M0J09j6k14J80j98J13k5K28r8k8q7j68L52m89J05
3709a98K71j2k55J65j65K26M2K2n8j44J06k15K96O9k06K61l53K72l02J45m8O4
3731a7J88N7k00o2N1l8q1R0L06j87K8k40L08l18K03Q5j35k28J28o6q4J66J58Q6
3755A98l68R5J35k1r4K08K09m24ML58k09j8j74K4O2J32l53J82p6L47k17m4l8k9
3779a11J04p4J36j84K48k22K23J7j52n3K79l38K55l57K83k36K08j85J76q4p5K0
3801a22J54oO9j9r4P4r0J29k54J85j97J46nJ93k75P5K94j74o1k2Qrj04K74k64
3826i5J10j35J19K46k52R3j83J91k68J02qj00J90L2k0j18L1K31j0l7r4M1k57J93
3850Bk05K63pj40L32l27Q3J34k33K76O9j49L3j90l4J44j77K44o3j96J84J32l93
$$ plain form
3686 272 -21 -15 -118 -138 112 272 -2 38 147 131 -83 97 -101 12 -13 215 117 89 2 -166 186 -303 -198
3709 -198 73 61 -194 -29 -194 32 74 96 38 -106 0 -215 81 150 -56 205 -148 124 -178 -33 -81 -17
3731 -17 171 228 28 -34 17 -21 -102 -12 294 107 135 -105 203 -115 88 173 38 -190 -62 -128 -212 -46 112 198
3755 198 -170 -75 60 39 -55 153 362 -62 -58 300 91 73 -101 -77 -15 117 -236 -54 -130 217 0 -44 -82 -111
3779 -111 -7 -81 55 -129 119 -103 120 137 -15 -68 211 -127 128 -229 54 -182 26 -159 17 -67 -142 -122
3801 -122 32 26 95 76 -18 56 -34 95 -159 26 -171 -25 -30 163 -112 -37 257 83 22 0 8 -1 -105 169 -95
3826 -95 15 -120 -1 245 -7 86 -97 94 -174 -72 -80 -180 10 42 22 -96 -65 166 156 119 25 66 -191 2
3850 2 -203 60 53 -87 245 -82 1 135 -98 178 247 98 131 -59 -93 51 -126 118 55 -141 43 175 -218
3873b18K10k16M7K40j36l4K95j38r6J61J3k04M6J23n4n9R6qj4mJ3j25m6K56j09
3898C9l0kJ31l62K57N4j57L87n96L02K8J96q7j39k66L12k24L06J11k38j02K6J34
3921H0l33N04l21Kj35K33m7K83l94L2J8K63k80R1J72j25j5j29N5K4N0j41ol8j7
3946a74L16j64J79l34K24o5J41k76L40j58N7p0K98l85l5M3JJ18j51K47k02J10
3968F0j7p5J7j84K84m6r4J47j63k08k2L25pm0n7K49l21M8J67j19L5J98j22J91
3992B46m22J65MK7k1K0j40L30n83N14l3j06M31m08n2M4o6R5L61q04L84j61K39
4015F4j16L61p5l79N55n37J66q58N17K75J66l14Lj89N4M79j16L4o71P33J91k04
4037A39l35p1k43R9L9J69j05n38J226l20l10K7K2M36j4j40k30L14m34K71l3K72
$$ plain form
3873 -218 -8 -224 -177 63 -73 -107 188 50 -46 115 128 -76 -30 93 39 -20 76 68 54 50 63 -62 -108 148 39
3898 39 9 7 138 -224 33 87 -70 317 -279 23 51 247 160 21 -245 67 -157 149 260 22 -80 -54 80
3921 80 -253 251 -70 -68 -203 30 -17 266 -128 -96 -78 185 -95 -4 168 43 28 -101 -46 -22 28 -113 -119 -157 -174
3946 -174 142 -22 157 -177 47 -18 123 -153 187 29 86 16 314 -71 -106 -63 -62 56 -95 152 -50 60
3968 60 43 -32 -15 -199 85 39 -55 92 -71 -279 -301 24 17 -23 -80 169 -152 -104 63 -56 -21 177 55 246
3992 246 -176 -11 -7 20 -1 19 -121 209 -374 140 107 1 432 24 -28 16 -50 45 406 -398 -14 -175 64
4015 64 -52 309 234 -145 410 -127 39 -819 -302 -27 139 -175 -172 -361 -307 172 56 90 -581 152 343 139
4037 139 -196 -267 -510 -411 -372 -203 -308 -846 380 60 -250 -223 -201 235 221 81 -149 165 -269 2 -31 241
4059B41J9k35k32L60n9l71K02J63j23K0j35J90n3p3K44j10j2m1Q3k13M3m9R4O9
4083B2r8K80j37o7q9l7Q1K29l60J29J10Q9j49l1P9j91J76j43J02J08r6R1n0R2
4107A40q3M1J98m86K57j11k8o2J77M0k17J72QQ6q3n3J05j20P1Mj73J49q1P6K1
4132D8r9K80j28j89K37j23p0J39k57N4R6q7J16N4j55j17J44L8J69j36j7M6j32
4155h9R3j6J08M2j28N9P9j13l1J49r4k01J6J97k27M63j59j74L1j8KJ3P8j66K11
4180A25J06k29j30K66k20P3jrn1j06OK66l02M06r7j79l88R8K14O6l1L85k64Kl2
4205b6l%J97O9l48R0%M7R1q2K7j76K92q9j56J70p8J01j94J42j22m0l9Q8J17k31
4231a53J39j07J14N1l3J1P7m5j7J10K17l45k9K04k2J01l23R8j51J93l15L5K69
$$ plain form
4059 241 260 25 -207 153 94 -277 -75 88 -35 -15 -150 40 -13 -86 158 48 36 -5 78 -135 -92 -141 -47 22
4083 22 -76 204 67 0 -89 -126 -45 184 -176 -47 63 152 3 -28 51 -140 36 -107 -5 103 7 98 48 140
4107 140 57 98 296 -190 67 -44 -72 -134 43 83 -134 38 46 132 49 -4 101 -19 52 56 -117 32 -49 27 48
4132 48 -51 229 101 -88 149 26 -44 95 -162 -108 -12 -99 17 71 -84 -201 -57 -19 150 14 -3 43 -89
4155 -89 4 -12 96 138 10 69 148 35 4 153 59 -142 -126 71 -156 307 148 -26 5 -13 -11 2 80 -86 125
4180 125 231 2 -128 138 -82 -9 -10 -19 -70 -176 -170 96 -206 200 103 -76 -464 -366 -152 -86 -117 268 4 6 -26
4205 -26 -29 -29 168 237 -111 -21 -21 26 117 35 62 -114 178 89 -67 103 25 126 -68 74 -48 -88 -127 -39 78 -153
4231 -153 -14 -121 -7 44 11 22 99 54 37 147 364 19 -10 194 172 273 -50 48 -103 90 -225 -190 79
4254G9q7j54K18J17l38K22rk46K87l43L61j61j56J41mO1j17R9M4J23l6r8j24R9
4278b2Q7j03o4L57k61p2P8n9N9J12l0K57l23j44Pl2J02r5J8R7k0J98K0l08J51
4303A0j98J07M6R6K22l18j13J82N7j28j04O2r4K05m0P0n9l6l58N26M9Mj14l54
4327b80MJ39L54j18K79k07m42j02P55q43L97j08K6J93m99P40k35k92M53j59q4
4348b9L53n09M38p03M91k56M91p17k20R52p70N29O8q63L79k9j8J89P4L49n9J98
4370C38m65p7K39J84k4J78p55J40L92L1m51M4M02o48K45J43K77L31q79L89k74
4391b40K83l48K05L96k98K84p3N3r1k60k1J54J04K6k59p4J06k10J78L45N6k69
4413D7l05M49j19j8P2K09K5r21Q23m03n25R49m64L99j48m57M14k30J18L72m80
$$ plain form
4254 79 -8 -162 56 173 -165 57 48 -198 89 -254 107 -54 -210 -69 -73 -12 -129 -30 14 137 101 3 -121 -22
4278 -22 65 -38 -102 255 -6 -78 0 -59 0 112 82 339 16 -128 -121 -153 -51 -146 -128 -31 -51 147 167 -141 10
4303 10 -188 -81 -35 61 283 -35 -148 34 91 -37 -141 -79 -173 32 -8 62 3 -33 -391 135 184 188 74 -280
4327 -280 -276 -137 217 99 378 171 -271 -373 382 -461 -64 -172 -146 47 -452 288 53 -239 214 55 -29
4348 -29 324 -185 253 -450 41 -215 276 -441 -661 291 -479 50 118 -745 -366 -395 -413 -224 -150 199 140 338
4370 338 -127 -204 35 219 195 373 -382 -242 150 181 -270 -226 176 -472 -227 -84 193 524 -355 34 -240
4391 -240 43 -305 -100 296 -2 282 209 262 171 -89 -110 44 148 174 -85 -159 -53 -263 -85 260 316 47
4413 47 -258 191 72 54 126 335 360 -561 262 -141 -666 283 -181 218 70 -387 27 -203 -85 287 -193
4434a93K99k06J72p9k08J93K7m32M44L5j37o3K68l14K41qj34J81n6J04k09K27
4456A52j99K11j51J18k83L72l59n6L99j93K59k74Nql16J82K06q0k15K03rR2l09
4479b53K72k08J62J27j70J40m4o4k91M92l17j48M96k51K92k46K83m14K43j1k8
4500F2Q7m02L5K44P1j60P5K5R9q0K89k97j75J31j88K06k44L15pj21N4l22O55k57
4524I5q4j55K38j96L94j91m69K74k54O19j81Q0K20l25L6k69O56l78J76q55N40
4545b9J48m24K89j44p3l7J43l62M10j22J11l15O93m62m39N20l14k30O82K33j070
4566g92R75k96n7L52m59L08k90R38o8q67l69M87m79J090m20N60J27r69p2R23n31
4587I1Q4J68r73J146p82N20l37P5q6k01J57p1J60k34N34m7m34K4o9L52N10r15
$$ plain form
4434 -193 106 -100 72 -7 -215 -22 5 -427 17 52 -85 -148 120 -194 47 39 -95 86 30 134 -75 152
4456 152 -47 164 13 131 -152 220 -139 -195 204 11 270 -4 1 -7 -323 -141 65 -15 -230 -27 -36 56 -253
4479 -253 19 -189 -27 100 -70 70 26 -38 -329 163 -154 -302 194 -57 235 -11 272 -142 101 90 62
4500 62 149 -253 -218 26 97 -63 12 37 136 56 345 48 -127 4 -184 22 -222 93 86 -35 19 -303 352 95
4524 95 11 -144 94 -102 292 101 -368 -94 -348 271 90 170 390 65 101 -168 488 110 286 -569 -29
4545 -29 119 -305 -16 -160 -233 -270 -127 -489 -79 -201 -90 -405 288 -174 -613 -93 -407 -637 45 278 -792
4566 -792 183 -113 -170 182 -277 31 -259 679 611 -256 -625 -138 -617 473 53 613 740 -229 -301 622 91
4587 91 175 343 -630 516 -266 254 -83 -8 -94 -295 -138 -209 -49 -283 251 204 -230 -206 -275 77 587 -328
4609c28N79p05O00J93P9k43r0p30J069p6n63o95N73M72j98M1k22J95K5J26k16
4630a14J50Q8k26L0nJ73l26K05K05M8m27K60j84J09n4R0O9p8j77K77P5n24L61
4653B5j88K26J20n5j03O9K01l23m0q5j3K15nP7n7J11m7n48L46P9k3o9J05J41j30
4678B9n8J75q6k80K57nq4PK45q4j0k09k7K60P9m20J98j05K60o1lj7j82K53q8m0
4704DK0J87m20M17j01j80j04M9J39Qn2J47rj74K54m11K41J7J29j19j73j20K78
4727B7r1j34J56j73L03n3k8j14J54k51L31k45n0P3R8K75k37n8P8K51k20k59N9
4750a08L7J34n6k82K12R5l50K97l23K93j64L06Q1k76J10N1j86R5k4O9J2k5M9K
4774D9j76K02q0j13K88l96K95k05K64N6r0p5k0R0j86J11j36M67k15l64L57Pk29
$$ plain form
4609 -328 251 -454 146 339 418 175 85 -645 424 348 -215 -910 -337 135 -63 -22 -244 -49 -24 102 -114
4630 -114 36 124 -102 -72 -77 96 -230 -25 180 228 -199 61 -123 -14 -68 22 91 13 -164 113 188 -336 25
4653 25 -163 63 183 128 25 94 295 -28 -68 -153 -166 49 44 121 64 175 128 -420 -74 5 -18 -87 18 159 29
4678 29 -29 146 60 -220 37 32 -52 -45 200 116 106 -103 -130 130 209 -211 -13 -118 142 81 78 61 -121 132 44 4
4704 4 24 211 -209 208 107 -73 -177 -128 11 19 -33 114 105 -69 185 -226 15 32 161 42 -131 -251 27
4727 27 -64 -198 -42 -215 88 35 7 -107 47 -204 127 -118 -168 -95 3 278 41 -17 61 312 92 -167 -108
4750 -108 -71 63 7 -275 -63 32 -318 -21 -344 -51 -215 91 172 -104 6 57 -129 -34 -58 11 23 -2 47 49
4774 49 -127 75 -5 -118 170 -226 69 -136 128 184 94 19 -1 89 -97 14 -122 345 130 -234 123 130 -99
4797i9K36l45J32j1J46m5qk9J60l77K67Jm0N3l68M02r8L1k34j9K77j00rk9K36
4822A30n1o3J61m22K27K2m2N0J33m9j21j12K00J15k17J54j70J38j8L2j67J5j12
4845a67K82l8J94m60Q4L05k14L2l19L06J73m42K45J83l10J24N7j92J43J7M6q9
4867d0o3R0k37L62J70j63j47o4K39j54q9J81K73k12qk83K10nJ10k09j33P1K1o
4891h6j0J97j06J4K09l15k6L7p4J77l2K5n5J45l9j59J62J47l70J95m9l28K73K63
4915A95l9M1j54L6J42L5q7l36M8K27J76n7k58J18N55p86K16K50l94l42R13q43
4937c44M17m6l2k35J63k3j088J144j141J407n33P77m53M67j050O02L6o26M45k5
4957a38j01M5j95L21k57R8Q4K53J54q04Q01k11RK09j24m8k68J55L46o32L97k03
$$ plain form
4797 -99 137 -208 -76 -87 59 14 6 -23 137 -240 27 28 -12 41 -327 75 -23 8 -226 -245 32 -68 -77 -106 130
4822 130 79 16 177 -245 -18 4 -38 12 145 96 -25 -137 63 178 -39 115 -55 83 65 97 -70 -55 -167
4845 -167 115 77 271 -189 -105 200 -14 18 -301 5 178 -264 -19 164 -146 -22 35 -157 -14 3 49 -40
4867 -40 -103 -13 -250 112 282 119 -28 -92 147 -7 -96 85 358 146 138 -145 65 60 170 -39 -172 -101 -80 -86
4891 -86 -96 101 -5 9 218 -97 -123 -86 -160 17 -15 10 -45 100 61 -98 64 211 -159 36 -13 -341 -68 195
4915 195 156 197 43 79 221 256 169 -167 -119 108 284 227 -31 87 642 -144 72 322 -72 -414 499 -344
4937 -344 73 27 -5 -240 -77 -100 -1188 -44 -1185 222 -311 466 13 480 -570 32 68 -558 -113 -138
4957 -138 -239 -194 -389 -68 -325 -227 -143 110 264 -540 261 50 59 268 144 96 -172 -17 329 -303 94 -109
4979a09n9N28p40N51m77q9N12j13J5k41N52o34k3K48j58P53n75K85n4K40o25J18
5001i5J29J16r18O14J7J48k67L16r3j47K74J21qj47J06m3L6j13p5L7L18k01k24
5024i9K48j77P4k00M94k60m8j2O7k12K7J61J87k67K13k60k7R4r2J87q5J36k71
5047a22K6J26O1k80K67j03J02m4j17p8J01K94k75J37K3N1m56K07K02j25J27j96
5069g2p2J61j21j94K85J3p8J32j06K94k08l38M9L31j88J50q3j54L46j1k50K60
5091A46J45m52J76j84K52m7q1P1nlk2o1j87L45j26Q0Q4M5k83J16J24k32J84l1
5115E4k02L2K48K04m10M2Q2j66R3J42j23l5J06p1QJ18j71Q1oRK05l3q3j31P5N4
5141A22n5%L1j88K11k66J9J12R1j09QJ04k39L21k61k37M42j11N6j17j22K31mj18
$$ plain form
4979 -109 -168 360 -380 171 -306 -395 117 4 19 -222 330 -304 -327 -79 -237 516 -59 226 172 412 -213 -95
5001 -95 34 150 -768 -154 -137 11 -256 60 -33 -180 94 215 207 60 166 123 159 46 -29 8 326 125 -99
5024 -99 149 -28 46 -154 340 80 32 20 87 -125 -98 63 250 -17 196 -64 -91 3 -89 98 13 149 -122
5047 -122 -96 30 91 -189 78 -25 77 33 -84 -162 -61 233 -42 95 118 169 -287 -80 122 -3 124 -72
5069 -72 -144 17 -104 -298 -13 0 -78 54 -52 242 34 -304 -255 76 -112 38 -45 -199 147 136 -114 146
5091 146 291 -161 15 -169 83 36 -45 26 21 18 -4 -65 -252 93 -33 47 131 176 -107 9 133 -99 85 54
5115 54 -148 -116 132 336 -74 -32 50 -116 -23 119 -4 -39 67 -4 4 122 -49 32 26 35 240 207 124 -7 68 122
5141 122 67 67 98 -90 121 -145 -126 -14 77 -32 -24 80 -159 162 -99 -336 106 -5 51 -66 -188 43 39 -79
5165g9J95q0K28k74K4l2J29o0J67k58o8KJ48j2j55J63J18l9N0j42m2k7O8J56L3
5190B13l38K49j00l45L37J01j79J04j44M0m7J42p8j09K69k16q3K91L4k5j00r1
5212g5L0K03l19M38l47r7L25P4r1l32L31j61n7J05J11k72J23j90L13k57j2K05
5234D8jj53R9L9Q0J38l59J87j33Q1K2PM6M0k6Qk36j45K77k06m5J3J72l63P34K8
5260C52O0o7j73M69r26N81L31n01R8l67J79O1j20K89q8l01K06o7j28J17Q9j15
5282b1J30j93J97M2p4j00k49J77J85M4k33J34l11L2K31K01k14K09j83J57k51l4
5304a24J06K58l01O1J68J90k82l0j74M7K57k70L8J01j35J44R9K2O5l15j11L28
5326A42J4M6k9l17L11k3j58p8N6J84l02K13j19M3P1j6j39rR5J11l8k6n0K28o8
$$ plain form
5165 -79 116 36 264 -10 14 -18 111 51 218 -40 -108 -106 42 30 -125 38 156 117 167 25 -17 -44 24 180 213
5190 213 -125 124 24 -321 16 117 -62 42 -102 -62 -109 33 -45 -154 115 -101 -184 107 141 116 16 -75
5212 -75 -45 158 -161 277 -70 -167 158 232 141 -191 140 -21 -78 27 138 -134 -11 -201 112 -145 -157 48
5234 48 47 -106 -7 32 112 250 -109 78 -55 26 48 55 101 141 115 123 -113 -258 19 -187 -232 -219 -47 -410 324 352
5260 352 412 345 172 641 -285 296 627 126 224 -143 36 97 -23 266 178 -123 83 16 -112 5 94 -21
5282 -21 109 -84 113 155 81 -19 -268 -91 94 138 -95 39 -272 -240 -9 192 -22 187 4 161 -90 -124
5304 -124 -18 240 -61 0 168 358 76 46 -128 -81 176 -94 -56 45 -90 54 153 175 240 -75 -186 142
5326 142 156 202 173 -144 167 144 -14 -92 -36 148 -154 59 -60 -17 54 38 -101 -110 -15 96 58 32 -18 210 142
5351A42J31k78j4J97k84L6K31p3k01N1J60n1L6l7J7J11jj59Qm8o7K60j54J35l4
5376A14r7R2k2k14K7Q7J23j35K30j37O4p6p9k17J30K33k49J02J2n7L5L0M8K7K28
5401B99l32R5j92L2j13P1P9l8L6J60L8k00N6J11j98J42j61J95M9r4j5K59l23J
5425d3J2K8R5j08O8j70J17N5M2qk44M77m94r3M16k02o1J45J66m16L94K8q0O6j83
5450Gn5j64K51j1j63Q8J01L0k71K57J17k22No8J75r3J27qo6J04l36L23k63K84
5474A49j90q9N3L03l24J47K47l75P0k16K09pj8pK4j67QK48n4j31L26k60J58k18
5498a14K43J40k81K5Q3j60Q7M8J04j59j40N7O0R2N6k10L5K4L3K5k52M9K84j01
5522B8J6k08L13k20O8p4L96Ok90K41r6r5k38L11l5m8Lj43J10j23M8j7K2j66J97
$$ plain form
5351 142 273 -5 -19 178 -106 -70 161 88 -113 -62 98 47 83 46 63 174 173 14 22 -26 -93 167 13 148 114
5376 114 17 109 87 -127 -100 -13 110 -25 205 68 132 56 -23 -240 -110 123 -126 -24 -12 -69 -34 -4 44 71 299
5401 299 -33 62 -130 -98 -211 -140 -61 -99 -63 97 135 -65 -9 102 -96 46 -115 80 129 35 20 279 -44 -43
5425 -43 -31 -3 92 -16 52 -118 -1 54 96 88 -156 321 -173 -266 150 -52 -113 32 198 -218 176 204 124 190 7
5450 7 -48 -212 39 28 -135 -47 54 84 -187 70 187 -35 -30 -98 77 -16 111 103 37 141 -195 128 -135 149
5474 149 -41 -130 -77 226 -98 49 296 -79 -9 -225 -16 -23 -41 -48 -24 -191 -183 65 11 -120 206 -54 104 -114
5498 -114 129 269 -12 13 96 -64 23 71 175 16 -124 -67 -7 85 141 -69 -34 -10 23 48 -204 -155 129 28
5522 28 44 -164 149 -71 -3 -77 319 325 35 276 180 85 -153 158 123 75 78 -65 45 -78 -30 -47 -25 -191 6
5547Fj96K49K45m95M12l79Q7J35J14k19j99K05J34L5j76K64k65j02n4K43j50j78
5569b84L18p4K93j68Q3jL5k77L59m08J2J95L6m46L22KnK17l49L67j65n5K40l18
5593g1J63m1p7J83j26j11J70j12l6P9k07J54J71l79K24qK21k08m7%J22j19r1l6
5617a82K52L7k74N3M4m7K68l89K60j37J84P6k02K07O5K2j97M0l9k2q6J58k81J42
5641d8J7J25m0J64l58K27j84L14k33M3m6J9J69j73j1J98j39j4K63l80Q7K06k89
5664h3K54j11K89l21L16l61j69L5J89m2M7n3M4j01K00j29lK03r3jk85J9K09j27
5688g4l7P5L5M3k27M12j23J9k86m4K57k42J86K0k1K30l97K2R9K9j83J18J7O4J7
5713Ij06j98J11J12J97q4j70o7K62j42J50p5jQ9j24J93j09j50L4K8kJ12k84R8
$$ plain form
5547 6 -190 59 304 -191 221 -158 -71 64 178 -41 -240 -35 99 134 -42 222 -43 -145 -199 44 -106 -284
5569 -284 34 -40 253 85 168 167 202 -75 284 -124 -112 83 119 -327 -5 -3 -8 209 -140 227 62 7 247 -71
5593 -71 92 51 -26 157 31 -80 90 -22 -58 21 -186 -32 139 -240 -16 -24 197 -11 -58 -58 64 -55 -146 -182
5617 -182 70 107 -167 -114 -70 -117 151 -238 22 -115 69 145 -57 150 215 237 40 80 41 19 -67 91 -190 -48
5641 -48 -31 94 54 218 -140 87 -97 217 -16 27 -19 0 169 -4 -15 183 44 30 293 -87 0 206 -83
5664 -83 171 60 349 28 344 -17 -186 -151 38 -4 43 -10 34 -67 133 4 1 204 111 110 -175 -156 53 -74
5688 -74 -111 -36 -1 42 -185 227 104 123 -163 -207 50 -192 -6 14 -7 223 -174 -152 -53 -24 -207 -89 -72 -8 9
5713 9 -97 -295 -184 -72 125 41 -129 -196 66 -76 74 -1 -2 87 -37 156 47 -103 -69 -41 -43 69 -215 -117
5737a17K09k89M0K16k89M58k88J39K6j09K63l44Q0J08l4O1n05M57lR8l83K28K71
5760B93j46k81J42p3k6K13j86K21j99j92L05j35Q1L8p9jl6K08l00J26N7k39K12
5783CN1r2JJ05O9k13l00L67Q2L2j69p6L55j72q7M0p3m0L0Q0q6L5J3jP1J36j89
5810b8j92P3L6P0L2K52q4j81j11J39j8J09n8PR5o9j83j07J45J10O5j42r4L16j45
5835C7r3K54k15j15Q7n2M8J5l9n0o8M27l80P8r1K36q4q2J27k55K12k75P2J82n2
5860g6K19m5l2j00q1K49k69K11Qj21L06j55m9j16K6J8J50l25J59K53m33P2P9J06
5884E4r0n5o7J06M7L9po0N6r1O0j83J67N8N7k11J32O3l3o1j33J16J19j22Jj66
5910b04N8Q0J04Ll01J46L1K53k96J96j16Q8n9j33L30q6Mj97J48k4o4q8O9J43n9
$$ plain form
5737 -117 92 -197 -157 59 -230 228 -60 79 105 -4 259 -85 -5 103 69 130 -375 82 79 177 -206 22 293
5760 293 147 -134 8 -65 -91 122 -64 157 -42 -234 71 -64 17 55 -24 -25 -61 147 -153 -27 30 -209 3
5783 3 54 -38 -37 68 137 -76 -376 -9 73 105 -64 -140 215 43 -44 -4 -77 -117 -87 -7 -93 -58 -45 -46 25 161 -28
5810 -28 -220 -147 -111 -41 -9 243 159 -22 -133 6 -12 97 39 46 141 72 -111 -218 -73 37 102 -40 -134 182 37
5835 37 -56 198 -17 -132 -45 -97 -49 -34 -73 -123 -191 236 -144 -66 -157 79 -5 -87 40 -215 -3 -278 -206 -24 -76
5860 -76 143 98 66 -34 -115 134 -135 76 84 -37 269 114 65 -51 -25 -7 143 -182 -23 230 -203 -131 -52 54
5884 54 -36 -91 -158 -52 -5 34 27 -33 23 -68 -8 -191 -24 34 91 -120 12 75 42 -19 -152 -36 83 -39 -38 -204
5910 -204 -146 -66 38 41 -260 -114 -83 170 -126 70 -46 42 -17 -150 180 94 98 -99 49 25 -39 -127 -58 85 26
5935B6j71J70j91L44j27j59n4R5j64K97j4j27J64O5j76K16l73Q9J61l9NJ26j07
5958E6p9J09j01p7J27k5n2J66p2l3r3K04j02l9n2J81k61P5M8lJ07K5j13J33j06
5983B3q9K3R4J86l36K89l22L44r5j17j34Q5m5q9K34n6j00K42r8j76J70O4j17k26
6007b46L84k12l3J43k49L22l7m3J56k83p9L41j17q1j3mL16j77r6L5l8n7j26J96
6031BQ9n6N4M4l93J60N8P0Q1M3j90k2J47r5p6J79j71J62j8M6j65r0l1K01j9j82
6057a72K21KLj61N09l47J96l22J14K17l43N7R8k23K41Q6m9O9k53J23l29K47O8
6080E2K8k25j5K2K48r5J33rn7j00k1l9n0M36l72N6Nj09J0M12k36k45P1L12m29
6105b17L06P5m7k51k6J19J03l9l5o2L28l17M5j5Q1j68R5J61p2Q0j60J88j85KJ5
$$ plain form
5935 26 -145 25 -166 178 51 -108 -162 -67 -231 66 52 -75 89 154 -22 194 -179 -90 71 32 37 163 56
5958 56 -23 86 -15 -92 35 10 -42 124 52 19 -74 130 28 -11 -63 118 -143 -68 -20 -23 84 109 -4 129 23
5983 23 -66 -43 51 237 -99 190 -132 212 117 0 -134 -49 -94 -183 51 -5 -105 137 39 -137 33 97 -20 -246
6007 -246 138 -74 -107 36 -213 109 72 29 185 -98 -177 164 47 -34 -47 -51 265 88 -8 27 -11 -68 -194 2
6031 2 91 35 89 133 -260 -100 -42 28 109 152 -38 -60 87 -8 -84 95 -76 86 68 114 -51 -141 -172 29 10 -172
6057 -172 49 51 54 -107 402 55 251 -71 43 260 -83 -26 72 -151 90 176 127 196 -57 66 -263 -16 52
6080 52 80 -145 -160 -138 110 15 148 139 82 -18 -39 -78 -128 308 -64 -8 -3 -112 -102 310 74 -171 -100 212 -217
6105 -217 89 164 117 -134 -160 -41 62 23 -12 -74 254 -63 -18 -33 48 -120 -25 136 64 144 -16 172 -13 -11 4
6130DJ86j19J40k63J25j0J79k08j13K22j75K50j81q3J06n4L2N4J59k30j70J45
6152dj63m7Q1q4J01M1J14J92k25oL5j93Q6K42q7K48k21k98K11m8j63K35p3o8N4
6177d0p1P0P2J68l23Q1J49p4r6J69k07lJ44J13r6j44J81K8J58k04j92K50o4O6
6201A35q6J51j00Np1k6k8N6j74M05k97m7K50l21J46J3j17Q6p1K69k30J39k74M78
6225B91j41q4k2P5r8j3P9Q6l07J49m1M4K2k29R9J1j1l2P2%j29K16j2j92K38j54
6251h3J1R4J30j42m3j8n7L9n1L2q2O8P1OJ24l68K91j36r1O5N9J49P8m4j99J23
6277B6j84K48J8l56K64m5r4P6L4R1M8N6l28K66k82K61L4j79J65l04L0K09j21o3
6301a30K15j54L75k45j4j7l05L15J09k04q4R8K59q4o0m3l0j5Qj0q9j02K86O0K3
$$ plain form
6130 4 190 71 211 -52 73 63 242 34 -79 143 -32 218 37 -46 60 6 38 92 251 21 -149 -4
6152 -4 -167 -214 -133 -217 -116 -75 39 231 6 0 35 -158 -72 170 83 331 110 -188 23 -25 -188 47 -26 -94 -40
6177 -40 -111 -41 31 199 -124 -43 106 32 -64 105 -102 -105 39 152 56 -88 93 121 279 75 -117 133 69 135
6201 135 49 200 100 105 34 8 -20 36 -138 267 -30 -77 173 -148 -2 11 -106 -20 -91 178 -52 87 -187 291
6225 291 150 66 44 119 21 8 87 173 -134 15 -26 18 40 -189 -90 -79 -90 -122 -50 -50 -179 37 25 -167 71 -83
6251 -83 -72 22 152 10 -33 -51 -108 -69 -120 -88 -170 -102 -31 -25 99 -269 22 -114 -205 -140 -81 68 146 102 -97 26
6277 26 -158 90 108 -248 16 -29 -123 -47 -13 78 126 182 -146 120 -162 99 133 -46 119 -185 -155 54 -67 -130
6301 -130 85 -69 306 61 47 30 -275 40 149 -55 -139 -41 218 134 74 31 1 -14 -6 -16 -105 -207 79 139 162
6326A62k44K01M1k20J66j81L32j59m6K49l95LK35j6K65l38l2o2k9N8J11j28n0
6349g7O5j8J40k22K06k21J90Nk46L08n3J6PR8m2k37J48O3j08Q1Pj94j03K01N2
6374F6q8J36k8n4j28J34M1r6J43j43K6J44k84K40N1r0m9P5mk41j8J75K8j27K0
6399g1p3J07j4q7J00J68k22K6j10n3L16M1k40j29J65j0J08j29lJ25j07j22L15
6422A01k45J22J60m1m5l40K69M4J24k70J90k50L01j84j34K04J17j67J39k16J7
6443a04j24K09O9J60j66nL4k1N9k28K64j85K20k49L60j18o0n6J61M3l05p3kK05
6467H8k69M37l90J53j20l37O34j58J69j09k15J25J3R0l80K65j09j11L12j35n9
6488a06J52j32m1J13j36q8J44k77L79q7m9L87l64j9PJ1K18o5j0j90J06M18o36
$$ plain form
6326 162 -82 119 160 -60 106 -75 257 98 52 301 -94 -91 144 128 393 55 23 -39 -68 -10 101 -27 -77
6349 -77 -12 -30 110 -112 94 -127 63 68 -178 130 77 93 100 198 156 -81 67 130 22 103 110 -84 -187 14 66
6374 66 -22 114 86 32 -96 38 79 -17 126 -17 9 153 -131 109 160 70 21 96 92 -149 -167 8 36 -91 -71
6399 -71 -144 -37 -51 -138 -38 130 -92 -66 -176 -229 87 128 -112 -241 -76 -86 22 -107 -110 15 -92 -214 101
6422 101 -144 -22 138 97 52 -288 -19 25 149 -121 69 -181 120 -64 -198 6 123 -44 95 -121 -104
6443 -104 -228 -19 50 210 44 39 73 52 111 -117 147 -38 182 -67 293 175 115 59 220 263 -42 -115 -117 88
6467 88 -181 256 -134 19 -101 -438 196 38 207 98 -117 8 21 111 -269 -4 -113 -224 88 -47 -106
6488 -106 46 -86 -127 -14 -150 -238 -94 -371 8 -79 -128 259 -105 -124 -117 -106 112 47 37 -153 -47 371 -265
6511b65M45l39R3J98k13K19j96j07R4K9O4j23R5j50R6J19J64j45l8L02l94L73
6533C21l96Ln0J59k87J86J64k30M02k41N9j33L2J1j34J10l8K93j31k19j16K76
6555D1l1j71o1M6L46l09n1L70l28K62k31Q0j05k0j05P6L35k4j08K33k23p1J39
6578I0l2j1r6Q4L02l14P9J31q8j01J18j53K1o7M7J65n03L97j05m0o6L11l4j86
6602e1k10K81L4L4N9k51K03l4J06l55K58r8J88k56j3O1P2k01J73j10J80K2j22
6625c0J16J46l52J83o6k0J33j20J96l57L68k29j47K23j78J35K5rR7L0k28K60k00
6648b4R2j25MJ1J84J5k85J41j15N4J91l52J38nJ77j7P4k36J01k29K56J31l56J54
6672b1J81j77M4r9p5N9j15J84p2J09Q1J2M5j68R3k31J08k0j01J72M1r2j54K53
$$ plain form
6511 -265 180 -159 -66 132 -81 138 -58 -165 -71 -42 22 -101 -6 -156 -60 59 223 78 40 342 -52 321
6533 321 -75 -72 -122 37 -250 -64 100 -130 272 31 90 -43 -11 0 -134 -24 -62 231 100 -119 -235 41
6555 41 10 -161 -222 -176 170 -139 -190 180 -148 114 -117 -37 -142 -162 -267 -191 144 120 12 245 22 -49 90
6578 90 58 47 -49 35 337 23 102 233 145 44 162 9 30 -37 10 175 -328 69 -36 -76 -142 169 135 -51
6602 -51 -261 20 54 88 147 -104 99 65 171 -184 74 -24 164 -92 -105 -44 28 -173 0 -110 70 92 -30
6625 -30 86 232 -120 63 -3 -23 110 -10 186 -171 197 -32 -179 44 -134 1 26 17 114 144 -84 176 -24
6648 -24 68 -57 -53 -42 142 157 -128 13 -102 -48 143 -209 -71 -76 101 84 158 -78 23 -206 50 181 -175 -21
6672 -21 160 -17 27 -72 -147 -88 -203 -19 -91 18 99 111 156 -12 81 -150 -42 -62 -163 9 50 -42 -196 57
6696E7P3M0j44J25k69J55N2J90m80K48j60J28j64J80K37k93J38o4j87J4J85Q3
6718A44j02j44K39j92O2M7l7J91j34j61K28J1r6k08m7J75J13k58P7J31j19L0K76
6741B26l78J86j56K82k8l35M00j07j13J95k62j65L68j19l9J29m1J22m19J12K09
6762F7m4j13J97j39J46l0j76J24o7J52l34K42o3N3j63K61j78k32K72j50K02k53
6784b26L05J23j21k27J96k01q0J46K52k86K59m14K76p3J05r5K6L6J33j21J48J33
6806B94k07j96P8J48j52J17l2J71j84l2l33L26J64M2j39m15L99n1J04p3j22N5
6828c8l5K96j40m03M49j15j32j69K09Q0K6K7K8j65J75j39J59j6k79L54q9J03k7
6851A59l08J15J13j20N8j71J49L8j52J84j52J71k57J57nJ14j70M0K56k74NL6K59
$$ plain form
6696 57 130 170 26 151 -118 37 89 279 -201 47 -113 15 -149 31 268 -25 113 49 -138 -124 61 144
6718 144 42 -102 137 -55 7 54 17 208 74 -87 141 152 56 -152 -199 -24 89 -169 -92 39 -80 -50 226
6741 226 -152 34 -122 160 132 -203 197 90 -23 172 -90 -255 113 -6 -45 84 43 165 -254 -142 67
6762 67 23 -90 107 -32 114 84 -92 32 -35 117 -217 25 -38 15 -148 113 -65 -297 -25 -175 27 -226
6784 -226 79 202 81 -146 50 -151 -231 -85 167 -119 140 -274 2 -71 34 -61 -35 1 134 13 161 294
6806 294 87 -109 -31 117 -35 82 50 221 37 5 -328 -2 162 204 65 -350 49 -2 102 29 -93 -38
6828 -38 -73 223 83 -320 129 14 -118 -287 -78 2 28 55 83 -82 93 -46 113 97 -182 172 83 186 159
6851 159 -149 -34 79 -41 17 -154 -5 33 -119 65 -87 84 -173 -16 -21 93 -77 -37 219 -55 -50 -14 245
6874B45j27j43J17l4J03j51p6l3j25N01j28k26j2L23j13j82j5j05K87k01j38K24
6896iL8J01j70M3k8j15M59k27j04Rj79L05j55j19K91j58J94l08K53j33N0l6j50
6919a48J29M0j35L32j59N8k5p0Q9J63J74l22j5o7j40j4J54k46L21o4k7K54k72
6942A0r7K03j14p5K12j33Jr7P4j09J31j30R6J30K3k28K4J63j28J13Q3l06L8M4
6966g2j41K16j68K83j48K3N8k27K50K35l70NK3k0J33k16K41l4j44r5M05l08j38
6989b09K16p7L18l68L34j24P3K5j26oLj02rJ26p9K61l31N2J02j07j3J54k69L9
7013a17J89j28K8K47k42j48J44L34l08R7j06j38J03J0K9R5J73j41j31J33p7J03
7035A49k08M4N3j97K18k38K39m65M75k8J63j34r2J42j51k4L47k03P3n9j17R3J64
$$ plain form
6874 245 118 -25 92 58 161 10 -66 -99 -224 277 149 -77 -89 234 121 -61 -76 -181 106 -95 -233 -9
6896 -9 29 130 -40 3 -25 -140 319 92 -12 -3 -182 123 -32 -151 140 -18 176 -132 121 -12 38 2 -148
6919 -148 -19 21 -114 218 59 117 92 22 111 274 448 126 111 44 -96 -110 44 -202 119 55 28 282 10
6942 10 -87 116 2 -73 139 6 7 -90 -16 -125 6 -124 -28 102 125 -103 -79 84 -44 69 152 -154 -116 -72
6966 -72 -213 3 -165 118 -30 -7 51 -176 74 309 -61 -56 -33 -53 80 -136 105 71 -73 -168 237 -71 -209
6989 -209 7 -70 248 -120 214 90 163 188 62 56 59 -43 -52 74 -5 256 -75 -23 79 -28 -41 113 -156 -117
7013 -117 72 -56 -28 219 -23 -171 -27 307 -1 96 -10 -148 -45 -35 -6 89 262 121 -10 123 46 149
7035 149 -59 -15 38 -159 59 -179 60 -405 70 42 205 71 -21 121 -30 -54 293 90 163 104 -13 80 244
7058B44m74K53r8q2L46m7j31m8J70r6N1j07K3m7J3J12j06p4L5j53K57j12N5P9
7082F3j93K08j53n7J59r9K12k81O7r4M43l38J21k0LO6j43J19k25J81k80J67K22
7105A48n2k40K04n0M9m4K63k73j48P6J58m0K5k64J40qL65l53k22K97m1p8n8J42
7129dl6J81k55K17Q2p2m5J50j77J18k37J13Q9L1j47n3Mp3J05k18K31k42L30K6
7153A18k21j56K31m7J72k83O5J15K2pj3Q7j36J42o1J42J24m53J80j37k7K58j86
7176g1R7%j30R6r8j1J42Jn5K0k9j75J14R6J26m6j95P1o1N9m8Q0q0J8o0J62j57
7203a34J31j0J72K9k28j33J85O2J36l60K85K0n0k44K22n2j42M7j49L34p2K08j43
7226A14m1K6Mo5M5j8k73L0L51k91M9J24n4J41k82LJ65k28l4L63p4j10J35n4j9
$$ plain form
7058 244 -230 23 -75 -157 189 142 11 -37 133 37 88 -19 4 -43 -30 82 -24 -98 -63 -216 41 -71 -16 63
7082 63 -130 78 -75 -132 27 -72 140 -141 -74 -168 275 -63 58 38 41 107 -36 83 -142 39 -241 -74 148
7105 148 96 -144 60 10 59 15 278 5 -143 -67 91 51 76 -188 -48 -56 309 -44 -266 31 -10 -88 -146 -4
7129 -4 -40 141 -114 103 185 113 68 218 41 159 -78 35 124 155 8 -45 -41 -114 -9 -227 4 -238 92 118
7153 118 -103 -259 -28 -75 97 -186 -121 -6 16 9 -4 83 -53 89 28 170 294 -159 21 -116 -143 115 -71
7176 -71 26 26 -104 -8 -106 -117 25 26 -29 -9 -38 -213 -99 -3 123 77 -118 -47 -108 -49 -97 -17 -97 -79 -139 23 -134
7203 -134 -3 -13 159 188 -40 -173 12 74 210 -150 135 155 105 -139 83 31 -111 -64 -213 121 49 257 114
7226 114 73 99 103 38 83 65 -208 -178 173 -118 -69 55 1 142 -140 -137 28 -200 -234 129 55 -55 80 26 7
7251GJ42k84l1J52m4J33p5j41M1OJ36N0m5R7k47l4K23j41L7k33K82J47Nl15J71
7276C9J04k30lQ4n1Q8L8j23K48j20o6J84j14Q8m4r4l2r5J12j47K59j52%J1L0k53
7302b39K80j5j66K80j59k27K09J2k53J88J74j41QJ47j34K3r3j08M38l72L45qk80
7325i1K12p5j01r6J98j13Rj55J43j2j8K22j80M3k00L86K8P8l54k5M2j56K2J97
7349DM9j3M8j42J41l11j12K30J76j09j68J44J4k5J55k52K54k42K25q0J09m61K35
7372a31K18J39m51M14k36jq5O53p06O47k50j92J09k9Q3k78J69k91J97k04J85J52
7394A12n9r2M5%N6k3o2j3P9J13Q8j37r0n4k83L82mp5J70J8q7k13J13k6K3m6l6
7421a01L19j57J45l6R4k70m4l8R2j24K77j86K9m1%J30K4l3j82j13J73M2p7R2k24
$$ plain form
7251 7 149 -135 -166 -14 -58 75 0 -141 -100 -94 42 92 47 144 -103 -137 86 -55 -18 -251 31 178 183 -132 39
7276 39 143 -87 -90 -6 -57 31 69 -54 194 74 8 192 78 166 122 28 -4 -99 13 -134 125 -27 -27 -16 14 -239
7302 -239 41 26 -140 140 -19 -246 -37 -25 -278 -90 84 -57 -49 98 -36 -13 -106 -214 224 -148 197 189 -91
7325 -91 121 46 -55 -151 47 -66 -57 -212 -69 -81 -99 123 -57 -14 -214 172 200 278 -76 -101 -59 -215 -193 4
7349 4 53 40 88 -54 87 -224 -336 -106 70 -39 -207 -63 -49 -74 81 -171 83 -159 66 -14 95 -366 -131
7372 -131 87 226 -225 189 -47 -48 -133 520 -186 461 211 19 128 99 182 -96 73 -218 -21 -225 -40 112
7394 112 53 -39 6 6 62 39 -23 -36 43 156 244 107 17 -37 -320 62 58 -17 153 171 84 -129 -16 -42 -19 -65 -101
7421 -101 218 61 206 170 264 -6 -50 -88 4 -120 157 -29 0 -41 -41 89 113 80 -102 -215 -42 0 -77 15 -209
7446b09j3J37J66J3j56p1J70L0j97N5q2L10L7l18L91k69o6J45p2J30j95m9p2j08
7470b93M50K6k04J13j07J19l3j21j07r8K51m8O4j12J35p3J28j55j62M61k72j8
7492e6M9%J93j25J35k56j6L27k66k0K57k07No1J57j95K24j69l1M02k76j0j30J09
7516D0J25k31J19k9P5j62J36k21N7R0k18J68j93K63l44N8J76k2J03J4J50m30K72
7539dO2M3o4m02N75k58K40k30J68j16J2R7k06j9J63j25PR4M4j39K48r8l26K02
7563c2j40K73j78pJ53j23J08j0J54l10K56j58J39k33J63K12l12N1J06J7j92j16
7585a79L32k57p1K76n9J87k76O8K13k52j77J03M8j04J12L20l19j47j9J24KJ34
7607E9M3q3j3K6j77J20j14J66j68J05nj09L39Q9m29Q4q7J25j42p2L29k90N5K67
$$ plain form
7446 -209 -222 -85 81 94 -62 -133 37 67 -130 -75 -157 153 190 -128 263 -6 -72 73 1 131 -64 -113 -185 -293
7470 -293 157 183 -21 92 -15 104 71 -50 -157 -255 -4 -52 12 -100 35 -38 90 -65 -227 234 -38 -56
7492 -56 -7 -7 186 61 196 -60 -76 251 -15 -35 222 15 20 -41 116 -79 145 -24 -55 347 71 61 -69 40
7516 40 165 -66 53 24 99 -63 73 -148 -91 -1 -219 -51 -244 19 -325 -267 -91 -113 -10 4 154 -276 -4
7539 -4 58 101 37 -365 210 -48 192 -38 130 14 26 123 -83 -102 61 -64 -57 37 81 -58 190 92 -234 -32
7563 -32 -172 101 -77 -84 69 -54 54 44 198 -112 144 -14 125 -108 55 267 -45 6 112 129 -63 -179
7585 -179 153 -104 -175 101 42 229 -47 21 234 -18 -195 -92 -44 -148 -36 284 -35 -182 -201 -77 -75 59
7607 59 102 19 6 32 -145 -25 -139 27 -141 -36 -41 -150 189 278 -151 -67 -154 -29 -171 -243 86 -204 -149 118
7631A18m4k9R0k64L77m21J75Q4l4k18K20n1j94K21P4Q9j86k5J01J9K4j18L3o1
7655b0l2N9J2o5K48p7j75j05J75K4M8K7j94L17k72j48J33q7J81pJ33j94R2j17
7679d4j18L33J31l01nOj59Q0K1N5R1k47J56k63K74kK4l1P5J9j28r5O1J20j25K55
7705A83j26j31l9J35R9k6j32l6R9j2J81j63K8J85j82j05J4J72j09n7j20O9J50
7728G7o1J48k28R7K0j23N9J69k39k8J09m0J65j32O9l2K0P8j05j96K40j08Q6p7
7752c2J19j49R1NQ1n3m04J39K46J27k17l2J69J44j44M1j39j44L81l54K81J13n25
7775b56L33j48m8q9K10n8K06l44J00P4j9m8K0K71j58n8mJ37k22J18oJ86k93k3
7799a19R5L8j06j5J66R8R8m23L44k96L00l53o2L03o2j58K49j27J47k0J6lN2k31
$$ plain form
7631 118 74 45 135 -129 248 -173 2 86 52 -166 54 3 -191 30 104 193 7 -18 83 102 126 8 41 -20
7655 -20 -52 7 19 -46 202 125 -50 -155 20 44 92 119 -75 242 -30 -178 -45 -132 49 42 175 -19 73 -44
7679 -44 -162 171 302 1 -4 2 -157 -77 -56 -1 90 -157 -1 -264 10 8 32 1 76 95 -33 -128 -67 53 -72 183
7705 183 57 -74 -113 22 121 95 -37 -73 26 14 195 32 60 245 63 -42 -28 144 35 -22 -142 -73 77
7728 77 16 164 -64 33 53 -70 -11 158 -81 -109 0 -40 125 -7 62 30 50 128 23 -173 67 -41 45 -32
7752 -32 87 -62 29 34 115 62 -342 -203 43 170 -47 -79 90 234 90 131 -8 -152 229 -125 156 269 -256
7775 -256 77 -71 -119 -208 2 -56 150 -194 -94 -20 -39 -87 -67 204 46 -12 -16 121 -101 17 11 197 -96 -119
7799 -119 -24 14 -92 -107 59 157 255 -168 176 -120 180 -173 -235 68 6 -152 97 -30 117 97 113 110 162 -69
7823f9j57J24p5J46O2j05J63k79P1M0p1RM2n8K62j57K50R9j30k4k07J96oj47P6
7848E5k98J97P6OoJ97M8j43r3l8J5j89J72k3j04M2P5p2M32l93j65L04l6nk89J55
7874h0J35n0M8m7j50L32j95m1o3K95k16J5J39n4j62J01j53N27l89M0j32K29o6
7897F3J7Mj16j19K0J39j05J91j61m0p9J18j3j15M46l07K29j1r3j03k36L28K6M4
7921A27l2j14J14j00PP4j46J13o2L52k88Q4j70J64j4r0J4l1j41K74l86L28m9L7
7945F5k88l9L34j16Ml2K34k34K48k56k85M27k04M1oJ77p6N0M2k65J83p7K15j93
7969e1j23K01j32j22J84K07j07j47J37J5J63j42m9q7m4J83n3o4j6r3J94j68L63
7992B49r0k16j17Q1M0q0k35L67rj27J47q9K57j52Qj8p1J18j16O7J3l6j11R8K57
$$ plain form
7823 -69 -226 -102 -177 -31 31 -74 89 -190 -119 -79 -150 -141 -99 -157 105 -52 198 297 167 143 -64 132 126 -21 55
7848 55 -243 -46 30 36 30 227 275 132 39 1 16 -173 -1 -24 -128 -86 -11 -83 349 -44 -209 95 59 54 -235 -80
7874 -80 55 5 53 6 -144 188 -7 -48 -111 184 -32 -17 122 68 -94 7 -146 381 -8 32 -100 129 63
7897 63 80 84 -32 -151 -131 8 -97 94 -67 -107 -186 -68 -81 -196 250 -57 172 161 68 -35 -271 57 83 127
7921 127 95 -19 95 -5 2 76 -70 43 -19 333 45 129 -41 123 109 19 33 2 -139 135 -251 77 28 65
7945 65 -223 -262 72 -44 -40 -72 162 -72 176 -80 -365 62 -142 -101 -107 70 -6 44 86 -179 4 -73 142 -51
7969 -51 -174 27 -105 -227 -43 164 57 -90 47 62 225 83 34 -53 -97 86 33 -31 -47 -140 54 -114 249
7992 249 159 -57 -174 -93 -53 -133 -368 -1 -10 -137 10 -79 178 26 34 16 -55 63 -53 14 27 -9 -120 -22 235
8017B35k22o0n3J26L4n2J76r1k6q0L98l07L4k97l7K36j32J35P3J01o3k32J46p
8041C5J4j79J49Kq6j61K28r0J5j22R1J99j72R5n2kl7J03k5J85k23K22j72j35J10
8066hN7OL0K69m78k2J83k5no5K21m75L32n7K47n34M77L3l2k19L15k07R6m8p1J79
8092A99l54Q0J78k53K84j38K57m58J42M0j22J02N6L2J18m36L19m4q8roK9J74K8
8116A30O2l03j04K37k03K01K5J7l84K69J14p9j83j8K41m4k1J14k7p0m2O6K41p09
8140d70M76k00K66np8P5k8r1n5NJ66j72j85M70p0p7n9qJ19K15M3l35K20m5k06
8165b9k6J75j38j15l0K30l6J3mL5N2j35j0Oj0j50K09r8K49l57K28n7k2j14j3O5
$$ plain form
8017 235 13 -47 -100 26 60 8 184 93 67 -13 385 78 112 -185 -222 14 -118 17 90 191 128 -104 42 35
8041 35 49 -130 19 21 -65 -226 2 -88 -73 -195 -104 95 -77 18 -34 -36 -73 30 5 190 -33 189 17 -118 -8
8066 -8 49 55 85 354 -124 -146 37 12 7 -58 163 -312 20 -37 210 -324 153 186 154 -65 250 43 139 91 20 199
8092 199 -155 -75 103 -150 134 -4 253 -205 -63 -23 -145 -43 13 45 163 -273 46 2 -86 -95 -101 -72 102 130
8116 130 192 -111 -215 22 -181 20 45 62 -322 -53 61 -18 -201 -219 22 -22 -43 71 44 -26 -68 -2 239 -470
8140 -470 6 -194 72 67 -11 64 36 -55 -110 -105 61 -111 -296 174 104 27 -32 -40 79 294 337 2 222 177 -29
8165 -29 -55 120 -18 -133 -163 67 31 44 40 75 127 -8 -18 -12 -22 -172 37 -61 188 -169 59 2 -20 -134 -147 -82
8191h2
$$ Imaginary data points
##PAGE= N=2
##DATA TABLE= (X++(I..I)), XYDATA
0@%%%%%%%%%%%%qJ6j6J6j6K4l2L8m6N6o4P2q8J04j20J39j63J88k15K46k80L18
34A69l59M05m58N14n74O41p15P94q81R78j081J194j320J457j604J767j949K147
52A125k366K609k881L186l530L925m380M912n547O317p274Q504j0150J2486j6098
67i162K2498l7396J43159J26934l3168m599n6360J3043m5044m257p86j5066n38
80I9258R077k7018J8204k2854j0647L931k0127K172M744q620J0620R22j0384L133
94E2411j2361j6772N532k2576P207M965k139K2069P595L835J5661r933j2458l000
108D0036l5444r003j4109k2187J6580m168J5523K5431O105K0893J2115q147N682
121D9307j2042j9922L825k1384M280R113k75K4018J1220J0311J6764J697k997
$$ plain form
0 0 0 0 0 0 0 0 0 0 0 0 0 0 -8 8 -8 8 -8 16 -16 22 -24 32 -32 40 -48 56 -64 75 -88 100 -115 131 -149 169
34 169 -190 215 -243 271 -303 338 -377 417 -464 514 -567 627 -693 764 -840 927 -1022 1125
52 1125 -1241 1368 -1513 1673 -1857 2068 -2312 2600 -2947 3370 -3904 4600 -5550 6936 -9162
67 -9162 13336 -24060 119099 246033 212865 208266 151906 164949 119905 115648 114862 99796 99258
80 99258 108335 81317 99521 76667 66020 69951 49824 51996 56740 48120 58740 59662 49278 52411
94 52411 40050 23278 28810 6234 13441 18406 16267 38336 45931 49766 65427 55494 43036 40036
108 40036 4592 -4411 -18520 -40707 -24127 -28295 -12772 12659 18764 39657 51772 43625 49307
121 49307 37265 17343 21168 -216 4064 13177 12902 36920 48140 58451 75215 76912 73915
134G3915M617j4826l615k077j7897P430o338m331O221p588m423L73j3251n333
148A2877l01j3840R650l579j859J2223q810L750j908j3481l270o655j2519N726
162b1996k568M438J9749N42J8580Q957l1N847j0626r862o313j4371p881K389n767
177a8913J1592J0470L920J7498J66K562M10j1158q123o796j2487j217J42l383
191a5317J3954j17Q523Q645l703M865k422n648N07k607l958P825l589M327N145
206A6430o864N010p072n602j53p098r75L768r67N301P020k842P363n439n430k283
222A67j2784l126m380l216M892O738M203J3702N020M118P229q311m93p146r611
237b998j090m554K08O560M401O479J1150j135P143j704p403K83j0092l879j608
$$ plain form
134 73915 78532 63706 60091 58014 40117 47547 41209 36878 43099 35511 31088 31461 18210 12877
148 12877 12576 -1264 8386 4807 2948 15171 6361 10111 8203 -5278 -8548 -15203 -27722 -21996
162 -21996 -24564 -20126 -377 165 18745 27702 27671 33518 22892 13030 6717 -7654 -15535 -13146 -18913
177 -18913 -7321 3149 7069 24567 24733 27295 27705 16547 8424 1628 -10859 -12076 -11934 -15317
191 -15317 -1363 -1480 7043 15688 11985 16850 14428 8780 9287 6680 2722 10547 6958 11285 16430
206 16430 9566 14576 7504 1902 1749 -5349 -6324 -2556 -3523 1778 8798 5956 13319 7880 2450 167
222 167 -12617 -15743 -20123 -23339 -18447 -11709 -7506 6196 11216 15334 22563 14252 13759 6613 -2998
237 -2998 -4088 -8642 -8434 -1874 2527 9006 20156 19021 26164 24460 17057 17340 7248 3369 1761
252A761l031J988M220m97N990J776l092L991q663j294n53n665K855J066L11M834
268E997L101k958L865o736k197j964o860K575j892Q88O671K979M164M525j729
283A0429r76k492r206j006o304l973L536k24O242O438L176M986K848m328N99p711
299B034o528q21p642K529J139K082O365L623J834M107j562l388o28q437k73j437
315g003k431M895r1M564L711L76j09O79m422q91j346m224M956j956M673M156N99
332F136L778m32k251j242l557n015J647l759K776M378L84O913J476P34R26l566
348I326m173k279n824j923R26k602O356J364L167N255j599Q16k071m786l298l194
364d539m657J452n96J504N478o33M243L70k285m34l415m074j017k165p00M282
$$ plain form
252 1761 -1270 718 4938 4441 10431 12207 9115 13106 4443 3149 2596 -3069 -214 852 1163 5997
268 5997 9098 6140 10005 3269 1072 -892 -7752 -5177 -7069 -6181 490 3469 7633 12158 10429
283 10429 9453 6961 -2245 -3251 -9555 -13528 -9992 -10216 -3974 2464 5640 10626 13474 9146 9745 2034
299 2034 -4494 -5315 -12957 -10428 -9289 -7207 -842 2781 4615 8722 7160 3772 3144 -5293 -5566 -7003
315 -7003 -9434 -4539 -4630 -66 3645 4021 3912 4591 169 -722 -2068 -6292 -1336 -3292 1381 5537 6136
332 6136 9914 9482 7231 5989 2432 -2583 -936 -4695 -1919 2459 2843 9756 11232 11966 12892 9326
348 9326 5153 2874 -2950 -4873 -3947 -6549 -193 1171 4338 9593 7994 8810 6739 1953 -1345 -4539
364 -4539 -9196 -7744 -8340 -6836 -1358 -1991 2252 2622 337 -97 -3512 -7586 -8603 -10768 -11468 -7186
380g186r19N044K311k86L212l371r81j383k838r27K180o11M539L613J269N774
396I440j471J133o26l989j036k618j348J447J569J234N836L00K643J831l457q8
412A0800l973l141j515j683m4K561P33K591L127k103K407l542l003j243m652p74
428c454m89nJ814L064K97L130p26j452K0m951q71k414j729J719J072J826L960
445H11J490J220K334k861l1k516l160O92k241J903K154J766K615L107o80J550
461H153j150l489lm093r54j05p84K082J268P76J757k10j997L94m238j504q42k840
479g779K119k47J156K560O59O4M79k709j816j207m066O64j273R41K647J110L046
496c652J393J67N0j200l375n70k610j308J656j43L498K644J999K869J059m11L43
$$ plain form
380 -7186 -8105 -3061 -750 -1036 2176 -1195 -2176 -3559 -6397 -7324 -5144 -5755 -1216 2397 3666 9440
396 9440 7969 9102 8476 4487 3451 833 -515 932 2501 3735 9571 9871 12514 14345 10888 10800
412 10800 6827 3686 2171 488 444 3005 3738 6329 9456 7353 9760 6218 3215 1972 -2680 -3454
428 -3454 -3943 -3948 -2134 930 1227 4357 3631 2179 2199 -2752 -3623 -6037 -7766 -6047 -4975 -3149 811
445 811 2301 3521 5855 2994 2963 447 -2713 -2021 -4262 -2359 -205 1561 4176 7283 6603 8153
461 8153 7003 3514 3511 -582 -1536 -1641 -2425 -343 925 1701 3458 3248 1251 1645 -2593 -4097 -4939 -7779
479 -7779 -5660 -5907 -4751 -2191 -1532 -1468 -989 -3698 -5514 -6721 -10787 -10123 -11396 -10455 -7808 -6698 -3652
496 -3652 -2259 -2092 -2042 -3242 -6617 -7187 -9797 -11105 -9449 -9592 -6094 -3450 -1451 1418 2477 2066 2409
513B409k079j674O16k233K179J331R06L827R37K008J187o38j146l91k944J42m95
530C942q67K357r58J434L87j101m00k117k832j566j475j923J256j028J863J420
546a608k77J682j821p63j759k405j769k42j189J271K200Q16L990N81J333M34j564
563a090o25j668j751j001L13l29K603J260J995K749l20J310p48j211r24j010q53
580a300O69K38J405K289M53K303L62p03M33j565k85m15l12M10J443N8J811K15
598G509r95M36k793j101j747j983l83m44k55J188O65j12J341j894o19j788k982
615e957o84k025n57N30Q26J240K511P98R47Q21j290N3k096q88m02r54J155O64
633e308J160K063J441kJ204j025q04j95j779l8o79P22P98P20M19J138m8n99j40
$$ plain form
513 2409 330 -1344 -728 -2961 -782 549 1455 5282 6219 8227 9414 8776 7630 7239 4295 4437 3942
530 3942 3075 5432 4474 5908 6295 5194 4794 2677 -155 -1721 -3196 -5119 -3863 -4891 -3028 -1608
546 -1608 -1885 -203 -2024 -2787 -4546 -6951 -8720 -8962 -10151 -8880 -6680 -5864 -1874 -1293 40 474 -1090
563 -1090 -1715 -3383 -5134 -6135 -5822 -6151 -3548 -2288 -293 2456 2136 3446 2698 1487 563 -447 -1300
580 -1300 -631 -393 1012 3301 3754 6057 6419 5716 6149 4584 4299 3884 3572 3982 5425 5483 7294 7509
598 7509 6514 6950 4157 3056 1309 -674 -1057 -1501 -1756 -568 97 -15 1326 -568 -1187 -2975 -5957
615 -5957 -6641 -8666 -9223 -8693 -7867 -6627 -4116 -3318 -2371 -1550 -2840 -2787 -4883 -5771 -6173 -7127 -5972 -5308
633 -5308 -4148 -2085 -644 -646 558 -467 -1271 -1466 -3245 -3283 -3962 -3240 -2442 -1722 -1303 -165 -213 -812 -952
652i52j460L67p50o7R92N86J332J013Q85m54R18j487p75j166n66Q1k29M56J116
671a60J348J251O69o33k46j001k290n97j996l42K28q5K387J78J429N97J66m84
689D19j61j423j394k23j156J362mR63N96P20N15J107q00m35P3k345O12p27k0K226
709i5r36J475l51J82j77q01j171k8n23n44J045k90J314J036L15L97j33p79p92
728h56j104o05p1m88J108Q65R44J507J13J056m24q29o21j167q72l64%P5J409L25
748AJ447O48R7M38j145l27j109l55q13L21m5O69Q90J37R50p99n3l67j048k46l45
769a054n43M58Q81q4R18K5m5k1j035m99q16j0k94J00N89Q76Q47M87Q05o75J44
790A054r45n75n88p20J12J85M36R79Q39K67J058n16n38k45j259m90n25l3K49L65
$$ plain form
652 -952 -2412 -2045 -2795 -2862 -1870 -1284 48 1061 1946 1492 2410 923 148 -1018 -1584 -1503 -1732 -1276 -160
671 -160 1188 2439 3108 2475 2229 1228 -1062 -1659 -3655 -3997 -3769 -3854 -1467 -1289 140 737 903 419
689 419 258 -1165 -2559 -2782 -3938 -2576 -2580 -1617 -1021 -301 214 1321 521 86 159 -2186 -1574 -2301 -2321 -95
709 -95 -1031 444 93 275 98 -703 -1874 -1902 -2425 -2969 -1924 -2214 -900 136 451 848 715 -64 -856
728 -856 -1960 -2565 -2636 -3124 -2016 -1151 -207 1300 1413 2469 2045 1216 595 -572 -1444 -1808 -1808 -1733 -324 1
748 1 1448 2096 2193 2631 1486 1159 50 -305 -1118 -797 -842 -173 717 854 1804 1005 952 585 -463 -709 -1054
769 -1054 -1597 -1139 -258 -342 576 601 556 535 -500 -999 -1815 -1825 -2119 -2019 -1430 -554 293 780 1585 910 1054
790 1054 109 -466 -1054 -1774 -1662 -1477 -1041 -62 777 1044 2102 1586 1048 803 -456 -946 -1471 -1504 -1255 -890
810h90M73J033K91K95K27r02k17m17o62P1k62P28M37L40M00N49k21l72m05q98
830d02O8q14O2L86K11P35K66J67J58j79p56l24j227q8k05K7N50M47P42O14N17
851I55J61l76l20n53o2p31M29r7O70J063J76P71J66j78K32p11p86j88p21k48O83
872C35l52P77M68J62j12K20p64o07m66k00k23l84O78K78O21M81K21J5l68k65l83
893A32j50o69L65K58m3R46k6N49M9j82l93l20o39k55k81k71N99j2Q94J13J2P85
915A461m70k11q44m2o22K73NL94P56J40N63J96P0k48j77k97m13k20K5J88j7O89
937A199J00J83L33o67M2r99k25l91j24k90M57O2L17L75O4L64m05m98k03o68L05
958f69l81M81K94N41O9O75j24k45J78m29l10m34r3K71k0M90L86J76J33M04o96
$$ plain form
810 -890 -417 616 907 1202 1429 527 310 -107 -769 -698 -960 -232 205 545 945 1494 1273 901 496 -402
830 -402 -334 -1148 -1086 -700 -489 246 512 679 837 658 -98 -422 -1649 -1737 -1942 -1915 -1365 -918 -176 438 955
851 955 1116 740 420 -133 -195 -926 -497 -594 76 1139 1315 2086 2252 2074 2306 1595 809 621 -100 -348 335
872 335 -17 760 1228 1390 1278 1498 734 127 -339 -539 -762 -1146 -468 -190 431 912 1133 1148 780 515 132
893 132 -18 -687 -322 -64 -107 839 813 1362 1411 1229 836 516 -123 -378 -659 -930 -331 -343 551 664 676 1461
915 1461 991 780 -64 -106 -728 -455 -450 -56 700 840 1403 1599 1669 1421 1244 947 534 314 339 527 510 1199
937 1199 1299 1482 1815 1148 1190 191 -34 -425 -549 -839 -382 -320 -3 372 436 800 395 -103 -306 -974 -669
958 -669 -1050 -569 -275 266 335 1010 886 641 819 390 80 -354 -447 -176 -196 294 680 856 989 1393 697
979F97o4n10m31n2l63K96K49M13J48N27j96K69m18l69M0q95j31M10q8N66M13P9
1001E90J61L24m67k01m28k12l13k77L95o0K77L06QK83J39n36j8m62o38J95m68
1022a402N05K64K68M64R7M30j58r6o39j15j16k50J51K66M28L90j16O15j91l84
1042D11J72m43k97J00n77O36K18n3L60P7L88j88l93k17k66k49j85R7P6N93k06
1063E4N92P5R4j65l15k60l98j32l91L58L0M77J84K92k4l7k96k62k48l53M7k89
1085i67J91R9K39N13o6L05k09j14k98m59j04l19K43J16L97K51K51K35j44l3l33
1106b06k73r6k5K40k39M3L31M08o2N72j36j48l62o11L46j93R9j20N60L35j93O82
1128I52m24N44p38n00J65n4p44N32N52n10J210l70j44K25J46o94l79L50j062M93
$$ plain form
979 697 633 123 -308 -360 -723 -427 -178 235 383 910 714 983 565 196 236 -659 -790 -380 -468 98 511 590
1001 590 751 1075 608 407 -21 -233 -546 -823 -428 -488 -211 95 103 386 525 -11 -29 -491 -1129 -934 -1402
1022 -1402 -897 -633 -365 99 196 626 468 372 -267 -382 -498 -748 -597 -331 97 487 371 986 795 411
1042 411 583 140 -157 -57 -634 2 220 167 527 604 992 804 411 194 -72 -321 -506 -409 -333 260 54
1063 54 646 721 815 650 335 75 -323 -455 -846 -488 -458 19 203 495 471 434 138 -124 -372 -725 -678 -967
1085 -967 -776 -677 -438 75 9 314 105 -9 -307 -766 -870 -1189 -946 -830 -433 -182 69 304 160 127 -206
1106 -206 -479 -575 -600 -360 -599 -556 -225 183 121 693 557 409 47 -564 -218 -411 -312 -432 128 463 270 952
1128 952 528 1072 334 -166 -1 -55 -799 -267 285 -225 985 615 471 696 842 148 -231 119 -943 -450
1148d50k81K63J022q46Q69k3K41j213lm48K23k26M4K12L47P1R7o1o8L37q85K62
1170e16l43P8k5K78j38K04O27j17OK61m74j30l78m4K6K10K64J35J49L05L02k29
1192D51O9r2n94J82m22M65l01L01m79N44J208l95L50n37m34J9o82r5L72p7N92
1213D45J53j39M12l72K78m83m08k04M28j6n97K39m1P88k5r2o12L46l17k20J0o62
1235a089O15k72L56K6N24J55l26jj62K32r95O74j38r05J495m53P70p01n2J056
1255H09n82j59o2k71m01O94j401O25O92N77r1n48J311r16k50L23r72M04j89M07
1275@k41O80J7J07J6k76M17p41K71k21k31k53J42M51M72n65L28O95p51j86n58
1296d27J62L79l11M4p1K94o4K11j78M29n53k26j14l04K57j6J87J68K36M43j9r3
$$ plain form
1148 -450 -731 -468 554 -292 577 554 795 -418 -421 -869 -646 -872 -828 -616 -269 -198 -101 -162 -230 107 -778 -516
1170 -516 -859 -781 -806 -528 -666 -462 165 48 54 315 -159 -289 -667 -711 -685 -475 -211 -76 73 378 680 451
1192 451 520 428 -166 16 -406 59 -242 59 -420 124 1332 937 1287 750 316 335 -347 -442 -70 -147 445
1213 445 598 459 871 499 777 294 -114 -318 110 94 -503 -264 -305 483 458 366 -246 100 -217 -437 -427 -1089
1235 -1089 -474 -746 -390 -364 160 315 -11 -12 -174 58 -937 -263 -401 -1306 189 -264 506 -195 -247 809
1255 809 227 68 6 -265 -666 28 -1373 -748 -56 521 430 -118 1193 277 27 350 -622 -218 -407 0
1275 0 -241 439 456 563 579 303 720 -21 250 29 -202 -455 -313 138 610 45 373 1068 317 131 -427
1296 -427 -265 114 -197 -153 -224 70 6 217 39 468 -85 -311 -425 -729 -472 -488 -301 -133 103 546 527 434
1318D34j25J49p95K20j92rj34J94K13J13L03N4J07j72k26j3l16K44l81K02JL50
1340B21k1J58q0m4J09k78r4j70P7m3J24M16k0J23P2j58J47j61m89m9j19J9N1K29
1364B0K15J35j01J43j28j62j54qn68K7jJ64K74K34J8J48K85l18l6l95r7k03j86
1387f94J82J30K98J40Q8J04N1j98k44J08m40M15o53K30p3L92J93M3N3r9om76j41
1410e97M04n18K51O3Q37q68M73N42m73k48L79m66j84j49K94j16J78L8J61L72j79
1431A94L58n49Q9M2q38o2Q36m42k87K89O26M40p24L98j77l58j86K17k54K62l23
1452d49M41k11K81O1J08j12O5k23Om2j95lN91l93L78j45K91l72j10K20k12n1n6
1475a32O1J34J0O9J90J60k21K07l92k41O6k44R8J72Ql2N40j39K29j14J05j68l48
$$ plain form
1318 434 309 458 -337 -117 -309 -318 -452 -258 -45 68 371 425 532 360 134 121 -195 49 -332 -130 -129 221
1340 221 200 358 278 234 343 65 -29 -199 -122 -165 -41 375 355 478 550 392 539 378 -111 -160 -279 -260 -209 20
1364 20 235 370 269 412 284 122 -32 -40 -608 -581 -582 -418 -144 90 108 256 541 223 187 -208 -305 -508 -694
1387 -694 -512 -382 -84 56 144 248 299 101 -143 -35 -475 -60 -713 -483 -556 -164 29 72 125 26 20 -456 -597
1410 -597 -193 -711 -460 -397 440 -428 45 587 114 -134 245 -221 -405 -554 -260 -376 -198 -160 1 373 194
1431 194 552 3 92 134 -704 -766 70 -372 -659 -370 256 696 -28 370 193 -165 -351 -134 -388 -126 -449
1452 -449 -8 -219 62 123 231 119 184 -39 -33 -75 -270 -273 318 -75 303 158 449 77 -33 187 -25 -76 -132
1475 -132 -71 63 73 142 332 492 271 478 86 -155 -89 -333 -235 -63 -55 -87 453 314 543 429 534 366 18
1498A8L5k96K21J82Q7q0K47r1J15L28n03j08K3j07k46K49k23K13k3P0K37k94L65
1521D19j37j77j7n21N92k09K95pK8j98L07Jl11j34k57K8K13j1o0J84J47J57o7
1544B65J33j49k4k48l60N6J74j65j48L24J07J87j5J38k12j75j68J92k09qQ9l4
1566b50J68K52K22j57J01k52o5J57k15p2j06L61k48J10K85J90k99K29P3m11j55
1587h2P1j81J96j05L49j8K49J11k65r2R6l87k36J44K2k3m8L99K3o0J79Kq1l18
1611e5n1L2j97k22L04N0j88M54j45j7J0l8j60J09j25j39j9L9J72O5M89l21m2J84
1635A89j68Op3l10K51m5J9N7L00J30k06J38j20k4k75J34j1l1J50p2J82l4O7J84
1659D38M3k20k79K81k73m19N02n8K54J81n50L42r5O8Q5l85J62m09Q7j7K09m4J43
$$ plain form
1498 18 53 -243 -22 160 247 167 414 323 438 766 263 155 178 71 -175 74 -149 64 41 111 348 54 419
1521 419 282 105 88 -433 159 -50 245 238 266 68 375 376 65 -69 -326 -298 -85 -96 -156 28 175 332 265
1544 265 398 249 225 -23 -383 -327 -153 -318 -466 -142 -35 152 137 275 63 -112 -280 -88 -297 -305 -216 -250
1566 -250 -82 170 392 235 336 84 19 176 -39 -111 -217 144 -104 6 291 481 182 411 484 73 -82
1587 -82 -11 -192 4 -101 248 230 479 590 325 233 329 -58 -294 -150 -128 -151 -199 200 223 163 342 344 263 -55
1611 -55 -106 -74 -271 -493 -189 -139 -327 127 -18 -35 -25 -63 -223 -114 -239 -378 -397 -358 -186 -121 368 47 5 189
1635 189 21 27 -46 -356 -105 -150 -131 -74 226 356 150 288 168 144 -131 3 -8 -39 111 39 221 187 254 438
1659 438 481 261 -18 263 -10 -429 73 15 269 450 -100 242 147 215 300 -85 77 -332 -245 -262 -53 -97 46
1682D6P5M4N3p2k6k34k0L71l70l84L82J67j44L16k55J43k03j70K81j27l28L04
1704a51j74M26j43M17jl30O5J80m33J38ooj2j36K15Q5M02m79n9k0k83L29j42R
1728a09j58J46N6oJ54q3J63j28N5j85k69K48N5m4j12K09o9j6L3M4m0M3lj59J50
1753b5l07J96j68K15L02j22J9L2m8j32j23P1p5k27K01K02P7j09J2J10l4K23j95
1776I5R1k06q5J60l96M56l3J31M8j29N2J86l91k96L02q4L6K9L03n5kK31j04j12
1800B27L9k77J79k03j03K69J24j48K33J06j37p8j74K43l54K01m9J4j82K20PJ32
1822B89J1J60j36m4J16l09M79m40K3L63k94R1K28k84P8r3j46K55k89j2j17J25
1844E4M04m06K88lK05l65J02l53M63l58p7n9j96K02K61%j9j25R7j1l83K78J13
$$ plain form
1682 46 121 165 218 146 120 -114 -134 237 -133 -517 -135 32 -112 204 -51 92 -111 -281 0 -127 -455 -151
1704 -151 -325 101 -42 375 374 44 109 289 -144 -6 -12 -18 -30 -166 49 134 536 57 -2 -22 -305 24 -118 -109
1728 -109 -267 -121 -65 -71 83 0 163 35 90 -95 -364 -116 -61 -105 -217 -8 -77 -93 -60 -16 -56 -13 -16 -175 -25
1753 -25 -332 -136 -304 -89 213 91 110 142 94 -38 -161 -90 -165 -392 -191 11 88 -21 -9 101 67 290 95
1776 95 186 -20 -105 55 -341 115 82 213 261 132 184 370 -21 -317 -15 -99 -63 -34 269 214 212 443 339 227
1800 227 266 -11 168 -35 -138 131 255 107 340 446 309 231 57 300 -54 147 98 112 -70 150 157 289
1822 289 300 460 324 280 396 87 566 126 149 512 218 309 537 253 331 238 92 347 58 46 -71 54
1844 54 458 52 340 337 542 177 279 -74 389 31 -46 -105 -301 -99 162 162 143 18 115 104 -279 -1 112
1867A12l16k17J76L90j77J23j39M5p7j87Qr9qL9L82l20J79O4l6J01L2Rk85k3M
1892b20j16L48l88N11r2PR6j36P7J77j26j45k05J17J04k35K25K22O4M1p0j47p4
1915C5j06j00P9L8jR0j53K42j71K49k58J26k00k3J11k35O2N9nQ3K04j04p7J05
1939E0L3k12j20P8P8j45r5J00M25j72K65l66j97P6J07n6o1p7l3K58q1L22l85n7
1963b65M62j43j36k97J82j08K12j57P3N65l16J44r5ML1J0k56n2K7J67j16JK97
1986B34j60J82o8j76j28j87J60L7j23J61n3K8n3L38k22J94m44P1K24k16l0Q7l0
2009a74K4J55k3N4J02j07j02j28K07l12L0P2J8K2K55q3l7J7j77Q6k95R6Q0o3K53
2034c0k19Q9K84j15K5Q6o6j57K17k02J53k52L48k73J44N6r3K42l16L35k93k2q1
$$ plain form
1867 112 -204 -421 -245 145 -32 91 -48 -3 -80 -267 -259 -358 -366 -327 55 -265 -86 -22 -58 43 75 84 -201 -224 -220
1892 -220 -336 12 -376 135 43 50 146 10 87 264 138 -7 -212 -95 9 -226 -1 221 285 326 256 109 35
1915 35 -71 -171 -92 -54 -55 35 -118 124 -47 202 -56 70 -130 -153 -42 -277 -215 -156 -161 -78 126 22 -55 50
1939 50 83 -129 -249 -171 -93 -238 -333 -233 192 20 285 -81 -278 -202 -95 -151 -212 -289 -322 -64 -145 177 -208 -265
1963 -265 197 54 -82 -379 -197 -305 -93 -250 -177 388 72 216 121 125 156 166 -90 -142 -115 52 -64 -63 234
1986 234 74 256 188 12 -116 -303 -143 -106 -229 -68 -121 -93 -146 192 -30 164 -280 -209 15 -201 -231 -144 -174
2009 -174 -150 5 -18 36 138 31 -71 -199 8 -304 -274 -202 -184 -162 93 10 -27 -10 -187 -101 -396 -300 -220 -283 -30
2034 -30 -249 -160 124 9 34 120 54 -103 114 -88 65 -187 161 -112 32 88 -5 237 -79 256 -37 -59 -140
2057a40N7j07L41j62j58N31j85j20q2rj74K12k0R3j39K49P1j68j53L89l65L45
2079C06j16l80R9N0j34j41J47J45j46N7J57k04M10n25J24N4j53J20q0J71J90m72
2101c21K46Q4o0Kr9oj46J48j04K30Q8Rn6K0K2k00K24m2Kl73J48J78L3L9K16k27
2127E5p2J73j69j84Q3K06o2r3M21l61J51j92L35J24m45J99j33J41k85R1j51J91
2149B3K4L95k38J5R3l32J30l82R4J03l1M1K44n4o8K36j77k92K78l35J09m1R9k69
2173c35J82J56R0k65R8j4K0J78m68J09k0l9j37L34o6J97L2j36K2L49n95J60j17
2196b65K71k21N2L46J44l24j7J71j72j93M0K26j85N4N2K25J27r2j06Oj33nnJ93
2220A89j55J35k96Q0J21O0k06j92L78j73J45j82K30k39j25J35P0J53k06O1K10
$$ plain form
2057 -140 -83 -190 151 -11 -169 362 177 57 -25 -34 -208 4 -16 77 -62 187 258 90 -63 326 -39 306
2079 306 190 -190 -91 -41 -175 -316 -169 -24 -170 -113 44 -160 250 -275 -151 -97 -250 -130 -210 -39 151 -321
2101 -321 -75 9 -51 -49 -148 -154 -300 -152 -256 -26 62 71 15 35 57 -143 81 39 41 -332 -184 -6 27 66 282 55
2127 55 -17 156 -13 -197 -114 92 30 -63 358 -3 148 -44 291 415 -30 169 36 177 -108 -17 -168 23
2149 23 47 442 204 219 312 -20 110 -272 -178 -75 -106 -65 179 125 57 293 116 -176 102 -233 -124 -165 -66 -335
2173 -335 -153 3 93 -172 -74 -88 -68 110 -358 -249 -269 -308 -445 -111 -177 20 52 -84 -62 287 -308 -148 -265
2196 -265 6 -215 -163 183 327 3 -14 157 -15 -208 -168 58 -127 -73 -21 204 331 239 133 139 6 1 -4 189
2220 189 34 169 -127 -47 74 134 -72 -264 114 -59 86 -96 134 -105 -230 -95 -25 128 -78 -17 193
2241A93j60l2j26O3j12K34k09q4l3L36j57j04o2J73m0J89j70Q0k22j66K76k44
2263c77L31J9l10M22l50K85j88k04M59j61L4J31J21q2j10L47j47j00n3J64l91
2284a60O8J19L16K37k13p5K7j22K35k85O4j45j41K60j60K24K5r7R1j42n9n4K07
2307B20L0k3l18L4K67p1J51l60J84J24j97K06p1l69j07L18p2K3k4n8K71j99j38
2330a79K16j08r2R5kj08o9R2Q8r1K28j23j98M10n21N27j61m33M66N0j22j0J50
2353A05J22j75l7j84JK31J84k46J48J41k46j45O8K38n29J20K60J3j0j82m5J16
2375e2l21L70%J9k26N92k99j03k5J96j73k66L57K30Mk66j16J38K51m24K26j90
2397g8L12l00j8p6J70L85k91m18N84m62Q5O8L66n15M10p67N09L9K52jk80K96k66
$$ plain form
2241 193 33 1 -125 -62 -174 60 -149 -233 -266 70 -87 -191 -253 -80 -120 69 -101 -21 -243 -409 -133 -377
2263 -377 -46 -27 -337 85 -265 20 -168 -372 87 -74 -40 91 212 130 20 367 220 120 67 231 -160
2284 -160 -92 27 343 580 367 292 319 197 432 147 211 66 -75 185 25 249 274 177 268 126 67 13 220
2307 220 250 227 -91 -57 210 139 290 -70 114 238 41 247 176 -193 -300 18 -54 -31 -55 -113 158 -41 -179
2330 -179 37 -71 -163 -68 -70 -178 -247 -155 -67 -158 70 -53 -251 159 -362 165 4 -429 37 87 -35 -45 105
2353 105 227 52 15 -169 -168 63 247 1 149 290 44 -101 -33 205 -324 -204 56 69 59 -123 -168 -52
2375 -52 -373 -3 -3 16 -210 382 83 -20 -45 151 -22 -288 69 299 303 37 -79 59 310 -114 112 -78
2397 -78 234 -66 -84 -160 10 395 104 -314 270 -192 -107 -39 327 -188 222 -545 -36 3 255 254 -26 270 4
2420DM23L0p22K81m73j70k15J088n32Q56m9q58O00q2l24J80l71j00K91N33n20
2441a30L3M23j80m03L22l2K79k25O3l13R2J47k19N78r4j13K88r51N2L53j96K61
2463C5o9k96J13J29J53J21q1k07J66J53n17J67J82r9j11R04n92K11p86M85o0q7
2485h6J21m0Q95o84p7q3m10M36j32r4J53L6K96j85J34k83m32N37L97j74K74o97
2507i8%k24L00k38J03N17l64n1K21m1j55R2J53j73k10K05l8L41q5j45j0J62l17
2530e5j44K33n1K94m44K95k75K86q5P7L9j28K52j38J12m83M70l77L93l41J04K76
2552C10j032Q08j46P1K04k18n0J03m4j63N3K01J5l01J63j33M3L13k84l9m4J97
2574B7n55N92N3m64M65k54O7L3N5n6m6K39j56k43M53j26k06n0K17j9J40N5j46
$$ plain form
2420 4 427 457 -265 16 -457 -627 -842 246 -286 570 521 -337 263 181 -143 37 -334 -434 -143 390 -130
2441 -130 -97 326 146 -257 65 33 312 87 150 -163 -71 76 -143 435 341 228 516 -435 -383 -30 -226 35
2463 35 -34 -330 -217 -88 65 186 105 -102 64 217 -300 -133 49 -50 -161 743 151 362 -424 61 1 -86
2485 -86 35 -5 890 206 129 46 -364 72 -60 -154 -1 35 331 146 280 -3 -435 102 499 325 599 -98
2507 -98 -98 -322 -22 -260 -157 360 -4 -55 166 125 -30 62 215 42 -168 37 -1 340 255 110 100 262 -55
2530 -55 -199 34 -17 277 -167 128 -147 139 54 131 170 42 294 156 268 -215 255 -122 271 -70 34 310
2552 310 -722 86 -60 11 215 -3 -53 50 6 -157 -104 97 112 -189 -26 -159 -116 197 -87 -126 -170 27
2574 27 -528 64 117 -347 118 -136 -69 -36 19 -37 -83 156 0 -243 210 84 -122 -172 45 26 166 221 75
2597G5j11K77k88J25j20Q2o9K33k31m6M28l51l6J67J65k76K07k83K15r3M4j60
2619d6K21j22n9j50L5P7K4Q8k70J32j54K43K5lO6j17J09r0j11Q2J6r5J35k5J4
2644B5m2k7l4j42j02J09j0K17K8n9l24K60j0k5J1K26l8j3j64J21J61J5q8l21M63
2669B37l32K65l1p8j14J22k5J61K4j54L2k85J55Q9K95n01J6qJ72j64j76L43j46
2692a03q5J63Q4l25J38J71j45K03k57M8Q6j95L25K36m23kJ22j23J67k59n9Q5L5
2715a13o6NJ81K6j04J26K6j48R0j41j24J72j51K3K25p5j26K75k47J24R7j29l1
2738h5J03j77L42k03o4K23j37K19q9j20j32M42j84m37J19K99l04L72k10n7K94
2759B14l73L0j33K47J2J53n3o1J7k98L41K48j71k15Q9k14Q9J59k26k8P4J61k9
$$ plain form
2597 75 -36 241 -47 78 -42 40 -29 204 -27 -73 355 4 -32 135 300 24 231 -52 163 70 114 -46
2619 -46 175 53 -6 -156 -121 -44 -20 68 -202 -70 -224 19 44 41 107 -10 99 9 -102 -20 -4 -99 36 11 25
2644 25 -17 -44 -78 -220 -322 -213 -223 -6 22 -37 -361 -101 -111 -136 -125 101 63 50 -114 7 168 183 95 -226 237
2669 237 -95 170 139 61 -53 69 44 205 229 75 107 -178 -23 66 361 -140 -124 -132 40 -124 -300 43 -103
2692 -103 -188 -25 59 -266 -128 43 -102 101 -156 -108 -22 -217 108 344 -79 -81 41 -82 85 -174 -233 -148 -113
2715 -113 -179 -174 7 33 -71 55 81 -67 23 -118 -242 -70 -221 -198 27 -48 -174 101 -146 -22 75 -54 -85
2738 -85 18 -159 183 -20 -84 139 2 221 132 12 -120 322 138 -299 -180 119 -185 187 -23 -80 214
2759 214 -159 -129 -262 -15 -3 150 97 36 53 -245 96 344 173 -42 47 -167 -78 81 -145 -173 -99 62 33
2782C3m9j4J27k30j10j5L17k02k8P1lJ83k14j11K03M8O4l03J60J97l41L99n34
2805c52N63l38J92r9N5qJJ81m58L15k2K71k69q3p0J4L48k39K3Q5M8j27j51N7o1
2830a24O2k5R9j63K86k40J48N7k60K05n5J15p7J0l06K83j31J14J2k80K49j50N2
2853a19loJ81ok35L13Q7j49j70o1J5r8J74J72nk94J26J8ON2M0k4j3J1O1P2k12
2880f7j02K76j36j7J78k68R5N7m9J25j89J02N5j28l5K65l1l75K66J60j54K02j09
2903A21k21J17L9n2K82j03N1nk66j93K23J04j49M4n6J10j3p5K64k27p8j29N2O4
2927i6m7J27mk3m2j85L11J41j86Jk66K04J77l71K63o7j1J61J1j68L8Q4k42L26
2951A36k7k28J66J38k39K4J13j1l29L48k69l8L80j82k21J92j7K1K14j38j29K04
$$ plain form
2782 33 -16 -30 97 -133 -243 -258 59 -143 -171 -100 -103 80 -134 -245 -42 6 70 -233 -73 124 -217 182 -352
2805 -352 211 -127 65 -34 21 13 14 195 -263 52 30 301 32 -51 -121 -107 241 2 25 110 158 31 -120 -63 -124
2830 -124 -62 -87 12 -151 135 -105 43 100 -160 45 -10 105 28 38 -268 15 -116 -2 10 -270 -21 -171 -119
2853 -119 -122 -128 53 47 -188 125 212 63 -107 -168 -153 -251 -77 95 90 -204 -78 -60 -54 -2 38 14 1 12 73 145 -67
2880 -67 -169 107 -29 -46 132 -136 -41 16 -33 92 -97 5 60 -68 -103 162 131 -244 22 182 28 230 121
2903 121 -100 17 56 4 286 183 234 229 -37 -230 -7 97 -52 -8 -64 46 33 -42 222 -5 -83 -212 -160 -96
2927 -96 -143 -16 -20 -43 -85 -270 41 182 -4 -3 -269 -65 112 -259 4 -63 -74 87 98 -70 -32 52 -190 136
2951 136 109 -119 47 185 -54 -30 83 72 -257 91 -178 -216 164 -18 -239 -47 -64 -43 171 33 -96 108
2973A08K67k06j73O9M7j50n7p9L59o1j76p4L17nl34L10k51M9K2P0m0j42K93j84
2997b1P5J37j9j0l68L21j35k7n9K30j08N0j06O1j62pN3k13L96j58k16J74O6j56
3021b02K76n9K11j87J50j94J80k76K24k51Q9Ok1r9K0QM20l22J53J34j05k48l1
3044a24J60pJ55q8k62L58ll04j1J72L7l26J88Q6J08k61o0K52p6M0K0j74J10j00
3068a10J86J15j69j26p4K09J8J4q8j02j29L14J74m31M4K20J29k29j1J8j46K4K66
3091A16j53J3nj71K88j23J4J76k85J8O4m0pn3L09o9Ok7p8N8L6k18J64q8K8L6k34
3118b25M05j94K7N4j65O7M2k49K60J06j94j10K62r6k51K13l5o5Q7O3N1j44P3J65
3142A47m04P5K06n4q9K63j45n5Jk02L1P5K6o7J36O5l4J26K11j56j81p9J74j20
$$ plain form
2973 108 375 169 -4 65 112 -38 -95 -174 185 124 -52 -126 191 186 -148 162 -89 -40 -18 52 12 -130 163 -21
2997 -21 54 191 172 162 -206 115 -20 -47 -106 124 16 66 -40 21 -141 -148 -95 -308 88 -70 -286 -112 -46 -202
3021 -202 74 15 226 39 189 -5 175 -101 123 -128 -39 -33 -54 -153 -133 -125 295 -27 126 260 155 -93 -124
3044 -124 36 29 184 96 -166 192 189 -115 -126 46 83 -243 -55 31 139 -122 -182 70 -6 34 54 -120 -10 -110
3068 -110 76 191 22 -104 -178 31 49 63 -25 -127 -256 58 232 -199 -155 65 194 -35 -46 -28 -174 -150 116
3091 116 -37 -24 -29 -200 88 -35 -21 155 -130 -112 -48 -88 -95 -148 161 92 98 71 -7 51 87 -131 33 -55 -27 9 -225
3118 -225 180 -14 13 67 -98 -31 11 -238 22 128 -66 -176 86 -10 -261 -48 -83 -148 -61 2 53 -91 -18 147
3142 147 -257 -182 24 -30 -119 144 -1 -56 -55 -257 -226 -151 -125 -192 -56 9 -25 101 312 156 -25 -104 70 -50
3166e0P3J05l09J28O1K9m12L98p5j09K03j72R2l1L5n2J3J19J19o8PJ59j87j34
3190e8J4K19M9l18j7J41k51J26K46j16J50j14p3l7p2K01j65K1R9K22m65J44k0
3213g4M08m33J40K1j5n5K47k91j3pL20j29r6m8j99K46p0J12j51j32OJ90n0j14
3237a87J43K34J5l63J02k51Q0K88j83K19k06K8r4K23l2j35K49Ml41J58Q3q0J66
3260A20j11n8J19j31J77j42R0k47K28j63K79K9j64q2M0j0p2J26n6j9J94%j09N9
3284I7Q6j58J06j41r4J40O5k85R6J28n9r9K82k58K27j38k29K78j9j11L2P4M4q
3308E6j21J02p2Q1J03j74j90J43k62K71n7n9L02l33K67l8J4q2J09j33j04J90k69
3331b56L17r9N7J62l23Q2R8k47M35j8j89P0p7M6L70m17j21J50o0Q1j20M2m1P8
$$ plain form
3166 -50 23 128 -181 -53 8 37 -375 23 -52 -161 42 -130 -38 -69 -34 -86 -73 46 165 97 104 263 76 -58
3190 -58 -44 175 224 -94 -111 30 -221 -95 151 35 185 71 -2 -39 -111 90 -75 -54 45 267 -198 -54 -74
3213 -74 334 -99 41 62 47 -8 239 -52 -65 -72 248 119 23 -25 -224 22 -48 64 -87 -219 -213 -23 -73 -187
3237 -187 -44 190 205 -158 -56 -307 -227 61 -122 97 -109 -81 -175 48 16 -119 130 134 -207 -49 34 -46 120
3260 120 9 -49 70 -61 116 -26 64 -183 45 -118 161 190 26 -56 -16 -26 -98 28 -28 -47 147 147 38 97
3284 97 183 25 131 -10 -104 36 101 -184 -88 40 -19 -118 164 -94 133 -5 -234 44 25 -86 -54 20 64 56
3308 56 -65 37 -35 46 149 -25 -215 -72 -334 -63 -120 -179 123 -210 57 19 33 -49 60 -73 -177 13 -256
3331 -256 61 -38 19 181 -142 -60 38 -209 226 208 19 89 12 58 428 11 -110 40 -20 61 -59 -17 -58 20
3355B0j6J60k3j44p5J93P1l32J3L75l08R9l02L42k43J75P6p9p8L5N0j38o8L06
3379A09j57j10J47j70J11P9k58K08J34j20kR3J21l43J25L26k29l4O2J75j96L8
3401A09m3J28j14o1j03J42k2j68J55k3k33L88k28n2mJ78l9j32p4K13R3j21j31
3424a42KJ43J02k11J43J28j44j05P0omM4k6O9q5N1p0L8O7q7J2Q0j09m8K48l59
3450a99J13L5J27k4m5J43l03k9J60KJ98l59J20j7J2N4K48j85q1k61L41j07O0O8
3474G1L6o8j72M06l00K08k36l5L43m07K00J63k04j77P4J31R0L6L4l86L8j24L35
3497E6M7k11J97K0P2k06j4N6Q0M3k22k20L46j53L9l1K32q6p4N1K30j44j75J94
3521A27n1k44RL10k61Q6R3o1l3k9J2K8m6O5J23l02K33j39nJ95k3k45K41r1r0O2
$$ plain form
3355 20 4 164 141 -3 -78 115 186 -146 -133 242 -66 33 -269 73 -170 5 81 2 -76 -41 9 -129 -197 109
3379 109 -48 -158 -11 -181 -70 9 -249 -41 93 -27 -29 64 185 -158 -33 293 64 30 92 267 71 109
3401 109 66 194 80 19 -84 58 36 -132 23 0 -233 155 -73 -125 -129 49 10 -122 -196 17 110 -11 -142
3424 -142 -140 3 105 -106 37 165 21 -84 -14 -20 -24 20 -6 63 -22 29 -41 -3 64 -23 -11 69 -40 -88 160 -199
3450 -199 -86 -51 76 52 7 150 -153 -182 -22 -20 178 -181 -61 -78 -66 -12 236 51 -30 -291 50 -57 3 71
3474 71 107 39 -133 273 -27 181 -55 -90 253 -154 46 209 5 -172 -98 33 123 159 193 -193 -155 -279 56
3497 56 103 -108 89 109 181 -25 -39 17 97 140 -82 -302 44 -109 -70 -101 131 45 -29 22 252 108 -67 127
3521 127 76 -168 -159 151 -110 -24 69 8 -25 -54 -42 -14 -60 5 128 -174 59 -80 -85 110 87 -158 83 -8 -98 -36
3547c6k7r2M4J1J35k79J84J61N6M8l20P3K24k03O9M3j59K82k75J22K5j06J01K5
3571A06L9k0r8q8J4O6Po3Q7J82k08j17NJ62M2j98O1k1p0L22k21j7n6J14J3J6j53
3598i4l1j3J12NP0o1m2j4R9j15j74K67K03l08J76r2J06j53j18J1J27J94j37L6
3622E4k45K40M4j58J91j53j21k2R7K41k70j54L07N7j10o2P2o7J58j91K4J27M7
3645A06k95K76k38J22J5k3K81l93K94J27j94m8r2P9J3j86J02M0J59j65K19j87
3667A2j36J28r4k5K01o9l3q2J98j67O7K77k44k38J10J6n5K78j44k72L37O7k20
3690h8M3J08J37j07j4j09J9k48L12j01J24j13r5K66j16OJ48j34k76L82p5L2j18
3713a7m9k00K55K1J48Lj69QQNL3M3k45O3j70J65J26K6j55J8M7K44k09j07Q9J51
$$ plain form
3547 -36 -63 -155 -111 -100 35 -244 -60 101 157 205 -115 -42 182 -21 48 91 -68 214 -61 61 86 -20 81 106
3571 106 145 125 27 -61 -47 19 26 -37 50 232 24 -93 -88 74 116 -82 -21 -42 -112 210 -11 -28 -84 30 43 59 -94
3598 -94 -125 -138 -26 -21 49 -12 -54 -68 31 -84 -258 9 212 -96 80 -12 94 -59 -177 -166 -39 155 18 54
3622 54 -191 49 93 -65 126 -27 -148 -170 -73 168 -102 -256 51 108 -2 -64 8 -59 99 -92 -68 59 106
3645 106 -189 87 -151 -29 -14 -37 244 -149 145 272 78 30 -62 17 30 -156 -54 -14 145 -20 199 12
3667 12 -124 4 -90 -115 86 17 -16 -98 100 -67 0 277 33 -205 -95 -79 -134 144 0 -272 65 132 -88
3690 -88 -45 63 200 93 79 -30 -11 -259 53 -48 76 -37 -132 134 18 24 172 38 -238 144 69 101 -17
3713 -17 -66 -266 -11 10 158 161 -8 0 8 13 46 89 -156 -93 -263 -98 28 54 -101 -83 -36 208 -1 -108 -19 132
3739A32k05J61K36l49m4o5L31Q3k88o8p4J26J65L5N4l61J94j5p0rJ45l05J06q
3763i3P9J51j37j8j53K6K54m27M59j41k42R7J03J45k4j79J95J02j30k29K55q7
3785FK02j51j57O1L8n1j49K15J15j58J05j68J80K32m28L63q9l06K72j34k4j42
3807a68L60L7l45K27r6j22N9m0K81k36rK12k84J84l2k2m27N11O0l51K89o4n5k14
3831b45K98r7n1RR8K87k85p0k1k1j01q8K51k3J42j51j2M1J80m12L06p9n5q8L10
3856A23r1l5J50j89L9M0J92k41j66p0J7J51J15j80K13l4K53k21J85k57o6J40j53
3879h5R7J56p6j4n7j7k63J41K13j09j25kK36j66J43j13r1L69l71J76k60K99o0
3902B1Q1m07J16J22p5n3L24k15J37M0j09R9J10Jp8l5l71L40j84M7O9J12j08j15
$$ plain form
3739 132 -73 88 324 -25 -69 -134 197 280 -8 -76 -150 -24 141 176 230 -131 63 48 -22 -31 114 -191 -85 -93
3763 -93 -14 137 0 -18 -171 -145 109 -318 141 0 -242 -145 -42 103 79 -100 95 197 67 -162 93 6
3785 6 208 57 -100 -39 -1 -52 -201 14 129 -29 76 -92 88 320 -108 255 166 -140 132 -2 -26 -168
3807 -168 192 229 -116 111 15 -107 -48 -88 193 -43 -52 160 -124 60 28 6 -421 90 150 -201 88 24 -31 -245
3831 -245 53 -44 -95 -86 12 299 14 -56 -77 -98 -199 -287 -36 -59 83 -68 -80 -39 141 -271 35 -44 -99 -187 123
3856 123 32 -3 147 -42 -3 37 229 -12 -178 -248 -231 -80 35 -145 68 34 287 66 251 -6 -72 68 -85
3879 -85 12 168 92 78 21 4 -259 -118 95 -14 -139 -141 95 -71 72 -41 -132 237 -134 42 -218 81 21
3902 21 102 -305 -189 -67 -142 -195 129 -86 51 91 -18 81 191 192 114 79 -292 48 -136 -89 -20 92 -16 -131
3926a31J37qq2J47Qp6m1J50l73K33K9J87J45m29J20j45L11q3j2k31K27r5LJ3j24
3951a20q8K89k49J44J41q9j04m2M9o3J38J54k52j08L60k26L04j12M5j15%K30j68
3974A18K3l2mj20l3J23p1K98k92J04J42k48j54J67q6L10n5m01N00l21J96k83K21
3997A02k13j24N79n33K47m4k95M66k81O7L44l68J66K09k79p1J16l69N96k99J21
4018A37K27n39N0K91J58l85p9K19M86o76l49J61N28o19p36J271L17r60P91m55
4038a62j30k6k31Q93k22K37m22M09n05l5j30k11M25L11k34N5j35K32O0j24l1l35
4060c11M00r8J44m60K38J25M0j94J2J47k0j98J89r7J8J30L4oJ2P9k73nP4n8K31
4085A53k29K80j94N7K3J65q0k63m8K41m4J68m43K01J47p6k08L8L14n51J99L09
$$ plain form
3926 -131 6 -2 -84 63 71 -5 -46 104 -269 -36 -7 180 325 -104 16 -129 182 99 87 -144 83 -12 -9 4 -120
3951 -120 -208 81 -168 -24 117 28 -76 -118 -69 -132 6 160 -92 -200 160 -66 238 126 171 56 56 286 118
3974 118 141 109 105 -15 -48 75 4 302 10 114 256 8 -146 21 -65 245 190 -211 289 -32 164 -119 102
3997 102 -111 -235 344 -189 58 14 -281 185 -96 -29 315 -53 113 322 43 -28 88 -281 315 16 137
4018 137 364 -175 -125 166 324 -61 -140 79 565 -111 -460 -299 229 -390 -1126 145 462 -498 293 -162
4038 -162 -292 -318 -549 344 122 359 -63 346 -159 -194 -324 -535 -110 201 -33 22 -113 119 179 55 24 -311
4060 -311 89 -9 135 -325 -87 38 78 -116 -104 43 23 -175 14 -83 -65 65 99 93 105 184 -89 -94 -20 -78 153
4085 153 -76 204 10 67 90 255 175 -88 -136 105 61 229 -214 -13 134 58 -150 -112 202 -349 -150 159
4107A59k40O6j05K94j63n8J37j33K6J22j55K9L7J78k41L1Q7j28K7K6J25r5N4l0
4131E0M5M8k39J56J39o2j36J74k2j74j60J44m9P2k1o6L26j98j00o8J28k7K3N6
4155C9JQ4j42L5JK13l14qP6q1J5Q2R6q0r5o6L16q9Q1k36O5j24J41r6L3Q2J11n2
4183H8j19j04K3L21l09M9Q7l3J65k26J57J19n6k56l3k7J73J25n0l49K75L17l75
4206c8J90R4n7k27o2K01l6o3P0j57O4N0m9J05j33pP1o1m5J65K3J6k63K61j04%
4232HO0J57l02L7J44j33p1K70l17P6K33L3j65o0q5K43rn76M85o4K61j88R0k40
4256a13j84L98k39J30Q2j0r8KJ32p9j14J45j9J0m3n1J04l7q6J33j5j94L17k07
4280c6j4J14j67L1p7J65L6j56M3K37k33J30l9MJk22O9J31K60j77p0Q8j06l7N4
$$ plain form
4107 159 -81 -15 -120 174 11 -47 90 -43 -17 105 -50 -21 16 194 -47 -16 71 -57 -30 -4 121 26 80 50
4131 50 95 143 -96 60 199 137 1 175 153 -21 -181 -37 -86 -14 -35 -101 225 27 -73 -141 -13 -40 -17 39
4155 39 40 124 -18 17 18 231 -83 -91 -15 -96 -81 1 97 17 -78 -144 172 83 164 -72 -7 -131 10 -86 -53 29 140 88
4183 88 -31 -135 -112 209 -100 -51 36 3 168 -58 99 218 162 -94 -127 -154 19 144 94 -255 20 337 -38
4206 -38 152 246 189 -38 -100 101 65 2 72 -85 -21 29 -20 85 -48 -55 16 -45 -90 75 98 114 -149 112 8 8
4232 8 68 225 -77 -40 104 -29 -100 170 -147 -71 162 195 30 -30 -115 128 119 -457 28 -36 225 37 127 -113
4256 -113 -297 101 -138 -8 74 64 -34 -32 100 21 -93 52 33 43 0 -51 53 16 -70 63 48 -146 171 -36
4280 -36 -50 64 -103 -72 -149 16 52 -104 -61 176 -57 73 34 38 39 -183 -114 17 277 100 30 118 12 -25 29
4305B9k12M07l98K70j43p8j23K74J62p4q4R6j23qj99K15mp2K74k02K16o14N51
4328A60l04J66P6L47o3k26J4k83o5K65JK62m54L49j99l33P78k94j75j10M46n44
4350a86Q41M2q20j59l01M98P29l18O6q90Q39o71j90O67J30m50N29p6J78J34j73
4371D19j45p95J216l44k34m05j57Q5k51P59O9P0n5n18j71O14M79q10L03o8o1j81
4393a81J76Lk9K49k70K59l31J2P7M5J35p1l25k1K44j07K20J52j91Q7k43N6j45
4416a99L52k85l11O41m92L35J66J00l6p1l69L00k5j99M50p04L98l19J13L46p7
4437A14j02j49K61J20k45k27M80j16j19k61L17p0J14k80L04O6l61K99k25r9L53
4458A74k81N6m2K22m6p3o7R6K12l62L9JJ14j5o1O6P4j63J60k46k1J92j37p8L3
$$ plain form
4305 29 -183 224 -174 96 -47 -125 -248 26 188 114 30 126 3 -5 -204 11 7 -65 209 7 223 -391 160
4328 160 -144 22 98 445 382 156 170 -113 -178 87 88 350 -104 245 46 -287 491 197 22 -88 358 -186
4350 -186 655 697 -123 -282 -583 -85 644 326 392 -498 341 -330 -520 147 277 -173 356 280 458 592 419
4371 419 274 -521 695 351 117 -288 -445 -360 -611 148 217 287 232 -286 -457 157 636 -174 129 61 0 -181
4393 -181 -5 -2 -31 218 -52 207 -124 -112 -35 10 145 74 -251 -272 -28 -135 85 237 46 133 -110 -54 -199
4416 -199 153 -132 -443 198 -294 41 207 307 271 200 -169 131 106 -93 357 -347 51 -268 -155 191 114
4437 114 12 -137 124 244 -1 -228 252 136 17 -244 73 3 117 -163 141 207 -154 145 -80 -179 174
4458 174 -107 -51 -93 129 83 10 -57 39 251 -111 -72 -71 43 28 -33 33 107 -56 104 -142 -163 29 -108 -186 -153
4483a53K40j28N4Q9m8J98m64N51m09J17N5r8l0M0K52j39q4J66j72k41M53j59q7
4506Cj71O2L16j73K28m03k4L59k68K08k56J84k63Q9K59k96J97j08p6K54J56r3
4528A84R3j91k21n8L19M74o03J42R9Q0K57j189O35m35K20L71n62q4M47k47L22
4549E3k40j01L26J94j84j48K24L3M78r98P9N19L10j46k35L7r3k68J07L11m49j50
4571c41M40j61k89m3L5L2L20o77O97o10J79R58L07j164L82R7O4J13m54J13K55
4592B53l27o21K3Q23J05m29O2K44J22l78K49l7K34l29R8k60Q9K8J30m34Q71j62
4614C54k92j99k33L45J56j094J001L76m60k39N05l19L15l24K23k67K04R4j12l4
4634@K9j03R5k25N0J06J34m9n3N9q1J11l4j00Q8J30j46Np3JR3l8p1J56k93K44
$$ plain form
4483 -153 87 -41 13 102 54 252 -212 339 -70 47 102 4 -26 14 266 127 43 209 37 -204 249 90 3
4506 3 -168 -106 210 37 265 -138 -162 197 -71 137 -119 65 -198 -109 150 -146 51 -57 -133 121 277 184
4528 184 277 86 -135 -193 126 600 -3 139 238 318 575 -614 21 -414 -194 177 -385 -469 -22 -269 53
4549 53 -187 -288 38 232 48 -100 124 157 635 -363 -284 235 545 399 164 201 108 -160 -53 258 -191 -341
4571 -341 99 -62 -351 -394 -359 -327 -7 -684 13 -597 -418 540 847 -317 65 162 226 339 -115 -2 253
4592 253 -74 -695 -672 151 256 -173 -111 133 255 -123 126 89 323 -6 92 -168 -79 -51 79 -355 516 354
4614 354 62 -137 -370 -25 131 -963 38 414 -46 -285 220 -99 216 -108 115 -152 52 146 34 0
4634 0 29 -74 21 -204 -154 -48 86 37 -16 43 -38 73 39 -61 27 157 11 16 -57 -56 37 -1 -72 84 -209 35
4660C5j12o6J35j79M58k51N9m11L28j37J06J69j59NP0MMJ1m2J28l68J08n8L51
4684A88o1k29J82R9m12K85k26O6r7J51j15L40L4j89N1nl15Q8J53J48j91J08p4
4707b1n6L73l73K03j45j96K67p0j83K94J09n20K81J22j83P2j6J00M7K5l33P4J95
4730F6j6q6j38J82j41R0k9O7j24P0l4J12O8j85J54k15L30j28Q0j44O9L7l5qk4
4755A8o8n7J69j79J15J45r4K8k33K27j03N9R2k84p9J96K04k74J27L2p7q7Q8j67
4779b02K58J33k63K20o9J1l3j87J76r0K68K5m18J43K01j5k82L19j4j86J06j74
4801g3K5M1N4J77k68J7O2LN6q3j17K05o3m9R9k49K98N5k41N7l7j76J65qN5P4j29
4828e0J84j73pR4j33J51j61K29l73J80j30J50N6k31L75M0j31k1QJ13j82l26L92
$$ plain form
4660 35 -77 -143 -8 -187 271 20 79 -332 -4 -141 -35 134 -25 -20 50 54 58 69 27 155 -213 -105 -163 188
4684 188 127 -102 80 179 -233 52 -174 -108 -205 -54 -169 171 205 16 67 62 -253 -165 -12 136 -55 53 -21
4707 -21 -77 296 -77 126 -19 -215 52 -18 -201 93 202 -318 -37 85 -98 -26 -42 58 105 130 -203 -129 66
4730 66 50 -36 -174 8 -133 -43 -72 -5 -129 -59 -93 19 87 -98 56 -159 171 43 123 -21 48 85 50 42 18
4755 18 -50 -107 62 -117 -2 143 49 77 -156 71 -32 27 119 -165 -244 -48 156 -118 9 41 -36 -123 -35 -202
4779 -202 56 189 -74 146 77 88 55 -132 44 -46 222 247 -171 -28 173 158 -124 195 181 -5 101 -73
4801 -73 -48 -7 47 224 -44 -27 35 38 94 11 -106 99 36 -13 86 -163 135 190 -51 6 -31 -207 -42 -50 5 79 -50
4828 -50 134 -39 -46 48 -85 66 -95 134 -239 -59 -189 -39 17 -214 161 201 70 49 57 170 -12 -338 54
4851E4j76J52K7j26k7J10Q9k23J96Kj35K90j62j02Q3p2N9j57J88k53n8n7N69k74
4875cJ14P9q6j79R0k45J35k2J45k4j10NrJ32k41K58j59j99L93O2n0j15o9J19J23
4900A44j26p7K36j9N0j78j61Q0j06K66Pr2J62P9n07L67n32M66K18k51Oj38N1L82
4924C27m53K59j37k86j12K08K41n97K07J0K31K09j44M64l36N5l84M03m07O23j126
4945g45K37j10R56q93M15o48J304o19m29N90K20o0p91J35K94N19m88J02K44n01
4965b68K7J84k06J15k27N01m26L58M2J37o42L69R6j36r5K8K0k73K11n02O9O54
4987C6J070q44o41k03L43K01l87j33k17J096p01O71o04P04j32j29K19o22M91l21
5007a03L3P31p36J79p0J73k06P5q3n5K45j30j96L73k41l4K01k13j87K64J08n2
$$ plain form
4851 54 -122 30 57 -69 -96 14 103 -120 76 78 -57 233 71 -31 52 -20 39 -118 70 -183 -241 -298 271 -3
4875 -3 111 190 104 -75 15 -230 -95 -117 28 4 -106 -101 -110 22 -219 39 -120 -319 74 136 86 -29 -98 21 144
4900 144 18 -59 177 158 208 30 -131 -51 -157 109 116 24 186 265 -242 125 -407 59 277 26 32 -106 -55 327
4924 327 -126 133 -4 -290 -402 -194 47 -550 -343 -333 -102 107 -37 427 91 146 -238 165 -242 381 -745
4945 -745 -508 -618 338 -555 -140 -788 516 -103 -532 58 278 218 -573 -438 -144 375 -113 -11 233 -268
4965 -268 -241 -57 -263 -148 -375 126 -300 58 100 237 -405 -36 60 -76 -171 -143 -123 -396 -185 -687 -618 36
4987 36 1106 262 -379 -582 -239 -38 -425 -558 -775 321 -380 291 -313 391 259 130 349 -273 218 -103
5007 -103 -70 661 -75 104 34 207 1 76 -7 -62 183 53 -143 230 -11 -45 156 -57 -244 20 128 76
5029G6O5j18q3L5m1m3lK44j66p6O3R0K3q9N4J30k25j49J77j84J59P6j00K3P8J26
5055A42k35M8lK14k98K15j38J10L8j26K93k35m2R0k07J48l1j99K42p0L1K10l89
5078a92J83J27p0N4j16P9j15J66O7m38lM34j85j57L21k51J72m2r6J4l89N61n41
5101d17L85K06k31m1L17k17j77Q0L9P7n4J01N6lm0k46J89r4K12j09O0j06L80m74
5125a07K35l87J35J71j79K33O0j79j95J67J97j30K7j41q1K03j06J16j88L00j95
5146d4O5m9j14L21l03L4lJ54L4R8j40k23J81k42M37l02l6O8J06k00K96k18P4K4
5170A8k78K30O3j27n6J51j95O1J89j71K56m11K10K92k65K13j43p2K47j91j9m3
5192d1J26J63j96j51j2J21k64J21M23m05P0J24p6k00K53m0J0k0J70j02k97K02
$$ plain form
5029 76 141 23 -60 -25 -66 -109 -112 132 -34 -110 -47 43 66 -23 31 161 -64 -213 -36 -220 -61 15 -85 -62 16 142
5055 142 -93 -45 -48 166 -132 83 -55 55 93 -33 260 25 -17 73 -134 14 -17 -216 26 -44 -13 197 -192
5078 -192 -9 118 48 102 -14 65 -50 116 183 -255 -258 176 -9 -166 155 -96 76 34 -62 -48 -437 124 -417
5101 -417 -32 174 -57 -98 219 2 -175 -95 -56 21 -33 68 124 121 81 -165 24 -70 142 33 93 -13 367 -107
5125 -107 128 -259 -124 47 -132 101 161 -18 -213 -46 151 21 48 -93 -174 29 -77 39 -149 151 -44
5146 -44 21 -28 -142 179 -124 -90 -93 61 95 193 53 -170 11 -231 206 -96 -132 -64 42 -158 138 -80 -6 18
5170 18 -260 -30 33 -94 -150 1 -194 -133 56 -115 141 -270 -60 232 -33 180 37 -35 212 21 2 -41
5192 -41 85 248 52 -99 -111 10 -254 -133 290 -115 -45 79 3 -197 56 16 26 6 176 74 -223 -21
5214b1o6K68k90L19l03L46k54k2L8J4j12PK16m1k36J69n1j93L02k81R6j09M09
5237B05k42K07k82l9J73n4O1j9J76O5j7m99K34k2J47q6R1K23J95r09M34j50Q2
5260b6l62O64n31j90Q20m40j0L17m15J72K89k36k1J0jk40L33k67K00J1k10R2j94
5283b35L23j44J47j99J21j15J95N3k02l3jL10l05J22p5J13O0l47L59k0K3j07k14
5306a71K36j46MQ7J94j77M1J25j45k98J92J37O0j01j16J93N0M8k79k0L10p6o6
5329H2J73l05K33O3q5k0j21lm3K5M6k24K54k65L32R0l24J96m1J63l24j28M22j62
5353C4m6LQ0k22l0o7K79j30J98K8k23O6o7K90k3j90j17J29J25k73K16j55L33j78
5377F0R1l01N9K2r8J37o5ON4l9j08J92J45k14K08o8k66L28o3k35J52j77J91j4
$$ plain form
5214 -21 -87 181 -109 210 -93 253 -1 -23 15 29 -83 -76 140 99 -137 32 -19 -212 90 -191 -95 -204 205
5237 205 -37 170 -112 -151 22 -32 29 10 186 251 234 -265 -31 -53 94 8 99 322 517 -392 42 -108 -26
5260 -26 -388 276 -255 -445 375 -65 -75 242 -173 -1 288 52 31 41 40 -200 133 -134 66 77 -133 -41 -235
5283 -235 88 -56 91 -108 13 -102 93 146 -56 -89 -90 220 -85 37 -38 75 135 -212 147 127 150 43 -171
5306 -171 65 -81 -77 10 204 27 68 193 48 -250 -58 79 139 38 -78 115 165 213 -66 -86 224 148 82
5329 82 255 -50 183 246 161 141 20 17 -26 -1 45 -179 75 -190 142 232 -92 104 63 226 -98 -226 196 34
5353 34 -12 -9 71 -151 -181 -248 31 -99 99 127 -96 -30 -97 193 170 -20 -137 -8 117 -156 60 -95 238 60
5377 60 151 -150 -91 -69 -167 -30 -95 -89 -35 -74 -182 10 155 -59 149 81 -185 143 80 -155 -3 -180 11 -3
5401cP2j33J31P3p0l06J97J43l71L96k68J51Q1O6o3O1k60J03L7j5RM7j70l4j4
5426a40K64j75J04j42J22k2k4Q3j31jJ40j32J35J11m5m2p3J79j62%m7lJ19j34
5450a6p1j14J68p6J51M8j9J80k64m5j9J29j07n9j3J84Q2J89m29j75N61n03J67
5473e1Q0P5k83N12m10K2k1J37j44n7L33k02j56J53M9R8R7j61J34j81l30M07N6
5496A57k56M9O6l09L46p6k5R6J72j31p2k84K60q1K6L85n38K55r4K22j97K5n3j27
5520a84J44P6j67M4K7J24J2j09K11j26l01K69J36k64J81j40Q2K76o18L57%L2M6
5543A08J00j79n2r4J44o4J69j71R1m2%M7r5k5Q4P9o6j47J14K22l13j50M06k17
5567e1K28j22J00k93J42Q1j39p2J43m5j15k10L46j42Q0j3pK9K61l39J31J71k05
$$ plain form
5401 -3 69 -64 67 140 70 -236 -39 104 -267 129 -139 12 93 159 96 157 -103 0 37 22 31 78 -92 -126 -140
5426 -140 124 -51 53 -89 33 11 -13 70 -61 -62 78 -54 81 192 147 105 32 211 49 49 2 -1 118 -16
5450 -16 -87 -201 -33 -109 42 90 71 251 -13 -58 -77 52 -55 -114 -127 57 139 328 -101 -276 285 -218 -51
5473 -51 29 104 -179 333 -77 -55 -76 61 -83 -140 193 -9 -165 -12 37 135 232 71 205 24 -306 101 157
5496 157 -99 -50 16 -293 53 -23 -48 48 220 89 17 -267 -7 -88 -62 323 -215 40 -54 168 -29 -4 -57 -184
5520 -184 -40 36 -131 -87 -60 64 76 -33 178 52 -249 20 156 -108 73 -67 15 291 -327 30 30 62 108
5543 108 208 29 -23 -117 27 -37 132 -39 52 10 10 57 -38 -63 21 100 34 -113 1 223 -90 -240 166 -51
5567 -51 177 55 155 -138 4 85 -54 -126 17 -28 -143 -353 -7 -149 -69 -82 -89 -60 201 -138 -7 164 -41
5590d1K38j68N8O0M9j38j83o8J07K82q5k21O9l0p5L74k30l9J20j46q9J49K81l38
5614f4P6k91N01j54l45J27J75J1J48n1l02L29j00L2Lk0k92L37k0M8nR9m48O7K97
5639A58K14j84l16J32j8J20N0l18L7K22k39J79p0J37j15O6j30K32p7m9J09k49
5661a09R3J03Q5l1l76M02r3j26J84p2K2q6n6J40j8oP8j22j4j76J96p3O7j3L9L28
5687C66m64J9l0K04k43J16jN1q2j37L00k79J67k33K89m8J6k26L46J38l87R8J21
5710A01j50O7J65l22L04k44l7J4K23j02J07nN8k31J30O7q1k08K24p0R3j1j17P9
5734E4J80k04o0k81J98L86l02j09L35j87r2K70l98K44o1k6N7J96l62J77j50K11
5756G6J45j63J60j23j1N1k3k15L9J99j57jj95L43n1m0k6o4K32m04L03k14K21j4
$$ plain form
5590 -41 197 29 87 147 196 58 -125 -193 -86 196 111 -110 -41 -71 -146 228 -2 -41 79 -67 -156 -7 274 -64
5614 -64 12 -279 222 68 -277 -150 25 36 184 133 -169 160 60 92 95 75 -217 120 100 148 143 242 -206 -139 158
5639 158 372 188 -128 4 -14 106 156 -162 -125 97 -142 37 -33 104 -11 55 -75 157 80 31 140 -109
5661 -109 -16 87 172 141 -235 167 74 -52 132 60 82 -4 -60 80 62 56 134 12 -2 -178 18 -55 12 -1 38 366
5687 366 -98 -79 -109 95 -148 -32 -33 18 -64 -201 99 -180 -13 -246 43 -5 11 -215 131 269 -118 -20 101
5710 101 -49 18 183 -139 165 -79 -116 -102 121 19 126 121 179 -52 78 145 64 -144 80 10 103 92 -25 54
5734 54 234 30 -30 -311 -113 273 -29 -138 197 10 -82 188 -210 34 -27 -53 4 200 -162 15 -135 76
5756 76 221 58 218 95 84 135 112 -103 -64 135 -22 -23 -218 125 74 34 8 -56 176 -228 75 -139 82 68
5780F8j66J66j43J57J7l6o3J94l3p1k95K12q6J53l03J40Rm8J73l1j44M1j03J69
5804b3J26j09J78k59p4J57j15P5j10P3K11o3N1K6k66L7R3j60P6P2%J06j81K42
5828A63j97J87k57j57K23m3Q3J24l18L98k38R2l28L40j47k3J15o5J5P1j40j7K28
5851A09j52J13j67M9M1J1J31j87o6K84j35j68R8j45L18l08Q7J28L7L6J27l86R1
5874e4l9J91j02NK9R7j12K9J07k3j03j61L15n19L26j16K25j54k8J88k5nk22M0
5898a11Q2M0n2K85l31J57r0p5r5K75r8K5R3j7J16j65P0r9J64P5l09J97j13k94
5922b70L01O8j05n0M82m88N8ml26L40j7j02M0K77jj13j68J93j36N0q2J14k36J93
5946A8j16k8J07P4J65j28Mo9J18k78J39Q1o4k4j3J70k73L04j33j68J41q9j7K07
$$ plain form
5780 68 -98 68 -75 82 99 63 0 194 161 90 -205 7 -79 74 -229 -89 -80 -128 45 14 -130 -89 -192 -23
5804 -23 103 -6 172 -87 -161 -4 -119 -44 -154 -81 130 67 118 144 -122 -85 8 -152 -76 -4 -4 102 -79 163
5828 163 -34 153 -104 -261 -38 -81 2 126 -192 206 -32 60 -268 72 -75 -98 17 -48 -33 38 -102 -119 109
5851 109 -43 70 -97 -48 -7 4 135 -52 -118 166 31 -137 -39 -184 134 -174 -87 41 78 114 241 -145 -54
5874 -54 -93 98 -4 1 30 127 15 44 151 128 25 -136 179 -340 -14 -130 95 -59 -87 101 76 71 -151 -111
5898 -111 -29 11 -41 244 -87 70 -20 -95 -190 85 -13 12 105 88 204 39 109 10 174 249 -60 137 24 -270
5922 -270 31 99 -6 -56 426 -62 -4 -8 -334 6 -11 -113 -73 204 203 90 -78 115 -21 29 -53 61 -175 18
5946 18 -98 -126 -19 55 220 92 96 27 145 -133 6 87 23 -1 -14 156 -117 187 54 -114 27 -62 -79 128
5970A28j92Q4r3J19k87K47k95L49o8j77J36J02J3j78J86p2j52K22J15k20j92J99
5992b6J92j77r8jR3L3R1j40J08O5L0k02R0j37o9j91L42n7nJ12QJ28l03o1M05j73
6018E7Q8j93n7J86j19j0o2J15r6J5R3l8j14J04n8K10j96K06j86K10L4r8r0J37
6042A38r2m2m9Q8Q0j49Q8j69J74O8pk40L99j84L9m2k9L0j44j17J95p8J27k19K72
6067A37k18L2pK46l77K66k5o0J58j91K7j06R7k47K73Q4M3m2J3M8P3j56Jj39K17
6092A47r3o9J2k3m6J49j52n5K06K2k27R6P5k47L17kj0j17k09K18n0K10j35k15
6116a98M59k20j33K70k64pL73l55J28k85J33P8K0N2k07K25o4J55k34k5J49mr2
6139d6J09k71QJ56P1M7j20r4n7J33M11l19k08L24j05k3l5J08m0j04j43J21K9J2
$$ plain form
5970 128 -64 20 -73 46 -241 6 -289 60 -8 -185 -49 53 66 -112 74 2 -150 72 187 -33 -225 -26
5992 -26 166 -11 -109 -110 -17 16 107 -33 75 140 170 -32 58 -79 -148 -339 3 -54 -59 53 61 189 -114 -175 230 57
6018 57 145 -48 -105 81 -38 -48 -110 5 -91 -76 17 -21 -135 -31 -89 121 -75 131 -55 155 189 91 1 138
6042 138 46 4 -45 43 123 -26 62 -107 67 135 128 -112 287 103 142 100 71 101 -43 -160 35 -43 84 -135 137
6067 137 -81 -49 -56 190 -187 79 54 -6 152 -39 -12 -118 -21 -268 5 89 132 90 103 151 224 68 69 -70 147
6092 147 54 -15 -3 -26 -72 77 -75 -130 76 98 -129 -33 42 -205 112 110 100 -17 -226 -8 -58 152 17 -198
6116 -198 261 41 -92 178 -86 -93 280 -75 53 -232 -99 -21 -1 51 -156 69 5 160 -74 -99 50 46 -46
6139 -46 63 -208 -200 -44 27 74 -46 -140 -197 -64 347 28 -180 144 39 16 -19 89 49 -55 -198 -77 -48 -36
6163c6K21j17M8j20n5K22o3p4j04J83j66o4K17M8j8M7j47k3R4j42j27J11R0K0
6187D5r3J23N7k95K95j16OL0l0K41j38k88M0J77p6J04p3j0J26k77oJ13r9q4R6
6212a32J18J52P5m2k17P9n0J36l1j96J30QJ2j56NN6k7J24O9n5j81M03m24j9J0
6237a53J46j51L1J27j29l6J30oK69k33j74J94N8k0j05J99k34j85QL65q0j58PK14
6261H4M8q8J7R1k10O7j18K30j59j8K27j80RJ27p1K12j85m2M5j37N0J74o5j42r6
$$ plain form
6163 -36 185 68 116 -4 -59 163 100 26 -78 105 -61 -125 92 140 122 169 22 -1 93 -49 -176 -65 25 45
6187 45 -48 75 132 -163 132 16 22 52 22 263 125 -163 -123 54 -22 82 9 -1 125 -152 -158 -45 -144 -228 -132
6212 -132 -14 138 213 171 -46 33 -17 119 88 -108 22 30 42 -114 -109 -53 -80 44 113 58 -123 280 -144 -163 -153
6237 -153 -7 -158 -127 0 -129 -165 -35 -41 228 -5 -179 15 73 53 -52 147 -87 -272 -264 101 21 -137 -130 84
6261 84 132 44 61 152 -58 9 -109 121 -38 -56 171 -9 0 127 56 268 83 41 86 -51 -1 173 108 -34 -130
$$ [...]
8191G8
##END NTUPLES=NMR FID
##END=
