##TITLE=1H_K-380/3
 CDCl3, 8 sc, 
 25.12.2019
##JCAMPDX= 6.0         $$ Bruker NMR JCAMP-DX V2.0
##DATA TYPE= NMR FID
##DATA CLASS= NTUPLES
##ORIGIN= UXNMR, Bruker Analytische Messtechnik GmbH
##OWNER= root
$$ XWIN-NMR		Version 3.5
$$ Wed Dec 25 14:18:52 2019 Russian Standard Time (UT+4h)  she@DPX200
##.OBSERVE FREQUENCY= 200.1315
##.OBSERVE NUCLEUS= ^1H
##.DELAY= (6, 6)
##.ACQUISITION MODE= SIMULTANEOUS
##.ACQUISITION SCHEME= undefined
##.AVERAGES= 8
##.DIGITISER RES= 18
##SPECTROMETER/DATA SYSTEM= spect
##.PULSE SEQUENCE= zg30
##.SOLVENT NAME= DMSO
##.SHIFT REFERENCE= (INTERNAL, DMSO, 0, 15.7039)
##AUDIT TRAIL= $$ (NUMBER, WHEN, WHO, WHERE, WHAT)
$$ ##TITLE= Audit trail, XWIN-NMR		Version 3.5
$$ ##JCAMPDX= 5.01
$$ ##ORIGIN= Bruker BioSpin GmbH
$$ ##OWNER= she
$$ F:/spectra/data/she/nmr/H-F/1/audita.txt
$$ ##AUDIT TRAIL=  $$ (NUMBER, WHEN, WHO, WHERE, WHAT)
(   1,<2019-12-25 14:17:26.07 +0400>,<she>,<DPX200>,
      <created by zg, POWCHK disabled, PULCHK disabled
       configuration hash MD5:
       00 E9 B6 7A A2 85 ED C7 34 08 36 98 17 FE 4E 26
       data hash MD5: 16K
       ED 4C 30 CA 9A CC ED 69 55 E8 24 50 5C DE 1D 4A>)
$$ ##END=
$$ 
$$ hash MD5
$$ 68 58 C5 B8 7F 73 04 5B CF F9 B2 43 32 56 58 75
##$RELAX= 
##$RELAX= 
##$RELAX= 
##$RELAX= 
##$RELAX= 
##$RELAX= 
$$ Bruker specific parameters
$$ --------------------------
##$DU= <F:/spectra>
##$EXPNO= 1
##$NAME= <H-F>
##$PROCNO= 1
##$TYPE= <nmr>
##$USER= <she>
##$AMP= (0..31)
100 100 100 100 100 100 100 100 100 100 100 100 100 100 100 100 100 100 
100 100 100 100 100 100 100 100 100 100 100 100 100 100 
##$AQSEQ= 0
##$AQ_mod= 1
##$AUNM= <au_zg>
##$AUTOPOS= <>
##$BF1= 200.13
##$BF2= 200.13
##$BF3= 200.13
##$BF4= 200.13
##$BF5= 200.13
##$BF6= 200.13
##$BF7= 200.13
##$BF8= 200.13
##$BYTORDA= 1
##$CFDGTYP= 0
##$CFRGTYP= 5
##$CHEMSTR= <none>
##$CNST= (0..31)
1 1 145 1 1 1 1 1 1 1 1 1 1 1 1 1 1 1 1 1 1 1 1 1 1 1 1 1 1 1 1 1 
##$CPDPRG= <>
##$CPDPRG1= <>
##$CPDPRG2= <>
##$CPDPRG3= <>
##$CPDPRG4= <mlev>
##$CPDPRG5= <mlev>
##$CPDPRG6= <mlev>
##$CPDPRG7= <mlev>
##$CPDPRG8= <mlev>
##$CPDPRGB= <>
##$CPDPRGT= <>
##$D= (0..31)
0 1.2 0 0 0 0 0 0 0 0.06 0 0.03 0 0 0 0 0.0002 0 0 0 0 0 0 0 0 0 0 0 0 
0 0 0 
##$DATE= 1577269045
##$DBL= (0..7)
120 120 120 120 120 120 120 120 
##$DBP= (0..7)
150 150 150 150 150 150 150 150 
##$DBP07= 0
##$DBPNAM0= <>
##$DBPNAM1= <>
##$DBPNAM2= <>
##$DBPNAM3= <>
##$DBPNAM4= <>
##$DBPNAM5= <>
##$DBPNAM6= <>
##$DBPNAM7= <>
##$DBPOAL= (0..7)
0.5 0.5 0.5 0.5 0.5 0.5 0.5 0.5 
##$DBPOFFS= (0..7)
0 0 0 0 0 0 0 0 
##$DE= 6
##$DECBNUC= <off>
##$DECIM= 24
##$DECNUC= <off>
##$DECSTAT= 4
##$DIGMOD= 1
##$DIGTYP= 9
##$DL= (0..7)
0 120 120 120 120 120 120 120 
##$DP= (0..7)
150 150 150 150 150 150 150 150 
##$DP07= 0
##$DPNAME0= <>
##$DPNAME1= <>
##$DPNAME2= <>
##$DPNAME3= <>
##$DPNAME4= <>
##$DPNAME5= <>
##$DPNAME6= <>
##$DPNAME7= <>
##$DPOAL= (0..7)
0.5 0.5 0.5 0.5 0.5 0.5 0.5 0.5 
##$DPOFFS= (0..7)
0 0 0 0 0 0 0 0 
##$DQDMODE= 0
##$DR= 18
##$DS= 0
##$DSLIST= <SSSSSSSSSSSSSSS>
$$ [...]
##$SUBNAM2= <"">
##$SUBNAM3= <"">
##$SUBNAM4= <"">
##$SUBNAM5= <"">
##$SUBNAM6= <"">
##$SUBNAM7= <"">
##$SUBNAM8= <"">
##$SUBNAM9= <"">
##$SW= 24.9337058887773
##$SWIBOX= (0..15)
0 0 2 0 0 0 0 0 0 0 0 0 0 0 0 0 
##$SW_h= 4990.01996007984
##$TD= 16384
##$TD0= 1
##$TE= 0
##$TE2= 300
##$TE3= 300
##$TEG= 300
##$TL= (0..7)
0 120 120 120 120 120 120 120 
##$TP= (0..7)
150 150 150 150 150 150 150 150 
##$TP07= 0
##$TPNAME0= <>
##$TPNAME1= <>
##$TPNAME2= <>
##$TPNAME3= <>
##$TPNAME4= <>
##$TPNAME5= <>
##$TPNAME6= <>
##$TPNAME7= <>
##$TPOAL= (0..7)
0.5 0.5 0.5 0.5 0.5 0.5 0.5 0.5 
##$TPOFFS= (0..7)
0 0 0 0 0 0 0 0 
##$TUNHIN= 0
##$TUNHOUT= 0
##$TUNXOUT= 0
##$USERA1= <user>
##$USERA2= <user>
##$USERA3= <user>
##$USERA4= <user>
##$USERA5= <user>
##$V9= 5
##$VALIST= <valist>
##$VCLIST= <CCCCCCCCCCCCCCC>
##$VD= 0
##$VDLIST= <DDDDDDDDDDDDDDD>
##$VPLIST= <PPPPPPPPPPPPPPP>
##$VTLIST= <TTTTTTTTTTTTTTT>
##$WBST= 1024
##$WBSW= 4
##$XGAIN= (0..3)
0 0 0 0 
##$XL= 0
##$YL= 0
##$YMAX_a= 185872
##$YMIN_a= -105059
##$ZGOPTNS= <>
##$ZL1= 120
##$ZL2= 120
##$ZL3= 120
##$ZL4= 120
##$ABSF1= 10
##$ABSF2= 0
##$ABSG= 5
##$ABSL= 3
##$ALPHA= 0
##$AQORDER= 0
##$ASSFAC= 0
##$ASSFACI= 0
##$ASSFACX= 0
##$ASSWID= 0
##$AUNMP= <proc_1d>
##$AZFE= 0.1
##$AZFW= 0.1
##$BCFW= 1
##$BC_mod= 2
##$BYTORDP= 1
##$COROFFS= 0
##$CY= 11.3945322036743
##$DATMOD= 1
##$DC= 2
##$DFILT= <>
##$DTYPP= 0
##$F1P= 16.9975609425685
##$F2P= -3.02152046262296
##$FCOR= 0.5
##$FTSIZE= 0
##$FT_mod= 4
##$GAMMA= 1
##$GB= 0.15
##$INTBC= 1
##$INTSCL= 1
##$ISEN= 128
##$LB= 0.24
##$LEV0= 0
##$LPBIN= 0
##$MAXI= 10000
##$MC2= 0
##$MEAN= 0
##$ME_mod= 0
##$MI= 1.114404
##$NCOEF= 0
##$NC_proc= 0
##$NLEV= 6
##$NOISF1= 3.799351
##$NOISF2= 2.8
##$NSP= 1
##$NTH_PI= 0
##$NZP= 0
##$OFFSET= 15.70392
##$PC= 1
##$PHC0= -10146.09
##$PHC1= 15.6008
##$PH_mod= 1
##$PKNL= yes
##$PPARMOD= 0
##$PSCAL= 0
##$PSIGN= 0
##$REVERSE= no
##$SF= 200.130013532006
##$SI= 16384
##$SIGF1= 3
##$SIGF2= 2
##$SINO= 400
##$SIOLD= 16384
##$SREGLST= <1H.CDCl3>
##$SSB= 0
##$STSI= 0
##$STSR= 0
##$SW_p= 3612.71676300578
##$SYMM= 0
##$S_DEV= 0
##$TDeff= 0
##$TDoff= 0
##$TI= <>
##$TILT= no
##$TM1= 0
##$TM2= 0
##$TOPLEV= 0
##$USERP1= <user>
##$USERP2= <user>
##$USERP3= <user>
##$USERP4= <user>
##$USERP5= <user>
##$WDW= 1
##$XDIM= 8192
##$YMAX_p= 0
##$YMIN_p= 0
$$ End of Bruker specific parameters
$$ ---------------------------------
##NTUPLES= NMR FID
##VAR_NAME=  TIME,          FID/REAL,        FID/IMAG
##SYMBOL=    X,             R,               I
##VAR_TYPE=  INDEPENDENT,   DEPENDENT,       DEPENDENT
##VAR_FORM=  AFFN,          ASDF,            ASDF
##VAR_DIM=   8192,          8192,            8192
##UNITS=     SECONDS,       ARBITRARY UNITS, ARBITRARY UNITS
##FACTOR=    0.0002004,     1,               1
##FIRST=     0,             0,               0
##LAST=      1.6414764,     0,               0
##MIN=       0,             -105059,         0
##MAX=       1.6414764,     185872,          0
$$ Real data points
##PAGE= N=1
##DATA TABLE= (X++(R..R)), XYDATA
$$ [...]
1993c89K94J91j95OL26L43k82m44k3k20Q1l91k58K13J66NK41k20k51R83L36M8
$$ -389 -95 96 -99 -93 233 576 294 -150 -173 -393 -312 -703 -961 -748 -582 -577 -336 -556 -807 176 512 560
2015E60k97o6K57L09m08j94k72j28L29l78j76k46L80J31J04j21N6M12M98J17l06
$$ 560 263 197 454 763 355 161 -111 -239 90 -288 -464 -710 -330 -199 -95 -216 -160 252 750 867 561
2036E61l24N71Oj56l84j44j93J8K74o76M15L92O8J32J46l87N02K39j12j76n37
$$ 561 237 808 814 658 274 130 -63 -45 229 -447 -32 360 428 560 706 319 821 1060 948 772 235
2057B35K77K41k7qr36L44j00L49K70n17J37M82J50J38j76KN6K92l15o12K99m87
$$ 235 512 753 726 718 -218 126 26 375 645 128 265 747 897 1035 859 861 917 1209 894 282 581 94
2079I4N20n72J2l40M14L1L64k68J7N44J87Q8n03j15K42J89l30j87m05j09J11J44
$$ 94 614 42 54 -286 128 159 523 255 272 816 1003 1091 588 473 715 904 574 387 -18 -127 -16 128
2101A28m95n6J52N16M0k49j52M25M11L7k51j04k80L08j7m87j40j92M9r5n0k46
$$ 128 -367 -423 -271 245 285 36 -116 309 720 757 506 402 122 430 413 -74 -214 -406 -357 -452 -502 -748
2123g48k4M35K34j16j0P4O46K59n32j17m6k0L28n16m00j99K04L51j20j39j01L38
$$ -748 -772 -337 -103 -219 -229 -155 491 750 218 101 55 35 363 -153 -553 -752 -548 -197 -317 -456 -557 -219
2145b19K48O5J34L1K8O3K16n22Q9N5J97p0m79k60J35M76K88m88j41K14K80O70
$$ -219 29 94 228 259 287 350 566 44 133 188 385 315 -164 -424 -289 187 475 -13 -154 60 340 1010
2167A010o89J07J17M05r0l86n13N90j86k68J07k14O0P2M14k52l15K68N05Q3l60
$$ 1010 321 428 545 950 860 474 -39 551 365 97 204 -10 50 122 536 284 -31 237 742 825 465
2188D65L1l00L27j25j82k75k3j14j7J67k78j8K13R1M1j74K0M54l8k35k90K53j56
$$ 465 496 196 523 398 216 -59 -82 -196 -213 -46 -324 -342 -129 -38 3 -171 -151 303 265 30 -260 -7 -163
2211a63l7o5l96q3J29n5M19n19J40K4N21R9m6n04O11k36N4k82p6k51K45j32l78
$$ -163 -200 -265 -661 -744 -615 -670 -251 -770 -630 -606 -85 14 -32 -536 75 -161 -107 -389 -465 -716 -471 -603 -981
2234i81j10J99K9N09r1k53K59M96j9j76j20R6L32k47J57m08j62J6K61k44j17J37
$$ -981 -1091 -892 -863 -354 -445 -698 -439 57 38 -138 -258 -162 170 -77 80 -328 -490 -474 -213 -457 -574 -437
2256d37P1J60P2j25j76M60L85J17k51m45O66K30l07k57k27J86j61kj65P0K41R4
$$ -437 -366 -206 -134 -259 -435 25 410 527 276 -169 497 727 420 163 -64 122 -39 -41 -206 -136 105 199
2278A99K39j51j34L00J26N5r3k62K91o9j60k75n8J74j74L0J03k35L52O5K73P8
$$ 199 438 287 153 453 579 634 541 279 570 501 341 66 8 182 8 38 141 -94 258 323 596 674
2300F74o05K38J91P3j77k09k07L91k00r5l25k58M29M9Kk96J99J35L31J1m18J24
$$ 674 69 307 498 571 394 185 -22 369 169 74 -251 -509 -80 -31 -29 -325 -126 9 340 351 -67 57
2322E7K46k74L35l01k81M22k10n57J05q9J04M63k42R3k02L73N61m45k37k51K42
$$ 57 303 29 364 63 -218 204 -6 -563 -458 -547 -443 20 -222 -129 -331 42 603 158 -79 -330 -88
2343h8L86j84q0n25K91k40L61n67L2J75O83j11j90K6K7K85j9J59L6n68K54Rl35
$$ -88 298 114 34 -491 -200 -440 -79 -646 -614 -439 244 133 -57 -31 -4 281 262 421 457 -111 143 152 -183
2366a83L2k61L01n7k78j42J84K04K93%p4k4K33J3m90k1J0j32N40p59R8j12q5M44
$$ -183 -151 -412 -111 -168 -446 -588 -404 -200 93 93 19 -5 228 241 -249 -270 -260 -392 148 -611 -513 -625 -710 -266
2390b66k34O8J05L6M36O6m18L18k87K99k9j98J03k35L20j31m73P2K40k7L56j26
$$ -266 -500 -432 -327 -291 145 211 -207 111 -176 123 94 -104 -1 -236 84 -47 -520 -448 -208 -235 121 -5
2412ej60O2M26P7m70K19N71j64Q4n56r9j32K23q9L59q1l83L69P6j36j45J21L79
$$ -5 -165 -103 323 400 -70 149 720 556 640 84 -15 -147 76 -13 346 265 -118 251 327 191 46 167 546
2435E46J30P1k74p9K05m7o53K05j07N31k19j96Q6j62J8K70J80j01n9J52J46l32
$$ 546 676 747 473 394 599 552 -101 104 -3 528 309 113 199 37 55 325 505 404 345 497 643 311
2457C11O5o8j73N8K9n58k66J54J39J39k25K24N3K54N8j71m6j71L70%r1o48J67
$$ 311 376 308 135 193 222 -336 -602 -448 -309 -170 -395 -171 -118 136 194 23 -23 -194 176 176 85 -563 -396
2480c96K12J6m39J3j95K59jKk52K24M88o3q9K3k11j25K36k05j25j66L28J9k56
$$ -396 -184 -168 -607 -594 -789 -530 -531 -529 -781 -557 -69 -132 -221 -198 -409 -534 -298 -503 -628 -794 -466 -447 -703
2503g03m3m5K40J36R3j44n9O05k61j6OJ26L1J58k46k46l9k27N53l74J56j61q2
$$ -703 -746 -791 -551 -415 -322 -466 -525 80 -181 -197 -191 -65 -34 124 -122 -368 -407 -634 -81 -455 -299 -460 -542
2526e42N96j47j24M94o7j05L97m25M3L7K7K86l55m07M40KN7j58M3k72O51N9r7
$$ -542 54 -93 -217 277 210 105 502 77 120 157 184 470 115 -292 148 150 207 49 92 -180 471 530 433
2549D33q1N8K80J69k83l05J65R0j37r0m80M62j58L28j14p8j18K87M75j55j25K28
$$ 433 352 410 690 859 576 271 436 526 389 299 -181 281 123 451 337 259 141 428 903 748 623 851
2571H51j39J74r7r8k35j75R8l2k68J35J09K1J61j43R2K64Q5k31j47q9K62K38o46
$$ 851 712 886 789 691 456 281 379 347 79 214 323 344 505 362 454 718 803 572 425 336 598 836 190
2594A90j20L3r3N0k33J85l18L26Q0L46J87m67L04n0K33m46l7K28l06M6q7R5l61
$$ 190 70 103 10 60 -173 12 -306 20 100 446 633 166 470 420 653 207 170 398 92 138 51 146 -215
2617b15J9J38j48q6J25M12k19j0j38J16L80l86L07m92L74k8m44J32k07R8j85J99
$$ -215 -196 -58 -206 -292 -167 245 26 16 -122 -6 374 -12 295 -197 177 149 -295 -163 -370 -272 -457 -258
2639b58k49J31M6J32K02j52J64k63L15J60j95m81J79k50K70j98p6L0Q7M26l44
$$ -258 -507 -376 -330 -198 4 -148 16 -247 68 228 33 -448 -269 -519 -249 -447 -523 -493 -406 20 -324
2660c24J23K4k04L18R4qk73J43J11N4l45n6k15L43k50o7K57j65K26L64m05J28
$$ -324 -201 -177 -381 -63 31 23 -250 -107 4 58 -287 -343 -558 -215 -465 -532 -275 -440 -214 150 -255 -127
2682a27J82k78K84J55n35L09N2k92L5j87K0J97K8q6l15L64p4M45j59J7j5k4J47
$$ -127 55 -223 61 216 -319 -10 42 -250 -215 -402 -382 -185 -157 -243 -558 -194 -268 177 18 35 20 -4 143
2705A43j74l0r3J95j70l50J11o9j53K78l7j00M67m80N64K4k26M9K4k3j18q6k44
$$ 143 -31 -61 -154 41 -129 -479 -368 -437 -590 -312 -349 -449 18 -462 102 126 -100 -51 -27 -50 -168 -254 -498
2728d98L08k96j8Ro4k11N78j34N9P2o2P8J9j54J50k76K52J13k64k10K14j66J62
$$ -498 -190 -486 -504 -495 -559 -770 -192 -326 -267 -195 -257 -179 -160 -314 -164 -440 -188 -75 -339 -549 -335 -501 -339
2751c39K8k46k6J61k53R5M13k08M25j26M64o78q4N5J88k55k55L73K08n56R9K17
$$ -339 -311 -557 -583 -422 -675 -580 -167 -375 50 -76 388 -290 -374 -319 -131 -386 -641 -268 -60 -616 -517 -300
2773c00j34J18K12R6j05R3P2J8J9l92L87o1j36j86J88k52J07m0J95j29j20L59
$$ -300 -434 -316 -104 -8 -113 -20 52 70 89 -303 84 23 -113 -299 -111 -363 -256 -296 -101 -230 -350 9
2795IR0K40o3k16J1j18K68o67L41l1J98k52R5o1l7P6J98J13p7j52J3L98k05N5
$$ 9 99 339 276 60 71 -47 221 -446 -105 -136 62 -190 -95 -156 -193 -117 81 194 117 -35 -22 376 171 226
2819B26K17o7P6l79oj60L18k6j76K82j79q6O12m87p0M34j68K99jk45m92N69Qk73
$$ 226 443 376 452 73 67 -93 225 199 23 305 126 40 652 165 95 529 361 660 659 414 -78 491 499 226
2843B26k55K42j20k73K25j00K2J59k24M56k80M00k32l53O17km49j33Q0j28k04
$$ 226 -29 213 93 -180 45 -55 -33 126 -98 358 78 478 246 -107 510 508 59 -74 6 -122 -326
2864c26k2J97j24L59k00j60L7L9J64j39K17K54k49J05K81m95r7J43n6N3k05L4
$$ -326 -348 -151 -275 84 -116 -276 -239 -200 -36 -175 42 296 47 152 433 -62 -159 -16 -72 -19 -224 -190
2886a90J14M0J6N5k57N41n3l4K79n56M52Jk35kj19L8J85m59M33k51j00L21l08
$$ -190 -76 -36 -20 35 -222 319 266 232 511 -45 407 408 173 171 52 90 275 -184 249 -2 -102 219 -89
2909h9J98l13K41K65L7l62K94JRj98l5k34J44J21L3L1O2j33L73l09J81K37n65
$$ -89 109 -204 37 302 339 -23 271 272 281 83 48 -186 -42 79 112 143 205 72 445 136 317 554 -11
2932a1J76N07n06L12k64J54Q4l41J65lm5j33K16J26J8K6J30Mk59K33k31L5L8j35
$$ -11 165 672 166 478 214 368 452 111 276 273 228 95 311 437 455 481 611 615 356 589 358 393 431 296
2956B96K3n0J0j41m1j02L08l09J64j74L2P8K89Nl59J51j47J21M0l91J27M6j00
$$ 296 319 269 279 138 97 -5 303 -6 158 -16 16 94 383 388 29 180 33 154 194 -197 -70 -24 -124
2979a24J59m4K34n09Q3J57L51l24J60K74n32J07K69k15j04K26k05j63j8J92k85
$$ -124 35 -9 225 -284 -201 -44 307 -17 143 417 -115 -8 261 46 -58 168 -37 -200 -218 -26 -311
3000c11J92l6N1l52M87q4J42j42N1Q7m1q5J02l09J62p4P7k13L29j90p0m57M23
$$ -311 -119 -155 -104 -456 31 -53 89 -53 -2 85 44 -41 61 -248 -86 -160 -83 -296 33 -157 -227 -684 -261
3023b61K95k83K98j22k50pM92m82M6j17J18K07j12L9n7r3J96m1J36n5J19M6J04
$$ -261 34 -249 49 -73 -323 -330 162 -320 -274 -391 -273 -66 -178 -139 -196 -289 -93 -134 2 -53 66 112 216
3046B16l86p5L18j20K43j07L43n62M39j43k12O1l83L96J98j2j27L8q3J20R8k49
$$ 216 -170 -245 73 -47 196 89 432 -130 309 166 -46 15 -368 28 226 214 87 125 42 162 260 11
3068A1J24K1R7j51K9mk49J76k2jK58j93J19J36k6j75J80j33K69q2j07q2P6M14
$$ 11 135 156 253 102 131 127 -122 54 32 31 289 96 215 351 325 150 330 197 466 384 277 195 271 685
3092F85o89M6j16J47k4j36O7M9K8L5L6r2J72LJ27j16j73J64M3j48k60l38M26K95
$$ 685 -4 42 -74 73 49 -87 -20 29 57 92 128 36 208 211 338 222 49 213 256 108 -152 -490 -64 231
3116B31j91m8L8R6l10K29j31j65J69p4K02l87p1J39J40m56K85N2n6M2O4J33n6
$$ 231 40 -8 30 126 -184 45 -86 -251 -82 -156 46 -341 -412 -273 -133 -589 -304 -252 -308 -266 -202 -69 -125
3139a25J21k94J5L34k5l17l1M74k02k66J98R8r7j51o0P1N6M2j25R4J57J07o7M2
$$ -125 -4 -298 -283 51 26 -291 -322 152 -50 -316 -118 -20 -117 -268 -328 -257 -201 -159 -284 -190 -33 74 7 49
3163D9R8k04j19M57l22R2j24L6j90L54j20P7k46N0o1L27j09J54j32l00J28J20
$$ 49 147 -57 -176 281 -41 51 -73 -37 -227 127 7 84 -162 -112 -173 154 45 199 67 -233 -105 15
3185A5J3Pj27j08j71K25o7L04j42L3j11M15k44o3K04K15j79p2j19k2M38n06K49
$$ 15 28 35 -92 -200 -371 -146 -213 91 -51 -18 -129 286 42 -21 183 398 219 147 28 6 444 -62 187
3208A87o9n1K07m49L36j45j67J66P7o8K53oM0l87K59j10n4L72o37M82j24l15o0
$$ 187 118 67 274 -175 161 16 -151 15 92 24 277 271 311 -76 183 73 19 391 -246 236 112 -203 -263
3231b63N23m02M57j62JJ13j91k1J01l33L76K42j77j79J25m78J56J03j78M42j01
$$ -263 260 -142 315 153 154 267 76 55 156 -177 199 441 264 85 210 -268 -112 -9 -187 255 154
3252A54k00Q9R5J1L7m4L44m12n9J11m9Q9l27J53q3k2L55l9j65rj14J01J31k97
$$ 154 -46 43 138 149 186 142 486 74 15 126 77 166 -161 -8 -91 -113 242 203 38 29 -85 16 147 -150
3276a50L40l33L84k48r8K40m69R8L12j93qj49J38K6p4j4m4M2R4l3L9J19m86M3
$$ -150 190 -143 241 -7 -105 135 -334 -236 76 -117 -125 -274 -136 -110 -184 -198 -242 -200 -106 -139 -100 19 -467 -424
3300d24J27J95k14L37k46q7k38Q6O53l81L22k5l00K00J96k35J74k36J27K00j63
$$ -424 -297 -102 -316 21 -225 -312 -550 -464 189 -192 130 105 -195 5 201 -34 140 -96 31 231 68
3321F8j87o3R7N7J11j33j89K53k31L98k35K25J09J51l18j0J89k19Pn4j65J60p1
$$ 68 -119 -182 -85 -28 83 -50 -239 14 -217 181 -54 171 280 431 113 103 292 73 80 26 -139 21 -50
3344e0o8R4km1L00k33j95L38Q7L6l68p0M23k94N8j81K53l51l3RK35k08J40K30
$$ -50 -118 -24 -26 -67 233 0 -195 143 230 266 -102 -172 251 -43 15 -166 87 -264 -297 -288 -53 -261 -121 109
3368A09k17L70l27K72j15j46J17L0j11j02J39m9o1k13J35k09J97M0k04J56J20
$$ 109 -108 262 -65 207 92 -54 63 93 -18 -120 19 -30 -91 -304 -169 -378 -181 -141 -345 -189 -69
3389f9q0K29k00j03K30j69L14m93M96n67M2K54n7K0J15J6l22J39j79mK79Q2K51
$$ -69 -149 80 -120 -223 7 -162 152 -341 155 -412 -370 -116 -173 -153 -38 -22 -344 -205 -384 -388 -109 -27 224
3412B24k98J41r9k74K79k13n7J25K53L5k93q0J03J59m9L9j10J59J27k8Q8m4K6
$$ 224 -74 67 -32 -306 -27 -240 -297 -172 81 116 -177 -257 -154 5 -44 -5 -115 44 171 143 231 187 213
3435B13l5J66q5L1j80j15K37L7n3J28k39K83j13N6j39M66m05O8l97K00J79Q2j74
$$ 213 178 344 259 290 110 -5 232 269 216 344 105 388 275 331 192 658 253 321 -76 124 303 385 211
3458B11Q0j38K5K0N8nl82L53k53N05p4m44L31k37K08o7n1k5Q6J50l78L6J38L3
$$ 211 291 153 178 198 256 251 -131 222 -31 474 400 -44 287 50 258 191 140 115 201 351 -27 9 147 180
3482A80J2k5R9k44L78n3j6l4l22j85K04k3L8j42Ql3K9J58j46j50J97PJ85j13l06
$$ 180 192 167 266 22 400 347 331 297 -25 -210 -6 -29 9 -133 -125 -158 -129 29 -117 -267 -70 -63 122 9 -297
3507b97L24j26k08J41Ok2J31k53J80j63K06kl58K15K09o08O02k75K46J1l87P9
$$ -297 27 -99 -307 -166 -160 -182 -51 -304 -124 -287 -81 -83 -441 -226 -17 -625 -23 -298 -52 -41 -428 -349
3529c49K72k78J93r5M3l6m1J15j08J46P3k5L6L5j30L58r7n71N81r4K17k76k34
$$ -349 -77 -355 -162 -257 -214 -250 -291 -176 -284 -138 -65 -90 -54 -19 -149 209 112 -459 122 28 245 -31 -265
3552b65J24P1Q8J70j74n3K60k67jl1k22M05N3q0KM7k45L69l70q7j59K60k64K13
$$ -265 -141 -70 18 188 14 -39 221 -46 -47 -78 -300 105 158 78 80 127 -118 251 -119 -206 -365 -105 -369 -156
3576a56q0p4M43m96N25l66j22L16O3k24K33k06kK15j88K40j9j78J78l10J97KJ51
$$ -156 -236 -310 133 -363 162 -204 -326 -10 53 -171 62 -144 -146 69 -119 121 102 -76 102 -208 -11 -9 142
3599A42P9n3j04k35%J99k8J2L2j72M15k14k88M56j69k87K69jk57J64J09L63n28
$$ 142 221 168 64 -171 -171 28 0 12 44 -128 287 73 -215 241 72 -215 54 53 -204 -40 69 432 -96
3622i6K43o7j40J24j81K72k86J9j69K17j54R5k07J16J40OO6p5JQ5j36N7K27k07
$$ -96 147 80 -60 64 -117 155 -131 -112 -281 -64 -218 -123 -330 -214 -74 -68 -2 -77 -76 9 -127 -70 157 -50
3646e0q3M2J20k24J48m4j68J64j35J44J64qo3j23J78K97l86j62r0K55o0j10k1
$$ -50 -133 -91 29 -195 -47 -91 -259 -95 -230 -86 78 70 7 -116 62 359 -27 -189 -279 -24 -84 -194 -215
3669b15M2N4j64J58j20J23K04K0J7k6J05m8j09l68N81l74j2K01j26O9P0j56Q9
$$ -215 -173 -119 -283 -125 -245 -122 82 102 119 93 198 150 41 -327 254 -120 -132 69 -57 12 82 -74 15
3692A5J10m1l23N02j09P8R1J2lk43o8K10N0j43j39j25l9K59N3Q4m6JM13o11K47
$$ 15 125 84 -239 263 154 232 323 335 332 89 21 231 281 138 -1 -126 -165 94 147 231 185 186 599 -12 235
3717B35J42j48k38M14j80j4j56j54J68O4L9j08K80l50J41K98m04k76M89l03N66
$$ 235 377 229 -9 405 225 211 55 -99 69 133 172 64 344 -6 135 433 29 -247 242 -61 505
3738E05n41P3M8l1M6k49J98j25J36j5J76k54M4K15P2k88j67K02J57k74n2J74j94
$$ 505 -36 37 85 54 100 -149 49 -76 60 45 221 -33 11 226 298 10 -157 45 202 -72 -124 50 -144
3761a44K98p6j27N1J66m74J48Q9J05k8p7k31K59k33L01k07P8k08M1O2K05K1l36
$$ -144 154 78 -49 2 168 -306 -158 -69 36 8 -69 -300 -41 -274 27 -180 -102 -310 -269 -207 -2 19 -317
3784c17L25l66K28O1P5j72K76k53K10k09J24J9J80l48O7j6J57j64n6L7J4N44n57
$$ -317 8 -358 -130 -69 6 -166 110 -143 67 -142 -18 1 181 -167 -100 -116 41 -123 -179 -142 -128 416 -141
3807a41J65j82j39L96k14J06K46k88K61L8m10q3j66L95N2k30K97j52L51l77J58
$$ -141 24 -158 -297 99 -115 -9 237 -51 210 248 -162 -245 -411 -16 36 -194 103 -49 302 -75 83
3828H3j23j89M27j00m7j83K55o7j27j13J30J32q5J86p5J53j57k66K55L59l25J77
$$ 83 -40 -229 198 98 51 -132 123 56 -71 -184 -54 78 -7 179 104 257 100 -166 89 448 123 300
3850C00l0k59l3L23j60l64J96k23K53L8L3o5J40k12K59l41N5N2j11M52l02n3J02
$$ 300 270 11 -22 301 141 -223 -27 -250 3 41 74 9 149 -63 196 -145 -90 -38 -149 303 1 -52 50
3873E0k51L11k43L53j41j46K08oj09j14k9J94j23L9J07j56R6P7j68j01J88j30
$$ 50 -201 110 -133 220 79 -67 141 135 26 -88 -117 77 -46 -7 100 -56 40 117 -51 -152 36 -94
3895i4P2L75l43J20j56n5M9j29J69J88l98L09l07K18j16j81P9Q6O6k99J45j24
$$ -94 -22 353 10 130 -26 -81 -32 -161 8 196 -202 107 -200 18 -98 -279 -200 -114 -48 -347 -202 -326
3917c26Q2J23k00J39J87k06J16m4K5K77q7k22J71k21J26m9k8n2OM7K55m55J16
$$ -326 -244 -121 -321 -182 5 -201 -85 -129 -104 173 86 -136 35 -186 -60 -109 -137 -189 -183 -136 119 -336 -220
3940b20J57j58L72k21N7K13j93L2M71j98l12nJ27j27K4Qn7M25m92K07m8q5J79
$$ -220 -63 -221 151 -70 -13 200 7 39 510 312 0 -5 122 -5 19 27 -30 395 -97 110 62 -23 156
3963A56r7j9J6j39Q5J87j1j79K50l1j39j14K68m6k51J09q4J96j8R4j9k51L6J6
$$ 156 59 40 56 -83 2 189 178 -1 249 218 79 -35 233 187 -64 45 -39 157 139 233 214 -37 -1 15
3987A5L69l96O7m5R7m0K18l70%p8K80k2J46K5l49L35q1R2j39L00l13kP8j5J89
$$ 15 384 -12 55 10 107 67 285 -85 -85 -163 117 95 241 266 -83 252 171 263 124 424 111 109 187 172 361
4012C61k55m0n9j01j20K66L7K46m51j24M24l26L91j84k5o2j36nj12L12j30J54
$$ 361 106 66 7 -94 -214 52 89 335 -116 -240 184 -142 249 65 40 -22 -158 -163 -275 37 -93 61
4034F1j88P1K12k53L52m73J21R9j05Q5j52J91K0Q6M9k32o2n3J06J85p9OL0l11
$$ 61 -127 -56 156 -97 255 -218 -97 2 -103 -18 -170 21 41 127 176 -56 -118 -171 -65 120 41 47 77 -234
4058b34L52P3m6J13j47J72n2k27J71j15J09j18k0J19j05J21l71J39J61J86l93
$$ -234 118 191 145 258 111 283 231 4 175 60 169 51 31 150 45 166 -205 -66 95 281 -112
4079a12K70kk6j68J61k11K57m43L65k08O7K28n1R8k46L6O4K9j39L59k35J68o9
$$ -112 158 156 130 -38 123 -88 169 -274 91 -117 -50 178 127 225 -21 15 79 108 -31 328 93 261 192
4102A92k29L85l73J57r1K4M5o1J7L01l84J5J93j9o2k65M18k57p8J71K08m55L39
$$ 192 -37 348 -25 132 41 65 110 49 66 367 -17 -2 191 172 110 -155 263 6 -72 99 307 -148 191
4125A91k25J48k73J94j16p0r1K64K69n64K95L06m09jM22k87n3J10k52O9L43k90
$$ 191 -34 114 -159 35 -81 -151 -242 22 291 -273 22 328 -81 -82 340 53 0 110 -142 -73 270 -20
4147b0K59k94l7k67J10J74M1j57l6J17J38j39J07j00j34K05l00j7K17r9K27ml6
$$ -20 239 -55 -92 -359 -249 -75 -34 -191 -227 -110 28 -111 -4 -104 -238 -33 -333 -350 -133 -232 -5 -9 -45
4170d5j63j30L73j90K18l26m7K24J65m0l56L1j71K69K50O0k48J5M68k90k5k25
$$ -45 -208 -338 35 -155 63 -263 -310 -86 79 39 -317 -286 -457 -188 62 122 -126 -111 357 67 42 -183
4192a83K13Qk70J97k2j84K54j71K00q1j64J48k70J85j09N6J46J24k08K08L4r3
$$ -183 30 38 -232 -35 -57 -241 13 -158 42 -39 -203 -55 -325 -140 -249 -193 -47 77 -131 77 111 18
4214A8r0K8J78p4rj21K35k03k1J16R1qj0j24Q5l7q0J33j34n0K21J20q6j4k97J32
$$ 18 -72 -44 134 60 51 -70 165 -38 -59 57 148 140 130 6 91 54 -26 107 -27 -77 144 264 178 164 -133 -1
4240ar6J45K34l08P1j67L29k94q7K90N5l22K19Q8k11jJ67k4m01K84j21K2R0J58
$$ -1 -97 48 282 -26 45 -122 207 -87 -174 116 171 -151 68 156 -55 -56 111 87 -314 -30 -151 -129 -39 119
4264A19j85L53l17Q2j94N83n40K16m97O60J07m96J0k53N41l51J43j32J63j15L27
$$ 119 -66 287 -30 52 -142 441 -99 117 -380 280 387 -109 -99 -352 189 -162 -19 -151 12 -103 224
4285B24l55K31j73L1r4J24j35L03kk62j55J25J22k79J2K87n1J4j3k2m5J44k59
$$ 224 -131 100 -73 -42 -136 -12 -147 156 154 -108 -263 -138 -16 -295 -283 4 -47 -33 -46 -68 -113 31 -228
4308b28J39pj55K96n9j80K54j77j5L46n45J06k6K30j6l04J56j48L33j19J64J9
$$ -228 -89 -96 -251 45 -14 -194 60 -117 -132 214 -331 -225 -251 -21 -37 -341 -185 -333 0 -119 45 64
4330F4j15j95M09k34K09j92q5K66k83K62j9n1j4J79l74L43J07J2l92L38k74L12
$$ 64 -51 -246 163 -71 138 -54 -139 127 -156 106 87 36 22 201 -173 170 277 289 -103 235 -39 273
4352B73J26l95P6K6j83M6NL57l11J54K2L5j1j98M0k2M9k39J05o8O6Q8k74Q3K35
$$ 273 399 4 80 106 -77 -31 -26 331 20 174 196 231 220 22 62 40 89 -150 -45 -113 -47 41 -233 -150 85
4377H5j69j27M59m02M43k32p0j25MJ38J48j25J57k58j12L33j6r5j65J54j31Q7
$$ 85 -84 -211 248 -154 289 57 -13 -138 -134 4 152 27 184 -74 -186 147 131 36 -129 25 -106 -19
4399a9K3J13k7m8j57K15j64q4r8J06q1L1N28o17K94q8L11j70j51M15k49P7j45
$$ -19 4 117 90 42 -115 100 -64 -148 -246 -140 -221 -190 338 -279 15 -73 238 68 -83 332 83 160 15
4422A5K34j21j18j32J20J11k5q4J1k00J78k65L97j25L84n54L2k50M47k19o0K32
$$ 15 249 128 10 -122 -2 109 84 0 11 -189 -11 -276 121 -4 380 -174 -142 -392 55 -164 -224 8
4444Hj60M31l47M4Q7l28L24J18K7l88k7P9j64M5L7J10l6qK28j97j68L09K3o8K18
$$ 8 -152 279 -68 -24 63 -265 59 177 204 -184 -211 -132 -296 -251 -214 -104 -140 -148 80 -117 -285 24 47 -21 197
4469A97r1j94J09j56K51Pl22J72J35K71l80K01M0j75K87m19J88q7J58m9K02m83
$$ 197 106 -88 21 -135 116 123 -199 -27 108 379 -1 200 240 65 352 -67 121 34 192 143 345 -138
4491a38j0r3M64J34j57j41J46N8k19j20K23kj14J65L6l11J4ML8M9Q4k47M15j11
$$ -138 -148 -241 223 357 200 59 205 263 44 -76 147 145 31 196 232 -79 -65 -61 -23 26 110 -137 278 167
4515A67j37o0M36m62L15Jj91l11M30N9m87J99L85k27j60Q3J51l56j2p8L24J93
$$ 167 30 -30 406 -56 259 260 69 -242 188 247 -240 -41 344 117 -43 40 191 -165 -177 -255 69 262
4537B62j05l18K26l36L20O5l93K63J17l53K04N3L5j89J57m4j23M34r9j02k41K61
$$ 262 157 -161 65 -271 49 114 -279 -16 101 -252 -48 5 40 -149 8 -36 -159 275 176 74 -167 94
4559I4k78J64L22m32r8l5j78N93k30J09J45k88J35j86J01K64l14N6N9k05J31j4
$$ 94 -184 -20 302 -130 -228 -263 -441 152 -78 31 176 -112 23 -163 -62 202 -112 -56 3 -202 -71 -85
4581h5RJ3r9L89k19L35k82j83O3J96k80K12P7J28k14j31M77n81K88j6J05m23K55
$$ -85 -76 -63 -162 227 8 343 61 -122 -59 137 -143 69 146 274 60 -71 406 -175 113 97 202 -221 34
4604C4K89m9j6l78L19m2Q6k90p4L20k82q0Q3l5J77k8J6J06j81K2J53j10j6J54
$$ 34 323 274 258 -120 199 157 243 -47 -121 199 -83 -163 -80 -115 62 34 50 156 -25 -3 150 40 24 178
4628A78j84p8O1nQ8j32J36j14j03N6J10p4k36L63l35J26J50J7J55k50n5M10m41
$$ 178 -6 -84 -23 -28 60 -72 64 -50 -153 -97 13 -61 -297 66 -269 -143 7 24 179 -71 -126 284 -157
4651a57L17k17q0K2p1J27j91J10j5K6j69K98k02O2j42K91m2l02Q4j39P1K25k83
$$ -157 160 -57 -137 -115 -186 -59 -250 -140 -155 -129 -298 0 -202 -140 -282 9 -33 -335 -251 -390 -319 -94 -377
4674c77k5K23P6j67M40J73k89k67j28J36L83k36J8K47Pm56K11l6Q2m0J72k47p9
$$ -377 -402 -179 -103 -270 170 343 54 -213 -341 -205 178 -58 -40 207 214 -242 -31 -67 15 -25 147 -100 -179
4697a79L87j53l68K13J5l7p7L87k81pJ90l49L55k67K36j63J10j73J89J23j65p8
$$ -179 208 55 -313 -100 -85 -122 -199 188 -93 -100 90 -259 96 -171 65 -98 12 -161 28 151 -14 -92
4719i2p9L98o3m98J19J14K11n3q9L38j01p4j76K21k58P5k15M17J0k66J81p2P3
$$ -92 -171 227 164 -334 -215 -101 110 57 -32 306 205 131 -45 176 -82 -7 -222 195 205 -61 120 48 121
4742A21N2j5J54k20o0L5J74k02j6J4L1l9k59O7M5L00k21K3j51J72M6M3J62K4j70
$$ 121 173 158 312 92 32 67 241 39 23 37 68 29 -230 -163 -118 182 -39 -16 -167 5 51 94 256 280 110
4767A10k4j84K22J21k42N3k94L27j19K22Q7l30j41J53k8k7j84J12K25l04r6K91
$$ 110 86 -98 124 245 3 56 -238 89 -30 192 279 -51 -192 -39 -67 -94 -278 -166 59 -245 -341 -50
4789e0l22M92r9n34L43J60R7K5K8k92K19l5J26k82K88j89rK15j08j68J50Q6l10
$$ -50 -372 120 21 -513 -170 -10 87 112 140 -152 67 32 158 -124 164 -25 -34 181 73 -95 55 141 -169
4812a69J97q2j6O3j38L12n20L16Q2J21l24L0K42j30J65O6k97j65K19J95k68M8
$$ -169 28 -54 -70 -7 -145 167 -353 -37 45 166 -158 -128 114 -16 149 215 -82 -247 -28 167 -101 -53
4834e3q0k4R2J48j40J48K8j83j69J56K82k7P8j12j37J23Q6j96K28o0n39N67m99
$$ -53 -133 -157 -65 83 -57 91 119 -64 -233 -77 205 178 256 144 7 130 216 20 248 188 -351 216 -283
4857b83P64o41J24Q4o5J47k59P4N1K68p3J06m76K81k74M12l51L31o2j5k24M4R9
$$ -283 481 -160 -36 48 -17 130 -129 -55 -4 264 191 297 -179 102 -172 240 -111 220 158 143 -81 -37 62
4880F2k29K22j62L98l88j13J29L42m10J94j12J39J2J17n07J32J66Q1p9n0Q5n6
$$ 62 -167 55 -107 291 -97 -210 -81 261 -149 45 -67 72 84 201 -306 -174 -8 73 -6 -56 29 -27
4902b7j49L54m67L24J61l29R1Jr7J6j09J62L69j88p8j14L11m59L72n5J62k60J03
$$ -27 -176 178 -289 35 196 -133 -42 -41 -138 -122 -231 -69 300 112 34 -80 231 -228 144 89 251 -9 94
4925I4j50J6l64L87J12J88n12K1K06lK46k58M73j85j98j24J2Rj64J66k24L31o5
$$ 94 -56 -40 -404 -17 95 283 -229 -208 -2 -5 241 -17 456 271 73 -51 -39 -30 -194 -28 -252 79 14
4948A4k0K58k08l64L15K00j35l9O6R1k77k8K34K10l31J34l05L3J73J28Q7k00J03
$$ 14 -6 252 44 -320 -5 195 60 21 87 178 -99 -127 107 317 -14 120 -185 -152 21 149 236 36 139
4971A39k58J68l7K39O4j52J29m22r4L32J19J03k14n3j95O0K12j03j0k1J18k3k1
$$ 139 -119 49 12 251 315 163 292 -130 -224 108 227 330 116 63 -132 -72 140 37 27 6 124 101 80
4994H0K39m11K15j27K51k64j93M78j72k40L89m00J54j50J90j41K44j95J75j96
$$ 80 319 -92 123 -4 247 -17 -210 268 96 -144 245 -155 -1 -151 39 -102 142 -53 122 -74
5014g4J3j65K34J90j75J84j37J04k75L11j28K16l07k2o4J03L22k08q0M56o69J22
$$ -74 -61 -226 8 198 23 207 70 174 -101 210 82 298 -9 -31 -95 8 330 122 42 498 -171 -49
5036d9J04O4j86n7N5j69J21R2q9K61m3k33M7K67l16L98o12K80n7J8M1K2J88j51
$$ -49 55 119 -67 -124 -69 -238 -117 -25 -114 147 104 -129 -82 185 -131 267 -345 -65 -122 -104 -63 -41 147 -4
5060dK04k31K50m4m11J10L04k21K9J25k62O4J62j51J40k33L33m15L55J10j17k85
$$ -4 200 -31 219 175 -236 -126 178 -43 -14 111 -151 -87 75 -76 64 -169 164 -251 104 214 97 -188
5082a88J86M93n03K0k0K89l31K7R4j70j2j80L78J04k08K68m61K95M2k07J56N1
$$ -188 -2 491 -12 8 -12 277 -54 -27 67 -103 -115 -295 83 187 -21 247 -214 81 123 -84 72 123
5104A23l29J35K51j95j58K21n5P6Q9l66K07Q8o0J61l42O3M45n07O0Q5l37L63k2
$$ 123 -206 -71 180 -15 -173 48 -7 69 158 -208 -1 87 27 188 -154 -91 354 -153 -93 -8 -345 18 -4
5127dj11l59N39o9M2j71M70l10n0l0%K12j52K82k42j23l4J10J92k75M5K08j67
$$ -4 -115 -474 65 -4 38 -133 337 27 -23 -53 -53 159 7 289 47 -76 -110 0 192 -83 -38 170 3
5150Cj35O8j63L59L6l31L73K6l42O0J61R0n1j71M4j8j02o2K05K9j88L42j0k9J46
$$ 3 -132 -64 -227 132 168 -163 210 236 -106 -46 115 205 154 -17 27 9 -93 -155 50 79 -109 233 223 194 340
5175C40n19Q7j79M76l36J64K27l0k70k55M08k03L6L2O9jk0k35O3p2J67J63n1k58
$$ 340 -179 -92 -271 205 -131 33 260 230 -40 -295 113 -90 -54 -22 47 46 26 -209 -146 -218 -51 112 61 -197
5199a97K0J64j38L73j96m1mJ3n6n7K12j80K0j64K72k26N45k02k90K37j27K06p6
$$ -197 -177 -13 -151 222 26 -15 -19 -6 -62 -119 93 -87 -67 -231 41 -185 360 158 -132 105 -22 184 108
5222A08o0m2m6J93k20m8L07m62K48J88o8j27L15k60J30l30K26r4Q7J19k74L71
$$ 108 48 6 -40 153 -67 -115 192 -270 -22 166 98 -29 286 26 156 -174 52 -42 45 164 -110 261
5244B61m34M28j70j37R6j06J72No5K78l47J26r2J39J22k89k41N14l25J94j34k21
$$ 261 -173 255 85 -52 44 -62 110 115 50 328 -19 107 15 154 276 -13 -254 260 -65 129 -5 -226
5266b26O8j03J94J20k15J73k34M95l10J10o5Ko1K93j20k0l6K1K40k15J69m80J24
$$ -226 -158 -261 -67 53 -162 11 -223 272 -38 72 7 9 -52 241 121 101 65 86 326 111 280 -200 -76
5289g6j20L09l83J54J21j46K75l11K90k75J76k8K86j98l62L75Rq5m42L45J75m6
$$ -76 -196 113 -270 -116 5 -141 134 -177 113 -162 14 -14 272 74 -288 87 96 11 -431 -86 89 43
5311D3l82L98j83J2k4K95l25M09k21k49R3P8k45j16J1M38Ol20Q1J19p2j19J86
$$ 43 -339 59 -124 -112 -136 159 -166 243 22 -227 -134 -56 -301 -417 -406 32 38 -282 -201 -82 -154 -273 -87
5334h7P3L95k15m88N38l64q1J67n6K08J57l46O7Kj20K74J33m79L52j72J07k78
$$ -87 -14 381 166 -322 216 -148 -229 -62 -118 90 247 -99 -32 -30 -150 124 257 -222 130 -42 65 -213
5356b13K56M1P2j78J89k92J72rj64K34J6j53j21K36l43J89n0J99r8p4J95k10K17
$$ -213 43 84 156 -22 167 -125 47 38 -126 108 124 -29 -150 86 -257 -68 -118 81 -17 -91 104 -106 111
5379A11j97m7L54j53M6L0J92m41K45j50j25M01m7o7l07J19O7m9Lj4j00j6K09r9
$$ 111 -86 -133 221 68 114 144 336 -105 140 -10 -135 266 219 152 -155 -36 31 -18 -15 -29 -129 -145 64 -35
5403c5L07k17n4j4J1N3k21K60Q2k96m3K55R2l60J64j13q3J52O2K3K75l89m3R7
$$ -35 272 55 1 -13 -2 51 -170 90 172 -124 -167 88 180 -180 -16 -129 -212 -60 2 25 300 -89 -132 -35
5427c5L81k8r0q1J52m83k15J52N3Q9J23k1Q4k0j07K47l44n3K11J37k86K35j82
$$ -35 346 318 228 147 299 -184 -399 -247 -194 -105 18 -3 81 61 -46 201 -143 -196 15 152 -134 101 -81
5450h1j62J21M2J37N5l62K20K91j52l31M0j41J03L05m21M29l20N32k03j27J96
$$ -81 -243 -122 -80 57 112 -250 -30 261 109 -222 -182 -323 -220 85 -336 93 -227 305 102 -25 171
5471A71l5j88j5R0l9J67j0k26k44K71J11n3M0p1m0K3Q2j82R6K04K1k74j31J69
$$ 171 136 -52 -67 23 -16 151 141 -85 -329 -58 53 0 40 -31 -71 -48 34 -148 -52 152 173 -101 -232 -63
5495f3J96k4k96R9j48O16m58Pk42L74R1L41m25j22J07j48M8L1j32P6L3K04k84
$$ -63 133 109 -187 -88 -236 380 -78 -71 -313 61 152 493 68 -54 53 -95 -47 -16 -148 -72 -39 165 -119
5518a19k9Q0j32L55l8K13k01k40P0J44ok31K16j85K11k17J72k99M69J3k73o7J03
$$ -119 -148 -68 -200 155 117 330 129 -111 -41 103 97 -134 82 -103 108 -109 63 -236 233 246 -27 -94 9
5541IM1j34J90j03j16M08j99m33N34j16k53J78j21r1M6K28r9m7o1J60J49l08k7
$$ 9 50 -84 106 3 -113 295 96 -337 197 81 -172 6 -115 -206 -160 68 -31 -78 -139 21 170 -138 -165
5564a65J2J4Q1L3k0j97K22m4K7K67l67M75m26M9L16m11P7Q7j60O2J67K44k97m6
$$ -165 -153 -139 -58 -25 -45 -242 -20 -64 -37 230 -137 338 -88 -39 277 -134 -57 30 -130 -68 99 343 46 0
5588@J01R9k71m2K20l52K22r5K71k84K17k01J27m9K3j86N9K3K56k40L23j82j52
$$ 0 101 200 -71 -113 107 -245 -23 -118 153 -131 86 -115 12 -37 -14 -200 -141 -118 138 -102 221 39 -113
5611a13M40J6l16M15l94j31K66j13J00r6Jm85N04K5J8k83J15j6J06j07J15j93
$$ -113 327 343 27 442 48 -83 183 70 170 74 75 -410 94 119 137 -146 -31 -47 59 -48 67 -126
5633a26J15k29K20j84L19k5mJ97l96J83j32J16L00m47O9J52j56K79k74K06K8m36
$$ -126 -11 -240 -20 -204 115 90 86 283 -113 70 -62 54 354 -93 -24 128 -28 251 -23 183 211 -225
5655b25j53K66J13l5J39j50kj1K63k87J46j35M07l45j45j63J91K52J4j92K59l20
$$ -225 -378 -112 1 -34 105 -45 -47 -58 205 -82 64 -71 336 -9 -154 -317 -126 126 140 -52 207 -113
5677a13N00p21N98l97Q2J27L1j8r8q8J08j0J81j31J45m80K52Q8m15M44j9j68l5
$$ -113 387 -334 264 -133 -51 76 107 89 -9 -97 11 1 182 51 196 -284 -32 56 -359 85 66 -102 -137
5700a37J22j24J5K1Q2K87l82L87k05Q8m7j72r6l3J70P3J19k15pJ45N7k14K54l
$$ -137 -15 -139 -124 -103 -21 266 -116 271 66 154 107 -65 -161 -194 -24 49 168 -47 -54 91 148 -66 188 185
5724A85l8j39L2R0J7Pjl67K58j71K37q8k70N32n26J86J38l6K71l91k4k18L27K8
$$ 185 147 8 40 130 147 154 153 -214 44 -127 110 22 -248 284 -242 -56 82 46 317 -74 -98 -316 11 39
5748C9j14J93j80J51M5K2K3n42K57K47k20Q8J88k07m6j11K33l4L0m08M28j92L87
$$ 39 -75 118 -62 89 134 156 179 -363 -106 141 -79 9 197 -10 -56 -167 66 32 62 -346 82 -110 277
5771B77o9J4l31J74j85J7J3k8m7p9J28K4K37k68M2%J6J10R7l17M13Lm88J53q8
$$ 277 208 222 -109 65 -120 -103 -90 -118 -165 -244 -116 -92 145 -123 -81 -81 -65 45 142 -175 238 241 -247 -94 -182
5796a82M07l23K30k52Q0P8N4J43j28j30k35L12j35j28L11p7J47k84J53K36m66
$$ -182 225 -98 132 -120 -40 38 92 235 107 -23 -258 54 -81 -209 102 25 172 -112 41 277 -189
5817a89K28K21l14o7K14j44k64M38j8j51J68j58r2K01J04j27j75O6q5L24j86J31
$$ -189 39 260 -54 -121 93 -51 -315 123 105 -46 122 -36 -128 73 177 50 -125 -59 -144 180 -6 125
5839A25l68L74P3m69J78J16P6j39r6K76k01%O5J56M3j08R9j34j23n1J83k37Mn
$$ 125 -243 131 204 -265 -87 29 105 -34 -130 146 -55 -55 10 166 209 101 200 66 -57 -108 75 -162 -158 -163
5863a63j6K08J20j67j27K54j56J60j9m9K9kJ54l70qQ8K65j05ol01L19j99J57J22
$$ -163 -179 29 149 -18 -145 109 -47 113 94 45 74 72 226 -144 -152 -64 201 96 90 -211 108 -91 66 188
5887A88j2q4o4R8k23K48m06L50j19K42l45J19Q0J9k11j1RJ79j2m5MJ94k32J29
$$ 188 176 92 28 126 -97 151 -255 95 -24 218 -127 -8 72 91 -120 -131 -122 57 45 0 4 198 -34 95
5911I5K3L10m33k3j37J21m7J57j67K01k72K9K7M4L79k01o2J85k11l41M60J10j66
$$ 95 118 428 -5 -28 -165 -44 -91 66 -101 100 -172 -143 -116 -72 307 106 44 229 18 -323 137 247 81
5934H1k34J89Q2l10M12l62N2J28L14m77l1J52J5j37p0J46K36k21J98m87M54P5
$$ 81 -153 36 118 -192 220 -142 -90 38 352 -125 -156 -4 11 -126 -196 -50 186 -35 163 -324 130 205
5956B05l88J55M58l92J23l38n2L32k0l46K48K43k51Q6J4j34n7L56rm35Q1Q2o8
$$ 205 -183 -28 430 38 161 -177 -229 103 83 -263 -15 228 -23 63 77 -57 -114 242 233 -202 -121 -39 -107
5979a07K90l51J74J02p0N4Q9k78J03j28J62l35L91nR8r2j85LLJ38pJ05k42rj66
$$ -107 183 -168 6 108 38 92 181 -97 6 -122 40 -295 96 91 189 97 -88 -85 -82 56 49 154 -88 -97 -263
6004b63L69l33J10L47L2l36Q4L68l71L52k98r6Q4k48L63o4j85K14J16K4l90O2
$$ -263 106 -227 -117 230 262 -74 10 378 7 359 61 -35 49 -199 164 100 -85 129 245 269 -121 -59
6026e9j77J26L1j67M18k79Q9j69j7K59p3l6oK11k35J88o1j37P3J88J0r7j62J56
$$ -59 -236 -110 -79 -246 172 -107 -18 -187 -204 55 -18 -54 -60 151 -84 104 43 -94 -21 167 177 80 -82 74
6050G4q5J8L4OrJ26Ok70j8K16k16q3L36k74P5l1L16k71J71j88j9J85l61M04r2
$$ 74 -11 7 41 47 38 164 170 -100 -118 98 -118 -201 135 -139 -64 -95 221 -50 121 -67 -86 99 -262 142 50
6075E0n4K74k12q2J14m5j92J01N8p4K40j64K2J50m4k28K00k8k77N06m11K9l4Q1
$$ 50 -4 270 58 -24 90 45 -147 -46 12 -62 178 14 36 186 142 -86 114 86 -191 315 -96 -67 -101 -20
6099b0j69K77j18kj64L16kk79K04J17o0j21K97l83J51J7l2j25K74j89k41N03p1
$$ -20 -189 88 -30 -32 -196 120 118 -161 43 160 100 -21 276 -107 44 61 29 -96 178 -11 -252 251 180
6122A80j60K70k02k22K29k27J65m3j26R1r8K45j00K4J43j80J8O4r5j72J15l8p2
$$ 180 20 290 88 -134 95 -132 33 -10 -136 -45 -143 102 2 26 169 -11 7 71 -24 -196 -81 -119 -191
6145a91M01k20P2N2j52k53O1K35q1N4l53J58K73j17K00j97nm0Q0Q4M7kM0P9k61
$$ -191 210 -10 62 114 -38 -291 -230 5 -76 -22 -375 -217 56 -61 139 -58 -63 -103 -23 61 108 106 146 225 -36
6170c6n1J63m9p1n6K47K6l9j54j83L56k85j51M52j08o7j02J29Q4j04J51nl01J35
$$ -36 -87 76 27 -44 -100 147 173 134 -20 -203 153 -132 -283 169 61 -6 -108 21 105 1 152 147 -154 -19
6194a9j21J69Q2j11J07k28J27L4J1K09k74J38nj20q9L32l94J9K19N6j8k91J48
$$ -19 -140 29 111 0 107 -121 6 40 51 260 -14 124 119 -1 -90 242 -152 -133 86 142 124 -167 -19
6217a9o2J20K1J34k38Q5l37M80l30J9Q5K65r9P5k5k47j21K17J17k48MJ32J19m34
$$ -19 -81 39 60 194 -44 41 -296 184 -146 -127 -42 223 124 199 174 -73 -194 23 140 -108 -104 28 147 -287
6241b87K91m9N5k5L1K18j78o3j43L11j83J89Ok64Q7n4J24k29L1M43j34J98m13
$$ -287 4 -45 10 -15 16 234 56 -7 -150 161 -22 167 173 -91 -4 -58 66 -163 -132 311 177 375 -38
6264c8M6nQ2k64K6P8n2j72M60K1l0j72K4O5j64J82P3q1j71J22k06J46J2j90J12
$$ -38 8 3 85 -179 -153 -75 -127 -299 161 182 152 -20 4 69 -95 87 160 79 -92 30 -176 -30 -18 -208 -96
6289i6L84k98K42N7N7r1J01k71m94L41J32k45qK73j58J45k12J93j19K18j03l6
$$ -96 288 -10 232 289 346 255 356 85 -409 -68 64 -181 -189 84 -74 71 -141 52 -67 151 48 12
6311A2k68L81n60L10L61l05O3j83L23j83J00O4L2m40J30L66q9m73O06j50l14N
$$ 12 -256 125 -435 -125 236 -69 -6 -189 134 -49 51 115 147 -293 -163 203 114 -359 247 97 -217 -212
6333b12K57k39K22K08j33P1l69N02j78j57j91K88j06M3j26m7L61k09k3J22J5m59
$$ -212 45 -194 28 236 103 174 -195 307 129 -28 -219 69 -37 6 -120 -167 194 -15 -38 84 99 -360
6355c60M57KK73k05l18k73L82N4J65m63J27RK99p9j63j44J65J34k15K57J97l62
$$ -360 97 99 372 167 -151 -424 -42 12 177 -286 -159 -150 149 70 -93 -237 -72 62 -153 104 301 -61
6377f1K73k00pK33j1l00p9K38J8r6Q0j22K7n6L9J64k45j96K91P5m8j69j17J84
$$ -61 212 12 5 238 227 -73 -152 86 104 8 88 -34 -7 -63 -24 140 -105 -301 -10 65 17 -152 -269 -85
6401h5J88k2k33R5L10L8l59Qr1L98o8j67l85L80j2l4J44k80OJ44J95n9j63o8K08
$$ -85 103 81 -152 -57 253 291 -68 -60 -151 247 179 12 -373 7 -5 -39 105 -175 -169 -25 170 111 -52 -120 88
6426H8l62M8K03j3j8J96m59L71j24K75k31J48J32j69k09J32P8K34j60J52k38j85
$$ 88 -274 -226 -23 -36 -54 142 -317 54 -70 205 -26 122 254 85 -124 8 86 320 160 312 74 -111
6448a11K42q7q0r0K46j34j18K4Q4l12K95J94K05l97J82k15L40l49r6Q8J59k27
$$ -111 131 44 -36 -126 120 -14 -132 -108 -24 -336 -41 153 358 -39 143 -72 268 -81 -177 -89 70 -157
6470a57Q2L21l23K07K0j37j11n2J67j78K38l95K19J40K8K13l40k3J72K8k0J2l3
$$ -157 -75 246 -77 130 150 13 -98 -150 17 -161 77 -318 -99 41 69 282 -58 -81 91 119 99 111 78
6493G8R5l37L24j49j79J3J99NJ33j44M5j55j02J81J43J51n15L74j12J2k26m4L26
$$ 78 173 -164 160 11 -168 -155 44 49 182 38 83 -72 -174 7 150 301 -214 160 48 60 -166 -210 116
6516A16J7O1j95n6L91k94j37j17M45n27K76r8K80q0j42K06Rl38rK99k09J55K2
$$ 116 133 194 -1 -57 334 40 -97 -214 231 -296 -20 -118 162 82 -60 146 155 -183 -192 107 -102 53 75
6539G5J52p0n7j8J70r5l57K95j42Q9P4J08l16K47k84n2N27m78O5n5K26k95K78
$$ 75 227 157 100 82 252 157 -200 95 -47 42 116 224 -92 155 -129 -181 346 -132 -67 -122 104 -191 87
6562H7j72p8J44Q5M7j7K12j74j64l7J56j87Q6J64l66L84r9ro2O1j34PJ17j47J16
$$ 87 -85 -163 -19 66 113 96 308 134 -30 -67 89 -98 -12 152 -214 170 71 62 0 61 -73 -66 51 -96 20
6587B0j0K6k28J42M2J4Q8j38k0j45K4K58L00j13j60j36L60l83M9J42N7l4q9k39
$$ 20 10 36 -192 -50 -8 6 94 -44 -64 -209 -185 73 373 260 100 -36 324 -59 -10 132 189 155 66 -173
6611a73j20M83k98K05k92P7O7J89j32j72j31K82r5J77K1j80k07O8K04p3J97J33
$$ -173 -293 190 -108 97 -195 -118 -51 138 6 -166 -297 -15 -110 67 88 -92 -299 -231 -27 -100 97 230
6633B30k30K38l3k61J53o2q3J56m7l2L9m2j64J26k23L85m6l62O88m83r7L03l08
$$ 230 0 238 205 -56 97 35 -48 108 61 29 68 26 -138 -12 -235 150 104 -258 430 -53 -150 153 -155
6656a55J05r0L28k25j33M5lj6N5L20l92J64k40N21j78k1l76R5Q7K64j90l4j64
$$ -155 -50 -140 188 -37 -170 -125 -128 -144 -89 231 -161 3 -237 284 106 85 -291 -196 -109 155 -35 -69 -233
6679b33L05k06L96l27%L67j48k59O8mj54K96j43k4j82o4K02J65qk72J64M50l48
$$ -233 72 -134 262 -65 -65 302 154 -105 -37 -41 -195 101 -42 -66 -248 -312 -110 55 47 -225 -61 389 41
6702D1j34P8J2k51J70k4L14l65J93k11J86j64k97N09l24L40K57k56k10K40L22
$$ 41 -93 -15 -3 -254 -84 -108 206 -159 34 -177 9 -155 -452 57 -267 73 330 74 -136 104 426
6723D26n4l08j75J71o2l60L11j29K76k35L75l81J09J51Pl43J36K39m2J08l23J76
$$ 426 372 64 -111 60 -2 -362 -51 -180 96 -139 236 -145 -36 115 122 -221 -85 154 112 220 -103 73
6745G3n06J09L25K4J66j55j13J73MN4j87J77k02q0L01j28j41K10o0n3m1qMQ5m1
$$ 73 -433 -324 1 25 191 36 -77 96 100 154 -33 144 -58 -138 163 35 -106 104 44 -9 -50 -58 -54 31 -10
6770a0m9J66R9j80n9J09k22K12j6N7j3nJ42j30J35l02K84k38n8L6k07K81J29j66
$$ -10 -59 107 206 26 -33 76 -146 66 50 107 94 89 231 101 236 -66 218 -20 -78 -42 -249 32 161 -5
6794eJ84j25J86m8q8j42r8M45m53J46q9J33%k39M95k50j35J70p7m5J54m03L36
$$ -5 179 54 240 192 104 -38 -136 309 -144 2 -87 46 46 -193 302 52 -83 87 10 -35 119 -284 52
6817E2R1ol10L28k00L3LJ1r0k6K83l00N2j1R1k21R4M00j90j19K4J17j06J4k02
$$ 52 143 137 -173 155 -45 -12 -9 2 -88 -114 169 -131 -79 -90 1 -220 -126 274 84 -35 -11 106 0 14 -188
6842a88L74q9k69l2M4J71j21J56j20j92N59k56R5l17J37k41K01N0j00L52k42J19
$$ -188 186 97 -172 -204 -160 11 -110 46 -74 -266 293 37 132 -185 -48 -289 -88 -38 -138 214 -28 91
6864I1j83n1K10p3o0p1J71K0k41J47q6j3P8k18K7L74k30KJ37m13N27J45m04J14
$$ 91 -92 -143 67 -6 -66 -137 34 54 -187 -40 -126 -139 -61 -279 -252 122 -108 -106 31 -382 145 290 -114 0
6888@K18j36k91O1J61o4P9n3r8K86o6r6k59r8N66l14K35j53NJ09j07J50M5m52
$$ 0 218 82 -209 -148 13 -51 28 -25 -123 163 97 1 -258 -356 210 -104 131 -22 -17 92 -15 135 180 -272
6912b72K46r9j1J34P7j32j47J74n4j82K95R9q8j37k5N3L0Q9p9j61J28L3J85m05
$$ -272 -26 -125 -136 -2 75 -57 -204 -30 -84 -266 29 128 40 -97 -122 -69 -39 50 -29 -190 -62 -29 156 -249
6936b49M55l76r6K14L05L5k82l54K33L78j26j73p6J09l81K50J99L80k85j19l23
$$ -249 206 -170 -266 -52 253 288 6 -348 -115 263 137 -36 -112 -3 -384 -134 65 445 160 41 -282
6957b82O48l07J90l76J10qK05j18k08O8mJ17Mm2L8J77j36j70J34J92k38j5j4L9
$$ -282 366 59 249 -127 -17 -25 180 62 -146 -78 -82 35 39 -3 35 212 76 -94 40 232 -6 -21 -35 4
6981Dl5o9l8k1K28L7j88o5m5K93L0l9j97Q4j92K90j02J9P1q3L35j51J47k23j13
$$ 4 -31 -100 -138 -159 69 106 -82 -147 -192 101 131 92 -105 -21 -213 77 -25 -6 65 -18 317 166 313 90 -23
7006b3J98k57q9L82l79K08K9K57k33j05k23L39k44K18j46L39k31J27l42K19K13
$$ -23 175 -82 -171 211 -168 40 69 326 93 -12 -235 104 -140 78 -68 271 40 167 -175 44 257
7027B57l65m3L12M20q78N38O9L8m63N1K12j03j79J75N4l97M22j93K40l90K15K32
$$ 257 -108 -151 161 581 -297 241 310 348 -115 -64 148 45 -134 41 95 -302 120 -73 167 -223 -8 224
7049B24k70p4P9Q6K24m91J12Q0J09K6m9l3k68Q0O4Q1K21k38J7J14l02K20M7j07
$$ 224 -46 -120 -41 45 269 -222 -110 -30 79 105 56 23 -245 -165 -101 -20 201 -37 -20 94 -208 12 59 -48
7073d8L13j95l16K19L6K2k52M76k12M1k77K51n5k35K6J3J66P0Rj15O2k44L43q3
$$ -48 265 70 -246 -27 9 31 -221 255 43 84 -193 58 3 -232 -206 -193 -27 43 52 -63 -1 -245 98 15
7097A5q0rQ4J89r4o5j1K0J55k58m1Q1J65J9k5j82o5K40k28K19n1k22N20n03Q6
$$ 15 -65 -74 10 199 105 40 29 49 204 -54 -95 -14 151 170 145 -37 -102 138 -90 129 78 -144 376 -127 -41
7122d1J15j62R6j6O3jj02K1j80J45M3r8J47Q2q6k0Pn6Q6m0J83l12J21l3p0K77
$$ -41 74 -88 8 -8 55 54 -48 -27 -207 -62 -19 -117 30 112 26 6 13 -43 43 3 186 -126 -5 -38 -108 169
7148A69J01j00l12N1J27k79L97LJ70j23k30J54n4K38m24R1k19L68k10K54j84l43
$$ 169 270 170 -142 -91 36 -243 154 157 327 204 -26 128 74 312 -112 -21 -240 128 -82 172 -12 -355
7170c55N30N8k89K99k49j09M85j72m12M58k12J3J56m12J35pJ70l20L14p5J09j32
$$ -355 175 233 -56 243 -6 -115 370 198 -214 244 32 45 201 -211 -76 -83 87 -233 81 6 115 -17
7192a7K81l26j01J12l0M92k04m79K26l0O8o8k9L32l89K25j23K63k64J05n0j07
$$ -17 264 -62 -163 -51 -81 411 207 -272 -46 -76 -8 -76 -105 227 -162 63 -60 203 -61 44 -6 -113
7214a13L55l82k2K09K7l4k21K2J88o0K20j76q6J80nj22j09R4K89K7j40j42K0n6
$$ -113 242 -140 -162 47 74 40 -181 -159 29 -31 189 13 -73 107 102 -20 -129 -35 254 281 141 -1 19 -37
7238c7J24q3j76L37l10K94k54MK45l72K63J77j90j50J8L23R7m65L16j70K3l7N6
$$ -37 87 4 -172 165 -145 149 -105 -101 144 -228 35 212 22 -128 -110 213 310 -155 161 -9 14 -23 33
7261C3m4j60K35l5J90k33n0q8n9L36r8J06o2l89K45K64l14K7L6O1L2k87K18j76
$$ 33 -11 -171 64 29 219 -14 -64 -152 -211 125 27 133 71 -318 -73 191 -123 -96 -60 1 33 -254 -36 -212
7285b12N76n24K07M8j64o9J73k5j97L71j91J2l06K53N7p8J73j93l0R6K19k03j43
$$ -212 364 -160 47 95 -69 -138 35 10 -187 184 -7 5 -301 -48 9 -69 104 -89 -119 -23 196 -7 -150
7308a50Pk0J53Q8QM0k2J3J64m64J92q2K71l8k86R9J12k48J37l0k4K41l00L19j79
$$ -150 -143 -163 -10 78 86 126 104 117 281 -183 9 -73 198 160 -126 -27 85 -163 -26 -56 -80 161 -139 180 1
7333AJ46k34o3J1L62k02mj89K44j58K17j43J67l48J6J40j33K26n4K10m9r5k17
$$ 1 147 -87 -150 -139 223 21 17 -172 72 -86 131 -12 155 -193 -177 -37 -170 56 2 212 163 68 -149
7356a49Q4J46j66K3rR8j28j08K42K47l98J29j33J03k67K80J18j49J26k10n2J30
$$ -149 -65 81 -85 -62 -71 27 -101 -209 33 280 -118 11 -122 -19 -286 -6 112 -37 89 -121 -173 -43
7378d3j17P0J35n6n2j42K06q3K39r9J09k27K01k11L70l13k9J79n2oP5k67K74J53
$$ -43 -160 -90 45 -11 -63 -205 1 -82 157 58 167 -60 141 -70 300 -13 -42 137 85 79 154 -113 161 314
7402C14n32K48K14q3k10R8qj57O8k0o1N2N4j00Q1r7K0J73q8l7j24J92o6j1L94
$$ 314 -218 30 244 161 -49 49 41 -116 -48 -68 -129 -77 -23 -123 -42 -139 -119 54 -34 -71 -195 -3 -69 -80 314
7427C14k25K87m07j74M99r6j37k37L75k66l32L74K8n4K35m03L73k24K31k69o0
$$ 314 89 376 -31 -205 294 198 61 -176 199 -67 -399 -25 3 -51 184 -219 154 -70 161 -108 -168
7448a68K89M9j37r9R9J3k22K17Jj1L0k07J84J25j87j30k5J28J42k32J69J34k82
$$ -168 121 170 33 -66 33 46 -176 41 42 31 61 -146 38 163 -24 -154 -179 -51 91 -141 28 162 -120
7471a20N4K73k65m1%o1K24M8j99P0J07j61j91P1l4K57Nq8L21l35j78M6K54m5k7
$$ -120 -66 207 -58 -99 -99 -160 64 112 -87 -17 90 -71 -262 -191 -225 32 37 -51 270 -65 -243 -197 57 12 -15
7496a5l8L28l49N1J08Ll86J04K58J78m08K26J92j07j04J50K52n94O4j22K22q6
$$ -15 -53 275 -74 -23 85 88 -298 -194 64 242 -166 60 252 145 41 191 443 -151 -87 -209 13 -73
7518g3J45j17J07n2J42J3k45j1K66j43k9Qj7j86J82k00K35j44j47J81J35P8j4
$$ -73 72 -45 62 10 152 165 -80 -91 175 32 3 11 -6 -192 -10 -210 25 -119 -266 -85 50 128 114
7541A14k88q0K48o8J31K18m64K86j92Q5j89K3K48J93k15J7j91K08j29L14k64O6
$$ 114 -174 -254 -6 -74 57 275 -189 97 -95 -10 -199 -176 72 265 50 67 -124 84 -45 269 5 71
7563G1k51M60k99k82K86Q8l01J21q4N2q2K13j14q3J84J82j33l04L18r8Jn5P6j42
$$ 71 -180 280 -19 -301 -15 73 -228 -107 -191 -139 -221 -8 -122 -205 -21 161 28 -276 42 -56 -55 -110 -34 -176
7587a76kL32k98K03J12k27k09K04J33j14L29n19N10p8k85j32P2J27J99j51m69
$$ -176 -178 154 -144 59 171 -56 -265 -61 72 -42 287 -232 278 200 -85 -217 -145 -18 181 30 -439
7608d39K11J79K82k58K33k15K04k17O7Q9q7J3q2j2J17k60m5K60J1r9Q7n8nq0Q9
$$ -439 -228 -49 233 -25 208 -7 197 -20 47 136 49 62 -20 -32 85 -175 -220 40 51 -48 39 -19 -24 -104 -15
7633a5o9J67q5j94K45N7j11L1J60l65K29m44K41K1K5L26l79Q7K60m51J48J04O8
$$ -15 -84 83 -2 -196 49 106 -5 26 186 -179 50 -394 -153 -132 -107 219 -160 -73 187 -264 -116 -12 56
7656E6K26k92j30J66M7k14J91j75j6L90k38j94k1L40M8m65L21k0q5K43j36j47
$$ 56 282 -10 -140 26 73 -141 50 -125 -141 249 11 -183 -204 136 184 -281 40 20 -65 178 42 -105
7678a05K19k1k44K34k00J91m7J15n01J83K99j69J97j52K67k52j3M8K06p7m0J19
$$ -105 114 93 -151 83 -117 74 27 142 -359 -176 123 -46 151 -1 266 14 1 49 255 178 138 257
7700B57k03Q8k48L04l66J75n0J12m65L58l1L65m64N1K39k56K48l50L83m19N51
$$ 257 54 142 -106 198 -168 7 -43 69 -396 -38 -69 296 -168 -117 122 -134 114 -236 147 -272 279
7721B79m3j61j57NL30q2j59q1n9jJ0K50L2j66J63o9j93K21j46j89L16kJ78j11
$$ 279 236 75 -82 -77 253 171 12 -69 -128 -129 -119 131 163 -3 160 91 -102 119 -27 -216 100 98 276 165
7745A65j60M6l52K94k5J16J74n57K83Q9L6p4P9j30r5k46M52k1j00P7K30l45j2
$$ 165 5 51 -301 -7 -32 84 258 -299 -16 73 109 35 114 -16 -111 -357 95 74 -26 51 281 -64 -76
7768g6J84q3n2j89L10k00J85K76m33J79l13N86o96N20j36k07L8O4k19K16O6J02
$$ -76 108 25 -27 -216 94 -106 79 355 -78 101 -212 374 -322 198 62 -145 -107 -43 -262 -46 20 122
7790A22l40J60K1k23O60n38J41j62K28N4l26K79P2j0j45K4Q8K4j1j08K09j56Q9
$$ 122 -218 -58 -37 -260 400 -138 3 -159 69 123 -203 76 148 138 -7 17 105 129 118 10 219 63 152
7813A52n8l50M31j89j46K26N0J17j94o9j51M40m38K62j53K56qk14L3j25J88J1
$$ 152 94 -256 175 -14 -160 66 116 233 39 -30 -181 259 -179 83 -70 186 178 -36 -3 -128 60 71
7835G1j88L34l67J79p6P5j14n7j41L59q0j52K90j26j46k24L72L75l97K19j01l9
$$ 71 -117 217 -150 29 -47 28 -86 -143 -284 75 -5 -157 133 7 -139 -363 9 384 -13 206 105 66
7857F6j02k76L62l10L77nj02K76l39k5R5j84J36j38K06j35j32Q5l44O32k9j17
$$ 66 -36 -312 50 -260 117 112 10 286 -53 -78 17 -167 -31 -169 37 -98 -230 -145 -489 143 114 -3
7879cj9j5j03N5L71l56k47K05j18n7K39m0j22K0J4j00K71k29K68Rp2r5N4Q7j21
$$ -3 -22 -37 -140 -85 286 -70 -317 -112 -230 -287 -48 -88 -210 -190 -176 -276 -5 -234 34 43 -29 -124 -70 17 -104
7904a04%j83N91j81j81j35K23p8J32k2q6j54M39k66K4K00l0k96J14M1J81r9j26
$$ -104 -104 -287 304 123 -58 -193 30 -48 84 62 -24 -178 261 -5 19 219 189 -107 7 48 229 130 4
7927Dj03K39j61j78K92j25j06K68m08J76J11J26J07k01j32j2K85l03J33O4jl9
$$ 4 -99 140 -21 -199 93 -32 -138 130 -278 -102 9 135 242 41 -91 -103 182 -121 12 76 75 36
7949C6j0j64J02m8P9k49L49k0l9J53l72J43J64k62J42Q1K24l51p8L29j92k13O8
$$ 36 26 -138 -36 -84 -5 -254 95 75 36 189 -183 -40 124 -138 4 85 309 -42 -120 209 17 -196 -128
7972a28k3J17j59J4l6L23j86J37l0k03K10kJ92l61K50K8l21K68M0j66J08k98K72
$$ -128 -151 -34 -193 -179 -215 108 -78 59 29 -174 36 34 226 -135 115 143 -178 90 130 -36 72 -226 46
7995D6k78N53k47O5O4j64L3k21P6J63k42p9N66l82J46j18J92j04pJ69n08K2M69
$$ 46 -232 321 74 139 203 39 72 -149 -73 90 -152 -231 335 -47 99 -19 173 69 62 231 -277 -255 214
8018B14n67M01q1o6l9n4L4J26j09J52J88k43lk03L07M4O6K9q3l84N2J14J91k67
$$ 214 -353 48 -33 -99 -138 -192 -158 -32 -141 11 199 -44 -47 -250 57 101 167 196 113 -271 -219 -105 86 -181
8042a81K44J29k51J50j46q0K65j9p3J86k30O1n2M8j15N9K97j28k55ol5K39l84
$$ -181 63 192 -59 91 -55 -135 130 111 38 224 -6 55 3 51 -64 -5 292 164 -91 -97 -132 107 -277
8065b77O0K17N0K84m00M0N7ll6n24L58M67l37l5K77j71o0o8J89J02J21k89k84
$$ -277 -217 0 50 334 -66 -26 31 28 -8 -532 -174 293 -44 -79 198 27 -33 -101 88 190 311 22 -262
8088b62N14m11J21L15j47l07J31k07M86l11J70j96q3%K08k23P2J78k18M3M1K12
$$ -262 252 -159 -38 277 130 -177 -46 -253 233 -78 92 -104 -187 -187 21 -202 -130 48 -170 -127 -86 126
8110A26j13o2l31K66q5J26mr4O8J46j18Q6j70K49j45n3L66l61M3o4Q2o7J78j08
$$ 126 13 -49 -380 -114 -199 -73 -77 -171 -103 43 -75 11 -159 90 -55 -108 258 -103 -60 -124 -42 -109 69 -39
8134c9k04L49J62l43R1k8p4k50K20k03N11l40J37J34l38K13J17m4j03N9Qp3l1
$$ -39 -243 106 268 -75 16 -12 -86 -336 -116 -319 192 -148 -11 123 -215 -2 115 71 -32 27 35 -38 -69
8157f9M2J55k75J88M5j53J39j94NL17k54J0J65j94LJ13j45K83k02j18M5M1j18
$$ -69 -27 128 -147 41 86 -67 72 -122 -117 200 -54 -44 121 -73 -70 43 -102 181 -21 -139 -94 -53 -171
8180a71N14m11J09MkqO3j24L46m26K20
$$ -171 343 -68 41 45 43 35 98 -26 320 -106 114
8191A14
$$ Imaginary data points
##PAGE= N=2
##DATA TABLE= (X++(I..I)), XYDATA
0@%%%%%%%%Qj6J6j6K4l2L2m0N0n8P2q7J02j18J35j54J77k02K30k63L00l39L82
$$ 0 0 0 0 0 0 0 0 0 8 -8 8 -8 16 -16 16 -24 26 -32 40 -47 55 -63 72 -82 95 -107 123 -140 160 -179 203
31B03m30M82n40O03o73P48q32R25j024J134j256J391j541J706j890K100k338K608
$$ 203 -227 255 -285 318 -355 393 -439 486 -538 596 -660 731 -810 896 -994 1106 -1232 1376
49A376k922L289l727M262m927N785o941Q591j1162J5767k6616R9152J03945p1519
$$ 1376 -1546 1743 -1984 2278 -2649 3136 -3805 4786 -6376 9391 -17225 81927 185872 114353
63A14353n353o481N865k7265j0845j0609j568j0533M018j904n501o272J4811J1565
$$ 114353 109000 102519 108384 81119 70274 59665 58097 47564 51582 49678 44177 37905 52716 64281
77F4281n377j5204N531J2776k149k2293j3812n95k353j4259j5677j2325o823l770
$$ 64281 58904 43700 49231 62007 59858 37565 23753 23158 20805 6546 -9131 -21456 -28279 -32049
91c2049k08j871n879l810R563J2587J728p764J775J4072P976q254j0037K076N701
$$ -32049 -32257 -34128 -40007 -43817 -34254 -21667 -19939 -27703 -25928 -11856 -3880 -12134 -22171 -20095 -14394
106a4394k440q042n431k476r29L536M852k862n127O328J6030N448p916j672J2955
$$ -14394 -16834 -24876 -30307 -32783 -33712 -30176 -25324 -28186 -33313 -26985 -10955 -5507 -13423 -15095 -2140
121b140J0097m865p222J729M064Q82j512k203m984k455O373O385n178j0500K597
$$ -2140 7957 3092 -4130 -2401 1663 2545 1033 -1170 -6154 -8609 -2236 4149 -1029 -11529 -8932
136h932J2146K718j0248p296N149O184l204o940k734N98L115L556n9n040j528
$$ -8932 3214 5932 -4316 -11612 -6463 -279 -3483 -10423 -13157 -12559 -9444 -5888 -5947 -10987 -12515
151a2515Q117Q908k576r822j798R517L601q516j0205J0M959p78o378m193P75L881
$$ -12515 -4398 4510 1934 -7888 -9686 -169 3432 -5084 -15289 -15279 -10320 -11098 -17476 -21669 -20894 -17013
167a7013N620L312n96j221O896J1794L123p469n254P057O569o727j2544m021L424
$$ -17013 -11393 -8081 -8677 -9898 -3002 8792 11915 4446 -808 6249 12818 6091 -6453 -10474 -7050
182g050p17n272m761j284J403N727N487R5k910M941J2127O219o898o566M813O587
$$ -7050 -7767 -13039 -17800 -19084 -17681 -11954 -6467 -6372 -9282 -4341 7786 14005 7107 541 5354 11941
198A1941m205j0647n907J69K01k495l743m012j61O624O878L69l511L252J1481
$$ 11941 7736 -2911 -8818 -8649 -8448 -10943 -14686 -18698 -18859 -12235 -5357 -4988 -8499 -5247 6234
213F234P379l187o162J758O751K25p579o759j489J190K19k522m543j879M284P462
$$ 6234 13613 10426 4264 6022 12773 12998 5419 -1340 -2829 -1639 -1420 -3942 -8485 -10364 -6080 1382
229A382K152m874j133Q113Q389k086p619r04N520J364n874n906k694k27O75J12
$$ 1382 3534 -1340 -2473 5640 14029 11943 4324 3420 8940 10304 4430 -1476 -4170 -4397 -3722 -3610
245c610l972m660J144P554L039n577n128M354P689j220q364l309L583K322k392
$$ -3610 -7582 -12242 -11098 -3544 -505 -6082 -11210 -6856 833 -387 -8751 -12060 -8477 -6155 -8547
260h547m283k170m54K975L639j241m663M51P395N403m030o129J834O726J522o510
$$ -8547 -12830 -15000 -15454 -12479 -8840 -10081 -14744 -14293 -6898 -1495 -5525 -11654 -9820 -3094 -1572 -8082
276h082m730J545L663P99j680k245K87M523O032K244l773q76O411P080j721p520
$$ -8082 -12812 -11267 -7604 -6805 -8485 -10730 -10443 -5920 112 2356 -1417 -2293 4118 11198 9477 1957
292A957k085N256K167n256o909j057K822J787o11k214q99L914P610L670k555l147
$$ 1957 -128 5128 7295 2039 -4870 -5927 -3105 -1318 -1929 -4143 -5042 -1128 6482 10152 7597 4450
308D450M513P263m46p798n436K758K261m094p106l544L80K236J213j021k707K049
$$ 4450 8963 16226 15780 7982 2546 5304 7565 3471 -3635 -7179 -6799 -4563 -3350 -4371 -7078 -5029
324e029P999N853j551l954L080P624J581o322n977O79K267k678n520m539p27J450
$$ -5029 2970 8823 7272 3318 6398 14022 15603 9281 3304 3983 6250 3572 -1948 -6487 -7214 -5764
340e764K563L7k754J83N930P104j74m460J51O794L614m459n921j146K474n56l480
$$ -5764 -3201 -3164 -5918 -5735 195 7299 7125 2665 2816 9610 13224 8765 2844 1698 4172 3616 136
357A36m466j809O45L311J380l114k498M222O928P22m913k381M364M449k195o182
$$ 136 -4330 -6139 -5494 -2183 -803 -3917 -6415 -2193 4735 5457 544 -1837 2527 6976 4781 -1401
373a401k497K236J649j172l138k228L24M368K837k257l707J697O062K155n176
$$ -1401 -3898 -1662 -13 -1185 -4323 -6551 -6227 -1859 978 -1279 -4986 -3289 2773 4928 -248
388b48m933J716M210l44n202l159P02K940J444r55k133K94M367M933p24m373j63
$$ -248 -5181 -3465 745 401 -4801 -7960 -7258 -4318 -2874 -3829 -5962 -5668 -1301 3632 2908 -1465 -1628
405a628N335K777m366n809o44L051O96l984l693m78K684L430J223j696p18M637
$$ -1628 3707 6484 2118 -3691 -4335 -1284 -588 -4572 -8265 -8743 -6059 -2629 -1406 -3102 -3820 817
421H17O651J257m595j586L981L583k758o636k346J713R55k448l452k103K304L844
$$ 817 7468 8725 4130 2544 6525 10108 7350 714 -1632 81 1036 -1412 -4864 -6967 -4663 -819
437h19K888j310j491L253O477L311l686l567K516L744j315n887m271M76J511j161
$$ -819 2069 759 -732 2521 8998 12309 8623 5056 7572 11316 10001 4114 -157 319 1830 669
453F69l024k439j43M082L748k80k473R43N579M254k544m854O77L410O43m690m636
$$ 669 -2355 -4794 -4937 -855 2893 2613 140 1083 6662 10916 8372 3518 4195 7605 8248 3558 -1078
470a078o53J286N79j449k525q44K953M642P90k922r79M441M395j714m914j585
$$ -1078 -1731 -445 134 -1315 -3840 -4684 -1731 2911 3701 779 -200 4241 8636 6922 2008 423
486D23K745J258k812m420j627J212J691N68k079j286J644N037K119k869l060K658
$$ 423 3168 4426 1614 -2806 -4433 -3221 -1530 -962 -3041 -4327 -2683 2354 4473 1604 -1456 1202
502A202M062j045n287l492J542J308r91l765j848M41K809K136j090j946P91N143
$$ 1202 5264 4219 -1068 -4560 -3018 -1710 -2701 -6466 -8314 -7873 -5064 -2928 -4018 -5964 -5173 -30
518c0L198k071m068K54M131M53m577l966l68K165K37k212k123k78L288L632R61
$$ -30 3168 1097 -2971 -2717 1414 1867 -2710 -6676 -7044 -4879 -4642 -6854 -8977 -9255 -5967 -2335 -1374
535a374j940m14M739M780j163m349p81L587J529k994m235q66J885J302k54k008
$$ -1374 -3314 -3728 1011 5791 4628 279 -502 3085 4614 1620 -2615 -3481 -1596 -294 -548 -2556
551b556m80K904M288K239j895j129L043M775L23m017k347J762K279j722l919j888
$$ -2556 -3036 -132 4156 6395 4500 3371 6414 11189 11512 7495 5148 6910 9189 7467 3548 1660
567A660R22K136P50j364j142J363M026L209j615k803J196L880O65m643l633k46
$$ 1660 2582 4718 5468 4104 2962 4325 8351 11560 9945 7142 8338 12218 12883 8240 4607 4361
583D361J957q41l431k967l29K291J331j20k151L7K844M037j382m242q05K506J412
$$ 4361 6318 5477 2046 -921 -1250 1041 2372 2252 101 138 2982 7019 5637 1395 590 3096 4508
600D508m011m994j591Q97M13k448k881j317J937K798O24j777j080K600M329k1
$$ 4508 497 -4497 -6088 -5191 -4778 -7226 -10107 -11424 -9487 -6689 -6065 -7842 -8922 -6322 -1993 -2014
616b014l783k470J922K182j868m513k355J057J132l10j880j089J785L673K563
$$ -2014 -5797 -8267 -6345 -4163 -6031 -10544 -12899 -11842 -10710 -11020 -12900 -13989 -12204 -8531 -5968
631e968m49j613K018M180J819k882k816R38K852n11l097k199O41J883J531j021
$$ -5968 -6417 -8030 -6012 -1832 -13 -2895 -5711 -4773 -1921 -2432 -5529 -7728 -7087 -5204 -3673 -4694
647d694j262J078L578L671p9j449j60M212K326k231l272l64J640O77k458k849
$$ -4694 -5956 -4878 -1300 2371 2292 843 683 4895 7221 4990 1718 1354 2994 3671 1213 -1636
663a636k68J418K023L53j646q51L108L833L53k489j263K200K887j658l902k043
$$ -1636 -1904 -486 1537 1890 244 -607 2501 6334 6687 4198 2935 5135 8022 6364 2462 419
679D19J261R69j185k732j403J154K296P78j418j353J384L946P20k754l189J495
$$ 419 1680 2649 1464 -1268 -2671 -1517 779 1557 139 -1214 170 4116 4836 2082 -1107 388
695C88K177p38l652k690J89J699k67j696j097K1K489K659l22k481K92L175J544
$$ 388 2565 1827 -1825 -4515 -4326 -2627 -2894 -4590 -5687 -5666 -3177 -518 -840 -3321 -3029 146 1690
712A690k216l612l73K004P5k814k661j9J322J695m46j096K53K645L613R68j658
$$ 1690 -526 -4138 -4511 -2507 -2432 -5246 -7907 -7926 -6604 -4909 -5355 -6451 -6198 -3553 60 1028 -630
729f30p23K884K499j106l956n20Q95J179j700k757o30J439J763J266j14p00K398
$$ -630 -1353 1531 4030 2924 -1032 -1552 -657 522 -1178 -3935 -4565 -3126 -1363 -97 -211 -911 1487
746A487L839J994j662j254K088K614k69l820k617M66J095j061k553k146M18K021
$$ 1487 5326 7320 5658 4404 6492 9106 8837 5017 2400 2866 3961 2900 347 -1799 -1381 640
762F40J157o46j742J615K665K275j590k251J57K015O74l338l207p55J099p7j931
$$ 640 1797 1151 -591 1024 3689 5964 4374 2123 2280 4295 4969 1631 -1576 -2331 -1232 -1309 -3240
779c240k017l53J361J835j00j626m34K534K395k74k478j026J999J277j808k429
$$ -3240 -5257 -5610 -4249 -2414 -2514 -4140 -4574 -2040 355 81 -2397 -3423 -1424 -147 -1955 -4384
795d384r92J602J012j19j366m87J128L201R84j634j086J837K826k39k735j690
$$ -4384 -5376 -3774 -2762 -2881 -4247 -4734 -3606 -405 579 -1055 -2141 -304 2522 2283 -452 -2142
811b142J135J588n62k452r90J012K131J217q79q01R71L286J478j122k177L32K288
$$ -2142 -1007 581 19 -2433 -3423 -2411 -280 937 58 -743 228 3514 4992 3870 1693 2025 4313
828D313O66k834k856j43J658J16j623j605P47K292J782J95n08M04K741K627l97
$$ 4313 4979 2145 -711 -854 804 920 -703 -2308 -1561 731 2513 2708 2200 2604 5345 7972 7575
845G575k161r90K100J083j911l193o47J227P69j221j363j22J833K434J035q88
$$ 7575 5414 4424 6524 7607 5696 2503 1856 3083 3852 2631 1268 1146 2979 5413 6448 5560
861E560k10J984K972j2j876j450P21J165j563k750j859K5O60l81j551j273R88
$$ 5560 5350 7334 10306 10294 8418 6968 7689 8854 7291 4541 2682 2707 3367 2986 1435 162 1150
878A150J869J383p99j137Q99K520O40j744k457k39J750k96k630k559o8J009M25
$$ 1150 3019 4402 3603 2466 3365 5885 6525 4781 2324 2085 3835 3539 909 -1650 -1718 -709 -284
895b84r57j321%J973J914k00j547J00K213J516j194k725j79J057J159j592j665
$$ -284 -1241 -2562 -2562 -589 1325 1125 -422 -322 1891 3407 2213 -512 -691 366 1525 -67 -1732
912a732m48J232J460R0p69o79J476K530o4j783j006J843J681j081l084j084J083
$$ -1732 -2180 -948 512 602 -167 -846 630 3160 3096 1313 307 2150 3831 2750 -334 -1418 -335
929c35J251p04j597o64J231J798N76n77j360J252K252O45k839j477O74J429m62
$$ -335 916 212 -1385 -2049 -818 980 1556 979 -381 871 3123 3768 929 -548 126 1555 1093
946A093k729j643K16J375O24j120r12P06K240J735O5j191K84K175J253j571j967
$$ 1093 -1636 -3279 -3063 -1688 -1064 -2184 -3096 -2390 -150 1585 1650 459 743 2918 4171 2600 633
963F33m38J207m6j735j908n8Q54J471l13q15K72K039K374L84r38r63J765J538
$$ 633 195 1402 1356 -379 -2287 -2345 -1491 -20 -333 -1148 -876 1163 3537 3921 2983 2020 3785 5323
981E323j143k290j093P63K87q74k413q71O32J632K90r68l21J106K406J068j237
$$ 5323 4180 1890 797 1560 1847 973 -1440 -2311 -1679 -47 243 -725 -1046 60 2466 3534 2297
998B297j320O82J901m38k354j868J18P68n82j947q76L12J280P92m58n35O60J927
$$ 2297 977 1659 3560 3122 768 -1100 -982 -214 -796 -2743 -3619 -3307 -2027 -1235 -1693 -2228 -1568 359
1016C59J312p14j975K82J720N22j931j936l26R45L20q25j184k03J206J313O55
$$ 359 1671 957 -1018 -736 984 1506 -425 -2361 -2687 -1742 -1422 -2247 -3431 -3634 -2428 -1115 -460
1033d60j209k85J782J836l88k456j90J141J106j562j778q30J009J097l10j039
$$ -460 -1669 -1954 -172 1664 1276 -1180 -1370 -229 877 -685 -2463 -3293 -2284 -1187 -1497 -2536
1049b536k98R88K148O34j087o24P82J617J32k182j565R91P70l65j563q66O76J405
$$ -2536 -2834 -1846 302 936 -151 -775 7 1624 1756 -426 -1991 -1000 -230 -595 -2158 -3024 -2348 -943
1067i43Q64m55j180J218J978J237q54j587K03J694K00j338k629j8J591j39j178
$$ -943 -79 -534 -1714 -496 1482 2719 1865 278 481 2175 2375 1037 -1592 -1610 -19 -158 -1336
1084a336j374K44J442J362r2n13J38J888J746o90j639o69J222O27j514j828q12
$$ -1336 -2710 -2466 -1024 338 246 -267 -129 1759 3505 2815 1176 507 1729 2356 842 -986 -1798
1101a798O06Q13p30j094m02J495J683M99m01n06J087K182l1j513j343J024Q61
$$ -1798 -1192 -379 -1109 -2203 -2605 -1110 573 1072 671 165 1252 3434 3403 1890 547 1571 2432
1118B432q46k356j175O85N17K63j101j85N77J891R48r3j238P73J787O32j285k129
$$ 2432 1586 -770 -1945 -1260 -743 -480 -1581 -1766 -1189 702 1650 1557 319 1092 2879 3511 2226 97
1136I7M57Q32n2j808j407j88R10O20l30q77J36J687J264l16r39n93J693P16j051
$$ 97 554 1386 1334 -474 -1881 -2069 -1159 -539 -869 -1746 -1610 77 1341 1025 86 -507 1186 1902 851
1155H51j890l84P77J52p31j450q4R71J204K26q87k90J487J632L00j791q65J170
$$ 851 -1039 -1423 -646 -494 -1225 -2675 -2759 -1788 -584 -358 -1245 -1535 -48 1584 1884 93 -772 398
1173C98Q33m28k208m17M11M48J0r06n85J125J579P18m30q36J098J547L72j312
$$ 398 1231 803 -1405 -1822 -1411 -963 -953 -1859 -2444 -1319 260 978 548 -288 810 2357 2729 1417
1191A417j474K99Q49m73j689j269K00Q03J28p22n45M47J563J162j61m90K66J299
$$ 1417 -57 242 1091 618 -1071 -2340 -2140 -1337 -1209 -1931 -2476 -2029 -466 696 535 45 311 1610
1209A610N01r36j583n93J051K28j611j127l84J085M76j60n56K59J626J613J92
$$ 1610 2111 1175 -408 -1001 50 278 -1333 -2460 -2844 -1759 -1283 -1443 -1999 -1740 -114 1499 1691
1226A691j046p0R18J309k82j944o79N34O80o10j463m01P99J243J09m37l96J284
$$ 1691 645 575 1493 2802 2520 576 -103 431 1111 501 -962 -1363 -564 679 788 351 -45 1239
1244A239J427N79j233q41N85J197N4j724j511J38N06K07j183n87J47Q71J371o09
$$ 1239 2666 3245 2012 1171 1756 2953 3007 1283 -228 -90 416 623 -560 -1147 -1000 -129 1242 633
1262F33n97kJ304J021o24j386k47R71P3j610j351m8J031L82r19o45K6J020J365
$$ 633 36 34 1338 2359 1735 349 102 1073 1146 -464 -1815 -1863 -832 -450 -1369 -2014 -1988 -968 397
1281C97o0o45J12P54J220o25j459p53R04K33o20j440q85Q24Q72j4j041PJ173J189
$$ 397 337 -308 -196 558 1778 1153 -306 -1059 -155 78 -542 -1982 -2867 -2043 -1171 -1185 -2226 -2219 -1046 143
1301A43L99r87n33R08J044o73j382j129J35N96m79j215o88M33P25M79m38j78O10
$$ 143 542 -445 -978 -70 974 301 -1081 -2210 -2075 -1479 -1958 -3173 -3861 -3428 -2703 -2224 -2662 -2840 -2230
1320b230J140Q34n09j314L39J266J58j168j474M7N79l5q02n81M14J154J189o7
$$ -2230 -1090 -256 -765 -2079 -1740 -474 -316 -1484 -2958 -2911 -2332 -2367 -3169 -3750 -3336 -2182 -993 -1060
1338a060m03K25J314J590n33j106j64J084P40r16j521l26P58P42n22n45r8J148
$$ -1060 -1463 -1238 76 1666 1133 27 -137 947 1687 771 -750 -1076 -318 424 -98 -643 -741 407
1356D07Q42N11m74J52Q08J015j64j266m44J39O50o84j246n73L06Q78k39j78p78
$$ 407 1249 1760 1286 1438 2246 3261 3097 1831 1387 1526 2176 1492 246 -327 -21 857 618 440 -338
1375c38O93J249O61m88o61L31M79M79j112j291r1Q94j82j077r14Q9P43R05n26
$$ -338 355 1604 2265 1777 1116 1447 1926 2405 1293 2 -89 805 623 -454 -1368 -1279 -536 369 -157
1394a57l57R9J029J297k53j034l71J246M27j042j654m90Q50L85o80r95N1N96J168
$$ -157 -514 -415 614 1911 1658 624 253 1499 1926 884 -770 -1260 -410 -25 -705 -1700 -1649 -1053 115
1413A15n5p39k41J007J011L6j057p04R10K63n37j677o29L28M18Nj261o1Q99L87
$$ 115 60 -679 -920 87 1098 1134 77 -627 283 546 9 -1668 -2297 -1969 -1551 -1546 -2807 -2868 -1969 -1582
1433a582R05o13j68O41Q48L46j054r82M85N51j26j013j215N93R02m2l40m29P09
$$ -1582 -677 -1290 -1458 -817 31 377 -677 -1659 -1174 -623 -749 -1762 -2977 -2384 -1482 -1524 -1864 -2293 -1584
1452a584R07R53r1n37K43J055Q33j011q65n11Q05N46j169q00J22J235J05q9j33
$$ -1584 -677 276 185 -352 -109 946 1779 768 -97 -608 197 743 -426 -1226 -1104 131 236 147 14
1471A4N0O79J378J25r97k29Q30J036n84j164p23M42M37n40n61m16N71J017K51
$$ 14 64 743 2121 2246 1249 1020 1850 2886 2302 1138 415 857 1294 754 193 -223 348 1365 1616
1490A616o76p6O09Q72K80o47m11l23O61M8j194j077M73M89l00l92p36N86R10J69
$$ 1616 940 864 1473 2345 2625 1978 1567 1244 1905 1953 759 -318 155 644 344 -48 -784 -198 712 881
1510H81j3l81J90P08N38m56j200l24P84l7q99j054j61P13L8q9p78M29O43P64j4
$$ 881 868 487 677 1385 1923 1467 267 -57 727 690 -209 -1263 -1424 -711 -673 -762 -1540 -1111 -468 296 282
1531B82r50K11N66R99p31j397PJ06M71q49p75n49O45Q79m26J1o32Q21J478K38
$$ 282 -668 -457 109 1108 377 -1020 -1013 -907 -436 -1285 -2060 -2609 -1964 -1085 -1511 -1500 -2132 -1311 167 405
1551D05p66o48M67J033n02q08r14J99O17m13n01n36O72O64N96o07j57P67Q53N96
$$ 405 -361 -1009 -542 491 -11 -819 -1733 -1534 -917 -1330 -1831 -2367 -1695 -1031 -435 -1042 -1199 -432 421 1017
1571A017n95o06K84R88l05r31p65J46N08jn54m09K21P81Q27p3k66K99O20N90j95
$$ 1017 422 -184 100 1088 783 -148 -913 -767 -259 -260 -814 -1223 -1002 -221 606 533 267 566 1186 1776 1581
1592A581r60j10K50M54q60o78l58P72M5r9m20J46K96J117n7l66k0K00R25j56m70
$$ 1581 621 511 761 1215 355 -323 -681 91 136 37 -383 -237 59 1176 1119 753 733 933 1858 1702 1232
1613A232q97J34L93j14j264l17J49Q33k62p4j81J53R82N48o80j47M53J96O9n58
$$ 1232 335 469 862 748 -516 -833 -684 149 -113 -187 -368 -215 767 1315 635 488 941 1137 1206 648
1633F48q89L08J06K4o13n78K20L79N52j89j28k48J413K80K3j087l5P87J35l77
$$ 648 -241 67 173 197 -416 -994 -774 -395 157 -32 -160 -408 1005 1285 1308 221 186 973 1108 731
1653G31j245J17J80J26q9n87q9O69N48Jm02J55M08R32k31n48n20L48K37n00p70
$$ 731 -514 -397 -217 -91 -180 -767 -856 -187 361 362 -40 115 523 1455 1224 676 156 504 741 241 -529
1674e29o24M98K99j66m08k38M95P41O29l00o31Q10K20J04o82j060K81O64l34q26
$$ -529 -1153 -655 -356 -522 -930 -1168 -673 68 697 397 -234 576 796 900 218 -842 -561 103 -231 -1057
1694a057n92L17L34J46l6j10Q5M54O72Nn09K07M86L58p02p36m32O18Q2n98n98
$$ -1057 -1649 -1332 -998 -852 -888 -998 -913 -459 213 218 -291 -84 402 760 58 -678 -1110 -492 -410 -1008 -1606
1715a606J08O57M65j50l11J95R12M59J17l74k87M18N83p78n53m75Q11J63l25o45
$$ -1606 -1498 -841 -376 -526 -837 -642 270 729 846 472 185 603 1186 408 -145 -620 191 354 29 -616
1735f16l16M16P45M05r5l20O32O37K72n81n11J25M79k18o43l14J28J90j9k04m81
$$ -616 -932 -516 229 634 539 219 851 1488 1760 1179 668 793 1272 1054 411 97 225 415 396 192 -289
1756b89L47N46O73j71o48K30N19O88r20q15J61N52l5p57o21L17K78M83l63m57
$$ -289 58 604 1277 1106 458 688 1207 1895 975 160 321 873 838 81 -540 -223 55 538 175 -282
1776b82K33K48M87M16q39j85M32M42o04l64m92J38L48k31n26k75K1P26P7j87j81
$$ -282 -49 199 686 1102 263 78 510 952 348 -16 -508 -370 -22 -253 -779 -1054 -1033 -307 -230 -417 -598
1797e98M73O79K51q04k86K70L70k29m77n98L1O28k59k90m39M8M25Q61n96R7K81
$$ -598 -125 554 805 1 -285 -15 355 126 -351 -949 -918 -290 -549 -839 -1278 -1230 -805 56 -540 -443 -162
1818a62N45R6J5p27j99P68K59j006o46N9M13l6l60l31L53O04O42k26lj71N89K80
$$ -162 383 479 494 -233 -432 336 595 -411 -1057 -998 -585 -621 -981 -1312 -959 -355 287 61 58 -113 476 756
1840G56L9r81j94O54m6k43q31j85O78J05m05j32J01L94Q58k5j83j06N08L87k27
$$ 756 795 -186 -380 274 228 -15 -846 -1031 -353 -248 -653 -785 -684 -290 568 543 360 254 762 1149 922
1861I22p72j64L06L08m27n35j82J73M94L22j50r4J13O26J34k93n19M02N71n8n05
$$ 922 150 -14 292 600 173 -362 -544 -371 123 445 295 201 314 940 1074 781 262 664 1235 1177 672
1882F72n27k29L98N1l92l14K00L77J66j89k10L16L76M56m69k45j20J33J99k55
$$ 672 145 -84 314 365 -27 -341 -141 236 402 213 3 319 695 1151 682 437 317 450 649 394
1902C94n60k22M21J74n77n5k28N70M78L22l96k98M06K73j07m38l4j72K74l34o05
$$ 394 -166 -388 33 207 -370 -425 -653 -83 395 717 321 23 429 702 595 157 123 -49 225 -109 -714
1923g14j62J06O20k57l46p3M27L43J58N1k31L77N09M4p43m90J63j67Q8o68l23
$$ -714 -876 -770 -150 -407 -753 -826 -399 -56 102 153 -78 299 808 852 109 -381 -218 -385 -297 -965 -1288
1944a288J79N43k39K42m66N14M24L59m00l20L63N81j09o31j43k13L52j74m9l50
$$ -1288 -1109 -566 -805 -563 -1029 -515 -91 268 -132 -452 -89 492 383 -248 -391 -604 -252 -426 -475 -825
1964h25k30J23O35M6m0J22K06O74O3o12K07O2J73l45p9k27k19J85K4j9l57K94
$$ -825 -1055 -932 -297 -251 -291 -169 37 711 774 162 369 431 604 259 180 -47 -266 -81 -57 -76 -433 -139
1986a39L49L93l94j05M21P1J82j27m89K48J17k31k46l80l5L56J80o3m08M11J17
$$ -139 210 603 209 104 525 596 778 651 162 410 527 296 50 -330 -365 -9 171 108 -300 111 228
2007B28L07K85n38j4K87K70k52o88r3P83m36l64j89j52K53L81k41j80K33M43n8
$$ 228 535 820 282 268 555 825 573 -115 -208 575 139 -225 -414 -566 -313 68 -173 -353 -120 323 265
2028B65J45j82k10K31L23k56q14l28L25L21l82k56j23J57M24k27k08K31N01J81
$$ 265 410 228 18 249 572 316 -498 -826 -501 -180 -562 -818 -941 -784 -360 -587 -795 -564 -63 118
2048A18Nl51j41J79J76k12m87m95P8L33l2o60Q4J60M06J26m7j19J95K69N19k29
$$ 118 123 -228 -369 -190 -14 -226 -713 -1208 -1130 -797 -829 -1489 -1405 -1245 -839 -713 -760 -879 -684 -415 104 -125
2070a25o66M56J33k55l11l72m1K58J86o28N6K70J44M13%K3K45K36k3J96k51l10
$$ -125 -791 -335 -202 -457 -768 -1140 -1181 -923 -737 -1365 -1309 -1039 -895 -482 -482 -459 -214 22 -1 195 -56 -366
2092c66M19j9r7j57j61k2N47k97O5j83K71N38P2m5l20N98P39n89p16J37L75n89
$$ -366 53 34 -63 -220 -381 -403 144 -153 -88 -271 0 538 610 565 245 843 1582 993 277 414 789 200
2114B00L70q1n81K47P24n2n29K65M8M58j50J51m30J60J43J83n01l41J48K45r0
$$ 200 570 489 -92 155 879 827 298 563 611 1069 919 1070 640 800 943 1126 625 284 432 677 587
2135E87l87N8m4L75J06J58k62J37P5N7J24l65k57O3K24o05m4j59J28J41j99K72
$$ 587 200 258 214 589 695 853 591 728 803 860 984 619 362 425 649 44 0 -159 -31 110 -89 183
2157A83o09M12R24l70l48m0M22K90k71l31k05m5R5%m44k99K82J20J3k73J60O00
$$ 183 -426 -14 910 540 192 152 574 864 593 262 57 12 107 107 -337 -636 -354 -234 -221 -494 -334 266
2179B66j0L84m62J02M38k84L15m03n78K26J91l14n29R9M5K86L1k63N09l10N62
$$ 266 256 640 178 280 718 434 749 346 -232 -6 185 -129 -658 -559 -514 -228 -197 -460 49 -261 301
2200C01K44m01J23l20L65j23k95m6j20K21j19m05K70k85K57K8L60n95L16O06k28
$$ 301 545 144 267 -53 312 189 -106 -152 -272 -51 -170 -575 -305 -590 -333 -305 55 -540 -224 382 154
2221A54L0r4n14N17j35k9n04R3q6K95l16j29j06M53J12L65k35j2M98p4J3r5m74
$$ 154 184 90 -424 93 -42 -71 -575 -482 -568 -273 -589 -718 -824 -371 -259 106 -129 -141 357 283 296 201 -273
2244b73N6L59l0o13l4K19MO7J26j30J51N14m2k2k60L45J17j80k86P9j82L22j91
$$ -273 -217 142 112 -501 -535 -316 -312 -245 -119 -249 -98 416 374 352 92 437 554 374 88 167 -15 307 116
2267A16j83j52K11K10k49J18J04L66L97j98K20k37l17L35R1j56p83l2Q0N30k41
$$ 116 -67 -219 -8 202 -47 71 175 541 938 740 960 723 406 741 832 676 -107 -139 -59 471 230
2288B30l35j93P37O3o00L15j4K60L45j31j69k06K3Q9j80o7k85n0K16l37k25J05
$$ 230 -105 -298 439 502 -98 217 203 463 808 677 508 302 325 414 234 167 -118 -168 48 -289 -514 -409
2310d09L73l8PP0j51K06J85J60l50j86M4P5j20l12l77RM36j24o8j48n6L76P8J34
$$ -409 -36 -74 -67 3 -148 58 243 403 53 -133 -89 -14 -134 -446 -823 -814 -378 -502 -570 -718 -774 -398 -320 -186
2334a86l43M01k19L48r0l00k88PM52l85k03K7R2J04N17n32J65N6N81q0j40Q7J45
$$ -186 -529 -128 -347 1 -89 -389 -677 -670 -218 -603 -806 -779 -687 -583 -66 -598 -433 -377 204 124 -16 71 216
2357B16k90N14m46j42L0N2L26m30K3P9M07o6J24l06K45K5K33j1k34K35J16j86
$$ 216 -74 440 -6 -148 -118 -66 260 -170 -147 -68 339 273 397 91 336 361 594 583 349 584 700 514
2379E14m64k80L66Qr8P6J26l22P15M6j95k75M19N9N6l1j87r4P7k20j64P2k7l94
$$ 514 50 -230 136 144 46 122 248 -74 641 687 492 217 636 695 751 720 533 439 516 296 132 204 177 -217
2403b17J30K6q2j23L61J57L35l35K1J02L74k49k88k94mJ68o6l35l39L32J59k1
$$ -217 -87 -61 -143 -266 95 252 587 252 273 375 749 500 212 -82 -86 82 16 -319 -658 -326 -167 -188
2425a88j21J14J37L80j36j87l07K68J66J27n87L12l3J6k36o8o44P91j57L66r0
$$ -188 -309 -195 -58 322 186 -1 -308 -40 126 253 -334 -22 -55 -39 -275 -343 -987 -196 -353 13 -77
2446g7k10J7L45M36n00K3l63M11j70k1j57k7j25L10k22j55O3M33r3L27l69oJ82
$$ -77 -287 -270 75 511 11 34 -329 82 -88 -109 -266 -293 -418 -108 -330 -485 -422 11 -82 245 -124 -130 52
2469E2K3M%l43J73M3k6o7l46J47K32o6j84K33R3j58M2J0J4L00J43k30J49n55J37
$$ 52 75 79 79 -264 -91 -48 -74 -141 -487 -340 -108 -174 -358 -125 -32 -190 -148 -138 -124 176 319 89 238 -317 -180
2494a80J69j36j16j38j10O02k52q2o4L7N22J19j61l21K38Q3J64j41m90J6J84J7
$$ -180 -11 -147 -263 -401 -511 91 -161 -243 -307 -270 252 371 210 -111 127 210 374 233 -257 -241 -57 -40
2516d0k06j93K39K0K67j64l8J2M48k1k00j43o1O56n57J24j44k42r8M61m9l05l04
$$ -40 -246 -439 -200 -180 87 -77 -115 -103 345 324 124 -19 -80 576 19 143 -1 -243 -341 120 71 -234 -538
2539e38L48L37r9l75J51K09J07m0j65o8j71O21j79k72l03J3K96p1k63k89L20m9
$$ -538 -190 147 48 -327 -176 33 140 100 -65 -133 -304 317 138 -134 -437 -424 -128 -199 -462 -751 -431 -480
2561d80N09mk46J9M15k92qk36L2M0N7k81R2k72R8K60j94K42k81K79J64O1k21K1
$$ -480 29 25 -221 -202 213 -79 -87 -323 -291 -251 -194 -475 -383 -655 -557 -297 -491 -249 -530 -251 -87 -26 -247 -226
2585b26K09K2J29k82j82M6m3j78J67nO5J34J35q7m4j0K92k66L45K86k08q9J11
$$ -226 -17 5 134 -148 -330 -284 -327 -505 -338 -343 -278 -144 -9 -96 -140 -150 142 -124 221 507 299 210 321
2608C21r7k56rj93L69l61K7K89m7N4J93r8J23j78L05K82n35N5K61J60k13J39l38
$$ 321 224 -32 -41 -234 135 -226 -199 90 43 97 290 192 315 137 442 724 189 244 505 665 452 591 253
2631B53j50K78j75j40J63L32K94P2k83j59L02M52n36j78j7K45l53M4j68J6J17
$$ 253 103 381 206 66 229 561 855 927 644 485 787 1239 703 525 508 753 400 444 276 292 409
2652D09J54k75J88L08j76j90K24n5K6J95j72K6l74K1M9J9M8j27p8j04L46k23k61
$$ 409 563 288 476 784 608 418 642 587 613 808 636 662 288 309 358 377 425 298 220 116 462 239 -22
2675b2K65R0k2K36k02o7j24L17k94p4l02J34q2m5N8k01lN04j44m23K40K9K42J70
$$ -22 243 333 311 547 345 278 154 471 177 103 -199 -65 -147 -192 -134 -335 -338 166 22 -401 -161 -132 110 280
2699B80j87j65K0j29L76l32l49k43M62Q5k85l48L03L36Q2L3k98J92M5O6qJ93o30
$$ 280 93 -72 -52 -181 195 -137 -486 -729 -267 -182 -467 -815 -512 -176 -94 -61 -359 -167 -122 -56 -64 129 -501
2722e01M8O0j28r8N4kJ2k2j20K2O0J16K42k38J94K81q0o3k42j4K73k61K5j36Q8
$$ -501 -453 -393 -521 -619 -565 -567 -555 -577 -697 -675 -615 -499 -257 -495 -301 -20 -100 -163 -405 -419 -146 -407 -382 -518 -430
2747d30j27K08O6j5r4N53o5k14n4O46m66j96J70k40O4j64J49K5j05J85o5k13L49
$$ -430 -557 -349 -283 -298 -392 161 96 -118 -172 474 8 -188 -18 -258 -194 -358 -209 -184 -289 -104 -169 -382 -33
2770c3l5k85L10J41J76k25m6K70J16j44m17k9O2L01m30k7kQ4L44j76K81k74j56
$$ -33 -68 -353 -43 98 274 49 3 273 389 245 -172 -201 -139 162 -268 -295 -297 -213 131 -45 236 -38 -194
2793a94J15K80Q0k67q3q4J18l50K96k67J11J25J7j56j09J65j17K42lP6J03k20
$$ -194 -79 201 281 14 -69 -153 -35 -385 -89 -356 -245 -120 -103 -259 -368 -203 -320 -78 -81 -5 98 -122
2815a22o6J5m6k4K55l58j04j0J99Nj95J42j9%l70P13j04m83L15j10K31j89om63
$$ -122 -188 -173 -219 -243 12 -346 -450 -460 -261 -256 -451 -309 -328 -328 -698 15 -89 -572 -257 -367 -136 -325 -331 -794
2839g94L57j09j5r2j2JJ18p8K80j13RJP0m3P5P6K18m53k47J07O4J18J00q3o1p5
$$ -794 -437 -546 -561 -653 -665 -664 -546 -624 -344 -457 -448 -447 -377 -420 -345 -269 -51 -504 -751 -644 -580 -462 -362 -445 -506 -581
2865e81J03M59j94N4P1J97j39r5j58K53mJ66k75k12r8K38l10K8J92J60J13M05
$$ -581 -478 -19 -213 -159 -88 109 -30 -125 -283 -30 -34 132 -143 -355 -453 -215 -525 -497 -305 -145 -32 373
2887C73k86m1j20J2L81m19K75l17J85K1l33p3J58J52l46N65j50j68K23p4n5K23
$$ 373 87 46 -74 -62 319 -100 175 -142 43 64 -269 -342 -184 -32 -378 187 37 -131 92 18 -37 186
2909A86j89L93o2K16o20j7%M00m7m77L84j10K71m09O0K09K2l7L08n9j48l01K53
$$ 186 -3 390 328 544 -76 -93 -93 307 260 -217 167 57 328 -81 -21 188 210 173 481 422 274 -27 226
2932B26L51l18j91J00K4R9l17J9J86l46L96n95L33K6K98K9Kk09M4R3m61J08j35
$$ 226 577 259 68 168 192 291 -26 -7 179 -167 229 -366 -33 -7 291 320 322 113 157 250 -211 -103 -238
2955b38J5m5r9m4pM47o0J15j20k94K38n4k3J85k52j68K40J31j63l9J93j48J2L2
$$ -238 -223 -268 -367 -411 -418 29 -31 84 -36 -330 -92 -146 -169 16 -236 -404 -164 -33 -196 -235 -42 -190 -178 -146
2979a46J67k43K23K60j69L31m47k41J87K38K5j70K11k98k47J05K33l6J86k00Q6
$$ -146 21 -222 1 261 92 423 -24 -265 -78 160 185 15 226 -72 -319 -214 19 -17 169 -31 55
3000E5O1J19k13q6J37j34j13O2N19l65LOm4kk68K70J03j8k96J17J04J51R2K73
$$ 55 116 235 22 -64 73 -61 -174 -112 407 42 45 51 7 5 -263 7 110 92 -204 -87 17 168 260 533
3024E33k96J30l97J68j05J27P3k20j9R9j37J98o0N0K24k41n9J48P7K94m16J0j69
$$ 533 237 367 -30 138 33 160 233 13 -6 93 -44 154 94 144 368 127 68 216 293 587 171 181 12
3047A2L14o2r1jOk28j34M64m13K01K17k98L03K38l69P4J55k36Q6J12j64l68QK3
$$ 12 326 264 173 172 178 -50 -184 280 -133 68 285 -13 290 528 159 233 388 152 238 350 186 -182 -174 -151
3071a51J28j5P1P7q4M6k8J6L38j78r8K10l28j9J12J7l0j30R1l10J52p5J89RN3
$$ -151 -23 -38 33 110 26 72 44 60 398 220 122 332 4 -15 97 114 84 -46 45 -265 -113 -188 1 10 63
3096F3R8j88N8J99k86p4J53j20J6k5RK18n98L77k42j29Q0J79K30km1p9o8J37J77
$$ 63 161 -27 31 230 -56 -130 23 -97 -81 -106 -97 121 -477 -100 -342 -471 -391 -212 18 16 -25 -104 -172 -35 142
3121A42m87L10O9l62J91j29JJ71Nqr1J11j80J71K77K21l12l49K68N6N5m9k60R7
$$ 142 -345 -35 34 -328 -137 -266 -265 -94 -89 -97 -188 -77 -257 -86 191 412 100 -249 19 75 130 81 -179 -82
3145h2J70M9k57p8J52K01k29J38J09M3R4n3k35L02K17m13Q0Q7j58K2q0j73K65
$$ -82 88 137 -120 -198 -46 155 -74 64 173 216 310 257 22 324 541 128 208 295 137 159 79 -94 171
3168A71k59L31j57K42j97J37k70r8M00K6m09J47K39n5j29j03J52q0k29J26Q3l36
$$ 171 -88 243 86 328 131 268 -2 -100 300 326 -83 64 303 248 119 16 168 88 -141 -15 68 -268
3190b68M30Q9m3q4J3j8J66j8k78K7q8K13k44n9m8j22K80j98L7J26L3J90j46M1
$$ -268 162 251 208 124 137 119 285 267 -11 16 -72 141 -103 -162 -210 -332 -52 -250 -213 -87 -54 136 -10 31
3214C1p3m0K35k7o32L82o0J46k61jj45p7J74r1M30l47rJ28J28k99J06j10L46M2
$$ 31 -42 -82 153 126 -506 -124 -184 -38 -299 -300 -445 -522 -348 -439 -9 -356 -365 -237 -109 -408 -302 -412 -66 -24
3238b4j60R9j32R0k24R6m6K16n8J3O1l38J82K96r6j16lM54j58l78K53k7k41L00
$$ -24 -184 -85 -217 -127 -351 -255 -301 -85 -143 -130 -69 -407 -225 71 -25 -141 -144 310 152 -226 27 0 -241 59
3262E9j15q8K85j18K31l81K56r3J52K28k47K4o9J39k00m8R0pk71M10j17j87K16
$$ 59 -56 -144 141 23 254 -127 129 36 188 416 169 193 124 263 63 15 105 98 -173 237 120 -67 149
3285A49L4j23J19L6J07N4K0J98L2l51J12J1j16R6n7j62o8M42n4k79n8L59M5k86
$$ 149 183 60 179 215 322 376 396 594 626 275 387 398 282 378 321 159 91 533 479 200 142 501 546 260
3309B60R5o3J47m1J52j35k20p1L29l83j71L98j42j27P2J53l0j83J27RQn23J97
$$ 260 355 292 439 398 550 415 195 124 453 70 -101 297 155 28 100 253 223 40 167 176 184 -339 -142
3332a42K08J0r7j27k73J33M40o13J86J57p0M0O1L70l42N9J56k49j31P4MJ15j25
$$ -142 66 76 -21 -148 -421 -288 152 -461 -275 -118 -188 -148 -87 283 -59 0 156 -93 -224 -150 -146 -31 -156
3355a56j74L76j23L1n0L5m01M76M3k50N4qJ01P1j4k2j71j06K34k68J90n9Q7k56
$$ -156 -330 46 -77 -46 -96 -61 -462 14 57 -193 -139 -147 -46 25 11 -11 -182 -288 -54 -322 -132 -191 -104 -360
3379c60K13k02L04p2j2P3j43l5jJ65O1o7j14l01K79J49j17l4K6k58M40q4k18J34
$$ -360 -147 -349 -45 -117 -129 -56 -199 -234 -235 -70 -9 -76 -190 -491 -212 -63 -180 -214 -188 -446 -6 -90 -308 -174
3403a74J09K93j41j67j14M7k5K4M44o45M91L7k28lK56q7k56L52k6j91J14J22R6
$$ -174 -65 228 87 -80 -194 -147 -172 -148 296 -349 142 179 -49 -52 204 117 -139 213 187 -4 110 232 328
3426C28k47K19k55K35m02R4j35J13l8n7mj32M07M4l43K13M23n65J17m2o3R0j00
$$ 328 81 300 45 280 -122 -28 -163 -50 -88 -145 -149 -281 126 170 -173 40 463 -102 15 -27 -90 0 -100
3449a00p1Q9K24l46j03J79J84k1K66l31O7J78j89K84J9k20Q7j19J49j60L2p4Q7
$$ -100 -171 -82 142 -204 -307 -128 56 35 301 -30 37 215 26 310 329 109 196 77 226 66 98 24 111
3472A11k64J14j57J64MK7j96J50N6K59m6J60k25R3j97J39r9Q4j80J27k1m65L61
$$ 111 -153 -39 -196 -32 -28 -1 -197 -47 9 268 222 382 157 250 53 192 93 177 -3 124 103 -362 -1
3495aj60O9K00J62l26k17M47k58N9j89j26K31K0R7N0j85l00L83O7j84J35p2k8
$$ -1 -161 -92 108 270 -56 -273 174 -84 -25 -214 -340 -109 -89 8 58 -127 -427 -44 23 -161 -26 -98 -126
3518a26K77k53L07k63K22J27l07N1l34L66j6K63l74J9J32Ll0K75l00J85j96P4
$$ -126 151 -102 205 -58 164 291 -16 35 -299 67 51 314 -60 -41 91 94 64 339 39 224 28 102
3540A02R3L74l70m9J29J77o36J81n3K73J03l59J32J1l0j6L38j39o3O3J6j00q6
$$ 102 195 569 199 150 279 456 -180 1 -52 221 324 -35 97 108 78 62 400 261 198 261 277 177 91
3563I1Pn3J53P1m9j36r1K2P0L39n28J02M24j77j18J04L7n76M09K21j67J91k47
$$ 91 98 45 198 269 220 84 -7 15 85 424 -104 -2 422 245 127 231 268 -308 101 322 155 346 99
3586I9j77J44j57lj5L9mP9N0k12J89J12k66K02l30L10j17k67K72k60J72J39j18
$$ 99 -78 66 -91 -94 -109 -70 -74 5 55 -157 32 144 -122 80 -250 60 -57 -324 -52 -312 -140 -1 -119
3609a19j21L76l66R2j02N7M4K2k22j32o8L52r1J7K14j34k77J69J0k80M77q2J72
$$ -119 -240 136 -230 -138 -240 -183 -139 -117 -339 -471 -539 -187 -278 -261 -47 -181 -458 -289 -279 -559 -82 -164 8
3632Hq2m8o6q9J42K62j14L1q7j39m5k44K29j05J43J19j75J74j49L53j58R3k69
$$ 8 -74 -122 -188 -277 -135 127 13 44 -43 -182 -227 -471 -242 -347 -204 -85 -260 -86 -235 118 -40 53 -216
3655b16M55k69J69k53K46k17N1j7J33P2p8J65k32J27Q3j11m35N55o3l17J56J83
$$ -216 239 -30 139 -114 132 -85 -34 -51 82 154 76 241 9 136 219 108 -327 228 165 -152 4 187
3677A87j35j70J27l58O18j75j46J06j70pO9k1L10q1k84M36k52j92K48J65l26k0
$$ 187 52 -118 9 -349 269 94 -52 54 -116 -123 -54 -75 235 154 -130 306 54 -138 110 275 -51 -71
3699g1l6J92m8k94J50J93J2k53K10R7k66K19q4j21J01l9M5L3p9k36jN30l84L78
$$ -71 -107 85 37 -257 -107 86 98 -155 55 152 -114 105 21 -100 1 -38 7 40 -39 -275 -276 254 -130 248
3723B48l65J11j58K98l80J74K61l8l5j88N3M9j84LP8M4L5j15o4J63L67m67rr1
$$ 248 -117 -6 -164 134 -246 -72 189 151 116 -72 -19 30 -154 -151 -73 -29 6 -109 -173 -10 357 -110 -119 -210
3747b10K62K25k33j99m1K25l74M64M4j37k48J85j56N5p0J50j44M32n47M86k73
$$ -210 52 277 44 -155 -196 29 -345 119 163 26 -222 -37 -193 -138 -208 -58 -202 230 -317 169 -104
3768a04J17j35P7J74l07N8n8J42M5J48l90K22PN0M6m3r1J25j43K68l17r5M40k79
$$ -104 13 -122 -45 129 -178 -120 -178 -36 9 157 -233 -11 -4 46 92 49 -42 83 -60 208 -109 -204 236 -43
3792d3k57J33K44k26n3J2O4O2K68p9o3N9J52k04J24J40l15J03J47k18J16j00J93
$$ -43 -300 -167 77 -149 -202 -190 -126 -64 204 125 62 121 273 69 193 333 18 121 268 50 166 66 259
3815B59m00L29Qj23L0M1l00M11q0o3p3JL13j71k1K7m9J50k52j81N29l30L10k95
$$ 259 -141 188 196 73 103 144 -156 255 175 112 39 40 353 182 161 188 139 289 37 -144 385 55 365 70
3839G0j18jJ31q7n9J03Q5j13n8L09n46L24m8qpk0j63J83j55j29J58J14Q6Ll5j49
$$ 70 -48 -49 82 -5 -64 39 124 11 -47 262 -284 40 -8 -16 -23 -43 -206 -23 -178 -307 -149 -35 51 54 19 -130
3865a30K73N5j45l06q0K67j00n6K55M4qq0j89K47l78K69j37pM74k22p2L9l91N0
$$ -130 143 198 53 -253 -333 -66 -166 -222 33 77 69 -11 -200 47 -331 -62 -199 -206 268 46 -26 13 -378 -328
3889c28K13K72Jo92L86K72J88n60MK68j16j87J61N5k92N47r7p7k24m9J97j30Q4
$$ -328 -115 157 158 -534 -148 124 312 -248 -244 24 -92 -279 -118 -63 -355 192 95 18 -206 -255 -58 -188 -104
3912a04j11j92O11m82Q1j04L09O1Q3l04K92j14l2j09K8L86l61J15L3j76K5L49
$$ -104 -215 -407 204 -278 -197 -301 8 69 152 -152 140 26 -6 -115 -87 299 -62 53 86 -90 -65 284
3934B84m20K69m01n4M44j13O7jk52K31J70p8j24n6J49J69k00Q8j17M0j60j62L60
$$ 284 -136 133 -268 -322 122 9 76 75 -177 54 224 146 22 -34 115 284 84 172 55 95 -65 -227 133
3957A33l51L64j1Q0k38p0L78j25j22J90o70L87p2P4M92l43j95N8j99L70k84L47
$$ 133 -218 146 135 215 -23 -93 285 160 38 228 -442 -55 -127 -53 439 96 -99 -41 -240 130 -154 193
3979A93Nj33K48o06K51j1l03L07J57j37J05j97K82P3j75K08m84O2K71j58k3J02
$$ 193 198 65 313 -293 -42 -53 -356 -49 108 -29 76 -121 161 234 59 267 -217 -155 116 -42 -65 37
4001C7k68J02j50L59q2j07Q1j06L55k15J29k71K2k35K57O0R3q5j00j2q7l9J61
$$ 37 -231 -129 -279 80 -2 -109 -28 -134 221 6 135 -136 -114 -349 -92 -32 61 -24 -124 -136 -223 -262 -101
4024a01j3p9K00l70J83K98j47K8J09o02K69N38n23J50P1j57L38l55K14K56m50
$$ -101 -114 -193 7 -363 -180 118 -29 -1 108 -494 -225 313 -210 -60 11 -146 192 -163 51 307 -143
4045a43L13Mj53J04p4kR9m3J69j46J88O2j16j83l91N28L9J17l17p6P9p2M47l00
$$ -143 170 174 21 125 51 49 148 105 274 128 316 378 262 79 -312 216 255 372 55 -21 58 -14 433 133
4069A33k43J71K57J08j74j03j38J63J17m8j37j26J03J98J77j83j34k46L12j48
$$ 133 -110 61 318 426 252 149 11 174 291 243 106 -20 83 281 458 275 141 -105 207 59
4089E9nJ77j16J13k27K63k40L56j46J0k49K93l06K49l14K78K81k41j3J52l70J87
$$ 59 54 231 115 228 1 264 24 380 234 244 -5 288 -18 231 -83 195 476 235 222 374 4 191
4111A91kJ68k65L44m52K83j98K03q7q3p9J87J1j03k72O98o84J20o1J07o2J07J25
$$ 191 189 357 92 436 -16 267 69 272 185 102 23 210 221 118 -154 544 -140 -20 -81 26 -36 71 196
4134A96j41j14j38K99j62O3j25r1K47j36jK58k77M0j01O7J33k23K41l6M21m00
$$ 196 55 -59 -197 102 -60 3 -122 -213 34 -102 -103 155 -122 -82 -183 -116 17 -206 35 -1 420 20
4156B0k14M28l48j13L4N02m04k5K8O20m22j7K87j62k4k17J87J34N8l6k26K5N0
$$ 20 -194 234 -114 -227 -193 309 -95 -120 -92 528 106 89 376 214 190 -27 160 294 352 316 90 115 165
4179A65p2J6rk44RL93L9m79J35M39l58J8J17L6r2j34p0K51k72P4OK32m5k34J06
$$ 165 93 109 100 -144 -135 258 297 -182 -47 392 34 52 169 205 113 -21 -91 160 -112 -38 -32 200 155 -79 27
4204B7J95j33M7Q6j81j76L27j44k0j1p5Q0O5j40m4r6M85k32k3K98m31L44m16P
$$ 27 222 89 136 222 41 -135 192 48 28 17 -58 22 87 -53 -97 -193 292 60 37 335 -96 248 -168 -161
4228a61L05q9j88J48j09L45j30k34k11O28j70r9p2L9K61m97K75j03K79k84l0j39
$$ -161 144 55 -133 15 -94 251 121 -113 -324 304 134 35 -37 2 263 -234 41 -62 217 -67 -97 -236
4250b36J26j91P0L54j14r8k9J25P5j54l65P30k53k23K07k29J42k11L07j48M17
$$ -236 -110 -301 -231 123 9 -89 -118 7 82 -72 -437 293 40 -183 24 -205 -63 -274 33 -115 302
4271C02m8o21M49M6r9j31L70j26l69K44Q2k38K53l01KK73k04R6L5J13l47J90J41
$$ 302 254 -367 82 128 29 -102 268 142 -227 17 99 -139 114 -187 -185 88 -116 -20 15 128 -219 -29 112
4294A12l06j12K84K17L7k29J59l18L90l87l8K0M7K26k73L95m19J57k73N74m25
$$ 112 -194 -306 -22 195 232 3 162 -156 234 -153 -191 -171 -124 102 -171 224 -195 -38 -311 263 -162
4315a62j04M28j85R3K50k97nn3J41k75N9m3M4m7K31j07l0N8J00J57k67K52k05
$$ -162 -266 162 -23 70 320 23 18 -35 106 -169 -110 -153 -109 -156 75 -32 -62 -4 96 253 -14 238 33
4338C3J02k03J39R2k29M8j6m0L47k33n3K7K59K6k08j50m6L16k54k3J02J39k05
$$ 33 135 -68 71 163 -66 -18 -34 -74 273 40 -13 14 273 299 91 -59 -105 211 -43 -66 36 175 -30
4361c0k3J50J26j34j75L12k08j95O2l90N85pk93K32nk58K55pJ18j69J3R3J14l02
$$ -30 -53 97 223 89 -86 226 18 -177 -115 -505 80 73 -220 12 7 -251 4 -3 115 -54 -41 52 166 -136
4385a36K32j15q5J23p9J12j65j9k32K05p2J75j32J28J1P3l00J36K6p8m00O50j57
$$ -136 96 -19 -104 19 -60 52 -113 -132 -364 -159 -231 -56 -188 -60 -49 24 -276 -140 -114 -192 -592 58 -99
4408i9O1k33K65j12L5J34k35J75k11K84k93J02j97K60j56L27k02J48k32J01J98
$$ -99 -38 -271 -6 -118 -83 51 -184 -9 -220 64 -229 -127 -324 -64 -220 107 -95 53 -179 -78 120
4429A20j7j73j4M8L48l63K52P2m1k79q4J98j07P9j88K60k64L20j00N3k21K34r9
$$ 120 103 -70 -84 -36 312 -51 201 273 232 -47 -131 67 -40 39 -149 111 -153 167 67 120 -101 133 34
4452C4j63J67J56j51PkMK43Rk71jJ10j63kr7J18J80r4j22l7k13K1N23p8j63j82
$$ 34 -129 38 194 43 50 48 52 295 304 33 32 142 -21 -23 -120 -2 178 84 -38 -75 -288 -267 256 178 15 -167
4478a67k1l2K60rn1k9p6J9J1l42M45o2k03K52J45l75K42m7j8j26J46J4K4K47q8
$$ -167 -188 -220 40 31 -20 -49 -125 -106 -95 -437 8 -54 -257 -5 140 -235 7 -40 -58 -184 -38 -24 0 247 159
4503A59r1k91K72M8l09K78j88L1K01k33j1L44k81P6l59K38M9N7M3k5k6l71N98
$$ 159 68 -223 49 97 -212 66 -122 -91 110 -123 -134 210 -71 5 -354 -116 -67 -10 33 8 -18 -389 209
4526B09m22P2l66N19NM4k52M10j88p0q9j7L88j11j43K1Q6m82M85R0O5M0o6k40
$$ 209 -213 -141 -507 12 17 61 -191 219 31 -39 -128 -145 243 132 -11 10 96 -386 99 189 254 294 228 -12
4550a2J66J5j21j14j10K48j2j04K6q8K62K7N7k18q4L29k24P0k52K78%J27j10J01
$$ -12 154 169 48 -66 -176 72 60 -44 -18 -106 156 183 240 22 -62 267 43 113 -139 139 139 266 156 257
4574B57l49L48l4k48J45K76k48L8j3j24N4J05n3n7n3k45N46j01l93L29L1J47k52
$$ 257 -92 256 222 -26 119 395 147 185 172 48 102 207 154 97 44 -201 345 244 -149 180 211 358 106
4597A06k4K47j38q2o9k24O7K64j23k6J59J07l49nJ70J09l09M04m8k45k9L8k03
$$ 106 82 329 191 109 40 -184 -117 147 24 -2 157 264 -85 -90 80 189 -120 284 236 -9 -38 0 -203
4620b03K50J12k47M1j66N71k53J50m45j47L67K82j96j06o2j72K24j42K06j82J74
$$ -203 47 159 -88 -47 -213 358 105 255 -190 -337 30 312 116 10 -52 -224 0 -142 64 -118 56
4641E6k19J46l01M66l53K75m8n7L3j27Q3J71J5m19O9K2k3J95j48L28k93j70K90
$$ 56 -163 -17 -318 148 -205 70 22 -35 -2 -129 -46 125 140 -279 -210 -188 -211 -16 -164 164 -129 -299 -9
4664iq1j64J73J1J98l78O1J25Q3j9j60j52K93Rl84J56K68J35l46J13Q2N9p5Q8
$$ -9 -90 -254 -81 -70 128 -250 -189 -64 19 0 -160 -312 -19 -10 -394 -238 30 165 -181 -68 14 73 -2 86
4688H6K27k94k66j7J96J95Ok51j8L51k69J3N3p8j39L97j46J88P4l96K5L61j95
$$ 86 313 19 -247 -264 -68 127 133 -118 -136 215 -54 -41 12 -66 -205 192 46 234 308 -88 -63 298 103
4711A03p5Q0J45l44j1LL08k79J11n6P4q3J34j14J93J63l77M03l50J69k98j2J43
$$ 103 28 108 253 -91 -102 -99 209 -70 41 -15 59 -24 110 -4 189 352 -25 378 28 197 -101 -113 30
4734C0j02J92O5k09J56m4j3P9k77L2K2O8K6k23J64N7j53L3O3P2k64K38o5K74m05
$$ 30 -72 120 185 -24 132 88 75 154 -123 -91 -69 -1 25 -198 -34 23 -130 -97 -34 38 -226 12 -53 221 -184
4759a84O2k22J22J66n5L0N3k65M11l70J38j7L46J5k00R4l01J65l21q4L38j77J61
$$ -184 -122 -344 -222 -56 -111 -81 -28 -293 118 -252 -114 -131 215 230 30 124 -177 -12 -333 -417 -79 -256 -95
4782i5K7J7J98k92l54M03J38K25j98j93J22Q0O6k01kJ91r0j79R7Q7N5l11K75J83
$$ -95 -68 -51 147 -145 -499 -96 42 267 69 -124 -2 78 144 -57 -59 132 42 -137 -40 47 102 -209 66 249
4806B49j59j4j22j75J76k06J87M0j12r2K88N8j38j6J24k48N3N5k8N5L59n39J80
$$ 249 90 76 -46 -221 -45 -251 -64 -24 -136 -228 60 118 -20 -36 88 -160 -107 -52 -80 -25 334 -205 -25
4829b5K08l20N5L10k44J2L48k62l22M38m91M90k01j53K43k79L76r1O4j26k6J70
$$ -25 183 -137 -82 228 -16 -4 344 82 -240 198 -293 197 -4 -157 86 -193 183 92 156 30 4 174
4851A74Q6l30K15N2K60p67J64M47k38j37K83k20r1P2O4q0K5J79O3k13k33o3L44
$$ 174 260 -70 145 197 457 -310 -146 301 63 -74 209 -11 -102 -30 34 -46 -21 158 221 8 -225 -288 56
4874E6j39n0J24k22J98j24K55q7J92l14j00N8j21K37j24L08k55j8PK76k16j28
$$ 56 -83 -133 -9 -231 -33 -157 98 11 203 -111 -211 -153 -274 -37 -161 147 -108 -126 -119 157 -59 -187
4896a87Q7j04l9J78K34l55J09J48k51J01R4l00M33l32r1J5k8L46m62L11J89j58
$$ -187 -100 -204 -243 -65 169 -186 -77 71 -180 -79 15 -285 148 -184 -275 -260 -288 58 -404 -93 96 -62
4918f2J27j61k05L23Jrp7k99K66K74l05J03n3j07O3M00k48O3r3k53P0K61j05L81
$$ -62 65 -96 -301 22 23 14 -63 -362 -96 178 -127 -24 -77 -184 -121 279 31 94 1 -252 -182 79 -26 355
4942C55l14q5k36K80K56j67j9j91O1QJ99j41j1Q9j75K93l3j96K50k77J87m16M99
$$ 355 41 -44 -280 0 256 89 70 -121 -60 -52 147 6 -5 84 -91 202 169 -27 223 -54 133 -283 216
4965B16k91JN2K21j77R8j62P0L3j08q9%J97k1j87J51k6o6J17Jj63KL24j00o2q5
$$ 216 -75 -74 -22 199 22 120 -42 28 61 -47 -136 -136 61 40 -147 4 -22 -88 29 30 -133 -131 193 93 31 -54
4991e4J50j88Pj29K12J5lj09R5J87k72J34K1k52L22k87L44j48R2r1k09L83p6l0
$$ -54 96 -92 -85 -214 -2 13 10 -99 -4 183 -89 45 66 -186 136 -151 193 45 137 46 -163 220 144 114
5015A14j66L0k3K05j47j55L64k72q7j37J39j06J4J98k11K53J11n70L94k19M18
$$ 114 -52 -22 -45 160 13 -142 222 -50 -137 -274 -135 -241 -227 -29 -240 13 124 -446 -52 -271 147
5036A47l33J73J22K7J61j83j57p6J43j56M9J68k99J9J92R3K27k47r7J73k45J87
$$ 147 -186 -13 109 136 297 114 -43 -119 24 -132 -83 85 -214 -195 -3 90 317 70 -27 146 -99 88
5058H8J3j87K37o1r7j53K01j31L20j13l02K22L35l87j8j38o6J13K58j06j21M01
$$ 88 101 -86 151 90 -7 -160 41 -90 230 117 -185 37 372 -15 -33 -171 -237 -124 134 28 -93 308
5080C08l22j42K97J5k89J62j87q9J31J68p9N6j09J84o0kl0j14M01k64L0j28Q6
$$ 308 -14 -156 141 156 -133 29 -158 -247 -116 52 -27 29 -80 104 44 42 12 -102 299 35 65 -63 23
5103B3J82j35j51K73j81L6o2k4K47k2j4j84O8J35k04p0M5M72o37N8L49j39J19
$$ 23 205 70 -81 192 11 47 -15 -39 208 186 172 -12 56 191 -13 -83 -38 434 -203 -145 204 65 184
5126A84o64M68Q6j1K0q8m3j59o3K91j14Oo7J62j34j08J66j04J52j48K22j20k6
$$ 184 -480 -12 74 63 83 -5 -48 -207 -270 21 -93 -87 -154 8 -126 -234 -68 -172 -20 -168 54 -66 -92
5149i2M8K10k49K35J00j01k51L76m60O7L68j25J46j96J08k43M1p0kJ01j3l8J42
$$ -92 -44 166 -83 152 252 151 -100 276 -184 -117 251 126 272 76 184 -59 -18 -88 -90 11 -2 -40 102
5172A02l08J4J30j34K3RJ62j3R4P6J48k15q4j00J22p8L88o24K27K78l87J3p3L27
$$ 102 -206 -192 -62 -196 -173 -164 -2 -15 79 155 303 88 4 -96 26 -52 336 -288 -61 217 -170 -157 -230 97
5196I7P3J83l00J3j74L3R5k36J17J83Lr2J35l48J13K48j12M9j01L22j29K23l15
$$ 97 170 353 53 66 -108 -75 20 -216 -99 84 87 -5 130 -218 -105 143 31 80 -21 301 172 395 80
5219H0o1QL5l3K18k78R8k36J41j21R3M13l22k55K88j06L54k73k87K76m9L12k05
$$ 80 19 27 62 29 247 -31 67 -169 -28 -149 -56 357 35 -220 68 -38 316 43 -244 32 -17 295 90
5242I0K64m43n8J86j27j59l9M61k88J51p6n3K45l21K66j13J3k57J53L44m15j9
$$ 90 354 -89 -147 39 -88 -247 -286 175 -113 38 -38 -91 154 -167 99 -14 -1 -258 -105 239 -176 -195
5264a95J4J70kL3J94k42j33R2J72j31M01l49N4J6j68J48K2j2r0R6j26j13l4k46
$$ -195 -181 -11 -13 20 214 -28 -161 -69 103 -28 373 24 78 94 -74 74 96 84 -6 90 -36 -149 -183 -429
5288d29O01l58L19j54M7J10j67K8j57j03K30J85J1r6j98N3J28j19RK96k45k4J0
$$ -429 172 -186 133 -21 26 136 -31 -3 -160 -263 -33 152 163 67 -131 -78 50 -69 -60 236 -9 -33 -23
5311b3r3J43n2K1J5p4J47j04K36j20j36k3N9K2j61J37l24J00J96k97L26J87n10
$$ -23 -116 27 -25 -4 11 -63 84 -20 216 96 -40 -63 -4 18 -143 -6 -330 -230 -34 -331 -5 182 -328
5334c28N55n06L68k91L97j78k89L95n6J42m74K96J99q4r2M6k33L15L27l68p3j41
$$ -328 227 -279 89 -202 195 17 -272 123 67 209 -265 31 230 146 54 100 -133 182 509 141 68 -73
5356g3P5K51k49j87L95l47k0J76j52k7J82P6l26K28r8J21J60j66q3M12l66J7j58
$$ -73 2 253 4 -183 212 -135 -155 21 -131 -158 24 100 -226 2 -96 25 185 19 -64 348 -18 -1 -159
5379a59j4RK21j62J95j19M5n7j32K07q5J12O5m41J95k2K14J8o5j01K50j95k67
$$ -159 -173 -164 57 -105 90 -29 16 -41 -173 34 -51 61 126 -315 -120 -142 72 90 25 -76 174 -21 -288
5402b88K74J70k2j73J22j19j7J1n6K24k73q7K10j90L83l09K05p2j60L72m94J39
$$ -288 -14 156 134 -39 83 -36 -53 -42 -98 126 -147 -234 -24 -214 169 -140 65 -7 -167 205 -289 -150
5424a50q7O8o2K90j06J43k82P2K16j73J08l23K78L6j6j06j37j6Q8j17M65k40J85
$$ -150 -237 -169 -231 59 -47 96 -186 -114 102 -71 37 -286 -8 28 12 -94 -231 -247 -159 -276 189 -51 134
5447A34l8M8J15m15o2K78m7L28l26J00pN9j41j06j61J43O9k36K89m0R6m3K77j70
$$ 134 96 144 259 -156 -218 60 13 341 15 115 108 167 26 -80 -241 -98 -29 -265 24 -16 80 37 314 144
5471A44l27K66k19N96k03m86K41N2j03L2nk50K7K03p5j95N10k87Q0J38k93K99
$$ 144 -183 83 -136 460 257 -229 12 64 -39 -7 -12 -262 -235 -32 -107 -302 208 -79 1 139 -154 145
5493A45r4R3J48k69j58K09J3r0K56k69R2j46m37P80j3l67N0P7M2m7R1r0o0L7R2
$$ 145 51 144 292 23 -135 74 87 -3 253 -16 76 -70 -507 273 260 -107 -57 20 62 15 106 16 -44 -7 85
5518H5k27K90j05J14j40j66K91l38L24k36O4j00K37M6k38M6o8J38k40J95J45j55
$$ 85 -142 148 43 157 17 -149 142 -196 128 -108 -44 -144 93 139 -99 -53 -121 17 -223 -28 117 -38
5540c8J84l21J51J12l12L50j8q6j12J15O5o22M35j7k6P1k06R8K78k84L32j54J80
$$ -38 146 -175 -24 88 -224 126 108 22 -90 25 90 -532 -97 -114 -140 -69 -275 -177 101 -183 149 -5 175
5563A75n4k0k67R2R0K21j13j98j4J8K29m37J75J13N2j41n7K95k63r8K79J20j85
$$ 175 121 101 -166 -74 16 237 124 -74 -88 -70 159 -278 -103 10 62 -79 -136 159 -104 -202 77 197 12
5586A2K2J17j72L0J55k98K77n01L88L42l32k30M6N55k00j20o1j83M9J91p6J14
$$ 12 34 151 -21 9 164 -134 143 -358 30 372 40 -190 -144 411 211 91 30 -153 -104 87 11 125
5608A25l17l8L64j49J92j68p5l6L39j03J6KJ79m91K6K29j38J04J16l5j3o0k87
$$ 125 -192 -230 134 -15 177 9 -66 -102 237 134 150 152 331 -160 -134 95 -43 61 177 142 129 69 -218
5631b18L14j70J83P1j94p7k0k00N0J07O5n5L53m69O7Q9L48j60l03K35K14k13O9
$$ -218 96 -74 109 180 -14 -91 -111 -311 -261 -154 -89 -144 209 -260 -193 -104 244 84 -219 16 230 17 86
5654H6J56m88L93n52M14j69K59J22j91k58M61k40J17pk94L21k77K35j32J99q0
$$ 86 242 -246 147 -405 9 -160 99 221 30 -228 233 -7 110 103 -191 130 -147 88 -44 155 75
5675G5n30N76m5r4K22k96j67L37p9j98M55k79m3N0m21J52J98J1K18k68q0K32o
$$ 75 -455 121 76 -18 204 -92 -259 78 -1 -199 256 -23 -66 -16 -437 -285 -87 -76 142 -126 -206 26 20
5698B0l2k82M77m39L55l19J57j12m4J13o4R0K56m39K37j12L23k34Q1J70m00K50
$$ 20 -12 -294 183 -256 99 -220 -63 -175 -219 -106 -170 -80 176 -263 -26 -138 185 -49 32 202 -198 52
5720E2K1j60P6j25J66J23k87k5J31N0r9N70l06k24O5k26N61n89J96p9O7k42M27
$$ 52 73 -87 -11 -136 30 153 -134 -159 -28 22 -77 493 187 -37 28 -198 363 -226 -30 -109 -42 -284 143
5743A43n6k29%O2J91p7K78k71j82J33J91k78K48O7l33K73J25l05j04O85n40J59
$$ 143 87 -142 -142 -80 111 34 312 41 -141 -8 183 -95 153 220 -113 160 285 -20 -124 561 21 180
5765A80k22j14L71l4j59J63l80J21j9K21R8j53L2j77R5j75N8N4K11k41j16K26
$$ 180 -42 -156 215 181 22 185 -195 -74 -93 128 226 73 105 -72 23 -152 -94 -40 171 -70 -186 40
5787D0q1J70p4m7k93M75k03j5J96l32J85k58L61L40l39j68K48k41j63j35J92K78
$$ 40 -41 129 55 8 -285 190 -13 -28 168 -164 21 -237 124 464 125 -43 205 -36 -199 -334 -142 136
5809A36k31K13j14Q7J4q3k7O3j55K4mj3L45k91J06M7j36J02J70j51k62K47L2k25
$$ 136 -95 118 4 91 105 22 -5 58 -97 -73 -77 -90 255 -36 70 117 -19 83 253 102 -160 87 119 -106
5833a06K09l8j82L75q3J5L16m76L6M1k71L8K22P3n5m41K51j34K17n1k64K13j14
$$ -106 103 65 -117 258 175 190 506 30 66 107 -164 -126 96 169 114 -327 -76 -210 7 -44 -308 -95 -209
5856b09M1J35k8L39k94J37k5k01K13%k40J83k66q3N94k17p6J30Oo26O60k86J36
$$ -209 -168 -33 -61 278 -16 121 96 -105 108 108 -132 51 -215 -298 296 79 3 133 139 -487 173 -113 23
5879B3r2K18k10J21K0r0J7J10j65j64N04m10K59l39J30K37K18m75J39K22l11o4
$$ 23 -69 149 -61 60 80 -10 7 117 -48 -212 292 -118 141 -198 -68 169 387 -88 51 273 -38 -102
$$ [...]
8191i5
##END NTUPLES=NMR FID
##END=
