##TITLE=1H_K-380/2
 DMSO, 8 sc, 
 26.12.2019
##JCAMPDX= 6.0         $$ Bruker NMR JCAMP-DX V2.0
##DATA TYPE= NMR FID
##DATA CLASS= NTUPLES
##ORIGIN= UXNMR, Bruker Analytische Messtechnik GmbH
##OWNER= root
$$ XWIN-NMR		Version 3.5
$$ Thu Dec 26 14:43:24 2019 Russian Standard Time (UT+4h)  she@DPX200
##.OBSERVE FREQUENCY= 200.1315
##.OBSERVE NUCLEUS= ^1H
##.DELAY= (6, 6)
##.ACQUISITION MODE= SIMULTANEOUS
##.ACQUISITION SCHEME= undefined
##.AVERAGES= 8
##.DIGITISER RES= 18
##SPECTROMETER/DATA SYSTEM= spect
##.PULSE SEQUENCE= zg30
##.SOLVENT NAME= CDCl3
##.SHIFT REFERENCE= (INTERNAL, CDCl3, 0, 15.7039)
##AUDIT TRAIL= $$ (NUMBER, WHEN, WHO, WHERE, WHAT)
$$ ##TITLE= Audit trail, XWIN-NMR		Version 3.5
$$ ##JCAMPDX= 5.01
$$ ##ORIGIN= Bruker BioSpin GmbH
$$ ##OWNER= she
$$ F:/spectra/data/she/nmr/H-F/1/audita.txt
$$ ##AUDIT TRAIL=  $$ (NUMBER, WHEN, WHO, WHERE, WHAT)
(   1,<2019-12-26 14:42:08.00 +0400>,<she>,<DPX200>,
      <created by zg, POWCHK disabled, PULCHK disabled
       configuration hash MD5:
       00 E9 B6 7A A2 85 ED C7 34 08 36 98 17 FE 4E 26
       data hash MD5: 16K
       08 2F 25 E7 E1 43 C7 EC 0A 0F 9F 4E F8 4C E7 DD>)
$$ ##END=
$$ 
$$ hash MD5
$$ 0B 0E AB 35 4B 24 09 0A 3A C0 D1 8C 69 9D E2 E1
##$RELAX= 
##$RELAX= 
##$RELAX= 
##$RELAX= 
##$RELAX= 
##$RELAX= 
$$ Bruker specific parameters
$$ --------------------------
##$DU= <F:/spectra>
##$EXPNO= 1
##$NAME= <H-F>
##$PROCNO= 1
##$TYPE= <nmr>
##$USER= <she>
##$AMP= (0..31)
100 100 100 100 100 100 100 100 100 100 100 100 100 100 100 100 100 100 
100 100 100 100 100 100 100 100 100 100 100 100 100 100 
##$AQSEQ= 0
##$AQ_mod= 1
##$AUNM= <au_zg>
##$AUTOPOS= <>
##$BF1= 200.13
##$BF2= 200.13
##$BF3= 200.13
##$BF4= 200.13
##$BF5= 200.13
##$BF6= 200.13
##$BF7= 200.13
##$BF8= 200.13
##$BYTORDA= 1
##$CFDGTYP= 0
##$CFRGTYP= 5
##$CHEMSTR= <none>
##$CNST= (0..31)
1 1 145 1 1 1 1 1 1 1 1 1 1 1 1 1 1 1 1 1 1 1 1 1 1 1 1 1 1 1 1 1 
##$CPDPRG= <>
##$CPDPRG1= <>
##$CPDPRG2= <>
##$CPDPRG3= <>
##$CPDPRG4= <mlev>
##$CPDPRG5= <mlev>
##$CPDPRG6= <mlev>
##$CPDPRG7= <mlev>
##$CPDPRG8= <mlev>
##$CPDPRGB= <>
##$CPDPRGT= <>
##$D= (0..31)
0 1.2 0 0 0 0 0 0 0 0.06 0 0.03 0 0 0 0 0.0002 0 0 0 0 0 0 0 0 0 0 0 0 
0 0 0 
##$DATE= 1577356927
##$DBL= (0..7)
120 120 120 120 120 120 120 120 
##$DBP= (0..7)
150 150 150 150 150 150 150 150 
##$DBP07= 0
##$DBPNAM0= <>
##$DBPNAM1= <>
##$DBPNAM2= <>
##$DBPNAM3= <>
##$DBPNAM4= <>
##$DBPNAM5= <>
##$DBPNAM6= <>
##$DBPNAM7= <>
##$DBPOAL= (0..7)
0.5 0.5 0.5 0.5 0.5 0.5 0.5 0.5 
##$DBPOFFS= (0..7)
0 0 0 0 0 0 0 0 
##$DE= 6
##$DECBNUC= <off>
##$DECIM= 24
##$DECNUC= <off>
##$DECSTAT= 4
##$DIGMOD= 1
##$DIGTYP= 9
##$DL= (0..7)
0 120 120 120 120 120 120 120 
##$DP= (0..7)
150 150 150 150 150 150 150 150 
##$DP07= 0
##$DPNAME0= <>
##$DPNAME1= <>
##$DPNAME2= <>
##$DPNAME3= <>
##$DPNAME4= <>
##$DPNAME5= <>
##$DPNAME6= <>
##$DPNAME7= <>
##$DPOAL= (0..7)
0.5 0.5 0.5 0.5 0.5 0.5 0.5 0.5 
##$DPOFFS= (0..7)
0 0 0 0 0 0 0 0 
##$DQDMODE= 0
##$DR= 18
##$DS= 0
##$DSLIST= <SSSSSSSSSSSSSSS>
$$ [...]
##$SUBNAM2= <"">
##$SUBNAM3= <"">
##$SUBNAM4= <"">
##$SUBNAM5= <"">
##$SUBNAM6= <"">
##$SUBNAM7= <"">
##$SUBNAM8= <"">
##$SUBNAM9= <"">
##$SW= 24.9337058887773
##$SWIBOX= (0..15)
0 0 2 0 0 0 0 0 0 0 0 0 0 0 0 0 
##$SW_h= 4990.01996007984
##$TD= 16384
##$TD0= 1
##$TE= 0
##$TE2= 300
##$TE3= 300
##$TEG= 300
##$TL= (0..7)
0 120 120 120 120 120 120 120 
##$TP= (0..7)
150 150 150 150 150 150 150 150 
##$TP07= 0
##$TPNAME0= <>
##$TPNAME1= <>
##$TPNAME2= <>
##$TPNAME3= <>
##$TPNAME4= <>
##$TPNAME5= <>
##$TPNAME6= <>
##$TPNAME7= <>
##$TPOAL= (0..7)
0.5 0.5 0.5 0.5 0.5 0.5 0.5 0.5 
##$TPOFFS= (0..7)
0 0 0 0 0 0 0 0 
##$TUNHIN= 0
##$TUNHOUT= 0
##$TUNXOUT= 0
##$USERA1= <user>
##$USERA2= <user>
##$USERA3= <user>
##$USERA4= <user>
##$USERA5= <user>
##$V9= 5
##$VALIST= <valist>
##$VCLIST= <CCCCCCCCCCCCCCC>
##$VD= 0
##$VDLIST= <DDDDDDDDDDDDDDD>
##$VPLIST= <PPPPPPPPPPPPPPP>
##$VTLIST= <TTTTTTTTTTTTTTT>
##$WBST= 1024
##$WBSW= 4
##$XGAIN= (0..3)
0 0 0 0 
##$XL= 0
##$YL= 0
##$YMAX_a= 246652
##$YMIN_a= -140938
##$ZGOPTNS= <>
##$ZL1= 120
##$ZL2= 120
##$ZL3= 120
##$ZL4= 120
##$ABSF1= 10
##$ABSF2= 0
##$ABSG= 5
##$ABSL= 3
##$ALPHA= 0
##$AQORDER= 0
##$ASSFAC= 0
##$ASSFACI= 0
##$ASSFACX= 0
##$ASSWID= 0
##$AUNMP= <proc_1d>
##$AZFE= 0.1
##$AZFW= 0.1
##$BCFW= 1
##$BC_mod= 2
##$BYTORDP= 1
##$COROFFS= 0
##$CY= 11.3945322036743
##$DATMOD= 1
##$DC= 2
##$DFILT= <>
##$DTYPP= 0
##$F1P= 16.9975609425685
##$F2P= -3.02152046262296
##$FCOR= 0.5
##$FTSIZE= 0
##$FT_mod= 4
##$GAMMA= 1
##$GB= 0.15
##$INTBC= 1
##$INTSCL= 1
##$ISEN= 128
##$LB= 0.24
##$LEV0= 0
##$LPBIN= 0
##$MAXI= 10000
##$MC2= 0
##$MEAN= 0
##$ME_mod= 0
##$MI= 1.114404
##$NCOEF= 0
##$NC_proc= 0
##$NLEV= 6
##$NOISF1= 3.799351
##$NOISF2= 2.8
##$NSP= 1
##$NTH_PI= 0
##$NZP= 0
##$OFFSET= 15.70392
##$PC= 1
##$PHC0= -10157.33
##$PHC1= 27.8008
##$PH_mod= 1
##$PKNL= yes
##$PPARMOD= 0
##$PSCAL= 0
##$PSIGN= 0
##$REVERSE= no
##$SF= 200.130013532006
##$SI= 16384
##$SIGF1= 3
##$SIGF2= 2
##$SINO= 400
##$SIOLD= 16384
##$SREGLST= <1H.CDCl3>
##$SSB= 0
##$STSI= 0
##$STSR= 0
##$SW_p= 3612.71676300578
##$SYMM= 0
##$S_DEV= 0
##$TDeff= 0
##$TDoff= 0
##$TI= <>
##$TILT= no
##$TM1= 0
##$TM2= 0
##$TOPLEV= 0
##$USERP1= <user>
##$USERP2= <user>
##$USERP3= <user>
##$USERP4= <user>
##$USERP5= <user>
##$WDW= 1
##$XDIM= 8192
##$YMAX_p= 0
##$YMIN_p= 0
$$ End of Bruker specific parameters
$$ ---------------------------------
##NTUPLES= NMR FID
##VAR_NAME=  TIME,          FID/REAL,        FID/IMAG
##SYMBOL=    X,             R,               I
##VAR_TYPE=  INDEPENDENT,   DEPENDENT,       DEPENDENT
##VAR_FORM=  AFFN,          ASDF,            ASDF
##VAR_DIM=   8192,          8192,            8192
##UNITS=     SECONDS,       ARBITRARY UNITS, ARBITRARY UNITS
##FACTOR=    0.0002004,     1,               1
##FIRST=     0,             0,               0
##LAST=      1.6414764,     0,               0
##MIN=       0,             -140938,         0
##MAX=       1.6414764,     246652,          0
$$ Real data points
##PAGE= N=1
##DATA TABLE= (X++(R..R)), XYDATA
$$ [...]
1960D81r0k64l53j64P5j61m53K26l8K91n9J50M08L6L45l1J85L0K09l94p1k29j36
1983gJ48n49j67l13J41J63M5O0J5N78k69L87o7j5O6K6O7j80N8l83l68j45k4J91
2007e42L2J7J67r0J40N87k51L83P1L83j70J21L1n0J16n33j83J55j69n06J58M14
2029B81k42j11K18K49R5n2J62L06j0o4J83J78k81n16N19k32k09N9k25l31J83K7
2051A87m2k59M43k05J76l13J5M38j45m08K53R2j64J82k57k63j36K91j87M2j53
2072d13J88J23N1m6j40K81Or5J77K25o5J00l85K27k4o35K36LK17o02k61K44J08
2095d80m29N03m0J57L46p9j1K2L82j52J96m5k56K4o0k47k04l7J84j87j38k29K17
2118e63J02J72J6O8j67N68l0l4L35m91p0J52k87r9j71j01K67m79K41J33L06R7
$$ plain form
1960 481 391 127 -226 -390 -315 -476 -929 -703 -741 -450 -509 -359 49 85 430 399 584 614 823 429 358 129 -7
1983 -7 141 -408 -575 -888 -747 -584 -539 -479 -464 114 -155 232 165 150 216 242 309 129 187 -196 -564 -709 -733 -542
2007 -542 -510 -493 -326 -416 -276 311 60 443 514 897 727 848 879 829 945 412 229 384 215 -291 -133 281
2029 281 39 -72 146 395 490 438 600 906 896 832 1015 1193 912 396 915 683 474 533 308 -23 160 187
2051 187 145 -114 329 124 300 -13 2 440 295 -113 140 232 68 250 -7 -270 -406 -115 -302 -260 -413
2072 -413 -225 -102 -51 -97 -237 44 50 -45 132 357 292 392 7 234 210 -425 -189 -186 31 -571 -832 -588 -480
2095 -480 -909 -406 -446 -289 57 -22 -33 -11 371 219 415 370 114 138 78 -169 -373 -410 -226 -413 -551 -780 -563
2118 -563 -461 -289 -273 -205 -372 196 166 132 467 -24 -94 58 -229 -328 -499 -600 -333 -812 -571 -438 -132 -35
2140c5j8L03j68J62K05R2l29j48J87k2r2l78j65J95j23k00p6J33r7L48L76j60
2162a0K06K93L44j62J46k3N7k94q1l89k65K49k68k9k07L16j48J66k4k1K81P0M96
2185G03p2o9l11M15Q7k56l43m1l05J40j73j25j02L64J23k81J94p0L00Q2N26l55
2207D31m81L28M7K3o0l60q2p2q5r7q7RK87q7J30O8J89K15m0P2O3j99J26K40r3
2232D85k65Oj67k87l29L40j73L75j96R5j68J86J57L74k71m10L67M99k84j18o5
2253A51m05L86lj24j79J3P0Nk48j1K40K87j85o8J61KK87l98q0k11K70J93l05r7
2277b49M36l37j47K67l01mP3m2N61m72K99qM24j53n9j16r4M18j30k20j90j09Q1
2300g2p0n5j14j35L97O0k43K00K11M8n0%J47j1M75o55J00k59k46N19j41k64k52
$$ plain form
2140 -35 -53 250 82 244 449 541 212 64 251 229 137 -241 -406 -211 -334 -534 -610 -477 -574 -226 150 -10
2162 -10 196 489 833 671 817 794 851 557 476 87 -178 71 -197 -226 -433 -117 -265 -99 -123 -144 137 207 703
2185 703 631 562 251 666 753 497 154 113 -192 -52 -225 -350 -452 -88 35 -246 -52 -122 178 260 786 431
2207 431 -50 278 325 348 288 -72 -154 -226 -311 -408 -495 -486 -199 -286 -156 -88 101 316 276 348 411 212 338 578 485
2232 485 220 226 59 -228 -557 -217 -390 -15 -211 -116 -284 -98 59 433 162 -248 119 618 334 216 151
2253 151 -254 132 129 5 -174 -161 -91 -86 -334 -345 -105 182 -3 -71 90 92 379 -19 -99 -310 -40 153 -152 -249
2277 -249 187 -150 -297 -30 -331 -335 -262 -304 257 -215 84 76 500 347 288 172 78 496 366 146 -44 -153 -72
2300 -72 -142 -197 -311 -446 -49 11 -232 -32 179 227 177 177 324 313 788 133 233 -26 -272 247 106 -158 -410
2323d10Q9J12L6K05n71N95Q9p6r7p0M28j73o9L5j34j40K20K4m03P2j15l5L11l8
2347a15K32l65K88N09j05l78K84L24J5j78l43R5J64j69m01j1k02J13O0Q9j48q0
2369c22Q0L54J99m78M25K63l2j3k73N2K13j92J46p56J07J22j95j68p3j51K18L63
2391a11J37P0N5l97P11j23m54R6Q5J54m9l13k49K58K22j97l08L05m9M45P3m40
2413g9j03N56k7Q2n23l0L33M67m13j29j54J81P4k62j53l82N29r7K57k51Q3M21
2435C80j24L74n98J66j7J46J98n46K4MQ7k39j87r4L01J53l40j90J35L43L45l99
2457g8J63K05k09M30j80l24j38j56Q8J58l28j4J77P6Q5l82j01M79L26j27j50Q0
2479H0R6J96o9k52o2k80M57j0p01J8K60J93r3r1m89P27p6K00k19m7K37N11l10
$$ plain form
2323 -410 -321 -209 -173 32 -539 56 145 69 -28 -98 330 157 88 123 -11 -151 69 93 -310 -238 -353 -388 -77 -115
2347 -115 117 -248 40 549 444 66 350 674 689 511 168 263 427 258 -143 -154 -356 -243 -183 -94 -242 -322
2369 -322 -242 112 311 -167 258 521 489 476 203 255 468 276 422 -334 -227 -105 -300 -468 -541 -692 -474 -111
2391 -111 26 96 151 -246 465 342 -112 -16 69 223 174 -139 -388 -130 92 -105 -413 -108 -157 288 361 -79
2413 -79 -182 374 347 429 -94 -124 209 676 263 134 -20 161 235 -27 -180 -562 -33 -130 127 -124 -41 380
2435 380 256 630 32 198 181 327 525 -21 3 7 94 -145 -332 -426 -125 28 -312 -502 -367 -24 321 -78
2457 -78 85 290 81 511 331 7 -131 -287 -199 -41 -369 -383 -206 -130 -45 -427 -528 -49 277 150 0 80
2479 80 176 372 303 51 -11 -291 166 156 -545 -527 -267 -74 -167 -258 -747 -20 -96 104 -115 -162 75 586 276
2502B76k99l1n5N32n74K8k50J47J22J53o09m32N56M44r9l67K22O8M57Pj62k02
2524f8L52q5J66l75k18K55j25m1j3l30l1O89k08k05JK15L18m0k65q0K02K39l7
2547C16l74k93M09P6N0o08K62P2N4p1N1q4L8R2M43j62j38j08O71k27j18P0k79
2570A42j46k3J22l69L09j62K60Ko21L84O32n0k42n2j24K40J38K2l42J81q0M6J07
2593C74o03R5Q17m72p6m56K23K12M40l88k58J87M85j80r2k40j53J62J49km27j49
2615c52K23n3k09L47l55L69O4j15k52J13J70L08p09L93J94K06l2m13l36n4R6M09
2637A2n58j33J31L02J83n0J5j49J43L89m37J61P4K46k92L02n60O5J35JK40m13
2659a93j66L56J68J7m14LK20O3J77q6R5N3R4k3l53O0j32L44K32n46j02M51M5r9
$$ plain form
2502 276 -23 -54 -109 423 -151 -123 -373 -226 -104 49 -560 -992 -436 8 -91 -458 -236 -168 289 296 134 -68
2524 -68 284 199 365 -10 -228 27 -98 -139 -152 -482 -513 176 -32 -237 -236 -21 297 257 -8 -88 114 353 316
2547 316 -58 -351 58 134 184 -424 -162 -90 -36 -107 -56 -140 -102 -10 433 271 133 25 696 469 351 421 142
2570 142 -4 -27 95 -274 35 -127 133 135 -486 -102 530 480 238 186 62 302 440 462 120 301 221 267 374
2593 374 -229 -134 683 211 135 -321 -98 114 554 166 -92 95 580 400 308 68 -85 77 226 224 -203 -352
2615 -352 -129 -182 -391 -44 -399 -30 34 -81 -333 -220 -50 258 -451 -58 136 342 310 -103 -439 -493 -397 12
2637 12 -546 -679 -548 -246 -63 -113 -98 -247 -104 285 -152 9 83 329 37 339 -221 -156 -21 -20 220 -193
2659 -193 -359 -3 165 182 -232 -229 -9 54 231 145 240 293 387 364 11 71 -61 283 515 -31 -133 318 363 264
2683B64n03J74L50K85m1q5p75Q07m4Lj64j62J41P8k02k32J03O4k8K0l9l47O43
2706C10n0J76m30K23j8K39k77j2l87M65O3J2l87l32k7O19mm76lL53L55j98m55
2729b41n9L76K57p6j85j70N74l84L1r2K0O8j39J86j59j96J73K02k08j1Q3J11M92
2752F53l59j08k51J78J85l19N0k13j14J17J05p6j39l3M2J22J7K52m62N23j89j37
2774a56m2L79l3k6l99J04j28L20j03k77j32K47K67q6j94j34K74O5P5J21j23J55
2796A74K66j42m27J13K47k51K36p1k47K02j17mO1k60K51K53m09K42j29R9K56K29
2818E72k70m61j5N81j95o15j00J24N46j6n87L75j64K01J32j03K96q4R0Q1k96j71
2840g9J47L48m8n55k14J57K1L11k34O1q3L75K27k39k18J01M53l43m1J2qJ47P1
$$ plain form
2683 264 -239 -65 285 570 529 444 -331 476 432 435 271 109 250 328 126 -106 -3 61 33 53 14 -333 310
2706 310 260 436 6 229 211 450 173 161 -226 239 302 314 -73 -405 -432 187 183 -293 -296 57 412 214 -241
2729 -241 -300 76 333 257 72 -98 476 92 123 31 51 119 -20 166 7 -189 -16 186 -22 -33 50 161 653
2752 653 294 186 -65 113 298 -21 29 -184 -298 -181 -76 -152 -291 -324 -282 -160 -143 109 -353 170 -19 -156
2774 -156 -198 181 148 122 -277 -173 -301 19 -84 -361 -493 -246 21 -65 -259 -393 -119 -54 21 142 19 174
2796 174 440 298 -129 -16 231 -20 216 145 -102 100 -17 -21 40 -220 31 284 -125 117 -12 87 343 572
2818 572 302 -159 -174 407 212 -403 -503 -379 167 151 -436 -61 -225 -24 108 5 301 217 307 388 92 -79
2840 -79 68 416 368 -187 -401 -244 -223 88 -146 -85 -168 207 434 195 -23 78 531 188 147 159 151 298 369
2863C69j22j8K05k53j65N6jK4J16J4k23J11r8K99J90n11KK80p4K21p0l21l10K39
2887d0J38j34j1j55J56J61k24j38K27J70m6n2MJ46j62J70j75L4O6k66K44l29K48
2910C2l46K70j4m7J17Nj0K88l16J57K63j62j86J08k08K09N5o1n3l45L09lN4j76
2934f0J08j45K9J80R6k0k80J85O5k99J41q5j53J19l10K79j04Q1R3P3n20K07M4
2957b76Q6K69n6p2j84L51J33k94m5J21J67n80J83lK18K4k60Pj80L79K13j93j27
2980a19J64L58l98K49l12N9J36J19k2k76L72l67J50P5j54m40K55K32j44J27j89
3001a25j37N38k65j6J62QK2j39l13K72m2N5j73k3j14M01k61q0N5J29O0J80m8j67
3025b1M0j45K08J8k49J19j03M0J38j57j20J38r3M57p49L50L67k6k6P8l72L25J9
$$ plain form
2863 369 247 229 434 181 16 72 71 95 211 225 2 113 15 314 504 -7 -5 275 201 422 352 31 -279 -40
2887 -40 98 -36 -47 -202 -46 115 -109 -247 -20 150 104 52 56 202 40 210 35 69 135 -131 113 -216 32
2910 32 -314 -44 -58 -105 12 17 7 295 -21 136 399 237 51 159 -49 160 215 154 101 -244 65 62 116 -60
2934 -60 48 -97 -68 112 208 188 -92 93 158 -141 0 -85 -238 -119 -429 -150 -254 -173 -80 -7 -527 -320 -276
2957 -276 -190 79 23 -49 -233 118 251 -43 -88 33 200 -380 -197 -200 18 42 -218 -211 -391 -12 201 8 -119
2980 -119 45 403 5 254 -58 1 137 256 234 -42 330 -37 113 188 34 -406 -151 81 -63 64 -125
3001 -125 -262 276 11 -5 157 165 187 48 -265 7 -35 20 -153 -176 -290 111 -150 -230 -175 -46 14 194 146 -21
3025 -21 19 -126 82 100 -149 -30 -133 -93 45 -112 -232 -94 -187 270 -479 -129 238 212 186 264 -108 217 236
3048B36k00r8j11K16p7J75j22m49L83O5j23J34r7p4L2qR5q8L43Q8k20r3k16QK20
3073A9j68K65m18L25l4j18L84m52O7K0N22m25j76N25j56J67l2k11O9P8k85N2m17
3096c99K99J44r5m6L06l90K86j62K0J40O5n2n7K52l94k3O2K07j96n8K42l85K90
3119E6j36N1J7K27j07k85k2K08K63n0k98J79L93l79l2J5k99M29p9k38J96l02J70
3142b3K24j71lo8n37N61j4K61m24N56k84p8n5NK56j60L7k16j76K33K45n04P3J98
3166f4j86j0L60n1P9l69J07J14J96l56K99j34j19J50j55j7J50j03j17q6J11N20
3188C19m79M8K39J5j10J6j4J97j0j94j77K99K34l59p0l03M22Pk76J17J10J16l50
3211b03L09K36K9j16N7k86m5L66k40k11L46J72k41j21l19J79O7J02J49j84K56
$$ plain form
3048 236 36 -62 -173 43 -34 141 19 -430 -47 18 -105 29 -68 -142 -110 -118 -23 -111 232 320 100 7 -209 -201 19
3073 19 -149 116 -302 23 -11 -129 255 -197 -130 -110 412 -13 -189 336 180 347 315 104 173 251 -34 18 -399
3096 -399 -100 44 -51 -97 209 -181 105 -57 -37 103 168 116 59 311 -83 -106 -44 163 -33 -91 151 -234 56
3119 56 -80 -29 -12 215 108 -177 -199 9 272 222 -76 103 496 117 85 100 -199 230 151 -87 109 -193 -23
3142 -23 201 30 27 -41 -578 -17 -31 230 -194 362 78 0 -55 -50 206 46 83 -133 -309 -76 169 -335 -262 -64
3166 -64 -250 -260 100 49 128 -241 -134 -20 176 -180 119 -15 -134 16 -139 -156 -6 -109 -226 -312 -201 319
3188 319 -160 -112 127 142 32 48 34 231 221 27 -150 149 383 24 -46 -349 73 80 -196 -79 31 147 -203
3211 -203 106 342 371 255 312 26 -19 347 107 -104 242 414 173 52 -267 -88 -21 81 230 46 302
3232C02l38J71p1M31m12J95k37L0k8m08M20p8J92k67K31m35J04q5L50m2J72M7
3254B44j67J77k52J06K12k24J54k90J18l5L5j73Q5r1M9m5j87J28j11N03k85k18
3276b67K0L8K53j31j35N5K77k53P2k4j2k47K01k65P6K44q9O4P4P0K31j92P8l4
3300A04j62J97Q7k31j83m0P9K12J41l49K9K13k6k64K21J70j20J8J57l04J23ln6
3323A3J07q1QJ5j83R7M8J0k85J90J19Q5k30k29N29l19J17L25k60m22N05l1p7o6
3347a5Q4k6n2K3k5L50k01l47jL68j31J31j95k7L43J54j29j56m8q9Q6n2m48L09
3371i4J85l99J54K09M4j94l2L49o7J86k51k66M91j3l09N5J73n23L4L16K72k82
3393C8j88r9p0K73l8j35J24K11k00j02K2J13K8J1M74o73K70j53J3J2pO6r3m0l2
$$ plain form
3232 302 -36 135 64 495 83 278 41 71 43 -365 55 -23 169 -98 133 -302 -198 -283 67 25 197 244
3254 244 77 254 2 108 320 96 250 -40 78 43 78 -95 -10 -101 -52 -97 -284 -156 -267 236 -49 -267
3276 -267 -247 -209 44 -87 -222 -167 110 -143 -71 -95 -107 -354 -153 -418 -342 -98 -187 -123 -49 21 252 60 138 104
3300 104 -58 139 226 -5 -188 -228 -149 63 204 -145 -116 97 71 -193 28 198 78 96 253 -51 72 69 13
3323 13 120 39 47 62 -121 -24 24 34 -251 -61 58 143 -87 -316 213 -106 11 336 76 -346 159 128 51 -15
3347 -15 69 43 -9 14 -11 339 138 -209 -210 158 27 158 -37 -64 279 433 304 148 100 11 97 45 -403 -94
3371 -94 91 -308 -154 55 99 -95 -127 222 155 341 90 -176 315 302 -7 48 221 -302 -268 48 320 38
3393 38 -150 -249 -319 -46 -84 -219 -95 116 -84 -186 -164 -51 -23 -12 462 -211 59 -94 -81 -69 -76 -10 -103 -143 -175
3418a75J89j62L0J22J06r6L0j51oJ33Q4k49J00j66L02q8o2pN4K60r6k91O8N1P3
3443E3l12J96J4J04j55J57M1m39K86J15k89L8L16j98rL0J16m05L88j26J42l26
3465b63R4R8J46j74J34k08m1J18K93k04Mm0J33M3l05M35k54K06q4K00k31Q1p2
3488A09r1K7Q1k86p1M32k01J39jl45J32K22j42O3ok39J46K68k63k40j10K79j41
3511b38P7K9K8l5j39J3L7L9K83l64J62r0K73j19k05J98K00j62k2j11K01O7l68
3534b46K08nK74l02j41K7J49j3J14k52J96L85k64k27M1J37K14k20m6O8J18j93
3556B2j76l0l0n7k62M31J11J0p2j21O3mK38p1k12l7K22l4q0r0j46J77J96j7k41
3581b10J14J28o6l6K7j17K47j74nJ01r1L75j07N6j18k63R3k06K63l4O9Q0j04J03
$$ plain form
3418 -175 14 -148 -118 4 110 14 44 -107 -113 20 104 -145 -45 -211 91 3 -59 -66 -12 248 152 -139 -71 -20 53
3443 53 -259 -63 -49 55 -100 57 98 -341 -55 60 -229 -191 125 -73 -82 -52 64 -341 47 -79 63 -263
3465 -263 -169 -71 75 -99 35 -173 -214 -96 197 -7 -3 -43 90 133 -172 263 9 215 131 331 100 181 109
3488 109 18 45 126 -160 -231 201 0 139 138 -207 -75 147 5 68 62 -177 -31 237 -26 -266 -376 -97 -238
3511 -238 -161 -132 -104 -139 -278 -265 -228 -189 94 -270 -108 -198 75 -44 -249 -51 149 -13 -35 -146 55 122 -246
3534 -246 -38 -43 231 -71 -212 -185 -36 -49 65 -187 9 394 130 -97 -56 81 295 75 29 97 215 22
3556 22 -154 -184 -214 -271 -533 -102 9 19 -53 -174 -111 -115 123 52 -160 -197 25 -9 -89 -179 -325 -148 48 31 -210
3581 -210 -96 32 -34 -70 -43 -160 87 -87 -92 9 -82 293 186 242 124 -139 -46 -252 11 -23 46 126 22 125
3605A25j99K8r0K74p0j73O3n9m6p2K74J85k60j16nL22k51M1NM7k3q9k78L14k85
3630c38M3J63K53m75L67r2j42K68j73O3K63l12J3O0J24N4l15J70k17K47k27j7
3652b20J61J71L1j01j85Q6L0k1l7m6L78k80jK53l53K26j55L1L0%L21m46J37K34
3676B44k86q3K77j11j71K16k52J32q7M22j70j75p9K14Q8J25k68J86k66R6r0L7
3698aj72P9M32o50Q6M4KK04q8Rn7K1r1mO1J91r3n3K86l79R0J45j25P7J43j50L30
3725C37l81K57o7n7j42K09J7k83J52k06M2k77P09P5P1k49k75M20k57k10J68r2
3747c9P9j73M48k64m6p6K39j78l73K00K76j17J32o9k88K16p0j30L36P5j09K33
3769C02l18j07P0M0j41K40p0J7j05j34L90j0n0j60L3j84L22k56J78K4j01K24k27
$$ plain form
3605 125 -74 -46 -136 138 68 -105 -42 -101 -147 -219 55 240 -20 -136 -141 181 -70 -29 -24 23 0 -89 -367 -53 -338
3630 -338 -295 -132 121 -354 13 -79 -221 47 -126 -63 200 -112 -99 -39 85 139 -176 -6 -223 24 -203 -220
3652 -220 -59 112 143 42 -143 -57 -27 -48 -85 -131 247 -33 -34 219 -134 92 -63 -32 -2 -2 319 -127 10 244
3676 244 -42 -125 152 41 -130 86 -166 -34 -121 301 131 -44 -123 91 179 304 36 222 -44 52 -38 -1
3698 -1 -173 -94 338 -312 -226 -182 -180 24 -64 -55 -112 -91 -182 -186 -125 66 -27 -80 206 -173 -83 62 -63 14 157 7 337
3725 337 -44 213 146 89 -53 156 173 -110 42 -164 -122 -399 310 385 456 207 -68 352 95 -115 53 -39
3747 -39 40 -133 315 51 5 -71 168 -10 -383 -183 93 -24 108 39 -249 -33 -103 -233 103 178 69 302
3769 302 -16 -123 -53 -13 -154 86 16 33 -72 -206 184 174 124 -36 -3 -187 135 -121 57 81 -20 204 -23
3792b3J74m7P3j68R3l2O2l11R0K29p8j44P6J1J4l3n2k6r8K42K44j29j3j97j46
3817a89K85j86K14n4j53J08k5O8M0k02J9N0K63j67O7q7r7M16n02k16L91J5J16
3840A74j38K12j65J6j93J52Q9j61J7o0J41j43k44L26j76L11K54n75J92j19M8J8
3862b4m1K07k3J22j65Q5l63K89J09j76j66L93k30l1K14j61k8j10P8k4N0K39k04
3885D0j13L36l96J83j75K95m05K69j01j54q5K31J22j25J75l87K70j83J14n9n5
3906b03N57k99l8l2N4K00l85J85N4k41r8J62P2J21j51k20M45l05L01l79L52k13
3928f1k2K14l47K01L56o33J68j93K45Q0J14m3k11L33N7m10M49k19p8q9J3J30M2
3951I6O3j44O4m7K23k41R5k8P1k18jL36j96qJ9m4J42Nk36J53m6r3O0j23M45o41
$$ plain form
3792 -23 151 104 177 9 102 70 132 -179 -89 140 62 -82 -6 5 19 -14 -66 -92 -190 52 296 167 154 -43 -189
3817 -189 96 -90 124 70 -83 25 0 68 108 -94 -75 -25 238 71 138 51 -46 370 -132 -348 43 58 174
3840 174 36 248 83 99 -94 58 147 -14 3 -57 84 -59 -303 23 -153 158 412 -163 29 -90 -42 -24
3862 -24 -65 142 119 241 76 161 -202 87 196 20 -146 247 17 -14 200 39 11 -99 -21 -45 5 244 40
3885 40 -73 263 -133 50 -125 170 -235 34 -67 -221 -306 -75 47 -78 97 -290 -20 -203 -89 -148 -203
3906 -203 354 55 17 -15 39 239 -146 39 93 -148 -246 -84 -12 109 -42 -262 183 -122 179 -200 152 -61
3928 -61 -83 131 -216 -15 341 -292 -124 -317 -72 8 122 79 -132 201 258 -152 297 78 0 -89 -76 54 96
3951 96 159 15 79 32 255 14 109 81 152 -66 -67 269 73 65 84 40 182 187 -49 104 58 -35 25 -98 347 -294
3977b94K61L7K04q9K3m6l21K61m6j41q5L37k35M1K62j85k55N47k80J6k31J90J06
4000G7o7j85Q6J08j16l5K45n4j05kJ32p8K65k80np3L21k34K3j71K42q6J53k51
4024i0r9N2j20L41r0o7L06k80j45J78J69m5k51J44k15l0J53J4k3N32o27J74j56
4047a75L18k05J78j08n1j8j56K52N9o3J14k07K05J39k06k9j60J45J77J00m07O4
4069c4j31M64m36L59L7k77L3j4K09J9m35J14j29L56k02p2j02K54j6j04J64l1j01
4092g5k46L40j72N26k90j79Q3J46J25k10j33j39J14J12j09l7r2M82k78K23j8l62
4114a89L24j17P6nk41J24k04M21l68J52j16L58l35k54K41l96L35K30o0J03j64
4135h5k7K8Q0J48R2o09L47j71K29p9m03M18K7j06j56M27j28k5J55k78n2K49q1
$$ plain form
3977 -294 -33 4 208 119 142 96 -225 36 -10 -151 -236 101 -134 -93 169 -16 -271 276 -4 12 -219 -29 77
4000 77 10 -175 -89 19 -97 -132 113 59 -46 -48 84 6 271 -9 -14 -87 234 0 23 -148 94 8 161 -90
4024 -90 -189 -137 -257 84 -6 -73 233 -47 -192 -14 155 110 -141 3 -212 -242 -89 -75 -98 434 -193 -19 -175
4047 -175 143 -62 116 8 -43 -61 -217 35 94 31 145 -62 143 282 76 47 -113 32 209 309 -98 -34
4069 -34 -165 299 -137 222 259 -18 15 1 210 229 -206 -92 -221 135 -67 -139 -241 13 -3 -107 57 26 -75
4092 -75 -321 19 -153 373 83 -96 -13 133 258 48 -85 -224 -110 2 -107 -144 -236 246 -32 191 173 -189
4114 -189 135 18 94 89 -152 -28 -232 189 -179 -27 -143 215 -120 -374 -133 -529 -194 36 -24 79 -85
4135 -85 -112 -84 -4 144 236 -373 -26 -197 32 -47 -450 -32 -5 -111 -267 160 32 7 162 -116 -168 81 0
4158@J0P0J86n21J00L5K75l25n5N12l74QK68l65M37j79J04j60p9K95j19j53N69
4181E39p04K38j88K18J9j58p3J85l26N08o7l21K8J13K02m45L33k56P3J08j28J82
4203H0l67J9J32N24l12k85K39k05J31P3J17r2r7R9L0j79J63K26k04j10J10J53
4225B45j08j79M54l79Kn03N82j85J81o2o2J94j05k62J79l8K10l8j22K3m8J45j72
4248d8O3L4R5n1j61M8J62q1q6N3L85m78K77j5r0l6O2k38K44l2k9m65J44M77j67
4273F7O1J7j51j66R7J6O6N5j23pJ59o2L85j51m45J57k4K2J72k41J13k86k8M62
4297A65k9j44j74L35J6o4J44l0l50J09K60p1l73M77l22j1m3K07q2j92L04Q2j73
4320D1J5k3L62l16J06j73K23n2k6l21J61j97M6K20p3j24K64r9k03R6k2R7J19j13
$$ plain form
4158 0 10 80 266 -255 -155 -120 155 -170 -225 287 -87 -79 189 -176 261 82 186 26 -53 242 123 -30 539
4181 539 -165 73 -115 103 122 -36 -109 76 -250 258 191 -130 -102 11 213 -232 101 -155 -82 26 -102 80
4203 80 -287 -268 -136 388 76 -209 30 -175 -44 29 146 54 -43 56 86 -93 70 296 92 -18 92 245
4225 245 137 -42 412 33 35 -468 114 -71 110 48 -14 180 75 -187 -8 -46 164 126 4 27 -21 124 -48
4248 -48 15 49 144 93 -68 -20 142 61 -25 28 413 -65 212 197 107 71 133 -105 139 107 78 -387 -243 234 67
4273 67 128 145 -6 -172 -75 -59 7 62 -61 -68 91 29 414 263 -182 -25 -49 -27 145 -96 17 -269 -297 165
4297 165 136 -8 -182 153 169 105 249 219 -131 -22 238 167 -206 271 -51 -62 -105 102 20 -172 132 214 41
4320 41 56 33 395 79 185 12 235 183 157 -164 -3 -200 -154 66 -7 -131 133 34 -169 -73 -95 2 121 8
4344Hl13O57m69R2N0j33K99j04q8J25k01L4n4k53K14K96m2l27J02o8j62L67k39
4367b09J75q3K17n8J05j62J17j05M1K10l33K98j42j26k8K8k31L31L54l73k24l1
4389b29K23j62K97m9m3m2J6P4J4L4N5j58j52j6m5K44k77Q6n0P7J69J36k96L99
4413C05k7n7l47K29l49K34K4J29m51Q8K56m33M77R4k99M6K64m56O89k85k45K39
4435A25k3n8P3j24K71l26j63L68l3k92K28j1n3j4R7l08j1L50l41L18l7J48p4k61
4459a51OJ95j77L11k09M3j28jJ07K1K2qJ39j52Q5J3r2N8j7o7q9O3J65j72l7k63
4485c35L39M7l62L88j81K61k42R7Q5O9n5j56j04J52o3O2JJ24o3m20L00j48j71
4508c75M82j2K6k8P3j81J88L0k63K43J1j79r1O2m4J81j18j48O1N9n8k17L20o8
$$ plain form
4344 8 -305 352 -117 -25 25 -108 191 87 -1 124 -77 -43 -97 -350 -136 160 118 -209 -107 -175 -337 30 -209
4367 -209 -34 -117 100 42 147 -15 102 -3 38 248 -85 213 71 -55 -83 -55 -286 45 399 26 -198 -229
4389 -229 -6 -168 129 80 37 -5 11 85 99 133 188 30 -122 -138 -183 61 -216 -130 -180 -103 66 202 -94 305
4413 305 278 221 -126 103 -246 -12 12 141 -310 -222 34 -399 78 172 -127 -81 183 -273 416 131 -114 125
4435 125 102 44 117 -7 264 -62 -225 143 110 -182 46 35 -18 -32 65 -243 -254 96 -245 73 36 184 110 -151
4459 -151 -145 50 -127 184 -25 18 -110 -111 -4 17 39 31 170 18 103 116 24 82 65 -2 -91 -28 137 -35 -72 -335
4485 -335 4 51 -311 77 -104 157 -85 12 97 166 111 -45 -149 3 -60 2 3 127 64 -356 -56 -204 -375
4508 -375 107 95 121 93 166 -15 173 203 -60 183 194 15 -76 -14 -58 123 5 -143 -82 -23 -81 -298 22 -46
4532d6N4Q9k94K14j8k48K46l7k6j40J48j23J20J28j29L44L8m67m5O0P8K77k10
4555A3L38l57P2l40K27Q0n6n5o5L4K98q0j76n3L27n9p8K10k72J58j08pq9P7k79
4580b40K10O2jj94J36Ml2k5K93N1j42j99l7L73j71j67K27j69M1P5J37k35J54J28
4604B79k64J9nj66j98J10N47m43O2j65Q0N0K28k00j40oK82r0J13k75J22j3k2K13
4628A18j47P3k09L97n60J85L76L0m17L46j54O0M3k42N7j64J99j1j08L81k85J28
4650I6M9j34J75l59L5M3J95j90K83J46j84m2J19j63Q5j18J08j37J39m54P1K58
4672B1k63K94K2l71M14m47O67l86L9k23J14P8QK1k4K02k21j18j31L52m20L6L8
4695b98K31J97p5j01K35k22k38pL41j43K62r3M6l65M54k01Qk15j50M10j07Q9l
$$ plain form
4532 -46 8 97 -197 17 -1 -249 -3 -40 -66 -206 -58 -181 -61 67 -62 282 320 -147 -192 -132 -54 223 13
4555 13 351 -6 66 -274 -47 33 -23 -78 -143 -109 189 109 -67 -120 207 148 70 280 8 166 58 51 -38 39 -240
4580 -240 -30 32 31 -163 -27 -23 -55 -80 213 264 122 -77 -114 259 88 -79 148 -21 20 95 232 -3 151 279
4604 279 15 34 29 -137 -335 -225 322 -121 -59 -224 -144 -94 134 -66 -206 -212 70 -20 93 -182 -60 -73 -95 118
4628 118 -29 44 -165 232 -328 -143 233 263 -154 192 38 98 141 -101 -44 -208 -9 -20 -128 253 -32 96
4650 96 145 11 186 -173 -138 -95 100 -90 193 339 155 113 232 69 154 36 144 7 146 -308 -237 21
4672 21 -242 52 74 -297 117 -330 337 -49 -10 -233 -119 -41 -33 -12 -36 166 -55 -173 -304 48 -372 -336 -298
4695 -298 -67 130 55 -46 189 -33 -271 -278 63 -80 182 89 135 -230 224 23 31 -184 -334 76 -31 58 55
4718E5l3r5M3j39K96m6L4k58J00L3o6J49K31n31J99K12k44l0J43j85J83J08j81
4741b2L77j01P9m54J09J65n6R8mK0o39O01l37J49j09k0N1J47q3M5PK56k80L7k15
4766a79K87MrRj74K25j77K9J96j5j02k97K29N7j30J32Jr2j84L35k10K61l14P7
4790d1m3Rj25K49k1J39L5j31j49K0l9j30J29K16j46O7k29K21j94J90JK7l93J05
4814b33J99L00q9k38N4j08r3L75k37J79M8k44K5K07Nq7M3j0Ol67L11l32K83j64
4838a67m3J7J17J10k76J50o2K10k51k0J40L6J59J98k87k99k9L05N2j26J55J41
4860B30k42J11M0l9j57k22M57l01P0J6q7L17k34M8l0L02m62K32jL5l02J04K85
4883A70j66P7N6Pm46K74j35K93j32k28K7K97j01K40q5l11J63k5k40L70k17K57
$$ plain form
4718 55 22 -73 -30 -169 127 81 115 -143 -43 -10 -76 73 304 -227 -28 184 -60 -90 53 -132 51 159 -22
4741 -22 355 254 333 -121 -12 153 97 195 191 211 -428 173 -164 -15 -124 -144 -93 54 -29 16 23 279 -1 36 -179
4766 -179 108 112 103 112 -62 163 -14 15 211 196 94 -203 26 83 -47 85 86 -6 -190 145 -65 196 -118 -41
4790 -41 -84 -75 -200 49 28 167 202 71 -78 -58 -97 -227 -98 118 -28 39 -190 31 -163 27 28 55 -338 -233
4814 -233 -34 266 177 -61 -7 -115 -208 167 -70 109 157 -87 -62 145 150 63 106 96 102 -265 46 -286 -3 -167
4838 -167 -210 -193 -76 34 -242 -92 -154 56 -195 -215 -75 -39 120 318 31 -268 -297 8 60 -66 89 230
4860 230 -12 99 139 100 -57 -279 178 -123 -53 -37 -124 193 -41 7 -23 279 -183 49 48 83 -219 -115 170
4883 170 4 81 137 144 -302 -28 -163 130 -2 -230 -203 94 -7 233 148 -163 0 -25 -265 105 -112 145
4905A45J58l65k6l45N57j25j09Q2J92j41Q9j15m0j65L26j18l57M21j73M4J03L7
4927G5k76J36L43k31K17p4k56J51r4J40o0k51R4J02N5K78n82K60k50K61J98l95
4949a59R7J56j63j82Q6k7J91K54Kn33J36K95o7P7J41m76OJj0K36K83k06k22j9
4973a03k0rJ03P0m4j0O6J76k10n1K62n23Nm2M22k36L51j03n1j05j48K56p4R5l2
4998D5j08m5M7M28k59N5m03K80j4j14J15J02l03n9M36Nk57J06k66L10j77j86L76
5021A14j87j02L31j10J9j19K01l50M1K14J34R1k63L39n79K77%n1j97J93k46O23
5043C73l86J41J26k10Q2K4j30Q3O4Qk99J68q5j66n8J83j98N14R7k76m21J95J10
5066f1K44K1q0j71J57l5j51n1N5J87r5k32J15K81j28j44K42k8R5l45L02j87k54
$$ plain form
4905 145 303 -62 -88 -433 124 -1 -110 -28 164 23 112 -3 -43 -208 118 0 -357 64 -109 -65 38 75
4927 75 -201 -65 278 47 264 190 -66 85 -9 131 71 -180 -86 16 71 349 -233 27 -223 38 236 -159
4949 -159 -62 94 -69 -251 -165 -192 -1 253 255 -278 -142 153 86 163 304 -172 -166 -165 -175 61 344 138 -84 -103
4973 -103 -123 -132 -29 41 -3 -13 53 229 19 -32 230 -293 -288 -330 92 -144 207 104 53 -52 -200 56 -18 77 45
4998 45 -63 -108 -61 367 108 163 -240 40 26 -88 27 129 -174 -233 203 208 -49 57 -209 101 -76 -262 114
5021 114 -73 -175 156 46 65 -54 147 -203 -162 52 186 277 14 353 -226 51 51 0 -197 -4 -250 373
5043 373 -13 128 254 44 126 150 20 103 167 175 -124 44 -41 -207 -265 -82 -280 234 331 55 -366 -171 -61
5066 -61 183 204 124 -47 110 75 -76 -127 -72 115 20 -212 -97 184 56 -88 154 126 221 -124 178 -9 -263
5089b63K53q7J09j30J83k0L3l9M8j44J65m88M40Lj39K37j66j21k6J30N0k54L13
5112H7k33J53L0k40K68j54J37j32J48q8J22k18J26j01J37j43k81K83K9L12l23
5133h1j68L23o7J11k08K5J17j06l10K91J80K7j06R5J12r1l26Q0o2K04l66K95K5
5156fR5j88J16m5K73j86j34K78l82L40l40JK03j00l2K42j41k7p6R2L3K24j69Q0
5180A51k8j9j59j68L66m6j60j20J53J92q0k20J05j64J51P4J23k33J85j38J82j02
5202D5J18j64J69J28j48k02l43L78O9k18L02j64K68l57K43j22m7j67M38j07j58
5223c9J59k13L45k01j74J20Rk39J60k25M71m04L75k78J00J90l24J64M3J57Qk14
5245a0J3JJ03j06L7k10Q1J38j51J07j04J75l79L04n2R7j85L89k65J89j18k68M18
$$ plain form
5089 -263 -10 -97 12 -118 65 45 78 39 87 -57 108 -380 60 63 -76 161 -5 -126 -152 -22 28 -226 87
5112 87 -146 7 37 -203 65 -89 48 -84 64 -24 98 -120 6 -95 42 -101 -382 -99 -70 242 -81
5133 -81 -249 74 7 118 -90 -65 52 -54 -364 -73 107 134 28 123 235 144 -182 -102 -164 40 -326 -31 -6
5156 -6 89 -99 17 -28 245 59 -75 203 -179 161 -179 -178 25 -75 -107 135 -6 -33 -109 -17 16 240 71 151
5180 151 123 104 -55 -223 143 97 -63 -183 -30 162 82 -138 -33 -197 -46 28 151 -82 103 -35 147 45
5202 45 163 -1 168 296 148 -54 -397 -19 50 -168 134 -30 238 -119 124 2 -45 -212 226 119 -39
5223 -39 120 -93 252 51 -123 -3 6 -233 -73 -298 173 -231 144 -134 -34 156 -168 -4 39 196 204 -10
5245 -10 3 4 107 1 38 -172 -91 47 -104 3 -101 74 -305 -1 -53 44 -141 248 -17 172 54 -214 204
5268B04k14j68M33o1J87k78J44k44J63j51Q0j40M04m95J05M19l85J65n13J81q
5289a72L77j51N5j42L65l32j17L75l80J45j58j84K02K12m2J7Q1l04J20j02J64
5310B9j48K%J72j8P2j78n5L55k68K03O5l04Q6j22o6J07K07k04j48K39K11o3kk41
5335f9J0R8K41m45J22K59m19K43j7L5M1l18q8J60J53K27Qk3o04M08m4j19J03L40
5359C02k41m30N33j7j11%l9n0j65M17j71N6K60l33j99J44r7K21n2j16K10k59K0
5382a17K57K93p09N14j34o8j16p6K46l7L7k37m5K38J7J39j87J81m42K31O4mp3
5405b8L01j76j83j32L10l8k58l7J65J1J85l27J97k9n9q4Q1Q8J94j05j56l2K39
5428A27k06q5K68j43j83K13J3r8j4l2k0P8L06k88J85J48j85k31K02J08k01J38
$$ plain form
5268 204 -10 -178 255 194 381 103 247 3 166 15 95 -45 359 -136 -31 388 3 168 -345 -164 -172
5289 -172 205 54 109 -33 332 0 -117 258 -122 23 -135 -319 -117 95 53 70 151 -153 -33 -135 29
5310 29 -119 -117 -117 55 37 109 -69 -124 231 -37 166 231 -73 13 -109 -175 -68 139 -65 -213 26 237 174 172 -69
5335 -69 -59 39 280 -165 -43 216 -203 40 23 58 99 -219 -307 -147 6 233 241 218 -386 22 -22 -141 -38 302
5359 302 61 -369 164 147 36 36 -3 -53 -218 199 28 84 344 11 -188 -44 -141 80 28 -88 122 -137 -117
5382 -117 140 433 -276 238 104 36 -80 -156 90 53 90 -147 -192 46 63 202 15 196 -246 -15 49 45 -28
5405 -28 273 97 -86 -218 92 54 -204 -241 -76 -65 120 -207 -10 -39 -98 -182 -101 -13 181 76 -80 -112 127
5428 127 -79 -164 104 -39 -222 -9 4 -94 -108 -140 -160 -82 224 -64 121 269 84 -147 55 163 -38 100
5450A00rp7M04n78p2L31k05J51N0J17k27j44J52l96K90K4o0J63k44J94j39k9M82
5473B78j42k48j13N59p1l66J1m9K05n8j20L90k05m48O20k74M0j16K16l51j4K27
5495b9j47K98j68j28K33J9r2l14L87m1L7O0k02n2J15K08l81L38j36om9qL58n07
5519b07Q0m4K70P0j45K45j99k2k07n7M13K43n22LJ86o3Mj45J27j5l4J62R4j19
5543A18J02j84r0Rp4R0n8P0L37k39j76M3J35k88J20O3K03k48K29k37J0K01j35
5566Aj69Q7M44m50N0j5J11p9q5K1j27J16L37k41J56J2n7J02n7k50J18o0n2l1J87
5591F9J19k17k9J95r1Q8l10K09k3k26Q7J13j1J41L6n7j76L36j51j98j60M0K34
5614A8K71j52P9m09j2K88j23L55m07P2J49j2k05M0R1k07M08k24J10mj48K5k4L22
$$ plain form
5450 100 91 14 418 -160 -232 99 -106 45 95 212 -15 -159 -7 -403 -113 -89 -149 14 -230 -36 -175 -204 278
5473 278 136 -112 -225 334 263 -103 -92 -141 64 6 -114 276 71 -377 243 -31 9 -107 109 -242 -256 -29
5495 -29 -176 122 -46 -174 59 78 -14 -328 59 18 55 115 -87 -139 -24 184 -197 141 5 -1 -50 -58 300 -207
5519 -207 -127 -171 99 169 24 269 70 48 -159 -216 197 440 -82 -79 107 44 48 -97 30 15 -19 143 237 118
5543 118 220 36 -54 -45 -119 -29 -87 -17 320 81 -95 -52 83 -205 -85 -22 181 -67 162 -75 -65 136 1
5566 1 -168 -81 363 -87 -37 -52 59 -20 -105 -84 -211 -95 242 1 157 169 112 214 157 -93 25 -35 -87 -118 69
5591 69 188 -29 -58 137 46 134 -176 33 10 -216 -129 -16 -27 114 150 93 -83 253 102 -96 -256 -216 18
5614 18 289 137 216 -193 -205 83 -40 315 -92 -20 129 117 -88 -48 43 -164 244 20 130 126 -22 3 -21 301
5638C01o7k63K28q8j78Q2J54N1l37q7K25P7l48J33nL06j19q6mr1J47l7j61J45
5662b2N2o8j7J07o3j2k54J61K41l79K78O8l3k62L07j16J48J40m97q5L61k31n5
5685b31P1O2j34j1K00J78j27J2l8Pl4J23kj66j8K03O4J25j22l9l56j9K49l5J80
5710A42j14j09K10j42k49K79o1p9O7J49mq1o6J37j18K8K51n43L85K4j35m0K00
5733A31L0k07j02p1K15LK68l94R1j8Q6R9r1K15p6j94j59M26l11N3k04oJ46j39
5757b09R5p0K23j41M88n25R0pl5R3j94K31l5K17o89P01j07l79M22j91n7P5J74
5780A70l18J08l9J45m6o4J20j41J53O4r5K36n62J81K7K19j04k26k32L75M7l21
5802c03M04l56J62L85m10P5m2k1K70k31K87n32K49k1J43Q0k98J88j84L80n45J30
$$ plain form
5638 301 234 -29 199 111 -67 15 169 220 -117 -204 21 98 -250 -117 -122 184 65 -21 -25 -116 31 -6 -167 -22
5662 -22 30 -38 -55 52 -11 -23 -277 -116 125 -254 24 92 59 -203 104 -12 136 276 -221 -306 55 -176 -231
5685 -231 -160 -98 -232 -243 -43 135 8 20 -18 -11 -45 78 76 -90 -108 95 159 284 162 123 -233 -252 -3 -38 142
5710 142 28 -81 129 -13 -262 17 -44 -123 -56 93 89 8 -58 79 -39 -11 240 -303 82 106 -29 -69 131
5733 131 161 -46 -148 -219 -4 -1 267 -127 -36 -54 32 131 40 255 179 -15 -174 252 -59 -6 -210 -216 -70 -209
5757 -209 -114 -184 39 -102 386 -139 -49 -56 -91 2 -192 39 4 221 -468 233 126 -253 169 -22 -79 -4 170
5780 170 -148 -40 -79 66 20 -44 76 -65 88 152 57 293 -269 -88 -61 158 54 -172 -404 -29 18 -303
5802 -303 101 -255 -93 292 -118 -43 -85 -106 164 -67 220 -312 -63 -84 59 139 -159 29 -155 225 -320 -190
5824a90L39j33k15K72j8J83j00o2l11M71l05r8N1O6J77kj34K17n1M9j54m41J40
5847b49M84k61K5j66p1M30j99J3J4M2k30q4K12R0J87j95o3L91q3k46j72N28o65
5870b68K72J4Mm80J84K79J44j15j18j64L68j67Q4j62K50j29J43j96j8m78N98p4
5892b9J65k89L70k98L24m7j07j42O9q5p8K12j37J05p4l9m6K53m27L76q3l69J73
5915b03J78o0P7L8J56k47J01k8o7p0K81R2j18l33J22J27k96K98l79M22m29K80
5937e8p5L2L36j99k5jR5k34j24M81k95n1p4K81k3l24N67j99k49R2k3L48j83n6
5961C9k77L73j23K1O1o2j85J28J32k54M0mK59j25L08m02j36L56k5l4J27l9Rn01
5985c14L46k92q3M46l3N9m0j52k58L26J56j94N5r5Q9j99M4J18p4K93m27L27J9
$$ plain form
5824 -190 149 16 -199 73 55 238 138 76 -235 236 -69 -167 -116 -50 127 125 -9 208 157 206 52 -389 -249
5847 -249 235 -26 -1 -167 -238 192 -7 6 20 62 -168 -252 -40 50 237 42 -21 370 287 41 -131 397 -268
5870 -268 4 18 22 -458 -274 5 149 34 -84 -248 120 -47 37 -125 125 -4 139 -57 -75 -553 45 -29
5892 -29 136 -153 217 -81 243 196 89 -53 16 -69 -147 65 -72 33 -41 -80 -126 127 -300 76 -7 -376 -203
5915 -203 -25 -85 -8 30 186 -61 40 12 -55 -125 156 248 130 -203 -81 46 -250 48 -331 91 -338 -58
5937 -58 -133 -101 235 36 11 10 105 -129 -253 228 -67 -118 -192 89 66 -258 309 110 -139 -47 -70 278 95 39
5961 39 -238 135 12 33 94 32 -153 -25 107 -147 -107 -111 148 23 331 -71 -207 149 124 90 217 178 187 -314
5985 -314 32 -260 -343 103 70 129 89 -63 -321 5 161 -33 22 -73 16 -183 -139 -21 -95 198 -229 98 117
6008A17p1O9lp1L4Nj60L4O9rQ9j46M1J21k03J0K24J22m59J17M8K12l09O2J53j19
6034b3k32J60O4K02j77q8R4k9R9j18J0R7j88L12k57p0M54k80pJ24K16m04P1p1
6058d1j0J91k02J41k50L74j12j50J15RK73k87K00l09L2K12l35r6L58j22j34J70
6080B7J4k01M0M1J21j59P6R0J03n4n3o5o7k31P7J13j22J75J57KL40m33n8J80l55
6105b42Q5K16O2L3j02K58k3k65N1J76j31P6j18o8k82K0K66l07K75K48k72J9J56
6128A31j91q3L42k30N9q7r1L23k90mrL7K09l76Q3J34L9K1p2j48M6J45J04J14n25
6153c19L90M2k2j86M5k3J31k58L06j95K76k92L37q7K2K47j99m59N19k91l6J82
6175A30L6l35J78R5j35p5l7N9M6m0o5l1J88J93Q1k82J47j10O1j03l6n5J8K36m54
$$ plain form
6008 117 46 115 112 41 75 80 -80 -46 23 14 103 -43 -2 119 -84 -74 150 272 -187 -70 -22 190 -119 -57 96 -23
6034 -23 -255 -95 -31 171 -6 -94 0 -29 70 -48 -38 59 -129 183 -74 -144 310 30 23 147 363 -41 30 -41
6058 -41 -51 140 -62 79 -171 203 91 -59 56 65 338 51 251 -58 -26 186 -149 -245 113 -9 -143 27
6080 27 41 -160 -120 -79 42 -117 -41 49 152 98 45 -20 -87 -318 -241 -128 -250 -75 82 84 424 -9 -67 113 -242
6105 -242 -157 59 121 154 52 310 287 22 73 249 118 194 76 8 -274 -254 12 -295 -20 228 -44 -25 131
6128 131 -60 -143 199 -31 28 -59 -150 173 -117 -121 -130 -93 116 -260 -177 -43 -4 17 -55 -203 -157 -12 92 206 -319
6153 -319 71 113 91 -95 -50 -73 58 -200 106 -89 187 -105 232 145 167 414 215 -244 275 -16 -52 130
6175 130 166 -169 9 104 -31 -106 -143 -84 -38 -78 -143 -174 14 207 288 6 153 43 104 1 -35 -90 -72 164 -290
6200b90K51J03K2j12O9q1J14n3J51j10j60j30j17M61k73J06J01J81m09J41n6J52
6222F1j00J45k28Nr6J99K30k34L26l41N3R6j29K33m91L65l37J21J18k54M3J81
6244c4j9pj88J53K02k50l5K3P7l2n4L22k84Q2O8j77J45k29K94K06l04K45j87j19
6268a02O4j25K93k52N42n36N6o2J08J86m0o9m5L88l62j17j11M23k77m23L39M50
6290C28k72L32m03J23j70N1p7O7p4J21k54L44k09J31n6j62K79k38J83J7j02Q4
6312D3m9O8R5l8p0nj71J15J36j82j42M13j94k49M60m57K34L8n0oj18P3J32lJ3
6337H6n6O5m9Q2j1r1j04j17P9J64l7K8n5j37Q2J24r9o2K75j30j35J74J46j12N4
6362A64m8J46j06l80k4j8J62N7J69lq9k34L99j28k42M53j38l76O6J23J23j12r
$$ plain form
6200 -290 -39 64 86 -26 43 -38 76 23 174 64 -96 -226 -343 118 -155 -49 52 233 -176 -35 -91 61
6222 61 -39 106 -122 -117 -213 -14 216 -18 308 -33 20 116 -13 220 -271 94 -243 -122 -4 -258 -215 -34
6244 -34 -53 -60 -248 -95 107 -143 -178 -155 -78 -110 -164 158 -126 -44 24 -153 -8 -237 57 263 -41 204 17 -102
6268 -102 -38 -163 130 -122 420 -116 -60 -122 -14 172 132 63 18 406 44 -73 -184 239 -38 -461 -122 328
6290 328 56 388 -15 108 -62 -11 -88 -21 -95 26 -228 116 -93 38 -18 -180 99 -139 44 61 -41 43
6312 43 -6 62 157 119 49 44 -127 -12 124 -58 -200 213 19 -230 230 -227 7 45 -5 -11 -129 -56 76 73 86
6337 86 30 95 46 128 117 26 -78 -195 -116 48 11 39 -16 -153 -71 53 -46 -108 167 37 -98 76 222 110 164
6362 164 116 262 156 -224 -248 -266 -104 -47 122 119 30 -204 195 67 -175 278 140 -236 -170 -47 76 -36 -45
6385d5J20J09j07k61j14L16J78l97L07j98K63l16K6o6L71q3l77L15O8M1r6J94
6407B48j81k65K93k81K14j9J8j61P0M0J85o2j54p1q7L81K2j09l65j9J21J20J69
6430A07K7l07J50m6L21J0l31R5n1J85k54J02r1J67j57K18j5O2N5o11L10j28K29
6453D7K53k41K47k56j61J22R0k33J55q8J90k05L82k55J37l42N9K32J26k99n0M3
6475d7J46O4r2R8K24l69M1Lj85J04j53p9N15k50O5J27k17mj62M5K51j61l9L66
6499B91m28L07k42l0N6j12J41J75N3j6j82J42k36M92o12J91L7k33K71m17N78m
6521B22j4J8k55nJ79k35r8J83L39k75k58R3L50k53j8n5J46P6j05P8L9o2Q4l0j15
6546B9j52J77K08l67J20o0j73L00j7j45P5q4Q1k0J34p9k17K20n8K85m42K8J59
$$ plain form
6385 -45 75 184 77 -184 -298 18 196 -201 106 -92 171 -145 -119 -185 186 103 -274 41 109 150 54 248
6407 248 67 -198 95 -186 28 9 27 -134 -64 -24 161 99 -55 -126 -213 168 190 81 -284 -303 -182 -62 107
6430 107 134 -173 -23 -69 252 262 -69 26 -25 160 -94 8 -83 84 -73 145 130 192 247 -364 -54 -182 47
6453 47 300 59 306 50 -111 11 101 -132 23 -65 125 -80 302 47 184 -158 -99 133 259 -40 -90 -47
6475 -47 99 163 71 169 393 24 65 68 -117 -13 -166 -245 270 20 85 212 -5 -9 -171 -126 125 -36 -75 291
6499 291 -137 170 -72 -102 -46 -158 -17 158 211 195 13 155 -81 411 -201 -10 27 -206 65 -352 226 222
6521 222 208 226 -29 -34 145 -90 -188 -5 334 59 -199 -106 244 -9 -27 -82 64 140 35 113 152 90 174 144 29
6546 29 -123 54 262 -105 15 -45 -218 82 65 -80 -5 -89 -8 -28 106 27 -190 30 -28 257 -185 -157 2
6569BJ60j84r9J6L13j07k1m6l0J92k01K61k29L9j46K23p2J0l45K34J29k29K29
6592I9k42R6j30L9K73mk74O9K07j08r3n4N3j69J67Jm5J26j33J08P2j47L20j62
6616F9k20J42O4m22L91j28k8n5KK16r6K7n0J49k5q3q8j92K27j54K80K9k85K7J54
6641d9K97k36Q1k02J83pm1L17p00L20m8L04j71l2m0Rk62K95j16j01P5R0p1K51
6665A46p3%K20m73N1lK81k19J87P5o2l00J92Q3j18M5L4l98L75q1J30k39L62k62
6689d7l8J23j95K62l26R9L35k34r0K12Q9l60J31K42l80L41j40nL17l00j21r7J50
6712c2l5Q7q0O9j05N6J15k68L35l04K19m8j75K92M2k61J94j36K48j28l2j15j84
6735b46R0K11m2j27K38l92L3L40o0n9k63L51Q0j19q0j02J49k2P8J04jj32Oj48
$$ plain form
6569 2 162 -22 -121 -105 208 101 80 34 4 196 -5 256 27 66 -80 143 71 81 -264 -30 99 -130 99
6592 99 -143 -47 -177 -138 135 131 -143 -74 133 25 -68 -122 -69 -238 -71 -70 -115 11 -122 -14 58 -89 231 69
6616 69 -151 -9 55 -367 24 -104 -132 -187 -185 31 -65 -38 -88 61 36 -47 -135 -327 -100 -254 26 55 -230 -203 -49
6641 -49 248 12 93 -109 74 67 26 343 -357 -37 -85 219 48 16 -24 -15 -277 18 -98 -199 -124 -34 -105 146
6665 146 73 73 293 -180 -129 -132 149 -70 117 192 130 -170 22 105 -13 32 66 -332 43 -38 92 -147 215 -47
6689 -47 -85 38 -157 105 -221 -122 213 -21 -111 101 190 -170 -39 203 -177 164 24 19 336 36 -85 -182 -32
6712 -32 -67 20 -60 9 -96 -40 75 -193 142 -162 57 9 -166 126 168 -93 101 -35 213 85 53 -62 -246
6735 -246 -156 55 13 -114 124 -268 -235 105 45 -14 -277 74 154 35 -45 -147 2 -20 58 162 161 29 35 -113
6759a13K97j5k68Mn1K6L28m47K19k70K0K63j33K63j7J56n35L82k18K98j64k94
6781b69K68n0o2J52J56l10J69O0l62RJ29K14j6j6j44K0L2J56k81K55JK00l13k28
6805b30N42j70J08j91n9J22J5k04J70l0O5K74k18j14l7j01K8k5K10j92k43JkL34
6829E3k13n7J63j95L90j83Q5k50N36l34n6L50k23jk42J25q0Qj7K70j48O0k27J82
6853dK33k33j33N5j85L70m08M4P6L03q2j00J86j97J19j39n6K38k7J2k80j32K64
6876g6J38J32k46J52k86J80j84LK91L4N9m15K77j57L90k61l68M72j80J96k54m9
6898a52j74NKM50R0j85m4m4K2K38k68O4l1k33J52J74k71L18m24J13K65j41q0K16
6922F2k24J01J71J58n27M38k79%K29q6l8k19J83Q5j88J28j36K09L12k54j9k8L25
$$ plain form
6759 -113 184 169 -99 -95 -146 -120 208 -239 -20 -290 -270 -7 -140 123 106 262 -273 109 -109 189 25 -269
6781 -269 -1 -51 -113 39 195 -115 54 114 -248 -239 -110 104 88 72 -72 -52 -20 136 -145 110 111 311 -2 -230
6805 -230 312 142 250 59 0 122 137 -67 103 73 138 412 194 80 43 -58 -30 -55 155 -37 -280 -279 -281 53
6829 53 -160 -217 -54 -249 141 -42 43 -207 329 -5 -61 289 66 65 -177 -52 -132 -124 -141 129 -19 41 -186 -4
6853 -4 229 -4 -137 -82 -267 103 -305 -261 -185 118 36 -64 122 -75 44 -95 -151 87 60 72 -208 -340 -76
6876 -76 62 194 -52 100 -186 -6 -190 -187 104 138 197 -218 59 -98 292 31 -337 135 -45 151 -103 -152
6898 -152 -326 -321 -319 131 221 36 -8 -52 -30 208 -60 4 -27 -260 -108 66 -205 113 -311 -198 67 -74 -154 62
6922 62 -162 -61 110 268 -259 179 -100 -100 129 43 5 -214 -31 54 -134 -6 -142 67 379 125 106 78 403
6945D03l65J78j78N9R7j24J05j90p8m8K69j62Q8O0k69K94k38J88R7k40J13j24
6967f5j23K01j0j11J80j19l4J95P1k36j3L68k51j28K19j86Q2K20l42K6J69K37
6989C50n01J59k47K6K12M6l15J20N6K10j2j2q0N4n6j33J85j75j27K84nKk89N91
7013C43m24J15P8k95M9K73J31k57kJ43l43J05K53r4l69L12r1k12J93j81O3j18
7035c28L93Nj9m18L20j01K40K6R3k14r4o4O4J75j26k10K81N6l18M00Jl58L5m5
7059b06L2J03r5R9J37J91n02K77k93L44p5O8l68N49j29k36M2k3K21n5J7J0j40
7082c2J50k8ln2j04k2PJ94k37r4M77j81j99K19J16k28PP0j3j13N0K60k31J3K41
7107B67j57oj11L30l20J66l26p7R9J63j79K30j55L4R1j53j02M15K0l39j14k19
$$ plain form
6945 403 38 216 38 97 194 70 175 -15 -93 -141 128 -34 54 114 -155 139 -99 89 186 -54 59 -65
6967 -65 -188 13 3 -108 72 -47 -81 114 185 -51 -64 304 53 -75 144 -42 40 260 -82 -56 113 350
6989 350 -151 8 -239 -213 -1 45 -270 -150 -94 116 104 92 12 66 10 -123 62 -113 -240 44 39 41 -248 343
7013 343 -81 34 112 -183 -134 139 270 13 11 154 -189 -84 169 75 -294 18 -73 -285 -92 -273 -210 -328
7035 -328 65 70 51 -367 -47 -148 92 118 211 -3 -97 -161 -97 78 -48 -258 23 79 -239 161 162 -196 -161 -206
7059 -206 -174 -71 -166 -67 70 261 -241 36 -257 87 12 80 -288 261 132 -104 -62 -85 136 81 98 108 -32
7082 -32 118 90 87 35 -69 -91 -84 110 -127 -221 256 75 -124 95 211 -17 -10 60 47 -66 -16 244 13 26 267
7107 267 110 104 -7 323 3 169 -157 -234 -135 28 -151 79 -76 -42 49 -104 -206 209 229 -110 -224 -443
7129d43L77m8lP6j36oO5L40k71q1J32K1M8j90Q0j10J27m92M84R1q6J38n8k22L21
7154A54m7k27K13j28j65K06J15N8j82j38M29l55P7j81K05m0l47J76K83p4k04K30
7176E8j5NL18n4m51J95q5p6J83jJ41k28q1P5j24R9J45k48K56j12R8j52J25q5J88
7201A74J2m22M75o2m51R8P7K76n7j86L72k26R7L7r8L4k43J54P6k45J25R0J82j56
7225A33l71M59k19M9j6r3L14K2j78k87K75r3M0j61J32o2J2J19J2k33K60L1j40
7248Ej8N9l34L52l92L19O5J02O6n73nM29o5J93J4j95l28nJ31M7N14k91N5o9J21
7273A97J24j98m47M60j99j83J44J49nL61l24m2pJ43l01J8J29j70j98O67k36k88
7295b06L89k98q5q5K15J18j24L3J77o4p3j17J77k27P2L5q2K27k59L06N3p5M7m7
$$ plain form
7129 -443 -66 -114 -117 -41 -177 -183 -118 222 -49 -130 2 23 71 -119 -39 -149 -22 -514 -30 61 -25 113 55 -167 154
7154 154 107 -120 93 -35 -200 6 121 179 -3 -141 288 -67 10 -171 34 -6 -353 -177 106 32 -172 58
7176 58 43 48 366 312 -139 56 -29 -105 78 77 218 -10 -91 -16 -140 -41 104 -144 112 0 98 -54 71 -14 174
7201 174 186 -236 239 177 -274 -176 -99 177 120 -66 306 80 177 214 116 150 -93 61 137 -108 17 107 289 133
7225 133 -238 221 2 51 35 -58 256 278 100 -187 88 -5 35 -126 6 -56 -44 75 87 -146 114 145 5
7248 5 -13 46 -288 64 -328 -9 56 158 224 -349 -354 75 10 203 217 22 -306 -311 -180 -133 381 90 145 76 197
7273 197 321 123 -324 136 -63 -246 -102 47 42 403 79 37 30 173 -128 -110 19 -151 -349 318 82 -206
7295 -206 183 -115 -200 -285 -70 48 -76 -43 134 70 -3 -120 57 -170 -98 -63 -145 82 -177 129 182 107 154 107
7319A07l56M99n68N16j61J81k02J01P8l15M71k09N7j47R9j71J42n9k61L56K45
7340D03l51lk00K29qk13j70K22K05k93J46j28M6J60j4L6r2j38qL06k20k9L94k11
7364F9j96K61l70K51p5j1L1L7K32l34O2K38l6j83J4K16m02J70Mm0P9P9k08J55
7388D3rN0J39k74L13k55m20M40k07J33j77K79Q4j79P1Q0l5j10M4k09J04K0L12
7411B37o27M27Q0j58k18L6O2K27j15k81M36k36K14k14J34N6j87j43N1K31j0K2
7433B4N5j29M1k79K12L7J96j41l8K66j20n8k05l1N43n31J86M9j41L2k80M86k23
7456d9r6r9K8M49k48N7R2p6K67l06J26j55K7k85J29J24M2J56k60k7N1j6L87l98
7480h0K96j53j09J70k99M75l68n3r6K74K49m63K10j06k20N49m74k10M69%j00K35
$$ plain form
7319 107 -249 250 -318 198 37 218 16 117 195 -120 351 142 199 52 151 -20 122 63 -198 158 403
7340 403 52 49 -151 78 70 -143 -313 -91 114 -179 -33 -161 -115 45 31 67 -25 -163 -171 135 -85 -114 280 69
7364 69 -127 134 -236 15 -60 -71 -40 -3 229 -105 -43 195 159 -24 -10 206 -196 -26 -22 -62 17 96 -112 43
7388 43 34 84 223 -51 262 7 -413 27 -180 -47 -224 55 139 -40 31 111 76 -34 10 -199 -95 -75 237
7411 237 -390 37 117 -41 -259 -223 -161 66 -49 -330 106 -130 84 -130 4 60 -127 -270 -219 12 2 24
7433 24 79 -50 -9 -288 -76 -39 157 16 -22 244 124 66 -139 -170 373 -158 28 77 -64 -32 -312 174 -49
7456 -49 -145 -244 -216 233 -15 42 134 58 325 19 145 -10 17 -268 -139 -15 27 183 -77 -104 -53 -69 318 -80
7480 -80 216 63 -46 124 -175 300 -68 -121 -217 57 306 -157 53 -53 -273 276 -198 -408 61 61 -39 196
7502A96l38J9j1q0p6L45l37M32k69n2L15k90L10Mj25k16J52J71l58J51j54K87
7524G6j83R5q8J21k8m6m6J34j32jL24j32m7l8K07k23Q3j04p7J32K10k78lj56J88
7549a2j6M0J31j1l09K6J28L29l26R1j02K89j98j46q0KL45k51p4R6PJ7o7m6J06
7574c1n9j89K23J22j3j05J20l28L08J02m65K99l33N54l84M51l34J04M1l87K31
7595g3J62l45L53k46J50n6j12J54k59K48J39j10L6k10J74J29n1l12J84k42K34
7616e3J01j03r1K9L18k37j19J27r7m8K37Q0j41J13k74J14O8l5q9L0j80J58pr0
7640a89K32Lj06j94L58j12r7J58o3J08J28m05K21R5l7Q1n21M67j83J14j43j88
7662b73N68m71M22k64O9k83R5Mj81M41J21l0k33L49n44L49P7j29j93J61N3n7P
$$ plain form
7502 196 -142 -123 -134 -214 -290 55 -282 150 -119 -171 144 -146 164 168 43 -173 -21 150 -208 -57 -211 76
7524 76 -107 -12 -100 21 -7 -53 -99 35 -97 -98 226 94 47 9 216 -7 76 -28 -105 27 237 -41 -44 -200 -12
7549 -12 -28 12 143 132 -177 -151 -23 306 -20 71 -31 258 60 -86 -166 -164 181 -70 -144 -48 -41 -24 -91 -137 -31
7574 -31 -90 -279 -56 66 53 -52 68 -260 48 150 -315 -16 -349 205 -179 272 -62 42 83 -304 -73
7595 -73 89 -256 97 -149 1 -55 -167 -13 -272 -24 115 5 41 -169 5 134 83 -229 -45 -287 -53
7616 -53 48 -55 -146 -117 201 -36 -155 -28 -125 -173 64 144 3 116 -158 -44 24 -11 -100 -70 -250 -92 -99 -189
7640 -189 43 46 -60 -254 104 -8 -105 53 -10 98 226 -179 42 137 100 181 -340 127 -56 58 -85 -273
7662 -273 295 -176 246 -18 51 -232 -137 -133 -314 127 248 218 -15 334 -210 139 216 87 -106 55 108 51 58
7685E8J98j24O2j20k33K18J32m3k33N4k4j3J05J12n4l23K23p9j37L02j57K79j93
7708A0k6L9q5j35K57K22l69j10k8L41o4J14m68O20l91j00J36L71l16j62L49l03
7730i8J98j89K85J01l16K17l40K41k67L48k22r1K34j48L75m77J7J9J5K59j52J71
7752A80j86P7j99J97j37m2jK39J7k05J57J02l36J93R8l90M24n58O01m3k38O2l2
7775b0o8K97l61J62j86M64p1j59k35pK01k72J40J75n2P4k38K82j93p3K0J67j01
7798e4K54Kmj53M8m6P6L1P8j60j56j70M9J25K99L1m10M0q6J71J45J30j44j23q9
7823a16K72r1Nk5K65m14K61k41j5J16k19K82k53J66P4j26L7k58N88l05k25K88
7845F6R3k79o9K16j20L65M6k56k0J23j27J71n02K34m9L06p6J23J13l21q8j10L10
$$ plain form
7685 58 256 132 194 74 -159 59 191 148 -85 -31 -55 -68 37 149 95 -228 -5 -84 -221 81 -76 203 10
7708 10 -16 23 -62 -197 60 282 -87 -197 -225 116 52 166 -302 318 -73 -173 -37 334 18 -144 205 -98
7730 -98 100 -89 196 297 -19 198 -142 99 -168 180 -42 -133 101 -47 328 -149 -132 -113 -98 161 9 180
7752 180 -6 71 -128 69 -68 -110 -111 128 145 -60 97 199 -137 56 154 -236 188 -370 231 188 -50 12 -20
7775 -20 -88 209 -152 10 -176 288 217 58 -177 -184 17 -255 -115 60 8 82 -156 126 -67 -140 -120 47 -54
7798 -54 200 202 198 45 93 47 123 154 232 72 -84 -254 -205 -80 219 250 -160 -120 -206 -35 110 240 96 -27 -116
7823 -116 156 65 70 45 310 -104 157 -84 -99 17 -202 80 -173 -7 67 -59 -22 -280 308 3 -222 66
7845 66 159 -120 -189 27 -93 272 318 62 42 165 38 209 -293 -59 -108 198 122 245 358 37 -51 -161 149
7868A49l04K02k29K00R8k10K66j97J19Q1k94L9P3l8KJ40k12J18P2n7k67L83j93
7891e9J59k32J17j18k6n4K22n2M3j3L3p4k7L11j94j64J50pJ23O2q9l69J96L1J
7916c0J3k25L59j22j3M0o3K06j74M9J06j49m1k05L66n73N84N0j52J18R0k20J30
7939A44Ok81Q9L9K65n8n45M23J7o3k22L75j62L11n7k22oj79m7K17j81MM14O2j70
7964A73j71k22J43N3K74P0M2l85j58K1K68j46kP8p8j94l8L01j24J09m9j45K14
7987C4M5p4L8m65N62l30K08j70L14L2k88J18L8P7l80K65j92K02J45j48j09J21
8009D3r6j00M12k05O1l0j72j35L19j98Q2j48n4J45J34Kk00K21j51n6Q2M0n8L63
8033C01l20J5m5P0j18j1K78j98N7n3l4k24M9L64k02j46K57j60O0J2k18O54m39
$$ plain form
7868 149 -155 47 -182 18 116 -94 172 -25 94 175 -119 -80 -7 -45 -43 97 -115 3 75 18 -249 134 -59
7891 -59 100 -132 -15 -133 -159 -213 9 -43 0 -13 20 -54 -81 230 36 -128 22 15 138 200 111 -258 -62 -31 -30
7916 -30 -17 -242 117 -5 -18 22 -41 165 -9 40 146 -3 -44 -249 117 -456 128 178 26 144 234 14 144
7939 144 150 -131 -42 -3 262 204 -341 82 99 36 -186 189 27 338 281 59 53 -126 -173 44 -137 -133 281 343 173
7964 173 2 -220 -77 -24 250 320 362 -23 -181 -160 108 -38 -40 38 -40 -234 -272 29 -95 14 -35 -180 34
7987 34 79 5 43 -422 140 -190 18 -152 162 194 -94 24 62 139 -241 24 -168 34 179 31 -78 43
8009 43 -53 -153 259 54 115 85 -87 -222 97 -101 -19 -167 -221 -76 58 60 -140 81 -70 -126 -44 -4 -62 301
8033 301 -19 -4 -49 21 -97 -108 170 -28 29 -24 -58 -282 -233 131 -71 -217 40 -120 -60 -48 -266 388 -51
8056e1q9J82J76l44Kj94L14J82o34M87J13l28L13n7N9J13j28k04J78k80K93pj53
8079e7J93j04M0j95J02o6L48k71M6l53L78k64K2M02m63N47l58J12J9o9n7K68j87
8102C3O2L1n9l87M66l12J20K20l8j07J99l81K75j34J79j99p2QJ96k49k9n1Q9K13
8126G3k25K11J58k10jL5N3j0P9J80k37l24J44K62j31O1r7j22j84K0L92m04K22
8149e5KK03m1l02J2K06j11K73q7kJ23k38p0L84k74k5j29J70n68R75n99M1N3r9
8173a58P0K27Q3j70n8nJ83l91J96j74L47k94Kp8J81R9J4J29
$$ plain form
8056 -51 -140 42 218 -126 -124 -318 -4 178 -456 31 144 -184 129 72 131 244 116 -88 90 -190 103 96 -57
8079 -57 136 32 72 -123 -21 -87 261 -10 36 -317 61 -203 -181 221 -242 305 -53 59 78 9 -48 220 33
8102 33 95 126 67 -320 146 -166 -46 174 136 29 228 -153 122 -12 167 -32 -104 -96 100 -149 -178 -229 -140 73
8126 73 -152 59 217 7 6 41 94 84 163 343 106 -218 -74 188 57 118 21 -101 -285 -265 127 -277 -55
8149 -55 -53 150 109 -193 -181 25 -86 187 100 98 221 -17 -87 297 23 -2 -131 39 -529 446 -153 -112 -59 -158
8173 -158 -88 139 222 52 -6 -11 172 -219 -23 -197 150 -144 -142 -220 -39 60 74 203
8191B03
$$ Imaginary data points
##PAGE= N=2
##DATA TABLE= (X++(I..I)), XYDATA
0@%%%%%%Qj6J6j6K0k8L2m0M9n7P2q8J04j21J44j68J94k26K58k95L39l86M37m93
30b61N55o26P05p87Q78r81J093j216J349j493J656j835K029k246K490k762L066
47A614l412L809m267M803n446O229p204Q462j0160J2590j6377K3164l9117J43672
61A18360J28292j88633k0109O2464L6096o0718l915K655m6315n3540O1806P0804
73A07247l6148q9936J2300O7509J1039l9555M968J4723l2776l9114K9943M3754
85E3954k6633p1571j6046M3901L2549j5305k8796j9004k738K2219M6134J7594
97C6258m5093n1449K0769O4876J7386m6064l5751R023J6254L561R002L888k9184
110b6524l0073K5736N1718k949m3276j102L6901L920k0367J7898K8178l0596m5012
$$ plain form
0 0 0 0 0 0 0 0 8 -8 8 -8 12 -16 16 -24 25 -32 40 -48 56 -65 79 -89 105 -121 137 -158 181 -205 232 -261
30 -261 294 -332 373 -414 464 -517 576 -640 709 -784 872 -963 1066 -1180 1310 -1452 1614
47 1614 -1798 2011 -2256 2547 -2899 3330 -3874 4588 -5572 7018 -9359 13805 -25312 118360
61 118360 246652 58019 37910 100374 136470 75752 71837 74492 28177 -25363 36443 107247
73 107247 71099 -18837 -6537 60972 72011 32456 37424 52147 19371 -19743 10200 53954
85 53954 27321 -44250 -60296 -16395 16154 849 -27947 -46951 -49689 -27470 18664 36258
97 36258 -8835 -60284 -39515 25361 42747 -3317 -39068 -30045 -13791 -10230 -1228 2660 -26524
110 -26524 -56597 -30861 20857 17908 -25368 -26470 10431 14351 -6016 11882 40060 9464 -35548
123c5548K9191O0538j2601o4121j5130L5938J4439j0584N359r37l7025j8812M5061
136d232M3875l0856n6901L826M5775J3713k1453j2314J923j711L799J8527O872
149A0843j9694j7255J3692K1577l275j5177k362L750o813r85K1061J4181k1683
162b140k9264R703L5751J4236j4743j3286rK490J0076J9849L18l3828k2725K9154
176E582L7910j5051m3786l434L3516J1641j6605j869J3478l417r365J6486K1835
189D6921j2809k7246K410J8571n284j6517M040M957k2967k1437J8538K9523q799
202I901l0667l086K4928J7388Q8n334o784n413J0411K0810j562k9662j7731J5897
216h16J7960j1249k2723k496J1101K827j607P602N859p968m404J4080J6351l806
$$ plain form
123 -35548 -6357 54181 41580 -22541 -37671 -1733 12706 2122 7481 6544 -30481 -49293 -4232
136 -4232 39643 8787 -48114 -44288 1487 15200 -6253 -18567 -16644 -18355 -14556 3971 10843
149 10843 -8851 -26106 -12414 9163 5888 -9289 -11651 -7901 -14714 -15699 5362 19543 -2140
162 -2140 -31404 -21701 14050 28286 13543 257 248 2738 12814 32663 32981 -847 -23572 5582
176 5582 43492 28441 -15345 -18779 14737 26378 9773 7904 21382 17965 8600 25086 46921
189 46921 34112 6866 9276 27847 22563 6046 10086 15043 -7924 -29361 -10823 18700 9901
202 9901 -20766 -23852 1076 18464 18552 13218 6434 1021 11432 32242 30680 1018 -16713 -816
216 -816 17144 5895 -16828 -19324 -8223 -5396 -7003 599 6458 -1510 -5914 8166 24517 20711
230B0711j0422J874J334j3210o740J4794P756k3035k4408J2736K7960j363k2642
243a4655m124J8508J1964j60N85L33r051l562J4682Q744j9891k5434L276J7927
257h58k485j8167n090O368j480m107Q916J2245j143n429M915P371n00O93O401
272G650k717j4743m070J4031N744j8472j7450P882J6008P79r613j305N160L639
286g477P353J0635r08j4511l338J7759J2777j3650j8656L575J2492m088j1836
299i873L048J0087m333q794N116J2072P24n800K898N763k200j826O074J167j2694
314A429r426Q578J1068q514j7990j723J1247N560n097n597k465J309P255J0494
328F128R4j1562m032J1863Q152q151q046O348O942p410q373L974N785m817o248
$$ plain form
230 20711 10289 12163 13497 287 -6453 8341 16097 -6938 -31346 -18610 9350 7987 -14655
243 -14655 -18779 -271 11693 11533 12118 12451 3400 -162 14520 23264 3373 -22061 -18785 -858
257 -858 -3343 -21510 -26600 -20232 -21712 -25819 -16903 -4658 -5801 -11230 -6315 1056 556 1249 7650
272 7650 4933 -9810 -13880 151 5895 -12577 -30027 -22145 -6137 -5358 -14971 -16276 -11116 -7477
286 -7477 -124 10511 9603 -4908 -8246 9513 22290 8640 -10016 -6441 6051 1963 -9873
299 -9873 -6825 3262 -1071 -9865 -4749 7323 8047 2247 5145 10908 8708 6882 12956 14123 1429
314 1429 -7997 581 11649 3135 -14855 -16578 -5331 229 -4868 -10465 -12930 -11621 -4366 6128
328 6128 6222 -5340 -9372 2491 10643 2492 -5554 794 7736 326 -8047 -4073 1712 -3105 -9353
343i353L922N094k895j643M722P3o681Q45J2860L505j3845r055J2028J5977n281
358A0273j5913k492R760M869l062k147o87l070l69O116J823p520l855P944O630
373H300n900p074M222O589l256o614K650N087j867n938j878O89j29J953J789m091
389e468p217L894J2873L340j0353o210J0349J1546k470p665P96L831j676l314
403B256P02j129o828k438O196J263q113m084P830O151m647l289Q230P831l976
418E955n895L361P230j183o483k530J260j286j7R07l373o871j489Q020N548l878
434g24m571M483O711Ok839K7O49o97L41P91l137o912j298M195jo072j769O225
452d592K893l692j349P402N803l157k781K938L666j378j606N74l350o423j294
$$ plain form
343 -9353 -5431 -337 -3232 -4875 -153 -80 -6761 -5916 6944 10449 -3396 -12451 -423 15554 10273
358 10273 -5640 -8132 1628 6497 3435 1288 601 -2469 -2838 3278 5101 -2419 -6274 1670 8300
373 8300 2400 -4674 -452 6137 2881 -3733 -1083 4004 2137 -3801 -5679 -4990 -5119 -3166 -1377 -5468
389 -5468 -12685 -8791 4082 7422 -2931 -9141 1208 12754 10284 2619 3415 7246 5570 2256
403 2256 2958 1829 -4999 -7437 -1241 22 -8091 -12175 -4345 1806 -2841 -6130 2100 9931 5955
418 5955 60 3421 10651 9468 2985 455 1715 429 412 1319 -2054 -8925 -10414 -2394 3154 -724
434 -724 -5295 -812 5899 5905 3066 3093 3742 3045 3386 4177 1040 -5872 -7170 -2975 -2976 -9048 -10817 -4592
452 -4592 -1699 -5391 -6740 662 6465 3308 527 3465 7131 5753 4147 4721 1371 -5052 -6346
467f346M563l87q709m295O865O385m093n755L571Q398K877j663K9J760l18P22
483C604J344j000m402j313K483o21n763k697M471K316l614k978M361N528M83j978
499B24k67J156J669K255M45l772l995K201M598k910q631k047P149M367m587l940
515f085M202N002m29r09K142K165q21R39K224l07l788k95K276j877o045j181M628
532A841K083m799m071K816N613K9k270P93L934K302J144K43j196j769J702K720
548A1115j044n147k304K417q9l232j880J076P16j620M1K109P98n19J138J928k72
565E231k135J160K548o99m306j650K704O8m072k434K725K070r59j604J601J430
581A678p09J210L967P83l554p92K434J008m233l254M81J137j700k465m66J23m89
$$ plain form
467 -6346 -1783 -2170 -10879 -15174 -8309 -1924 -6017 -11772 -8201 197 3074 1411 1440 3200 2882 3604
483 3604 4948 3948 -454 -1767 716 95 -5668 -8365 -3894 -1578 -5192 -8170 -3809 1719 2202 224
499 224 -43 1113 2782 5037 5482 1710 -2285 -84 4514 1604 -7027 -9074 -1925 2442 -2145 -6085
515 -6085 -1883 3119 2690 1781 3923 6088 5267 6206 8430 8123 4335 4040 6316 4439 -1606 -2787 1841
532 1841 3924 -875 -4946 -2130 3483 3512 1242 2035 5969 8271 9415 9658 8462 6693 8395 11115
548 11115 10071 4924 2620 5037 4948 1716 -164 912 1628 8 49 2158 2956 2437 3575 5503 5231
565 5231 3096 4256 6804 6105 1799 149 2853 2921 -1151 -3585 -860 1210 251 -1353 248 1678
581 1678 969 2179 6146 6929 3375 2583 5017 6025 1792 -1462 -981 156 -1544 -4009 -4475 -4352 -4841
598d841j63J079N94N07K192K959J61j423J095K730k94k894j233R25R46k620k655
615b935j426ok23N66o6j347p65L369L526r32l088R73M653R13k905j615K722J132
633B546k926k141J55J112p03n2Q09l16R7R88K232L71j535J422L462M39l331j834
651G95K084J479j661k734q74P71l21Op45o75N53K205K235l33j83K401K879J09
669G991j570P91J848l38j002o81j8r32j596j357j67r50k65R38P96p32j380J349
687B725K263O15j486J04K728R07k007j349K27q1k276j016k5p39j510j247P56j79
705a590j123j52J527R07n60Q10O72K05j044n96M56n25j108o89j06j518r43J87
723e190Q87p90m74J160K178J032p1K104J338K61m57J573J92j539j271J86r59k406
$$ plain form
598 -4841 -5004 -3925 -3331 -2824 -632 2327 2488 1065 2160 4890 4596 1702 469 1394 2340 -280 -2935
615 -2935 -4361 -4367 -4590 -4024 -4090 -5437 -6202 -2833 693 -239 -3327 -2354 2299 3212 307 -1308 1414 2546
633 2546 -380 -2521 -2366 -1254 -1957 -2009 -1200 -1516 -1419 -431 1801 2172 637 2059 5521 5960 2629 795
651 795 2879 4358 2697 -37 -911 -140 -461 -455 -1200 -1875 -1322 883 3118 2785 2602 5003 7882 7991
669 7991 6421 7212 9060 8722 7720 7039 7021 6089 4493 3136 2969 2019 1754 2692 3488 2756 1376 2725
687 2725 4988 5603 4117 4221 6949 7856 5849 4500 4727 4646 2370 1354 1329 590 -920 -2167 -1411 -1590
705 -1590 -2713 -2865 -1338 -431 -991 -181 491 696 -348 -944 -488 -1013 -2121 -2810 -2916 -4434 -5377 -5190
723 -5190 -4303 -5093 -5567 -4407 -2229 -1197 -1268 836 2174 2435 1978 3551 3743 2204 933 1119 160 -2246
741b246k399m34P71q07j304O34J126M96K12J014K290J164P46J25J81q50p24p12
759g17k75j808j782q24k55m44j470q27J376J261M73N09J456J488J052J124K38
776E75n45k76K14L33j350j295j47N47j161j307J081K427O59N09K155J871J035
793E325P65J325P13n10o13N35j85k551k764J89k14k164j782K98P31M37k18O33
811e0J166J063J209R20J08M50K83p26p48r18j246l45j037j086q41p28N43l6o5
830b084j42J064J288J336M48Q9N06O90p7l1j025l57L77j74j156j134K98L18k73
849c9j76J040J661j92j97N31R08j32k11J73M67j546m29j81j227j613j342J04k86
868b687r95j012O40L82R5J04R36J03N55Q39L65J55L22N80m50j273j42M47j66j167
$$ plain form
741 -2246 -4645 -5079 -4308 -5115 -6419 -5785 -4659 -4163 -3951 -2937 -647 517 1263 1388 1569 719 -5 -717
759 -717 -992 -2800 -4582 -5406 -5661 -6105 -7575 -8402 -7026 -5765 -5292 -4783 -3327 -1839 -787 337 575
776 575 30 -246 -32 301 -1049 -2344 -2491 -1944 -3105 -4412 -3331 -904 -245 264 2419 4290 5325
793 5325 6090 7415 8128 7618 7005 7540 7355 4804 2040 2229 2015 -149 -1931 -1633 -902 -465 -683 -50
811 -50 1116 2179 3388 4308 4416 4866 5149 4423 3675 2757 1511 1166 129 -957 -1798 -2526 -1983 -2019 -2084
830 -2084 -2226 -1162 126 1462 1910 1999 2505 3195 3118 3087 2062 1705 2082 1908 752 -382 -84 234 -39
849 -39 -215 825 2486 2294 2097 2628 3536 3404 3193 3366 3833 2287 1858 1677 450 -1163 -2505 -2401 -2687
868 -2687 -3682 -4694 -4054 -3672 -3577 -3473 -2537 -2434 -1879 -1040 -675 -520 -198 382 -68 -1341 -1483 -1036 -1202 -2369
888b369o19J65N24n74m27J92Q89N12N99L13N75P06N78L94L71L78K71Nk62j63q35
909A223n42L77k67m46k23O34N60m49m61J162R24L41p7L44K29j75p55o98l26r05
929D70m89l58q47j202K41N75p88p39R54J695L81L20J197Q91L41l11R0m57o87j52
949A125j95r39j553j533J0l92r51m01J376J299O66N57M76J316R05K64p3K06O52
968B815m95q91j002p12j10m93q88j87j19Q78K98O38N20O65J234N49Q7j43O07K05
988C456r02j286o32q62m80n69l48m64q5Q84M92j79O22K223J078L64k69O68O86
1007D397p23q99p29K9q91j303q03j370j015l28Q63K32m1R51J397R56j17L26J012
1026A944K66M5k39o56q8p25p38r87l50l52r0m36L24L78P52P65J5J6N15J059K20
$$ plain form
888 -2369 -2988 -2823 -2299 -2873 -3300 -3108 -2219 -1707 -1108 -795 -220 486 1064 1458 1829 2207 2478 2483 2221 2058 1223
909 1223 681 1058 791 345 122 756 1316 867 406 1568 2492 2833 2756 3100 3329 3154 2399 1701 1375 470
929 470 -19 -377 -1224 -2426 -2185 -1610 -2398 -3137 -2183 -488 -107 213 1410 2301 2642 2331 2421 1964 1277 1125
949 1125 930 -9 -1562 -3095 -3085 -3477 -4428 -4829 -3453 -2154 -1488 -931 -455 861 1766 2030 1957 2163 2815
968 2815 2320 1429 427 -285 -395 -888 -1776 -1963 -2082 -1204 -906 -268 252 917 2151 2700 2787 2644 3251 3456
988 3456 2554 1268 636 -226 -706 -1275 -1623 -2087 -2172 -1288 -796 -975 -353 1870 2948 3312 3043 3711 4397
1007 4397 3674 2775 2046 2075 1184 -119 -922 -2292 -3307 -3635 -2772 -2540 -2581 -1630 -233 723 606 932 1944
1026 1944 2210 2255 2016 1360 1272 547 -191 -1178 -1528 -1880 -1970 -2406 -2082 -1704 -952 -187 -172 -156 359 1418 1638
1047A638l71j69mJ1q18r83p15K3K1m09L37L95M4K50P07N32L37P14J234K5q49J92
1069B142j00N58j334j026J11j84j069j002k5L4l53k4j1K77M26N70K85M8N58L92
1089B73M16j27o16n3L26l2j123m41K1p2m75K1J77L1J77L97J85K11K74Q90Q15l76
1111H99l64K35P43l44n61j33K96Q4l02n52K89K69p5R0L57Q36N7P02R00n69k5J82
1133C014K17k83p97o71q5o38j114q33k07k18o66k15K94M05M40M52M03K58M13M91
1153F60O52n22l54j79j02o71p54o16J07l97o17m48N26j32N4K77J320N04N00M68
1173B76O52M2p0J35J95k64r32K5Q6l88q29m60M63M81o73P14Q54P42k13K05N95
1194A636j07j69l08k13n57n92l21n55j109r46m29K70J45m58M98Q86J89M00O72
$$ plain form
1047 1638 1267 1098 1094 1105 287 -696 -1411 -1388 -1367 -1776 -1439 -1044 -1000 -750 -43 489 826 1540 2774 2799 1950 2142
1069 2142 2042 2600 1266 240 351 167 -902 -1904 -1929 -1895 -2248 -2272 -2283 -2006 -1580 -1010 -725 -677 -119 273
1089 273 689 562 -54 -107 219 187 -936 -1377 -1356 -1428 -1903 -1882 -1705 -1674 -1497 -1100 -915 -704 -430 460 1275 899
1111 899 535 770 1513 1169 608 475 771 855 553 1 290 559 484 574 931 1767 1824 2526 3426 2857 2832 3014
1133 3014 3231 2948 2151 1480 1395 757 -357 -1190 -1397 -1615 -2281 -2496 -2202 -1797 -1357 -905 -502 -244 169 660
1153 660 1312 790 436 257 155 -516 -1270 -1886 -1779 -2176 -2793 -3241 -2715 -2847 -2793 -2516 -1196 -692 -192 276
1173 276 928 970 900 1035 1230 966 34 59 145 -243 -1072 -1532 -1069 -588 -1261 -547 307 1049 836 1041 1636
1194 1636 1529 1360 1052 839 282 -310 -631 -1186 -2295 -3241 -3670 -3400 -3255 -3713 -3215 -2329 -2140 -1740 -1068
1213a068R27J52M80L08j94m94k38l69j86q00n64r3j40J7l49K10P39O50J50O91
1233a71P59R28m0M26J06J29j44j18j72q24m07Q5p1k53o59K95P19om3N70O94J41
1255A944P8j54J88l4n47J4n12q51m97n96K07q32n01J92N41L95m21O90M89L52j
1276A44P26K08L50k53l0q2r91k85k11k7r57l18q8J15m44n3L29R28L94j94O44M49
1298C54K17J37J39K70k29m09NK09o06m82l4k30j48l58J60M70P1K24m7K69M11j96
1320A97O8M21j71n98k06l88m25p53M71m76j19j61j76N60n9J77M61N71K66k98Q27
1341A89L94m80j40J53k60j53p68l57J57o93o6j40N9K70L31M28P50k4N28O85O29
1362A492k83j97L21O59j54k57j99r0o07k93k15r4L2K96J13L72k32m7R38R8k44
$$ plain form
1213 -1068 -141 11 491 799 605 111 -127 -496 -682 -1482 -2046 -2139 -2279 -2262 -2611 -2401 -1662 -1012 -862 -171
1233 -171 588 1516 1476 1902 2008 2137 1993 1875 1703 879 472 557 486 233 -426 -131 588 582 539 1109 1803 1944
1255 1944 2022 1868 2056 2022 1475 1489 977 126 -371 -967 -760 -1592 -2093 -1901 -1360 -965 -1386 -696 -207 145 144
1276 144 870 1078 1428 1175 1145 1063 72 -213 -424 -451 -1408 -1726 -1814 -1699 -2143 -2196 -1867 -939 -545 -739 -95 354
1298 354 571 708 847 1117 888 479 484 693 87 -395 -429 -659 -807 -1165 -1005 -535 -464 -240 -287 -18 393 197
1320 197 265 686 515 -83 -289 -677 -1102 -1855 -1384 -1860 -1979 -2140 -2316 -1756 -1815 -1638 -1177 -606 -340 -638 189
1341 189 583 103 -37 116 -144 -297 -1065 -1422 -1265 -1958 -2024 -2164 -2105 -1835 -1504 -1076 -326 -350 178 863 1492
1362 1492 1209 1012 1333 1992 1838 1581 1382 1292 685 392 177 83 115 411 524 896 664 617 1555 1653 1409
1383A409p3L23N02q09n99r1k43J19r94M78n16J18O6p3K92k43L99Q47J73k25j81
1404F79R09Q1m23p69o6K17m92o26k38j54J0k12j05M01j59R93O47L2M22J23N98
1425A868M70j37k14J16j27l94o77l5k65l14o7k26j81M70k99M57M8J34q4N75K63
1446A381k79j91pJ88o56k69m28L42p27j49l44K12J26k40K96K60l7K16K92L32K11
1467E29l59M2Q5p89k92J22p3o29k99J61k7l15l51O90K91L05N00J83N94O1L39J88
1489I56k1j96p4L66o53o46N6m2k06o53j36J62M34j9j99N23O61M30k20K00K65L21
1511A309l75p5j64l21J23l73r1o79k35J43M36n17o2O16N86J2J26l0M92m18k27
1532B76k62j25k58l16L18q13m94j07M9N39r94M02N56P42k30oP27L04K56P5m00
$$ plain form
1383 1409 1336 1659 2161 1352 753 662 419 538 -456 22 -494 -376 -310 -383 -91 -334 65 912 1085 860 679
1404 679 1588 1669 1246 477 411 628 136 -490 -728 -882 -872 -1084 -1189 -788 -947 46 693 725 1147 1270 1868
1425 1868 2338 2201 1987 2103 1976 1582 905 870 605 291 224 -2 -183 287 -12 445 493 627 543 1118 1381
1446 1381 1102 911 904 1092 436 167 -261 81 -646 -795 -1139 -927 -801 -1041 -745 -485 -522 -306 -14 318 529
1467 529 170 212 297 -492 -784 -662 -735 -1364 -1663 -1502 -1529 -1844 -2195 -1505 -1214 -909 -409 -226 368 429 768 956
1489 956 935 739 665 1031 378 -268 -212 -254 -460 -1113 -1249 -1087 -653 -672 -871 -348 313 743 523 723 988 1309
1511 1309 934 859 695 374 497 124 33 -646 -881 -738 -302 -819 -881 -265 321 333 459 429 921 503 276
1532 276 14 -111 -369 -685 -367 -1180 -1674 -1781 -1732 -1193 -2187 -1785 -1229 -487 -717 -723 4 308 564 639 239
1553B39L52j04J18m97m08m75m39N98o55l65K74K87P6K48k90L34J175k62L20k6
1573E00L93m8j51l8o66j54l22L64k57m51m68K20J3n9j44R31K85n45j3K90Q5j02
1595c37j56o7m2p88j26Q9o67j79Q0N8N06k24ON88O16j26K98N09N15l60L29P8k61
1618C39n41N9j76k04Ok77l71J94j22J45M88p6Q0K05N93L44K4n0k3K18j41o43j34
1641f3j7k17l45m76k01k61K76k46J98K14k5L47q6J37j19M10k59j94m16L24M0o52
1663a631k64k29L19k50K95o3J42L61J96P49M1kJ29N85L86m95j82K33l0o05j85
1684e00NN3l25m8O4N2k31L49P0N33j83M68K99J13l40j18M79k66k93m92q3k42k67
1707i03o31J39k71J30qK96j54p1K37J35N0Q0l1J63j01k37J70Q3L6l41o4k26k3
$$ plain form
1553 239 591 487 605 108 -300 -775 -1214 -616 -1271 -1636 -1362 -1075 -999 -751 -1041 -707 468 206 526 500
1573 500 893 845 694 656 -10 -164 -486 -122 -379 -830 -1298 -1078 -1065 -1124 -1268 -337 -52 -597 -610 -320 -235 -337
1595 -337 -493 -560 -602 -1390 -1516 -1427 -2094 -2273 -2193 -2135 -1629 -1853 -1847 -1259 -643 -769 -471 38 553 193 522 600 339
1618 339 -202 -143 -319 -523 -517 -794 -1165 -971 -1093 -948 -460 -536 -456 -251 342 686 710 660 637 855 714 71 -63
1641 -63 -80 -297 -642 -1118 -1319 -1580 -1304 -1550 -1352 -1138 -1163 -816 -902 -765 -884 -474 -733 -927 -1343 -1019 -979 -1631
1663 -1631 -1895 -2124 -1805 -2055 -1760 -1823 -1681 -1320 -1124 -375 -334 -336 -207 378 764 269 87 320 290 -315 -500
1684 -500 -495 -442 -767 -815 -751 -699 -930 -581 -511 22 -161 307 606 719 379 261 740 474 181 -311 -394 -636 -903
1707 -903 -1534 -1395 -1666 -1536 -1544 -1248 -1402 -1473 -1236 -1101 -1051 -971 -1002 -839 -940 -1177 -1007 -924 -888 -1229 -1293 -1519 -1542
1730a542K26K36J00N93k14L25N31r1k40M85K34r4j48j98K54o58m5l43L49j73m07
1751h20J92L33j24m7K74J65N7J74L05k84K20j12J9j67j12m69k30J70k87n90n1
1772a384j04K41l12N6J35L15k47L30j21L03LJ7L53m77O8m8P6O0m94Q3J43M22q8
1795f70j34L17Q7L17QP78k0k88N22l24L03n26L07l99j20k52p2n3q2Mk52J72J74
1818b03J9K48J63L03j4L21m38L28m75o1j99k02j42l04Jo67j77K02J6mn9K35J85
1841i24K04L02p3M29P0O1n2L06m11m7k89k6j23K09k26K00J64o9M14j33L71K55
1863F12L1K55J52j76L5Q5n02j5j55P9m68n33Q2K33q3m4P1M36M1J10J36K90L05
1886I77o17J8K75k89n09k20j41l95Q4k36k54K9k15M69r5M04R0M27l6J47j13M74
$$ plain form
1730 -1542 -1316 -1080 -980 -387 -601 -276 255 164 -76 409 643 549 401 203 457 -201 -246 -589 -240 -413 -820
1751 -820 -628 -295 -419 -466 -192 -27 30 204 509 225 445 333 352 185 73 -396 -626 -456 -743 -1333 -1384
1772 -1384 -1488 -1247 -1559 -1503 -1368 -1053 -1300 -970 -1091 -788 -785 -768 -415 -892 -824 -872 -796 -736 -1230 -1147 -1004 -582 -670
1795 -670 -804 -487 -400 -83 -75 703 683 395 917 593 896 370 677 278 158 -94 -166 -219 -301 -297 -549 -377 -203
1818 -203 -184 64 227 530 516 837 399 727 252 191 -8 -210 -352 -656 -655 -1322 -1499 -1297 -1281 -1285 -1344 -1109 -924
1841 -924 -720 -418 -491 -62 8 69 17 323 -88 -135 -424 -450 -573 -364 -590 -390 -226 -295 119 -14 357 612
1863 612 643 898 1050 874 909 994 492 477 322 401 -67 -600 -518 -285 -368 -412 -341 95 136 246 382 672 977
1886 977 360 378 653 364 -145 -365 -506 -901 -817 -1053 -1307 -1278 -1493 -1024 -1119 -715 -625 -198 -234 -87 -200 274
1908B74L15l54M84q26O8K65k25k91J53j04l9K49K50n3K67O4K54L06j91J43p8L11
1930A242m18k77l57L30M4o29K4n7Q3j85K38J14q9L36K79l50K59Q4J58m95L18j07
1952E45p1Q1o20q3J53j19m11j4K08K8J78P5J79l8M09J90j0J08p0K14Q1J08k85
1975H36K47k41oj31k86q4J28j39J97Kj03l7M26k68J66j97pJ66j71j45k52n4J98
1998B45l39J9q7k89J7l7q2R2M8J29J45Nj09K03j07J24k8K41m26J72m24k3k08K75
2022d44l33k83K43j39J40L12l2K20L30L21J27J80j74M12K06o3m26j19K5l65J52
2043B90L4M9m40j14n1K87K29K15K71j73L32j5p9M33p02M18k78q2n84O6m9Q2l32
2066a93j6j33K99J66j17L35J89O8J21N0J1l46R9o3k77p0m74L7k72K88l93K04K31
$$ plain form
1908 274 589 235 719 -107 -39 226 1 -290 -137 -241 -280 -31 219 166 433 497 751 1057 866 1009 931 1242
1930 1242 824 547 190 520 564 -65 -41 -98 -15 -200 38 152 63 399 678 328 587 671 829 334 652 545
1952 545 474 555 -65 -148 5 -114 -525 -539 -331 -303 -125 -50 129 91 500 690 680 788 718 932 1013 1121 836
1975 836 1083 842 836 705 419 335 463 324 521 523 420 383 809 541 707 510 503 669 498 353 101 47 245
1998 245 -94 -75 -162 -451 -434 -471 -553 -461 -413 -284 -139 -134 -243 -40 -147 -23 -51 190 -236 -64 -488 -511 -719 -444
2022 -444 -777 -1060 -817 -956 -816 -504 -536 -316 14 335 462 642 468 880 1086 1023 597 478 503 138 290
2043 290 324 373 -67 -181 -232 55 284 499 770 597 929 914 835 1268 566 984 706 624 40 106 57 139 -193
2066 -193 -209 -342 -43 123 6 341 530 598 719 769 780 434 533 470 193 123 -351 -314 -586 -298 -691 -487 -256
2089b56J95Q9J89J08J17Q0J60K29J1Q5l92J1l8k63k36o8m08K36j15n7K33j75q3
2112c48L48J32K82j78K16l6o1O3k94R6j50J12l87Q0l77M33k95Q6l7J29L07J8P2
2135B11j95K64K5l37K60j92l37j6O9l03n6k09M67jm09M22Rq6J96j01kP01l05K30
2159C05l30J42J1k59K38k79J9j27O6O9k69n27J83O02k34J66J40j52K80J0M0o2
2181C2L44l57K9J4J54j97j46M28m04o4J15p4J29pk26J65K32k45R1j92N08O2M8
2204D39j43n03M58l78L05n7l32k57L69Q2K1k25J04J95J33k86L57l17K94J23K29
2225F11j94k80R1j54Q9l70m04K35N1j8k21J27K53j68O64n32K52K77J00M7n48J43
2247E1m2L66k81N5J24o03M6J14j51p6N1J70n8J89k13K54J97J70j87K2l7J20J7
$$ plain form
2089 -256 -61 28 217 325 442 522 682 911 922 1007 615 626 588 325 89 21 -387 -151 -266 -323 -90 -265 -348
2112 -348 0 132 414 236 452 416 355 418 124 220 70 182 -205 -125 -502 -69 -364 -278 -315 -186 121 139 211
2135 211 16 280 305 -32 228 36 -301 -317 -248 -551 -607 -816 -349 -350 -759 -337 -328 -414 -218 -319 -321 380 75 305
2159 305 -25 117 128 -131 107 -172 -153 -280 -214 -145 -414 -941 -758 -156 -390 -224 -84 -236 44 54 94 32
2181 32 376 19 48 62 216 19 -127 301 -103 -167 -52 -126 3 -4 -230 -65 167 -78 13 -179 329 391 439
2204 439 296 -207 251 -127 178 121 -211 -468 -99 -17 4 -221 -117 78 211 -75 282 -35 259 382 611
2225 611 417 137 228 74 163 -207 -611 -376 -325 -343 -564 -437 -184 -352 312 -220 32 309 409 456 -92 51
2247 51 9 375 94 149 273 -330 -284 -170 -321 -397 -346 -176 -234 -45 -258 -4 193 363 176 198 161 281 298
2270B98m92L7q8J30m11k9l14O51M5r1K11J25K29M10m52j59K11J45k3p5m16j14
2292a72K99m43j3k06rJ36J06K32j67m0J06Q78l00O2k24L54n9j93q5jj53j0k21
2315a23j91K38j63L05k71O9o3K68J61L89q89N60k00J63j21j91j67L73k14l14J71
2336b10k25J3Q8K64O2k86kN01j0n8l85N54j02K93l45k12J0M02n61nJ06l48R5J97
2360a64j20k19M47J25J02o2k96J37N35j4P3n06J44K93k31j03j69%N5n1l92J37
2382b79q6K10L03k46J36l25M57K12o1j38m03P28j3k01p33K43J88K86k08k94OK38
2404B0km41J32K31L70K0j79k66J39m7M4Q8k90L0K86j69on61J43K85j7J94K2J05
2428A31j7K12O9l59J91K38L76k50p09J12L01R3o99K48j77M21k30l37m2K31K45
$$ plain form
2270 298 -194 -157 -245 -115 -526 -555 -869 -218 -173 -264 -53 72 301 711 259 100 311 456 433 358 -58 -172
2292 -172 127 -316 -329 -535 -544 -408 -302 -70 -237 -277 -171 707 407 469 245 599 540 347 262 261 108 98 -123
2315 -123 -314 -76 -239 66 -205 -136 -199 69 230 619 -270 290 90 253 132 -59 -226 147 -67 -381 -210
2336 -210 -435 -422 -334 -70 -8 -294 -296 205 195 137 -248 306 204 497 152 -60 -50 352 -209 -214 -108 -456 -361 -164
2360 -164 -284 -503 -56 69 171 109 -187 -50 485 471 544 38 182 475 244 141 -28 -28 27 -24 -416 -279
2382 -279 -365 -155 148 -98 38 -287 170 382 321 183 -220 508 495 294 -439 -196 -8 278 70 -224 -218 20
2404 20 18 -423 -291 -60 310 330 151 -115 24 -23 21 109 -181 -151 135 -34 -40 -601 -458 -173 -190 4 26 131
2428 131 114 326 395 36 227 465 841 591 -118 -6 295 388 -311 -63 -240 181 -49 -386 -428 -197 48
2449D8L07m97J9L58K52k17O4K4k00J66M19o26q5l06P6M57k02o01M04LM06J74n36
2472i3J21N1L29o3l20Q9J18o7J25n16R8J50k44Q6n9j91K31K05J81l84M0L07K51
2495D45m8n02K36r7N21m98k31J62jn8j72k67J68K83k71J51K3J50N1K51q8j91J57
2518A74j11J86q6j31J17j62L7K6j29j08N2J59n0k5n9K90r7J51k97J85Ql08J94
2541A6m50j33K89K47N9n52P9J92J01J22n12J56L93L92n90J48j40J37L84J28j95
2562B71l31j54Q9J26l83r0L12K0k24j33k1K81M34j7j31o7M07Q4j36k61ORK16k3
2586B84l25j09N6K47k0m03r3M75j55K57K2k76K62L26j60j29j07K67K65q2m45l43
2608a86K46j9Q5M5l96J65M12l71J03J17J60J27j66Qj38J86L2r2m01o1qR5J10l73
$$ plain form
2449 48 355 -142 -123 235 487 270 334 358 158 324 743 117 32 -274 -198 259 57 -544 -140 -137 269 443 -93
2472 -93 28 79 408 345 25 114 232 165 290 -226 -128 22 -222 -136 -195 -386 -155 50 231 -153 -113 194 445
2495 445 397 -105 131 34 555 57 -174 -12 -13 -71 -243 -510 -342 -59 -330 -179 -156 -6 45 296 208 17 174
2518 174 63 249 163 32 149 -13 24 50 -79 -187 -135 24 -26 -51 -110 180 83 234 -63 122 130 -178 16
2541 16 -434 -567 -278 -31 28 -524 -445 -253 -152 -30 -542 -386 7 399 -191 -43 -183 -46 338 466 271
2562 271 -60 -214 -125 1 -382 -472 -160 -140 -364 -497 -518 -237 197 180 49 -18 389 473 337 76 82 91 307 284
2586 284 -41 -150 -94 153 133 -270 -363 112 -43 214 236 -40 222 548 388 259 152 419 684 602 157 -186
2608 -186 60 41 126 171 -225 -60 352 -19 84 201 361 488 322 330 192 378 410 318 -83 -144 -152 -57 53 -320
2632c20J17j00J32O8L3j53j62P70k07j26j05J74P9J35m69l3L3q8k7l38j1K82q1
2655c97J0j82L52l78L80L41k21k24Q8L12j18j18l20K08M04j11n50o3L15M7n0K27
2677d8l60o8P86J4m83k44K47K20M38m45k73K74J09k20P4k07l7J22J81K4m83L17
2699f2M38m2k88J47J22M7L76j97o28K16K00q9Qk91J89j55o5k1o1k39N12M9o8n29
2723d31K31K78J93k02k84N3M02J51j35j20n38N87J26j70l46o8J93J13J6j55l3
2744a39L64L41k64j24j72M88L9j09p04M94J46j64q2j08k64J69J90J4Q2l26M31
2765C02L34m72L8J0L25l36J13l8k66J84o6j47k87k22N15J12n29L95j32r8L69j33
2787b9k48J17L70nj44k39k4K22J06J1l17j79J86N1L4k03j2K19K20p6M4k80K50
$$ plain form
2632 -320 -203 -303 -171 -103 -70 -223 -385 385 178 52 -53 121 200 335 -134 -167 -134 -222 -249 -587 -598 -316 -397
2655 -397 -387 -569 -217 -595 -215 126 -95 -319 -231 81 -37 -155 -475 -267 137 26 -524 -587 -272 -225 -275 -48
2677 -48 -408 -476 310 324 -159 -403 -156 64 502 57 -216 58 167 -53 21 -186 -223 -101 80 104 -379 -62
2699 -62 376 334 46 193 315 362 738 541 -87 129 329 240 248 -43 146 -9 -74 -95 -156 -395 117 166 98 -431
2723 -431 -200 78 271 69 -215 -162 240 391 256 136 -402 185 311 141 -205 -273 -80 33 49 -106 -139
2744 -139 225 566 302 178 6 494 533 424 -280 214 360 196 114 6 -258 -89 101 115 197 -129 302
2765 302 636 164 202 212 537 201 314 276 10 194 128 -19 -306 -528 -13 99 -430 -35 -167 -265 104 -29
2787 -29 -277 -160 210 205 61 -178 -202 20 126 137 -180 -359 -173 -122 -88 -291 -303 -84 136 60 104 -176 74
2810G4K19j79k40N6J25K22j08j03k34M1K31K1n23l8K08J80l8j17K70k3K43J61
2832D48j82j47M9K51l69j50m25M02J7j44l5j75N6L56j93k2J2L35P9k0L2k68K00
2855A07J98l63K94j72r9N54m68j78l15K27M95l04R0j64N49k84L57l47p3J61J05
2876C70p6n8l5q1R9J22j78k73m5K32j9o7P1qM49m53M5R9j98K74k3k09l9J37O1
2901A97l5k44J3j31J78k29K5J34K34q6k73L35p2K84J01Q3l50j15K82J40k45j78
2923D8l56K24J91Q6P1j54o8Q9K43k64K16k86P61o73m9j26J44K45m05J73n7Nj08
2946e0K59j99J06l60M35k39J57K60n53L66K07k05j84p8J14k8j40P7r5J74K71m03
2968a08j37K94m4lq4Q0j31L71O0j67J32k45K1L16m40OJ20K81m33J33k44j24K13
$$ plain form
2810 74 293 114 -126 -70 55 277 169 66 -168 -127 104 125 -398 -436 -228 -48 -86 -203 67 44 287 448
2832 448 266 119 168 419 50 -100 -525 -123 -106 -250 -285 -460 -404 -48 -241 -263 -251 84 163 143 175 -93 107
2855 107 305 -58 236 64 -35 519 51 -127 -442 -215 280 -24 66 -98 451 167 524 177 104 265 370
2876 370 294 236 201 120 219 341 163 -110 -155 77 58 -9 62 54 503 50 95 194 -4 270 247 38 -1 136 197
2901 197 162 -82 -69 -200 -22 -251 -226 -92 142 56 -217 118 46 330 431 514 164 49 331 471 226 48
2923 48 -308 -84 107 193 264 110 42 131 374 110 326 40 801 128 79 -47 97 342 -63 110 53 58 -50
2946 -50 209 10 116 -244 191 -48 109 369 -184 182 389 184 0 -78 36 8 -132 -55 -150 24 295 -108
2968 -108 -245 49 5 2 -82 -2 -133 238 298 131 263 18 39 355 -85 -79 41 322 -111 22 -222 -346 -133
2991a33L22k79N8J47n6J62r3P3k21R9k22N07o1m54N6o3M2l0K22J02k63L2Jk19
3015b71L95J95n55K19Oj4j89M05k97l21N28q1M1k73l5M25l19J48j5N3K38k54p9
3038e0J41l80L79L3k9M1k7Q8J27l44K11j27l14O00l89j6J43p8K00l40j05L67J00
3061B31j42l6ml0K43J49k30L18m87j42K07j19J60j13Ln3M05l68K0m2J3J09q5K62
3085B69l67K49p7N4l66K42k08q5R5j73M62j03L31k55p5J49O9K39n83K13K5J7j82
3108f0J45l0l51M16l40J44L3M4J05j07K4J77j19j07J20p3J43j11O4m55K07O9j05
3131a67J73l6p9O9J01l1J06j71j62p5kJ13L15j87L08m15J69j0j99L13j51K8J55
3154A65o19M18N0m8l3j95J19j43L35m56o6L20J91J72k01K68l00p1N2k2j5j42L76
$$ plain form
2991 -133 189 -90 -32 115 59 221 128 201 -20 79 -143 364 303 -151 -95 -158 -116 -146 76 178 -85 -53 -52 -271
3015 -271 124 319 -236 -17 -11 -25 -214 191 -106 -427 101 20 61 -212 -247 178 -141 7 -8 45 283 29 -50
3038 -50 91 -289 90 123 94 135 108 196 323 -21 190 63 -251 349 -40 -56 87 9 209 -131 -236 131 231
3061 231 89 53 49 19 262 411 181 499 12 -130 77 -42 118 5 8 -45 360 -8 12 -30 -17 92 7 269
3085 269 -98 151 74 128 -238 4 -204 -289 -194 -367 95 -8 323 68 -7 142 211 450 -133 80 105 122 -60
3108 -60 85 55 -296 120 -220 -76 -43 1 106 -1 23 200 81 -26 94 21 164 53 117 -338 -131 -62 -167
3131 -167 6 -30 -109 -40 61 30 136 -35 -197 -272 -274 -161 154 -33 275 -140 29 19 -180 133 -18 10 165
3154 165 -454 -36 14 -34 -67 -262 -143 -286 49 -407 -473 -153 38 210 9 277 -23 -94 -42 -64 -79 -221 155
3177A55k50j41O7J95j63R2J00PK74m69L72Q6j4j52j07L16Ml12m8L0l39L00o3k36
3201b96K41J69j31N1N6n8O3N5K44m48j72P8M3J1n9M85l85l4K24j06m9J65j16j84
3225a53k2O0J90j25J64n6O4L41j50m59O49p94R3O0NJ69l1N3j63J49n6K41l10M47
3249C66l54K13R1l13J85J50n5j4L2j90r3L14M7k46J78l90J23L03k46J9R5K9l40
3272i6K18J89j20pN9N2R3n45K71J33o9j37j18k73m0K12J61K35j32Q3k17k56L1
3295b73L78k14L91m14L6j00J47K9j74N2K4O0J68O3j99k38J26J6L68m07j75L55
3317A9K28p6K7j37j18K88l45J61Qn9K25M4l75k2J74p4k46K60j24L34q6M6l64K78
3341F6L4R5l24J77l46M54k45K50om09OK24k40K62j56J25K09p0L8k26m7L27j86
$$ plain form
3177 155 -95 -236 -169 26 -137 -45 55 62 336 -133 239 325 311 159 52 368 372 60 12 42 -297 3 -60 -296
3201 -296 -55 114 -17 34 90 32 95 150 394 -54 -226 -148 -105 -94 -153 332 -53 -87 137 31 -18 147 31 -153
3225 -153 -175 -115 75 -50 114 58 122 463 313 -146 503 -291 -198 -138 -133 36 5 58 -105 44 -12 229 -81 366
3249 366 12 225 316 3 188 338 283 269 301 111 18 332 379 133 311 -79 44 347 101 120 215 244 -96
3272 -96 122 311 191 184 243 295 388 -157 114 247 178 41 -77 -350 -390 -178 -17 218 86 169 -48 -304 -273
3295 -273 105 -109 282 -132 -96 -196 -49 -20 -194 -142 -118 -58 110 173 -26 -264 -138 -122 246 -161 -336 19
3317 19 247 171 198 61 -57 231 -114 47 55 -4 221 265 -110 -132 42 -32 -278 -18 -142 192 106 152 -212 66
3341 66 100 195 -129 48 -298 156 -89 161 155 -254 -248 -24 -264 -2 -158 -33 176 106 144 -82 -129 198 12
3364A2o3j35j0L54k97J12J36Q6N7J28j3k12k11N4J86R3L13l15m6j33j88O1K42
3387B11l56J57m9R8j7j96P3J62J36j50k00N63l39N8l28Q4r4J08M7l32M26j18j00
3410a56P7k7k08J53R8J29j72P5J41k46j90M04j44k5P5j05N1o8PL11k81k6Q1M6
3434@J12p8j7R0L48k80l3K44o18L34J73j29J5j45J73l2q8j61PJm4L21j8k82k26
3459c33K97K30j51k86K69J93l6j60J45L3m23Q9J17OJ93k68K2j97J5J98Q7Q0n92
3482d72O57l17M07l60j09L08J86k83l51N08j41Lj9mK43l48L34rj60K63j79k9R2
3505B20k57J64L10k90L3J37k36L46k26m0j98J51j96J02P9j23RK06l17L97n83M58
3527A46j01o0o6j59L67r1n2l51O67l25O9j89j26N0K01j92L47j76L11k76o4J90
$$ plain form
3364 12 -51 -186 -196 158 -139 -27 109 195 252 380 367 155 -56 -2 184 277 590 275 229 96 -92 -31 211
3387 211 -145 12 -37 61 44 -152 -79 83 219 69 -131 432 93 151 -177 -93 -187 -79 -32 -364 62 -56 -156
3410 -156 -79 -106 -314 -161 -63 66 -106 -31 110 -136 -326 78 -66 -91 -16 -121 -70 -138 -131 180 -101 -127 -46 0
3434 0 112 34 17 107 455 175 142 386 -232 102 275 146 161 16 189 157 69 -92 -85 -84 -128 193 175 -107 -333
3459 -333 -36 194 43 -243 26 219 183 23 168 201 -222 -133 -16 -10 183 -85 -63 -260 -245 -47 40 120 -472
3482 -472 185 -132 275 -85 -194 114 300 17 -334 174 33 36 17 13 256 -92 242 233 73 336 157 128 220
3505 220 -37 127 437 147 180 317 81 427 201 161 -37 114 -82 20 99 -24 -15 191 -126 271 -312 146
3527 146 45 -15 -81 -240 127 36 -16 -367 300 -25 44 -145 -271 -221 -20 -212 135 -41 270 -6 -70 120
3549A20j08J10J58l28J59j81Q7J10K5n2mj66L2O5J58m7o0J0J88l51J26n2J00l42
3573b43P3L38J6l19Q3J64k4j56K9j32L4r5N5J43J25k12j13K98k71L40j4l27Q1
3596a27R8j76j47J75r5L99n00M69m74O83j49j32l3k28J3J84K1N0l3J1j78P8J40
3619D9j65MR9n9j8n0J46Q4q5j54L0J24P3j9l41J06OJ13J98n6k30Q7k7j80q7O5
3645b87J28K20j97P3p8n8K36j94j48L47P0j78p3O6J6J9P5M4k03k32L68j91J24
3668e3k26L22K2KQj97j83N26m03P8J16k2j50J05K52k35p6L5J7R8n2J0p0L4K05
3693A63k64J00J94K93l46j13j9K79l59J84j20K99n07J96Q8j5r5O2M4q7L6j32Q4
3716c5O7n4j44L06j73K31j93r7M7l0k34K66M3J37j7j51r6L3J88r9p4J85J35k56
$$ plain form
3549 120 12 122 280 -48 111 -70 17 127 152 100 96 -70 -38 27 185 138 78 88 276 -75 51 -1 99 -243
3573 -243 -170 168 184 -135 -52 112 88 -68 -39 -171 -137 -232 -177 -34 91 -121 -234 64 -207 133 119 -208 -127
3596 -127 -29 -205 -352 -177 -272 127 -373 96 -378 305 156 24 -9 -237 -224 -40 -19 31 -2 9 -169 -91 49
3619 49 -116 -112 -13 -72 -90 -140 6 90 5 -149 -119 5 78 59 -282 -176 -170 -57 141 85 -145 -58 -85 -265 -352 -287
3645 -287 -159 61 -136 -63 -141 -199 37 -157 -305 42 112 -66 -139 -73 -57 -38 37 81 -122 -354 14 -177 -53
3668 -53 -279 43 65 67 75 -122 -305 221 -182 -104 12 -10 -160 -55 197 -38 -114 -79 -62 36 -16 -6 -76 -42 163
3693 163 -101 -1 193 486 140 27 8 287 -72 112 -8 291 -216 -20 68 53 -42 20 64 -23 13 -119 -35
3716 -35 32 -22 -166 140 -33 198 5 -92 -45 -75 -309 -43 0 137 120 -31 -127 -94 94 -5 -79 106 241 -15
3740a5l03L72O9j64l4j07J79N8j67l4J62m5L23k70k74K24L52r3k28K32l32J6j03
3763a82M28r6N3J47k12l59N01K9l2l9j90k29L39n79L42L22J02m78p7J92mPk09
3786b24L34r8r7m0k1J39j56J31J56Rp4L3j79J72j25k6R4j39P4j89K31k11Pj44
3810c43L90J13q2m12L57K48l75JK59k20K31nj96L57n84K99o1r%O0j23n9k2J11
3834f5N5R7R0l42M2L63p2k50l0j08M13j48j88Lj09L21Kj77N8Lj74J61J74q8p9
3859d8J47j26J4m4P1j76K10J44j26j16J92k84K44L1m33J30L29k44r4J18O4j56
3881a53J3J09MM7r7J85k01r4K36j47Q5J00l49K12j50Q0q1R2N6J0J72k52O9MPJ18
3907G5j88Rk8K59k00L26l72J37j05k27K39L5jj07L9P3j8k8M6J5k07J98L64l78
$$ plain form
3740 -15 -318 54 123 -41 -75 -182 -3 55 -112 -146 16 -29 294 24 -250 -26 326 233 5 237 -95 -79 -182
3763 -182 246 150 203 350 138 -221 280 309 277 238 48 -181 158 -421 -79 243 345 -133 -210 -18 -22 -15 -224
3786 -224 110 12 -85 -125 -146 -7 -163 -32 124 133 59 92 -87 85 -40 -66 28 -111 -37 -226 5 -206 -199 -343
3810 -343 47 160 78 -334 23 271 -104 -103 156 -64 167 162 -34 323 -261 38 -23 -32 -32 28 -95 -154 -176 -65
3834 -65 -10 87 177 -165 -123 240 168 -82 -112 -220 193 45 -143 -140 -249 72 74 -103 -45 -42 -216 -55 119 31 -48
3859 -48 99 -27 -13 -57 14 -162 48 192 66 -50 142 -142 102 133 -300 -170 159 -85 -179 -61 3 -153
3881 -153 -140 -31 -27 20 -77 108 -93 -187 49 -98 -13 87 -262 -50 -200 -120 -201 -109 -53 -43 129 -123 -54 -50 -43 75
3907 75 -113 -104 -132 127 -73 253 -119 18 -87 -314 -75 -40 -41 -148 -109 -36 -54 -82 -36 -21 -228 -30 334 -44
3931d4L01j49k11L45k41Q9j46j7L0K90m11K80o9J3L1r4K0m4M5J09j06J1q1J6K91
3956B58k01Nl65K38n0N1K19k68K2M2R4m01Q5J32J53n2K10O0n1k62R2J00p1j04
3980f4K15j57l08M32Lj73K64Q7j62J67m00J17j21J00nP4n4j67o8K43k82J33K16
4003I0k45K31K23m75j20L64l04j28O2R5J61K5P8j06j8n8J23r1N1K09k76M14m56
4026a51K00l48J09J2K94l37R1m5K56Q1l30N57m40J74M8j00j7j39m3K82k56k81
4048c83N18j76j49M10m17K6K74K18j07M0j82j90L18n9m25L1J89o4m0J83K76l67
4070g6K37n7Mk42K14k18J86p1j09K35k99L17j01p4q4K01m6k70L52k71J88L3K11
4093B60lp57N29oj42J06J44j23K29m78J13J24K94j00j24m4J70l56K65J34j46j94
$$ plain form
3931 -44 257 108 -103 242 1 90 -56 -73 -43 247 -164 116 47 60 91 -3 17 -27 18 127 21 32 -49 -33 258
3956 258 57 62 -303 -65 -115 -64 155 -113 -91 -49 45 -356 -271 -139 14 -38 172 232 181 -81 11 111 40 -64
3980 -64 151 -6 -314 118 121 -52 212 299 137 304 -96 21 -100 0 -5 69 15 -152 -220 23 -259 -126 90
4003 90 -155 76 299 -176 -296 68 -236 -364 -302 -207 -46 -21 57 -49 -67 -125 -2 -93 -42 167 -109 305 -151
4026 -151 49 -299 -190 -178 116 -221 -130 -175 81 162 -168 389 -51 123 171 71 54 -85 -128 154 -102 -383
4048 -383 135 -41 -190 220 -197 -171 103 321 214 254 72 -118 200 141 -284 -253 -64 -128 -168 15 291 -76
4070 -76 161 104 108 -134 80 -138 48 -23 -132 103 -196 121 20 -54 -138 63 17 -253 99 -172 16 49 260
4093 260 257 -500 29 23 -119 -13 131 8 237 -241 -128 -4 290 190 66 22 192 -164 101 235 89 -105
4115a05K48m2M3j97L10j41r7M5j98M66k22j01j39L6K85p3j09q4L67l04o8M70l97
4138gN7j55J75j1L1m8k14J82k08J03M03l60J69M0j92J66J35k18R8K4l66K81R1
4161A76k53K14K5l22K78J25j74k15K27o7J78l30L05k1k92K92q8r5L15l97m9J49
4183a9Q8j62J02J78r1q5p7k13M04j12oJ05k08K43j94k07J38L8n3N7J4J01K74l38
4207b3O5K66K9l05j83J99j93M40l43R9k74JJ76K3P4j28R9j36r9K37J11k69j6M30
4231B80j43j41J14m5J49j24n20O13j14j6K32l21n9L12l24j36L84m21J47J73m5
4252ej2Q3j95K13j77L10m0j15o4J92k34j28J64k9N2N9k90M1J74J42k51M9J64J05
4276B08j77n3J53l84J32M40l94k64L19j24J03k7M5n5m1M5M9M5l29R0J09J27m1
$$ plain form
4115 -105 143 101 144 -53 257 116 19 64 -134 332 110 9 -130 -94 191 118 9 -75 292 -12 -80 390 -7
4138 -7 50 -105 70 59 90 42 -172 10 -198 -95 308 -52 117 157 -35 131 266 48 146 170 -196 85 176
4161 176 -77 137 162 -160 118 243 69 -146 81 14 192 -138 167 146 -146 146 58 -37 278 -119 -168 -19
4183 -19 69 -93 9 187 96 11 -66 -279 125 13 7 112 -96 147 -47 -254 -116 -78 -131 -74 -60 41 315 -23
4207 -23 42 308 337 32 -151 48 -145 295 -48 51 -223 -222 -46 -23 51 -77 22 -114 -213 24 135 -134 -150 280
4231 280 137 -4 110 65 214 90 -430 183 69 53 285 -36 -95 217 -107 -243 141 -280 -133 40 -5
4252 -5 -17 66 -129 84 -93 217 177 62 -2 190 -44 -172 -8 -37 15 74 -216 -175 -1 141 -110 -61 103 208
4276 208 31 -22 131 -253 -121 319 -75 -339 -20 -144 -41 -68 -23 -78 -119 -74 -25 20 -309 -219 -110 17 -24
4299b4J29k14J6L63k02Q5r3m1q8J35K4r2j79k3K24o6K1L21k24Rk45J19l8Q3%J27
4325A27k95L89j89Pk79K32j07P8ln9Q8j11K80m01M83k51J86k03N4m0k69L04r8
4348g7j1P4r7L23Q6l43j22j34J72r7J23P0L12o38K18R8j46J43K56lm4k62J00J19
4372A20j44J07m20K57j02N2L65l17n9L60J28k80j73K58j87N5J20j04J78k71j97
4393b54K54J95j64q1k30K24r7j05O87n47p6M37j34j89j3l0K18j35K19j54k97J8
4415b54N00m14J80Q9j50n0PK69J08k84j18J72J16L7l48J99J9o0l3l13M24K5j26
4438eJ12M3k2j14k93L17M0k98K76J7K61m72K27l9J37l61jJ01j0R7Q0l3l31L14
4462D3J49Mj86O2m51M79k29J94j48J38j1j24O6j64R6L46l11j21R8K78j55J4l8
$$ plain form
4299 -24 105 -109 -93 270 68 153 60 19 -69 66 90 -2 -181 -204 20 -46 -25 296 72 81 -164 -45 -83 0 0 127
4325 127 -168 221 32 39 -240 -8 -115 -37 -40 -99 -11 -122 158 -243 240 -11 175 -28 26 -14 -283 21 -77
4348 -77 -88 -14 -111 212 298 -45 -167 -301 -129 -226 -103 -33 279 -359 -141 -43 -189 -46 210 207 163 -99 1 120
4372 120 -24 83 -337 -80 -182 -130 235 -82 -141 219 347 67 -106 152 -35 20 140 36 214 -57 -254
4393 -254 0 195 31 -50 -280 -56 -153 -258 429 -118 -194 243 109 -80 -93 -123 95 -40 179 25 -272 -254
4415 -254 246 -168 12 101 -49 -99 -92 177 285 1 -117 55 171 208 -140 59 78 18 -15 -328 96 121 -5
4438 -5 107 150 128 14 -279 38 78 -220 56 73 334 -138 89 50 187 -174 -175 -74 -84 13 93 60 -271 43
4462 43 192 196 10 72 -379 100 -129 65 -83 55 44 -80 -14 -178 -82 264 -47 -168 -70 208 53 67 29
4485B9r5k06J55L35k30J01j88J02P9r2j15ML35n07K64L0J25J76k96J60k33m6p0
4508a83J20J05j63K54p2Mm28L75J91k44k8k4R5k7Q8Q5k82L1J11j45K0j84K87l6
4532e0K63l16j18L77l02M92m44J94j55J03O7j19p4L55J4l72L24l87K58K6j02l8
4554dO3k18r1K46L10j71k74l1L72q8k25j32L88pq0J22k09m6%J55j32n1LK12j84
4579g2m5M49l92N3k64K74J57k24K10j44l4k5o2K0J98N2o9k12M73o1j24j50k38
4602b30K84J54j43q0k71K83o6n2o4J63J20j11n2mJ2m7Q9j08J47j4K86k51r8l32
4626c85J96J2M01o09R4K74j35J60O2%L18n19q8K40o3J58j47K27Jl46K05j86M2
4649h8J8M7J77k65K2K44k16on2M5K07k44Q8N5j91K90j17j01K6JQ4K7p1J95j03
$$ plain form
4485 29 -66 -272 -117 218 -12 89 -99 3 82 -10 -125 -121 214 -293 -29 1 126 302 6 166 -67 -113 -183
4508 -183 -63 42 -121 133 61 65 -363 12 203 -41 -69 -93 2 -25 63 148 -134 -103 8 -137 -117 -301 -14 -50
4532 -50 213 -103 -221 156 -146 346 -98 96 -59 44 111 -8 -82 273 287 -85 239 -148 110 136 34 -4
4554 -4 59 -159 -250 -4 306 135 -139 -170 202 114 -111 -243 145 138 58 180 -29 -75 -75 80 -52 -103 -100 112 -72
4579 -72 -117 332 -60 -7 -271 3 160 -64 146 2 -32 -57 -119 -99 99 151 82 -130 343 282 158 8 -230
4602 -230 54 208 65 -15 -286 -3 -69 -121 -185 -22 98 -13 -65 -69 -57 -104 -15 -123 24 10 296 45 -53 -385
4626 -385 -189 -177 224 -385 -291 -17 -152 8 70 70 388 -131 -219 21 -42 116 -31 196 197 -149 56 -130 -88
4649 -88 -70 -23 154 -111 -89 155 -61 -67 -119 -74 133 -111 -23 32 -159 131 14 -87 -61 -60 24 51 -20 175 72
4674G2j28k77N36k15l15N49k57J0m2L4J17J91l78K55m66L32r4K90j4k23q3R5J36
4697A25l90J91q9L05k62J79O9k38K26j05K33l21Q2o3J33M9J14j75k09j42K63J53
4719A28l2m10K64K33k73J24j28M21o01L61l26L19k34J15MRj04j7L51j31J1l17
4741b33L33k80K12j60J23K69m83L11J26k50k7mK5k08N15k03j08M7M4j15J1KJ63
4764A10k74J60j16K80j49N8k1l76K06J73N2k1j06J39l68K58K1j21O7k15K26J48
4786A31r7k11J3K45J11j66m8r0J13nL43k35L3r9k89k8K04k3O3j19K26l37K82J54
4810A71k51k94N77p1pk17k9J85q7L7o1j63J86j02K27l05K10o4j24K47j92J74o5
4833a8L84o56J92K83j40j03J08J8qk20N4J30r6mN2M8j19J72j47N0L17k41j35j85
$$ plain form
4674 72 -56 -333 203 -12 -327 222 -35 -25 -67 -33 84 275 -103 152 -314 18 -76 214 200 -23 -106 -11 125
4697 125 -265 -74 -163 142 -120 59 128 -110 116 11 244 -77 5 -58 75 124 238 63 -146 -288 -25 128
4719 128 96 -314 -50 183 -90 34 -94 327 -274 87 -239 80 -154 -39 -35 -26 -130 -147 204 73 84 -233
4741 -233 100 -180 32 -128 -5 264 -219 92 218 -32 -59 -63 -38 -246 269 66 -42 5 49 -66 -55 -53 110
4764 110 -164 -4 -120 160 11 69 48 -328 -122 51 103 82 -24 115 -253 5 26 -95 -28 -243 -17 131
4786 131 34 -177 -164 81 192 26 -22 -112 1 -4 339 104 137 38 -251 -279 -75 -98 -35 -154 72 -265 17 171
4810 171 -80 -374 203 132 125 -92 -121 64 -23 14 -47 -210 -24 -126 101 -204 6 -58 -182 65 -127 47 -18
4833 -18 366 -290 -98 185 45 -58 50 68 60 -160 -106 24 -72 -76 -24 24 -95 77 -70 -20 297 56 -79 -264
4857b64K39M1K16m72K03j73P2k1L07l0l25J33N3J18OJ58k13Q0k9J06j68p0J30
4880I7j43M3K6O8m15M58m8l01J45Q5j19M24l23o0J3J02oR3j08p6K78k24n5r6O37
4905D95n78N7r8OM38l46O6j82M69n35J41K09j05o2j81J64L6J33n24M28r8O5j99
4928b01N4L31j07k27R7L41q9j90j62J53k2P3j32k61O52j4l42J47r4k34J93k17
4950b51L45l73J50k22M37n7k57L76j65j74l5K50n3M7p6j5M1J86q7k12J1K41M8
4973A55j53K4J98m42K03j4J01o7J33k01k8k28J19J58J07Qj36K16L2l39K20j68
4995a02Q1J1K49l24l3qO4J44j50J03k9j52k18L47R2j09l2M80o35J30m7j19L87
5018A30k94P8o5J37m7M49m44J71m43M58l18NL8J74k07P6J26J72N6k10k21J42K11
$$ plain form
4857 -264 -25 16 232 -240 -37 -210 -138 -159 148 118 -207 -74 -21 97 103 261 48 128 99 205 37 -33 97
4880 97 -46 -3 23 91 -324 134 86 -215 -70 15 -104 320 -3 -63 -50 52 46 139 31 -45 233 9 -46 -142 495
4905 495 -83 -26 -124 -118 320 -26 40 -142 327 -208 -67 142 37 -25 -206 -42 -6 127 -397 31 -67 -2 -201
4928 -201 -147 184 77 -150 -53 288 199 9 -153 0 -22 51 -81 -342 310 296 -46 101 7 -227 -34 -251
4950 -251 94 -279 -129 -351 86 29 -228 148 -17 -191 -226 24 -29 18 -58 -73 -32 154 67 -145 -134 107 155
4973 155 2 26 224 -218 -15 -29 72 5 138 -63 -91 -319 -200 -42 65 73 -63 153 185 -154 66 -102
4995 -102 -21 -10 239 -85 -118 -126 -62 82 -68 35 6 -146 -364 -17 75 -34 -66 414 -221 -91 -138 -257 130
5018 130 -164 -86 -151 -14 -61 388 -56 115 -328 130 -188 -183 -145 29 -178 -102 24 196 252 42 -179 -37 174
5041A74o02O59j71J62j05j32J31k66J75k0j40K11K3j19qK3K19j53k27K93j24j80
5063a77K72J51n49O41l85q5J53J46J3l45R0j71K72P2nj02J89q7j64Q5R8l63N9
5086a92J12l6M04l84j21j58L75J42m2K2q1o23P28j11j35l1J89K3k4J04k8q8n8
5109a3K13j58r0K02J5r7j80l4J42R6N2j87j4j61M52j98k57L53p0j28Q5M6j10J94
5133A53k6l15J45p5K9jJ95m4m49N56k24J13J24J0k47k51K74pJ69j00J65m49L45
5156I0O6J18j71o2R7j72J20j15j6M7q7n8Q3m5Q9J11k3R6j73q5M20j50j14M1j1
5181I6j51J57K5j05lK77j47k78J50k77M26l64N06q1l19k1K28j49n9J8L73m33j1
5204a42j40K84k09K89m5j0O4j84N1J97j76K12J24l39K98l58J19M2Lj00n3j11M
$$ plain form
5041 174 -428 231 60 222 117 -15 116 -150 25 5 -135 76 99 -20 -28 -5 214 61 -166 127 3 -177
5063 -177 95 246 -303 338 -47 -132 21 167 180 -165 -75 -246 26 98 93 -9 180 93 -71 14 112 -251 -192
5086 -192 -80 -116 288 -96 -217 -375 0 142 100 122 41 -582 146 35 -100 -131 58 81 57 161 133 45 -13
5109 -13 200 42 -48 154 169 72 -108 -142 0 96 148 -39 -53 -214 238 40 -217 136 66 -62 23 69 -41 153
5133 153 127 -188 -43 -118 -89 -90 105 61 -388 168 -56 57 181 191 -56 -307 -33 -40 129 29 194 -255 90
5156 90 156 274 103 41 138 -34 86 -29 -45 2 -85 -143 -60 -105 -16 95 72 168 -5 -90 330 180 66 107 96
5181 96 -55 102 127 22 19 296 149 -129 21 -256 170 -194 312 231 -88 -109 119 -30 -89 -71 302 -131 -142
5204 -142 -282 2 -207 82 37 27 91 -93 -42 155 -21 191 315 -24 274 -84 35 77 80 -20 -73 -184 -180
5227a80J50K40q3o4j39k30M40K13l46Q0q6p5p8R9j78L68R6k73N0j57J15j79J70
5250d7j30r9K4Q1P2l9K57n9J49m7m6m37K91j63m2J83K28k72k0K06n8k2k27J10
5274a07J26q3k23J45L29k50k05L93k55J98j31l5O0j41K61K4q0j66l8K58j24r1
5296a35O3j45N11n3j8l48R2j69J37K29k28j49M75m97Q1j5N8j81K24J19j39N6J64
5319A32j65K85o6o15L62Q2J44K30l31p2J2O3k89K92l35J20N47o55L06j92J35q4
5341i4P2J61N5j28l0j34M88l13J42k98K2p3J06k90K34j38K85n8Jm28L42J94J33
5364B51r2j43L9k16J00p1K70Q9k98P8K42J6l51J37J10m48J88j23o4K08K10o8j93
5387a29L07j81o7q6j19P9J72j49L00k8k10nM00m10K06j17J38n0j72K61k35K20
$$ plain form
5227 -180 -30 210 127 63 -76 -306 134 347 1 81 -5 -80 -158 -59 -237 131 227 -46 4 -153 -38 -217 -47
5250 -47 -177 -276 -252 -171 -99 -138 119 60 209 162 116 -321 -30 -193 -235 -52 176 -96 -116 90 32 10 -217 -107
5274 -107 19 -64 -287 -142 187 -63 -268 125 -130 68 -63 -98 -38 -179 82 106 26 -140 -178 80 -44 -135
5296 -135 -72 -217 294 241 223 -125 -33 -202 -65 164 -64 -213 262 -235 -154 -169 -111 -292 -68 51 -88 -32 132
5319 132 -33 252 186 -429 -67 15 159 389 58 -14 -2 61 -228 64 -271 -151 396 -259 47 -145 -10 -94
5341 -94 -22 139 194 66 36 -98 390 77 219 -79 -57 -130 -24 -314 -80 -218 67 9 10 -418 -76 118 251
5364 251 159 16 55 -161 -61 -132 138 227 -71 7 249 265 -86 51 161 -287 -99 -222 -286 -78 132 64 -129
5387 -129 178 -3 -70 -156 -275 -196 -24 -173 127 99 -111 -116 284 -126 80 -37 101 51 -121 140 -95 125
5409A25R1j32j24Pl0L19l06j51K04M32m68J28n0mK1j48M52l83j02j1P0O9qO2J70
5434B33k49j87K68j93J51J26j40o9K76k10J72k09R3m1J13k09K39J02j41j10q1
5455f6P4N7l46M14j40o2j51K22j96M34j48j19O3P1j25m7LK4n1J80j27J32j18J28
5479A06j67K3N9o7K13l0k02K31j25l2M38k32q4j63O0j82K05km5j28J98j80K00
5502I4jK8K8p6p0j47J9K91l62M44j30k16R9P7k14o9M95o82N48j41k02q6L16j18
5526g5K87k49m2QJ16L4j79J18J00Pl05l3L28j87j01J44k2J8J88q6r7J39j18l6
5550d3N3K33j90K8nl16K32n4J7m7j44R3j9K12q9m6j11O9M40l65M2K19r8k79kL08
5576A38R1m51jK75j36K25j27J08l7J0K8j38R3j09q5J37L34n50R8K95k92J85M5
$$ plain form
5409 125 216 84 -40 -33 -63 256 -50 -201 3 435 -33 95 45 41 62 -86 366 -17 -119 -130 -60 9 1 63 233
5434 233 -16 -203 65 -128 23 149 9 -60 216 6 178 -31 62 21 134 -75 164 266 125 15 -66
5455 -66 8 65 -281 133 -7 -69 -220 2 -194 240 92 -27 36 107 -18 -65 -62 -38 -89 91 -36 96 -22 106
5479 106 -61 -38 21 -46 167 137 -65 166 41 9 447 215 131 -32 28 -154 51 49 4 -124 74 -106 94
5502 94 93 121 149 73 3 -144 -125 166 -196 248 118 -98 1 78 -136 -205 290 -392 156 15 -187 -273 43 -75
5526 -75 212 -37 -79 -71 45 79 -100 18 118 125 -180 -213 115 -72 -173 -29 -51 -33 155 69 -28 111 -7 -43
5550 -43 10 243 53 81 76 -240 -8 -62 -45 -92 -236 -143 -162 50 -39 -85 -196 -127 313 -52 -10 209 111 -168 -170 138
5576 138 229 -222 -223 52 -84 141 14 122 85 95 123 -15 78 -31 -116 21 355 -195 -97 198 -94 91 136
5599A36j06p9K6N6J33k6P7l12j3N9m5j59J30J45k12L33N1j08o1j1k30J97M91o15
5623a43M5J27R2j8r9Q0n43N89m40M25k69K60M2M8q7l84N61l3m64L31j00k9j82
5646a91K12R9j68p7m0K10Q3K5mj54l13M67q1k3q8K3J23K12l35j9o7O7p9R8L22
5671C02o26M59o06P22r5Ok09Q1J46j39M1%l02J45j33J53J08r4J0J36k58K48o5
5694C0N1P4k09J48k65O5M6J59l88K87J36J02k76k27Q5L8o4q1J83j2R6O4L58o78
5718b78J15K51j96J86j20K72j90J13l64J54j1K47j88k02k3J59J76l0k5J27Rj93
5740a1j8J43l32L00j15L8l06O32j41j16M8j22J13j84L33l32K57M0m65J95j03m2
5762a88J32J58n2k5j00R0ML26m71R0%o1mK15j56q6L89j92O7k21K98j42j22K4p6
$$ plain form
5599 136 30 -49 -23 33 166 140 217 -95 -108 -49 -94 -253 -123 22 -190 143 194 86 25 14 -216 -19 472 -143
5623 -143 -98 29 121 103 4 84 -459 130 -310 115 -154 106 148 196 109 -275 286 253 -211 120 20 -9 -191
5646 -191 21 120 -48 -125 -165 45 128 153 149 -5 -318 149 68 45 -43 -20 103 315 -20 -39 -106 -39 -118 -20 302
5671 302 -324 135 -471 251 156 162 -47 34 180 41 82 82 -220 -75 -208 -55 53 -41 -31 105 -153 95 30
5694 30 81 155 -54 94 -171 -106 -60 99 -289 -2 134 236 -40 -267 -182 -144 -208 -289 -106 -118 -22 42 400 -278
5718 -278 -163 88 -108 78 -42 230 40 153 -211 -57 -68 179 -9 -211 -234 -75 101 71 46 173 182 -11
5740 -11 -29 114 -218 82 -33 5 -301 331 190 74 122 0 113 -71 262 -70 187 227 -238 -43 -146 -188
5762 -188 -56 102 50 25 -75 15 19 345 -126 -36 -36 -97 -101 114 -42 -128 261 69 136 -85 213 71 -51 -27 -103
5787a03j23K00n8J38m14J63L11j19J19N1k24J03k8k02K36r1MJ57q2l8J22j71L
5810d6K2n0l3K59l44L44k85J58K48K8k74k67K57k11M93j98J19j60k4J45l19R4
5832d4J26j10J02k3R2o6j86J37m7J42k31P2j30K94j92J62k14N6K08q0l6r7k18
5855b83K64m73J19M19l13M5J44R7R2m2J0j12K19n2n9k9j77m5J26l9o5J16M34m90
5879i4K8j9Q9%k04J62k55K07J57l21K44R3q9j23j45L16k72K75j24J89j47n4J07
5902B0j06J29N2k51K45l26M32N9k35j98n3LK08J43j26m3j81K18k33L86j50J59
5924A52j7l34K11L02l08N0J06j75P1l44M36l2j98J59N3r6j68Q3J12n5J79k51l1
5947i5N5J27j45J00n4Q5k3l33K58K62k15Q1l70Q4J30J41L94l89n8q6J23J67k25
$$ plain form
5787 -103 -226 -26 -84 54 -360 -197 114 -5 114 165 -59 44 16 -186 50 -41 -37 120 38 0 122 -49 -46
5810 -46 -24 -74 -107 152 -192 152 -133 25 273 301 27 -240 17 -194 299 101 220 60 36 181 -138 -44
5832 -44 82 -28 74 51 143 77 -109 28 -19 123 -108 -36 -166 128 -64 98 -116 -60 148 68 32 -65 -283
5855 -283 -19 -492 -373 46 -267 -222 -78 19 111 69 79 -33 186 134 75 46 -131 -176 -50 -89 -154 -38 396 -94
5879 -94 -66 -85 4 4 -200 -38 -293 -86 71 -250 -6 87 -2 -125 -270 46 -226 49 -75 114 -33 -87 20
5902 20 -86 43 95 -156 89 -237 195 254 19 -179 -232 -229 -21 122 -4 -47 -228 -10 -243 143 -7 152
5924 152 135 -199 12 314 6 56 162 -13 58 -286 150 118 -80 79 132 36 -132 -49 63 8 187 -64 -95
5947 -95 -40 87 -58 42 -12 73 50 -283 -25 237 22 103 -267 -183 -53 88 482 93 35 -51 72 239 14
5970A4j11lqL49l74N0J29j58L17ml01j23J47k4R4j84J11J63oql2Oo2j45K30l50
5996b83L18O9oR9J8n01M36j17L8j86J50j54R3N2p0K83m33j6K06J35k1m4N8k7j59
$$ plain form
5970 14 -97 -100 -108 241 -133 -83 46 -112 205 201 -100 -223 -76 -100 -6 -190 -79 84 78 70 38 44 -18 -163 67 -283
5996 -283 35 104 98 197 215 -286 150 33 71 -115 35 -119 -26 26 -44 239 -194 -210 -4 131 110 66 124 97 -62
$$ [...]
8191H6
##END NTUPLES=NMR FID
##END=
