##TITLE=1H_K-377/3-2
 CDCl3, 8 sc, 
 16.12.2019
##JCAMPDX= 6.0         $$ Bruker NMR JCAMP-DX V2.0
##DATA TYPE= NMR FID
##DATA CLASS= NTUPLES
##ORIGIN= UXNMR, Bruker Analytische Messtechnik GmbH
##OWNER= root
$$ XWIN-NMR		Version 3.5
$$ Mon Dec 16 14:19:11 2019 Russian Standard Time (UT+4h)  she@DPX200
##.OBSERVE FREQUENCY= 200.1315
##.OBSERVE NUCLEUS= ^1H
##.DELAY= (6, 6)
##.ACQUISITION MODE= SIMULTANEOUS
##.ACQUISITION SCHEME= undefined
##.AVERAGES= 8
##.DIGITISER RES= 18
##SPECTROMETER/DATA SYSTEM= spect
##.PULSE SEQUENCE= zg30
##.SOLVENT NAME= CDCl3
##.SHIFT REFERENCE= (INTERNAL, CDCl3, 0, 15.7039)
##AUDIT TRAIL= $$ (NUMBER, WHEN, WHO, WHERE, WHAT)
$$ ##TITLE= Audit trail, XWIN-NMR		Version 3.5
$$ ##JCAMPDX= 5.01
$$ ##ORIGIN= Bruker BioSpin GmbH
$$ ##OWNER= she
$$ F:/spectra/data/she/nmr/H-F/1/audita.txt
$$ ##AUDIT TRAIL=  $$ (NUMBER, WHEN, WHO, WHERE, WHAT)
(   1,<2019-12-16 14:18:03.57 +0400>,<she>,<DPX200>,
      <created by zg, POWCHK disabled, PULCHK disabled
       configuration hash MD5:
       00 E9 B6 7A A2 85 ED C7 34 08 36 98 17 FE 4E 26
       data hash MD5: 16K
       ED 8C 90 8C A8 4C CE B1 2E FB E7 0A 81 98 B9 8F>)
$$ ##END=
$$ 
$$ hash MD5
$$ 74 4F 0F C6 F7 CB FD C7 B4 F1 E3 B8 C3 52 E9 9B
##$RELAX= 
##$RELAX= 
##$RELAX= 
##$RELAX= 
##$RELAX= 
##$RELAX= 
$$ Bruker specific parameters
$$ --------------------------
##$DU= <F:/spectra>
##$EXPNO= 1
##$NAME= <H-F>
##$PROCNO= 1
##$TYPE= <nmr>
##$USER= <she>
##$AMP= (0..31)
100 100 100 100 100 100 100 100 100 100 100 100 100 100 100 100 100 100 
100 100 100 100 100 100 100 100 100 100 100 100 100 100 
##$AQSEQ= 0
##$AQ_mod= 1
##$AUNM= <au_zg>
##$AUTOPOS= <>
##$BF1= 200.13
##$BF2= 200.13
##$BF3= 200.13
##$BF4= 200.13
##$BF5= 200.13
##$BF6= 200.13
##$BF7= 200.13
##$BF8= 200.13
##$BYTORDA= 1
##$CFDGTYP= 0
##$CFRGTYP= 5
##$CHEMSTR= <none>
##$CNST= (0..31)
1 1 145 1 1 1 1 1 1 1 1 1 1 1 1 1 1 1 1 1 1 1 1 1 1 1 1 1 1 1 1 1 
##$CPDPRG= <>
##$CPDPRG1= <>
##$CPDPRG2= <>
##$CPDPRG3= <>
##$CPDPRG4= <mlev>
##$CPDPRG5= <mlev>
##$CPDPRG6= <mlev>
##$CPDPRG7= <mlev>
##$CPDPRG8= <mlev>
##$CPDPRGB= <>
##$CPDPRGT= <>
##$D= (0..31)
0 1.2 0 0 0 0 0 0 0 0.06 0 0.03 0 0 0 0 0.0002 0 0 0 0 0 0 0 0 0 0 0 0 
0 0 0 
##$DATE= 1576491483
##$DBL= (0..7)
120 120 120 120 120 120 120 120 
##$DBP= (0..7)
150 150 150 150 150 150 150 150 
##$DBP07= 0
##$DBPNAM0= <>
##$DBPNAM1= <>
##$DBPNAM2= <>
##$DBPNAM3= <>
##$DBPNAM4= <>
##$DBPNAM5= <>
##$DBPNAM6= <>
##$DBPNAM7= <>
##$DBPOAL= (0..7)
0.5 0.5 0.5 0.5 0.5 0.5 0.5 0.5 
##$DBPOFFS= (0..7)
0 0 0 0 0 0 0 0 
##$DE= 6
##$DECBNUC= <off>
##$DECIM= 24
##$DECNUC= <off>
##$DECSTAT= 4
##$DIGMOD= 1
##$DIGTYP= 9
##$DL= (0..7)
0 120 120 120 120 120 120 120 
##$DP= (0..7)
150 150 150 150 150 150 150 150 
##$DP07= 0
##$DPNAME0= <>
##$DPNAME1= <>
##$DPNAME2= <>
##$DPNAME3= <>
##$DPNAME4= <>
##$DPNAME5= <>
##$DPNAME6= <>
##$DPNAME7= <>
##$DPOAL= (0..7)
0.5 0.5 0.5 0.5 0.5 0.5 0.5 0.5 
##$DPOFFS= (0..7)
0 0 0 0 0 0 0 0 
##$DQDMODE= 0
##$DR= 18
##$DS= 0
##$DSLIST= <SSSSSSSSSSSSSSS>
$$ [...]
##$SUBNAM2= <"">
##$SUBNAM3= <"">
##$SUBNAM4= <"">
##$SUBNAM5= <"">
##$SUBNAM6= <"">
##$SUBNAM7= <"">
##$SUBNAM8= <"">
##$SUBNAM9= <"">
##$SW= 24.9337058887773
##$SWIBOX= (0..15)
0 0 2 0 0 0 0 0 0 0 0 0 0 0 0 0 
##$SW_h= 4990.01996007984
##$TD= 16384
##$TD0= 1
##$TE= 0
##$TE2= 300
##$TE3= 300
##$TEG= 300
##$TL= (0..7)
0 120 120 120 120 120 120 120 
##$TP= (0..7)
150 150 150 150 150 150 150 150 
##$TP07= 0
##$TPNAME0= <>
##$TPNAME1= <>
##$TPNAME2= <>
##$TPNAME3= <>
##$TPNAME4= <>
##$TPNAME5= <>
##$TPNAME6= <>
##$TPNAME7= <>
##$TPOAL= (0..7)
0.5 0.5 0.5 0.5 0.5 0.5 0.5 0.5 
##$TPOFFS= (0..7)
0 0 0 0 0 0 0 0 
##$TUNHIN= 0
##$TUNHOUT= 0
##$TUNXOUT= 0
##$USERA1= <user>
##$USERA2= <user>
##$USERA3= <user>
##$USERA4= <user>
##$USERA5= <user>
##$V9= 5
##$VALIST= <valist>
##$VCLIST= <CCCCCCCCCCCCCCC>
##$VD= 0
##$VDLIST= <DDDDDDDDDDDDDDD>
##$VPLIST= <PPPPPPPPPPPPPPP>
##$VTLIST= <TTTTTTTTTTTTTTT>
##$WBST= 1024
##$WBSW= 4
##$XGAIN= (0..3)
0 0 0 0 
##$XL= 0
##$YL= 0
##$YMAX_a= 149939
##$YMIN_a= -105173
##$ZGOPTNS= <>
##$ZL1= 120
##$ZL2= 120
##$ZL3= 120
##$ZL4= 120
##$ABSF1= 10
##$ABSF2= 0
##$ABSG= 5
##$ABSL= 3
##$ALPHA= 0
##$AQORDER= 0
##$ASSFAC= 0
##$ASSFACI= 0
##$ASSFACX= 0
##$ASSWID= 0
##$AUNMP= <proc_1d>
##$AZFE= 0.1
##$AZFW= 0.1
##$BCFW= 1
##$BC_mod= 2
##$BYTORDP= 1
##$COROFFS= 0
##$CY= 11.3945322036743
##$DATMOD= 1
##$DC= 2
##$DFILT= <>
##$DTYPP= 0
##$F1P= 16.9975609425685
##$F2P= -3.02152046262296
##$FCOR= 0.5
##$FTSIZE= 0
##$FT_mod= 4
##$GAMMA= 1
##$GB= 0.15
##$INTBC= 1
##$INTSCL= 1
##$ISEN= 128
##$LB= 0.24
##$LEV0= 0
##$LPBIN= 0
##$MAXI= 10000
##$MC2= 0
##$MEAN= 0
##$ME_mod= 0
##$MI= 1.114404
##$NCOEF= 0
##$NC_proc= 0
##$NLEV= 6
##$NOISF1= 3.799351
##$NOISF2= 2.8
##$NSP= 1
##$NTH_PI= 0
##$NZP= 0
##$OFFSET= 15.70392
##$PC= 1
##$PHC0= -9795.83
##$PHC1= 27.80086
##$PH_mod= 1
##$PKNL= yes
##$PPARMOD= 0
##$PSCAL= 0
##$PSIGN= 0
##$REVERSE= no
##$SF= 200.130013532006
##$SI= 16384
##$SIGF1= 3
##$SIGF2= 2
##$SINO= 400
##$SIOLD= 16384
##$SREGLST= <1H.CDCl3>
##$SSB= 0
##$STSI= 0
##$STSR= 0
##$SW_p= 3612.71676300578
##$SYMM= 0
##$S_DEV= 0
##$TDeff= 0
##$TDoff= 0
##$TI= <>
##$TILT= no
##$TM1= 0
##$TM2= 0
##$TOPLEV= 0
##$USERP1= <user>
##$USERP2= <user>
##$USERP3= <user>
##$USERP4= <user>
##$USERP5= <user>
##$WDW= 1
##$XDIM= 8192
##$YMAX_p= 0
##$YMIN_p= 0
$$ End of Bruker specific parameters
$$ ---------------------------------
##NTUPLES= NMR FID
##VAR_NAME=  TIME,          FID/REAL,        FID/IMAG
##SYMBOL=    X,             R,               I
##VAR_TYPE=  INDEPENDENT,   DEPENDENT,       DEPENDENT
##VAR_FORM=  AFFN,          ASDF,            ASDF
##VAR_DIM=   8192,          8192,            8192
##UNITS=     SECONDS,       ARBITRARY UNITS, ARBITRARY UNITS
##FACTOR=    0.0002004,     1,               1
##FIRST=     0,             0,               0
##LAST=      1.6414764,     0,               0
##MIN=       0,             -105173,         0
##MAX=       1.6414764,     149939,          0
$$ Real data points
##PAGE= N=1
##DATA TABLE= (X++(R..R)), XYDATA
0@%%%%%%%%%Pj5J6j6J6k2L0l2M0m8N6o5P3q8J04j20J37j55J76k01K27k56K88l24
$$ 0 0 0 0 0 0 0 0 0 0 7 -8 8 -8 8 -14 16 -16 24 -24 32 -33 40 -48 56 -64 73 -82 94 -107 120 -136 152 -172
33a72L63m06M53n06N64o25O92p66Q52r45J043j155J281j420J580j763J972k214
$$ -172 191 -215 238 -268 296 -329 363 -403 449 -496 547 -608 673 -747 833 -930 1042 -1172
51a172K503k856L289l841M578n606P161r831J5671n4526L9660K9699j19854j0048
$$ -1172 1331 -1525 1764 -2077 2501 -3105 4056 -5775 9896 -44630 -4970 24729 -95125 -105173
65a05173Q7550L0873p3910j1064N9119J9576m5646j678L4556j853k8732J7028
$$ -105173 -17623 13250 -60660 -71724 -12605 6971 -38675 -40353 -5797 -7650 -36382 -19354
77a9354K6188k0673l1718K4875L5465j3632l1507J1501L0986K062j6766L933J6358
$$ -19354 6834 -13839 -45557 -20682 14783 1151 -30356 -18855 12131 14193 -2573 1360 17718
90A7718J902r896J361J1375J788j2964l327J2576K264k0635p343K6917J5386l3210
$$ 17718 19620 9724 11085 22460 24248 11284 7957 20533 22797 2162 -5181 21736 37122 3912
104C912k8926L1806L9876k5199m6289J6776M4769j2611m3750R540L8287j0026
$$ 3912 -25014 6792 46668 21469 -24820 -8044 36725 24114 -19636 -10096 28191 18165
116A8165l4265J1139K6689j5107j9382K3654J7194l1891j7985L9051K4935l9638
$$ 18165 -16100 -4961 21728 6621 -12761 10893 28087 -3804 -21789 17262 42197 2559
128B559k8970L4222K7554k9521k4588K4063J7996k4442j4570K1804J0094k0034
$$ 2559 -26411 7811 35365 5844 -18744 5319 23315 -1127 -15697 6107 16201 -3833
140c833l858K1734j61k4598J265K8298K764k8758j1552K0094J3454j4380j6834
$$ -3833 -7691 14043 13882 -10716 -9451 18847 21611 -7147 -18699 1395 14849 469 -16365
153a6365J954J0228j13r639n141M985O663k411p833m45O085L917K70n42n080o384
$$ -16365 -14411 -4183 -4296 -13935 -19076 -14091 -7428 -9839 -17672 -18117 -12032 -8115 -7845 -8387 -13467 -19851
169a9851O886J5197l401j9610j752K1456N676j9448m484K0569O356j8511m366
$$ -19851 -12965 2232 -1169 -20779 -22531 -1075 4601 -14847 -19331 1238 7594 -10917 -15283
182a5283J7407L736j4422J451J2536q588j6993J2379K2584j3260k7796R307L0403
$$ -15283 2124 5860 -8562 -7111 5425 -3163 -20156 -7777 14807 1547 -26249 -16942 13461
195A3461l746k5542L812K3662p65j7628K467J4886k559r491L821L158j0268l012
$$ 13461 9715 -15827 -12015 11647 10882 -6746 -4279 10607 8048 -1443 2378 5536 -4732 -7744
209g744J4779M762j9238r961J6927J4873j0908j3217P487J3327k151q551J684
$$ -7744 7035 11797 -7441 -17402 -475 14398 3490 -9727 -2240 11087 8936 385 2069
222B069P604J175m199k171k49L40J872J132j250o750l823O062Q975k977j4072
$$ 2069 9673 10848 6649 4478 4229 4569 6441 7573 6323 -427 -4250 1812 10787 7810 -6262
237f262k787J3729O628j2607j1004J0608J1003r151j2736O708J2424l220q585
$$ -6262 -9049 4680 11308 -1299 -12303 -1695 9308 157 -12579 -5871 6553 3333 -5252
250e252J979M292k893J671Q838k262j4155k5J6952K062j7926n616J4714N545j4218
$$ -5252 -3273 1019 -1874 -203 8635 6373 -7782 -7807 9145 11207 -6719 -12335 2379 7924 -6294
265f294o603J1534P184q470n083O355L031l265L573O193n806r977O549J3519l919
$$ -6294 -12897 -1363 5821 -2649 -7732 -1377 1654 -1611 1962 8155 2349 -7628 -1079 12440 8521
280H521j6270j675J2890K264j1852n463Q103N721n538p356J627O292K638k073
$$ 8521 -7749 -9424 3466 5730 -6122 -11585 -3482 2239 -3299 -10655 -9028 -2736 -98 -2171
294b171l456k081J195M731L065m193o278M61P820K822o858m459O103P054l857
$$ -2171 -5627 -7708 -6513 -1782 1283 -2910 -9188 -8727 -907 1915 -4943 -9402 -3299 3755 -102
309a02p982K951Q841Q34p786k573L766K091o53K94j131n924L49Q086L744q746
$$ -102 -8084 -5133 3708 4542 -3244 -5817 -2051 40 -613 -319 -1450 -7374 -7025 1061 4805 -3941
325c941n238Q217Q428n593q790N961J0027k700r902J69O996J273l503j784j033
$$ -3941 -9179 -962 7466 1873 -6917 -956 9071 6371 -3531 -3362 3634 4907 1404 -380 -1413
340a413l011K136N603j184p728j144Q441M165o623m072O612N865l769o112K391
$$ -1413 -4424 -2288 3315 2131 -5597 -6741 1700 5865 -758 -4830 1782 7647 3878 -2234 157
355A57O085J233l156k593r06J426L324K231l862o068J771P189N89o970l554N435
$$ 157 6242 7475 4319 1726 820 2246 5570 7801 3939 -2129 -358 6831 7420 450 -3104 2331
371B331N213m675o731J929P871L25o014l152M091M894J12k494k005l62K407L345
$$ 2331 7544 2869 -3862 -1933 5938 6263 249 -2903 1188 6082 6194 3700 1695 1333 3740 7085
387G085r03n173k637M382K780m783o113L138O005k237p448k57O093K465k152k045
$$ 7085 6182 1009 -1628 2754 5534 751 -5362 -2224 3781 1544 -5904 -6161 -68 2397 245 -1800
403a800l55R42K412K774j160n178j206N925K573o065n930N027N936m319p350J481
$$ -1800 -2155 -1213 1199 3973 2813 -2365 -3571 2354 4927 -1138 -7068 -2041 3895 -424 -7774 -6293
419f293O744R64n264k462K278K879J226P1k452k447J966M660P44n444j948N181
$$ -6293 451 1415 -3849 -6311 -4033 -1154 72 143 -2309 -4756 -2790 1870 2614 -2830 -4778 403
435D03M050m178n299K945N813o15n415k457L421L220j214k596k088Q3K047K742
$$ 403 4453 275 -5024 -2079 3734 3119 -2296 -4753 -1332 1888 674 -1922 -4010 -3927 -1880 862
451H62j377m573o78N580L117m256m841M061P062j865p081j85O991K490m641l730
$$ 862 -515 -5088 -5766 -186 2931 -1325 -6166 -2105 4957 3092 -3989 -4174 2817 5307 666 -3064
467c064J234L036K03j53j307k009K82L737J820m430l108M834M923l517n196J899
$$ -3064 -1830 1206 1409 1256 -51 -2060 -1778 1959 3779 -651 -3759 1075 5998 2481 -2715 -816
483h16O777J9n161k078L277K296l74j248r06j564R65L119K0n132k305M526L040
$$ -816 5961 5980 819 -1259 2018 4314 3940 2692 1786 222 1187 4306 4326 -806 -3111 1415 4455
500D455m775m791K372O154j164n803j118M953L421k061l307K63K427J811K05j198
$$ 4455 -320 -5111 -2739 3415 2251 -3552 -4670 283 3704 1643 -1664 -1401 1026 2837 3042 1844
516A844k141j17K867J894l687m262K557M770k407o367p91N781K454m711m223K321
$$ 1844 -297 -414 2453 4347 660 -3602 -1045 3725 1318 -5049 -5840 -59 2395 -2316 -6539 -4218
532d218L919n39j672m40n18p7K602J548l821l328L695M564l490o979J736O859
$$ -4218 -299 -838 -2510 -2950 -3468 -3545 -943 605 -3216 -6544 -2849 1715 -1775 -8754 -7018 -159
548a59N5p271k326N318L060k733k323J429J116K68J743R82k174q93L911L348l252
$$ -159 -104 -7375 -9701 -4383 -1323 -4056 -6379 -4950 -3834 -3566 -1823 -841 -3015 -3908 3 3351 99
565I9l448L254N599j825n486o28M792K163l169l630R22K344j86p62j210n13J74
$$ 99 -3349 -95 5504 3679 -1807 -2435 2357 4520 1351 -2279 -1357 987 801 39 -1171 -1684 -1510
582a510K233Q43k522k443K639M007r74n290k45N667K959n161m487L533M982j268
$$ -1510 723 1566 -956 -3399 -760 3247 2273 -3017 -3262 2405 5364 203 -4284 -751 4231 2963
598B963m562N75K408P7q10O26K4k020J350L920n49n216l3P409J789o815k597O217
$$ 2963 -1599 -1024 1384 1461 651 1277 1301 -719 631 4551 4002 -1214 -1247 6162 7951 1136 -1461 4756
616D756M096m393m308K804K994k109j103P88j337k375J085K650l221m681J598
$$ 4756 8852 4459 151 2955 5949 3840 2737 3525 2188 -187 898 3548 327 -4354 -2756
631b756M814j112o484j006N691K500n165k764K273L174n44k206m66N42J382N68
$$ -2756 2058 946 -5538 -6544 -853 1647 -3518 -6282 -4009 -835 -1379 -3585 -4051 -3509 -2127 -1559
647a559m24j419k07J914K028m23k992j121L926K724k786m108K225N467l84m754
$$ -1559 -1983 -3402 -3609 -1695 333 -90 -3082 -4203 -277 2447 -339 -4447 -2222 3245 2861 -1893
663a893o23M350K178k715j039J458L86l12J286R74l003k192M052K794n450n586
$$ -1893 -2516 1834 4012 1297 258 1716 2102 1790 3076 4050 1047 -1145 2907 5701 251 -5335
679e335M320N529m418o515J781N444r20m769k50L485n35j064J812O90k881O30
$$ -5335 -1015 4514 96 -6419 -4638 806 -114 -4883 -5133 -1648 -2183 -3247 -1435 -745 -3626 -2996
695b996M745J056n804j147N605K965m657l295L031L680j627k987N7J786J062m11
$$ -2996 1749 2805 -2999 -4146 1459 4424 -233 -3528 -497 3183 1556 -1431 -1374 412 1474 1063
711A063n05j371K79J861J430j160k252M27L189R04k522k497J479L550p2m259j940
$$ 1063 558 -813 -534 1327 2757 1597 -655 -228 2961 3865 1343 -1154 325 3875 3803 -456 -2396
728b396L637K796k937m048J020K929j098j563K7J96j431J478K544j567l608K232
$$ -2396 1241 4037 1100 -2948 -1928 1001 -97 -1660 -1633 -1437 -2868 -1390 1154 -413 -4021 -1789
744a789O118r45o294M69O925J434o406j596M705J736k826j402J952j347j206K072
$$ -1789 4329 3384 -2910 -2441 4484 5918 -488 -2084 2621 4357 1531 129 2081 734 -472 1600
760A600K056l912k819M808L410m381m554L812N335k323m894K47M334N47k692j005
$$ 1600 3656 -256 -3075 1733 5143 762 -3792 20 5355 3032 -1862 -1615 2719 3266 574 -431
776d31J018o27P60N71q77k263L48K708L96l100j609K196K561p44l765p78L420
$$ -431 587 -40 720 1291 414 -1849 -1501 1207 1603 -1497 -3106 -910 1651 907 -2858 -3636 -216
793b16K132k589l509J556L977Ok393o21J935P53n40P57l06k293K9L325k11m791
$$ -216 1916 -673 -4182 -2626 1351 1357 -1036 -1657 278 1031 491 1248 942 -1351 -1322 2003 1792 -2999
811b999j585N537K373n944m410N119M555l141m336K606K976j463r26K096O12k810
$$ -2999 -4584 953 3326 -2618 -7028 -1909 2646 -495 -4831 -2225 751 -712 -1638 458 1070 -1740
827a740J052M075j085m551Q88N294M65o051j003N112K777m169k643K149K537n55
$$ -1740 -688 3387 2302 -2249 -1361 3933 4398 -1653 -2656 2456 5233 1064 -1579 570 3107 2552
843B552j094R0k34l54J713J143k059j130J588K368n17k912l72L475J336k387l398
$$ 2552 1458 1548 1314 960 2673 3816 1757 627 2215 4583 4066 1154 782 4257 5593 3206 -192
860a92J013L378j06l463j960J629J987j614j657Q88L04j12M97J317j407j242K648
$$ -192 821 4199 4093 630 -1330 299 2286 672 -985 -97 207 95 592 1909 502 -740 1908
877A908K601k355l853K326N137r34n604k81L971Q54k891j400K039l58j437J188
$$ 1908 4509 2154 -1699 627 5764 4830 -774 -1055 2916 3770 879 -521 1518 1160 -277 911
893I11Q88k277o40K842J465l659k793M102L506l361m325J387M300n80k854o17
$$ 911 1799 -478 -1118 1724 3189 -470 -3263 839 4345 984 -3341 -1954 2346 1766 -1088 -1705
909a705J312p2l3j24k88j344K30J989p56k922n96L687P93l188j899J705L116K87
$$ -1705 -393 -465 -498 -622 -910 -2254 -2024 -35 -791 -3713 -4309 -622 171 -3017 -4916 -3211 -95 192
927A92k649n99J719J972j30j427k02R28O60l91q22l17K97Q46M97j757k245J427
$$ 192 -2457 -3056 -1337 635 505 -922 -1124 -196 464 73 -749 -1066 -769 77 574 -1183 -3428 -2001
945b001L469m96l779r84L933K035k396k201J840J619j003j164J007O4o21P80J067
$$ -2001 1468 972 -2807 -3791 142 2177 -219 -2420 -580 1039 36 -1128 -121 -57 -678 102 1169
962A169k012j957K472L153k125l943L00M900Q04m431j423K887Q50j309r98J195
$$ 1169 -843 -2800 -328 2825 700 -3243 -2943 1957 2761 -1670 -3093 -206 644 -665 -1663 -468
978d68K38n45J102K46j176l95L219J126k455k537K676L359o98l921p19K429J338
$$ -468 -230 -775 327 573 -603 -998 2221 3347 892 -1645 1031 4390 3692 -229 -948 1481 2819
995B819j464k023L90J219j09l90j96j29P20R16N24j443j065K044K067j54l254
$$ 2819 1355 -668 -278 941 832 442 246 117 837 1753 2277 834 -231 1813 3880 3726 472
1012D72q22K930K045k525k435Q64J983n02j906j63J232r2n86l2k06r26Q85J960
$$ 472 -350 2580 4625 2100 -335 529 2512 2010 104 -59 1173 1081 495 463 257 -669 216 2176
1030B176q11l183n7L909J264l148k690K870K323j226k229M71J949n28j508L67
$$ 2176 1365 -1818 -1875 2034 3298 150 -2540 330 2653 1427 -802 -331 1618 1090 -418 -51
1046e1j01p63M52R87j733k188J114L108j21l382q65L062J752j495j865R66J789
$$ -51 -152 -915 -463 524 -1209 -3397 -2283 825 704 -2678 -3543 -481 1271 -224 -2089 -1123 666
1063F66j29j600m62P51Q54k80j041j042l98J116J304o92k778J97K209J673j682
$$ 666 537 -1063 -1525 -774 80 -200 -1241 -2283 -2681 -1565 -261 -953 -3731 -3534 -1325 348 -1334
1080a334k013J027K263J11j851n79K045O87j044j366P61M60R96K63o72j368p9
$$ -1334 -3347 -2320 -57 54 -1797 -2376 -331 356 -688 -2054 -1293 -833 163 426 -246 -1614 -1693
1097a693K632J155k101k763J763K913q58l034L42K411L79j941l16R57J192m21
$$ -1693 939 2094 -7 -2770 -1007 1906 1048 -1986 -1644 767 1146 -795 -1111 -154 1038 617
1113F17%m36p81J003K214N4k557j112K203J955j540k527L06K242K48j684j108
$$ 617 617 181 -600 403 2617 2671 114 -998 1205 3160 1620 -907 -601 1641 1889 205 -903
1130i03J318J152p0j069j64M98J401Q95j154j440J28K142J120j853j670Q71K116
$$ -903 415 1567 1497 428 264 762 2163 3058 1904 464 592 2734 3854 2001 331 1202 3318
1147C318j13j889j222J539J151j303j729K37J388J65o09j289k67K27J586M7j534
$$ 3318 3205 1316 94 1633 2784 1481 -248 -11 1377 1542 933 -356 -623 -396 1190 1237 -297
1164b97j693J358K313l96k125m39K334N06j785j222J389R27m90j044q76j71J107
$$ -297 -1990 -632 1681 1285 -840 -1279 1055 1561 -224 -1446 -57 870 380 -664 -1540 -1711 -604
1181f04J038l91j792j134J910J975j247j970J078K085M03k341JJ076J035o99j200
$$ -604 434 43 -1749 -2883 -973 1002 -245 -2215 -1137 948 1351 -990 -989 87 1122 423 -777
1198g77l26M21P11l24j388j180N69J547K4j362j260L62K183j70j640o15J750Q90
$$ -777 -1103 -682 29 -295 -1683 -2863 -2294 -747 -723 -2085 -3345 -2983 -800 -970 -2610 -3225 -1475 -585
1216e85n81j913P08J786L31j170o10M50P16J139m06q82r95J397J610l97j715l4
$$ -585 -1166 -3079 -2371 -585 -254 -1424 -2034 -1584 -868 271 -135 -1017 -2012 -615 995 598 -1117 -1151
1234a151K012J261k291j153J849J474m00j271lQ56O75O37j83j280k08J171J221
$$ -1151 861 2122 -169 -1322 527 2001 1601 330 327 1183 1858 2495 2312 1032 824 1995 3216
1251C216j003j852K00K332k57k277n30J583O81r99j309K64R27O20P3r18p57P80
$$ 3216 2213 361 561 2893 2636 359 -171 1412 2093 1094 -215 49 976 1596 1669 751 -6 774
1269G74J336J77j460o16J301J307l36j337k23J186N99o83j322J33J861J90j646
$$ 774 2110 2287 827 211 1512 2819 2483 1146 923 2109 2708 2025 703 836 2697 2887 1241
1286A241r48J50J546j41m40j057J43L16Q58k36j454k18J180J147j986j275J308
$$ 1241 293 443 1989 1848 1408 351 494 810 1668 1432 -22 -240 940 2087 101 -1174 134
1303A34J448p77j918k72Q95P29j129k92p86j56J070O94r41j825O02K174J47j551
$$ 134 1582 805 -1113 -1385 -490 239 -890 -1182 -1968 -2124 -1054 -360 -1301 -3126 -2524 -350 -203 -1754
1321a754r42K681P64j433j125R59J234j42k86o30o41N67R76j34j392p16R98J141
$$ -1754 -2696 -15 749 -684 -1809 -850 384 242 -44 -674 -1315 -748 228 94 -1298 -2014 -1016 125
1339A25j042j327K29J625M21j029q03O94J212K2j003p75N60J493K04j287o90L91
$$ 125 -917 -2244 -2015 -390 31 -998 -1801 -1107 105 127 -876 -1651 -1091 402 606 -681 -1371 -980
1357i80R12Q8k38q98J05P13L30r16q59J033J640m1k094O7J821J283j295n77P04
$$ -980 -68 20 -218 -1116 -1011 -298 32 -884 -1743 -710 930 889 -1205 -1138 683 1966 671 94 798
1376G98J21R48J10m83p95J1J332J27j709o78J747R93j640j556P17J864k27j466
$$ 798 919 1867 1977 1494 699 710 2042 2169 460 -218 1529 2522 882 -674 43 1907 1680 214
1394B14l54N96L76M65N5p88n27J126J150o58j656O25J661j93j186q39Q39J053
$$ 214 -140 456 832 1297 1352 564 37 1163 2313 1655 -1 624 2285 2092 906 67 906 1959
1412A959m27j139o58N26R59J2r84o12N49J135l44p09l87J77P67K87q39q07O51
$$ 1959 1532 393 -265 261 1220 1232 248 -364 185 1320 976 267 -120 57 824 1111 272 -535 116
1431A16Q32o6j873n60K010K56j130j236K74J024l70l87m24k89J02M30O47j041
$$ 116 948 882 -991 -1551 459 715 -415 -1651 -1377 -353 -723 -1110 -1534 -1823 -1721 -1291 -644 -1685
1449a685j184J529J648j329j515M13K416j93j646k16J410K07p56K31N4m42J56
$$ -1685 -2869 -1340 308 -1021 -2536 -2123 293 100 -1546 -1762 -352 -145 -901 -670 -616 -1058 -902
1466i02Q22l84j287k86J823K16j475q22J603J284p36j616O68Q95Q53n76m06k74
$$ -902 -80 -464 -1751 -2037 -214 2 -1473 -2295 -692 592 -144 -1760 -1092 -197 656 80 -326 -600
1484f00K23R93j30r03m16R58K27j95r60MQ83M91m18r00k87J325J079p89j440N06
$$ -600 -377 616 486 -417 -833 125 352 157 -803 -799 84 575 157 -743 -1030 295 1374 585 -855 -349
1504c49J619K43r51n12J217M3jK15k73n65K31J089n03j596n7K053K68k260p29
$$ -349 1270 1513 562 50 1267 1310 1309 1524 1251 686 917 2006 1503 -93 -150 1903 2171 -89 -818
1523h18J652J188j338r03R03L79k06K10K7l68m83J002R09j504q83O31J299p23
$$ -818 834 2022 684 -219 684 1063 857 1067 1094 726 243 1245 2154 650 -233 398 1697 974
1541I74j932L59J527Jr97o01J00O83n5l51k96j11N49O12l77q78l2Q85P02p54r82
$$ 974 -958 -599 928 929 -68 -669 -569 114 59 -292 -588 -699 -150 462 85 -793 -825 60 762 8 -974
1562i74M07P36J90n31r51K75R21J26j332l46R68K81l76o12L43k82N12K56l02r46
$$ -974 -567 169 359 -172 -1123 -848 73 199 -1133 -1479 -511 -230 -606 -1218 -875 -1157 -645 -389 -691 -1637
1582a637J01J453N65j599j192J762J071m63j484M78J058k83r78j09Q57m73m5L87
$$ -1637 -1536 -83 482 -1117 -2309 -547 524 61 -1423 -945 113 -170 -1148 -1257 -400 -873 -918 -531
1600e31l07j074P91J349l88j675j5J632M45r69p70J197P35l33l13O1m5N22K59
$$ -531 -838 -1912 -1121 228 -160 -1835 -1850 -218 227 -742 -1512 -315 420 87 -226 -165 -210 312 571
1619E71k87o11j23J285M08o90j269Q73M73L35r72k24M59J215k62o32m19M64J098
$$ 571 284 -327 -450 835 1243 553 -716 157 630 965 -7 -231 228 1443 1181 549 130 594 1692
1638A692n02o15j73O41L34k11o34K66m07O87J41o82j114N65J371o29j348j41J360
$$ 1692 1190 575 402 1043 1377 1166 532 798 391 1078 1219 537 -577 -12 1359 730 -618 -759 601
1657F01M98j146m59Q85M13m46L38J61l07j83O80L16j197m84J187P72j228j257
$$ 601 1099 -47 -506 379 792 346 684 845 538 355 1035 1351 154 -330 857 1629 401 -856
1675h56Q98J121p84q36k54P01K84k46l36k08k4N36K73m00p24N53K40N09j013l64
$$ -856 42 1163 379 -457 -711 -10 274 28 -308 -516 -540 -4 269 -131 -855 -302 -62 447 -566 -930
1695i30L97O06k64j056o2Q20Rm93n81M4O44K53n05k70L82k0L29O2k65l16L90Q45
$$ -930 -533 73 -191 -1247 -1309 -489 -480 -973 -1554 -1510 -866 -613 -1118 -1388 -1006 -1026 -697 -635 -900 -1216 -826 19
1717A9Qj036Q9R36L94r15q98R80R33m73r53L06O93o89L49K23n55k50L92P35o56
$$ 19 27 -1009 -920 16 410 -505 -1403 -423 510 37 -916 -610 83 -606 -257 -34 -589 -839 -447 288 -368
1738c68q42K93J464k35j100j9R98P03j030l54O28j9J61M52m82n63K32M67O02j120
$$ -368 -1210 -917 547 312 -788 -807 191 894 -136 -490 138 119 280 732 250 -313 -81 386 988 -132
1758a32k69Q23P01m75q05L78J066M56o81o88M82R46k78n69j83K01L62K83o79l17
$$ -132 -401 422 1123 648 -157 221 1287 1743 1062 374 856 1802 1524 955 772 973 1335 1618 939 622
1778F22j76K43L89p21m93K92M28L89j149m58P95J181p36j090Q5Q64L10m08l26
$$ 622 446 689 1078 357 -136 156 584 973 -176 -634 161 1342 606 -484 -399 465 775 367 41
1797D1Q5m9L20N61m99p02K24N47K82j201l35J087O81j083n18r2J011l00m71J61
$$ 41 126 77 397 958 459 -243 -19 528 810 -391 -726 361 1042 -41 -559 -651 360 60 -411 -250
1817b50j08L27K45k51q8j65L6P22m01p73j15P07P2p50p57J94N63p8o48LJ95L33
$$ -250 -358 -31 214 -37 -125 -290 -254 468 67 -706 -821 -114 -42 -792 -1549 -1355 -792 -870 -1518 -1515 -1320 -987
1839i87k78m7L2N5M68J06l27K42j2J49M29n15k89N53N87j20r84O9P22L51m64l45
$$ -987 -1265 -1312 -1280 -1225 -757 -651 -978 -736 -748 -599 -170 -685 -974 -421 166 46 -938 -869 -147 204 -260 -605
1861f05K52J05o3J59J35l42M0L54J20o16k10P87R88q44q18L54N77K30p14K10M0
$$ -605 -353 -248 -311 -152 -17 -359 -319 35 155 -461 -671 116 1104 260 -558 -204 373 603 -111 99 139
1882A39o8p0K4J0O1l24M48k15l78L93P89L14o34m35L20Q56O3p78k26Q59K69n5
$$ 139 71 1 25 35 96 -228 220 5 -373 20 809 1123 489 54 374 1230 1293 515 289 1148 1417 1362
1904A362n72J13J18L59l28k8j87o1M34R0o86l89L8R16J9j136M5J95O90o47n80
$$ 1362 790 903 1021 1380 1052 1024 837 776 1210 1300 614 225 263 1179 1198 62 107 302 992 345 -235
1925b35O25K91l95j49O9lk19L69k42n25k66P90M53l55j294L34P21J00p30l22O43
$$ -235 390 681 286 137 206 203 -16 353 111 -414 -680 110 563 208 -1086 -752 -31 69 -661 -983 -340
1946c40L04j17k58n0J33J05L83k79j54J29rK44m55l20M8O88l48p80k89L41L32
$$ -340 -36 -153 -411 -461 -328 -223 160 -119 -273 -144 -153 91 -364 -684 -636 52 -296 -1076 -1365 -1024 -692
1967f92q6o60J19L96j01n2O7o1L21o5j66M7n3N32k6J15m96o4N44M81l27p09L44
$$ -692 -778 -1438 -1319 -923 -1024 -1076 -1009 -1070 -749 -814 -980 -933 -986 -454 -480 -365 -861 -925 -381 100 -227 -936 -592
1990e92N28n1n57J56N28K00l18O7J43l74O82L71m27m63K36Q38J91p02k22M81L50
$$ -592 -64 -115 -672 -516 12 212 -106 -39 104 -270 412 783 356 -107 129 967 1158 456 234 715 1065
2011A065m45k73o2K56k46k44Nj33k1O66m8o44M2M92K68j01l89k1L16L98k2l51
$$ 1065 620 347 285 541 295 51 56 -77 -98 568 520 -124 -82 410 678 577 188 167 483 881 859 508
2033E08L33Q9K33m38m13O5O12J21n94L6r0N21k27j14l45l33N81M09n29k87j76
$$ 508 841 930 1163 725 312 377 989 1110 516 552 462 983 756 642 297 -36 545 954 425 138 -38
2054c8M86o2l39r0N33J87p30l33K73N99m46M2j07k87l55M35L92o60k69L1O01J24
$$ -38 448 386 47 -43 490 677 -53 -386 -113 486 40 82 -25 -312 -667 -232 160 -500 -769 -738 -137 -13
2076a3p41J40L30K10p20L51K97l29K81K33k26o23P05K99n39n38j5R32k37l08j50
$$ -13 -754 -614 -284 -74 -794 -443 -146 -475 -194 39 -187 -810 -105 194 -345 -883 -898 34 -203 -511 -661
2097f61o3K50k11P8l44L8K78L47m71p9J52O10R0n82j00N36j37L58m91l06L48o7
$$ -661 -724 -474 -685 -607 -951 -913 -635 -288 -759 -838 -686 -76 14 -568 -668 -132 -269 89 -402 -708 -360 -427
2119d27L66j61m31M39K86m91M1r1O80m45k66O6L18L55j15K53k90k41J73M75J70
$$ -427 -61 -222 -653 -214 72 -419 -378 -469 211 -234 -500 -434 -116 239 124 377 87 -154 19 494 664
2140F64n16K36N46k55n02k7L34m1n47J21J17j66K20K00K90m30j92M84K46j4k51
$$ 664 148 384 930 675 173 146 480 439 -108 13 130 -36 184 384 674 244 52 536 782 768 517
2161E17L0L62l17m06M70J4J49l47J76k16k74N42P4n32j75K65L24Lm36l26K55N8
$$ 517 547 909 592 186 656 670 819 472 648 432 158 700 774 242 67 332 656 659 223 -103 152 210
2183B10J13l15R6O5L17l2m64O1L89K70q86J34JL26l04K36k33m06p8J68J73k09
$$ 210 323 8 104 169 486 454 -10 51 440 710 -176 -42 -41 285 -19 217 -16 -422 -500 -332 -159 -368
2205c68k9K95K58r00j64J005M56p55p68P01K11k95J55r8l1j61j08N08k47o06O5
$$ -368 -397 -102 156 -744 -908 97 553 -202 -970 -269 -58 -353 -198 -296 -327 -488 -596 -88 -335 -941 -876
2226h76O55m68j23K01J18J44n37m37R29L0k96J14p6j76J78N32k5l64j24M49K94
$$ -876 -221 -689 -812 -611 -493 -349 -886 -1323 -394 -364 -660 -546 -622 -798 -620 -88 -113 -477 -601 -152 142
2247A42k92j25K17J04j08l77m7K22J83j36K9m62N91j1K83k38k74L36j2J30P9J00
$$ 142 -150 -275 -58 46 -62 -439 -486 -264 -81 -217 -188 -650 -59 -70 213 -25 -299 37 25 155 234 334
2269C34j00L12j67p3m44M06K35o9q31K41N22J99l92j0n7L04j42Q8K7p6j42Q44
$$ 334 234 546 379 306 -138 268 503 434 -397 -156 366 565 173 163 106 410 268 356 383 307 165 1009
2291A009j30n64K53O35l48m18l18N62O04n52Lk9j82OJ60M4n91k45LN41k05n44
$$ 1009 879 315 568 1203 855 437 119 681 1285 733 736 707 525 531 691 735 144 -101 -98 443 238 -306
2313c06L33K82M5n15J07K63p9k8j05j21K8K02L69m44k65k8J91mk34j75n5J01J85
$$ -306 27 309 354 -161 -54 209 130 102 -3 -124 -96 106 475 31 -234 -262 -71 -75 -309 -484 -539 -438 -253
2336b53m9j1P1K47j50q8q3O92k94k45j53J32Q1l73K91J39p05mM42pl04j20L21
$$ -253 -302 -313 -242 5 -145 -233 -316 376 82 -163 -316 -184 -103 -476 -185 -46 -751 -755 -313 -320 -624 -744 -423
2359d23o8j4n45J63M78no39L41M20l19k48J16L30o1k53P27l46J8K0M18j77r3k1
$$ -423 -491 -505 -1050 -887 -409 -414 -1053 -712 -292 -611 -859 -743 -413 -474 -727 0 -346 -328 -308 110 -67 -160 -181
2382a81j17K57J5j12l74O21L4K7O6l73K92J81K8m0J6l20L31K26l68p5K68J14N7
$$ -181 -298 -41 -26 -138 -512 109 143 170 236 -137 155 336 364 324 340 20 351 577 209 134 402 516 573
2405E73n55L0M61l12j53L6j21K59k62K49q3R3q6J08J79q0k89O16L1l70j8n0N27
$$ 573 18 48 509 197 44 80 -41 218 -44 205 122 215 129 237 416 336 47 663 694 324 306 256 783
2428G83q8l00j88M36J56l16j39J58J24j26k45M25m06J55K64m45l63j1K95J38k27
$$ 783 695 395 207 643 799 483 344 502 626 500 255 680 274 429 693 248 -115 -126 169 307 80
2449H0j02l4M26o9m70j58L7J72l30N4O4J08k14j00K91o24K53N5J50r3K4p5O01
$$ 80 -22 -56 370 301 -169 -327 -290 -118 -448 -394 -330 -222 -436 -536 -245 -869 -616 -561 -411 -504 -480 -555 46
2472D6j79M1k68J32L37k02Q8J6J50k48K45l48K3L6kp1M5n48K98mL07l38o7J61
$$ 46 -133 -92 -360 -228 109 -93 -5 11 161 -87 158 -190 -167 -131 -133 -204 -159 -707 -409 -413 -106 -444 -511 -350
2496c50j95J1j3J59J20m09K35J20J99m50N3O13k44k70K02Q4l6J5m91N73l0k8m7
$$ -350 -545 -534 -547 -388 -268 -677 -442 -322 -123 -573 -520 93 -151 -421 -219 -135 -171 -156 -647 -74 -104 -132 -179
2519a79J72p7k5K08J41R8k85L89Q3p7J00p8J53j83k00L6J3R7M5j23p9R3J82m10
$$ -179 -7 -84 -109 99 240 338 53 442 525 448 548 470 623 440 240 276 289 386 431 308 229 322 504 94
2543I4J36L5j00L5L6m3L8R2l12M50m11n8N19l43j00J22L79M20p82r7J65L38J3
$$ 94 230 265 165 200 236 193 231 323 11 461 50 -8 511 168 68 190 569 989 207 110 275 613 626
2566F26m68J73L77l51k07K53J53n31L33J3L90o71N3P3K61l00k37J35K66K5j12
$$ 626 158 331 708 357 150 403 556 25 358 371 761 90 143 216 477 177 -60 75 341 366 254
2587B54L3k10j27N7n14K36p5j24J93J58m51j89L28P0k03k25J24K50K00l63K5K8
$$ 254 287 77 -50 7 -507 -271 -346 -470 -277 -119 -570 -759 -431 -361 -564 -789 -665 -415 -215 -578 -553 -525
2609e25M27p02L08K1J96J27l64J04J22j62K38j36l17p6K92L47p3n32L01P5P8j19
$$ -525 -98 -800 -492 -471 -275 -148 -512 -408 -286 -448 -210 -346 -663 -739 -447 -100 -173 -705 -404 -329 -251 -370
2631c70l99P35l37k3J40k9N9j27J04p0P5k44J91J40k81j04K38M04n49L17l6L61
$$ -370 -769 -34 -371 -394 -254 -283 -224 -351 -247 -317 -242 -486 -295 -155 -436 -540 -302 102 -447 -130 -166 195
2653A95k82m8K80M1r0J95K81N8l95q0L16m8j77R0L71l03K82k36NM19l04k33Q0
$$ 195 -87 -135 145 186 96 291 572 630 235 155 471 423 246 336 707 404 686 450 455 874 570 337 417
2676D17K62j30Q5p9J05k32Pn1M03m80J04N6K90O0o17K76nJ37l99L39l6p5jl57
$$ 417 679 549 634 555 660 428 435 384 787 307 411 467 757 817 200 476 471 608 209 548 512 437 436 79
2700G9L76j1j55q4M99k43m61J61m3k4j61j2J74j40M5J04j90K28r4n16L13R6k46
$$ 79 455 444 289 205 704 461 0 161 118 94 -67 -79 95 -45 0 104 -86 142 48 -468 -155 -59 -305
2723c05k10M9J56j63Oj7r9j13J82jJ66j79K16l17P4J01q2O0j09j78J61QK56J20
$$ -305 -515 -466 -310 -473 -467 -484 -583 -696 -514 -515 -349 -528 -312 -629 -555 -454 -536 -476 -585 -763 -602 -594 -338 -218
2747b18l97J20R3k19n0NJ34j72J4J34P6l9p5J53K09N7n11K43J04J35m00N57J92
$$ -218 -615 -495 -402 -621 -671 -666 -532 -704 -690 -556 -480 -519 -594 -441 -232 -175 -686 -443 -339 -204 -604 -47 145
2770A45k42K43l94J25j52K0K05K79m86K31J96L14m62j15J4L25p3nK15j89k7j91
$$ 145 -97 146 -248 -123 -275 -255 -50 229 -257 -26 170 484 22 -93 -79 246 173 168 383 194 167 -24
2792b4N84Jk30q4J35j39J57k27K35j35j79J19N0K09j80k13J48RJ70Ql66M20k22
$$ -24 560 561 331 247 382 243 400 173 408 273 94 213 263 472 292 79 227 236 406 414 48 468 246
2815B46OP7J38l6j0Mk24K03l65J47K72j37o1n59O09K4j83J47j20P1k43j0r5K7
$$ 246 252 329 467 431 421 425 201 404 39 186 458 321 260 -299 310 334 151 298 178 249 6 -4 -99 -72
2839g2l03O76j51k00J1L6K38k64k21J34J03J25l38N6j30K6j47L45m85J62j66J46
$$ -72 -375 301 150 -50 -39 -3 235 -29 -250 -116 -13 112 -226 -170 -300 -274 -421 -76 -561 -399 -565 -419
2861d19N0R6l80M61q6l41J78M0J21p7N8K19P3k22j9J4J9M1m55K06K51r2k61q0
$$ -419 -369 -273 -653 -192 -278 -619 -441 -401 -280 -357 -299 -80 -7 -229 -248 -234 -215 -174 -629 -423 -172 -264 -525 -605
2885f05Q5J83k98J32L02m3k16K65J19j23Q4l45J42K32lJ76j66J85P5m27M21k09
$$ -605 -520 -337 -635 -503 -201 -244 -460 -195 -76 -199 -115 -460 -318 -86 -89 87 -79 106 181 -246 175 -34
2907c4j07M17l5j43p6K79J11j42J03l03K22k3k6L59j13mr5rJ67J15j21NL9k82
$$ -34 -141 276 241 98 22 301 412 270 373 70 292 269 243 602 489 485 390 381 548 663 542 547 586 304
2931C04q8L29Q3l23j86L10l19J77o2L9l40R3K19o1l6K82Q5k26j08kL02J56j73
$$ 304 216 545 628 305 119 429 110 287 225 264 -76 17 236 175 139 421 506 280 172 170 472 628 455
2954D55j32p7J37r3K6J03l14J96k49J37j64l6L61r7k95J71j7j43k44M33m32Q9
$$ 455 323 246 383 290 316 419 105 301 52 189 25 -11 350 253 -42 129 112 -31 -275 158 -274 -185
2976a85l4L7L4k79J86j74j69J25M1qJ21O0k88J18J11l66L04O2l58K25L88o1n28
$$ -185 -219 -182 -148 -427 -241 -415 -584 -459 -418 -426 -305 -245 -533 -415 -304 -670 -366 -304 -662 -437 -49 -110 -638
2999f38j15J30M82m6l32Q6K10l22K37q3l20M77m7K32r9r1j6J35k63J43N0J27k6
$$ -638 -753 -623 -141 -187 -519 -433 -223 -545 -308 -391 -711 -234 -281 -49 -148 -239 -255 -120 -383 -240 -190 -63 -89
3022h9k70L04l30K14nj56K35NK75k40J33n13L01J64m1k94J26p8M01q3N4q4l1p
$$ -89 -359 -55 -385 -171 -176 -332 -97 -92 183 -57 76 -437 -136 28 -13 -307 -181 -259 142 59 113 29 -2 -9
3046ik9K08k9k02N59k46k03M10j21O8K02P9o82L79l1K16o7k54j83M39j28j50m8
$$ -9 -38 170 141 -61 498 252 49 459 338 406 608 687 5 384 353 569 502 248 65 504 376 226 178
3069A78L12j60k35K96k49J23R4k37J55jj22J88l30K58q1K1J54m49L88j76J31K16
$$ 178 490 330 95 391 142 265 359 122 277 276 154 342 12 270 189 210 364 -85 303 127 258 474
3091D74m17j60J12k2R9n32O17LJj08j80L1L24l02J2M01l52k63j29K93K2j79R9
$$ 474 57 -103 9 -13 86 -446 171 174 175 67 -113 -82 242 -60 -48 353 1 -262 -391 -98 -76 -255 -156
3114a56j61L3j64O5L9j91J63l18Q1j57L85r4j27K28l25J33J41Qj24J16k3j03K16
$$ -156 -317 -284 -448 -383 -344 -535 -372 -690 -609 -766 -381 -475 -602 -374 -699 -566 -425 -417 -541 -425 -448 -551 -335
3137c35J00m7j69J49j00J14n9K41J4k49q4K61j58L09J76k40n6K52r2J7L9k5J3
$$ -335 -235 -282 -451 -302 -402 -288 -347 -106 -92 -341 -425 -164 -322 -13 163 -77 -133 119 27 44 83 58 71
3160G1j99J76O2j37J10M8k1j3J6L46k08k31J00j3K79r2J02k83j03K88k57L47J61
$$ 71 -128 48 110 -27 83 131 110 97 113 459 251 20 120 107 386 294 396 113 10 298 41 388 549
3183E49j15k7l09K49K05RJ71l38J5J80l43L26mN8k89Pj10o1j19K07j38j06L8J57
$$ 549 434 407 98 347 552 561 732 394 409 589 246 572 568 626 337 344 234 173 54 261 123 17 55 212
3207B12M12o09O%K9mQ2j11j10M7J83k43p4O0j03j9J37k32J33pP0n6q3MJ34K76
$$ 212 624 15 21 21 50 46 128 17 -93 -46 137 -106 -180 -120 -223 -242 -105 -337 -204 -211 -141 -197 -280 -276 -142 134
3233A34j65k36Q0k68R7J09J08j75J34j63J37k13K78k82K5q4M56ro33N28j34M19
$$ 134 -31 -267 -187 -455 -358 -249 -141 -316 -182 -345 -208 -421 -143 -425 -400 -484 -28 -37 -670 -142 -276 143
3255A43o49L10n1R1J80l56R5L15j82q5J38k26L91j04k11J73J90n98K63K12j39
$$ 143 -506 -196 -247 -156 24 -332 -237 78 -104 -189 -51 -277 114 10 -201 -28 162 -436 -173 39 -100
3276a00k23J58N8J12m6r4k9r7J5J19L69k0o9j60K33J42l46J3L6k42K25j16J85
$$ -100 -323 -165 -107 5 -41 -135 -164 -261 -246 -127 242 222 153 -7 226 368 22 35 71 -171 54 -62 123
3299A23J51m12J75J13J01k65j64m8K62n9J37K44K9P7l83r5K17K26k24R1j75O1
$$ 123 274 -138 37 150 251 -14 -178 -226 36 -23 114 358 387 464 81 -14 203 429 205 296 121 182
3321A82J90j60J85k61L9J74K67m33o0j26K10J13k16J09l9J85N2l00L92M8l84J75
$$ 182 372 212 397 136 175 349 616 183 123 -3 207 320 104 213 174 359 411 111 503 551 167 342
3343C42q1m6o1J06k0l27M7J41L0k1rK2J99k12k84LJ72j62K97J13p8j71P6O7j25
$$ 342 261 215 154 260 240 -87 -40 101 131 110 101 123 322 110 -174 -171 1 -161 136 249 171 0 76 143 18
3368A8k71J61m3J05K44k09k9q9j37rK43K9q3l59L85Nk27K35Oo6j88K02k32K76
$$ 18 -253 -92 -135 -30 214 5 -24 -113 -250 -259 -16 13 -70 -429 -44 -39 -266 -31 -25 -91 -279 -77 -309 -33
3392c3M2j35j09M65k04m42L25J55k19Mj62J82k15M11m43l1N7r7K08J27lJ34j7
$$ -33 9 -126 -235 230 26 -416 -91 64 -155 -151 -313 -131 -346 65 -378 -409 -352 -449 -241 -114 -117 17 0
3415@mM8N5J64O8m07Q3j15K52p3P9r6K45q0k66K99k44J68J7m1K7K10m61L52J16
$$ 0 -4 44 99 263 331 -76 7 -108 144 71 150 54 299 219 -47 252 8 176 193 152 179 389 -72 280 396
3440C96p2l2J7l8j86N65k13k1J44l07K57k28L89m50k34K97K04k77j38K08K51l09
$$ 396 324 292 309 271 85 650 437 416 560 253 510 282 671 221 -13 284 488 211 73 281 532 223
3462B23J16M2j13J72l66J61L52l26l49J68J91O2l64K88j72k58k63L44J59K2l43
$$ 223 339 381 268 440 74 235 587 261 -88 80 271 333 -31 257 85 -173 -436 -92 67 89 -254
3483b54M7O83q43M59K81n03k05K50j73K21n0k35N00j27k07l45K30K95k16l9n9
$$ -254 -207 476 -367 92 373 -130 -335 -85 -258 -37 -87 -322 178 51 -156 -501 -271 24 -192 -231 -290
3504b90O5l60J78Q3K33k14j35O2O5j67O04q1m03J94m0m10L54j04K90O1j85k86
$$ -290 -225 -585 -407 -324 -91 -305 -440 -378 -313 -480 124 43 -360 -166 -206 -616 -262 -366 -76 -15 -200 -486
3526d86K66j92%L06N7k31o5L52j7j58J39QP4m59M28q6r1J72oJ3p2K19o1J50l34
$$ -486 -220 -412 -412 -106 -49 -280 -345 7 -10 -168 -29 -21 53 -406 22 -64 -155 17 11 24 -48 171 110 260 -74
3551g4J11K33k94Q1K5j18K51lo2J71l56J30K50r6J22j0k90N6k72J29K66K77k87
$$ -74 37 270 -24 57 82 -36 215 212 150 321 -35 95 345 249 371 361 71 127 -145 -16 250 527 240
3574B40R4j0R3k98K67r8J94J11r5l48J70l3j31J69J24Q4m62K28L9j76k42oJ34
$$ 240 334 324 417 119 386 288 482 593 498 150 320 287 156 325 449 533 71 299 338 162 -80 -86 48
3597D8Nj88M7N9j16K94k18R8J93j20j1J79l92M2J41q4k02j23L55k58K39j79K19
$$ 48 53 -135 -88 -29 -145 149 -69 29 222 102 91 270 -122 -80 61 -23 -225 -348 7 -251 -12 -191 28
3620B8j47k45L42k72M4J22j40K24O0j24j71J27L4l66J42L1K50l98K69r0K68m04
$$ 28 -119 -364 -22 -294 -250 -128 -268 -44 16 -108 -279 -152 -118 -484 -342 -311 -61 -459 -190 -280 -12 -416
3642d16K90r2l83J46K55j87J10J82m19L23j15L83j42J73n68K1K11J43n2k28K05
$$ -416 -126 -218 -601 -455 -200 -387 -277 -95 -514 -191 -306 77 -65 108 -460 -439 -228 -85 -137 -365 -160
3663a60m8J12J08q5r1J78L5k47l6j14M93k24p5J92k42J65P7N8J8j20M32m21J57
$$ -160 -208 -96 12 -73 -164 14 49 -198 -234 -348 145 -79 -154 38 -204 -39 38 96 114 -6 426 5 162
3686A62l9K8J24K9j68p5K62q0lq3k3k28O7R6K28j90J41k00L16l38R0J12pj90L0
$$ 162 123 151 275 304 136 61 323 243 240 157 134 -94 -27 69 297 107 248 48 364 26 116 228 221 31 61
3711F1L12PL3j57J37j99j25L92k55q5L6k9o2j3L58n52J46J94m1l56K34M2J29p5
$$ 61 373 380 413 256 393 194 69 461 206 121 157 128 66 53 411 -141 5 199 158 -198 36 78 207 132
3735A32O0m65L98k2o5m0K7k79L35k25K3l2j4j33J62r9j05m5L59J15k08K14k59
$$ 132 192 -273 125 103 38 -2 25 -254 81 -144 -121 -153 -167 -300 -138 -237 -342 -387 -28 87 -121 93 -166
3758a66p6K64j16j00N1k47lJ9K49m23J09J01P2J70J25k87L3O3j64K48n0l13M39
$$ -166 -242 22 -94 -194 -143 -390 -393 -374 -125 -548 -439 -338 -266 -96 29 -258 -225 -162 -326 -78 -128 -441 -2
3781bn11K43J91l25K94J32l48J1K81k88J48J46J44m71L88O5o4J37j75j13J79l0
$$ -2 -513 -270 -79 -404 -110 22 -326 -315 -34 -322 -174 -28 116 -355 33 98 34 171 -4 -117 62 32
3803C2m0k8j39K21J77j92K71k08L71l33L66n50M07j64K0Qk18N68n89L27j1J16
$$ 32 -8 -36 -175 46 223 31 302 94 465 132 498 -52 355 191 211 219 1 569 -20 307 296 412
3825D12j69j14j91J74Q0O7m1K16j59l2M2k70J56L06k30k36J65J19o9j46K34J22
$$ 412 243 129 -62 112 192 259 218 434 275 243 285 15 171 477 247 11 176 295 226 80 314 436
3847D36q6N3j43k94K58Mj56q4P3j75N84k21m02L55J25Q9k85L8k18l9N8K29k83
$$ 436 350 403 260 -34 224 228 72 -12 61 -114 470 249 -153 202 327 416 131 169 -49 -88 -30 199 -84
3870h4J18J5l44L06R5k41O4j18%K4k97K51j57k58M13Nk45J42O3r8K11k70K89j94
$$ -84 34 49 -295 11 106 -135 -71 -189 -189 -165 -462 -211 -368 -626 -213 -208 -453 -311 -248 -346 -135 -405 -116 -310
3894c10K3j83L62j76K69k71n8Q7kN1K18k89K5j04o2L00k09J64J60mK1q6mN40l78
$$ -310 -287 -470 -108 -284 -15 -286 -344 -257 -259 -208 10 -279 -254 -358 -420 -120 -329 -165 -5 -9 12 -74 -78 462 84
3919H4j14m9K56j58%L1J36O2j73K57j18m7J18j62K9n4o8mP2J6p6N6L43m21K38
$$ 84 -30 -79 177 19 19 50 186 248 75 332 214 167 285 123 152 98 30 26 98 114 38 94 437 16 254
3944B54r2J01K3%lj23O6o7j32P6QK26o7o8j40P6l6M04k04l23K69j94Q1K4k61L06
$$ 254 162 263 286 286 283 160 226 159 27 103 111 337 270 202 62 138 102 506 302 -21 248 54 135 159 -102 204
3970B04nQ9Q3k70K18m16N04k24q2J27q0R0o3m9j09j27K80r7J55l12l6K37j96o5
$$ 204 199 288 371 101 319 -97 407 183 101 228 148 238 175 126 17 -110 170 73 228 -84 -120 117 -79 -144
3994a44R8M5j71K4P9l5M6o0q5K3p9J1K09R2m26J6M2K51O6m29J12r8K58J4j75P6
$$ -144 -46 -1 -172 -148 -69 -104 -58 -118 -203 -180 -259 -248 -39 53 -373 -357 -315 -64 2 -427 -315 -413 -155 -141 -316 -240
4020b40J56j79n6n8N4J98l45K74l71L35J8M5j47K50J01r5l13K6J05M6N5J43k36
$$ -240 -84 -263 -319 -377 -323 -125 -470 -196 -567 -232 -214 -169 -316 -66 35 -60 -373 -347 -242 -196 -141 2 -234
4043b34n3O5QL31k69l6k83L38J03L2m96K30M91n61K73j92J45o8J94k31Q5M0j56
$$ -234 -287 -222 -214 117 -152 -188 -471 -133 -30 2 -494 -264 227 -334 -61 -253 -108 -176 18 -213 -128 -88 -244
4066b44K35R4r4j9L85l87P2k92J84oJ86j7j06K1J06K24J15k42n4K9Q0k6k12J05
$$ -244 -9 85 -9 -28 357 -30 42 -250 -66 -72 114 97 -9 12 118 342 457 215 161 190 270 244 32 137
4090A37L4n2K45j25P6nj35J77j21M27m89K06j67j83K0J32l8O5k46K55R7k63K6
$$ 137 171 119 364 239 315 310 175 352 231 658 169 375 208 25 45 177 139 204 -42 213 310 47 73
4113G3K57k63P8K0n54M04M2J59r7k98J27P4l16K75O6m9R3k07Q7j93K97k02J20
$$ 73 330 67 145 165 -389 15 57 216 119 -179 -52 22 -294 -19 47 -2 91 -116 -29 -222 75 -127 -7
4136gq0J30N6j84j71P1q7K99M8k20K07j98o1j49J65N2p6N4J31l00q9R0m9K75q4
$$ -7 -87 43 99 -85 -256 -185 -272 27 75 -145 62 -136 -197 -346 -181 -129 -205 -151 -20 -320 -409 -319 -368 -93 -177
4161a77j90K16q0Q0j98J11L3J23j21j34j57K42p2K21p4j32L50k85m2K70O8j36
$$ -177 -367 -151 -231 -151 -349 -238 -205 -82 -203 -337 -494 -252 -324 -103 -177 -309 41 -244 -286 -16 52 -84
4183h4k53M18k7j7P5j06k93K61j42K31m1j28K55l8r2N5j01n0j30M23J56m68J90
$$ -84 -337 81 54 37 112 6 -287 -26 -168 63 22 -106 149 111 19 74 -27 -77 -207 216 372 -96 94
4206I4J36K16k97P8n1k26J79J08K8l2j38K65l77L85l36K30J13k46L19l30p2K33
$$ 94 230 446 149 227 176 -50 129 237 265 233 95 360 -17 368 32 262 375 129 448 118 46 279
4228B79j54q9R5q0J67m90O48m5j84Q1j81L2N36p32K40j37l3K18N8j51J92k39j24
$$ 279 125 36 131 51 218 -272 376 331 147 228 47 79 615 -117 123 -14 -47 171 229 78 270 31 -93
4251i3K57r1j93K07k10M00k81k95M91l65l47K84L47n1q7j91j45K03J35K57n74
$$ -93 164 73 -120 87 -123 277 -4 -299 192 -173 -520 -236 111 60 -27 -218 -363 -160 -25 232 -342
4272c42j61O21l50J79l53N6K39k70J53j14P0J30j38J26kj87K68j08N2p6l6N4J71
$$ -342 -503 118 -232 -53 -406 -350 -111 -381 -228 -342 -272 -142 -280 -154 -156 -343 -75 -183 -131 -207 -243 -189 -18
4295a8k24L0J85J2n03K48L21Nj91j38K0K11kk61L13j75K2L02np9J12L3Q8k49k75
$$ -18 -242 -212 -27 -15 -518 -270 51 56 -135 -273 -253 -42 -44 -305 8 -167 -145 157 152 73 185 218 306 57 -218
4320b18L30K3l08K20O3J73n02K40K44j37R3n0j04K83j62k64J75j22M83o59P11
$$ -218 112 135 -173 47 110 283 -219 21 265 128 221 171 67 350 188 -76 99 -23 460 -199 512
4341E12l47j60K18j63j40J63L2N8L13n95M37j43k40K77j64j19J14J54j0n7j00
$$ 512 165 5 223 60 -80 83 115 173 486 -109 328 185 -55 222 58 -61 53 207 197 140 40
4362D0Q0j6K01k71PK89m60J18K0J77j58K36k53Q5J83N5k57J85l88K24p9Lk16K14
$$ 40 120 104 305 34 41 330 -130 -12 8 185 27 263 10 95 278 333 76 261 -127 97 18 21 -195 19
4386A9L6K7p0n9n7j01L00m19J57Q2j74q7J68J51k50L54k57N9J53N0l84L27j29
$$ 19 55 82 12 -47 -104 -205 95 -324 -167 -85 -259 -346 -178 -27 -277 77 -180 -121 32 82 -302 25 -104
4409a04j86K46m14L79j59l2K01j33j7l0J34J04j52k57M24n67L11k12J49q2K79
$$ -104 -290 -44 -458 -79 -238 -270 -69 -202 -219 -249 -115 -11 -163 -420 4 -563 -252 -464 -315 -397 -118
4430a18l0j42J95m6j19j67L70j76J00L28m28J85k4K20p3l2q9J08j62J74K08r7
$$ -118 -148 -290 -95 -141 -260 -427 -57 -233 -133 195 -233 -48 -72 148 75 43 -46 62 -100 74 282 185
4452A85j7J6J2j39Q1J0km2N2m3n4K4k55K73j9oK37k77O2j44K87lL14r8n28K91
$$ 185 168 184 196 57 138 148 146 104 156 113 59 83 -172 101 82 76 313 36 98 -46 241 238 552 454 -74 217
4478B17k48L10q3R5J03n56N10j84Q2p5OL5l22L03K04j02j84J28Qj12J4M5k54P9
$$ 217 -31 279 196 291 394 -162 348 164 246 171 177 212 -110 193 397 295 111 239 247 135 149 194 -60 19
4502A9N4n9J91l59J58K14l4l25R9O2J53m19J69n8J29j85K79k35Q5Q7k55J78o4
$$ 19 73 14 205 -154 4 218 184 -141 -42 20 173 -246 -77 -135 -6 -191 88 -147 -62 25 -230 -52 -116
4525a16n1j40M09k26j37j2O8o3J3J44j52Pj93Q8k4j7J1M11l78J24K29l57K02L58
$$ -116 -167 -307 102 -124 -261 -273 -205 -268 -255 -111 -263 -256 -449 -361 -385 -402 -391 20 -358 -234 -5 -362 -160 198
4549A98l52J00k56R4L44l76o5L3K51m51M35K2q2J22j17j08M4J82k6j2K08l62J15
$$ 198 -154 -54 -310 -216 128 -248 -313 -280 -29 -480 -45 -23 -105 17 -100 -208 -164 18 -8 -20 188 -174 -59
4572e9Q9j47O2J0J94l02K12pq9R2j22J37K9J34k69O8j29K00R6p6Jl40O26k53J35
$$ -59 30 -117 -55 -45 149 -153 59 52 -37 55 -67 70 99 233 -36 32 -97 103 199 123 124 -216 410 157 292
4597B92O0o9k41J45j32m9J6M31j87l41K36j5O8J07j15P4j19K93j6l63l50K03J16
$$ 292 352 283 42 187 55 6 22 453 266 -75 161 146 214 321 206 280 161 454 438 75 -275 -72 44
4620D4J16o8r2J95o3Kkj99Q5kP0k9k3N0P8j5k91K40j17j12K72j44o5J06q7j69
$$ 44 160 92 0 195 132 134 132 -67 18 16 86 57 34 84 162 147 -144 96 -21 -133 139 -5 -70 36 -51 -220
4646b20M87k22L3k61j92L74m0j52J88l3l42N7M32k90J69j32J32m30M56k50m6J61
$$ -220 267 45 78 -183 -375 -1 -41 -193 -5 -38 -380 -323 109 -181 -12 -144 -12 -442 14 -236 -282 -121
4668a21K06k55P6n9L17k91q9j02K83j44J83p3m09O12j50l47m3M81jm10K02J25
$$ -121 85 -170 -94 -153 164 -127 -216 -318 -35 -179 4 -69 -478 134 -16 -363 -406 75 74 -336 -134 -9
4690iP7j37q8%J59k36K42q7m5J09k8m3Q9j39K75r7k07J66q0K25J97m76M07m25
$$ -9 68 -69 -157 -157 2 -234 8 -79 -124 -15 -43 -86 3 -136 139 42 -165 1 -79 146 343 -133 274 -151
4714a51K81j62K28j41j48J07r1M03j46P9j79L38l16J94m21jJ15K88j55k03J13
$$ -151 130 -32 196 55 -93 14 -77 326 180 259 80 418 102 296 -125 -126 -11 277 122 -81 32
4735C2P3%j81K48j10J4k4N4K28j98j08L47n60L24N7j12K06o71L18K54R1j5j55
$$ 32 105 105 -76 172 62 76 52 106 334 136 28 375 -185 139 196 84 290 -381 -63 191 282 267 112
4758A12J32p0k20m4J26J52M5k90K9rn2J58k40N5K96O2n3J11j18l56K53k43M69
$$ 112 244 174 -46 -90 36 188 233 -57 -28 -37 -89 69 -171 -116 180 242 189 300 182 -174 79 -164 305
4781C05k48M9m91M99r9k6P4k16K85m68J78n6n0K82k27O5J04m68J87K54l28L45
$$ 305 57 106 -385 114 15 -11 63 -153 132 -336 -158 -214 -264 18 -209 -144 -40 -508 -321 -67 -395 -50
4803e0j26l0L63l10J10l50K29L2N7j18J08MJ62l06N6P86p19j41N9K7K9J76l15
$$ -50 -176 -206 157 -153 -43 -393 -164 -132 -75 -193 -85 -81 81 -225 -169 617 -102 -243 -184 -157 -128 48 -267
4826b67r2N73l22J99j11J39j28J28L0m35N24l24o1K76L7l1k80P6L4L07k29L58
$$ -267 -359 214 -108 91 -20 119 -9 119 149 -286 238 -86 -147 129 166 135 -145 -69 -35 272 43 401
4848D01n02m9n2M36j45L44k00l93N22j62j59L89m46k1J32K60m11P2J33j62J75
$$ 401 -101 -150 -202 234 89 433 233 -160 362 200 41 430 -16 -37 95 355 -56 16 149 -13 162
4869A62R5L0k38J1L8pJ39j22k26J51j53M65l22R5m3K97k05J07l09J22j40J30N3
$$ 162 257 287 49 60 98 91 230 108 -118 33 -120 345 23 118 75 372 167 274 -35 87 -53 77 130
4892A30k03J00L6J16l78K19q2r2J33m6p7J91J50k04j47L02k4l25J69k95J93K85
$$ 130 -73 27 63 179 -199 20 -62 -154 -21 -67 -144 47 197 -7 -154 148 124 -201 -32 -327 -134 151
4914A51k1k71J34k59K26k38J29l03L88j92J05j12j8J53p1J7J74J1k35K20l10K83
$$ 151 130 -141 -7 -266 -40 -278 -149 -452 -64 -256 -151 -263 -281 -128 -199 -182 -8 3 -232 -12 -322 -39
4936c9j15j79M09J9o2J3r6K35j49k27l1j08Q1L53k9p3q3M9J39j95J98k27j50L13
$$ -39 -154 -333 76 95 33 46 -50 185 36 -191 -222 -330 -249 104 75 2 -81 -32 107 -88 110 -117 -267 46
4960D6J06k11L56m34L78N4p3j91m70O86n11L15J3K19P2j44j78l2n6J10n8K10P3
$$ 46 152 -59 297 -137 241 295 222 31 -439 247 -264 51 64 283 355 211 33 1 -55 55 -3 207 280
4983B80l25K2L57m28N97m29J88j03R0k28L50r8j31k34O7K18j88J7K14k96M1o1
$$ 280 -45 -23 334 -94 503 74 262 159 249 21 371 273 142 -92 -25 193 5 22 236 -60 -19 -80
5005h0j50K41L95k91M7k57L08k48j49L25O7k41L8l9j70J36k02J53L50j72N0j97
$$ -80 -230 11 406 115 162 -95 213 -35 -184 141 208 -33 5 -34 -204 -68 -270 -117 233 61 111 -86
5027h6j90J68j48K11K81j77j89L8m4PM9K8k6j35j48L39l45K15k97K87j36Q5%K65
$$ -86 -276 -108 -256 -45 236 59 -130 -92 -136 -129 -80 -52 -78 -213 -361 -22 -367 -152 -449 -162 -298 -213 -213 52
5051E2k48l18J76N9N7j14K93j3J61q0k61l6L8P1j41L8K31j97j29J01K10j29j49
$$ 52 -196 -514 -338 -279 -222 -336 -43 -56 105 25 -236 -272 -234 -163 -304 -266 -35 -232 -361 -260 -50 -179 -328
5074c28J91K5m4K76q4o2LJ11k01o5J16k7K0J42j31R6l14J44K32K42k48k53J61
$$ -328 -137 -112 -156 120 36 -26 -23 88 -113 -178 -62 -89 -69 73 -58 38 -276 -132 100 342 94 -159 2
5097BO5j68r7K88j36J64j08K01j44L63l27m2k4J34L5j72J34k62J36M4L70k42k9
$$ 2 67 -101 -198 90 -46 118 10 211 67 430 103 61 37 171 206 34 168 -94 42 86 456 214 185
5120A85j22L57l46q3L91m01K39k12j54O5M30k19j75J66R6l22J3L41j29lL6k16
$$ 185 63 420 74 -9 382 -19 220 8 -146 -81 349 130 -45 121 217 -105 -92 249 120 117 153 -63
5142f3OL31k44J43k21L81j93o17L99O5k40J86l0K04k63K06O7o5j93J3j33K35L2
$$ -63 -57 274 30 173 -48 333 140 -477 -78 -13 -253 -67 -97 107 -156 50 117 52 -141 -128 -261 -26 6
5165Fk57J80j41J46O8j26j89M51k69j34nK39l49J76K14j51p5k7J13j37j80L30
$$ 6 -251 -71 -212 -66 2 -124 -313 138 -131 -265 -270 -31 -380 -204 10 -141 -216 -243 -130 -267 -447 -117
5187a17M2L12k91l9J6R2p0j2j67J09r2j60P5K26j49J53j84R3J08j03J06k20K72
$$ -117 -75 237 -54 -93 -77 15 -55 -67 -234 -125 -217 -377 -302 -76 -225 -72 -256 -163 -55 -158 -52 -272 0
5210@q5J75qN4m31K15J16j02lK05K72k86N2K5k48J30lJ59m36J18K83k60j50J81
$$ 0 -85 90 82 136 -295 -80 36 -66 -69 136 408 122 174 199 -49 81 78 237 -199 -81 202 -58 -208 -27
5234b7k0J21q1K6L25k83J30P6l27j64N36r1k23K66l00J79K81k87J57j66j16K5
$$ -27 -47 74 -7 19 344 61 191 267 -60 -224 312 221 -2 264 -36 143 424 137 294 128 12 37
5256C7J4N0M1q8J35j02J50k6j69j5Q2j04J1L4r9K25k00J89k45K66k37J10j10P2
$$ 37 51 101 142 54 189 87 237 211 42 27 109 5 16 50 -49 176 -24 165 -80 186 -51 59 -51 21
5280B1M64m94k03L09p5j00K11l32K37j12J9Mj45K0K39k02Q5k92K88K55m20J21
$$ 21 485 -9 -212 97 22 -78 133 -199 38 -74 -55 -51 -196 -176 63 -139 -54 -346 -58 197 -223 -102
5302a02n9J42j58J43j38K07J02l32J17m3J6N0M7k01J38j0J25p0k7J51m04K87p4
$$ -102 -161 -19 -177 -34 -172 35 137 -195 -78 -121 -105 -55 -8 -209 -71 -81 44 -26 -53 98 -306 -19 -93
5325i3K3k01n8m6L04n6J97k73J79j07m2J2M1R4j89K08m5j1J11n7J52j99jo4k86
$$ -93 -70 -271 -329 -375 -71 -127 70 -203 -24 -131 -173 -161 -120 -26 -215 -7 -52 -63 48 -9 143 -56 -57 -121 -407
5350d07K93M3K64M4j00l14L43r3J78k11j23K39j36J47j12O5o4K20l59N9k7L10
$$ -407 -114 -71 193 237 137 -177 166 73 251 40 -83 156 20 167 55 120 56 276 -83 -24 -51 259
5372B59j53k15K4K06j63J15j44L3k0J46j58L05N9k73Ok66L46j12N5q0J04J02P5
$$ 259 106 -109 -85 121 -42 73 -71 -38 -58 88 -70 235 294 21 27 -239 107 -5 50 -30 74 176 251
5395B51k82J94j7j07J43j14J07j21j6j19P2P7k4R5j18n5q7J3k22K27K02j01J96
$$ 251 -31 163 146 39 182 68 175 54 38 -81 -9 68 44 139 21 -34 -121 -108 -330 -103 99 -2 194
5418A94m1j89Q6k24mN9m2p9K28r9o0o1q6K25j09L00j48q9J20j07l0J83n6k45P6
$$ 194 153 -36 50 -174 -178 -119 -161 -240 -12 -111 -171 -232 -318 -93 -202 98 -50 -139 -19 -126 -156 27 -29 -274 -198
5443a98K31p8N8m5n0J07j08j45o3K93O5j75K21k32k43M22m6k48K71l01J65n1K53
$$ -198 33 -45 13 -32 -82 25 -83 -228 -291 2 67 -108 113 -119 -362 60 14 -234 37 -264 -99 -150 103
5466A03r6k16N3M72m95J12J33n9k71K86L8o9O0m8k8J82r8K50k07J6l6j7r6L80
$$ 103 7 -209 -156 316 -179 -67 66 7 -264 22 60 -9 51 3 -25 157 59 309 102 118 82 65 -31 349
5490C49j77J56O4l10M0O3p9K2M5j07K87m2j52n9O6j28p2k9K33J38j19k80K71J96
$$ 349 172 328 392 82 122 185 106 128 173 66 353 311 159 100 166 38 -34 -63 170 308 189 -91 180 376
5514C76j21l40N5J71k83K71J01n26M00j30M54j39j63j49J41j73rR0m04K98J80
$$ 376 255 -85 -30 141 -142 129 230 -296 104 -26 428 289 126 -23 118 -55 -64 26 -378 -80 100
5535A00J38K92k97m31O9L41m58L95m03K94k82L17k35K75j89J88P2j84j07K66m34
$$ 100 238 530 233 -198 -129 212 -246 149 -254 40 -242 75 -160 115 -74 114 186 2 -105 161 -273
5556b73M89m67R9K59j90MoQ5m3J46k63L5k15L63k79K20j50L6j86K33j59K83J5
$$ -273 216 -251 -152 107 -83 -79 -85 0 -43 103 -160 -125 -340 23 -256 -36 -186 -150 -336 -103 -262 21 36
5579C6j04l3nP7j18J5r7J95J31k97K7K55k35j15L17k21R0l9N9r3P6K42j72L7j88
$$ 36 -68 -101 -106 -29 -147 -132 -229 -34 97 -200 -173 82 -153 -268 49 -172 -82 -121 -62 -155 -79 163 -9 28 -160
5604a60J70m0K56l60P5J08J15l86J71N5j48K68k83K02jK48k85M1J26l19K17J93
$$ -160 10 -30 226 -134 -59 49 164 -222 -51 4 -144 124 -159 43 42 290 5 46 172 -147 70 263
5626B63j49j43K27K58n00L23lq7k64Q9J11N3j43j72N3R6K57j55l54N75Q6n27K16
$$ 263 114 -29 198 456 -44 279 276 189 -75 14 125 178 35 -137 -84 12 269 114 -240 335 421 -106 110
5649A10j90jJ26L01l83M1j54K59j70N8J2j34M31n11M07k22lQ4R4k53M7J6J65K77
$$ 110 -80 -81 45 346 -37 4 -150 109 -61 -3 9 -125 306 -205 202 -20 -23 61 155 -98 -51 -35 130 407
5673D07n51J33k76K15K32rJ33l55K9J2j10j8J25k05J8K20j88J00N8J04m96J42
$$ 407 -144 -11 -287 -72 160 151 284 -71 -42 -30 -140 -158 -33 -238 -220 0 -188 -88 -30 74 -422 -280
5695b80K06r3o8R1m9M20j43k51rM7P7j49r5K94j01n8K6j14J35J54J82k71k49P9
$$ -280 -74 -167 -235 -144 -193 227 84 -167 -176 -129 -52 -201 -296 -2 -103 -161 -135 -249 -114 40 222 -49 -298 -219
5719b19K12k4j65O0K5j59J63j2p8j1j26K62K95k35k24L88j78R0j32O4j2n7L89
$$ -219 -7 -31 -196 -136 -111 -270 -107 -119 -197 -208 -334 -72 223 -12 -236 152 -26 64 -68 -4 -16 -73 316
5742C16j48r6K5Oq8j36L26k72K17Ml15O7K87k45O8PJ62R0o8m2q0K24l80K98l91
$$ 316 168 72 97 103 15 -121 205 -67 150 154 -161 -94 193 -52 16 23 185 275 207 165 85 309 -71 227 -164
5767a64K76K26j57k51K61J19o7K8j12PJ84l94J75J70l50j54K80j14j63L09l34
$$ -164 112 338 181 -70 191 310 243 271 159 166 350 -44 131 301 -49 -203 77 -37 -200 109 -225
5788b25nK54K9J8l8j56p7K92m5k0r4N4K1l19J40R4Q3L1k59k26O16n1k01k26K81
$$ -225 -230 24 53 71 33 -123 -200 92 47 27 -67 -13 8 -311 -171 -77 6 37 -222 -448 168 117 -84 -310 -29
5813b9J30k02K66j28j19N9l4O8l76K88j55J66j24k4RK45m21M04j52K51k6m23L12
$$ -29 101 -101 165 37 -82 -23 -57 11 -365 -77 -232 -66 -190 -214 -205 40 -381 23 -129 122 96 -327 -15
5836a5l74K51j53N07l58J37j03n1l3M4q1J52k08K45k0K76o16M80k90K01N4l15
$$ -15 -389 -138 -291 216 -142 -5 -108 -159 -192 -148 -229 -77 -285 -40 -60 216 -400 80 -210 -9 45 -270
5858b70K07J51j11L08l97M2l9K53j52L0N4J0J47j90J24M2M1N2L5k22j34J12Q6
$$ -270 -63 88 -23 285 -112 -70 -109 144 -8 22 76 86 233 43 167 209 250 302 337 115 -19 93 179
5881A79j3l52m4N2L2J7K6K6m1PJ31M8k36K92k28j9J7P6K50j60j29L26n3Mm12J14
$$ 179 166 -186 -230 -178 -146 -129 -103 -77 -118 -111 20 68 -168 124 -104 -123 -106 -30 220 60 -69 257 204 208 -204 -90
5907i0n9K10M1j4j83J52J22k20J58p4j50K3J53N3m09lL63j94L86l03O3J5l25o9
$$ -90 -149 61 102 88 -95 57 179 -41 117 43 -107 -84 69 122 -287 -290 73 -121 265 -38 25 40 -285 -354
5931c54M86j49q8j11M7n0J52j49J75j09j52M59j42j07K56k01k71K44J56j6k73
$$ -354 132 -17 -105 -216 -169 -219 -67 -216 -41 -150 -302 157 15 -92 164 -37 -308 -64 92 76 -197
5952a97K55o1L1m32L23O9p9K2%k16L15K90m77L39k29j74K4L90k63k1J52m17M03
$$ -197 58 -3 28 -404 -81 -12 -91 -69 -69 -285 30 320 -157 182 -47 -221 -197 193 -70 -91 61 -356 47
5975D7L5m6qj51L0J97J4j27r5J05j19q6J74l9J0k06K74K05ll77K58l21k10J76
$$ 47 82 36 28 -123 -93 104 118 -9 -104 1 -118 -204 -30 -69 -59 -265 9 214 211 -166 92 -229 -439 -263
5999b63K53j14L75k64lP0l7j03J97k26R5j34lL41Oj27l20L36k54N1M1J45J10o7
$$ -263 -10 -124 251 -13 -16 54 17 -86 111 -115 -20 -154 -157 184 190 63 -257 79 -175 -124 -83 62 172 105
6023A05m4r8J67k3j45L91k27k18Q6J38J16k56m3K55j11J18k39K36L59l27k57K65
$$ 105 61 -37 130 107 -38 353 126 -92 -6 132 248 -8 -51 204 93 211 -28 208 567 240 -17 248
6045B48l47M7K08l49K90j4j52K5K09O0m93J69K24l6k07j46J00J25J4j57J58J00
$$ 248 -99 -52 156 -193 97 83 -69 -44 165 225 -268 -99 125 89 -118 -264 -164 -39 -25 -182 -24 76
6067G6J20k71K26l63J57J21k02k5J59l5J29k48J50k39J81j82J76k24K27K8k63
$$ 76 196 -75 151 -212 -55 66 -136 -161 -2 -37 92 -156 -6 -245 -64 -246 -70 -294 -67 -39 -302
6088c02K96Qk74K02L74k11k92k02r9J25M61j22j23J6L0j01M25l42K79l93k9o9
$$ -302 -6 2 -272 -70 304 93 -199 -401 -500 -375 86 -36 -159 -143 -113 -214 211 -131 148 -245 -274 -343
6110c43K99J26k26m2K1k7L68j76J10l6l32M73L7k94K49O2l0j19k65J06K57j39
$$ -343 -44 82 -144 -186 -165 -192 176 0 110 74 -258 215 252 -42 207 269 239 120 -145 -39 218 79
6132G9Q3j97R1K62m22M81m23K5R3Nj81Q6J49l07J16K15k01Q7L3K28l06lL17k76
$$ 79 162 -35 56 318 -104 377 -46 -21 72 77 -104 -18 131 -176 -60 155 -46 41 74 302 -4 -7 310 34
6156C4J58M0k60K94k40QJ85k70J62o2J94l15J66j45L43n77K56K62n09M62p6J48
$$ 34 192 232 -28 266 26 34 219 -51 111 49 243 -72 94 -51 292 -285 -29 233 -276 186 110 258
6178B58l84J41L00l02Ol04N73m66L52j63R8k64j00K30J52p9l35K3K08K53m09K16
$$ 258 -126 15 315 13 19 -285 288 -178 174 11 109 -155 -255 -25 127 48 -287 -264 -56 197 -212 4
6200DNn4L8k02J99J91k67k15L50J00k19j16J70J50j15j03L57k01r0r3j43L67k70
$$ 4 9 -45 -7 -209 -10 181 -86 -301 49 149 -70 -186 -16 134 19 -84 273 72 -18 -111 -254 113 -157
6223a57q7J40R2J81k53m8j22mP4P7l9J25j9n7N9j17K52M5j63K17l17K23r6pl32
$$ -157 -244 -104 -12 169 -84 -132 -254 -258 -184 -107 -146 -21 -40 -97 -38 -155 97 142 -21 196 -121 102 6 -1 -333
6248c33j20L33K74mj45j08J18O2Pkj13o2O7K80k39j08n6K28lr7K40Rq7L2m18l4
$$ -333 -453 -120 154 150 5 -103 15 77 84 82 -31 -93 -26 254 15 -93 -149 79 76 -21 219 228 141 173 -245 -279
6274b79M78q0l60K32m7J47K9j47K35r5QQ7j2j18K7l14J33q5O0O7R4o1J95j36P8
$$ -279 199 119 -241 -9 -56 91 120 -27 208 113 121 208 196 78 105 -209 -76 -161 -101 -34 60 -1 194 58 136
6299A36K39l62p7J45j8l40L39m8k90K15K35p3J27m32K23j0K28k16o7NJ72k34K99
$$ 136 375 13 -64 81 63 -277 62 14 -276 -61 174 101 228 -204 19 9 237 21 -46 -41 131 -103 196
6322A96p2K10k33k19O5J33K06l70J21l85M75k01J76J03l66k8J36j47K3J52k57
$$ 196 124 334 101 -118 -53 80 286 -84 37 -348 127 -74 102 205 -161 -189 -53 -200 -177 -25 -282
6343b82K05j54K36q7j05J82J03l50J07k89K85N5J0J65j58L0o5M34m47J60j3l02
$$ -282 -77 -231 5 -82 -187 -5 98 -252 -145 -434 -149 -94 -84 81 -77 -47 -112 322 -125 35 22 -280
6365b80J46K90J34l51J8K49k23K54m54Q7L53k33J84k25j5J45L6n2j78m3J36p2
$$ -280 -134 156 290 -61 -43 206 -17 237 -217 -130 223 -10 174 -51 -66 79 115 63 -115 -158 -22 -94
6387i4K08Q2k63J32J86k68pK20j30p9J51j42J34k95N22n07K08K12j72K77l95K78
$$ -94 114 196 -67 65 251 -17 -24 196 66 -13 138 -4 130 -165 357 -150 58 270 98 375 -20 258
6409B58l22L38k81J47l61K30k17L57r3q4J25m8q1K68n03K24m7J57m6P6J58m12
$$ 258 -64 274 -7 140 -221 9 -208 149 56 -28 97 49 -32 236 -267 -43 -90 67 21 97 255 -157
6431a57K28j24L1j27K39k81M61o6j99o4j16K12K11j81l09L29J87n22J51J8O9o7
$$ -157 71 -53 -22 -149 90 -191 270 204 5 -59 -175 37 248 67 -242 87 274 -248 -97 -79 -10 -77
6453g7j48K4K58J84j51r3M72j95k73k41J76J67m81L34O4r2j76L91Lm56J36K07
$$ -77 -225 -201 57 241 90 -3 469 274 1 -240 -64 103 -378 -44 20 -72 -248 143 146 -310 -174 33
6475C3K76l89L21p13M53k33j03J81J05J46L57q50K21Q8L89k74j43l5p6R4j22K80
$$ 33 309 -80 241 -472 -19 -252 -355 -174 -69 77 434 -416 -195 -107 282 8 -135 -170 -246 -152 -274 6
6497Fj79j22K68k56J80P8k96L84j81j0n1J52Q5j16l7K03J86l17J73M4k69J68j30
$$ 6 -173 -295 -27 -283 -103 -25 -321 63 -118 -128 -179 -27 58 -58 -95 108 294 -23 150 194 -75 93 -37
6520c7K51j40k26K6L1L43P4j26k09J02Q4j10k10L83j82N3j46K29l65J66L22n71
$$ -37 214 74 -152 -126 -95 248 322 196 -13 89 173 63 -147 236 54 107 -39 190 -175 -9 313 -258
6542b58N72k73k0L0j48J6m3K70j13J91j58K5j0K7oj5r7J49j60j21q3L52M8L1N9
$$ -258 314 41 21 51 -97 -81 -124 146 33 224 66 91 81 108 102 87 -10 139 -21 -142 -225 127 175 206 265
6567B65l02m1K40l85l4J21O4j0j2K8j00M52n99J43K98r3j94O0J16J3j68QJ61q6
$$ 265 -37 -78 162 -223 -257 -136 -72 -82 -94 -66 -166 286 -313 -170 128 35 -159 -99 17 30 -138 -130 31 -55
6591e5J96r6n35K40L49m32%L51j51J21J58k15O0K8j91J34mM8m8J55O2k92l28N54
$$ -55 141 45 -490 -250 99 -333 -333 18 -133 -12 146 -69 -9 19 -172 -38 -42 6 -42 113 175 -117 -445 109
6615A09j82j99M66k50j04L57k23k30J10j13J97Q8Kr1K99qk02J8k07J73k3q5L45
$$ 109 -73 -272 194 -56 -160 197 -26 -256 -146 -259 -62 26 28 -63 236 228 26 44 -163 10 -13 -98 247
6638B47l60Q6m5M6K33J08m27J03K40r9j22J17KJ60m14K1N7N7O3j99K07k48L37
$$ 247 -113 -27 -72 -26 207 315 -112 -9 231 132 10 127 129 289 -125 -104 -47 10 73 -126 81 -167 170
6661A70P8j59j9k93N00k48J12%k13j85M98l94L38k70K10j06j59M08l70K23N2k22
$$ 170 248 89 70 -223 277 29 141 141 -72 -257 241 -153 185 -85 125 19 -140 268 -102 121 173 -49
6683d9M02k56l55L60o7n2j87J73M29l49r1j61K85R6j65k11J79q6J6k20K25K02
$$ -49 353 97 -258 102 35 -17 -204 -31 398 49 -42 -203 82 178 13 -198 -19 -105 -89 -309 -84 118
6705A18l7j86j85J65j05J54j68K63k35J80P4n7J00j73K9R8q9l48Q37p34l4J19
$$ 118 81 -105 -290 -125 -230 -76 -244 19 -216 -36 38 -19 81 -92 -63 35 -54 -402 435 -299 -333 -214
6727b14J37j45K49j26N3j56J74R8k07n0%o1L29l95L65m30K91K72m71M56p9M00
$$ -214 -77 -222 27 -99 -46 -202 -28 70 -137 -187 -187 -248 81 -314 51 -379 -88 184 -287 169 90 490
6749D90o62o9jL86j36L8j51J49J2P4k16J68m11J35L55m7n4Q9O8m11K95Q5n1o1
$$ 490 -172 -241 -242 144 8 46 -105 44 56 130 -86 82 -329 -194 161 114 60 149 217 -194 101 186 135 74
6773G4k24K76j22N9P7k91N16k82k63J33M4j64M29l87j34O00j41p3r9N9k8l3r7
$$ 74 -150 126 4 63 140 -151 365 83 -180 -47 -3 -167 262 -125 -259 341 200 127 28 87 59 26 -71
6796g1L50J21n49M37m60M52l7l77J04L8K5N6J41j45j1J28J07n06K60j46K20j59
$$ -71 279 400 -149 288 -172 280 243 -134 -30 8 33 89 230 85 74 202 309 -197 63 -83 137 -22
6818b2q5M74k27M7l35L74p8j82k11L20q3k54L25l4n6j02L97l20j54K6L45k97N8
$$ -22 -107 367 140 187 -148 226 148 -34 -245 75 -8 -262 63 29 -27 -129 268 -52 -206 -180 165 -132 -74
6841g4O6o0P0n9k70L37j68K27r6o5p6R8O9k72L21k55K96M5l67K9pM17J59n70O3
$$ -74 -8 -68 2 -57 -327 10 -158 69 -27 -92 -168 -70 -1 -273 48 -207 89 134 -233 -204 -211 206 365 -205 -142
6866a42q1P6L25j86k75J85o7O8J59j51R6j36K1K92k95J43N5k54K52J73l49j76
$$ -142 -223 -147 178 -8 -283 -98 -165 -97 62 -89 7 -129 -108 184 -111 32 87 -167 85 258 -91 -267
6888b67J16M5L2j27m1J20j69L24O2K17j14k79n9L31Jr1j96J96R3j82j59QM67l32
$$ -267 -151 -106 -74 -201 -242 -122 -291 33 95 312 198 -81 -140 191 192 101 -95 101 194 12 -147 -139 328 -4
6912dK39n10N36k56J90j39j69J59r8K57k18J06j52K27l78J24J82M0k9k1N0j06
$$ -4 235 -275 261 5 195 56 -113 46 -52 205 -13 93 -59 168 -210 -86 96 136 107 86 136 30
6934C0J36o8k39J41Q5l4j07j12L3K27o6k39L63j30J42j80j11J70P8m9j04K7N5
$$ 30 166 98 -141 0 85 51 -56 -168 -135 92 26 -213 150 20 162 -18 -129 41 119 70 -34 -7 48
6957D8K00m12L33k24q6L5K89j57J9j61j2L30j87k52J54J21j36J96K79m21r9M56
$$ 48 248 -164 169 -55 -141 -106 183 26 45 -116 -128 202 15 -237 -83 38 -98 98 377 -44 -143 313
6979C13n20O23k64j79j40q2Q2J45Q2j66JPK58l48J17k13K98K0O7N4j41k33J44
$$ 313 -207 416 152 -27 -167 -249 -167 -22 60 -106 -105 -98 160 -188 -71 -284 14 34 101 155 14 -219 -75
7002g5J64k46J27j78J10l4L9j26Q5K36J46k80j00L14j45j63K89N6m16K85j01Q3
$$ -75 89 -157 -30 -208 -98 -132 -93 -219 -134 102 248 -32 -132 182 37 -126 163 219 -197 88 -13 70
7024G0K76l49L3O8k34N64n86K97k94K31j07k7j48J79j30Q4O0J47J67p2j87R6N5
$$ 70 346 -3 30 98 -136 428 -158 139 -155 76 -31 -58 -206 -27 -157 -73 -13 134 301 229 42 138 193
7047A93j62N5L35l53m7K59l55J44J06k48j95M50ll02K00K5r5p5j47P2J54P9N4
$$ 193 31 86 421 68 21 280 -75 69 175 -73 -268 182 179 -123 77 102 7 -68 -215 -143 11 90 144
7070A44j11Q0J09j46j17J64j84j99L76k83K32n7l8j06K15k19K00K60n12J40P1
$$ 144 33 113 222 76 -41 123 -61 -260 116 -167 65 8 -30 -136 79 -140 60 320 -192 -52 19
7091A9j33o5P4l5N1p4Q4J15n78M69L74k37p2Q7Jq8n4n0k47M92k16k20M84n72N22
$$ 19 -114 -179 -105 -140 -89 -163 -79 36 -542 -73 301 64 -8 79 80 -8 -62 -112 -359 133 -83 -303 181 -391 131
7116A31J4n8J66n90p8L16K50p0l8J1J65m57Q0K30l81L55n6K32q8m31K56J08n8
$$ 131 145 87 253 -337 -415 -99 151 81 43 54 219 -238 -158 72 -309 46 -10 222 134 -297 -41 67 9
7139Ik50L75j20J79j6Q1k79j3k51K58J47J75k84jL24j65j73l9J68k78J13J82l91
$$ 9 -241 134 14 193 177 258 -21 -34 -285 -27 120 295 11 10 334 169 -4 -43 125 -153 -40 142 -249
7162b49M85j06K2o3j31O1L0m3J77j06J1k91K30j24J97N5r2K9j71J78n0J24l63
$$ -249 236 130 152 89 -42 19 49 6 183 77 88 -203 27 -97 100 155 63 92 -79 99 49 173 -190
7185a90K56l02L22R3m5R7j97l13M44k04K95j8j48k03K08l01L04J23j52O0j15q6
$$ -190 66 -236 86 179 134 231 34 -279 165 -39 256 238 90 -113 95 -206 98 221 69 129 14 -72
7207g2j25J26J36j46R2K35j39j3k17Q9L5k0j8m1N2j24L22j90j15J95j25R1l12
$$ -72 -197 -71 65 -81 11 246 107 94 -123 -34 1 -19 -37 -78 -26 -150 172 -18 -133 62 -63 28 -284
7230b84L65j32n2l00L15K62l18J83k20J2L3J32j05p4J19j03J67O3k16J84r2j29
$$ -284 81 -51 -103 -403 -88 174 -144 39 -181 -169 -136 -4 -109 -183 -64 -167 0 63 -153 31 -61 -190
7252a90N2L49l2k52J19l81P9L57j29j35L3K7L10l57J34K65j70l72NL91O1Lq8n5
$$ -190 -138 211 179 -73 46 -335 -256 101 -28 -163 -130 -103 207 -150 -16 249 79 -293 -288 103 164 167 79 24
7276B4j46JJ52k30k3K63N3K7l39J50J90r1K40k60J65k78Q5L9J67Rk80J00j28K43
$$ 24 -122 -121 31 -199 -222 41 94 121 -218 -68 122 31 271 11 176 -102 -17 22 189 198 -82 18 -110 133
7300A33p8o9r9J7J18j04m1K92j74K40l52j05J50n7K07j49R8j01l9J88r5o2J05
$$ 133 55 -14 -113 -96 22 -82 -123 169 -5 235 -117 -222 -72 -129 78 -71 27 -74 -113 75 -20 -82 23
7323B3N8r0J80k47K00k99N63m76J69j27j11J1L18J41j25l14L6O83q00j3L73l53
$$ 23 81 -9 171 -76 124 -175 388 -88 81 -46 -157 -146 172 313 188 -126 -90 593 -207 -220 153 -200
7345b00L5J81j32j56J59K7P3j39MK33j26K68l36M2q2R3K11m55L68k4K7k72RM19
$$ -200 -165 16 -116 -272 -113 -86 -13 -152 -148 85 -41 227 -109 -67 -149 -56 155 -300 68 44 71 -201 -192 227
7369B27j46l1J73l0l72j7l1J52N3J21o1j28k0J11k29J66j78N2K37p5j07J81p7
$$ 227 81 50 223 193 -179 -196 -227 -75 -22 99 38 -90 -110 1 -228 -62 -240 -188 49 -26 -133 48 -29
7392b9n3J91j25o6j23L5O1J04k3J29m26J93K51J38m43M40n13K68J92j74j16L59
$$ -29 -82 109 -16 -82 -205 -170 -109 -5 -28 101 -325 -132 119 257 -186 254 -259 9 201 27 -89 270
7414B70m34L33k32J14j4j02K52j47n5J02j00J04k66oK37n10K09N57n11K35J37
$$ 270 -164 169 -63 51 37 -65 187 40 -15 87 -13 91 -175 -181 56 -454 -245 312 -199 36 173
7435A73j85J15k4R0k04K28l52K51O9l50M32j37l44M48m10K89q4K2J70k58L00j92
$$ 173 -12 103 79 169 -35 193 -159 92 161 -189 243 106 -238 210 -200 89 5 27 197 -61 239 47
7457D7R3r6j34K99j66N5K67k95j20j93M00j03j62LL22n85L31j28q9J00L77k14
$$ 47 140 44 -90 209 43 98 365 70 -50 -243 157 54 -108 -105 217 -368 -37 -165 -254 -154 223 9
7479IK46n74J77L8Q2K41k01k3J1J67j56j55J91N7k20K10j19j6n7N3k83L28q5q7
$$ 9 255 -319 -142 -104 -22 219 18 -5 6 173 17 -138 53 110 -110 100 -19 -35 -92 -39 -322 6 -79 -166
7503a66L55j05j95j41M33l88j57M08k1J0j42R9j59j19K49j54N3n7j03PL34o6j44
$$ -166 189 84 -111 -252 181 -207 -364 44 23 33 -109 -10 -169 -288 -39 -193 -140 -197 -300 -293 41 -25 -169
7526a69j6J12M22k53l4l1l75L04P7m97P38j98j45K33j84p3J73j7M3k85J90K53
$$ -169 -185 -73 349 96 62 31 -344 -40 37 -460 278 80 -65 168 -16 -89 84 67 110 -175 15 268
7548B68l70K11K49l31j90M1J26Q3k87K22j21K69L28l66j22j27J34J88j83J42J38
$$ 268 -102 109 358 27 -163 -122 4 87 -200 22 -99 170 498 132 10 -117 17 205 22 164 302
7569C02j50OP4k60q8k1P8R5o4j06nL28q2j52J65k21K00RJ44n8k34R6L01k09o8
$$ 302 152 158 232 -28 -116 -137 -59 36 -28 -134 -139 189 107 -45 120 -101 99 108 252 194 -40 56 357 148 80
7594H0m8L11l09JJ67q4p1M9j30j00J34O4J86k76k23L80J08k35K11l51L89k83j52
$$ 80 32 343 34 35 202 118 47 96 -34 -134 0 64 250 -26 -249 131 239 4 215 -136 253 -30 -182
7617a82K71p0j56L35l41K71l00K7K6n6J14O8J64p9j35r6N6j51l3J62K35l66j1
$$ -182 89 19 -137 198 -143 128 -172 -145 -119 -175 -61 7 171 92 -43 -139 -83 -234 -267 -105 130 -236 -247
7640b47M91k11J9J31m35J01R0J02kOj27r2LK6J38N6k36L3n4J92j08K8L3L9j46
$$ -247 244 33 52 183 -252 -151 -61 41 39 45 -82 -174 -171 -145 -7 49 -187 -154 -208 -16 -124 -96 -63 -24 -170
7665a70QJ85kl1n5M3M63o18m6J91m3K07j30m6n5O2L07p4k45O2M3J09k27K38l35
$$ -170 -162 23 21 -10 -65 -22 441 -177 -223 -32 -75 132 2 -44 -99 -37 270 196 -49 13 56 165 -62 176 -159
7690a59J08N9N29n26L1p8o9K42n4j31O1k2M41k48j04l96J67J17o7M89n10n3K06
$$ -159 -51 8 537 11 42 -36 -105 137 83 -48 13 -9 432 184 80 -316 -149 -32 -99 390 -120 -173 33
7713C3J88k87J01k68L60J32l46J61k15J87J38j49R9m9j65jk2j26N12k69k92M20
$$ 33 221 -66 35 -233 127 259 -87 74 -141 46 184 35 134 85 -80 -81 -103 -229 283 14 -278 142
7735A42k29j73K34J3k4N5pj43P8K4K42j53kJ32n42K93j44J9k19J05M88n5p2k66
$$ 142 -87 -260 -26 -13 -37 18 11 -132 -54 -30 212 59 57 189 -353 -60 -204 -185 -404 -299 189 134 62 -204
7759b04L21j90j31J71l6J46k21j27N27l11J37j93J03k11OJ94Q1k00J74Q5k25j85
$$ -204 117 -73 -204 -33 -69 77 -144 -271 256 -55 82 -111 -8 -219 -213 -19 62 -138 36 121 -104 -289
7781b89L77n09M41p1r6K05k79L89k37P7k83J25J10r2J6k7j95K19K96l90L83k89
$$ -289 88 -421 20 -51 -147 58 -221 168 -69 8 -275 -150 -40 -132 -116 -143 -338 -119 177 -213 170 -119
7803a19L74l04P3q2K97k76k7Q0j77N2kLK25J27j95J82m77M09K11l65J3q4L09n7
$$ -119 255 -49 24 -58 239 -37 -64 16 -161 -109 -111 -108 117 244 49 231 -246 163 374 9 22 -62 247 190
7827A90j66j75k3L76j27J10k51R1J49k83J04L7P9o7j23J17L9j21J52P3O1k97O0
$$ 190 24 -151 -174 202 75 185 -66 25 174 -109 -5 32 111 44 -79 38 77 -44 108 181 242 -55 5
7850EQ9l50M01j87j31J66K03p5k43L31l47J34k22J53K97n61K46J11J40K11o19
$$ 5 94 -256 145 -42 -173 -7 196 121 -122 209 -138 -4 -226 -73 224 -337 -91 20 160 371 -248
7871b48L5J21K27j09K22j91q2R3Jl08o3N61m43O4J9l0N40l08m30J71P0j43L88
$$ -248 -213 -92 135 26 248 57 -25 68 69 -239 -302 259 -184 -120 -101 -131 409 101 -329 -158 -88 -231 157
7894A57j89PK0J70k50J75q7l2k50K38j40Q9J06J26n8l17%p0J39J77j21K24P2k45
$$ 157 -32 -25 -5 165 -85 90 3 -29 -279 -41 -181 -92 14 140 82 -235 -235 -305 -166 11 -110 114 186 -59
7918e9J0K0q3K09p9J82m10L1K12j03J16J60l11K98l02J12QK24p4k13P1J25k67
$$ -59 -49 -29 -112 97 18 200 -210 -179 33 -70 46 206 -105 193 -109 3 11 235 161 -52 19 144 -123
7941a23J05K87j99j09J20j83j26K18P8j90J04L0R8k23J37J01J16k29J85k81OO8
$$ -123 -18 269 70 -39 81 -102 -228 -10 68 -122 -18 12 110 -113 24 125 241 12 197 -84 -78 -10
7963a0r0J32p9Q2J5P6l41L35J74j83l58J75r3R5K7J33K2o3k5j06K88l67J92J39
$$ -10 -100 32 -47 35 50 126 -215 120 294 111 -247 -72 -165 -70 -43 90 112 49 24 -82 206 -161 31 170
7987A70k89j2N6K46k56J24QK64m05K44pm40m3K41M4K17k97L10j77j35q8J81N9
$$ 170 -119 -131 -75 171 -85 39 47 311 -94 150 143 -297 -340 -99 -55 162 -135 175 -2 -137 -225 -44 15
8010A5J57J9k63o6J04P6O8k70Q6J23j80oLj5O4n8J80k99K06L19r9j07l9J54o4
$$ 15 172 191 -72 -138 -34 42 110 -160 -74 49 -131 -137 -134 -149 -85 -143 37 -262 -56 263 164 57 18 172 108
8035A08r7K2Q5Jj79k21L61O8l2p2k98L93o8J04r2l76M16j08j96j89J37J40J96
$$ 108 11 33 118 119 -60 -281 80 148 116 44 -254 139 71 175 83 -293 123 15 -181 -370 -233 -93 103
8058A03M2k70L5K13K5j46J45j75k37M02j44O7K58k32k9j99l2l4J08J94J39j39
$$ 103 145 -125 -90 123 148 2 147 -28 -265 137 -7 60 318 86 57 -142 -174 -208 -100 94 233 94
8080I4j90J66k60J43N7K69P7p5j96k28K86j40O6n4K12k61M83n18k50M83pk72K31
$$ 94 -96 70 -190 -47 10 279 356 281 85 -143 143 3 69 15 227 -34 449 -69 -319 164 157 -115 116
8103A16L7l71Q4j40K84j37P1k91J32L46k00O2k1j7j62L13j07K18J7p3L1j23O0
$$ 116 153 -218 -134 -274 10 -127 -56 -347 -215 131 -69 -7 -28 -45 -207 106 -1 217 234 161 192 69 129
8126A29%K4l19J97n9J50k34l0k03N69q1n44L54j76K11K7J5j71O7m1n5J30J51l72
$$ 129 129 153 -166 31 -28 122 -112 -142 -345 224 143 -401 -47 -223 -12 15 30 -141 -74 -115 -170 -40 111 -261
8150b61J98k90L99k1n1J4j78N42k74k4j43J44l44L37m51J87N32k97l41l2K06J95
$$ -261 -63 -353 46 25 -26 -12 -190 352 78 54 -89 55 -289 48 -403 -216 316 19 -322 -354 -148 47
8172D7K29k73J56K7Roj17o6K59j55K5o5q1P1k80L06p8j61L0
$$ 47 276 3 159 186 195 189 72 6 265 110 135 70 -11 60 -220 86 8 -153 -123
8191a23
$$ Imaginary data points
##PAGE= N=2
##DATA TABLE= (X++(I..I)), XYDATA
0@%%%%%%%%Qj6J6j6K1k9L2m0M8n6O8p7R0j06J22j42J66j91K19k50K83l18L58m05
$$ 0 0 0 0 0 0 0 0 0 8 -8 8 -8 13 -16 16 -24 24 -32 36 -41 49 -57 65 -77 89 -102 117 -133 150 -168 190 -215
32b15M54n07N66o31P03p81Q67r61J064j178J304j444J602j775J968k191K447k742
$$ -215 239 -268 298 -333 370 -411 456 -505 559 -619 685 -759 843 -932 1036 -1155 1292 -1450
50a450L088l502M007m638N451o550Q122j0577J4984k5332R1700P4636j50778O67
$$ -1450 1638 -1864 2143 -2495 2956 -3594 4528 -6049 8935 -16397 75303 149939 -839 -172
64a72R0150J9877r8569j7814O2378J4715o4877r685M2341O191l9297M303K6777
$$ -172 89978 109855 11286 -6528 55850 70565 5688 -3997 38344 44535 5238 9541 36318
77C6318j3100l3637J6568L1144j4543l7767M703K7735J355k0777k703J1166J769
$$ 36318 23218 -10419 6149 37293 22750 -15017 -10314 17421 18776 -2001 -4704 6462 8231
90H231o285K043O579l00o986N67O280j489j3301k99J9715L466l1381j7644L4129
$$ 8231 1946 3989 10568 10268 3282 3849 10129 8640 -4661 -4960 14755 18221 -13160 -30804 3325
105C325L0759l1223l9886K4259M4060j8381m2356J5992M0065j6878l8971J3709
$$ 3325 34084 2861 -37025 -12766 31294 12913 -29443 -13451 26614 9736 -29235 -15526
117a5526L1718j8148k8663J9423J9593l0678k2485L5990K5633l8473l0751L4490
$$ -15526 16192 -1956 -30619 -11196 8397 -22281 -44766 -8776 16857 -21616 -52367 -17877
129a7877L3149k6149k7309K3523K2767j9620j5886J9232J2106j6632l777J7793
$$ -17877 15272 -10877 -38186 -14663 8104 -11516 -27402 -8170 3936 -12696 -16473 1320
141A320j694k0628O665K7693k183k9195k504K7567R967j9636j2069J1691J0750
$$ 1320 -374 -21002 -14337 13356 11173 -18022 -20526 7041 17008 -2628 -14697 -3006 7744
154G744n769j0065K92P174J540n414m892L086M519Q00n49K075k941o018O791J4894
$$ 7744 1975 -8090 -7798 -624 916 -4498 -9390 -6304 -1785 -985 -1534 541 -2400 -8418 -1627 13267
170A3267m575k1250k437K2533N212k3483r507K0423Q465j9423q306J7265Q465
$$ 13267 8692 -12558 -14995 7538 12750 -10733 -20240 183 8648 -10775 -19081 -1816 6649
183F649j2135j934J2535k196j0113J1120J7870j3312k2566J2864K6657r040k7269
$$ 6649 -5486 -7420 5115 2919 -7194 3926 21796 8484 -14082 -1218 25439 16399 -10870
196a0870N050K3444m775k0388M114J7011m678j2666N419Q571q035n648J3941N716
$$ -10870 -5820 17624 12849 -7539 -3425 13586 8908 -3758 1661 10232 2197 -3451 10490 16206
210A6206j8354j0146J7887J4952j3322j6818P724J5608j974j0915J41Q573K639
$$ 16206 -2148 -12294 5593 20545 7223 -9595 -1871 13737 11763 848 989 9562 12201
223A2201m620m231P11L420K232j856n584l937J170N833L573n913r747K209J2926
$$ 12201 7581 3350 4061 7481 9713 7857 2273 -1664 -494 5339 8912 2999 -6748 -4539 8387
238H387M029j1821o240J0961Q519r726r999Q216R391p554r693K445M101n444j198
$$ 8387 12416 595 -5645 5316 13835 4109 -5890 2326 11717 4163 -5530 -3085 1016 -4428 -5626
253e626P259l757j4039J173J8236K380j8964n829J8118P881j4978q748J3533Q305
$$ -5626 1633 -2124 -16163 -14990 3246 5626 -13338 -19167 -1049 6832 -8146 -16894 -3361 4944
267D944r741q559O470O119l037l38K838l890n413P560J0945n610j3478K191J3368
$$ 4944 -4797 -13356 -6886 -767 -3804 -4142 -1304 -5194 -10607 -3047 7898 2288 -11190 -8999 4369
282D369O37j1530l085Q824L713p194n270M117O212k14k676j546m42K027N082K836
$$ 4369 5006 -6524 -9609 -785 2928 -4266 -9536 -5419 793 579 -2097 -3643 -4085 -2058 3024 5860
298E860m283o721K006Q701J343r233n642P049O498n862q860L332J0055j35r383
$$ 5860 1577 -5144 -3138 5563 6906 -2327 -7969 -920 5578 -284 -9144 -5812 4243 4108 -5275
313e275k105Q053M529j862j973L85j049J219O048J307p130l869P420N684o558
$$ -5275 -7380 673 5202 3340 1367 1752 703 1922 7970 9277 2147 -1722 5698 11382 4824
328D824o782N540P953m299q756J746P650m7m590q64k36j757J943N161k415q233
$$ 4824 -1958 3582 11535 7236 -1520 226 7876 7829 3239 2375 2139 382 2325 7486 5071 -3162
344c162n81R177L835q525m802P233O851n565p362L089P106r6o434l423J185K312
$$ -3162 -3743 5434 9269 744 -4058 3175 10026 4461 -2901 188 7294 7198 764 -2659 -1474 838
360H38J132j100m571l050K515N262n07n941r69O529L222m090m236L189O672j133
$$ 838 1970 870 -3701 -6751 -4236 1026 519 -5422 -6391 138 3360 -730 -4966 -1777 4895 3762
376C762o547j634L722L197j540l578k189j08K701K524j641n374j156O100L598
$$ 3762 -2785 -4419 -697 2500 960 -2618 -4807 -4915 -2214 310 -1331 -6705 -7861 -1761 1837
391A837n399m897M436P243l044p460J108P381K249n194l038J933K847J160N31
$$ 1837 -3562 -8459 -4023 3220 176 -7284 -6176 1205 3454 -1740 -4778 -2845 2 1162 1693
406A693j593l675M16N003J506n932l427M637M288m494n838K506O571j43n466j295
$$ 1693 100 -3575 -3159 1844 3350 -2582 -6009 -1372 2916 -1578 -7416 -4910 1661 1518 -3948 -5243
422e243L463L151R79n47k236j613K916M565o28o173j970O302K973n558n262L688
$$ -5243 -1780 1371 2350 1803 -433 -2046 870 5435 4807 -1366 -3336 2966 5939 381 -4881 -1193
438a193O561j745p141j152O017L488k214l681k15K692K557N19j875l207P63M093
$$ -1193 5368 3623 -3518 -4670 1347 4835 2621 -1060 -1275 1417 3974 4493 2618 -589 174 4267
454D267J483m646l827M211M803l242o297P28O297R76n481l354K219K412k7j344
$$ 4267 5750 1104 -2723 1488 6291 3049 -3248 -2520 3777 4753 -728 -4082 -1863 549 522 -822
470h22j619j571O08L744J190m228k566M822M974l958n616L088P136r01o610j547
$$ -822 -2441 -4012 -3404 340 1530 -2698 -5264 -442 4532 574 -5042 -1954 5182 4281 -2329 -3876
486c876M716K690k449k688p29P3J036J427q00l571p36M361K650m292l312L795
$$ -3876 840 3530 1081 -1607 -2336 -2263 -1227 200 -600 -4171 -4907 -546 2104 -2188 -5500 -1705
502a705M999j610n601K15N295K215l358k997L92J862Q77l09j596j996L54L165
$$ -1705 3294 1684 -3917 -3702 1593 3808 450 -2547 -2155 -293 584 275 -1321 -3317 -2963 202
518B02J090m043k766L794M622k543n935J427O976J945n538l015M494M566j469
$$ 202 1292 -2751 -5517 -1723 2899 356 -5579 -4152 2824 4769 -769 -3784 710 5276 3807
533C807k997M84J346J03Q70M08k711k449K874L493m034n418J974O000j076o861
$$ 3807 810 1294 2640 2743 3613 4021 1310 -1139 1735 5228 1194 -4224 -2250 3750 2674 -4187
549d187j269N733K671l600k428J764J916O7O61L92k299j023L563K087m150l595
$$ -4187 -5456 277 2948 -652 -3080 -1316 600 667 1328 1720 -579 -1602 1961 4048 -102 -3697
565c697L773M572k675n875M93O082J365m083k921K869L371j32j393o46Q38R40
$$ -3697 76 4648 1973 -3902 -3409 2673 4038 -45 -2966 -97 3274 3142 1749 1103 1941 2881
581B881J240L98j976j597K154L072j637n067J08M769J368n715l702L322M207k610
$$ 2881 4121 4519 2543 946 3100 6172 4535 -532 -424 4345 5713 -2 -3704 -382 3825 1215
597A215n184J35L224l31j377K04J34j668J186L106q32m816P02O787Q21o838k580
$$ 1215 -3969 -3834 -610 -941 -2318 -2114 -1980 -3648 -2462 644 -188 -5004 -4302 2485 3306 -3532 -6112
614f112P106L971n642m059L825L914j889k785J632N12j572J363K299k172l777
$$ -6112 994 4965 -677 -4736 -911 3003 1114 -1671 -39 473 -1099 264 2563 391 -3386
629c386J712N100j362n760k7N902J367n052k993L190K697j556k847q20Q09J35
$$ -3386 -1674 3426 2064 -3696 -3723 2179 3546 -1506 -4499 -1309 1388 -168 -3015 -3835 -3026 -2891
645b891k70j180k011n69J474J239j941l063M04L666J809l267l455L243M986q15
$$ -2891 -3161 -4341 -6352 -6921 -5447 -4208 -6149 -9212 -8808 -5142 -3333 -6600 -10055 -6812 -1826 -2641
661b641m902LN233K232l316j555K626J272j244P07J129k051j260L692K670m644
$$ -2641 -7543 -7540 -2307 -75 -3391 -4946 -2320 -1048 -2292 -1585 -456 -2507 -3767 -75 2595 -2049
677b049m040M909N392l779o590L253N852o65n332M25M587m45j704P51N19k129
$$ -2049 -6089 -1180 4212 433 -6157 -2904 2948 2283 -3049 -2624 1963 1518 -186 565 1084 -1045
693a045m20L969m2n766j309N658K044o032l507M533L728k826l425J306K740R05
$$ -1045 -1465 2504 2462 -3304 -4613 1045 3089 -2943 -6450 -1917 1811 -1015 -4440 -3134 -394 511
709E11n83n25J62J049J987J120j296j523J197K707L26k360k427J751K995j026
$$ 511 -72 -597 -435 614 2601 3721 2425 902 2099 4806 5132 2772 345 2096 5091 4065
725D065l854j195M010K138l389l533K173L323n72k334pM08o07J138J521k226l353
$$ 4065 211 -984 3026 5164 1775 -1758 415 3738 3166 832 825 1233 626 1764 3285 1059 -2294
742b294J894M547k228n772N71O396K31o953j522N260J754m142j570K415p8j388
$$ -2294 -400 4147 1919 -3853 -3282 3114 3345 -3608 -5130 130 1884 -2258 -3828 -1413 -1491 -2879
758b879J498J423l221k004M612L175l765m320M064N610k628n577J437M814J1l590
$$ -2879 -1381 42 -3179 -5183 -571 2604 -1161 -5481 -1417 4193 1565 -4012 -2575 2239 2250 -1340
774a340n89R11L47Ln4r47k104O95K569K99l630q70L275K089j497k895J37L927
$$ -1340 -1929 -1018 -671 -668 -722 -1669 -3773 -3078 -509 -210 -3840 -4710 -1435 654 -843 -3738 -3601 326
792C26J505l027k611J966L597m48l407l67K562L03j005N08L30j653j15K924L04
$$ 326 1831 -1196 -3807 -1841 1756 1308 -2099 -2466 96 399 -606 -98 232 -1421 -1536 1388 1692
809A692m194r59N166J843n427l284N137M972m031m624K917L609j130k182J492
$$ 1692 -2502 -3461 1705 3548 -1879 -5163 -26 4946 915 -3709 -792 2817 1687 -495 997
824I97Q63k413K58L226j098m782R00N034q92o394p76N898J811m964k237L392K580
$$ 997 1860 -553 -295 2931 1833 -2949 -2049 2985 2093 -4301 -5077 821 2632 -2332 -4569 -1177 1403
841A403n03j381N97O10J63J187Q87j524j260J326J855j380k979P5L228N33l178
$$ 1403 900 -481 116 726 889 2076 2963 1439 179 1505 3360 1980 -999 -924 2304 2837 -341
858c41k436J986L324m23l460j188K874J942j602j694M75N88j89R4N57j310j501
$$ -341 -2777 -791 2533 2110 -1350 -2538 336 2278 676 -1018 -543 45 -144 -50 507 -803 -2304
875b304K199K078l250l235K724M227k003n504M49M473P58l788r74K205P00j559
$$ -2304 -105 1973 -1277 -4512 -1788 2439 436 -5068 -4619 -146 612 -3176 -4150 -1945 -1245 -2804
891b804O25P79p71o89L075J174l193j531M169L289l562l983K214L673m40l724
$$ -2804 -2179 -1400 -2171 -2860 215 1389 -1804 -3335 834 4123 561 -3422 -1208 2465 2025 -1699
907a699n33J816N08q66l08l08r62R05J475k34k471P46L228K28k890j853K718K762
$$ -1699 -2232 -416 92 -774 -1082 -1390 -2352 -1447 28 -206 -2677 -1931 1297 1525 -1365 -3218 -500 2262
925B262j244k872p70K154J790j450j356J28J389M03q95k87k4N46N50K47j376j379
$$ 2262 1018 -1854 -2624 -470 1320 -130 -1486 -1358 31 434 -461 -748 -772 -226 324 571 -805 -2184
943b184J948K586p88l520k73L989K191l106j872K324K230j188j236P82O10m24
$$ -2184 -236 2350 1562 -1958 -2231 1758 3949 843 -1029 1295 3525 2337 1101 1883 2493 2069
959B069j26J17j091j986K361K243k366m087J574M673l33m196o40L467J477k023
$$ 2069 1943 2060 969 -1017 1344 3587 1221 -2866 -1292 3381 3048 -1148 -1788 1679 3156 1133
975A133p98J723J71o46M83J89j416k45J733N82k838k103K623K858j581l968K19
$$ 1133 335 2058 2229 1583 2066 2255 839 594 2327 2909 71 -2032 591 3449 1868 -2100 -1881
992a881L038J312j996j585J084J360m18q28l08Q24K11M05j45j588J18J451J534
$$ -1881 1157 2469 473 -1112 -28 1332 914 86 -222 602 813 1218 1073 -515 -397 1054 2588
1009B588j576k922m8L212J198k859k653J417K300r97k366P0K017J40r54m86O11
$$ 2588 1012 -1910 -1958 1254 2452 -407 -3060 -1643 657 -340 -2706 -2636 -619 -479 -1433 -1919 -1308
1026a308p4Q75J234q53k519M41L805O10l796k389K816K594k292k725J074J663
$$ -1308 -1382 -507 727 -126 -2645 -2204 1601 2211 -1585 -3974 -1158 1436 -856 -3581 -2507 -844
1042h44p41j425L78J152k16K92N92o55j507J581K790p73k950r07L672J489k271
$$ -844 -1585 -3010 -2632 -1480 -1696 -1404 -812 -1467 -2974 -1393 1397 624 -2326 -3233 439 1928 -343
1059c43k011J179K158n69j238J4R58M07l66p20j85L4J145J209j338k004L25K360
$$ -343 -2354 -1175 983 414 -824 -810 148 555 189 -531 -716 -682 463 1672 334 -1670 -1345 1015
1077A015J312j862k068J086L128m11k229k3K152N65j432j015O54J073k03o17o91
$$ 1015 2327 465 -1603 -517 2611 2200 -29 -52 2100 2665 1233 218 872 1945 1742 1125 434
1094D34r52K54K036N76k401j861K554K496j195k281N10K897J77k205l83J252J197
$$ 434 -518 -264 1772 2348 -53 -1914 640 3136 1941 -340 170 3067 3244 1039 656 1908 3105
1111C105j056o06l94m66R57R23n53k631n93K326J598k026k575J216K042k77k077
$$ 3105 2049 1443 1049 583 1540 2463 1910 -721 -1314 1012 2610 584 -1991 -775 1267 990 -1087
1128a087n38J481J012r38q95j77Q17J022K72j515q44M02K022L89k307j471O33
$$ -1087 -1625 -144 868 -70 -965 -1142 -325 697 969 -546 -1390 -988 1034 1423 -884 -2355 -1722
1145a722K339j14k464m33J800R32j451j904J375J628K80j505k42oJ076J218k74
$$ -1722 617 503 -1961 -2394 -594 338 -1113 -3017 -1642 -14 266 -1239 -1481 -1487 -411 807 533
1162E33j400r82J134J974j210k385l73K290K32k263r41J574J303j021j306j47
$$ 533 -867 -1849 -715 1259 49 -2336 -2709 -419 -187 -2450 -3391 -1817 -514 -1535 -2841 -2988
1178b988O10O90N93o67r27j83J807J330j155j714J137J682J88j888j74J833P94
$$ -2988 -2378 -1688 -1095 -1762 -2689 -2872 -1065 265 -890 -2604 -1467 215 403 -1485 -1659 174 968
1195I68j219r71K85J109O05m92p83p62Q77J588l3j426j049J827J096l1j144o00
$$ 968 -251 -1222 -937 172 777 285 -498 -1260 -383 1205 1172 -254 -1303 524 1620 1589 445 -155
1213a55J923O11q34j886Q91J583m42j281p50K67J036L79p73j079p54J416J739
$$ -155 1768 2379 1545 -341 550 2133 1691 410 -340 -73 963 1342 569 -510 -1264 152 1891
1230A891n78k127O00K048N31k131l94J882J374o77j748M10J593P0Pp42p58M17
$$ 1891 1313 -814 -214 1834 2365 234 -160 1722 3096 2419 671 1081 2674 2744 2751 2009 1251 1668
1248A668J328Q66j451j895Q92J963q50j858K39J002J191j509j034L68J347k7j131
$$ 1668 2996 3862 2411 516 1408 3371 2521 663 902 1904 3095 1586 552 920 2267 2240 1109
1265A109n58j66N47J205n32j698m05Q24Q25p20j577m63J246N33j430j394J084
$$ 1109 551 385 932 2137 1605 -93 -498 326 1151 431 -1146 -1609 -363 170 -1260 -2654 -1570
1282a570J318o1j282j012J220J101J5r46l12L92P06O99n09j293K8J532N93k007
$$ -1570 -252 -313 -1595 -2607 -1387 -286 -271 -1217 -1529 -1137 -431 268 -241 -1534 -1506 26 619 -1388
1300a388r29J519J441j602j553K75J412L51j081o04P1N16M49O01q02j379N88J851
$$ -1388 -2317 -798 643 -959 -2512 -2237 -825 -474 -1555 -2159 -2088 -1572 -1123 -522 -1324 -2703 -2115 -264
1318b64J38j692l26J777R30j680j081J219J202J1j096p00j49J069Q96k56j111
$$ -264 -126 -1818 -2144 -367 563 -1117 -2198 -979 223 234 -862 -1562 -1711 -642 254 -2 -1113
1335a113k68J629Q96p33r70P01J703K19j237m93R66J356k58j208q15Q14J486q67
$$ -1113 -1381 248 1144 411 -559 142 1845 2064 827 334 1300 2656 2398 1190 375 1189 2675 1808
1353A808j089n77N62O77J44r99k99K82P56M39r39j278J318J785j084j750O2K320
$$ 1808 719 142 704 1381 1525 526 227 509 1265 1704 765 -513 805 2590 1506 -244 -182 2138
1371B138L49j387r97O22P56K51o56l14n21k10J268Kj546m70J440R75j679j214
$$ 2138 2487 1100 103 725 1481 1732 1076 762 241 31 1299 1301 -245 -715 725 1700 21 -1193
1389a193R20K426j157j558J96P09n3L91m6j063j49O16Q50j020r90L61J329m38
$$ -1193 -273 2153 996 -562 -366 343 290 681 635 -428 -577 39 889 -131 -1121 -760 569 131
1407A31j664m87J194R40p74j296N9Q80Q89l19o17l91Q84P90m5j032K05N19O78
$$ 131 -1533 -2020 -826 114 -660 -1956 -1897 -1017 -128 -447 -1064 -1455 -571 219 174 -858 -653 -134 544
1426E44pq87l09Q56J049q01j113m57J961M38j811j093J428Q98l25q06j02L52k9
$$ 544 537 -350 -659 197 1246 445 -668 -1125 836 1274 -537 -1630 -202 696 371 -435 -537 -185 -214
1445b14J20P15j025k83R75J364j067j791J033J920m97k315JJ977L06j009p26N74
$$ -214 -94 621 -404 -687 288 1652 585 -1206 -173 1747 1250 -1065 -1064 913 1219 210 -516 58
1463E8k19L29K78m7q86J93J614M45j426p79J710J400j264j028O58R37lk98m54
$$ 58 -161 168 446 399 -487 -294 1320 1765 339 -440 1270 2670 1406 378 1036 1973 1970 1672 1218
1482A218k99J91N25m17q65j06O72M55p46n73K97N28M05n42q47jJ209O55r30j079
$$ 1218 919 1110 1635 1218 353 247 919 1374 628 55 352 880 1285 743 -104 -105 1104 1759 829 -250
1502b50O56J572n65j330J73O36L0o70j6j08n88L68R45p75j172N03J690J79k187
$$ -250 406 1978 1413 83 256 892 922 252 236 128 -460 -92 853 78 -1094 -591 1099 1278 -909
1521i09n46K129P68j280j068J212N71o12k77K83j97l54M30N76j001j202J157J009
$$ -909 -1455 674 1442 162 -906 306 877 265 -12 271 74 -280 150 726 -275 -1477 -320 689
1539F89j092j822N91J603j55j154l83Q22M16q1j94q14M61M55N15o06l22p1Q70
$$ 689 -403 -2225 -1634 -31 -186 -1340 -1723 -901 -485 -566 -760 -1574 -1113 -658 -143 -749 -1071 -1142 -272
1558b72K38p61p21N74M49R0p42m26L22J210q8j376l06J155M90l31n11P44J36j74
$$ -272 -34 -795 -1516 -942 -493 -403 -1145 -1571 -1249 -39 -127 -1503 -1809 -654 -164 -495 -1006 -262 -126 -300
1578c00M43l6o31K20J134M6j106n19J207J079p00j599M92J349j04j457N92Q41
$$ -300 143 107 -524 -304 830 876 -230 -749 458 1537 837 -762 -270 1079 975 -482 110 951
1596I51n31j01N01k96p12O24J119k99j422k31K217N91j653n77J018O68n95n58
$$ 951 420 319 820 524 -188 436 1555 1256 -166 -397 1820 2411 758 181 1199 1867 1272 714
1614G14l92Q68n01q8j94k47L9O51K77o31p55P02J277p72m66l78N49Q79j99q51
$$ 714 322 1190 689 601 407 160 199 850 1127 496 -259 443 1720 948 482 104 653 1532 1333 482
1634D82k40P75L99n51p00O4Q06m60j90k48j31p5NL66l44j138Q85J030o43j549
$$ 482 242 1017 1416 865 165 229 1035 575 385 137 6 -69 -64 302 -42 -1180 -295 735 92 -1457
1654a457M07J456J65j369l54J010M56n70l98J82k06r1J63L54j454j73J147P61
$$ -1457 -1050 406 571 -798 -1152 -142 314 -256 -654 -472 -678 -769 -606 -252 -1706 -1879 -732 29
1672B9j124j538J263J030l58j070K17J374j37n06j6K89j32L93J60k86l85K98Q15
$$ 29 -1095 -2633 -1370 -340 -698 -1768 -1551 -177 -314 -820 -836 -547 -679 -286 -126 -412 -797 -499 316
1691C16k51o33n73Q42K75m11o72k26R60M25q11k93J39J087J22q80k01K44P95K20
$$ 316 65 -568 -1141 -299 -24 -435 -1107 -1333 -373 52 -759 -1052 -913 174 296 -584 -785 -541 254 474
1711D74m59Q0l72L23R43o58n50j03R07O13j193n24Q93P84k79r83J90R07k7j52
$$ 474 15 95 -277 46 989 331 -219 -322 585 1198 5 -519 374 1158 879 -104 86 993 966 814
1731H14J12J0k86M81Q36q74o54L03J028j06j352k32J509K47j200m82N44N35k96
$$ 814 926 936 650 1131 1967 1093 439 742 1770 1664 312 80 1589 1836 636 154 698 1233 937
1750I37m12l40k70J8N82L4m72n88P48M93m48n61K77P71j41o10n82O75P35N9o93
$$ 937 525 185 -85 -67 515 549 77 -511 237 730 282 -279 -2 769 628 18 -564 111 846 905 212
1771B12n03L21K80jj37l96j12l1O21j78o87j69P56L80p95m81N14Q54k19j006j93
$$ 212 -291 30 310 309 172 -224 -336 -367 254 76 -611 -780 -24 356 -439 -920 -406 448 229 -777 -970
1792i70J077K9j072J41R6n0l1J31n03l66Q5N84q6p35j09N73J052j218m54R10N78
$$ -970 107 136 -936 -795 -699 -749 -780 -649 -1152 -1518 -1433 -849 -935 -1670 -1779 -1206 -154 -1372 -1826 -916 -338
1813c38j90n38M09J26J15K59L92o90J23L27M01n50o42O76N93l50n06l22O00K47
$$ -338 -528 -1066 -657 -531 -416 -157 235 -455 -332 -5 396 -154 -796 -120 473 123 -383 -705 -105 142
1833A42J82m87k47L14N97q1n78N3L68J6K88k15k81k75P71l5m13o59N61N02j96
$$ 142 324 -163 -410 -96 501 420 -158 -105 263 279 567 352 71 -204 567 532 119 -540 21 523 327
1854C27q40m06J264M19m69j39J19K54J90j45L62r1J14L68Q6o77j53R18J17n87
$$ 327 -513 -919 345 764 295 156 275 529 719 574 936 845 959 1327 1413 736 583 1501 1618 1031
1874A031o63J71R08j44o64m32N84J49j25m12n5m4J54k06J03p29K18Q91J4r18l22
$$ 1031 368 539 1447 1303 639 207 791 940 815 403 348 304 458 252 355 -374 -156 735 749 -169 -491
1895d91M00O17j06p17K3K97N36n14j33m0L85l49K4k07l33N76k48J46l52p4K09
$$ -491 -91 526 420 -297 -274 23 559 45 -88 -128 257 -92 -68 -275 -608 -32 -280 -134 -486 -560 -351
1916c51O53j16l34p44J068L85q72k28K55L44m73m4K35k11r5J69p4m33l24L08O25
$$ -351 302 186 -148 -892 176 561 -311 -539 -284 60 -413 -457 -222 -433 -528 -359 -433 -866 -1190 -882 -257
1937b57l30q56O25M44K19j295p0J080k9Q1m83K00K88j63L41k60j9O8O24j19n89
$$ -257 -587 -1443 -818 -374 -155 -1450 -1520 -440 -469 -388 -871 -671 -383 -546 -205 -465 -484 -416 208 89 -500
1958e00m93Q51M33p68M2k51Q28p2q7j69j67P71J74o79L47J24N05l62j09j61pJ28
$$ -500 -993 -142 291 -477 -435 -686 142 70 -17 -186 -353 418 592 -87 260 384 889 527 418 257 250 378
1980C78L04k15p91j57L16O54n04l88K02P19n9m50L37M16k23j61P0J37M2j53O59
$$ 378 682 467 -324 -481 -165 489 -15 -403 -201 518 459 9 346 762 539 378 448 585 627 474 1133
2001A133o66m70L64O90J48p03l64O01M17k99k90k05M96l49K47l57K19j87K5m0
$$ 1133 467 -3 361 1051 1199 496 132 733 1150 851 561 356 852 503 750 393 612 425 450 410
2021D10k73K0L40O5m4o72K99L68Q0l51m29J70r7J84l08l40N74J75r8m95m35N14
$$ 410 137 157 497 562 518 -154 145 513 593 242 -187 -17 -114 70 -238 -578 -4 171 73 -422 -857 -343
2043c43K21r9k79k11k51P83M09m86n58L96J74J30j26l07L29M1n86j29M58k13j8
$$ -343 -122 -221 -500 -711 -962 -179 230 -256 -814 -418 -244 -114 -240 -547 -218 -177 -763 -892 -434 -647 -665
2064f65j40j19l4q5N71j56k83m90P62K08j13o20L32L52k31k79J70N32J63n80L64
$$ -665 -805 -924 -958 -1043 -472 -628 -911 -1401 -639 -431 -544 -1164 -832 -480 -711 -990 -820 -288 -125 -705 -341
2085c41o8l20K35M30j86o64J54L80L18n17O5K77ON5np2M22J09M77n51l2O13j28
$$ -341 -409 -729 -494 -64 -250 -914 -760 -380 -62 -579 -514 -237 -231 -176 -181 -253 169 278 755 204 172 785 657
2108F57L06m43k25K13N12m87m57K80q5N00l1l95k65O46O0j24n89M05Q19n16j84
$$ 657 963 520 295 508 1020 533 76 356 271 771 740 345 80 726 786 662 73 478 1297 781 597
2129E97M1Q6K96K3J83k17q21M20L53k1k70k43J40l2m69n9Q32m61m31P3M66m54
$$ 597 638 724 1020 1043 1226 1009 188 608 961 940 670 427 567 535 66 7 839 378 -53 20 486 32
2151C2J88K61J01o14j63P33J11m34l76J87M33n18j42K10N21m35m68k05L37j17
$$ 32 220 481 582 -32 -195 538 649 215 -161 26 459 -59 -201 9 530 95 -373 -578 -241 -358
2171c58J03J18j19o92P85J45n6o99J69M98N1j24m13J80j91M08k24k68j64p0L28
$$ -358 -255 -137 -256 -948 -163 -18 -74 -773 -604 -106 -55 -179 -592 -412 -603 -195 -419 -687 -851 -921 -593
2192e93l25j25L02J85p4Q0j67j00K68m6r5k61K37N36k5l75k32O84J22m55m76O91
$$ -593 -918 -1043 -741 -556 -630 -550 -717 -817 -549 -595 -690 -951 -714 -178 -203 -578 -810 -126 -4 -459 -935 -244
2214b44M65j51r3m5k5l4J49K88n97m79L61L54l4m00j50Q01K16p13K00J82K92j19
$$ -244 221 70 -23 -68 -93 -127 22 310 -287 -766 -405 -51 -85 -485 -635 166 382 -331 -131 51 343 224
2236B24N4m5l2J56L06j54m36K79r3K38l51k66K21L78k41j16J92K24K63k18j98
$$ 224 278 233 201 357 663 509 73 352 259 497 146 -120 101 479 238 122 314 538 801 583 385
2257C85k06O55K64j98l27n9L96j13M8j67J15K04k96J61n21j81M19K04m89l63J19
$$ 385 179 834 1098 900 573 514 910 797 845 678 793 997 701 862 341 160 579 783 294 -69 50
2278E0M24m5l85q1N2L17m69M48K86p94K56O5M08n29j07K43J36l64n16M12M44m12
$$ 50 474 429 44 -37 15 332 -137 311 597 -197 59 124 532 3 -104 139 275 -89 -605 -193 251 -161
2300a61L1j93O6O8j44J10j09j04K53J99j69j20J15K13l37QM2J81k40j66j14j81
$$ -161 -130 -323 -257 -189 -333 -223 -332 -436 -183 16 -153 -273 -158 55 -282 -274 -232 -51 -291 -457 -571 -752
2322g52j31M72k53j53o5J78j00J43ml22N0L48J05l72J83K19r5M3m41N29LL93l52
$$ -752 -883 -411 -664 -817 -882 -704 -804 -661 -665 -987 -937 -589 -484 -856 -673 -454 -549 -506 -947 -418 -415 -22 -374
2345c74K46k42j11K75J86k0q5r6K06J16l32q4M55K09l94k08M80J92j58k69k95
$$ -374 -128 -370 -481 -206 -20 -40 -125 -221 -15 101 -231 -315 140 349 -45 -253 227 419 261 -8 -303
2366c03P61%k36J40K0m18l7K94K81p44kM87p8o80L75J92O42l14l36P7K12K2K68
$$ -303 458 458 222 362 382 -36 -73 221 502 -242 -244 243 165 -515 -140 52 694 380 44 121 333 355 623
2389F23l74N3L1L23l9j37L18L6j19J59k16k70L21J43l05j99n6K50O9m62N1J61
$$ 623 249 302 333 656 617 480 798 834 715 874 658 388 709 852 547 348 292 542 611 149 200 361
2411C61l69M84m11j29K66j51J28o5m6k50K78n0j07l21j06L83p1n08L90O3j87Q7
$$ 361 -8 476 65 -64 202 51 179 114 68 -182 96 46 -61 -382 -488 -105 -176 -684 -294 -231 -418 -331
2433c31P5K2p7k49K22K55K0k64K27q3j38J83K19j01j94k44r7N96p8l82R5O9k72
$$ -331 -256 -234 -311 -560 -338 -83 -63 -327 -100 -183 -321 -138 81 -20 -214 -458 -555 41 -37 -419 -324 -255 -527
2456e27M8j2m6j56j10J28r4m4J60J81p4J04j80R3J09j56K08j69K24N2k30j24K21
$$ -527 -479 -491 -537 -693 -803 -675 -769 -813 -653 -472 -546 -442 -622 -529 -420 -576 -368 -537 -313 -261 -491 -615 -394
2479c94J66J30l50m4J76J96J21j51K66r9m5M00Q4j18J60J91L7j74j53P1K31l29
$$ -394 -228 -98 -448 -492 -316 -120 1 -150 116 17 -28 372 456 338 498 689 726 552 399 470 701 372
2501C72L2r0K78k62j58L09l0m01J77K73l34k13J47J76K58j80n07M81n1J37l7j54
$$ 372 404 314 592 330 172 481 451 50 227 500 166 -47 100 276 534 354 -153 328 277 414 377 223
2523B23M23r0k49L73m90o8M99K32m65k52K44K28N6n76J23K21M01k01l16K15J7
$$ 223 646 556 307 680 190 122 621 853 388 136 380 608 664 88 211 432 833 632 316 531 548
2544E48l03k3k43K80r8k7L79n1n02j25O3j22l1k34q0J11K61p13J20L67j67m08
$$ 548 245 222 -21 259 161 134 513 462 -40 -165 -102 -224 -255 -489 -569 -458 -197 -910 -790 -423 -590 -998
2566i98M15q2%j8K10O0q3L66n1k13k15K37k6K72l70l28N20L47j33l26J08m9k59
$$ -998 -583 -665 -665 -683 -473 -413 -496 -130 -181 -394 -609 -372 -398 -126 -496 -824 -304 43 -90 -416 -308 -357 -616
2589f16K89j2K66m09M46j07j12p2j20N45l46J67l3O3R0k55K3j30J31M59l95P3
$$ -616 -327 -339 -73 -482 -36 -143 -255 -327 -447 98 -248 -81 -114 -51 39 -216 -193 -323 -192 267 -128 -55
2611e5j00M96m69J17j61L94k51R3J7j64R9o5N13j24J38l06L13P0r2N9Q8L6l39
$$ -55 -155 341 -128 -11 -172 222 -29 64 81 -83 16 -49 464 340 478 172 485 555 463 522 610 646 307
2634C07L45l19J36l47L55r6o8k48N0L19k57J55j94J82p3l92K14K67o4j04k63L10
$$ 307 652 333 469 122 477 381 313 65 115 434 177 332 138 320 247 -145 69 336 272 168 -95 215
2656B15J5k07L07l21j37K72j19K14m51K9L41k96J52J26o33O62j45J66k71K6N4
$$ 215 230 23 330 9 -128 144 25 239 -212 -183 158 -138 14 140 -493 169 24 190 -81 -55 -1
2677aN0m8k1L5N1l01K01p7rj91L52l17j18J03l3O8j05j32qN96n02j8K27n1k50
$$ -1 49 1 -20 15 66 -235 -34 -111 -120 -311 41 -276 -394 -291 -324 -256 -361 -493 -501 95 -407 -425 -198 -249 -499
2702d99Q8J54J24K8j37j83L3N0Q4J93k50L75j94k49l7K5K02K49j41j92q9M42m27
$$ -499 -411 -257 -133 -105 -242 -425 -392 -342 -258 -65 -315 60 -134 -383 -420 -395 -193 56 -85 -277 -366 76 -351
2725c51O3N89j90n6l47K64P6P2N1k84K11j46J60j77j1j6O9L1k41L33K3k07J75
$$ -351 -288 301 111 55 -292 -28 48 120 171 -113 98 -48 112 -65 -76 -92 -23 8 -233 100 123 -84 91
2748I1n0J32r7j0J41l99K35o9N45m22l74O55K14n02j1J61K77N0j20m70M50l10
$$ 91 41 173 76 66 207 -192 43 -26 519 97 -277 378 592 90 79 240 517 567 447 -23 427 117
2770A17R1PJ64k00l67J87M75l45J69K2M23k57k09O8K45Om7k09j6J63j44p9K85
$$ 117 208 215 379 179 -188 -1 474 129 298 320 743 486 277 345 590 596 549 340 324 487 343 264 549
2793E49j91K2k74J51m32N29j33j42j12j61L49j31J31n9n11K42R3j12J09l14L05
$$ 549 358 380 106 257 -175 354 221 79 -33 -194 155 24 155 96 -415 -173 -80 -192 -83 -397 -92
2814i2k5j10qk5k00K00j15j4kj29J44O0j41L2L4K66m79Q8N33k82j68KK13l34o
$$ -92 -117 -227 -235 -260 -460 -260 -375 -389 -391 -520 -376 -316 -457 -425 -391 -125 -604 -516 17 -265 -433 -431 -218 -552 -558
2839e58q3L05J71j70J41j62J7k78L76n9m5j84j26K81k62p0J49J04j18j02M54r7
$$ -558 -641 -336 -165 -335 -194 -356 -339 -617 -241 -300 -345 -529 -655 -374 -636 -706 -557 -453 -571 -673 -219 -316
2861c16k25J40L83Qpm70M61k37K23j59J01J15l21P14l76j26n0K5J48K9P1L0j32
$$ -316 -541 -401 -18 -10 -17 -487 -26 -263 -40 -199 -98 17 -304 410 34 -92 -142 -117 31 60 131 161 29
2884B9m9J58J40O1J75l9m61O25k91R0m1Q7q3J68j46J8j61K44k65l09M58J60n16
$$ 29 -20 138 278 339 514 475 14 639 348 438 397 484 401 569 423 441 280 524 259 -50 408 568 52
2907E2j01J38K07l57M32j22M68n16n5O7K57l19L00J00r6m59O8J64K22k78K09K2
$$ 52 -49 89 296 -61 371 249 717 201 146 213 470 151 451 551 455 -4 64 228 450 172 381 403
2929D03k91lk19N14l53L0J5M1JQk25q9J10m4N7Nr5k06K63k54R1J5J55l49k78L68
$$ 403 112 109 -110 404 51 81 96 137 138 146 -79 -168 -58 -102 -45 -40 -135 -341 -78 -332 -241 -226 -71 -420 -698 -330
2955c30l97M12l11J97k11P9M12j38l7O4j70J81j76L61k69j81J56M4K23n79K44
$$ -330 -727 -315 -626 -429 -640 -561 -149 -287 -324 -260 -430 -249 -425 -64 -333 -514 -358 -314 -91 -670 -426
2976d26J48q1Q3m0l5J15j7P0n7K8j40j08J53R7j21J26po4l8P8J41l06O27m72M26
$$ -426 -278 -359 -276 -316 -351 -236 -253 -183 -240 -212 -352 -460 -307 -210 -331 -205 -212 -276 -314 -236 -95 -401 226 -246 180
3001A80j22j99J66j0J6K9k07K33J78j74K81j54p7N9J61k10q5J24J04J78J15O0
$$ 180 58 -141 25 15 31 60 -147 86 264 90 371 217 140 199 360 150 65 189 293 471 586 646
3023F46n3J9M0l29K95N0j33qk86R1K1J52n1k73J65j81l4L37K32l53l26K27K86
$$ 646 593 612 652 323 618 668 535 527 241 332 353 505 454 181 346 165 131 468 700 347 21 248 534
3046E34l16j15j40J47Q6j26K23K7k6l6Q4r7p4k59M41k51p3l29L11j82J40L08k62
$$ 534 218 103 -37 110 196 70 293 320 294 258 342 245 171 -88 353 102 29 -300 11 -171 -31 277 15
3069A5m5j14K16j94J86k67L58l59k04K30r4m4K03j36lK82n06j87L9J38K39k78
$$ 15 -30 -144 72 -122 64 -203 155 -204 -408 -178 -272 -316 -113 -249 -252 30 -476 -663 -624 -486 -247 -525
3091e25k0K59j66R3j52K86k99K25n4M2m8r3J64pK10m58K14n8P6J70K05l27n3J10
$$ -525 -545 -286 -452 -359 -511 -225 -524 -299 -353 -311 -359 -452 -288 -295 -85 -543 -329 -387 -311 -141 64 -263 -316 -206
3115b06N0j07L14J55m62r2K99M76n52L04K56n69P1m8J28k22K60l60K76j21J16
$$ -206 -156 -263 51 206 -256 -348 -49 427 -125 179 435 -134 -63 -111 17 -205 55 -305 -29 -150 -34
3136c4M1m8j09K14j65L25j02k00K49k83L36k05K66J3l45L73L2r0j67M33J5j14
$$ -34 7 -41 -150 64 -101 224 122 -78 171 -112 224 19 285 298 -47 326 358 268 101 534 549 435
3158D35k15K39n1j39L47j85k42J22J10j23k16K25j37j58L20j64o3j21P5L11j62
$$ 435 220 459 408 269 616 431 189 311 421 298 82 307 170 12 332 168 105 -16 59 370 208
3179B08j05lJ14L14m10j59J31r9n4k9K16k22q1J77Q4j67k6j56K04J23j66J96o8
$$ 208 103 100 214 528 118 -41 90 -9 -63 -92 124 -98 -179 -2 82 -85 -111 -267 -63 60 -106 90 22
3202B2j97K26j22J12j95o0j66M57k47K8j72m1k69J53j51M61r4l39M19l19K88l85
$$ 22 -175 51 -71 41 -154 -214 -380 77 -170 -142 -314 -355 -624 -471 -622 -161 -255 -594 -175 -494 -206 -591
$$ [...]
8191f9
##END NTUPLES=NMR FID
##END=
