##TITLE=1H_K-377
 DMSO/CCl4, 8 sc, 
 1.6.2020
##JCAMPDX= 6.0         $$ Bruker NMR JCAMP-DX V2.0
##DATA TYPE= NMR FID
##DATA CLASS= NTUPLES
##ORIGIN= UXNMR, Bruker Analytische Messtechnik GmbH
##OWNER= root
$$ XWIN-NMR		Version 3.5
$$ Mon Jun  1 12:37:20 2020 Russian Standard Time (UT+4h)  she@DPX200
##.OBSERVE FREQUENCY= 200.1315
##.OBSERVE NUCLEUS= ^1H
##.DELAY= (6, 6)
##.ACQUISITION MODE= SIMULTANEOUS
##.ACQUISITION SCHEME= undefined
##.AVERAGES= 8
##.DIGITISER RES= 18
##SPECTROMETER/DATA SYSTEM= spect
##.PULSE SEQUENCE= zg30
##.SOLVENT NAME= DMSO
##.SHIFT REFERENCE= (INTERNAL, DMSO, 0, 15.7039)
##AUDIT TRAIL= $$ (NUMBER, WHEN, WHO, WHERE, WHAT)
$$ ##TITLE= Audit trail, XWIN-NMR		Version 3.5
$$ ##JCAMPDX= 5.01
$$ ##ORIGIN= Bruker BioSpin GmbH
$$ ##OWNER= she
$$ F:/spectra/data/she/nmr/H-F/1/audita.txt
$$ ##AUDIT TRAIL=  $$ (NUMBER, WHEN, WHO, WHERE, WHAT)
(   1,<2020-06-01 12:36:10.78 +0400>,<she>,<DPX200>,
      <created by zg, POWCHK disabled, PULCHK disabled
       configuration hash MD5:
       00 E9 B6 7A A2 85 ED C7 34 08 36 98 17 FE 4E 26
       data hash MD5: 16K
       E4 CB FF 40 DD 33 C5 E2 07 22 24 51 BC 21 E3 D0>)
$$ ##END=
$$ 
$$ hash MD5
$$ 01 4B 08 13 DA F6 5D A1 40 3A A7 6F CC A3 D4 47
##$RELAX= 
##$RELAX= 
##$RELAX= 
##$RELAX= 
##$RELAX= 
##$RELAX= 
$$ Bruker specific parameters
$$ --------------------------
##$DU= <F:/spectra>
##$EXPNO= 1
##$NAME= <H-F>
##$PROCNO= 1
##$TYPE= <nmr>
##$USER= <she>
##$AMP= (0..31)
100 100 100 100 100 100 100 100 100 100 100 100 100 100 100 100 100 100 
100 100 100 100 100 100 100 100 100 100 100 100 100 100 
##$AQSEQ= 0
##$AQ_mod= 1
##$AUNM= <au_zg>
##$AUTOPOS= <>
##$BF1= 200.13
##$BF2= 200.13
##$BF3= 200.13
##$BF4= 200.13
##$BF5= 200.13
##$BF6= 200.13
##$BF7= 200.13
##$BF8= 200.13
##$BYTORDA= 1
##$CFDGTYP= 0
##$CFRGTYP= 5
##$CHEMSTR= <none>
##$CNST= (0..31)
1 1 145 1 1 1 1 1 1 1 1 1 1 1 1 1 1 1 1 1 1 1 1 1 1 1 1 1 1 1 1 1 
##$CPDPRG= <>
##$CPDPRG1= <>
##$CPDPRG2= <>
##$CPDPRG3= <>
##$CPDPRG4= <mlev>
##$CPDPRG5= <mlev>
##$CPDPRG6= <mlev>
##$CPDPRG7= <mlev>
##$CPDPRG8= <mlev>
##$CPDPRGB= <>
##$CPDPRGT= <>
##$D= (0..31)
0 1.2 0 0 0 0 0 0 0 0.06 0 0.03 0 0 0 0 0.0002 0 0 0 0 0 0 0 0 0 0 0 0 
0 0 0 
##$DATE= 1591000570
##$DBL= (0..7)
120 120 120 120 120 120 120 120 
##$DBP= (0..7)
150 150 150 150 150 150 150 150 
##$DBP07= 0
##$DBPNAM0= <>
##$DBPNAM1= <>
##$DBPNAM2= <>
##$DBPNAM3= <>
##$DBPNAM4= <>
##$DBPNAM5= <>
##$DBPNAM6= <>
##$DBPNAM7= <>
##$DBPOAL= (0..7)
0.5 0.5 0.5 0.5 0.5 0.5 0.5 0.5 
##$DBPOFFS= (0..7)
0 0 0 0 0 0 0 0 
##$DE= 6
##$DECBNUC= <off>
##$DECIM= 24
##$DECNUC= <off>
##$DECSTAT= 4
##$DIGMOD= 1
##$DIGTYP= 9
##$DL= (0..7)
0 120 120 120 120 120 120 120 
##$DP= (0..7)
150 150 150 150 150 150 150 150 
##$DP07= 0
##$DPNAME0= <>
##$DPNAME1= <>
##$DPNAME2= <>
##$DPNAME3= <>
##$DPNAME4= <>
##$DPNAME5= <>
##$DPNAME6= <>
##$DPNAME7= <>
##$DPOAL= (0..7)
0.5 0.5 0.5 0.5 0.5 0.5 0.5 0.5 
##$DPOFFS= (0..7)
0 0 0 0 0 0 0 0 
##$DQDMODE= 0
##$DR= 18
##$DS= 0
##$DSLIST= <SSSSSSSSSSSSSSS>
$$ [...]
##$SUBNAM2= <"">
##$SUBNAM3= <"">
##$SUBNAM4= <"">
##$SUBNAM5= <"">
##$SUBNAM6= <"">
##$SUBNAM7= <"">
##$SUBNAM8= <"">
##$SUBNAM9= <"">
##$SW= 24.9337058887773
##$SWIBOX= (0..15)
0 0 2 0 0 0 0 0 0 0 0 0 0 0 0 0 
##$SW_h= 4990.01996007984
##$TD= 16384
##$TD0= 1
##$TE= 0
##$TE2= 300
##$TE3= 300
##$TEG= 300
##$TL= (0..7)
0 120 120 120 120 120 120 120 
##$TP= (0..7)
150 150 150 150 150 150 150 150 
##$TP07= 0
##$TPNAME0= <>
##$TPNAME1= <>
##$TPNAME2= <>
##$TPNAME3= <>
##$TPNAME4= <>
##$TPNAME5= <>
##$TPNAME6= <>
##$TPNAME7= <>
##$TPOAL= (0..7)
0.5 0.5 0.5 0.5 0.5 0.5 0.5 0.5 
##$TPOFFS= (0..7)
0 0 0 0 0 0 0 0 
##$TUNHIN= 0
##$TUNHOUT= 0
##$TUNXOUT= 0
##$USERA1= <user>
##$USERA2= <user>
##$USERA3= <user>
##$USERA4= <user>
##$USERA5= <user>
##$V9= 5
##$VALIST= <valist>
##$VCLIST= <CCCCCCCCCCCCCCC>
##$VD= 0
##$VDLIST= <DDDDDDDDDDDDDDD>
##$VPLIST= <PPPPPPPPPPPPPPP>
##$VTLIST= <TTTTTTTTTTTTTTT>
##$WBST= 1024
##$WBSW= 4
##$XGAIN= (0..3)
0 0 0 0 
##$XL= 0
##$YL= 0
##$YMAX_a= 169557
##$YMIN_a= -134220
##$ZGOPTNS= <>
##$ZL1= 120
##$ZL2= 120
##$ZL3= 120
##$ZL4= 120
##$ABSF1= 10
##$ABSF2= 0
##$ABSG= 5
##$ABSL= 3
##$ALPHA= 0
##$AQORDER= 0
##$ASSFAC= 0
##$ASSFACI= 0
##$ASSFACX= 0
##$ASSWID= 0
##$AUNMP= <proc_1d>
##$AZFE= 0.1
##$AZFW= 0.1
##$BCFW= 1
##$BC_mod= 2
##$BYTORDP= 1
##$COROFFS= 0
##$CY= 11.3945322036743
##$DATMOD= 1
##$DC= 2
##$DFILT= <>
##$DTYPP= 0
##$F1P= 16.9975609425685
##$F2P= -3.02152046262296
##$FCOR= 0.5
##$FTSIZE= 0
##$FT_mod= 4
##$GAMMA= 1
##$GB= 0.15
##$INTBC= 1
##$INTSCL= 1
##$ISEN= 128
##$LB= 0.24
##$LEV0= 0
##$LPBIN= 0
##$MAXI= 10000
##$MC2= 0
##$MEAN= 0
##$ME_mod= 0
##$MI= 1.114404
##$NCOEF= 0
##$NC_proc= 0
##$NLEV= 6
##$NOISF1= 3.799351
##$NOISF2= 2.8
##$NSP= 1
##$NTH_PI= 0
##$NZP= 0
##$OFFSET= 15.70392
##$PC= 1
##$PHC0= -9793.003
##$PHC1= 15.80082
##$PH_mod= 1
##$PKNL= yes
##$PPARMOD= 0
##$PSCAL= 0
##$PSIGN= 0
##$REVERSE= no
##$SF= 200.130013532006
##$SI= 16384
##$SIGF1= 3
##$SIGF2= 2
##$SINO= 400
##$SIOLD= 16384
##$SREGLST= <1H.CDCl3>
##$SSB= 0
##$STSI= 0
##$STSR= 0
##$SW_p= 3612.71676300578
##$SYMM= 0
##$S_DEV= 0
##$TDeff= 0
##$TDoff= 0
##$TI= <>
##$TILT= no
##$TM1= 0
##$TM2= 0
##$TOPLEV= 0
##$USERP1= <user>
##$USERP2= <user>
##$USERP3= <user>
##$USERP4= <user>
##$USERP5= <user>
##$WDW= 1
##$XDIM= 8192
##$YMAX_p= 0
##$YMIN_p= 0
$$ End of Bruker specific parameters
$$ ---------------------------------
##NTUPLES= NMR FID
##VAR_NAME=  TIME,          FID/REAL,        FID/IMAG
##SYMBOL=    X,             R,               I
##VAR_TYPE=  INDEPENDENT,   DEPENDENT,       DEPENDENT
##VAR_FORM=  AFFN,          ASDF,            ASDF
##VAR_DIM=   8192,          8192,            8192
##UNITS=     SECONDS,       ARBITRARY UNITS, ARBITRARY UNITS
##FACTOR=    0.0002004,     1,               1
##FIRST=     0,             0,               0
##LAST=      1.6414764,     0,               0
##MIN=       0,             -134220,         0
##MAX=       1.6414764,     169557,          0
$$ Real data points
##PAGE= N=1
##DATA TABLE= (X++(R..R)), XYDATA
0@%%%%%%%%%%qJ6j6J6j6J8k6L2l6M4n3O1p0Q2r5J10j26J41j59J82k04K28k58K89
$$ 0 0 0 0 0 0 0 0 0 0 0 -8 8 -8 8 -8 10 -16 16 -20 24 -29 32 -38 44 -51 59 -67 74 -85 97 -107 121 -137 152
34A52l23L61m02M47m97N52o10O74p47Q27r17J017j128J255j398J564j760J994
$$ 152 -171 190 -212 235 -262 290 -320 354 -393 434 -483 534 -594 661 -737 827 -933 1061
52A061k276K623l068L660m494N770p985J2944m6710K0985N6903o2335p9753l1545
$$ 1061 -1215 1408 -1660 2000 -2494 3276 -4709 8235 -38475 -17490 39413 -22922 -102675 -134220
66a34220N9384O8707J3444n9127n7288M5O2002N3790j794n3973m1776J1760N7983
$$ -134220 -74836 -6129 7315 -51812 -109100 -109055 -47053 6737 4943 -49030 -90806 -79046 -21063
79b1063M5060q619n5256m2331J5417O2344M4240k1254o8882m3717K8471P4750
$$ -21063 23997 15378 -39878 -82209 -66792 -4448 39792 18538 -50344 -94061 -65590 9160
91I160L9950m1159q2545l3974N4669Q6033K2820o5790q1002m503P8321P5585n619
$$ 9160 49110 7951 -74594 -108568 -53899 32134 54954 -10836 -91838 -96341 -18020 57565 51946
104E1946p3858n7096K0399P4651N1526j9167o3322m0502K2196O0116L8799k0770
$$ 51946 -21912 -79008 -58609 16042 67568 48401 -14921 -55423 -33227 26889 65688 44918
116D4918n8742l8191J8565N6459L4667k5426o3542l6947K7222O1898K8704l8986
$$ 44918 -13824 -52015 -33450 23009 57676 32250 -31292 -68239 -41017 20881 49585 10599
128A0599o6768k2217M6142O4530J2164n4439o0125L572O4803N4008j5124o4284
$$ 10599 -56169 -78386 -32244 32286 44450 -9989 -70114 -66542 -1739 52269 37145 -27139
140b7139l8223L1427O3610K7047l4542n5241j6345L7091M8380J0835l6563m6584
$$ -27139 -65362 -33935 29675 56722 22180 -33061 -49406 -12315 36065 46900 10337 -36247
152c6247j1161L3128M3905Q922l8207m9506j1182M0721N1162N907m9224n3675
$$ -36247 -47408 -14280 29625 38547 340 -49166 -60348 -19627 31535 37442 -11782 -65457
164f5457J00N7078N4079p140o1690m8516J9231O8877M5900k5791o7468l3623L8939
$$ -65457 -65357 -8279 45800 38660 -23030 -71546 -52315 16562 62462 36671 -30797 -64420 -25481
177b5481O7882K4982m1364n9426j2081M4303N1053O937m0944m4074m482L6152
$$ -25481 42401 67383 26019 -33407 -45488 -1185 49868 56805 15861 -28213 -32695 3457
189C457L9240L629l5473m0728n701L4744M0253J949m1395m3496J855M6171L9044
$$ 3457 42697 46326 10853 -29875 -35576 -832 39421 41370 -25 -43521 -41666 4505 43549
202D3549j1782n2083l5672K1336N3799K6983k9632n3289j7582L8419N3064Q691
$$ 43549 31767 -20316 -55988 -34652 19147 46130 16498 -36791 -54373 -15954 37110 45801
214D5801m2318m5194L544M8600M0679q336m4438k9882J5632M4251K7454j4376
$$ 45801 3483 -41711 -38167 10433 51112 42776 -1662 -31544 -15912 28339 55793 41417
226D1417l8971k4632J4284L9104K5402j4740m3108k9397J5362M5483K5948k4469
$$ 41417 2446 -22186 -7902 31202 56604 41864 -1244 -30641 -15279 30204 56152 31683
238C1683n4284k7236K9046N2533J7026m0018n4754j1367M3325M9393K240m6912
$$ 31683 -22601 -49837 -20791 31742 48768 8750 -46004 -57371 -14046 35347 37587 -9325
250i325m4061O377M8672L9398j0967m5168k8516J8006M4380K5129j7506l7492
$$ -9325 -53386 -47009 1663 41061 30094 -15074 -43590 -25584 18796 43925 26419 -11073
262a1073j7818J8303L4847J7137j6919l4457j8055J6686L4581J5403k1946m0792
$$ -11073 -28891 -10588 24259 41396 24477 -9980 -28035 -11349 23232 38635 16689 -24103
274b4103j6083K6361M0546P597l6231m2024j93M1231L6290r161m4634k9453J7713
$$ -24103 -40186 -13825 26721 34318 -1913 -43937 -44130 -2899 33391 24230 -20404 -49857 -32144
287c2144M5677K4358k1860m2670j6175K8368M2155J1933k8472l7665n747K9567
$$ -32144 13533 37891 16031 -26639 -42814 -14446 27709 39642 11170 -26495 -32242 -2675
299b675L4519L597k9351l2177m507K7901L1001L244l0424l5021m418L2319L5412
$$ -2675 31844 35441 6090 -26087 -30594 -2693 28308 31552 1128 -33893 -38311 -5992 29420
312B9420m45l8527l7403O062M3328L4009j3710m5475k7057K2459M5862K0723k5190
$$ 29420 28975 -9552 -46955 -40893 2435 36444 22734 -22741 -49798 -27339 18523 39246 14056
325A4056m1087j1308K9371L8524P776k8404l2512k108K9581K9372m59k8280k5834
$$ 14056 -27031 -38339 -8968 29556 37332 8928 -23584 -25692 3889 33261 32802 4522 -21312
338b1312K653K6979K3217m461k7912k3447L936K8187K2206p934l2614k3612J1368
$$ -21312 -18659 8320 31537 27076 -836 -24283 -20347 7840 30046 22112 -10502 -34114 -22746
351b2746L5157K1126j9073l9030j6324K6084L9919R066l2214l6426J93L5616L2406
$$ -22746 12411 33537 14464 -24566 -40890 -14806 25113 34179 1965 -34461 -34268 1348 33754
364C3754m139l4991k5826R954L4315K3736j0474l2449k0338J2122L2332J8557
$$ 33754 29615 -5376 -31202 -21248 13067 36803 26329 -6120 -26458 -14336 17996 36553
376C6553j3179l1875j8256J3756L0921J5811j5848l3773j6870J7163L3089J3941
$$ 36553 23374 -8501 -26757 -13001 17920 33731 17883 -15890 -32760 -15597 17492 31433
388C1433k2040l7183j1542K6167L5932N522l1683l3831J815L4756K9120p614l3940
$$ 31433 9393 -27790 -39332 -13165 22767 28289 -3394 -37225 -35410 -654 28466 20852 -13088
401a3088k1944J3276L2994J7605j4476k8606j2428J5862K7453J0695j5876k5804
$$ -13088 -35032 -21756 11238 28843 14367 -14239 -26667 -10805 16648 27343 11467 -14337
413a4337r168J6800K5539P290j9276k6680n858K1317K5818K641k4886k6717l31
$$ -14337 -23505 -6705 18834 26124 6848 -19832 -25690 -4373 21445 24086 -800 -27517 -27848
426b7848K7466K6373m286l1119k4997R803L4894K1467j5382l4993j5682K0937
$$ -27848 -382 25991 21705 -9414 -34411 -24608 10286 31753 16371 -18622 -34304 -13367
438a3367L4306J0422k2606l0479n518K3844K7442L213k2761k5051k114K2315K3888
$$ -13367 20939 31361 8755 -21724 -27242 -3398 24044 27257 4496 -20555 -22669 -354 23534
451B3534J631k3162k4299q03K4331K3762k370k6762k3385M723K7630K1076q460
$$ 23534 25165 2003 -22296 -23099 1232 24994 22624 -4138 -27523 -22800 4830 25906 17446
464A7446k9997j9622J1496L0282J5470j6131l1533j1705J9999K9422O486k3320
$$ 17446 -12551 -32173 -20677 9605 25075 8944 -22589 -34294 -14295 15127 21613 -1707
476a707k6545j068K5268K2284k375k3147j8355O065K3242J7232n189k1095j5169
$$ -1707 -28252 -29320 -4052 18232 15857 -7290 -25645 -19580 3662 20894 15705 -5390 -20559
489b0559P416K2817J6517q127k4457j4723J1275K6651J2694j5776k7772j0940
$$ -20559 -13143 9674 26191 18064 -6393 -21116 -9841 16810 29504 13728 -14044 -24984
501b4984J7331K7050O571k1786k8306m106K3284K5918k14k6522k3968M830K8216
$$ -24984 -7653 19397 25968 4182 -24124 -28230 -4946 20972 20758 -5764 -29732 -24902 3314
514C314K1424p665k6424j5680J1938K6790J4906j0683k2606j1193J2623K3221
$$ 3314 24738 17073 -9351 -25031 -13093 13697 28603 17920 -4686 -15879 -3256 19965
526A9965J1586j1655k3225j1289J2619K3344Q380j7660k6408p724J7534K2006
$$ 19965 31551 19896 -3329 -14618 -1999 21345 29725 12065 -14343 -22067 -4533 17473
538A7473J530k3548k3760o07K2059J9351m882k4137j8220P970K5258J6693j0373
$$ 17473 19003 -4545 -28305 -28912 -6853 12498 7616 -16521 -34741 -26771 -1513 15180 4807
551D807k3290r803J5611K5281R540j3642j9632l426J8015K1332L730j5094j8505
$$ 4807 -18483 -28286 -12675 12606 22146 8504 -11128 -14554 3461 24793 28523 13429 -5076
564e076k096J7320J8633J076j9408k0435r89K0002J8783m750k4803j9337N958
$$ -5076 -7172 10148 28781 29857 10449 -9986 -10975 9027 27810 23060 -1743 -21080 -15122
577a5122K3912J4771j1077k5443j3046J2614K4673J0361j4486k3958o353J6915
$$ -15122 8790 23561 12484 -12959 -26005 -13391 11282 21643 7157 -16801 -23154 -6239
589f239K3761N701j7315k1164j444J9553J9891m02j9000j7005K057J8059J5681
$$ -6239 17522 23223 5908 -15256 -16700 2853 22744 22342 3342 -13663 -11606 6453 22134
602B2134l373j8831j5874L113J8855J4395o686k1261j4443Q328K2093J1152j2715
$$ 22134 18761 -70 -15944 -12831 6024 20419 13733 -7528 -21971 -13643 8450 19602 6887
615F887k2647p994J5134K1047M520j6737j9457j419J7857J8029p38j8239j6407
$$ 6887 -15760 -23754 -8620 12427 16947 210 -19247 -20666 -2809 15220 14482 -3757 -20164
628b0164L002J9534J5090n697j9601j3081P344J9706J0943q913j9643r514J0033
$$ -20164 -17162 2372 17462 11765 -7836 -20917 -13573 6133 17076 8163 -11480 -20994 -10961
641a0961J9013Q816j1128j9688q096J2989K0280O316j5327k0891l886J7638J9785
$$ -10961 8052 16868 5740 -13948 -22044 -9055 11225 17541 2214 -18677 -22563 -4925 14860
654A4860L87j9058j8442K893J9836J5851n189j9350j3028O537J9850J2416p344
$$ 14860 15247 -3811 -22253 -19360 476 16327 11138 -8212 -21240 -14703 5147 17563 10219
667A0219j8703r804R827J9474R201j0503j8195n777J2347J7769M385j3242j6945
$$ 10219 -8484 -18288 -8461 11013 20214 9711 -8484 -14261 -1914 15855 20240 6998 -9947
680i947l347J3489J5581R20j5819j7116p63J5444J4317l899j9347j4884N382J8528
$$ -9947 -13294 195 15776 16696 877 -16239 -17002 -1558 12759 8860 -10487 -25371 -19989 -1461
694a461J0901r374j9122q782J0809J8498O701j0796j6833l925J3264J7617L904
$$ -1461 9440 66 -19056 -27838 -17029 1469 8170 -2626 -19459 -23384 -10120 7497 11401
707A1401j2964j5580j290J5256J6019m85j6063j5003J121J6069J2666n173j7473
$$ 11401 -1563 -17143 -18433 -3177 12842 12357 -3706 -18709 -17588 -1519 11147 5974 -11499
720a1499j3932L787J6052J0348p588j8854j1702Q042J8131Q664j0589j8350n271
$$ -11499 -25431 -21644 -5592 4756 -2832 -21686 -33388 -25346 -7215 1449 -9140 -27490 -32761
733c2761J3666J8445M924j2456j3761K63J5815J6579J674j2383j1622K749J6245
$$ -32761 -19095 -650 4274 -8182 -21943 -21680 -5865 10714 12388 5 -11617 -8868 7377
746G377J3688k249j4167j1393N189J5985R620o882j6884q786P557J5275N065j0272
$$ 7377 21065 18816 4649 -6744 -1555 14430 24050 17168 284 -8502 -945 14330 19395 9123
760I123j6052o312R888J4591L288j2530j5762j989J3963J4581j84j5003j2751
$$ 9123 -6929 -13241 -3353 11238 14526 1996 -13766 -15755 -1792 12789 12605 -2398 -15149
773a5149L264J6091J1884m310j4948r723O567J5230R377o561j5099p597P234J5812
$$ -15149 -11885 4206 16090 11780 -3168 -12891 -6324 8906 18283 11722 -3377 -10974 -3740 12072
787A2072O748r317j6498n377J0712J5304L116j2666j4696j774J3108J3193P8j3195
$$ 12072 18820 9503 -6995 -12372 -1660 13644 16760 4094 -10602 -12376 732 13925 14003 808
801H08j2431Q86J3928J2337k218j4590j1147M974J5486R523o048j5137p069P840
$$ 808 -11623 -10737 3191 15528 13310 -1280 -12427 -7453 8033 17556 11508 -3629 -10698 -2858
815b858J4713N320q835j3886l869R750J2853K979j0129j2872k204J1548J2529
$$ -2858 11855 17175 8340 -5546 -9415 335 13188 16167 6038 -6834 -9038 2510 15039
828A5039q2j2604j2196J639J3549J0847m073j4061r186M905J3733P545o250j4235
$$ 15039 14957 2353 -9843 -8204 5345 16192 12119 -1942 -11128 -6223 7510 15055 8805 -5430
842e430p042O939J4024N636q595j4210m465R883J3811L285j1381j2906r09J2144
$$ -5430 -12472 -5533 8491 14127 5532 -8678 -13143 -3260 10551 13836 2455 -10451 -11360 784
856G84J2152l60j2262j0574J802J2285J0426k104j2937r758L770J3267R184o122
$$ 784 12936 12576 314 -10260 -8458 3827 14253 12149 -788 -10546 -6776 6491 15675 9553
870I553j3834p289O856J3355N124q166j2875m301Q519J1940L186r083j2098j819
$$ 9553 -4281 -11570 -4714 8641 13765 5599 -7276 -11577 -3058 8882 12068 2985 -9113 -10932
884a0932J0241J2406N82j1462j0503J622J2458J0251l008j2431q133M742J2349
$$ -10932 -691 11715 12297 835 -9668 -8046 4412 14663 11655 -776 -8909 -4167 8182
897H182P005n609j2144n995N740J2012M897p743j2876m794Q160J1549K019j0397
$$ 8182 15187 9578 -2566 -8561 -2821 9191 14088 6345 -6531 -11325 -3165 8384 10403 6
911Fj2565j126J0412R909q15j1129j0327J792J1274R009k579j1602q142L991J2750
$$ 6 -12559 -13685 -3273 6636 5821 -5308 -15635 -13843 -2569 6440 3861 -7741 -15883 -11892 858
926H58Q149m928j2142n555O826J3038N266p257j1487l500Q910J1150K730q623
$$ 858 9007 4079 -8063 -13618 -6792 6246 11512 4255 -7232 -10732 -1822 9328 12058 3435
940C435j0468j797R223J0025O74j0486j0395P57J0569Q937l008j1845q110M099
$$ 3435 -7033 -8830 393 10418 11092 606 -9789 -9032 1537 10474 7466 -4379 -12489 -8390
954h390J0635O609n474j0780n397N578J1181M806o541j0456l592Q104J1255K763
$$ -8390 2245 8854 3380 -7400 -12797 -7219 3962 8768 2227 -8229 -11821 -3717 7538 10301
968A0301q358r871m28J0070R967k88r818q216K015J0045Q101k837j0705p263K949
$$ 10301 1943 -7928 -8356 1714 11681 11393 1575 -6641 -4626 5419 13520 10683 -22 -7285 -4336
983d336J0412O517n220j1812o356N752J0851L719p650j1105k970P335R765K027
$$ -4336 6076 12593 7373 -4439 -10795 -5043 5808 9527 1877 -9228 -12198 -4863 4902 6929
997F929p829r582j233Q848R592P68q686r290J554J0476Q598k181r842p160M084
$$ 6929 -900 -10482 -11715 -2867 6725 7493 -1193 -10483 -8929 1547 10145 7964 -1878 -9038 -4954
1012d954J0446O198m577j0151n011N021R143L842n635j0295m505O743R526K299
$$ -4954 5492 11690 7113 -3038 -8049 -3028 6115 9957 4322 -5973 -10478 -3735 5791 8090
1026H090q052r861j371Q726Q442m70q984p426J626R458P087k066r085o192L553
$$ 8090 38 -9823 -11194 -2468 5974 5504 -3480 -10906 -9280 178 7265 5199 -3886 -10078 -6525
1041f525J0065O242m191r635m935N710R816M193o613r676k866O968R095R29p478
$$ -6525 3540 9782 5591 -4044 -8979 -3269 6547 10740 4127 -5549 -8415 -1447 7648 8577 1099
1056A099r154j067P792Q216m60q517q396R39R064P178k356r747o547M095R236
$$ 1099 -8055 -9122 -1330 6886 6426 -2091 -10487 -9548 -484 6694 4338 -5409 -11956 -7861 1375
1071A375N747m621r132m216N262R205L644m929q637k618N965R273K449o848q407
$$ 1375 7122 2501 -6631 -10847 -5585 3620 7264 2335 -6302 -8920 -2955 6318 8767 1919 -6488
1086f488n76Q038Q088k28q066p172J620Q322O323k259q470n525K470Q460N161
$$ -6488 -7064 974 9062 8834 768 -6404 -4784 3538 9861 7602 -868 -6393 -3923 4537 9698
1101I698m227r022m709M284Q990L314n993r292k260O463Q202R50o888p515q7P168
$$ 9698 5471 -3551 -8260 -3976 5014 8328 2335 -6957 -9217 -2754 5448 6398 -490 -8005 -8092 -924
1117i24P597k64p057o286J197Q571P006j706q551n349L321R070M946m039r039
$$ -924 6673 6409 -648 -6934 -5737 2834 9840 8134 -417 -5766 -2445 6625 11571 7532 -1507
1132a507l808M831Q112K457n572q089k970N470P891J414o631q636o52P040P094
$$ -1507 -5315 -484 7628 10085 4513 -3576 -6546 -1076 6815 8229 1598 -7038 -7690 -650 6444
1147F444m49p612o227J985Q190N628j854p321m590L395Q046M887k872p488m161
$$ 6444 5995 -1617 -7844 -5859 2331 7959 6105 -1216 -5806 -2411 5635 10522 7650 162 -3999
1162c999M642Q304K974n222q263k437N635O899O08p001p357m95N763N712p48o852
$$ -3999 643 8947 11921 6699 -1564 -4001 1634 8533 9141 2140 -5217 -5712 51 5763 5015 -1837
1178a837o752J041P003N848k198p770m888L401Q609L927l516p249l225N545P426
$$ -1837 -8589 -7548 -545 5303 3105 -4665 -9553 -6152 2457 6384 2868 -4381 -7606 -2061 5365
1193E365K626m801o771j805N444O795J274n867p214j034N993O610j012p326o441
$$ 5365 7991 3190 -3581 -5386 58 6853 8127 2260 -4954 -5988 5 6615 5603 -1723 -8164
1208h164R94O750N513k536p284m654K713P336L946k898o631l623M481P406L263
$$ -8164 -7170 -420 5093 2557 -4727 -9381 -6668 668 4614 1716 -4915 -8538 -4057 3349 6612
1223F612m360o665j662N737P104J182n971n857j88N922N471p89o049n479K97O084
$$ 6612 2252 -4413 -6075 -338 6766 7948 1977 -3880 -4068 1854 7325 6536 487 -4992 -4695 1389
1239A389M767j757p176m863K126O863L777l618p606l128M059O811K299m705o443
$$ 1389 6156 4399 -2777 -7640 -5514 1349 5126 1508 -6098 -9226 -5167 1644 3943 -762 -7205
1254g205j578M694O245J281n234n913n25N939O329o09o584n145J486O815M511
$$ -7205 -8783 -4089 2156 3437 -1797 -7710 -8235 -2296 4033 3424 -3160 -8305 -6819 -4 4507
1269D507k036o070l643K540O361L831k878n957l153L812O736L090m167o214k342
$$ 4507 2471 -3599 -7242 -4702 1659 5490 2612 -3345 -6498 -2686 4050 7140 2973 -3241 -5583
1284e583N211O494R81n721n760l4N392M893p09o268m434O91N186M353j619o110
$$ -5583 -372 6122 7103 1382 -4378 -4412 980 5873 5164 -1104 -5538 -4847 339 4692 3073 -3037
1300c037m244K219O373L763l161o022k526L981O231K033l806n306q58M323N795
$$ -3037 -7281 -5062 1311 5074 1913 -4109 -6635 -2654 3577 5610 1804 -3502 -4360 -37 5758
1315E758J011m343n088q43N209N467m79o210n123Q90O122M164k643o371l712K241
$$ 5758 6769 2426 -2662 -3505 1704 7171 6692 482 -4641 -3751 2371 6535 3892 -2479 -6191 -3950
1331c950N775K488l033n804l114L554O006K307l882n684j400M732N828O97m266
$$ -3950 1825 4313 1280 -4524 -7638 -4084 1922 4229 347 -5337 -6737 -2005 3823 4520 254
1346B54m954K19N162M809m94m905m319Q90N461L904j294n449m260J854N731L253
$$ 254 -4700 -4481 681 5490 4996 91 -4228 -3338 2123 6027 4733 -716 -4976 -3122 2609 5862
1362E862k965o200k840L719O046J493m471m910r05M427M627P46m087m562OM716
$$ 5862 2897 -3303 -6143 -2424 3622 5115 644 -4266 -5171 -744 3883 4629 542 -4020 -4014 702
1378G02M803Qn169m147J018N709L835j778n546l160K444M789K494k536n024k271
$$ 702 5505 5513 344 -3803 -2785 2924 6759 4981 -565 -3725 -1281 3508 6002 3466 -1558 -3829
1394c829K354N443J903l625n515j407M192N277J022m962m915M66M686M359q82
$$ -3829 -1475 3968 5871 2246 -3269 -4676 -484 4793 5815 853 -4062 -3596 1090 5449 4567
1409D567m537l657J242M862L379j361m990k968J877M925L008k286n274k454K941
$$ 4567 30 -3627 -2385 2477 5856 4495 -495 -3463 -1586 3339 6347 4061 -1213 -3667 -726
1424g26N101J603l708m686q86L514M223O97m038m197n99M041M554n60m410m307
$$ -726 4375 5978 2270 -2416 -3302 212 4435 5132 1094 -3103 -3702 339 4893 4333 -77 -4384
1440d384P12N029L024j415n081k871K329M936J822k663m357j658K814M582J809
$$ -4384 -3672 1357 4381 2966 -2115 -4986 -2657 2279 4101 1438 -2919 -4577 -1763 2819 4628
1455D628l364l782j502L946M496Q49l490m331j74M687M014o10m411l717J412M060
$$ 4628 1264 -2518 -4020 -74 4422 5271 1781 -2550 -2724 1963 5977 5367 956 -2761 -1349 2711
1471B711L217j261m791l549J909M168K897k897m733k545K411N029P67l338m447
$$ 2711 5928 4667 -124 -3673 -1764 2404 5301 2404 -2329 -4874 -2463 2566 3333 -5 -4452
1486d452o33L427M049M90l471l517P4L564L767K01l828l305Q61M584L329r67m415
$$ -4452 -5085 -1658 2391 2881 -590 -4107 -4033 -469 3298 3499 -329 -3634 -2773 1811 5140 4173 -242
1503b42k986K304M655K121k388m560j386K052M232J073k926m384j116L250L656
$$ -242 -3228 -924 3731 5852 3464 -1096 -2482 -430 3802 4875 1949 -2435 -3551 -301 3355
1518C355O54l934m374n9M043L467p32m095l126J477M015K734j598l982j914J556
$$ 3355 4009 75 -4299 -4358 -315 3152 2420 -1675 -4801 -3324 691 3425 1827 -2155 -4069 -2513
1534b513M345K157j471m105k686K809M861J751l266m413o41L357L543L31l671
$$ -2513 1832 3989 2518 -1587 -4273 -1464 3397 5148 1882 -2531 -3172 185 3728 4059 388
1549C88l608K76L456K685k92l694l641Q08L290L126j564m151k470J765M238J873
$$ 388 -3220 -2944 512 3197 2905 -789 -4430 -3622 -332 2794 1230 -2921 -5391 -3626 612 2485
1565B485k304l716j266K612L219J635k653l158j061L119L895N68l055l648K00
$$ 2485 181 -3535 -4801 -2189 1030 2665 12 -3146 -4207 -1088 2807 3375 320 -3328 -3128
1580c128L779L194n97m168k592J002L588K634j934l427k257J388L470J723j810
$$ -3128 651 3845 3248 -920 -3512 -2510 1078 3712 1778 -1649 -3906 -2518 952 2675 865
1595H65m356j546K618M041R85k841l492m99L473L512J30l162k641M17L103K994
$$ 865 -3491 -5037 -2419 1622 2607 -234 -3726 -4225 -752 2760 2890 -272 -2913 -2496 607 3601
1611C601k04l366k595R40L016K981j352m006j988J219L970J651k605l891j139
$$ 3601 3397 31 -2564 -1624 1392 4373 3021 -985 -2973 -1754 2216 3867 1262 -2629 -3768
1626c768J841L753M33k468k993r57K251L271P07k978k944j68L564L004n52l426
$$ -3768 -1927 1826 2259 -209 -3202 -4159 -1908 1363 2070 -908 -3852 -4020 -456 2548 1996 -1430
1642a430k481J312L569K186j123l060j985J551L296J991k080l182j642J943L761
$$ -1430 -3911 -2599 970 3156 2033 -1027 -3012 -1461 1835 3826 1746 -1436 -3078 -1135 2626
1657B626R13k582l447n59K659L024q5k883k866L47K564K794o28k911k077O79K769
$$ 2626 3539 957 -2490 -3049 -390 2634 2549 -334 -3200 -2853 -289 2505 1877 -1034 -3111 -2432 337
1674C37K810j246l172j979J670L476J467j754l320j147K205L075P73k135k691
$$ 337 3147 1901 -1271 -3250 -1580 1896 3363 1609 -1711 -2858 -653 2422 3195 1060 -1631
1689a631q38K309L010M63k314k985p0K979K958n13l324k590J176L487J836j302
$$ -1631 -2469 -160 2850 3313 999 -1986 -2056 923 3881 3368 44 -2546 -1370 2117 3953 2651
1705B651l279j522J320K751J259j418l161j334J727L018J119k409l206n74K734
$$ 2651 -628 -2150 -830 1921 3180 1762 -1399 -2733 -1006 2012 3131 722 -2484 -3058 -324
1720c24L015M7k728k212J06L078K143o58k346j613O77K778K243j087k880j713
$$ -324 2691 2738 10 -2202 -2096 982 3125 2467 121 -1492 -815 1963 4206 3119 239 -1474
1736a474J217L507J038k159k941j125J954K809K84k346k861m0J661K573n5k354
$$ -1474 -257 3250 4288 2129 -812 -1937 17 2826 3110 764 -2097 -2137 -476 2097 2042 -312
1752c12k291k79K830K578j21k974k009R21L584J786j241k520j507J510K834J268
$$ -312 -2603 -2882 -52 2526 2405 -569 -2578 -1657 1927 3713 2472 -48 -1555 -45 2789 4057
1768D057j519k547j223J513K521J105k288k780o42K170K337l32k951k150J7K304
$$ 4057 2538 -9 -1232 281 2802 3907 1619 -1161 -1803 367 2704 2372 -579 -2729 -2712 -408
1784d08K324p22k702j913P22K636J871q26j893k038J287L182J521j356l166n72
$$ -408 1916 1194 -1508 -3421 -2699 -63 1808 982 -911 -2949 -1662 1520 3041 1685 -1481 -2053
1800b053K153K338O58k056k492j71K016J753K79k242k327k31J951K298o04k373
$$ -2053 100 2438 3096 1040 -1452 -1623 393 2146 2425 183 -2144 -2375 -424 1874 1270 -1103
1816a103k556P24K730J762j236k885j179J498K355J146j437k324p70J452K654
$$ -1103 -3659 -2935 -205 1557 321 -2564 -3743 -2245 110 1256 -181 -2505 -3275 -1823 831
1831H31Q72j385k535q46K689K131K15k335k199M85K354J887j056k151j400L38
$$ 831 1703 318 -2217 -3063 -374 1757 1972 -363 -2562 -2077 277 2164 1108 -1043 -2443 -2105
1847b105K353J333p37k188j494J358K374Q34j138k638j096J782K600M37j872k472
$$ -2105 248 1581 844 -1344 -2838 -1480 894 1728 590 -2048 -3144 -1362 1238 1675 -197 -2669
1863b669n2J903J892j34j725k238L35K021K061j98k360j915R11K190J876j244
$$ -2669 -2721 -818 1074 940 -785 -3023 -2688 -667 1394 1196 -1164 -3079 -2168 22 1898 654
1879F54k305q45J604K223J050j656k377j6J206K096R43j596k618n02J560K746
$$ 654 -1651 -2496 -892 1331 2381 725 -1652 -1668 -462 1634 2577 981 -1637 -2139 -579 2167
1895B167j78k100k458N7K446J704o34k212j318M49J997J734j027k052j019R41
$$ 2167 1989 -111 -2569 -2512 -66 1638 1004 -1208 -2526 -2077 -80 1654 627 -1425 -2444 -1503
1911a503K633J233j052k504n58J708K391N83j350k459k77K041K007l56k073j393
$$ -1503 1130 2363 1311 -1193 -1751 -43 2348 2931 1581 -878 -1155 886 2893 2537 464 -929
1927i29l18K063J439n83j969j600K38K367J492j128k495j167J370K117R84j543
$$ -929 -1247 816 2255 1672 -297 -1897 -1659 708 2200 1072 -1423 -2590 -1220 897 1881 338
1943C38j897k26J295K087O80j273j813n49J917K231M20k278j749N69J947J543
$$ 338 -1559 -1785 -490 1597 2277 1004 -809 -1358 559 2790 3210 932 -817 -248 1699 3242
1959C242p43k058j623O24K088P97o39k433p96R36J520R64j190j984r46J369J784
$$ 3242 2499 441 -1182 -558 1530 2327 1688 -745 -1541 -605 915 1879 689 -1295 -2241 -872 912
1976I12O66j612j819j53K177J259J86j696j046N05J442J712m22j669j588L55K186
$$ 912 1578 -34 -1853 -2006 171 1430 1616 -80 -1126 -621 821 2533 2111 442 -1146 -791 1395
1993A395J272o56k138j450J166K323J76j337j694q96J230J782K90j611j792o3
$$ 1395 2667 2011 -127 -1577 -411 1912 2088 751 -943 -1839 -609 1173 1463 -148 -1940 -2003
2009b003J168J577L27j732j454RJ942J616l11j856j518J270J272J144m23j858
$$ -2003 -835 742 1069 -663 -2117 -2108 -166 1450 1139 -717 -2235 -965 307 1451 1028 -830
2025h30p31O27K139Q16j023j487j090J277J978P07j424k222N9J424J509j93j766
$$ -830 -1561 -934 1205 2021 998 -489 -1579 -302 1676 2383 959 -1263 -1204 220 1729 1536 -230
2042b30j419L72J483J322n04j662j328J66K016O13j64k053j039Q05K104N92q19
$$ -230 -1649 -1277 206 1528 1024 -638 -1966 -1800 216 829 665 -1388 -2427 -1622 482 1074 255
2059B55j871m56J320J714N28j522j132k96J609J684m0j481j560K04J936J493j143
$$ 255 -1616 -2072 -752 962 1490 -32 -1164 -1460 149 1833 1793 312 -1248 -1044 892 2385 1242
2076A242j768j026P90J737O49r43j495o15N02J557P47r85j316j013J041J471N04
$$ 1242 -526 -1552 -762 975 1624 681 -814 -1429 -927 630 1377 392 -924 -1937 -896 575 1079
2093A079j139j680K54J533J388J01j315j336J10J672J286k75j340j353N09J552
$$ 1079 -60 -1740 -1486 47 1435 1536 221 -1115 -1005 667 1953 1678 338 -1015 -506 1046
2109A046J410o46k263q71J137J586N92j354j510m74J083J443q9j430j091k08J379
$$ 1046 2456 1810 -453 -1324 -187 1399 1991 637 -873 -1347 -264 1179 1090 -340 -1431 -1639 -260
2126b60J185O8j195j678K07J505J403%j726j055Q56J443J052o52j322r51R80J353
$$ -260 925 993 -202 -1880 -1673 -168 1235 1235 -491 -1546 -690 753 1805 1153 -169 -1120 -140 1213
2144A213N09m69j767n66J152J461m5j308j285j38J467P71p9j521r90M27R55R11
$$ 1213 1722 1253 -514 -1080 72 1533 1488 180 -1105 -1243 224 995 916 -605 -1595 -1168 -213 698
2162F98l53j242j086K25J701R85o11j178j173R66J591Q62r02j291n92J129J662
$$ 698 345 -897 -1983 -1758 -57 928 317 -861 -2034 -1068 523 1385 483 -808 -1400 -271 1391
2179A391N88j752j080j29J542J033j68j130j286J51J151J210r33r62j381Q20J253
$$ 1391 1979 227 -853 -982 560 1593 1425 295 -991 -840 311 1521 588 -374 -1755 -935 318
2196C18L46p50j172n19Q51J100M94q69j174n46Q10J459N28q99j528P3J410J391
$$ 318 664 -86 -1258 -1777 -926 174 668 -201 -1375 -1921 -1111 348 876 -23 -1551 -1478 -68 1323
2214A323J54j239j412M06J435J047n38j422p29K56J315P80q08j410o60Q67J207
$$ 1323 1477 238 -1174 -768 667 1714 1176 -246 -975 -719 596 1376 568 -842 -1502 -635 572
2231E72K67r10j713j25J058J002rq96q78k11J080J045n0n22r51k11J237J123L46
$$ 572 839 -71 -1784 -1909 -851 151 142 -754 -1632 -1843 -763 282 232 -290 -1241 -1452 -215 908 1254
2250A254j774j284J019J403P64l94j731m83R22J458L31o85j797J40P89Q74p4q79
$$ 1254 -520 -1804 -785 618 1382 988 -743 -1226 -304 1154 1485 800 -997 -857 -68 806 732 -147
2268a47j156K41R78R62j89j066q66K78J211P89n28j038n57L17J181J051k48j371
$$ -147 -1303 -1062 -84 878 689 -377 -1243 -965 246 1035 507 -531 -1088 -771 410 1461 1213 -158
2286a58p82P20J608K97o02j769J02R76J362l4j052j413M16R64J006k39q96j338
$$ -158 -940 -220 1388 1685 1083 -686 -584 392 1754 1720 668 -745 -329 635 1641 1402 506 -832
2304h32P01P28R19l59j036j139N32J060P20m95j119o46M05R79O29l31j224n30
$$ -832 -131 597 1516 1157 121 -1018 -486 574 1294 799 -320 -966 -561 418 1047 716 -508 -1038
2322a038N94J353M96n86j645l42J285J575m23j092j102L50J542R59r15j251l83
$$ -1038 -444 909 1405 819 -826 -1168 117 1692 1269 177 -925 -575 967 1926 1011 -240 -623
2339f23N13J166L58p61j144j72N06Q46K86n40j014n44P89Q02J23n12j082j82Q95
$$ -623 -110 1056 1414 653 -491 -663 -157 689 975 435 -579 -1123 -334 468 591 79 -1003 -1185 -290
2358b90J107L19r26j053K5J190J443m31j128j064P19J581P43j037j363m19J053
$$ -290 817 1136 210 -843 -818 372 1815 1384 256 -808 -89 1492 2235 1198 -165 -584 469
2375D69J387l48r81o65r8O08R23o10o46q56o1P62M61L52q15j048M3O29J138r8
$$ 469 1856 1508 527 -138 -236 372 1295 685 39 -817 -878 -116 345 697 -118 -1166 -1123 -494 644 546
2395E46j108o32K70R56Q41p5j131r02N79J432O17q79j546k71J172J299j17j575
$$ 546 -562 -1194 -924 32 873 798 -333 -1235 -656 776 1393 514 -1032 -1303 -131 1168 1051 -524
2413e24p45P9J245J95m64r47k70M88K96M99mo33o08K47N55O50j05j035k68M43
$$ -524 -1269 -1190 55 250 -214 -1161 -1431 -943 -647 -148 -152 -785 -1393 -1146 -591 59 -46 -1081 -1349 -906
2433i06R86M02k83j063p12Q62J197O55q25j258k00J441P20k22j045r57N87J135
$$ -906 80 482 199 -864 -1576 -714 483 1138 313 -945 -1145 296 1016 794 -251 -1208 -621 514
2451E14O45r74q26l55O88L51L21n15l44m41J53O95M59j20j027k90K48J230M80
$$ 514 1159 185 -641 -996 -308 43 364 -151 -495 -936 -783 -88 371 251 -776 -1066 -818 412 892
2470H92q76r37m61R07J208k8j017q01K48J285Q56l98j102q95O73J181L99l67j335
$$ 892 16 -921 -1382 -475 733 705 -312 -1113 -865 420 1276 878 -224 -1119 -446 735 1134 767 -568
2489e68J75O01Q44o50k95o30L80K78K92L26m46o03k86M18M57M00o55o64j89J026
$$ -568 -393 208 1052 402 107 -523 -143 135 427 753 307 -296 -582 -164 293 693 38 -626 -815 211
2509B11P03K15j267j057N58J495M46m05j431k62J084R62J84j069p99M0Q89O67
$$ 211 914 1129 -138 -1195 -637 858 1304 899 -532 -794 290 1252 1436 367 -432 -392 497 1164
2527A164j02j114o85O32K99N59p78kk55m36P03L44r2k95j018K08R39Q12n93l66
$$ 1164 1062 -52 -737 -105 194 753 -25 -27 -282 -718 -15 329 237 -58 -1076 -868 71 883 290 -76
2547g6r32M94J259L12k64j544r3Q90J304l2j056n41K3R55Q01p17o29m97M08M42
$$ -76 -1008 -514 745 1057 793 -751 -844 46 1350 1318 262 -279 -256 699 1500 783 154 -343 65 507
2567E07M80l02r75p5L82k16M02j15q06J17R6M04N72n55o66l90Q19P25P50j156
$$ 507 987 685 -290 -365 17 -199 203 88 -718 -601 -505 -101 471 -84 -750 -1140 -321 404 1154 -2
2587bp30l47J201Q82m6j194o19Q75L58Q34p73q13j33O20N89m0o35n12r4M90N78
$$ -2 -732 -1079 122 1004 958 -236 -855 20 378 1212 439 -374 -507 113 702 662 27 -485 -579 -89 489
2608D89J75p24l05k13M07O29Qm09k03m51K57Q25J89m76p70k13J197P89k65r06
$$ 489 664 -60 -365 -578 -171 458 466 57 -146 -597 -340 485 674 198 -572 -785 412 1201 936 30
2628C0q16O65J270M18j084o71J01L68N28j41m78n12K97L80J31Pm81o50L99P6J35
$$ 30 -786 -121 1149 1567 483 -188 -87 281 809 668 190 -322 -25 355 486 493 12 -638 -239 -163 -28
2649b8P5n86k02j12K75Q92j40m00p79L30N91O25l63q88n19Q30J210j41n14j030
$$ -28 47 -539 -741 -853 -578 314 174 -226 -1005 -675 -84 541 178 -710 -1229 -399 811 670 156 -874
2669h74M64Q00N05n39p37m9N05L02J96r4o57j82j10Q16R3j44l82o02kM80O81k32
$$ -874 -410 390 895 356 -381 -430 75 377 573 479 -178 -360 -470 346 439 295 -87 -689 -691 -211 470 238
2691B38l91o46L92O06K83k64q26k98N73J042K16q77p99K78J164N82n03q15n97
$$ 238 -153 -799 -407 199 482 218 -608 -906 -333 709 925 48 -751 -473 691 1273 770 -45 -642
2710f42P44P73k63l28k42k67M26K94J07k97m68l05K60L60L67l53o62j43K79O83
$$ -642 102 875 612 284 42 -225 201 495 602 305 -163 -468 -208 152 519 166 -496 -639 -360 323
2730C23K28l42p37o9N31O14J20q38m93K40Q98Q56p77j177K4N75P83R1p35l43K80
$$ 323 551 209 -528 -597 -66 548 668 -170 -663 -423 475 1331 554 -623 -599 -24 759 850 115 -228 52
2751E2J50O52m25k81k84K19p1M10J98o95l9n27K80N01L13n33n69m72Q76P36r4
$$ 52 202 854 429 148 -136 83 12 422 620 -75 -114 -641 -361 140 453 -80 -649 -1121 -245 491 397
2772C97q73m58L02J116L15r38m18n99J088P48k64p15o72O88J53M78l66o61K6M67
$$ 397 -476 -934 -632 484 799 -139 -557 -1156 -68 680 416 -299 -971 -283 -130 348 -18 -679 -653 -186
2792a86L89l76j58k7N5k55r8O36M9o20k04k82O02P32l80r00kO12R65M6p71q04
$$ -186 203 -173 -331 -358 -303 -558 -656 -20 29 -591 -795 -1077 -475 257 -123 -1023 -1025 -413 552 598 -173 -977
2814i77J49Q49P67l98m73n55M87P55r9J67q76n6pR35k79j49k05k72J79N4M03j53
$$ -977 -828 21 788 390 -83 -638 -151 604 505 672 -204 -260 -267 668 389 240 35 -237 -58 -4 399 246
2836B46m73j14K15M14J67K6p27l74P97O94j01l47p18rP51L43j23n54k85K74R95
$$ 246 -227 -341 -126 288 455 481 -246 -620 177 871 770 423 -295 -304 447 790 667 113 -172 102 1097
2857A097J95q14q3k19J56O11j38n26m87J0K69M40j73q4k61k3l56L00L03n5o15
$$ 1097 1292 478 395 176 332 943 805 279 -208 -198 71 511 338 254 -7 -30 -386 -86 217 162 -453
2878d53k46K96N05J45o16n69K21Q78N24l78q14j61N00K82M76p83k21K7N72N31
$$ -453 -699 -403 102 247 -369 -938 -717 161 685 307 -507 -668 -168 114 590 -193 -414 -387 185 716
2898G16m24n3n63KN61L28l63k29k73Q0Q8L19j1j99j53k21L65M77r4o45m51J64
$$ 716 292 239 -324 -322 239 567 204 -25 -298 -218 -130 189 178 -21 -174 -395 -30 447 353 -292 -743 -579
2920e79R45K44l40n35k93P95N36N1o70k97J49N73N16p00j27m08N10J53L23k61
$$ -579 366 610 270 -265 -558 237 773 824 154 -143 6 579 1095 395 268 -140 370 523 846 585
2940E85l83k10L04N45P5l26l98m23N6N49j46J62k13n90J1O37L68k55q41j83O99
$$ 585 202 -8 296 841 916 590 192 -231 -175 374 228 390 177 -413 -402 235 603 348 -493 -676 23
2961B3O02L83j288k21J28O93M22k82n93k49K19M03K46l51k20qo1K50K56n9n81
$$ 23 625 1008 -280 -501 -373 320 742 460 -133 -382 -163 240 486 135 -85 -93 -154 96 352 293 -288
2982b88j52K91J19M5j20n95K7L23J34M62m06o18r9R27P5J06m82p01M46N94L38
$$ -288 -440 -149 -30 15 -105 -700 -673 -350 -216 246 -160 -778 -877 50 125 231 -251 -952 -506 88 426
3003D26m30n88n4O80L55K6m67k11O2L26K94j98l13K02k80N47L6j40k72l59J14
$$ 426 -4 -592 -646 34 389 415 -52 -263 -201 125 419 221 -92 110 -170 377 413 273 1 -358 -244
3024b44J27K04J48j20m33r5J95Q14l68k87l63J09N15M32m31o02O2M28L09k7l43
$$ -244 -117 87 235 115 -318 -413 -218 596 228 -59 -422 -313 202 634 203 -399 -337 91 400 373 30
3045C0k77j67M09N89l04m66L7q3K74K72m9m89o9N8K30J77k57m51l6l06P54M45
$$ 30 -247 -414 -5 584 280 -186 -149 -232 42 314 265 -224 -293 -235 -5 172 -85 -536 -572 -878 -124 321
3067C21l68n27R2k0L23Q7J38n83q1L98K81n6l06K2k53Q02j81m6l37j71M53J46
$$ 321 -47 -574 -482 -502 -179 -92 46 -537 -618 -220 61 5 -301 -279 -532 270 89 43 -294 -465 -12 134
3089A34j34R4l05Q4m5J53K89K00o14l66K73J74J32mo22J40L00J05K23j82o14K11
$$ 134 0 94 -211 -127 -172 -19 270 470 -144 -510 -237 -63 69 65 -557 -417 -117 -12 211 29 -585 -374
3111c74K91M75k0l67m84J95P43n8j86j96p1L13K31J16o54j27K74J32K24l40J13
$$ -374 -83 392 372 5 -479 -284 459 401 215 19 -52 261 492 608 -46 -173 101 233 457 117 230
3132B30l9k34R1K97j3r7l16r6J60L99l50p8n62L30L84R1j6p16M96j17N01Q4l34
$$ 230 191 -43 48 345 332 235 -81 -177 -17 382 32 -46 -608 -278 106 197 181 -535 -39 -156 345 429 95
3155I5n42L18J63L12L1k75k58J97J73l5J54j93l67J35J70Q3J2m49j12K30J95J37
$$ 95 -447 -129 34 346 377 102 -156 41 214 179 333 140 -227 -92 78 161 173 -276 -388 -158 37 174
3177A74n7m71j87J51M46R4o56K94k74Q8N16n3k77M8k50N6N77j03k91l18L04L91
$$ 174 117 -354 -541 -390 56 150 -506 -212 -486 -398 118 65 -212 -164 -414 -358 219 116 -175 -493 -189 202
3199B02K2j31k75p5J25L00k24r5K01l26J49J6r1K87p8o07P0O00Q7l94j39R6n1
$$ 202 224 93 -182 -257 -132 168 -56 -151 50 -276 -127 -111 -202 85 7 -600 -530 70 157 -237 -376 -280 -331
3222c31P60l15k10n42L72L26J04k16O4k82j58K82M39K08m60k44K27K38J43k92
$$ -331 429 114 -96 -638 -266 60 164 -52 12 -270 -428 -146 293 501 41 -203 24 262 405 113
3242A13l16L61m37P13m01j69k01j6J71N17n71R9J58l50M54J50o9j40l61k8K06
$$ 113 -203 158 -279 434 33 -136 -337 -353 -182 335 -236 -137 21 -329 125 275 206 66 -295 -323 -117
3263a17K41J85o68K58K62R6J23k40k20M7L27K01o3k34j59l62N68L83o7o24k14
$$ -117 124 309 -359 -101 161 257 380 140 -80 -33 294 495 432 198 39 -323 245 628 561 -63 -277
3284b77N8O82j49J17m41q7M6M9M07l69j08k45J25K65J42l61l87q6J052p7k59j70
$$ -277 -219 463 314 431 -10 -97 -51 -2 405 36 -72 -317 -192 73 215 -146 -533 -619 433 356 97 -73
3306g3o6K05l0K07P5p25O18m12L79J64k0k18j85j54M46J3n9m68N3L22j32L72m38
$$ -73 -139 66 36 243 318 -407 211 -201 178 342 322 104 -81 -235 211 224 165 -303 -250 72 -60 312 -126
3329a26j92j33p1L10J82l81K61j30j6M38P6m15M2J24K93j09J57m43J46K04K03
$$ -126 -318 -451 -522 -212 -30 -411 -150 -280 -296 142 218 -197 -155 -31 262 153 310 -133 13 217 420
3350D20j97j13J02l01L50J6o6l89J71j92P8N4K79j14l08J11J74J29P7k62n35J17
$$ 420 223 110 212 -89 261 277 211 -178 -7 -199 -121 -67 212 98 -210 -99 75 204 281 19 -516 -399
3372c99N06N6K48n87j37L11L07j64j25r1j49L20j6o0j98L01j14j05Q8K80j88l44
$$ -399 107 163 411 -176 -313 -2 305 141 16 -75 -224 96 80 20 -178 123 9 -96 -8 272 84 -260
3394b60J02QL16j79j00m79L27K20l5J06l45k46n9K07K59J80l78l7K24M5L03o04
$$ -260 -158 -150 166 -13 -113 -592 -265 -45 -80 26 -319 -565 -624 -417 -158 22 -356 -393 -169 -124 179 -425
3416d25k9J64J3L32l6R7k54j35m8K83J35k81j24M5o3O24k73n9o1l41O03k74k9
$$ -425 -454 -290 -277 55 19 116 -138 -273 -321 -38 97 -184 -308 -263 -326 298 25 -34 -95 -436 167 -107 -136
3439a36p8j01J8K32L2Q0j1l85J95M3K23K37l75m1K33L42l78j30j05J60K16j00
$$ -136 -214 -315 -297 -65 -33 47 36 -349 -154 -111 112 349 -26 -67 166 508 130 0 -105 55 271 171
3461A71K28l71J27p4L51j00m13J68L04o2l69O66n30k35o0L26M19j87j67p8J88
$$ 171 399 28 155 81 432 332 -81 87 391 329 -40 626 96 -139 -199 127 546 359 192 114 302
3482C02J42m3k7O6l44j12K12K91k08M8p8j17L08o7l7j35K08j9L73l48k63J52k26
$$ 302 444 401 374 440 96 -16 196 487 279 327 249 132 440 373 336 201 409 390 763 415 152 304 78
3505G8L14n8J26j2m00k52M69m4o0j13p1j65L72J17p1k96k97J58L37R7k04L12n31
$$ 78 392 334 460 448 48 -204 265 221 161 48 -23 -188 184 301 230 -66 -363 -205 132 229 25 337 -194
3528a94J23K73j19J47k21r6L24k97K93k61Q6L6k29J09L51k06n29M60N5L4l02K26
$$ -194 -71 202 83 230 9 -87 237 -60 233 -28 58 94 -135 -26 325 119 -410 50 105 139 -163 63
3550F3m17O9JM62m18r0j2k88M62N2p3N6J02m60L12J69J57l22j34J07M16l38j32
$$ 63 -354 -285 -284 178 -240 -330 -342 -630 -168 -116 -189 -133 -31 -491 -179 -10 147 -175 -309 -202 214 -124 -256
3573b56J34L68j58q0L19k69j42M2K44k30K60k08q0L5J27l4j35J29n5kN2K7q8j36
$$ -256 -122 246 88 8 327 58 -84 -42 202 -28 232 24 -56 -21 106 72 -63 66 11 9 61 88 0 -136
3597a36j02L90j80j88M28l39J24j07K18N7l62o2L83Q2m61M25l89O4j3J79O5k75
$$ -136 -238 152 -28 -216 212 -127 -3 -110 108 165 -197 -259 124 206 -255 170 -219 -155 -168 11 76 -199
3619a99p7Q3J30J0l6k10J15M0LJ54l96m8J92P8J66Kj65m95K61Q5J93j18L3P1k09
$$ -199 -276 -193 -63 -53 -89 -299 -184 -144 -141 13 -383 -431 -239 -161 5 7 -158 -653 -392 -307 -114 -232 -199 -128 -337
3644c37J90K2J21R0o20M31J24J92k00j56J28l39M86J07k10k37K24p2J65q2j81
$$ -337 -147 -125 -4 86 -534 -103 21 213 13 -143 -15 -354 132 239 29 -208 16 -56 109 27 -154
3665a54j46L9J69J61J9l37J69r7O8J59Q5p6m86J42M27o2n0j60N6L03j24J82l6
$$ -154 -300 -261 -92 69 88 -249 -80 -177 -109 50 135 59 -427 -285 142 80 30 -130 -74 229 105 287 251
3688B51l02L01P2k15jM7k70l9j8L02Q4l79K84m73K51J94J00n9l09J36j35L91k67
$$ 251 -51 250 322 107 106 153 -117 -156 -174 128 212 -167 117 -356 -105 89 189 130 -179 -43 -178 213 -54
3711e4k01J67L10m24K15j00m8l44L82R7j84J98K69j68n75M12J51M3j77l37K83
$$ -54 -255 -88 222 -202 13 -87 -135 -479 -97 0 -184 14 283 115 -460 -48 103 146 -31 -368 -85
3732h5k5K55Ok33J6n2j22K85k12k15N4J55K38m5o4J34l33K61Q8k17o4n7K32R1
$$ -85 -110 145 151 -82 -66 -118 -240 45 -167 -382 -328 -173 65 20 -44 90 -243 18 106 -111 -175 -232 0 91
3756I1R1l25j98K34j63M46p1k80Ql1k0L14Qn4j10O4l4j46K87m43J45O9k21K21
$$ 91 182 -143 -341 -107 -270 176 105 -175 -167 -198 -218 96 104 50 -60 4 -30 -176 111 -332 -187 -118 -339 -118
3780a18L47k37j60j63N81k12j4k24K32j02O9J75m41J41K63k68K61J51k22j37J63
$$ -118 229 -8 -168 -331 250 38 24 -200 32 -70 -1 174 -267 -126 137 -131 130 281 59 -78 85
3801H5J1j61J89j24M7j23L2N5K23k82o3J74O3n5k37M71m68L01j72Q5j56j25K94
$$ 85 96 -65 124 0 47 -76 -44 11 234 -48 -111 63 126 71 -166 305 -163 138 -34 51 -105 -230 64
3824F4K7l43P8R8L7q9J45l3K90q6j52O0j52J28O5r1J11j58L6RJ01N3L6j15J94
$$ 64 91 -252 -174 -76 -39 -128 17 -16 274 188 36 96 -56 72 137 46 157 -1 35 44 145 198 234 119 313
3849C13j80J4m36J69J70N3K40l53J7r9L94j82r4N3k94M43k86L75l63J49k68M26
$$ 313 133 147 -289 -120 50 103 343 -10 7 -92 302 120 26 79 -215 228 -58 317 -46 103 -165 261
3871B61Qk05L6p2j06M34j50j2l3l3J64l23K60O7k3l64J83M9OO0k30l08K49K83
$$ 261 269 64 100 28 -78 356 206 194 161 128 292 -31 229 296 273 -91 92 141 147 207 -23 -331 -82 201
3895B01m5j85j47j17N56o7k57J69m03J51J87O2l6L7k57L02K4o0O2J94j25r3m7
$$ 201 156 -29 -176 -293 263 196 -61 108 -295 -144 43 105 69 106 -151 151 175 115 177 371 246 153 106
3918A06J2L0k21Q7l05M44o0P5l25J26J04M9k10J14j04j53K92j83J91q3j47M2j25
$$ 106 118 148 -73 14 -291 153 93 168 -157 -31 73 122 -88 26 -78 -231 61 -122 69 -14 -161 -119 -244
3941b44K34j2K3R3j11j76O7J7j51M64n65N58m03K58j74nJ56N9k52J31J2k13L53
$$ -244 -10 -22 1 94 -17 -193 -126 -109 -260 204 -361 197 -206 52 -122 -127 29 88 -164 -33 -21 -234 119
3964A19q1j16m0k47K11J22K92k23j51J26j28L32l69k0L54m80L88l51N14j65nj24
$$ 119 38 -78 -118 -365 -154 -32 260 37 -114 12 -116 216 -153 -173 181 -299 89 -262 252 87 82 -42
3986d2J63l41L79L8m85J53J0J51k30K82M6k46L9J94q4p3k31j96M56PL0j24O8L17
$$ -42 121 -220 159 197 -288 -135 -125 26 -204 78 124 -122 -83 111 27 -46 -277 -473 -17 -10 20 -104 -36 281
4010B81l70L60J99m99j91K20o9j6r3j5K72P7L8k44O4r4j74M59j4k4m1k08p0J02
$$ 281 -89 271 470 -29 -220 0 -69 -85 -178 -193 79 156 194 -50 14 -80 -254 205 191 167 126 -82 -152 -50
4034e0j65J47k8J68M4j01p4K61l54J60j83j20M68q2j60j02p8K49j24J68k39K51
$$ -50 -215 -68 -96 72 116 15 -59 202 -152 8 -175 -295 173 91 -69 -171 -249 0 -124 44 -195 56
4056E6j6l30M34l20J54k6r3K43l8j59P6J06j81N2K6k32J91j26L01p4k50L16k03
$$ 56 40 -290 144 -176 -22 -48 -141 102 64 -95 -19 87 -94 -42 -16 -248 -57 -183 118 44 -206 110 -93
4079i3J35QJ81j59j84J82l5R3k43J14J70k41J97k31j81K99n3K85m7J8j66j90J78
$$ -93 42 50 231 72 -112 70 35 128 -115 -1 169 -72 125 -106 -287 12 -41 244 197 215 49 -141 37
4102C7o3K07lk06k59J84J04J64l7Nk31K98j83K6N2l18K35j46K15k6j32J59l9%
$$ 37 -26 181 178 -28 -287 -103 1 165 128 133 -98 200 17 43 95 -223 12 -134 81 55 -77 82 43 43
4126D3j2L2q1k13Q06n45K17l68J9j92K8M89k08M0m1J94m84M60m5j59J0L2j66L70
$$ 43 31 63 -18 -231 575 30 247 -121 -102 -294 -266 223 15 55 14 208 -276 184 139 -20 -10 22 -144 226
4150B26P7j16k03j28R2K7K03j92K54k40m5J2L1J66k5m37J10M04Rk40l20L80p5
$$ 226 303 187 -16 -144 -52 -25 178 -14 240 0 -45 -33 -2 164 139 -298 -188 216 225 -15 -335 45 -30
4173c0K19k4J59l39m03K20K23k59J56j52%j2P5K90m4k76o1K11K32n39J68J99J3
$$ -30 189 165 324 -15 -418 -198 25 -234 -78 -230 -230 -242 -167 123 79 -197 -258 -47 185 -354 -186 13 26
4196B6LJ53j90j6k09O2L26m79L7K84J12Kk13J31j14j66K79q7R0j92P9m06L89J06
$$ 26 29 182 -8 -24 -233 -171 155 -324 -287 -3 109 111 -102 29 -85 -251 28 -59 31 -161 -82 -488 -99 7
4220Gpl13J3L44L9m8j21rm2r5KL08K5J6j68J79n1l08K57L4j55r8K82q3K11m49
$$ 7 0 -313 -300 44 83 35 -86 -95 -137 -232 -230 78 103 119 -49 130 79 -229 28 62 -93 -191 91 8 219 -230
4246b30L0J8J86Km1k31K84k53L68O8o6k25j40J83K62j84j79J27k33N09l89J54
$$ -230 -200 -182 4 6 -35 -266 18 -235 133 201 135 -90 -230 -47 215 31 -148 -21 -254 255 -134 20
4268B0o5q0j22K26J79p3r2l0O4j60L3k6J55l30J25L52l23J07J16n6o1K26l06r0
$$ 20 -45 -125 -247 -21 158 85 -7 -37 27 -133 -100 -126 29 -301 -176 176 -147 -40 76 20 -41 185 -121 -211
4292b11K62L1Oj47K88k4j30k92p2M16l68J15L57j40q1k01J36J31k06Q0R1J48q6
$$ -211 51 82 88 -59 229 205 75 -217 -289 127 -241 -126 231 91 10 -191 -55 76 -130 -50 41 189 103
4315A03q2k91L56j69k44L76J36l45jM56l42L33r1j86k23K25L9k99K97j74J75K8
$$ 103 21 -270 86 -83 -327 49 185 -160 -161 295 -47 286 195 9 -214 11 50 -249 48 -126 49 77
4337G7K08l22qo4L05k66L72l18Q7j87J68K40k79p5j4j26J41L8P8k02K56l5K19
$$ 77 285 -37 -45 -109 196 -70 302 -16 71 -116 52 292 13 -62 -76 -202 -61 -23 55 -147 109 74 293
4360B93l75k6L6j7L81j3m35K1J90l8J03l07J83l4Q7P8jk14L1L06j10j90P2r5J34
$$ 293 -82 -108 -72 -89 292 279 -156 -135 55 17 120 -187 -4 -38 49 127 126 -88 -57 249 139 -51 21 -74 60
4385F0k7ln7K00j68J69l71M35j2l54m8j66K34j18J56k50K81K59l44N3L51k85J38
$$ 60 33 30 -27 173 5 174 -197 238 226 -128 -176 -342 -108 -226 -70 -320 -39 220 -124 -71 280 -5 133
4408A33k46K07m55M30p8j4K32k15r9J37lj37L23k32L8k25l1J49L28j86L2q0o8
$$ 133 -113 94 -361 69 -9 -23 209 -6 -105 32 29 -108 215 -17 21 -204 -235 -86 242 56 88 8 -60
4431f0k54N89n6o6j63o9j4L78m30J81J54m0l84L27l6l2L09m68NK06L4k36M2n3
$$ -60 -314 275 219 153 -10 -79 -93 285 -145 36 190 150 -234 93 57 25 334 -134 -129 77 111 -125 -83 -136
4455a36M14J1j15j28j98L53k02Ln5K6j20K0J63J05k80N5Q6q8J1M4M3j97J58Q0
$$ -136 278 289 174 46 -152 201 -1 2 -53 -27 -147 -127 36 141 -139 -84 2 -86 -75 -31 12 -185 -27 53
4479E3K06l06J0P5Jj81L42M0k01k13O1K0M08k38j50p6K39m6k47K5J38Q2o0k5L02
$$ 53 259 -47 -37 38 39 -142 200 240 39 -174 -113 -93 315 77 -73 -149 90 44 -203 -178 -40 42 -18 -43 259
4504B59l27J61J95l03J0o5K20q8Q5j42K62Q2l47K49l28m7J14K82j36k0l88J68
$$ 259 -68 93 288 -15 -5 -70 150 62 147 5 267 349 2 251 -77 -124 -10 272 136 116 -272 -104
4526a04J34k45K20r7q9J97J55j57j41J17j08J13j13L23n56J72JK76l34P7K34k83
$$ -104 30 -215 5 -92 -181 16 171 14 -127 -10 -118 -5 -118 205 -351 -179 -178 98 -236 -159 75 -208
4548b08J63J42q1q2P8m3M5j24K66k87J53j17J97j17k08K95K6p6j66L4J39j42k10
$$ -208 -45 97 16 -66 12 -31 14 -110 156 -131 22 -95 102 -15 -223 72 98 22 -144 -110 29 -113 -323
4571c23L74p29L61L28J6J23k43k5L87N5l11j66J3M1R4K06k81j13P3M43m56l8p3
$$ -323 51 -678 -317 11 27 150 -93 -118 269 324 13 -153 -140 -99 -5 201 -80 -193 -120 323 -133 -171 -244
4594b44L26L83n27K10j8n60M60l7j93M46j7k88Q2rq6J11j42J42R3j47j90L2L5
$$ -244 82 465 -62 148 130 -430 30 -7 -200 246 229 -59 23 14 -72 39 -103 39 132 -15 -205 -173 -138
4617a38J24r9Q3J51k69K30j25m6K94K6l4p3P8mj71k2J50k28J11n0n7K07j60Q2
$$ -138 -14 -113 -30 121 -148 82 -43 -89 205 231 197 124 202 198 27 5 155 -73 38 -12 -69 138 -22 60
4641F0j78K03L10j59l35J76j28N1L33l84J6k49L35k39K61l01J03j10J70J07j17
$$ 60 -118 85 395 236 -99 77 -51 0 333 -51 -35 -284 51 -188 73 -228 -125 -235 -65 42 -75
4662g5j9q9J65J94j86k02K47J54j47K4j15J3J84k17J89m7J11m02K78q1K7j8p7
$$ -75 -94 -183 -18 176 -10 -212 35 189 42 66 -49 -36 148 -69 120 73 184 -218 60 -21 6 -12 -89
4685h9K53j61k83P1J26j80J96J76j83K70k09m2K47o8n1l03R3J06j50K31L9j70
$$ -89 164 3 -280 -209 -83 -263 -67 109 -74 196 -13 -55 192 124 73 -230 -137 -31 -181 50 89 -81
4707h1J45j82r1J50j1J72l11N5L1N9J37j38Q7r8J28j3K2K24lj16j72q8N8J94L6
$$ -81 64 -118 -209 -59 -70 102 -209 -154 -123 -64 73 -65 22 -76 52 39 61 285 282 166 -6 -94 -36 158 194
4732A94l68P5K41q4R2l10q7K22R1k04N7K42r2j88O2M0M0J06n0J57L9l09K47K55
$$ 194 -174 -99 142 58 150 -160 -247 -25 66 -138 -81 161 69 -119 -57 -17 23 129 79 236 275 -34 213 468
4756D68n89K67l3J12m84K40j94J96J9k79JK56n8r7L45l05K55L7j91k51J95L02
$$ 468 -121 146 113 225 -259 -19 -213 -17 2 -277 -276 -20 -78 -175 170 -135 120 157 -34 -285 -90 212
4778B12r9j15K11j55O0k54N0K44K09o04L72j03m8K13m46J48J80l70J49P9j67k05
$$ 212 113 -2 209 54 114 -140 -90 154 363 -241 131 28 -20 193 -253 -105 75 -295 -146 -67 -234 -439
4800d39M40J8j62o9K49R0j77O8J20r0J63j71q4J39l08N62k78k48J67o8j56L71
$$ -439 1 19 -143 -212 37 127 -50 18 138 48 211 40 -44 95 -213 349 71 -177 -10 -78 -234 137
4822A37r8k7m7N1l86K34qJ09J63r0J53o8j08J9n5LK21k76J79l19K63M81n74j76
$$ 137 39 12 -35 16 -370 -136 -144 -35 128 38 191 123 15 34 -21 -18 203 -73 106 -213 50 531 -43 -219
4846b19J94jj30K27j32J56K06N1m27j92K98J20J57k59J2N9p8l04N15j95J8k13
$$ -219 -25 -26 -156 71 -61 95 301 352 -75 -267 31 151 308 49 61 120 42 -262 253 58 76 -137
4868a37K02r0J20k39J56O7j46Kp6jJ89k07J10q3L00m57L19Ok70K53L2jk05L05
$$ -137 65 -25 95 -144 12 79 -67 -65 -141 -142 47 -160 -50 -133 167 -290 29 35 -235 18 50 49 -156 149
4892A49l11J21P6l66L10k1m8j8j15K22j66K36j48O6j00j41K99k84J82j06N4N4
$$ 149 -162 -41 35 -331 -21 -42 -90 -108 -223 -1 -167 69 -79 -13 -113 -254 45 -239 -57 -163 -109 -55
4914e5j6l2J82k58J25O7K9N0j1J05qk90K63l0j10r0q8L26J99m34O1k26J29R1J60
$$ -55 -71 -103 79 -179 -54 13 42 92 81 186 178 -112 151 121 11 -79 -167 159 358 -76 -15 -241 -112 -21 139
4939A39P9k72R7q1q3K7K61m23J77J78l01M21j59N2j0n4rp4J00q8J29j16j9M9J28
$$ 139 218 -54 43 -38 -121 -94 167 -256 -79 99 -202 219 60 112 102 48 39 -35 65 -23 106 -10 -29 20 148
4964A48j71j19L73n18L48l9k16K00Q4J04k02L02l68k1L37m39L50j2l58Q2K80j72
$$ 148 -23 -142 231 -287 61 22 -194 6 90 194 -8 294 -74 -95 242 -197 153 141 -217 -135 145 -27
4986b7m2K2K22j96k48K43L13j44k26K96j86p3n8J58j13K90N2k16o1J93m59N28
$$ -27 -69 -47 175 -21 -269 -26 287 143 -83 213 27 -46 -104 54 -59 231 283 67 6 199 -260 268
5008B68j13j29l02p5K21K57j55j59L64J34j39j07j43J4K93K2p6l04MK13k09L75
$$ 268 155 26 -276 -351 -130 127 -28 -187 177 311 172 65 -78 -64 229 251 175 -129 -125 88 -121 254
5030B54m32M78j04l43l7O7J35J75r9L55l76L4%Q8l88L85J20k16K3p7j26K41m8
$$ 254 -178 300 196 -147 -184 -117 18 193 94 449 73 107 107 195 -193 192 312 96 119 42 -84 157 109
5053A09p7L4j1O6j05L19l22P5k23K80l36r9K99Lk40J40J7l8P8M04k22k83o3P4
$$ 109 32 66 55 121 16 335 13 88 -135 145 -191 -290 9 12 -228 -88 -71 -109 -31 373 151 -132 -195 -121
5077a21J51j19J64J0j68P3J04J32l66j3L5K07J03l56L56J00j56J86j71j07J20
$$ -121 30 -89 75 85 -83 -10 94 226 -140 -153 -118 89 192 -164 192 292 136 322 151 44 164
5098A64J27l14q4M8L45l53J19R8o36L73kJ37J31j05L3N5O2k37j49K16k51J99j08
$$ 164 291 -23 -107 -59 286 -67 52 150 -486 -113 -115 22 153 48 81 136 198 -39 -188 28 -223 -24 -132
5121a32k3O7K46l63J05K18j82R8l73Q3J35P7P6k44L02j73J65j59j7J70q2j02p9
$$ -132 -155 -88 158 -205 -100 118 -64 34 -339 -256 -121 -44 32 -212 90 -83 82 -77 -94 76 -6 -108 -187
5144a87M01l30jk22L22j6k63K8K20Q8l63J85L65j47R4j71Q4J11k55K11J4j95R7
$$ -187 214 -116 -117 -339 -17 -33 -296 -268 -48 40 -323 -138 227 80 174 3 87 198 -57 154 168 -27 70
5167G0q7J73o0r3j1m3l14M92k80J35pj10L26l66K50m04M12k52M86k76j5o6j49
$$ 70 -17 156 96 3 -8 -51 -365 127 -153 -18 -25 -135 191 -175 75 -329 83 -169 317 41 26 -40 -189
5190a89K07M8O4l90K93j8r9p7J4L80k51O5j95J50R3m8J88k25j34q8J92o9N4L82
$$ -189 18 66 130 -260 33 15 -84 -161 -147 233 -18 47 -148 2 95 47 235 10 -124 -212 -20 -89 -35 347
5214C47m94K96O0n5j23J91j64l27K61N0J67J9k03k4JN6j37K6O8K1P1l7K6J17n15
$$ 347 -147 149 209 154 31 222 58 -269 -8 42 209 228 25 1 2 58 -79 -53 15 36 107 70 96 213 -302
5239c02J30O9M5J23k86K77J86p1Rl09J65o6m1J0K83l76J86j37K81j75j8Kl9KJ37
$$ -302 -172 -103 -58 65 -221 56 242 171 180 -129 36 -30 -71 -61 222 -154 32 -105 176 1 -17 -15 -54 -52 85
5264H5J7m9P0k05K18l2p2o8p1j03J20l9K8j6J62PO8l94L22j20J23q5K80j40P7
$$ 85 102 53 123 -82 136 104 32 -36 -107 -210 -90 -129 -101 -117 45 52 120 -274 48 -72 51 -34 246 106 183
5289A83k71K01J43j31l9k53R4j55J76J2k42L07r6l35N16m9j84O5R1n5J97O5J12
$$ 183 -88 113 256 125 86 -167 -73 -228 -52 -40 -282 25 -71 -406 110 61 -123 -58 33 -22 175 240 352
5312C52m25j93N99k62j47J50j82p5J01mK7J30q0M4k05Q4J35n6j42j12O34p39L01
$$ 352 -73 -266 333 71 -76 74 -108 -183 -82 -86 -59 71 -9 35 -170 -86 49 -7 -149 -261 373 -366 -65
5335f5R4N6k10M10m34J50r8j65K32p6N2K08k7O8p4m8J92k50M4r1o0k1J15j02J71
$$ -65 29 85 -125 285 -149 1 -97 -262 -30 -106 -54 154 127 195 121 73 265 15 59 -32 -92 -113 2 -100 71
5360G1K20k43k33q3R8R9J47j36K82m10K26nQ0J70l34L88k16j35j05J37o5m7k2
$$ 71 291 48 -185 -268 -170 -71 76 -60 222 -188 38 33 113 283 -51 337 121 -14 -119 18 -47 -94 -116
5383a16P1k7K35l1K9R9m41K03O6j21O3j12L2P6k73K79j79k7M16r5k64J35M5m02
$$ -116 -45 -72 163 132 161 260 -181 22 88 -33 30 -82 -50 26 -247 32 -147 -174 242 147 -117 18 63 -339
5407c39J74O8L96l33J1P9j10J64p0J80k79j22L20r2j12J79j63K2j63K95j71R1
$$ -339 -165 -97 299 -34 -23 56 -54 110 40 220 -59 -181 139 47 -65 114 -49 -27 -190 105 -66 25
5429B5j3P2j09j78M12k99l4L47j35M3m14K55k73M76n2j6j26J8k80M1J07L65n8
$$ 25 12 84 -25 -203 209 -90 -124 223 88 131 -283 -28 -301 175 123 107 -19 -1 -281 -240 -133 232 174
5452A74l11J79m0m4q4J5q6K14L72l97o4J61j09N2k53L33k3r5j60L08m5j34r8k1
$$ 174 -137 42 2 -42 -126 -111 -197 17 389 -8 -72 89 -20 32 -221 112 89 -6 -166 142 97 -37 -135 -156
5476a56k9K96k53L15k01p8LRL1q4R3r7N4N4J3Jq4j93O7K2L28k21j77L89j34j85
$$ -156 -185 111 -142 173 -28 -106 -103 -94 -63 -147 -54 -151 -97 -43 -30 -29 -113 -306 -239 -217 111 -110 -287 102 -32 -217
5502b17J23N3K3o5R9J8L37k60k8j06j79M28J1r0J4l8j77J28N7j66j00M6J4K7J24
$$ -217 -94 -41 -18 -83 16 34 371 111 83 -23 -202 226 237 147 161 123 -54 74 131 -35 -135 -89 -75 -48 76
5527G6j54K20k73j84J67j35O49k03l73M10j48j56N6L26j40Q3j83m37J97K27j11
$$ 76 -78 142 -131 -315 -148 -283 366 163 -210 200 52 -104 -48 278 138 221 38 -399 -202 25 -86
5548h6j10J51K14l74J48K54r4p6k89K97j41l8J95j7m01K83j0o7L58k63k49O62
$$ -86 -196 -45 169 -205 -57 197 103 27 -262 35 -106 -144 51 34 -367 -84 -94 -161 197 -66 -315 347
5570C47l74p0J00q4R8J69k71L50j12k46j52K77k35n8J45J30R4j73J85J86j64j85
$$ 347 -27 -97 3 -81 17 186 -85 265 153 -93 -245 32 -203 -261 -116 14 108 -65 120 306 142 -43
5592d3k74K30P0Q6j62K91j70J15r0J7L09k27j92R9j55Q1Q2m50K77K7J30l54L65
$$ -43 -317 -87 -17 69 -93 198 28 143 53 70 379 152 -40 59 -96 -15 67 -383 -106 -79 51 -303 62
5615F2J46n3j48n6j08K36k88M3J79M9J21j90M4N5J5J18j88j4k33K27J28L5l58
$$ 62 208 155 7 -49 -157 79 -209 -166 13 62 183 -7 37 92 107 225 37 23 -210 17 145 180 -178
5638a78L46K37m87J61l0RJ64p3j89N5M3q7R6k19N1k24L48l9R0k54K98J6l49L65
$$ -178 168 405 -82 79 49 58 222 149 -40 15 58 -29 67 -152 -101 -325 23 -16 74 -180 118 134 -215 150
5662A50k15J82j01o0Qn6j03J47J28j61k2J45j6l96K11J10j22O4K00j31M70k23
$$ 150 -65 117 16 -44 -36 -92 -195 -48 80 -81 -103 42 26 -370 -159 -49 -171 -107 93 -38 432 209
5684B09k15l7lK23J40k9k65k21k3m8L18K9l9Q4j83Rn1Q9m9K44l02J00j1J06R8
$$ 209 -6 -43 -46 177 317 288 23 -198 -221 -269 49 78 39 123 -60 -51 -102 -13 -62 182 -120 -20 -31 75 173
5709A73k68J05K04k71N6k1j08J05J88l87J02rk05M52Q3l69M15j86l03L74m61J47
$$ 173 -95 10 214 -57 -1 -22 -130 -25 163 -224 -122 -131 -336 116 199 -170 245 59 -244 130 -331 -184
5731a84M8r9M36j26N4L84k24k29n6K09j88J64l5K24j68m6r7k60J52l1O0J55l50
$$ -184 -136 -235 201 75 129 513 289 60 4 213 25 189 154 378 210 164 67 -193 -41 -72 -12 143 -207
5754b07K22NM0N4q3q3k54K37M35n03p6K96k40j64N02l77J55K06K7j46k05K97k11
$$ -207 15 20 60 114 31 -52 -306 -69 366 -137 -213 83 -157 -321 181 -196 -41 165 192 46 -159 138 -73
5777g3N3L6L18l19o6j23L8J27p9J19k4%P5k99L07j01L70o59P08j93k61K9j23j0
$$ -73 -20 16 334 15 -51 -174 -136 -9 -88 31 7 7 82 -217 90 -11 359 -300 408 215 -46 -17 -140 -150
5801a50K03J16k3j15o9n4L94o6k81P6m3p0L4j64L04j41q5K16MPK22m38L29j26
$$ -150 53 169 146 31 -38 -92 302 236 -45 31 -12 -82 -48 -212 92 -49 -134 82 86 93 315 -123 206 80
5825H0j16J56j54J7j20J46l22K62M0N9n8m6J0k10K52N6k49L14k41K04l91K50K29
$$ 80 -36 120 -34 -17 -137 9 -313 -51 -11 48 -10 -56 -46 -256 -4 52 -197 117 -124 80 -311 -61 168
5848A68k4j88Q2pk3r0P6M09n10k14K36O8J80m27L36j14N2K77k92J22k29J12Q7
$$ 168 144 -44 38 31 8 -82 -6 403 -107 -321 -85 -17 163 -264 72 -42 10 287 -5 117 -112 0 87
5871H7N8M3l7ko8O1Q9r6j06L8J30j83ol6j80L68k14Qp0J69M4J42l07Mn4P5j7J79
$$ 87 145 188 151 149 81 142 231 135 29 67 197 14 8 -28 -208 160 -54 -46 -116 53 97 239 -68 -64 -118 -43 -60 119
5899A19j56J1J53k22j08J39K0Q4R4l43J63J20o8K64m92L74j09J27j89O6J26j33
$$ 119 -37 -26 127 -95 -203 -64 -44 40 134 -209 -46 74 6 270 -222 152 43 170 -19 47 173 40
5921D0%l6p0J17j46L65q9j30j41O0j29J74mj20K49j14j74J13j17R7q9j47J85j06
$$ 40 40 4 -66 51 -95 270 181 51 -90 -30 -159 15 11 -109 140 26 -148 -35 -152 -55 -144 -291 -106 -212
5945b12J61J56p9j30K7j46Q7L23j47j13J30j28L3J21k02n7rJ65K26m20K60k47
$$ -212 -51 105 26 -104 -77 -223 -136 187 40 -73 57 -71 -38 83 -119 -176 -185 -20 206 -214 46 -201
5967b01J15qm4J61k74J80K31m6p1j0k13P8J89k03M07j39l39L08k02r3L65m48L34
$$ -201 -86 -94 -138 23 -251 -71 160 114 43 33 -180 -102 87 -116 291 152 -187 121 -81 -174 191 -257 77
5990G7l07j01L21p0J67J1k44KK04j05r1o6O6K54k1K47l29j53J29l61L88K00J07
$$ 77 -230 -331 -10 -80 87 98 -146 -144 60 -45 -136 -202 -136 118 97 344 15 -138 -9 -370 18 218 325
6013C25l49k05K75J67l70J82k02j07K75q8j17k5K08k8M1n6J57n7K22l34O2k0q7
$$ 325 -24 -229 46 213 -157 25 -177 -284 -9 -97 -214 -239 -31 -59 -18 -74 83 26 248 -86 -24 -44 -131
6036a31M03l00R9j66L38J20k72J08m07J77J21j48J52j43O9k28OL42l8P5k08j60
$$ -131 272 -28 71 -95 243 363 91 199 -208 -31 90 -58 94 -49 20 -208 -202 140 102 177 -31 -191
6058a91J69L9o8J12n4L08m02K59k40R7k45N23j38K7j46j57j02L21M0l2q1J45j4
$$ -191 -22 17 -51 61 7 315 -87 172 -68 29 -216 307 169 196 50 -107 -209 112 152 120 39 184 170
6081A70l48K56j18l77K68K97k5o1J48j44l8l75M69k87j12K94j07L86k76k8J87
$$ 170 -178 78 -40 -417 -149 148 123 62 210 66 28 -347 122 -165 -277 17 -90 296 20 -8 179
6102A79l21K9J44j32J65k85Q9J26K34j05M8j13m65N40l36O22n28k01L82j43Q8
$$ 179 -142 -113 31 -101 64 -221 -132 -6 228 123 171 58 -407 133 -203 419 -109 -310 72 -71 17
6123A7k74K81K2k73NJ52l60M45kj31N8J73m15L86N3J16n3k88L21p4K0m45R6j95
$$ 17 -257 24 46 -227 -222 -70 -430 15 13 -118 -60 113 -302 84 137 253 200 -88 233 159 179 -266 -170 -365
6147c65M13o8L9j40L3M65j50j95K14l94m3R2M2K58j93L7k34L17m09L99K0l14J74
$$ -365 48 -20 19 -121 -88 377 227 32 246 -148 -191 -99 -57 201 8 45 -189 128 -281 118 138 -176 -2
6170bJ88j8k97K81R7k11r8j37K55L2k80J27J85k05j6n7J21j64K37k3j93L85k33
$$ -2 186 168 -129 152 249 38 -60 -197 58 90 -190 -63 122 -83 -99 -156 -35 -199 38 15 -178 207 -26
6193b6j0k67M22j83K67l0j23L2j71J6J80j99jj07J68R7O3k11J69k31L14%O5m31
$$ -26 -36 -303 119 -64 203 173 50 82 -89 -73 107 -92 -93 -200 -32 65 128 -83 86 -145 169 169 234 -197
6217a97J28R7j66K06J03J6k29K37k31J78j72K56o8N9k90J9O5p2N7k4J81n1k07
$$ -197 -69 28 -138 68 171 187 -42 195 -36 142 -30 226 158 217 -73 -54 11 -61 -4 -28 153 102 -105
6240a05K47K08j30l68R0j93J22k6q7J0K27j74K78j03j50L10k94R3r2M5m1J06K32
$$ -105 142 350 220 -148 -58 -251 -129 -155 -242 -232 -5 -179 99 -4 -154 156 -138 -45 -137 -92 -133 -27 205
6263B05l06J65l36J45J26L0K17k27P9J84J18m40K1L1k60J21L83l29K7O8Q4k43
$$ 205 -101 64 -272 -127 -1 29 246 19 98 282 400 -40 -19 12 -248 -127 256 -73 -46 22 106 -137
6285a37J64n0o8j07J33K44k30L9k83L78j37L28k41K3O1L8n3j52K35j74Q8k6k47
$$ -137 27 -23 -91 -198 -65 179 -51 -12 -295 83 -54 274 33 56 117 155 102 -50 185 11 99 73 -174
6308a74L57j83j9J08j19J69k28L69k8k14p5J27L8q9P9n5J13l21K61j91p9L02j59
$$ -174 183 0 -19 89 -30 139 -89 280 252 38 -37 90 128 39 118 63 176 -145 116 -75 -154 148 -11
6331a1k1q6K46l77J91R3j32L22L8q2p4j16Q3j1j60J12j74jM34m51L49l36L68l2
$$ -11 -32 -118 128 -249 -58 35 -97 225 263 181 107 -9 74 63 -97 15 -159 -160 274 -177 172 -164 204 172
6355A72P5K9m59J03j23J95Q9k2J78L6k52J5j09n1Q6J77N1r7j35j52L15k21J00
$$ 172 247 276 -183 -80 -203 -8 81 59 237 273 21 36 -73 -124 -38 139 190 93 -42 -194 121 -100 0
6378@r7p4j18N26k9L9n09K17k01J05J30k52J91M6p6J76J63j94j93J21m8J27Q7
$$ 0 -97 -171 -289 237 208 247 -262 -45 -246 -141 -11 -263 -72 -26 -102 74 237 43 -150 -29 -77 50 137
6401A37l11K02J51q0j19R4J25k1l21j48N91k49Jm3j80K04K17l55J03J88j73J45
$$ 137 -174 28 179 99 -20 74 199 178 -143 -291 300 51 52 9 -171 33 250 -105 -2 186 13 158
6423A58j22j1J16p7k61J58J16m15M96k98n5J38P0L38o89K92o4J81o7M3J25o8m02
$$ 158 36 25 141 64 -197 -39 77 -338 158 -140 -195 -57 13 351 -338 -46 -110 71 4 47 172 104 -298
6446b98M65l47nK34Q2K8k72J84p5j42p8J53J53j75L58k42j51O18k35k21p1j31
$$ -298 167 -180 -185 49 131 159 -113 71 -4 -146 -224 -71 82 -93 265 23 -128 490 255 34 -37 -168
6468a68J34qJ70j30J27j32n7P8m0p4M29m11Q4J63l83J17O9J33k99K70O7j19K1
$$ -168 -34 -42 128 -2 125 -7 -64 14 -26 -100 329 -82 2 165 -218 -101 -32 101 -198 72 139 20 41
6491D1N2j08j14K46l64j26K28L4k3K28j84K78m33J52N5o2J36q2J13J10J9qJ07
$$ 41 93 -15 -129 117 -247 -373 -145 -111 -134 94 -90 188 -245 -93 -38 -100 36 -46 67 177 196 188 295
6514B95l05j89L52J50j97N1o3p8j77L66k70l03M50n9j63R2L59k69q2L53m1l28
$$ 295 -10 -199 153 303 106 157 94 16 -161 205 -65 -368 82 23 -140 -48 311 42 -40 313 272 -56
6536e6k3j03K38K52k08M8l17K5J09J54k86N3j6K23J15o9Mm6j3j58l8J2J84J8j90
$$ -56 -79 -182 56 308 100 148 -169 -144 -35 119 -167 -114 -130 93 208 139 143 97 84 -74 -112 -100 84 102 -88
6561h8M3l00L70m0n9j06K26K54k75ll30L42K1j23J34j85m5j41M49M4p0j74J28
$$ -88 -45 -345 25 -15 -74 -180 46 300 25 22 -308 34 55 -68 66 -119 -164 -305 144 188 118 -56 72
6584G2k79J99J41ql78K65j0Ml07K42K8j93M24j74J96m38J32j60K01P1o6J73qj62
$$ 72 -207 -8 133 125 -253 12 2 6 -301 -59 -31 -224 200 26 222 -216 -84 -244 -43 28 -38 135 127 -35
6608c5j47L69l27M36l27k90Q0M8L96l91J66k27P3K08p8K18j22p9j77J99K2J3j33
$$ -35 -182 187 -140 296 -31 -321 -241 -193 203 -188 -22 -249 -176 32 -46 172 50 -29 -206 -7 15 28 -105
6631a05j41N01l75J85J17k87J2J6J43k59J67K16j31l57L05o7J04n8Mj12L78l53
$$ -105 -246 255 -120 65 182 -105 -93 -77 66 -193 -26 190 59 -298 7 -60 44 -14 -10 -122 256 -97
6653i7J42j82J44N8Q8j91J58n0J3M5K09o34N83l78P6J68J66j67j60j77M17l51
$$ -97 45 -137 7 65 153 -38 120 70 83 128 337 -297 286 -92 -16 152 318 151 -9 -186 231 -120
6675a20R6J10k23K57K45k65j14J25k27p1J71j06M9J07k12L49n96L49Q7J4J35j14
$$ -120 -24 86 -137 120 365 100 -14 111 -116 -187 -16 -122 -73 34 -178 171 -425 -76 11 25 160 46
6697D6j05N8L76j89J60k66k4K4k01p9J95L9j58K85l57L06k02J23rj82QK70k02
$$ 46 -59 -1 375 186 346 80 56 80 -121 -200 -5 34 -124 161 -196 110 -92 31 22 -160 -152 118 -84
6720h4J98j01k05K15j12L74j94j00M2k9L2l6j42R8J66q5K6P7l3j30k5j74M34k19
$$ -84 114 13 -192 23 -89 285 91 -9 33 4 36 0 -142 -44 122 37 63 140 107 -23 -48 -222 212 -7
6744gJ75m8o2j54K2j3j04M59l26J29j43m4K37K02m73L81k68j44M58l62J62j38
$$ -7 168 120 58 -96 -74 -87 -191 268 -58 71 -72 -116 121 323 -150 231 -37 -181 277 -85 77 -61
6766f1q1L6R0J82r4K37k36j51K71o5j33l6P6j03r6K78P8k74pL38m07P2k26J93
$$ -61 -142 -106 -16 166 72 309 73 -78 193 128 -5 -41 35 -68 -164 114 192 -82 -89 249 -158 -86 -312 -119
6790a19K56j09j54L45m0m65N99m56l2J93J6k3J75l79L21O4J38l53o4L2J65m35
$$ -119 137 28 -126 219 179 -286 313 -143 -175 18 34 11 186 -193 128 192 330 -23 -87 -55 110 -325
6812c25L61N6o6j27L47j31l24L20l3K40m12mJ14K1p6j08J24j28M2N3k57M44j74
$$ -325 36 92 26 -101 246 115 -209 111 78 318 -94 -98 16 37 -39 -147 -23 -151 -109 -56 -313 131 -43
6835d3J18J26j25n3k46K86j28p4MO3J47j52L13k57K08k98O6O7J77r1k28J1J89
$$ -43 75 201 76 23 -223 63 -65 -139 -135 -72 75 -77 236 -21 187 -111 -45 22 199 108 -120 -109 80
6858H0q3k76N03k69J31Lj1j44k7K75n08J19K01p6M20l66k20K69k51M38j91K34
$$ 80 -3 -279 224 -45 86 89 78 -66 -93 182 -326 -207 -6 -82 338 -28 -248 21 -230 208 17 251
6880B51j51l30L42k99N7M75k36m2j97K44M8O7k59k66L87q5o3Q1j76p1K06j3mk16
$$ 251 100 -230 112 -187 -130 345 109 67 -130 114 162 229 -30 -296 91 6 -57 24 -152 -223 -17 -30 -34 -250
6904b50R4J96k28K75P3j72J1Q2j46K31j91O6j12j13j83K61L00l98M41j33k33J39
$$ -250 -156 40 -188 87 160 -12 -1 81 -65 166 -25 41 -71 -184 -367 -106 194 -204 237 104 -129 10
6926A0P4k73L83j93K9K86k07j55m4j80M27j09L83m20R4K4k51pM2L9j39J6J65k58
$$ 10 84 -189 194 1 30 316 109 -46 -90 -270 157 48 431 11 105 129 -122 -129 -87 -48 -187 -171 -6 -264
6950b64K68L10j71k25M9K6k03K89J26j36j75J9J47j42J15M3p6Q9k04j20L4K42
$$ -264 4 314 143 -82 -33 -7 -210 79 205 69 -106 -87 60 -82 33 76 0 89 -115 -235 -201 41
6972D1r5J64n4qk8p6J21J16l19J73O0m3K5N7N5l75R7L0J92J06m67J37RK00o1k5
$$ 41 -54 110 56 48 20 -56 65 181 -138 35 95 52 77 134 189 -186 -89 -59 133 239 -228 -91 -82 118 57 32
6998C2r1l6l0J17J44K98k92j04k64J85M3l33L61K3k44J26N6j08J59k00L44m89
$$ 32 -59 -95 -125 -8 136 434 142 38 -226 -41 2 -331 30 53 -191 -65 -9 -117 42 -158 186 -303
7020c03K77p0J98j52K13k61K11l28K29J30k21K03k23l5K34m27O12l11kk08K3L52
$$ -303 -26 -96 102 -50 163 -98 113 -215 14 144 -77 126 -97 -132 102 -325 287 -24 -26 -234 -211 141
7042A41j53O1K8K3L0k40J25j1j06p7O3L1J27J04j82p0J57o7q1J8oJ30N9k86K84
$$ 141 -12 49 77 100 130 -110 15 4 -102 -179 -116 -85 42 146 -36 -106 51 -16 -97 -79 -85 45 104 -182 102
7067A02j99J97qk06k0n5J40j46K60l75K57j5J33l5R2R5q6j92P1p0Q8N2j38n8K12
$$ 102 -97 100 92 -114 -134 -189 -49 -195 65 -310 -53 -68 65 30 122 217 131 -61 10 -60 28 80 -58 -116 96
7092I6l4k14J32j8J07k98J76N4K68m15o6J66J68n6k81M41m39M34k08k60K73J85
$$ 96 62 -152 -20 -38 69 -229 -53 1 269 -146 -212 -46 122 66 -215 226 -213 221 13 -247 26 211
7114B11j02J7K8j86j17K4K37NL62j80k58P7l42J79R8l9lJ63k00j08Q9K4Q3M6l91
$$ 211 109 126 154 -32 -149 -125 112 117 479 299 41 118 -224 -45 53 14 11 174 -26 -134 -45 -21 62 108 -283
7139b83K64k2J7nm3O2p4N0J14j09L13k72P7M1J55j26l36L55l06L37l85K87r4j64
$$ -283 -19 -41 -24 -29 -72 -10 -84 -34 80 -29 284 12 89 130 285 159 -177 178 -128 209 -176 111 17 -147
7163a47L26m90L16R9Q4k33o6lj7j73L04Q7l65L58k22J42m7o7N3J80l45K20k4j10
$$ -147 179 -311 5 104 188 -45 -111 -114 -131 -304 0 87 -278 80 -142 0 -47 -114 -61 119 -226 -6 -30 -140
7187a40o7K59k47j32O7L32K12j25k11K08j26j44j71M94j58J43k44q5K08j93K1
$$ -140 -207 52 -195 -327 -260 72 284 159 -52 156 30 -114 -285 209 51 194 -50 -135 73 -120 -99
7208i9j09K02j77J78J11j2j10k6L2R7j92K35j83J01k71L13J07j63J35o3L99m68
$$ -99 -208 -6 -183 -5 106 94 -16 -42 -10 87 -105 130 -53 48 -223 90 197 34 169 106 505 37
7230C7m8K03k77K60J02l4j94m1J4k79J21M30j92k38M62n21J28J54p3O3L5K69m63
$$ 37 -11 192 -85 175 277 243 49 8 22 -257 -136 294 102 -136 326 -195 -67 87 14 77 112 381 -82
7253h2J82m0j17K79l47Q5o7O5j82NN54m15K1k0J37k00L04l37K79p0K19n62K04
$$ -82 100 60 -57 222 -125 -40 -107 -42 -224 -219 335 -80 -59 -79 58 -142 162 -175 104 34 253 -309 -105
7276a05m7Q7J75j99N1k13K86k9j7J84k08J32N3j19n5%K90m96K14J11k28L35l29
$$ -105 -152 -65 110 -89 -38 -251 35 6 -11 173 -35 97 150 31 -24 -24 266 -230 -16 95 -133 202 -127
7299a27K34r5J53j13n1K17j6p6o3j96L8k82L37nJ55j26N4k31K62K50k43j28J60
$$ -127 107 12 165 52 1 218 202 126 63 -133 -95 -377 -40 -45 110 -16 38 -193 69 319 76 -52 108
7322A08r7p9M0J44l60L75J19k65k09L05J16J0N0m11M18j78J44n6n4J11j17j48
$$ 108 11 -68 -28 116 -244 131 250 -15 -224 81 197 207 257 -154 264 86 230 174 120 231 114 -34
7344c4P0J69k37J0L55m06q3M08k36k28J28p4L25k77M7k9q1K26J45R3k35n6J60
$$ -34 36 205 -32 -22 333 -73 -156 252 16 -212 -84 -158 167 -110 -63 -92 -173 53 198 291 56 0 160
7367A60k84j38J05P1o6J87n9q3n5K06L62m52j42J55j37K0K88j00o6k17K86J01
$$ 160 -124 -262 -157 -86 -152 35 -24 -107 -162 44 406 -46 -188 -33 -170 -150 138 38 -28 -245 41 142
7389A42m40M96k46P5J34k34K93l14J06J02q8J34j11k44J55P4P4j48m3J80k71M59
$$ 142 -298 198 -48 27 161 -73 220 -94 12 114 26 160 49 -195 -40 34 108 -40 -83 97 -174 285
7411B85l82Q5L6R1k08rj84J66P5q3R7K80n58K71q2MJ68l38J31J16RK94m00j41
$$ 285 -97 -12 24 115 -93 -102 -286 -120 -45 -128 -31 249 -309 -38 -120 -116 52 -286 -155 -39 -30 264 -136 -277
7435b77L46k22L4J31M4j13q2o2K56j72p4L56j89K13j09k25J87q4K48j03J75l30
$$ -277 69 -153 -119 12 56 -57 -139 -201 55 -117 -191 165 -24 189 80 -145 42 -42 206 103 278 -52
7457e2o6R4K8n5k44J99O0J36j36o5k14L57k21M81l76j32L32l22K55p4L07m15o7
$$ -52 -118 -24 4 -51 -295 -96 -36 100 -36 -101 -315 42 -179 302 -74 -206 126 -196 59 -15 292 -123 -190
7480a90L40l63K40m8L20j96j99P6J69n9O6M1j4l3j66K50n05M7J07J56n5m48L56
$$ -190 150 -213 27 -21 299 103 -96 -20 149 90 156 197 183 150 -16 234 -271 -224 -117 39 -16 -464 -108
7503a08j35k24N84l36K06j56J83K16m7m18K29J07q9N3J82k85p7J40P5O8j64k3
$$ -108 -243 -467 117 -219 -13 -169 14 230 183 -235 -6 101 12 65 247 -38 -115 25 100 168 4 -19
7525a9j93M36k40j15Q8O2P4J16j97O8o1J84k29J90l38M61l26j27K64k47K15J9
$$ -19 -212 224 -16 -131 -43 19 93 209 12 80 19 203 -26 164 -174 287 -39 -166 98 -149 66 85
7547H5p7L8N2p6J77k88J29l6p0J02j13p8L09j65P7k50o4N55m11k16J23K59k86
$$ 85 8 46 98 22 199 -89 40 4 -66 36 -77 -155 154 -11 66 -184 -248 307 -104 -320 -197 62 -224
7570b24N08n43p3K89N9o7n4J78j08j6M1j2J20r2L01m30L4J76K8J84l87P0K20j62
$$ -224 284 -259 -332 -43 16 -51 -105 73 -35 -51 -10 -22 98 6 307 -123 -89 87 115 299 -88 -18 202 40
7594D0j24L05J7R7k73rO4j88o7L87l75o6m6J26L94k96J64l7m0l3J70l09J34j05
$$ 40 -84 221 238 335 62 53 117 -71 -138 249 -126 -192 -238 -112 282 -14 150 113 73 40 210 -99 35 -70
7618g0m0K93j01K07j25k82n4K27J1J11m40K81l3J47k22O7K58o26P26j23l76J67
$$ -70 -110 183 82 289 164 -118 -172 55 66 177 -263 18 -15 132 -90 -23 235 -391 335 212 -164 3
7640CJ33j15j64j42L15l0K77k95M1j27K25j87J83k16J3J79P7r1mL6K6j14o5L09
$$ 3 136 21 -143 -285 30 0 277 -18 23 -104 121 -66 117 -99 -86 93 170 79 75 111 137 23 -42 267
7664B67l03J5O9R1j21K99k98L4N1l69J60K1K47r1j15O6J98J27k57L8M7m15K98
$$ 267 -36 -21 48 139 18 317 19 53 104 -265 -105 -84 163 72 -43 23 221 348 91 129 176 -239 59
7687E9l90L50K65l13j5j9N1ol4m8n2M30L7l65q4q7K89K8n8L0j92J90j36k17J70
$$ 59 -331 19 284 -29 -44 -63 -12 -18 -52 -100 -152 278 315 -50 -134 -221 68 96 38 68 -124 66 -70 -287 -117
7712a17K57k44J47pJ97j81O1l47L37j59J90n9P4l23K51l13M52m08j35N16l12J89
$$ -117 140 -104 43 36 233 52 113 -234 103 -56 134 75 149 -174 77 -236 216 -192 -327 189 -123 66
7734F6Q0m8m22L50k24K28K1J4j56k45K00K62l63n8J67K50q9k59J51N3k1M40k04
$$ 66 146 98 -324 26 -198 30 51 65 -91 -336 -136 126 -237 -295 -128 122 33 -226 -75 -22 -43 397 193
7757A93l57K67K19m59j4K52J20J3j99L7J79k22K43l06J5p3M47o08P4J73L6j36
$$ 193 -164 103 322 -137 -151 101 221 234 35 72 251 29 272 -34 -19 -92 355 -253 -179 -6 30 -106
7779a06K8L01R8n59mK17J78l22r9M22j43J44l52J92O0P8l67K04R9j41l7L5K08
$$ -106 -78 223 321 -238 -242 -25 153 -169 -268 154 11 155 -197 -5 55 133 -234 -30 69 -72 -109 -74 134
7802A34l61J60L33m73L03q5l15J48j31L35o0j24J12K37l38R1J24L5m50J23L46
$$ 134 -227 -67 266 -207 96 11 -304 -156 -287 48 -12 -136 -24 213 -125 -34 90 125 -325 -202 144
7823A44l22J85L94l90j40K66l37K91Rj40R5k59K44m2j78J41JK00k10M11k02N3
$$ 144 -178 7 401 11 -129 137 -200 91 100 -40 55 -204 40 -2 -180 -39 -38 162 -48 363 161 214
7845B14nl54K10j02n2K69j07R4j03n2Jj00r2R7K88k83J36j90J39j61J60l32L33
$$ 214 209 -145 65 -37 -89 180 73 167 64 12 13 -87 -179 -82 206 -77 59 -131 8 -153 7 -325 8
7868Hj11k9J55j8J56k20J31J63m48LL52l6k74L03j49l7p0R9j29j6K47J03k60M7
$$ 8 -103 -132 23 5 161 -59 72 235 -213 -210 142 106 -168 135 -14 -51 -121 -22 -151 -167 80 183 -77 -30
7892c0j16R4j89J5L94j51l5l25O50k77j68L36j61j81K6p3p0J70L3M3L09m82J96
$$ -30 -146 -52 -241 -226 168 17 -18 -343 307 30 -138 198 37 -144 -118 -191 -261 -91 -58 -15 294 -188 8
7915HjQ8j09K18k1l28R3J77K06j72j09k06J08N1j93M70m35M19l70O6k38L64K62
$$ 8 7 95 -14 204 183 -145 -52 125 331 159 50 -156 -48 3 -190 280 -155 264 -106 -40 -278 86 348
7938C48l29k85J14L53l85J58k69K55R9Q3l32K77k5o5J38j43J42l40J88K2m6j14
$$ 348 19 -266 -152 201 -184 -26 -295 -40 59 142 -190 87 62 -3 135 -8 134 -206 -18 4 -42 -156
7960a56J78K7n10K95K07m5r6J6K55m61K65L36m36K41p3J16J8j08L35o23J11J52
$$ -156 22 49 -461 -166 41 -4 -100 -84 171 -290 -25 311 -125 116 43 159 177 69 404 -219 -108 44
7982D4k3j00K86j81r7k35M61o85J49K18J30M2Q2j06m0J37k32O56p36K46m32J95
$$ 44 21 -79 207 26 -71 -306 155 -530 -381 -163 -33 9 91 -15 -55 82 -150 506 -230 16 -416 -221
8004b21K24o1P6L59j58L1l81K25K4L0nk06k03J60K59j5J27k82L03l82L27l12K99
$$ -221 3 -58 18 377 219 250 -131 94 118 148 143 -63 -266 -106 153 138 265 -17 286 -96 231 -81 218
8027B18k06P8k89J61j95M54k20J89J22n33J93L88m29j07J12K99m28J06J16j27
$$ 218 12 90 -199 -38 -233 221 1 190 312 -221 -28 360 -69 -176 -64 235 -193 -87 29 -98
8047i8K23n4j75l4K48N47o17j56J97k98N29j63K49l01R9j75O4P5k54L14j0l83
$$ -98 125 71 -104 -138 110 657 40 -116 81 -217 312 149 398 97 196 21 85 160 -94 220 210 -173
8069a73O7K49j69J38n5R3J20k83J97l84R9J50k33J50J75l5j14J36K8j88P0l31
$$ -173 -106 143 -26 112 57 150 270 -13 184 -200 -101 49 -184 -34 141 106 -8 128 156 -32 38 -293
8091b93J43j44L24MP1L6k71K69r4J85k83J55l01j76L69Q9q3lL00k12j20N7L69
$$ -293 -150 -294 30 34 105 141 -130 139 45 230 -53 102 -199 -375 -6 83 0 -3 297 85 -35 22 391
8114C91k60l27M60k89N2r6qJ51j41J27j50j5K66k35K39k3r2k51o6K78K04l45p8
$$ 391 131 -196 264 -25 27 -69 -77 74 -67 60 -90 -105 161 -74 165 142 50 -201 -267 11 215 -130 -208
8137b08K19l00K72N0j48Q3mk44K84K43k18o0N0O7p6j89J87k04K16j52L50l9j58
$$ -208 11 -289 -17 33 -115 -32 -36 -280 4 247 29 -31 19 86 10 -179 8 -196 20 -132 218 179 21
8160B1O3j71J27J68l08k0J43KN7r1o1l25L80J62j01k40K98k48L6j02Q6K89k41
$$ 21 84 -87 40 208 -100 -120 23 25 82 -9 -70 -395 -15 147 46 -194 104 -144 -108 -210 -124 165 -76
8183g6J92k91J16OO2m1O5M9
$$ -76 116 -175 -59 -53 9 -32 33 82
8191H2
$$ Imaginary data points
##PAGE= N=2
##DATA TABLE= (X++(I..I)), XYDATA
0@%%%%%%%jRj6J6j6K2l0L2m0M9n7P1q3R4j10J30j51J73j98K25k55K93l30L70m19
$$ 0 0 0 0 0 0 0 0 -1 8 -8 8 -8 14 -16 16 -24 25 -32 39 -44 50 -60 70 -81 92 -106 119 -136 157 -173 197 -222
32b22M70n25N86o54P28q10R00r97J106j226J356j501J663j844K048k281K546k850
$$ -222 248 -277 309 -345 383 -427 473 -524 582 -644 712 -789 874 -970 1078 -1203 1343 -1507
50a507L208l635M156m806N644o773Q389j0909J5431k6099R8901Q7557j24514o5464
$$ -1507 1701 -1934 2222 -2584 3060 -3713 4676 -6233 9198 -16901 82000 169557 45043 -20421
64b0421P065R4523M7118l5237r9576n1192K7887P7703L0398m2388q2060l6041
$$ -20421 -13356 81167 128285 93048 -6528 -57720 -29833 47870 78268 35880 -46180 -82221
76h2221L3510O8807K7796l6498o9704k9584L8128P1283K9936l9987o9868k2191
$$ -82221 -48711 20096 47892 11394 -58310 -87894 -49766 21517 51453 11466 -58402 -80593
88h0593N0125P4998J9163n5909p1234o012O7109O7858q197p5184n8387K3713P5550
$$ -80593 -30468 44530 63693 7784 -63450 -69462 -2353 65505 57308 -17876 -76263 -52550 23000
101B3000M0249l9482p3842k6649M5314O1857J1662m8214n4287n006M6430M8784
$$ 23000 63249 23767 -50075 -76724 -31410 30447 42109 -6105 -60392 -65398 -18968 29816
113B9816J819m4473m4645J576M6994M6798K74m7941m7849N771N6809N1019r881
$$ 29816 31635 -12838 -57483 -55907 -8913 37885 38159 -9782 -57631 -51860 4949 55968 46087
126D6087o2934m9031K0223P0173M6668k9750p5240m0049M0911P8875K9201n2764
$$ 46087 -16847 -65878 -45655 24518 71186 41436 -33804 -73853 -32942 45933 75134 22370
138B2370p5616j5756N9226O7106K838n9773n6217L829N4563M6652p364n0795m2576
$$ 22370 -53246 -69002 -9776 57330 60168 395 -55822 -51993 2570 49222 41858 -8937 -51513
151e1513O001M4939L9076o576m7316m1228O007M7888M0019j2508n3378l9021J9224
$$ -51513 -45512 -573 38503 31927 -15389 -56617 -50610 -2722 37297 24789 -28589 -67610 -48386
164d8386N7029L3423k7869n8584k4186L7805O0117J5830m5033n4734k066N3723
$$ -48386 8643 42066 14197 -44387 -68573 -30768 29349 45179 146 -54588 -56654 -2931
176b931M9932q679n5603l9462K0439N4305K8611k5430m9630k2041K5108M4497
$$ -2931 47001 38322 -17281 -56743 -36304 18001 46612 21182 -28448 -50489 -25381 19116
188A9116J7368k5506m2958j9321K4006M4100K0185k6771m8588j9742L3014N3852
$$ 19116 36484 10978 -31980 -51301 -27295 16805 36990 10219 -38369 -58111 -25097 28755
200B8755J7947l9976n4687r374M9301N5093K711n3411n0778P042N7536M5469j5961
$$ 28755 46702 6726 -47961 -57335 -8034 47059 49770 -3641 -54419 -47377 10159 55628 39667
213C9667n8971l8472K2958N5714K7466k9322n2414k0334K8979M3980J3880k8361
$$ 39667 -19304 -57776 -34818 20896 48362 19040 -33374 -53708 -24729 19251 33131 4770
225D770l9392j1614K5836L7937J2848k3456l6627j0923K9363M2064J1941l1952
$$ 4770 -34622 -46236 -20400 17537 30385 6929 -29698 -40621 -11258 30806 42747 10795
237A0795m0466k742M2056M2123m192m5408l5593J5065M9186K8518k3441n0057
$$ 10795 -29671 -32413 9643 51766 47574 2166 -33427 -18362 30824 59342 35901 -14156
249a4156k1970K8756M6270J1431l6403m5334o369L6778L7701k132l8989l4584
$$ -14156 -36126 -7370 38900 50331 13928 -31406 -37775 -997 36704 34572 -4417 -39001
261c9001M240L5645K9908n305l4272k9145M836L5253L1587m133l6860l2692Q036
$$ -39001 -34761 884 30792 25487 -8785 -37930 -33094 2159 33746 29613 -7247 -39939 -31903
274c1903M4286L4393j2957m8049l0214K2210N1882K4602k9232n0024j6045L4628
$$ -31903 12383 46776 33819 -14230 -44444 -22234 29648 54250 25018 -25006 -41051 -6423
286f423M6432Q155l7264m2055j893L7515L5422l856l7742l0859O925L4438K4563
$$ -6423 40009 48164 10900 -31155 -33048 4467 39889 36033 -1709 -32568 -25643 8795 33358
299C3358j0287l3145k2377R426L0461J9477j0779l0990k1206J1644L3689K0153
$$ 33358 23071 -10074 -32451 -23025 7436 26913 16134 -14856 -36062 -24418 9271 29424
311B9424j6300l7385j8021K3581M0862J2648l0218m0270l287L7642L7238l872
$$ 29424 13124 -24261 -42282 -18701 22161 34809 4591 -35679 -38966 -1324 35914 32042
323C2042l9262l0970J1912M0331K5700j5758l9197k0349J9081L7039J5686k1112
$$ 32042 -7220 -38190 -26278 14053 39753 23995 -15202 -35551 -16470 20569 36255 15143
335A5143l5313j4425K1011L3140J0810k1767l3525j0955K1334L3103J0523k3528
$$ 15143 -20170 -34595 -13584 19556 30366 8599 -24926 -35881 -14547 18556 29079 5551
347E551l5158r643K7573L7594P360l2174l6860J31L8371L5768o526l9843k8545
$$ 5551 -29607 -39250 -11677 25917 33277 1103 -35757 -35626 2745 38513 31987 -7856 -36401
360c6401J5005M0329K2366j8605l7017j5019K0834L3319J0341k2401l0041q098
$$ -36401 -21396 18933 41299 22694 -14323 -29342 -8508 24811 35152 12751 -17290 -25388
372b5388K1803K6857M320k2723k6488l894K2752K4947R84k4507k5127O99K6671
$$ -25388 -3585 23272 27592 4869 -21619 -25513 -2761 22186 23170 -1337 -26464 -25765 906
385I06K5215l357k9339k4706Q440L4487K3972j3725l6748j8486K1588L8368J2923
$$ 906 26121 22764 -6575 -31281 -22841 11646 35618 21893 -14855 -33341 -11753 26615 39538
398C9538k6345l5163n712K9418L1615J16k9601k7845J823K8073K4045m944k8232
$$ 39538 13193 -21970 -27682 1736 33351 33467 3866 -23979 -22156 5917 29962 25018 -3214
411c214k3385M022K6553K1326o385k9007k2132O748K9052K0507j0402l0483j8992
$$ -3214 -26599 -22577 3976 25302 18917 -10090 -32222 -25474 3578 24085 13683 -16800 -35792
424c5792J2558L2605J8483j6178l2920j3525K2242L4933J0011k5045l1024j726
$$ -35792 -23234 9371 27854 11676 -21244 -34769 -12527 22406 32417 7372 -23652 -25378
436b5378K9670K8391l341k8553k2239P899K7401J7823j0077k6385j5979R621K3817
$$ -25378 4292 32683 29342 789 -21450 -13551 13850 31673 21596 -4789 -20768 -11147 12670
449A2670J2829j2186k5703j3288J1982K4699J0875j5872k6976r374J8579K7532
$$ 12670 25499 13313 -12390 -25678 -13696 11003 21878 6006 -20970 -30344 -11765 15767
461A5767P033k1102k6739l063K5862K7852N55k6881k5327N550L1618K3314r529
$$ 15767 22800 1698 -25041 -28104 -2242 25610 26165 -716 -26043 -20493 11125 34439 24910
474B4910l1934j8795J4580L0542J3130j7546k9357j1054J6237K4491P013j8116
$$ 24910 -7024 -25819 -11239 19303 32433 14887 -14470 -25524 -9287 15204 22217 4101
486D101k5374q419J6064K3515O722j8674k4740o089K0569K5685L237k1985k3438
$$ 4101 -21273 -29692 -13628 9887 16609 -2065 -26805 -32894 -12325 13360 16597 -5388 -28826
499b8826J497K5706K3377l042k5619j9303Q443K8196J7893j1518k7335j3735J5576
$$ -28826 -27329 -1623 21754 18712 -6907 -26210 -17767 10429 28322 16804 -10531 -24266 -8690
512h690K6965Q709j8998k5852m882J9500K1472P86k0567j9555P59J9096J8085
$$ -8690 18275 26984 7986 -17866 -22748 -3248 18224 19010 -1557 -21112 -20353 -1257 16828
525A6828j432j9407j6993K525K1498J8835l824k2392j6775P779K6086J6208j0548
$$ 16828 15396 -4011 -21004 -18479 3019 21854 18030 -4362 -21137 -13358 12728 28936 18388
538A8388k6588j3379J4502K6632R960j7719k7524p826J8669K4693L198k2648k4745
$$ 18388 -8200 -21579 -7077 19555 29515 11796 -15728 -23554 -4885 19808 23006 358 -24387
551b4387j687K2404K1150l535k3907j8970N394K2338J6005o043k1451j3295P152
$$ -24387 -26074 -3670 17480 13945 -9962 -28932 -23538 -1200 14805 8762 -12689 -25984 -18832
564a8832K1690J4195o882k0825j2750J0214K3450J2442j1784k3019r460J6319
$$ -18832 2858 17053 10171 -10654 -23404 -13190 10260 22702 10918 -12101 -21561 -5242
576e242K4036N628j8080k1867j621J9867J9881o57k0941j7632M071K1621J6442
$$ -5242 18794 24422 6342 -15525 -17146 2721 22602 21945 1004 -16628 -12557 9064 25506
589B5506o882k1597j3592R922K2047J0595j1533k1202q248J2507J9542O397j3689
$$ 25506 18624 -2973 -16565 -6643 15404 25999 14466 -6736 -14984 -2477 17065 23462 9773
602I773j9955n717J3377J8939M747j6112k1252l229J8015K0475P68k1115j9669
$$ 9773 -10182 -15899 -2522 16417 21164 5052 -16200 -19429 -1414 19061 19829 -1286 -20955
615b0955L763K3063J7631n638k2200j3731R143K3183J2698r754k1151j0260J2893
$$ -20955 -17192 5871 23502 17864 -4336 -18067 -8924 14259 26957 17203 -3948 -14208 -1315
628a315K1268P965j3363k0992o251J4306J8474K800j6512j8421l011J4924J5809
$$ -1315 19953 27918 14555 -6437 -12688 1618 20092 22892 6380 -12041 -15052 -128 15681
641A5681p33j6784j6868O20J6650J5075k679j9167j4488N818K0861J3530q702
$$ 15681 14948 -1836 -18704 -18084 -1434 13641 10962 -8205 -22693 -16875 3986 17516 8814
654H814k0338q940J2366K1243P006j3477j8025l582J4704J8212K127j5253j6754
$$ 8814 -11524 -20464 -8098 13145 20151 6674 -11351 -14933 -229 17983 20110 4857 -11897
667a1897m24J6537J5647j882j7941j4966L361J8192J3242n995j8302j1624O923
$$ -11897 -12321 4216 19863 17981 40 -14926 -11565 6627 19869 13874 -4428 -16052 -9129
680i129J8202J1036p684j8072j0031R933J9992Q817j1295j9777o789J4460J9767
$$ -9129 9073 20109 12425 -5647 -15678 -5745 14247 23064 11769 -8008 -14797 -337 19430
693A9430L655j5960j8505p61J6707J5730j771j6982j4648K652J6391J3320m743
$$ 19430 23085 7125 -11380 -12141 4566 20296 18525 1543 -13105 -10453 5938 19258 14515
706A4515j6888j1776N587J6952J0753p749j7212q803R312J7049O588j1075j6900
$$ 14515 -2373 -14149 -8562 8390 19143 11394 -5818 -14621 -5309 11740 18328 7253 -9647
719i647n179J1075J5437K761j3694j6979k262J3272J4251j342j7303j5339K021
$$ -9647 -14826 -3751 11686 14447 753 -16226 -18488 -5216 9035 7693 -9610 -24949 -22928
732b2928J7032J1204o517j8308j0428P644J6516Q458q727j6117o422R866J6904
$$ -22928 -5896 5308 -1209 -19517 -29945 -22301 -5785 2673 -6054 -22171 -28593 -18727 -1823
745a823O823j0008j5625m105J2996J7247L209j3083j5213j00J5021J4283l76j5151
$$ -1823 5000 -5008 -20633 -24738 -11742 5505 8714 -4369 -19582 -19682 -4661 9622 9246 -5905
759e905j2775K108J5058J2343l534j5889j1854N169J7529R917p011j6983q209
$$ -5905 -18680 -16572 -1514 10829 7295 -8594 -20448 -15279 2250 12167 5156 -11827 -20036
772b0036J0315J7121N829j0194j4916l188J1802J4325K546j1569j3381q93J1817
$$ -20036 -9721 7400 13229 3035 -11881 -15069 -3267 11058 13604 2035 -11346 -12239 -422
785d22J3176n57j3819j2907J601J3678J0351m532j5617j0587N647J4839P550p366
$$ -422 12754 12197 -1622 -14529 -12928 750 11101 6569 -9048 -19635 -13988 851 8401 1035
799A035j4892o653Q298J5091N932r393j4082l160J1898J5668K648j1937j2858
$$ 1035 -13857 -20510 -12212 2879 8811 -582 -14664 -17824 -5926 9742 12390 453 -12405
812a2405L42J4613J2589j038j3461j1198L631J3475R946m228j4054r872M480J3508
$$ -12405 -12063 2550 15139 14101 640 -10558 -6927 6548 16494 12266 -1788 -11660 -7180 6328
826F328Q559o934j5576q088P861J4481N317j0006j4901l150J0155J3605K587j0885
$$ 6328 14887 7953 -7623 -15711 -7850 6631 11948 1942 -12959 -16109 -5954 7651 10238 -647
840f47j1749o92J1811J2606P03j2147j0933K367J3896J0830l447j3679q279N320
$$ -647 -12396 -13088 -1277 11329 12032 -115 -11048 -8681 5215 16045 12598 -1081 -9360 -4040
854d040J3494O822o642j3160n898O706J2365M056q335j3080m391Q459J2674J949
$$ -4040 9454 16276 9634 -3526 -9424 -2718 9647 13703 5368 -7712 -12103 -3644 9030 10979
868A0979j1110j2716j157J2021J1109j207j2560j0092L059J2730R184l275j2391
$$ 10979 -131 -12847 -14004 -1983 9126 7919 -4641 -14733 -11674 1056 10240 6965 -5426
881e426p800N256J3481P901n386j3298o089Q501J4081N030q517j2732k855R709
$$ -5426 -13226 -7970 5511 13412 8026 -5272 -11361 -2860 11221 16251 7734 -4998 -7853 1856
895A856J2542J565r982j1395o78J0154J0654k60j1512j0895R91J1854R344l243
$$ 1856 14398 15963 5981 -5414 -6092 4062 14716 14456 2944 -7951 -6960 4894 14238 10995
909A0995j3570q457M942J1877O642o408j1982n500O861J1911L811p331j1223l291
$$ 10995 -2575 -11032 -6090 5787 12429 6021 -5961 -11461 -4600 7311 11122 3791 -7432 -10723
923a0723Q281J1847K308r403j1069p41J0777R879j101j1073q983K412J1060P720
$$ -10723 -2442 9405 11713 2310 -8759 -9500 1277 11156 10055 -1018 -10001 -7589 3471 11191
937A1191l850j1389p369M092J0685O497n222j2043n912O660J1863M063p689j2359
$$ 11191 7341 -4048 -11417 -7325 3360 9857 4635 -7408 -13320 -6660 5203 9266 1577 -10782
951a0782k156R200J1171J345r516r972j83J0290R428Q3j0180r045J872J0835R021
$$ -10782 -12938 -3738 7433 8778 -738 -10710 -10893 -603 8825 8908 -1272 -10317 -8445 2390 11411
966A1411k798j1807p345M300J1923N832n579j1623m921O645J0416L557p073j0151
$$ 11411 8613 -3194 -10539 -6239 5684 11516 5937 -5686 -10607 -3962 6454 10011 2938 -7213
980g213l267P515J0217K440q392j0488o28R369R218k79j0237q049K531J0247P085
$$ -7213 -10480 -2965 7252 9692 1300 -9188 -9816 -447 8771 8492 -1745 -9794 -7263 2984 10069
995A0069k831j0095o210M206J0431N432m562j0417m671N837J0758M182p616j0408
$$ 10069 7238 -2857 -9067 -4861 5570 11002 6440 -3977 -8648 -2811 7947 12129 4513 -5895
1009e895k718Q328R858R52q938r449L6Q603Q272j139r422q010J128R645P162k859
$$ -5895 -8613 -285 9573 10525 1587 -7862 -7826 777 9049 7910 -1512 -9522 -8394 1251 8413 5554
1025E554j0455o639M132J0429N471n235r985m377O137J0351L893o832q879j914
$$ 5554 -4901 -11540 -7408 3021 8492 3257 -6728 -11105 -4968 5383 9276 2444 -6435 -8349
1039h349P201R376J940p351q845r44R130Q627p79r233p942J749R314O241l234
$$ -8349 -1148 8228 10168 2817 -6028 -6972 2158 10785 10006 773 -7169 -5420 3894 10135 6901
1054F901r714o211L158Q688M750m596r853m290M757R525L122o182r280k675P915
$$ 6901 -2813 -9024 -5866 2822 7572 2976 -6877 -11167 -6410 3115 6237 55 -9225 -11900 -3985
1069c985Q774J282p334q234J029Q256P306n86p642p306K071Q719O554k822r215
$$ -3985 4789 6071 -1263 -9497 -8468 -212 7094 6508 -1134 -8440 -6369 2350 8904 6082 -3133
1084c133o249L521R547M634n043j0044m234N825Q461K634o281q437k223O331Q224
$$ -3133 -9382 -5861 3686 8320 3277 -6767 -11001 -5176 3285 5919 -362 -8799 -11022 -4691 3533
1099C533J549p073p949k40Q281Q032k79q005p080K325Q950O382k527q345n072
$$ 3533 5082 -1991 -9940 -10180 -1899 6133 5854 -2151 -9231 -6906 2044 8426 5899 -2446 -7518
1114g518L526Q211M566l985q335m289M496P956L010n555q558l045O603Q519K66
$$ -7518 -3992 4219 8785 4800 -3535 -7824 -3328 4628 7638 2083 -6475 -9520 -2917 5602 5868
1129E868o834p878M14P270O542j066p151n829J432P952N592k027q095n066L285
$$ 5868 -966 -8844 -8430 -1160 5382 4316 -2835 -8664 -7232 720 6312 4285 -3810 -8876 -5591
1144e591Q743M449m285q335l368N714Q167K411n912p477j326O074P788P21n741
$$ -5591 3152 7601 3316 -5019 -8387 -2673 5494 7905 1993 -5484 -6810 -736 7052 7773 2032
1159B032p108l47P132P172l65p739o567K077P931N571k857q202m611L341P355
$$ 2032 -5076 -5423 1709 8881 8516 777 -5790 -3713 4218 9789 6932 -1270 -5881 -2540 4815
1174D815L982m425p709l500M426P357K655n284p835j627N723P801R60o545o719
$$ 4815 8797 4372 -3337 -6837 -2411 4946 7601 2317 -5518 -7145 -1422 6379 7339 794 -5925
1189e925R24O900O268m74o521n045J521P071N070j916o430n017K375P251M101
$$ -5925 -5001 1899 8167 7693 1172 -3873 -2352 4719 9789 7873 1443 -3574 -1199 6052 10153
1204A0153m298p896l873M469O922J316n668p173k005N166O102J96n697o417r6
$$ 10153 5855 -2041 -5914 -1445 5477 6793 1125 -6048 -8053 -2887 3215 3411 -2286 -8703 -8799
1219h799O596O268k66o637n094J929Q049N315j963o448l606M120P047L959l687
$$ -8799 -2203 4065 3799 -2838 -7932 -6003 2046 7361 5398 -1050 -4656 -536 6511 10470 6783
1234F783o479l065M004O734K238m798p284k315M877O280K69o264p076n26O124
$$ 6783 304 -2761 1243 7977 10215 5417 -1867 -4182 695 6975 7244 980 -6096 -6622 -498
1249d98N297j215o428n202J589O325M332j662o041m193K971P129L933l191o703
$$ -498 4799 3584 -2844 -8046 -6457 -132 4200 2538 -3503 -7696 -4725 2404 6337 3146 -3557
1264c557k695M689O850J605m597o407j422N230N236J66n489n582n72M837N336
$$ -3557 -6252 -1563 5287 6892 2295 -4112 -5534 -304 4932 5098 -391 -5973 -6545 -1708 3628
1279C628n88o277n583J214O574M608k349o854l556L222P054K859l300n843j960
$$ 3628 3040 -3237 -8820 -7606 -1032 3576 1227 -5627 -9183 -5961 1093 3952 652 -5191 -7151
1294g151M129O411K388m116n979r55M956N878P82n641n605L76N604M878j115o274
$$ -7151 -3022 3389 5777 1661 -4318 -5273 -317 5561 6343 702 -4903 -4527 1077 5955 4840 -1434
1310a434m353J402N323L734j971n218m299K144N896L424k942o440k543L835O459
$$ -1434 -5787 -4385 938 4672 2701 -2517 -6816 -4672 1224 4648 1706 -4734 -7277 -3442 3017
1325C017J936m620n629j110N413N445K27m909m978N95N022M735m26n162m647J485
$$ 3017 4953 333 -5296 -6406 -993 4452 4679 -230 -5208 -4613 409 5144 4718 -444 -5091 -3606
1341c606N597L951j916n948l501K807O059K228l207n668k147K980N108J543l693
$$ -3606 1991 5942 4026 -1922 -5423 -2616 3443 5671 2464 -3204 -5351 -2371 2737 4280 587
1356E87o112j183L996N447L28m895n733L89N246M658r84n612l741J825N472L562
$$ 587 -5525 -6708 -2712 2735 3063 -1832 -7565 -7176 -1930 2728 1744 -3868 -7609 -5784 -312 3250
1372C250j637n180k672K737N665K725k217n334j884L680N581J563l736n208q63
$$ 3250 1613 -3567 -6239 -3502 2163 4888 2671 -2663 -4547 -867 4714 6277 2541 -2667 -3530
1387c530L944M459O50n149m463l36M316L990j203m863m670R43N099L603j710n395
$$ -3530 414 4873 5523 374 -4089 -4425 -109 3881 2678 -2185 -6855 -5912 -813 2790 1080 -4315
1403d315l152K608N836K213k846m582j720L716N249J844l189m268k07L476M745
$$ -4315 -7467 -4859 977 3190 344 -4238 -5958 -2242 3007 4851 1662 -2606 -2813 663 5408
1418E408P85l646m748J60M668M224p05n379l959J393M189K860j810n238k735J515
$$ 5408 6193 2547 -2201 -2041 2627 6851 6146 767 -3192 -1799 2390 5250 3440 -1798 -4533 -3018
1434c018M596K589k794n444k163L354N334J010l559m733n74M399M721J54l957
$$ -3018 1578 4167 1373 -4071 -6234 -2880 2454 3464 -95 -4828 -5402 -1003 3718 3872 -85
1449h5l623K79M185M055m83m385l044P98M312L797j771m548l189J872M817K091
$$ -85 -3708 -3429 756 4811 4328 -57 -3101 -2303 2009 5806 4035 -513 -3702 -1830 2987 5078
1465E078k559m747j778L013L945J267l377m299r60L540M032O69l711m170J62M575
$$ 5078 2519 -2228 -4006 -993 2952 4219 842 -3457 -4417 -877 3155 3824 113 -4057 -3895 680
1481F80M098j069m471k778J399M326K590j774l920k019K040L980J865k211m276
$$ 680 4778 3709 -762 -3540 -2141 2185 4775 3001 -919 -2938 -898 3082 4947 2736 -1540
1496a540j834K815L962J591l372m398j172M051L827R0l944m116M30M099K898p78
$$ -1540 -3374 -559 3403 4994 1622 -2776 -3948 103 3930 4020 76 -4040 -3610 489 3387 2609
1512B609l929k971J038M378K911j267m440k538K175M910K254k671m185j078L076
$$ 2609 -1320 -4291 -3253 1125 4036 2769 -1671 -4209 -2034 2876 5130 2459 -1726 -2804 272
1527B72M175P28k956l599m47L065L229P66l254l895k23L722L422j056m054l618
$$ 272 4447 5175 2219 -1380 -1827 1238 4467 5233 1979 -1916 -2139 1583 5005 3949 -105 -3723
1543c723J475M019K565k014m468j899J996M088J845k212m217j289K435L964J469
$$ -3723 -2248 1771 4336 2322 -2146 -4045 -2049 2039 3884 1672 -2545 -3834 -1399 2565 4034
1558D034k694m105m51L873L344O5l380l203Q79L238K941q53l460k444N01L669
$$ 4034 1340 -2765 -3216 657 4001 4066 686 -2517 -1638 1600 4541 3688 228 -2216 -1715 1954
1574A954K643j235m434k525J501L886K196k695m444j280K632L942L96k835l755
$$ 1954 4597 3362 -1072 -3597 -2096 1790 3986 1291 -3153 -4433 -1801 2141 2537 -298 -4053
1589d053j82K925K810P20l349k995J21L426L369l30l755k623J104M147K270j283
$$ -4053 -4235 -1310 1500 2220 -1129 -4124 -4003 -577 2792 2462 -1293 -3916 -2812 1335 3605 2322
1605B322l549j704J899L421J644k081l001j691K009L757J233k823l683q78K983
$$ 2322 -1227 -2931 -1032 2389 4033 1952 -1049 -2740 -731 3026 4259 1436 -2247 -3125 -142
1620a42L400J41l826l178K75L367K491j166l348k277R25L571K209j473l100k086
$$ -142 3258 3399 -427 -3605 -3330 37 2528 1362 -1986 -4263 -3338 233 2442 969 -2131 -4217
1636d217J708L813J902k344l092j412K768L518Q76k350l230j33K798K878p7k652
$$ -4217 -2509 1304 3206 862 -2230 -3642 -874 2644 3520 1170 -2060 -2193 605 3483 3406 754
1652G54k916l07K752K942q30l462k686P98L413J840j701l722k075K054L623Q58
$$ 754 -2162 -2469 283 3225 2395 -1067 -3753 -2955 458 2298 597 -3125 -5200 -3146 477 1335
1668A335k043k974r80K356L038J498k019l122n32K849L656P3k996k596M77L382
$$ 1335 -708 -3682 -4662 -2306 732 2230 211 -2911 -3443 -594 3062 3135 139 -2457 -1980 1402
1684A402K323r53l029j991N42L021J701j356l363j728J125L113J335k021l168
$$ 1402 3725 2772 -257 -2248 -1706 1315 3016 1660 -1703 -3431 -2306 807 2142 121 -3047
1699c047j738K277L584N20k820k679K10K703K581M91k521k482K52L170K671k09
$$ -3047 -4785 -2508 1076 1596 -1224 -3903 -3693 -990 1591 2082 -439 -2921 -2669 501 3172 2963
1715B963l092k105J068L089J952j478l394j237J553L071Q92j897l301r78J886
$$ 2963 -129 -2234 -1166 1923 3875 2397 -997 -2234 -681 2390 3282 1385 -1916 -2894 -1008
1730a008K709M59k178k871r23K784L022j23k675k645N54K958K384n94k537j911
$$ -1008 1701 2160 -18 -2889 -3812 -1028 1994 1871 -804 -3449 -2895 63 2447 1853 -684 -2595
1746b595O49L377J586p74k936j462J343L043J322j445l322q64K076K977N82k782
$$ -2595 -1946 1431 3017 2243 -693 -2155 -812 2231 3553 2108 -1214 -2078 -2 2975 3557 775
1762G75k582k7K376K304l34k180k257O7K382K682p55k637j980N68K944J775j297
$$ 775 -1807 -1834 542 2846 2512 332 -1925 -1858 524 3206 2451 -186 -2166 -1598 1346 3121 1824
1779A824k820j511J924K496J271j666k585j022J960K579O68j512k671n71K112
$$ 1824 -996 -2507 -583 1913 3184 1518 -1067 -2089 -129 2450 3118 1606 -1065 -1636 476
1794D76K919n2k124k525N59K590J958m58k819j884R98K787Q28r69k511j571Q81
$$ 476 3395 3343 1219 -1306 -747 1843 3801 3343 524 -1360 -362 2425 3253 2284 -227 -1798 -917
1811i17K692R70j454l103p27J564K749N10k293k302M0K361K186o4k254j968N38
$$ -917 1775 2745 1291 -1812 -2539 -975 1774 2284 -9 -2311 -2271 90 2276 2212 -42 -2010 -1472
1828a472K365K311o52k239j884P78K765J813j577k425j595J604K714N55j965k304
$$ -1472 893 3204 2552 313 -1571 -793 1972 3785 2208 -217 -1812 -208 2506 3061 1096 -1208
1844a208r93J606K149l0j541k478n76J903K336Q2k174k494M14K601J902j74k460
$$ -1208 -2201 -595 1554 1524 -17 -2495 -3071 -1168 1168 1250 -924 -3418 -3004 -403 1499 1325 -1135
1861a135j411J142K830R43p02k135r76R91K298J290j501k451j119J838K351K92
$$ -1135 -2546 -1404 1426 2369 1667 -468 -1444 -453 1845 3135 1634 -817 -1936 -98 2253 2545
1877B545k224k476pJ816J803o22k007j938L69J558J846l86k019j793N82K557J448
$$ 2545 321 -2155 -2162 -346 1457 835 -1172 -3110 -2741 -1183 663 277 -1742 -3535 -2953 -396 1052
1894A052o50k363j245J521K654R17j313k590j54J910K246J46j690j727o31J667
$$ 1052 402 -1961 -3206 -1685 969 1886 573 -2017 -2171 -261 1985 2131 441 -1286 -1917 -250
1910b50K073J82k300k138L03J962K002p31k651j490J013K124J218j066k379r15
$$ -250 1823 2005 -295 -2433 -2130 -168 1834 1103 -1548 -3038 -2025 99 1317 251 -2128 -3043
1926c043J141J949J152j095k068j156J944K272L85j460k067r2J983K034l14j898
$$ -3043 -1902 47 1199 104 -1964 -3120 -1176 1096 1481 21 -2046 -2138 -155 1879 1565 -333
1942c33j667O24J662J555L1k284j500O47K090J490r65k037j270R30K579P30j608
$$ -333 -2000 -1376 286 1841 1872 -412 -1912 -1265 825 2315 1350 -687 -1957 -1027 1552 2282 674
1959F74k311k39J381K002J72j611j552m33J665J729p9j914j565K38K044J816n22
$$ 674 -1637 -1876 -495 1507 1679 68 -1484 -1917 -252 1477 1398 -516 -2081 -1843 201 2017 1495
1976A495k022j253P23K215J395j158j902r84J386K101N16q54k189p78J617J783
$$ 1495 -527 -1780 -1057 1158 2553 1395 -507 -1491 -105 1996 2512 1658 -531 -1309 308 2091
1992B091M98j806j825k00J523J832k04k155j516L83J699J310r00j626j212P48
$$ 2091 2589 783 -1042 -1242 281 2113 1909 -246 -1762 -1379 320 1630 730 -896 -2108 -1360
2008a360J651J296l43k259r28J044K469M91j069k282j78J573J800L70j454j624
$$ -1360 291 1587 1244 -1015 -1943 -899 1570 2061 992 -1290 -1468 105 1905 2275 821 -803
2024h03j4R81J939j68j454j830J43J648J573o68k114j403P56K074R13j028j699
$$ -803 -817 164 2103 1935 481 -1349 -1206 442 2015 1347 -767 -2170 -1414 660 1573 545 -1154
2041a154j000J245J368Q03j001j385n77J331J625O27j362j755l0J569J694J8j805
$$ -1154 -2154 -909 459 1262 261 -1124 -1701 -370 1255 1882 520 -1235 -1265 304 1998 2016 211
2058B11j137L65J407J217p25j572j077N20J457J123q01j951j375J315J704Q76
$$ 211 -926 -561 846 2063 1338 -234 -1311 -791 666 1789 988 -963 -2338 -1023 681 1557
2074A557j520k033l79J550J368J25j452r60L2J016J643n0j387j201L18J580J587
$$ 1557 37 -1996 -2375 -825 543 668 -784 -1744 -1712 -696 947 897 -490 -1691 -1373 207 1794
2091A794n14j479j217N98J610J379j048j777m07P01J684K25p05j746n23J007J690
$$ 1794 1280 -199 -1416 -818 792 2171 1123 -654 -1061 -360 1324 1549 844 -902 -1425 -418 1272
2108A272M25j755j533J15J086J525j76j787j161L42J670J096m55j621o39N86J675
$$ 1272 1697 -58 -1591 -1476 -390 1135 959 -828 -1989 -1647 23 1119 664 -957 -1596 -1010 665
2125F65Q47l83j494q63R54J689J044j497j323r09J512J607J66j437j422J67J205
$$ 665 1512 1129 -365 -1228 -274 1415 2459 962 -361 -1270 242 1849 2015 578 -844 -677 528
2142E28J059J0j552j346L5J682J002l57j895j182R44J738O43p33j925k70J019
$$ 528 1587 1597 45 -1301 -1266 416 1418 1061 -834 -2016 -1072 666 1309 576 -1349 -1619 -600
2159f00J677O7p81j343j40J091J374N16j302j140m66J475J393oj355j291K79J082
$$ -600 1077 1144 363 -980 -1120 -29 1345 1861 559 -581 -1047 428 1821 1815 460 -831 -552 530
2177E30J429n22j600j013L13J669M67n30j610q51Q25J738L06j153j431k13J437
$$ 530 1959 1437 -163 -1176 -863 806 1273 743 -867 -1718 -893 845 1151 -2 -1433 -1646 -209
2194b09J095Q5j273j065J7J788N54J18j286o58K8J054J085J09j645q81M42J412
$$ -209 886 971 -302 -1367 -1350 438 992 1110 -176 -834 -806 248 1333 1442 -203 -1084 -642 770
2212G70R99n35j473r19R73J475M18j238j341j73R35J251j02j087j207r9J253R87
$$ 770 1769 1234 -239 -1158 -185 1290 1708 470 -871 -1044 -109 1142 1040 -47 -1254 -1353 -100 887
2230H87j33j337j089L53J242J022k88j654n22M27J313O31m13j136n74M83J402
$$ 887 754 -583 -1672 -1319 -77 945 657 -997 -1519 -1092 221 852 439 -697 -1271 -788 614
$$ [...]
8191F7
##END NTUPLES=NMR FID
##END=
