##TITLE=1H_K-376_3-1
 CDcl3, 8 sc, 
 16.12.2019
##JCAMPDX= 6.0         $$ Bruker NMR JCAMP-DX V2.0
##DATA TYPE= NMR FID
##DATA CLASS= NTUPLES
##ORIGIN= UXNMR, Bruker Analytische Messtechnik GmbH
##OWNER= root
$$ XWIN-NMR		Version 3.5
$$ Mon Dec 16 14:11:43 2019 Russian Standard Time (UT+4h)  she@DPX200
##.OBSERVE FREQUENCY= 200.1315
##.OBSERVE NUCLEUS= ^1H
##.DELAY= (6, 6)
##.ACQUISITION MODE= SIMULTANEOUS
##.ACQUISITION SCHEME= undefined
##.AVERAGES= 8
##.DIGITISER RES= 18
##SPECTROMETER/DATA SYSTEM= spect
##.PULSE SEQUENCE= zg30
##.SOLVENT NAME= CDCl3
##.SHIFT REFERENCE= (INTERNAL, CDCl3, 0, 15.7039)
##AUDIT TRAIL= $$ (NUMBER, WHEN, WHO, WHERE, WHAT)
$$ ##TITLE= Audit trail, XWIN-NMR		Version 3.5
$$ ##JCAMPDX= 5.01
$$ ##ORIGIN= Bruker BioSpin GmbH
$$ ##OWNER= she
$$ F:/spectra/data/she/nmr/H-F/1/audita.txt
$$ ##AUDIT TRAIL=  $$ (NUMBER, WHEN, WHO, WHERE, WHAT)
(   1,<2019-12-16 14:10:53.29 +0400>,<she>,<DPX200>,
      <created by zg, POWCHK disabled, PULCHK disabled
       configuration hash MD5:
       00 E9 B6 7A A2 85 ED C7 34 08 36 98 17 FE 4E 26
       data hash MD5: 16K
       CE 5C 5F FD 65 F4 CF 0E 21 EB 81 42 72 AA 42 BA>)
$$ ##END=
$$ 
$$ hash MD5
$$ D6 72 DE 1E 61 9D ED C5 BD CD 1A 3A 2F 03 B8 7D
##$RELAX= 
##$RELAX= 
##$RELAX= 
##$RELAX= 
##$RELAX= 
##$RELAX= 
$$ Bruker specific parameters
$$ --------------------------
##$DU= <F:/spectra>
##$EXPNO= 1
##$NAME= <H-F>
##$PROCNO= 1
##$TYPE= <nmr>
##$USER= <she>
##$AMP= (0..31)
100 100 100 100 100 100 100 100 100 100 100 100 100 100 100 100 100 100 
100 100 100 100 100 100 100 100 100 100 100 100 100 100 
##$AQSEQ= 0
##$AQ_mod= 1
##$AUNM= <au_zg>
##$AUTOPOS= <>
##$BF1= 200.13
##$BF2= 200.13
##$BF3= 200.13
##$BF4= 200.13
##$BF5= 200.13
##$BF6= 200.13
##$BF7= 200.13
##$BF8= 200.13
##$BYTORDA= 1
##$CFDGTYP= 0
##$CFRGTYP= 5
##$CHEMSTR= <none>
##$CNST= (0..31)
1 1 145 1 1 1 1 1 1 1 1 1 1 1 1 1 1 1 1 1 1 1 1 1 1 1 1 1 1 1 1 1 
##$CPDPRG= <>
##$CPDPRG1= <>
##$CPDPRG2= <>
##$CPDPRG3= <>
##$CPDPRG4= <mlev>
##$CPDPRG5= <mlev>
##$CPDPRG6= <mlev>
##$CPDPRG7= <mlev>
##$CPDPRG8= <mlev>
##$CPDPRGB= <>
##$CPDPRGT= <>
##$D= (0..31)
0 1.2 0 0 0 0 0 0 0 0.06 0 0.03 0 0 0 0 0.0002 0 0 0 0 0 0 0 0 0 0 0 0 
0 0 0 
##$DATE= 1576491052
##$DBL= (0..7)
120 120 120 120 120 120 120 120 
##$DBP= (0..7)
150 150 150 150 150 150 150 150 
##$DBP07= 0
##$DBPNAM0= <>
##$DBPNAM1= <>
##$DBPNAM2= <>
##$DBPNAM3= <>
##$DBPNAM4= <>
##$DBPNAM5= <>
##$DBPNAM6= <>
##$DBPNAM7= <>
##$DBPOAL= (0..7)
0.5 0.5 0.5 0.5 0.5 0.5 0.5 0.5 
##$DBPOFFS= (0..7)
0 0 0 0 0 0 0 0 
##$DE= 6
##$DECBNUC= <off>
##$DECIM= 24
##$DECNUC= <off>
##$DECSTAT= 4
##$DIGMOD= 1
##$DIGTYP= 9
##$DL= (0..7)
0 120 120 120 120 120 120 120 
##$DP= (0..7)
150 150 150 150 150 150 150 150 
##$DP07= 0
##$DPNAME0= <>
##$DPNAME1= <>
##$DPNAME2= <>
##$DPNAME3= <>
##$DPNAME4= <>
##$DPNAME5= <>
##$DPNAME6= <>
##$DPNAME7= <>
##$DPOAL= (0..7)
0.5 0.5 0.5 0.5 0.5 0.5 0.5 0.5 
##$DPOFFS= (0..7)
0 0 0 0 0 0 0 0 
##$DQDMODE= 0
##$DR= 18
##$DS= 0
##$DSLIST= <SSSSSSSSSSSSSSS>
$$ [...]
##$SUBNAM2= <"">
##$SUBNAM3= <"">
##$SUBNAM4= <"">
##$SUBNAM5= <"">
##$SUBNAM6= <"">
##$SUBNAM7= <"">
##$SUBNAM8= <"">
##$SUBNAM9= <"">
##$SW= 24.9337058887773
##$SWIBOX= (0..15)
0 0 2 0 0 0 0 0 0 0 0 0 0 0 0 0 
##$SW_h= 4990.01996007984
##$TD= 16384
##$TD0= 1
##$TE= 0
##$TE2= 300
##$TE3= 300
##$TEG= 300
##$TL= (0..7)
0 120 120 120 120 120 120 120 
##$TP= (0..7)
150 150 150 150 150 150 150 150 
##$TP07= 0
##$TPNAME0= <>
##$TPNAME1= <>
##$TPNAME2= <>
##$TPNAME3= <>
##$TPNAME4= <>
##$TPNAME5= <>
##$TPNAME6= <>
##$TPNAME7= <>
##$TPOAL= (0..7)
0.5 0.5 0.5 0.5 0.5 0.5 0.5 0.5 
##$TPOFFS= (0..7)
0 0 0 0 0 0 0 0 
##$TUNHIN= 0
##$TUNHOUT= 0
##$TUNXOUT= 0
##$USERA1= <user>
##$USERA2= <user>
##$USERA3= <user>
##$USERA4= <user>
##$USERA5= <user>
##$V9= 5
##$VALIST= <valist>
##$VCLIST= <CCCCCCCCCCCCCCC>
##$VD= 0
##$VDLIST= <DDDDDDDDDDDDDDD>
##$VPLIST= <PPPPPPPPPPPPPPP>
##$VTLIST= <TTTTTTTTTTTTTTT>
##$WBST= 1024
##$WBSW= 4
##$XGAIN= (0..3)
0 0 0 0 
##$XL= 0
##$YL= 0
##$YMAX_a= 133651
##$YMIN_a= -89594
##$ZGOPTNS= <>
##$ZL1= 120
##$ZL2= 120
##$ZL3= 120
##$ZL4= 120
##$ABSF1= 10
##$ABSF2= 0
##$ABSG= 5
##$ABSL= 3
##$ALPHA= 0
##$AQORDER= 0
##$ASSFAC= 0
##$ASSFACI= 0
##$ASSFACX= 0
##$ASSWID= 0
##$AUNMP= <proc_1d>
##$AZFE= 0.1
##$AZFW= 0.1
##$BCFW= 1
##$BC_mod= 2
##$BYTORDP= 1
##$COROFFS= 0
##$CY= 11.3945322036743
##$DATMOD= 1
##$DC= 2
##$DFILT= <>
##$DTYPP= 0
##$F1P= 16.9975609425685
##$F2P= -3.02152046262296
##$FCOR= 0.5
##$FTSIZE= 0
##$FT_mod= 4
##$GAMMA= 1
##$GB= 0.15
##$INTBC= 1
##$INTSCL= 1
##$ISEN= 128
##$LB= 0.24
##$LEV0= 0
##$LPBIN= 0
##$MAXI= 10000
##$MC2= 0
##$MEAN= 0
##$ME_mod= 0
##$MI= 1.114404
##$NCOEF= 0
##$NC_proc= 0
##$NLEV= 6
##$NOISF1= 3.799351
##$NOISF2= 2.8
##$NSP= 1
##$NTH_PI= 0
##$NZP= 0
##$OFFSET= 15.70392
##$PC= 1
##$PHC0= -9787.091
##$PHC1= 16.00086
##$PH_mod= 1
##$PKNL= yes
##$PPARMOD= 0
##$PSCAL= 0
##$PSIGN= 0
##$REVERSE= no
##$SF= 200.130013532006
##$SI= 16384
##$SIGF1= 3
##$SIGF2= 2
##$SINO= 400
##$SIOLD= 16384
##$SREGLST= <1H.CDCl3>
##$SSB= 0
##$STSI= 0
##$STSR= 0
##$SW_p= 3612.71676300578
##$SYMM= 0
##$S_DEV= 0
##$TDeff= 0
##$TDoff= 0
##$TI= <>
##$TILT= no
##$TM1= 0
##$TM2= 0
##$TOPLEV= 0
##$USERP1= <user>
##$USERP2= <user>
##$USERP3= <user>
##$USERP4= <user>
##$USERP5= <user>
##$WDW= 1
##$XDIM= 8192
##$YMAX_p= 0
##$YMIN_p= 0
$$ End of Bruker specific parameters
$$ ---------------------------------
##NTUPLES= NMR FID
##VAR_NAME=  TIME,          FID/REAL,        FID/IMAG
##SYMBOL=    X,             R,               I
##VAR_TYPE=  INDEPENDENT,   DEPENDENT,       DEPENDENT
##VAR_FORM=  AFFN,          ASDF,            ASDF
##VAR_DIM=   8192,          8192,            8192
##UNITS=     SECONDS,       ARBITRARY UNITS, ARBITRARY UNITS
##FACTOR=    0.0002004,     1,               1
##FIRST=     0,             0,               0
##LAST=      1.6414764,     0,               0
##MIN=       0,             -89594,          0
##MAX=       1.6414764,     133651,          0
$$ Real data points
##PAGE= N=1
##DATA TABLE= (X++(R..R)), XYDATA
$$ [...]
2087a685J41K5K51J37P7K93J5k5O7k82l7l53P9l89l02O1J38l12K15j47k9M05J88
$$ -1685 -1544 -1519 -1268 -1131 -1054 -761 -746 -771 -704 -986 -1023 -1376 -1297 -1686 -1988 -1927 -1789 -2101 -1886 -2033 -2062 -1657 -1469
2110a469L42L0q0K37L64n02J68K38k09j54L6j35j40k2J21m9L83J50k8L52J25L26
$$ -1469 -1127 -1097 -1177 -940 -576 -1078 -910 -672 -881 -1035 -999 -1134 -1274 -1296 -1175 -1224 -841 -691 -719 -367 -242 84
2132H4Q2l14o8J07j48j02m2o4K5R2j23J26K05K82K96J21p9M60l54p8N47k55q2
$$ 84 166 -148 -216 -109 -257 -359 -401 -465 -440 -348 -471 -345 -140 142 438 559 480 940 586 508 1055 800 718
2155G18l60k73K80l84R6Q7K3N1R5o8J94J47O97l38M97k40J39k67j65j01j02l83
$$ 718 358 85 365 -19 77 164 187 238 333 265 459 606 1303 965 1462 1222 1361 1094 929 828 726 343
2177C43k00k64L6kJ64J22K40j43K28M16J67mK0J56j35m27j05O8m19J51n51l0j7
$$ 343 143 -121 -85 -87 77 199 439 296 524 940 1107 1103 1123 1279 1144 717 612 680 261 412 -139 -169 -186
2200a86k82K47J56j88K95K99J76K64K1L9j47J7k73j6j39j9j40l51j91j7J23k6
$$ -186 -468 -221 -65 -253 42 341 517 781 802 841 694 711 438 422 283 264 124 -227 -418 -435 -312 -338
2222c38%M23L9jL57j31L9l77M59k05k53m4j92q1k76J46p8k18L25QL57l0o0k8K45
$$ -338 -338 85 124 123 480 349 388 11 470 265 12 -32 -224 -305 -581 -435 -513 -731 -406 -398 -41 -71 -131 -159 86
2247H6J87k80p0O5r3n7k45j7n09L85j74J78K10J2M17l16O12r9j06J3R7Q2n56K39
$$ 86 273 -7 -77 -12 -105 -162 -407 -424 -933 -548 -722 -544 -334 -322 95 -221 391 292 186 199 296 378 -178 61
2271F1l6j21k8j53Q9j98L33k4L01J7K64J88p1P9J72p6n8Rm65O1J9j64mn5l1RJ77
$$ 61 25 -96 -124 -277 -188 -386 -53 -77 224 241 505 693 622 701 873 797 739 748 283 344 363 199 195 140 109 118 295
2298B95P6lL14J05K28K40K01r3j44k49Ql82j10n7k69P3k84M34k18L76O1Q6K91
$$ 295 371 368 682 787 1015 1255 1456 1363 1219 970 978 596 486 429 160 233 -51 383 165 541 602 688 979
2321I79J55k32R4L52k31l20J99n11m25J46l05NK55l42l4k10M06J66J05J99K6q9
$$ 979 1134 902 996 1348 1117 797 996 485 60 206 -99 -94 161 -181 -215 -425 -19 147 252 451 477 388
2343C88p8l4o7r7j65k29n00j26L62k07k13Q5K80m47M37L54k69M0O9J06j11J84
$$ 388 310 276 209 112 -53 -282 -782 -908 -546 -753 -966 -881 -601 -1048 -611 -257 -526 -486 -417 -311 -422 -238
2365b38l89QJ01m11j41J0k6%K79j57J47j64M30P4K58k6J05J09l02J24k03j13r5
$$ -238 -627 -619 -518 -929 -1070 -1060 -1086 -1086 -807 -964 -817 -981 -551 -477 -219 -245 -140 -31 -333 -209 -412 -525 -620
2388f20J5K85j67l12N1L05K17J45J97J50J84k21K60K12j91j01j64p5j47o7L4m9
$$ -620 -605 -320 -487 -799 -748 -443 -226 -81 116 266 450 229 489 701 510 409 245 170 23 -44 -10 -59
2410e9j36J11M5K83L39j16K97J14n0J24N8l15j25Q5q2j85q6n8l58JK98j04Q5J79
$$ -59 -195 -84 -39 244 583 467 764 878 828 952 1010 695 570 655 573 388 302 244 -114 -113 185 81 166 345
2434C45J07J61j00j1L99k59r5p6N3k89l71j89j25J21j91O5m7O91j14k2R9J62m0
$$ 345 452 613 513 502 901 642 547 471 524 235 -136 -325 -450 -329 -520 -455 -502 189 75 53 152 314 274
2457B74j33p5K34l06q1n6J71l22mm72M56k67j19K66J41J04L2J71K3J01nj7K08
$$ 274 141 66 300 -6 -87 -143 28 -294 -298 -770 -314 -581 -700 -434 -293 -189 -157 14 37 138 133 116 324
2480C24p90J61J23o5M2k23L81n56K86j20N9L91L45m43L62l8j12O6o6j28M8J76
$$ 324 -466 -305 -182 -247 -205 -428 -47 -603 -317 -437 -378 13 358 -85 277 239 127 193 127 -1 47 223
2502B23j90l83l18N75m30L30J96N1n5K0J3R0J59m4j21J2J99l07m37J29o5J45l21
$$ 223 33 -350 -668 -93 -523 -193 3 54 -1 19 32 122 281 237 116 128 327 20 -417 -288 -353 -208 -529
2525e29J58k4M47L6n25N25O1K39M2k3o4m4l08J22k13k82l16M43l94o9K69j1M02
$$ -529 -371 -395 52 88 -437 88 149 388 430 407 343 299 -9 113 -100 -382 -698 -255 -649 -718 -449 -460 -58
2548e8j0N7J16J81k14r1K37J5j76N7k7k56k7j74j16N3J30n4J45PK76K82j80M6
$$ -58 -68 -11 105 286 72 -19 218 233 57 114 87 -169 -196 -370 -486 -433 -303 -357 -212 -205 71 353 173 219
2572B19L71l55o8j21N0j15q2k32j78N6M9L7N4M9J78kJ14K05j76J85j62k50J81
$$ 219 590 235 167 46 96 -19 -101 -333 -511 -455 -406 -369 -315 -266 -88 -90 24 229 53 238 76 -174 7
2595GK36k10o35K27j41L09l54mJ85j53J23o2M94n4L0k42J88m1l22P0p9j37r6M
$$ 7 243 33 -602 -375 -516 -207 -561 -565 -380 -533 -410 -472 22 -32 -2 -244 -56 -97 -419 -349 -428 -565 -661 -657
2619f57j41q1K08j94o5M81K06j5J17k28L13l71K59j02P5k18j13J95j86j03j22
$$ -657 -798 -879 -671 -865 -930 -449 -243 -258 -141 -369 -56 -427 -168 -270 -195 -413 -526 -331 -517 -620 -742
2640g42N4M97K7O8J61p8L13J11Q3J05k74R7n4L10l19m6n8k30K29N7k71L31J73
$$ -742 -688 -191 -164 -96 65 -13 300 411 494 599 325 422 368 678 359 313 255 25 254 311 40 371 544
2663E44j54O70k57p7J68K96m18N27n43N17o32M3J64k51j00O4O4J39j31L02J76
$$ 544 390 1060 803 726 894 1190 772 1299 756 1273 641 684 848 597 497 561 625 764 633 935 1111
2684A111j52J31q3N02n46O7j66l35M06k87K25m05j71K9L6M86k40K69j20K70j38
$$ 1111 959 1090 1007 1509 963 1030 864 529 935 648 873 468 297 326 362 848 608 877 757 1027 889
2705H89l74o0K12q4k19q9k89K50m01K72r3m08J82M2k31L03J20k52M34j31j27q4
$$ 889 515 455 667 583 364 275 -14 236 -165 107 14 -394 -212 -170 -401 -98 22 -230 204 73 -54 -138
2727a38l1qk81o5N4J03l68L7J27j47K65MJ56J21K1p5J5J26O9m97M67m79k8L28
$$ -138 -169 -177 -458 -523 -469 -366 -734 -697 -570 -717 -452 -448 -292 -171 -150 -225 -210 -84 -15 -512 -45 -524 -552 -224
2751b24m91J68j21Q9j22N6K65%K2JJ34j07q5N63k68K34n37pK22j84o4j56q8J30
$$ -224 -715 -547 -668 -579 -701 -645 -380 -380 -358 -357 -223 -330 -415 148 -120 114 -423 -430 -208 -392 -456 -612 -700 -570
2775e70O4K10J29J69O5k58K93L5N0L27p04M9M6J02l95N8j12J71k29J39K28L0P8
$$ -570 -506 -296 -167 2 67 -191 102 137 187 514 -190 -141 -95 7 -388 -330 -442 -271 -500 -361 -133 -103 -25
2798b5K1L38l29J98j42J47m6L34k34m16K17j52q1j5N4o0l1L52K90k57O4J08R6
$$ -25 -4 334 5 203 61 208 162 496 262 -154 63 -89 -170 -185 -131 -191 -222 130 420 163 227 335 431
2821D31j75j88l4r3J69l30k6j48k83p7J08K89Nn2L86k81J00J69p7j71K16k67r9
$$ 431 256 68 34 -59 110 -220 -246 -394 -677 -754 -646 -357 -352 -404 -18 -299 -199 -30 -107 -278 -62 -329 -428
2844d28N58p50M05n17J64J06j13l62J64N1L35N9m1K12j46n9P6K26o08L37k24j17
$$ -428 130 -620 -215 -732 -568 -462 -575 -937 -773 -722 -387 -328 -369 -157 -303 -362 -286 -60 -668 -331 -555 -672
2866f72m6k9n5R3J7K47j88k4K61Q8k14J70J4l27L25k30l15J7J67k33k39J89j58
$$ -672 -718 -747 -802 -709 -692 -445 -633 -657 -396 -308 -522 -352 -338 -665 -340 -570 -885 -868 -701 -934 -1173 -984 -1142
2889a142n1J97L37K9k07K22K27K2j90L26k41q2J20j26j69j84K61j47K57J19k23
$$ -1142 -1193 -996 -659 -630 -837 -615 -388 -366 -556 -230 -471 -553 -433 -559 -728 -912 -651 -798 -541 -422 -645
2910f45K68L64l37M74k05J97n1o1J3j45J94J2j24Q2m15K86l89M05M5J30J26k22
$$ -645 -377 -13 -350 124 -81 116 65 4 17 -128 66 78 -46 36 -379 -93 -482 -77 -32 98 224 2
2932BK94J74M1l70L22J27k60k26Q3J97j13j3k27K1J87M6J99k16N7j76L23l14P9
$$ 2 296 470 511 141 463 590 330 104 187 384 271 258 31 52 239 285 484 268 325 149 472 158 237
2955B37L19n00J32k18Q5J24k8k13R9l23L7M0J10J34L27l22M43k22K03k35J24j79
$$ 237 556 56 188 -30 55 179 151 -62 37 -286 -249 -209 -99 35 362 40 483 261 464 229 353 174
2977A74k35K43j42n2k21L14l50M04j44Oj46J35J14kJ31k3K23j64j69k10J13N0
$$ 174 -61 182 40 -12 -233 81 -269 135 -9 -3 -149 -14 100 98 229 206 429 265 96 -114 -1 49
2999D9p7k83l74M39j49K12j18J17P6L9r0J20J66l13M25l30r7M8K73m59KL06k34
$$ 49 -28 -311 -685 -246 -395 -183 -301 -184 -108 -69 -159 -39 127 -186 239 -91 -188 -140 133 -326 -324 -18 -252
3022b52j55K47j57J96M4n3j0K37j23L53m66L5K10j1k78oJ07J21O6k98J55K15q7
$$ -252 -407 -160 -317 -121 -77 -130 -140 97 -26 327 -139 -104 106 95 -183 -189 -82 39 105 -193 -38 177 90
3045I0K61j14P3Jj8J37j91p4K70l68o4K23k61nL32j27j82J68M1L27j11O8j57K8
$$ 90 351 237 310 311 293 430 239 165 435 67 3 226 -35 -40 292 165 -17 151 192 519 408 476 319 347
3069C47k7J98R6l19K04j61o9L43m00J64l74L39P9j22L72l19j21K38J48l30K9K07
$$ 347 320 518 614 295 499 338 269 612 212 376 2 341 420 298 670 351 230 468 616 286 315 522
3091E22j24J15N5m19j05J03L3J34j69j08N3P1j57J00K72k88P2M7J24l50j7J97
$$ 522 398 513 568 149 44 147 180 314 145 37 90 161 4 104 376 88 160 207 331 -19 -36 161
3113A61j85k28J90j47K14p6p5K3m7M8mK5J49K32j61j49j58J80k87K04k12N3J63
$$ 161 -24 -252 -62 -209 5 -71 -146 -123 -170 -122 -126 -101 48 280 119 -30 -188 -8 -295 -91 -303 -250 -87
3136h7k87J77k29L6L8L28j33L82l95R2p7O4j11l0J63k91l45N12k26J2N8J31P1
$$ -87 -374 -197 -426 -390 -352 -24 -157 225 -170 -78 -155 -91 -202 -232 -69 -360 -705 -193 -419 -407 -349 -218 -147
3159a47K3j71L0K27K45Oj53j54J23K12k07j04J45j51k85K43n0L29J10j66R0J06
$$ -147 -124 -295 -265 -38 207 213 60 -94 29 241 34 -70 75 -76 -361 -118 -168 161 271 105 195 301
3181C01R9K2q5m4n0J69J29k28K08l58j10L02j97k33K49J6k58J98n9j36K33K08
$$ 301 400 422 337 293 243 412 541 313 521 163 53 355 158 -75 174 190 -68 130 71 -65 168 376
3203C76j20K54m19j26O3k1K2l73j59M32r1L4K13k14K09j61P7j29J00J80k79j4
$$ 376 256 510 91 -35 28 7 29 -344 -503 -71 -162 -128 85 -129 80 -81 -4 -133 -33 147 -132 -146
3225a46J92J02m26k0M3K39%l99M09j29o1J1J5K43m8q9Q9j98J99L17l96O4m35L78
$$ -146 46 148 -278 -298 -255 -16 -16 -415 -6 -135 -196 -185 -170 73 25 -64 25 -173 26 343 -53 11 -424 -46
3249d6J09n0L5l25M2j0J21k3K66j05k58K06J17k46L40j76k64J48L9j43Q8j51M0
$$ -46 63 13 48 -277 -235 -245 -124 -147 119 14 -244 -38 79 -167 173 -3 -267 -119 -80 -223 -135 -286 -246
3272b46j20P1L3N23m38K03J98j38M0j37K63j35j19J8J44k90K18K86j96j98K19
$$ -246 -366 -295 -262 261 -177 26 224 86 126 -11 252 117 -2 16 160 -130 88 374 178 -20 199
3293A99J50j36J91k68K85Kj45J35o4J7l72M0J59l5J16l0j13R8l9j27L46k4m2N8
$$ 199 349 213 404 136 421 423 278 413 349 366 -6 34 193 158 274 244 131 229 190 63 409 385 343 401
3317D01j62J61j84M25m96j86N17k59k67J19j19j55o3N45k88K06j46kL74l5Po7
$$ 401 239 400 216 641 145 -41 476 217 -50 69 -50 -205 -268 277 -11 195 49 47 421 386 393 326
3339C26l4m5l91L19K1j14L7O8j15j10j3L51R0p0k57M42q8m04R8J06j9m5J51k41
$$ 326 292 247 -144 175 196 82 119 187 72 -38 -51 300 390 320 63 505 417 13 111 217 198 153 304 63
3363F3p5k67M5L27l85L25j00r1K64q2j29M4J08k93M4M3j11k36K23k33j93N41n15
$$ 63 -12 -279 -234 93 -292 33 -67 -158 106 24 -105 -61 47 -246 -202 -159 -270 -506 -283 -516 -709 -168 -683
3386f83M41j05m67p1M86j92O2N1Q9k8k42J85n6k73L01k27J53J93j00r1jL34k76
$$ -683 -242 -347 -814 -885 -399 -591 -529 -478 -389 -417 -659 -474 -530 -803 -502 -729 -576 -383 -483 -574 -575 -241 -517
3409e17J2l5M72l93j80K80l6K98K5l49L1J39k92R3K05k10L02k00K49K06r7j51
$$ -517 -505 -540 -68 -461 -641 -361 -397 -99 -74 -423 -392 -253 -545 -452 -247 -457 -155 -355 -106 100 3 -148
3431a48j46K41J96m79K43kK3L5k99J94n3N3j32L15j7l89L05J47O0k33L28O0j90
$$ -148 -294 -53 143 -336 -93 -95 -72 -37 -336 -142 -195 -142 -274 41 24 -365 -60 87 147 -86 242 302 112
3454A12O4nJ30j86J91q7k50J08Ok3j1N1nJ21L91l41J55q1k80N44m40L35j72k57
$$ 112 176 171 301 115 306 219 -31 77 83 60 49 100 95 216 607 266 421 340 60 604 164 499 327 70
3478G0N18m48O3j31q5J41J66l74M2M25r1k80J6J44j57k77K41J0k68pl9M08l09
$$ 70 588 140 203 72 -13 128 294 -80 -38 387 296 16 32 176 19 -258 -17 -7 -275 -282 -321 87 -222
3501b22l68M99j45J58O1q2J74j32P2j77J55l69L11j88K72m63R1j10j32M21k30
$$ -222 -590 -91 -236 -78 -17 -99 75 -57 15 -162 -7 -376 -65 -253 19 -444 -353 -463 -595 -174 -404
3522d04m0J02M43k28L39n98M17k27k7L69k72k04R6q8K74j21J19l33K03L2k9L56
$$ -404 -444 -342 101 -127 212 -386 31 -196 -223 146 -126 -330 -234 -322 -48 -169 -50 -383 -180 -148 -177 179
3544A79j22j46Q3J50j50k17J44RK02k5l3j22N7%k31OR3K53l6P7j08p3L22k05O5
$$ 179 57 -89 -6 144 -6 -223 -79 -70 132 107 74 -48 9 9 -222 -216 -123 130 94 171 63 -10 312 107 172
3569A72R0k69L59k53j03p7L08l30K8K31J42O5k98J00j76P3K28j61N9r3j91K00
$$ 172 262 -7 352 99 -4 -81 227 -103 -75 156 298 363 65 165 -11 62 290 129 188 95 -96 104
3591A04l12MJ67J58j76J5M0K09j89k5l0r8L91j96k95L48k25L03n08J08K71l89
$$ 104 -208 -204 -37 121 -55 -40 0 209 20 -5 -35 -133 258 62 -233 115 -110 193 -315 -207 64 -325
3613c25J34j37K22j40M74k78J34l57K91r4J73n3R1j86k05K96j93J7q4Rj78J17
$$ -325 -191 -328 -106 -246 228 -50 84 -273 18 -76 97 44 135 -51 -256 40 -153 -136 -220 -211 -389 -272
3635b72L4l1M8n8K6K08j07P1mj91J33K7n8m4K1O4j70p3J83K63n25j7K23m9K00
$$ -272 -238 -269 -221 -279 -253 -45 -152 -81 -85 -276 -143 -116 -174 -218 -197 -133 -303 -376 -193 70 -455 -472 -249 -298 -98
3660i8J2k69K36l2J74k65J01k52J28O1o2K24l02M9N2kJ37J19J17J14l03j85J40
$$ -98 -86 -355 -119 -151 23 -242 -141 -393 -265 -204 -266 -42 -344 -295 -243 -245 -108 11 128 242 -61 -246 -106
3683a06K23j51J7p7j27J20K65m26R8K11j36k6J83o4o1L1k8J08L10j84j76J36k
$$ -106 117 -34 -17 -94 -221 -101 164 -262 -164 47 -89 -115 68 4 -57 -26 -54 54 364 180 4 140 138
3706A38J27K5j24j53K35k21J07J94q3nl2N2l18J77K14l78L03J51o3nj41L39m10
$$ 138 265 290 166 13 248 27 134 328 245 240 208 260 -58 119 333 -45 258 409 346 341 200 539 129
3729A29L81k31k10K30R6l45L70L1l18K41j33j87K63j50O1j13J43j3p9j15pJ17
$$ 129 510 279 69 299 395 50 420 451 133 374 241 54 317 167 228 115 258 245 166 51 44 161
3751A61K4j41L84j57n9l01K23k89L09K06m83L08k48k2J66l36Q9J52J45L9n70M56
$$ 161 185 44 428 271 212 -89 134 -155 154 360 -123 185 -63 -85 81 -255 -166 -14 131 170 -400 56
3773E6j41k23J40k7O8j50k9L08o7j94M70l54j21O4K46n57K79K9K4N04m38J54j36
$$ 56 -85 -308 -168 -195 -127 -277 -306 2 -65 -259 211 -143 -264 -200 46 -511 -232 -203 -179 325 -113 41 -95
3796i5j97L90l31L35k96j02J92o7j18K04L3k11k87L16L98J55k94p9K52n41J64
$$ -95 -292 98 -233 102 -194 -296 -104 -171 -289 -85 -52 -263 -550 -234 164 319 25 -54 198 -343 -179
3817a79J77p2J3K29L3j69J02k99J06M1J00M2J11k60KL41k70K14k33j38J88K18
$$ -179 -2 -74 -61 168 201 32 134 -165 -59 -18 82 124 235 -25 -23 318 48 262 29 -109 79 297
3839B97j86j94L86k13K04j01q2j03JR7M3k40k3L21m4J58j65J79j81k01J41j39
$$ 297 111 -83 303 90 294 193 111 8 9 106 149 -91 -114 207 163 321 156 335 154 -47 94 -45
3861d5j50L17j02j04M03k58N5J3j91K95j90l5J44q3M7j13R4k6N0k52m9J61j19
$$ -45 -195 122 20 -84 319 61 116 129 -62 233 43 8 152 69 116 3 97 71 121 -131 -180 -19 -138
3884a38J15N4J90l02N6K5l7k09R2L40k42j09j00M32k25m18K54Q2l58M00k13M8
$$ -138 -23 31 221 -81 -25 0 -37 -246 -154 186 -56 -165 -265 167 -58 -476 -222 -140 -498 -98 -311 -263
3906b63J14j13M4L5J54k69j32j61O23m10K2K04m21M65j13J15j85K04o1P2J06k07
$$ -263 -149 -262 -218 -183 -29 -298 -430 -591 32 -378 -356 -152 -573 -108 -221 -106 -291 -87 -148 -76 30 -177
3928a77L14j63l01M95k74M0k5q2k71N81k14K52k50K07j35j2J14Jj19O3o0P9J00
$$ -177 137 -26 -327 168 -106 -66 -91 -173 -444 137 -77 175 -75 132 -3 -15 99 100 -19 44 -16 63 163
3951A63L3m13J34q0L4K84l8j03lk1j03K67Q6n6k4j57J29j62K56o4K24l39J5o4
$$ 163 196 -217 -83 -163 -129 155 117 14 11 -10 -113 154 240 184 160 3 132 -30 226 162 386 47 62 -2
3975bL9J58q4n8j88K15J1j43K25K80l09J00k87N01k1l06l51Q81l23R7Nk70L8j53
$$ -2 37 195 111 53 -135 80 91 -52 173 453 144 244 -43 458 437 131 -220 661 338 435 440 170 208 55
3999E5Q7j8L2N5r1J65Kj00k8J00k45M00j86l85J00J46j83J25j08l79K35L32k72
$$ 55 142 124 156 211 120 285 287 187 159 259 14 414 228 -157 -57 89 -94 31 -77 -456 -221 111 -161
4022a61k30K83J1M6l4O0k70L5K98k02p4K93p6k66K32Q2k30L34j74j11k13J62m2
$$ -161 -391 -108 -97 -51 -85 -25 -295 -260 38 -164 -238 55 -21 -287 -55 27 -203 131 -43 -154 -367 -205 -247
4045b47m4J86L54m06J52kK46l48N7R7L7K6J69q4r1J20L8o12N39j24j05J06j52
$$ -247 -291 -105 249 -157 -5 -7 239 -109 -52 45 82 108 277 193 102 222 260 -352 187 63 -42 64 -88
4068h8J80L22k91P4j41N7LK25l39J21j19l4J21k68O9N5j25m8M88k35p8K4J43j
$$ -88 92 414 123 197 56 113 116 341 2 123 4 -30 91 -177 -108 -53 -178 -226 262 27 -51 -27 116 115
4092A15J35k87j69M47nj16N5K5k11K65j29r1J22k40K99j75K93l28J8r3oL48l78
$$ 115 250 -37 -206 241 236 120 175 200 -11 254 125 34 156 -84 215 40 333 5 23 -70 -76 272 -106
4115a06Q9j3K35M6J59n4O9j79j26o8O9K25m27Q8J26j81K09j8k98J59K50l68o1
$$ -106 -17 -30 205 251 410 356 425 246 120 52 121 346 -81 7 133 -48 161 143 -155 4 254 -114 -175
4138a75J67k32M01l04J42j92L40k35q1q1k21J35R1Q8J27O2m3mj85J56M9R6j15
$$ -175 -8 -240 161 -143 -1 -193 147 -88 -169 -250 -471 -336 -245 -157 -30 32 -11 -15 -200 -44 5 101 -14
4161a4o9n8j06J71l40K94L8k18M35k47j02K96k08J63m05K25pj67K6K08o5k3j46
$$ -14 -83 -141 -247 -76 -416 -122 -84 -302 133 -114 -216 80 -128 35 -370 -145 -152 -319 -293 -85 -150 -173 -319
4184c19J21P7Q8k17k92N18m22K61r1PJ70J91n2l49l9L68l6k90L83l44J18K6l45
$$ -319 -198 -121 -33 -250 -542 -24 -446 -185 -276 -269 -99 92 40 -309 -348 20 -16 -306 77 -267 -149 -123 -468
4207d68K18K6J61k63j3q9K40L5R3l6J67j73M4m8K06k70K65JK26j49k78K49j8K04
$$ -468 -250 -224 -63 -326 -339 -428 -188 -153 -60 -96 71 -102 -58 -106 100 -170 95 96 322 173 -105 144 126 330
4231C30o9l4K10k17M9J33k76j92L84q5J94j14m23J99O7m1K1R9m50K00k8J94k53
$$ 330 261 227 437 220 269 402 126 -66 318 233 427 313 -110 89 156 115 136 235 -215 -15 -43 151 -102
4254a02K29Q4k39J03m6Nq4J24j6ll4j18j2J44P2n0J0p0J09j50j59J27j09p0K50
$$ -102 127 211 -28 75 29 34 -50 74 58 55 21 -97 -109 35 107 57 67 -3 106 -44 -203 -76 -185 -255 -5
4279el04L03Ml15N48l22n0K36q2j01K8j38Q1RJ08p5j89J68J42l87J83kj5J29J02
$$ -5 -309 -6 -2 -317 231 -91 -141 95 13 -88 -60 -198 -117 -108 0 -75 -264 -96 46 -341 -158 -160 -175 -46 56
4304E6l15J79j00k65L89k36J57J38j0k22o0M88l18J67k79q5L20k59n3J70l7k7
$$ 56 -259 -80 -180 -445 -56 -292 -135 3 -7 -229 -289 199 -119 48 -231 -316 4 -255 -308 -138 -175 -202
4326b02j38L53j2l0r7k79K07L5K59k37L06J2j57L65l83M6j89L26q9j33L91ml67
$$ -202 -340 13 1 -29 -126 -405 -198 -163 96 -141 165 177 20 385 2 48 -141 185 96 -37 354 350 -17
4349a7q0O5J48j63L89m5k61m0n9L40k38N5l07J15K81j46k4o7O5j0J26j72K35l7
$$ -17 -97 -32 116 -47 342 297 36 -4 -63 277 39 94 -213 -98 183 37 13 -54 11 1 127 -45 190 153
4373A53J68j48o9k46J27K53p9k3j31K9N3L1k56L49k98k12L15N7J37J03m94K12
$$ 153 321 173 104 -142 -15 238 159 136 5 34 87 118 -138 211 -87 -299 16 73 210 313 -181 31
4395C1j35R5J91m9k88L34j99qm1L6K0k8j04j14L2J03J04r2k26L15j02J60m9l29
$$ 31 -104 -9 182 133 -155 179 -20 -28 -69 -33 -13 -41 -145 -259 -227 -124 -20 -112 -338 -23 -125 35 -14 -343
4419c43J68N1J09j61K63Pk25J80l05J77j59K09N9j90Q2jj52J84K22j76M4k01n3
$$ -343 -175 -124 -15 -176 87 94 -131 49 -256 -79 -238 -29 30 -160 -78 -79 -231 -47 175 -1 43 -158 -211
4442b11J1k41L56n6N9K12k04M0O6r1K7j19l1P6K1J30nJm12L39J87k6J23l22j21
$$ -211 -200 -441 -85 -141 -82 130 -74 -34 32 -59 -32 -151 -182 -106 -85 45 40 41 -371 -32 155 129 252 -70 -191
4467a91K61J46R8m87P1oJ43O0Mj23M5K59l73K05j58L47n4P3l42J01P6r7J20O1
$$ -191 70 216 314 -173 -102 -108 35 95 99 -24 21 280 -93 112 -46 301 247 320 -22 79 155 58 178 239
4491B39j20K59n30K86J15k48K32n0J5q8J39J86l35K83k99J4M46l23m2l7n7L00
$$ 239 119 378 -152 134 249 1 233 183 198 110 249 435 100 383 84 98 544 221 179 142 85 385
4513C85k11k78M19j13J31j97j71K27N4r0p1j30K57k23M36k12k91K99l14J23j33
$$ 385 174 -104 315 202 333 136 -35 192 246 156 85 -45 212 -11 425 213 -78 221 -93 30 -103
4534a03J03Q0L9j17k49K40l09K82j44k39L59J2K46k10r3j37L36K6n80L04q9k18
$$ -103 0 80 119 2 -247 -7 -316 -34 -178 -417 -58 -46 200 -10 -103 -240 96 122 -458 -154 -243 -461
4556d61N06k44Q9j42M7J07j87J62n3K21j33k55l2L33O8j8J75l39q3n3K33j1k3
$$ -461 45 -199 -110 -252 -205 -98 -285 -123 -176 45 -88 -343 -375 -42 26 8 183 -156 -239 -292 -59 -70 -93
4579i3k49M83l18L8M8J02o2m6k01K88K04m03O38o12J78j82M2K2n6K59k41J84p8
$$ -93 -342 141 -177 -139 -91 11 -51 -97 -298 -10 194 -209 429 -183 -5 -187 -145 -123 -179 80 -161 23 -55
4602e5K22L7l38K16q0j99P7J91L0m2J0J36j63k15k6L95j38m2j20K80K5o6mR5o7
$$ -55 167 204 -134 82 2 -197 -120 71 101 59 69 205 42 -173 -199 196 58 16 -104 176 201 135 131 226 159
4627A59r6j27N5O2k6q4L19J79l83K84n09J35j44J57K35o7KK3k28R5J17j22M16
$$ 159 63 -64 -9 53 27 -57 262 441 58 342 -167 -32 -176 -19 216 149 151 174 -54 41 158 36 452
4650D52n97N18k99K77k71pj66J45J26k57J00O6j59k7J86j40j14q2P4L3R0j0l05
$$ 452 -145 373 74 351 80 73 -93 52 178 -79 21 87 -72 -99 87 -53 -167 -249 -175 -142 -52 -62 -367
4673c67N36M6l08P8m72K91j20J44J55M8M46m34r8K60l62N5J55J05m92O34l70O0
$$ -367 169 215 -93 -15 -487 -196 -316 -172 -17 31 477 43 -55 205 -157 -102 53 158 -334 300 -70 -10
4695a0k81L83M4j2m90K27L34k20L1r7j35n4K59m1K04m22O54n06O7J38N2l4J75
$$ -10 -291 92 136 124 -366 -139 195 -25 6 -91 -226 -280 -21 -62 142 -280 374 -132 -65 73 125 91 266
4718B66l54J65j10j76K27j19m8K46j50j42R4J30k13J28mJ21J79j93K22l46K76
$$ 266 -88 77 -33 -209 18 -101 -149 97 -53 -195 -101 29 -184 -56 -60 61 240 47 269 -77 199
4739A99J08j69l07M00m22J53jj14K60R2q7P5k00M2J08p7L0J36K7o6j09M8O7oo6
$$ 199 307 138 -169 231 -191 -38 -39 -153 107 199 112 187 -13 29 137 60 90 226 253 187 78 126 193 187 121
4764A21J25j00J06k05J64j20j70J78J39m7R5j25oK3k5l2j12rP3K65l36j95N62
$$ 121 246 146 252 47 211 91 -79 99 238 191 286 161 155 178 153 121 9 0 73 338 2 -193 369
4787C69q9m15N6N4K43j94J50K8Lm74L01J11k62J83j25M5j54L63j80J3lk66M17
$$ 369 280 -135 -79 -25 218 24 174 202 205 -269 32 143 -119 64 -61 -16 -170 193 13 26 23 -243 174
4810A74m18L22j6j52J09j13K33k82k21K69L7jk51L43J09k91N1J79n8l01K79J3
$$ 174 -244 78 62 -90 19 -94 139 -143 -364 -95 -58 -59 -310 33 142 -149 -98 81 23 -278 1 14
4832A4j69K48m58L26M14o70K40J61j56j22J91j07N6R4m35K60K28Nl36J06j09M3
$$ 14 -155 93 -365 -39 375 -295 -55 106 -50 -172 19 -88 -32 62 -373 -113 115 120 -216 -110 -219 -176
4854a76K21Ll02J03J04P2O4j01J58k95QL33rM8j91L32j18k74l3l7J24K81l77L21
$$ -176 45 48 -254 -151 -47 25 89 -12 146 -149 -141 192 183 231 40 372 254 -20 -53 -90 34 315 -62 259
4878B59j0K22o5l18K06k68J2J44j02l0J61j60J18k89J37l1K31j50L8j5J33j37
$$ 259 249 471 406 88 294 26 38 182 80 50 211 51 169 -120 17 -14 217 67 105 90 223 86
4900H6N6L9l08n6J69L01l03N7N6k41J50q6J04j27l2O2m1pj8j40K12J34J17k17
$$ 86 142 181 -127 -183 -14 287 -16 41 97 -144 6 -80 24 -103 -135 -73 -114 -121 -139 -279 -67 67 184 -33
4924c3k17K44K44j94k18K28n4N3j40J00k48Q1K6L46j74k13J72p3k15K36n8J88
$$ -33 -250 -6 238 44 -174 54 0 53 -87 13 -235 -154 -128 218 44 -169 3 -70 -285 -49 -107 81
4946H1QQ0k70p9k38K30l9p3K24Rj75j54L70L8k04K71N5Ln2l94M0K04o5l94R13
$$ 81 89 169 -101 -180 -418 -188 -227 -300 -76 -67 -242 -396 -26 12 -192 79 134 137 85 -309 -269 -65 -130 -524 389
4971C89o56K31J10o05M58k7k6R9J25k80M3J72J91j53j49L02l56J53J0m71M45P4
$$ 389 -267 -36 74 -531 -73 -100 -126 -27 98 -182 -139 33 224 71 -78 224 -132 21 31 -440 5 79
4993G9j71K81l8R1j17j51k16K41M6j7q8J78Q4k99J15O4k59L75j37L1j91M63m98
$$ 79 -92 189 151 242 125 -26 -242 -1 45 28 -60 118 202 -97 18 82 -177 198 61 92 -99 364 -134
5016a34J20M19j72l08J10K9OJ43j21N0k2q3J47k38r5K16J7j3n1k45M43m00P4o9
$$ -134 -14 405 233 -75 35 64 70 213 92 142 120 37 184 -54 -149 67 84 71 20 -225 218 -182 -108 -177
5040a77L21J7k29M68n46L90k66R3j1K3j09j39P4p0J29m2K18j83P0j02J22p4N3
$$ -177 144 161 -68 400 -146 244 -22 71 60 83 -26 -165 -91 -161 -32 -74 144 -39 31 -71 51 -23 30
5063C0jl89K82P7l59L05J61j90j73M2J14L60p3m52J55J2J0NLq5j3J09J37m4J1
$$ 30 29 -360 -78 -1 -360 -55 106 -84 -257 -215 -101 259 186 -266 -111 -99 -89 -84 -81 -166 -179 -70 67 23 34
5088C4j58P1k35J0M01j22l43K47n1RK39k54r6J27jl21M31K04m31M33j44k51p1
$$ 34 -124 -53 -288 -278 123 1 -342 -95 -146 -137 102 -152 -248 -121 -122 -443 -12 192 -239 194 50 -201 -272
5111b72L81j88J95j52j6N4J25P6j22N0O1O6n35M13k43K36o4l4l9L40o28N25L8
$$ -272 109 -79 116 -36 -52 2 127 203 81 131 192 258 -277 136 -107 129 65 31 -8 332 -296 229 267
5134B67l33j6J55K94l40K41M9p4k82N00m90j9M27n57J07L21l65L86L6k9k60K08
$$ 267 -66 -82 73 367 27 268 317 243 -39 461 -29 -48 379 -178 -71 250 -115 271 307 278 18 226
5156B26j66L68p67O51l39l5J82k71K24k13L13k86J83Q7k24l2m6K7L45q4j85J05
$$ 226 60 428 -339 312 -27 -62 120 -151 73 -140 173 -113 70 157 -67 -99 -145 -118 227 143 -42 63
5178F3k5Jj33K69J4m08J47J05k21K86Pl1K88k03k08N6o6J14j30R7j40j05J80o2
$$ 63 38 39 -94 175 189 -219 -72 33 -188 98 105 74 362 159 -49 7 -59 55 -75 22 -118 -223 -43 -105
5202a05j60L08j15k67M45j28j08J47k16J2m9J37J71k05r9M3J69pOJ38k99K0k49
$$ -105 -265 43 -72 -339 106 -22 -130 17 -199 -187 -236 -99 72 -133 -232 -189 -20 -27 -21 117 -182 -162 -411
5225d11K6J70o9L32k44J83j22J77N8n5j36LJ93j66p9J37k45L68l23K12rk9O9j92
$$ -411 -385 -215 -284 48 -196 -13 -135 42 100 45 -91 -88 105 -61 -140 -3 -248 120 -203 9 0 -29 40 -152
5249a52K17l58N01j60K7J04j18J98j12l94M56J3q7k89J3J79j01N7J36K7l7m6j04
$$ -152 65 -293 208 48 75 179 61 259 147 -247 209 222 135 -154 -141 38 -63 -6 130 157 120 74 -30
5272c0K78p7J35jk72n1K66q9l94L40l0L87l02r5l1o5J77k49L42k51K30m4j28m0
$$ -30 248 171 306 305 33 -18 248 159 -235 105 75 462 160 65 34 -31 146 -103 239 -12 218 174 46 6
5296FJ53p2r0K25k48K50j07j19K37j59k42L14k90L47j94J28k26J00j2J47k6j88
$$ 6 159 87 -3 222 -26 224 117 -2 235 76 -166 148 -142 205 11 139 -87 13 1 148 122 -66
5318f6K4J4K71r6k68J84j70k6K56k30J74P4j0p0j37k42K82n1J90l88K68m5j20
$$ -66 -42 -28 243 147 -121 63 -107 -133 123 -107 67 141 131 61 -76 -318 -36 -87 103 -285 -17 -62 -182
5341a82OJ36R8j70k49M39m07L43J03O6m19K91o9k06K61r8r4j32J60J73l16L59
$$ -182 -176 -40 58 -112 -361 78 -329 14 117 183 -236 55 -14 -220 41 -57 -151 -283 -123 50 -266 93
5363I3p5j98K87k44M05j09j99L0p7J73m63K84J22j37K55m73K68J37k53K00m8J52
$$ 93 18 -180 107 -137 268 159 -40 -10 -87 86 -377 -93 29 -108 147 -326 -58 79 -174 26 -22 130
5385A30j63j09J00K01J42j32j07k62K8K29p7Q1J02r9r0j2L19l3m21K32k0k39j4
$$ 130 -33 -142 -42 159 301 169 62 -200 -172 57 -20 61 163 64 -26 -38 281 248 -173 59 39 -200 -214
5408b14K01M2K7J10J15k16K5O1j52K41j94j19M6M7j64L79J58l90P4O8J14k74K39
$$ -214 -13 29 56 166 281 65 90 151 -1 240 46 -73 -27 20 -144 235 393 3 77 145 259 -15 224
5431B24n5J05j38k3l10K65N0k01j32P6K66p1j86L00k63J78j30j47J17J41l0J81
$$ 224 169 274 136 113 -197 68 118 -83 -215 -139 127 56 -130 170 -93 85 -45 -192 -75 66 36 217
5453B17j33j58p1R5N6l00K07j00J01j9J09JJ36k20L35k76K94n39M68j6j89J39
$$ 217 84 -74 -145 -50 6 -294 -87 -187 -86 -105 4 5 141 -79 256 -20 274 -265 203 187 -2 137
5475A37m02L20j85K1P0J30J81l74j63J22K13P4m1m5k18K74j19J9j75n3L90j4j89
$$ 137 -265 55 -130 -109 -39 91 272 -102 -265 -143 70 144 103 58 -160 114 -5 14 -161 -214 176 162 -27
5498b7j56N14l32J73l54M0p5J52K41j05j20r8M33j81K23m35M20m23L03j50q1L5
$$ -27 -183 331 -1 172 -182 -142 -217 -65 176 71 -49 -147 286 105 328 -107 313 -110 193 43 -38 -3
5520cj06J17p6K27lJ10r1j43K41K3l03K22r3l8m7N3O2l39L63o7k07K28m0m7o2
$$ -3 -109 8 -68 159 156 266 175 32 273 296 -7 215 122 84 37 90 152 -187 176 109 -98 130 90 43 -19
5545a9L77j05q6k29Pq4J16K59l4l52K5L89k17m4j02P8J56m15J04J57J33l19L18
$$ -19 358 253 167 -62 -55 -139 -23 236 202 -150 -125 264 47 3 -99 -21 135 -280 -176 -19 114 -205 113
5568A13J53k37k79J31p3J2K36n0J22k28K17o3k35J6J97lJ31j11r4L42m10lj90
$$ 113 266 29 -250 -119 -192 -180 56 6 128 -100 117 54 -181 -165 32 29 160 49 -45 297 -113 -116 -306
5591c06N5K37k4J4l33N09j81j08P8k64K53K82k88j63J3J48n5l4K34k6j49n6K1
$$ -306 -251 -14 -38 -24 -357 152 -29 -137 -59 -323 -70 212 -76 -239 -226 -78 -133 -167 67 41 -108 -164 -143
5614a43L30q0l15J09j19p6M12L3m77L58jj03R9j87l8P7k4q4N76k58Q8m3J74l80
$$ -143 187 107 -208 -99 -218 -294 118 151 -326 32 31 -72 27 -160 -198 -121 -145 -229 347 89 177 134 308 -72
5638g2J85j12k22M03m48K80O3k97K42m2J13k72J26K0j01J28J3L38k69Q9j04R7
$$ -72 113 1 -221 182 -266 14 77 -220 22 -20 93 -179 -53 -33 -134 -6 7 345 76 165 61 158
5660A58k18J17K2N2n0o7r2J36n0J6K22k13J02j43K24k60L08M4k38l05L60k93K51
$$ 158 -60 57 79 131 81 14 -78 58 8 24 246 33 135 -8 216 -44 264 308 70 -235 125 -168 83
5683H3j34O7R7r2q5O6P7p3K11J6k34P7j91K9K61k0L4j3m08K81J90n18M07p8j30
$$ 83 -51 16 113 21 -64 2 79 6 217 233 -1 76 -115 -86 175 155 189 176 -232 49 239 -279 128 50 -80
5708h0K01j01MRk04L77m27J69j3r7J36J30k06NQ2j85K08k38J92M3k0k1k74N83
$$ -80 121 20 24 33 -171 206 -221 -52 -65 -162 -26 104 -102 -97 -15 -200 8 -230 -38 5 -15 -36 -310 273
5732B73l8r8l6k7k14k02L01j12J33M5L59l74m3K8m3oj36J36J50j97k8j65N00j70
$$ 273 235 137 101 74 -140 -342 -41 -153 -20 25 384 10 -33 -5 -48 -54 -190 -54 96 -101 -129 -294 206 36
5756C6j30K06K1K9j52o8M8k59L38j20j23M16o39M63j0J02J69l37q6J01m03M03
$$ 36 -94 112 133 162 10 -58 -10 -269 69 -51 -174 242 -397 66 56 158 327 -10 -96 5 -398 5
5778EN0J21K3l38L43j60j0J94k95J39r2k1q2O8J35M8L3m77K81ll26N25k26J73
$$ 5 55 176 199 -139 204 44 34 228 -67 72 -20 -41 -123 -55 80 128 161 -316 -35 -38 -364 161 -65 108
5802A08j19r4L35J10n08pL98k9k77M60k81J3j08j62M86k25j40L1K38m38J91PJ49
$$ 108 -11 -105 230 340 -168 -175 223 194 -83 377 96 109 1 -161 325 100 -40 -9 229 -209 -18 -11 138
5825A38n4r2j19K82J9p5j08j29N56l61K7Rr1n2p3k09J48O5Q1k48K10qL9j01K12
$$ 138 84 -8 -127 155 174 99 -9 -138 418 57 84 93 2 -50 -123 -332 -184 -119 -38 -286 -76 -84 -45 -146 66
5850F6k61L93j82q0j29q3L29M1p2k23J1L18k08N0k79J55M3J26j76j4R5k80L68
$$ 66 -195 198 16 -64 -193 -276 53 94 22 -201 -190 128 -80 -30 -309 -154 -111 15 -161 -175 -80 -360 8
5873Ho7JJ84l66K06M0r2n1J7M1Mp5K88N6k15J04r5PJ87q8j92J96k55P3K88k58
$$ 8 -59 -58 126 -240 -34 6 -86 -137 -120 -79 -75 -150 138 194 -21 83 -12 -5 182 94 -98 98 -157 -84 204 -54
5899e4L2j03L16j28M5M6l00J32K74m31K30J60r7r7J93N3k45n1K6J36QK11m38J51
$$ -54 -22 -125 191 63 108 154 -146 -14 260 -171 59 219 122 25 218 271 26 -25 1 137 145 356 -82 69
5923F9k4k4J40k18K71l31L4O8P8M5J3j91O6K9L3J30j66j63K77j08j82K02J82j06
$$ 69 45 21 161 -57 214 -117 -83 -15 63 108 121 -70 -4 25 58 188 22 -141 136 28 -154 48 230 124
5947A24k30L27Mj52K00j80k0J27k64n6K12o1rK32l24r2K73k18J33J07j60k2L5
$$ 124 -106 221 225 73 273 93 73 200 -64 -120 92 31 22 254 -70 -162 111 -107 26 133 -27 -49 -14
5970a4L07l85M7j29J51K28k25j61K11L8l06J95j05L15P7k70j44K15Ok60K11k26
$$ -14 293 -92 -45 -174 -23 205 -20 -181 30 68 -238 -43 -148 167 244 -26 -170 45 51 -209 2 -224
5992b24Q9J39j72K82o4J39k40J14j92K54k96J41j53J29l7J38k0jJ26J6j75m4K1
$$ -224 -135 4 -168 114 50 189 -51 63 -129 125 -171 -30 -183 -54 -91 47 27 26 152 168 -7 -51 -30
6015c0q0M03j67q8O8k03L43j70p2K83k52j2k32JJ42J37r4j14J27J52l35M48j54
$$ -30 -110 293 126 38 106 -97 246 76 4 287 35 23 -209 -208 -66 71 -23 -137 -10 142 -193 255 101
6038A01j35J29r2M0K9k33K49N2l9R2jm40J16K52P2r5J02Nk29O5r6m0L27n8k15
$$ 101 -34 95 3 43 72 -161 88 140 101 193 192 -248 -132 120 192 97 199 204 -25 40 -56 -96 231 173 -42
6063d2l07K50NLn1J42P2j99J42p1o4m7J21JM0J79j72J05o4n4j14J4K03q9k2j33
$$ -42 -349 -99 -94 -91 -142 0 72 -127 15 -56 -120 -167 -46 -45 -5 174 2 107 43 -11 -125 -111 92 3 -19 -152
6089a52M31l12P4l24N2L04j74K52k69K68l46m0RJ87m0q0o8lJ42P5r3k77J96N2
$$ -152 279 -33 41 -283 -231 73 -101 151 -118 150 -196 -236 -227 -40 -80 -160 -228 -231 -89 -14 -107 -384 -188 -136
6113a36J20O0j99Q6j82K42k56M24l46L82l20J12k50L20k44K73j41J01l60O09j48
$$ -136 -16 44 -155 -69 -251 -9 -265 159 -187 195 -125 -13 -263 57 -187 86 -55 46 -314 295 147
6134A47j68M1k00j18j2J58K05J2n84M35K06j17l29J09P5j91J82K19k01j65J43
$$ 147 -21 20 -180 -298 -310 -152 53 65 -519 -84 122 5 -324 -215 -140 -331 -149 70 -131 -296 -153
6155a53K75q7J11l89J58K65j29N9l11J61o8n2K42k49K59K06k44Qk19M10J37o12
$$ -153 122 35 146 -243 -85 180 51 110 -201 -40 -108 -160 82 -167 92 298 54 62 -157 253 390 -222
6177b22K07J99j50r8j26L58L7k09L2K33k63j64M68k94O8M71n52m6L30k53K26k75
$$ -222 -15 184 34 -64 -190 168 205 -4 28 261 -2 -166 302 8 76 547 -5 -51 279 26 252 -23
6199b3K1L70j74j02R9q7j3j99M92j76m63K24K56j68R0o3k03J16k79L83K26k91
$$ -23 -2 368 194 92 191 104 91 -108 384 208 -255 -31 225 57 147 84 -119 -3 -282 101 327 36
6221C6k29J85J68k18J07Kl1j47L69m02J18k32L77j04J16j38L02k73l90M94k81
$$ 36 -193 -8 160 -58 49 51 20 -127 242 -160 -42 -274 103 -1 115 -23 279 6 -384 110 -171
6242a71Q3l15M05o1j10q1K51j9p6K69P7l85J77j49N4k27L18k58M87j26j44j10
$$ -171 -88 -403 2 -59 -169 -250 1 -18 -94 175 252 -133 44 -105 -51 -278 40 -218 269 143 -1 -111
6264a11L49k75N0k05J72J7k6j25J38J66l44m2L53p1l9J95n22K40J66l5n3J26M
$$ -111 238 -37 13 -192 -20 -3 -29 -154 -16 150 -194 -236 117 46 7 202 -320 -80 86 51 -2 124 128
6287A28j56K14j89J30Q3l06J66m8j57L20M7k74J93j17K45j20Mq3O4J14p0l16K53
$$ 128 -28 186 -3 127 210 -96 70 22 -135 185 232 -42 151 34 279 159 163 80 144 258 188 -128 125
6310A25J34j89K92k54j61K29J17o06n0L55J25j18j03J44k30J67K26j21K6j65J09
$$ 125 259 70 362 108 -53 176 293 -313 -363 -8 117 -1 -104 40 -190 -23 203 82 108 -57 52
6331E2k12K59N1J53l64J99Lk78M30n19L01n6k0l3O8j15L73l63J80k30J33K0r1
$$ 52 -160 99 150 303 -61 138 141 -137 293 -226 75 19 -1 -34 34 -81 292 -71 109 -121 12 32 -59
6354e9J32L1L3M8k02J32N4j2o8P8l10P0R3j54j42K11n2m5K41j75J48k81L74j0
$$ -59 73 104 137 185 -17 115 169 157 89 167 -143 -73 20 -134 -276 -65 -117 -162 79 -96 52 -229 145 135
6378A35J09j46P3r1J5R2j70j39K09j71j7L37l14J53m4j51J0M1K40p7l22P5K65
$$ 135 244 98 171 80 95 187 17 -122 87 -84 -101 236 -78 75 31 -120 -110 -69 171 94 -228 -153 112
6401A12o9P8O6l28o2O8M6j8J00p8p3J49K65k96K57k24N4M6j53J22m3J06m74K11
$$ 112 43 121 187 -141 -203 -135 -89 -107 -7 -85 -158 -9 256 -40 217 -7 47 93 -60 62 19 125 -349 -138
6425a38K64l16K59rL08j41j14j60k6j9OJ42p8J71o0j83L71m26M14l1l38J32K38
$$ -138 126 -190 69 60 368 227 113 -47 -73 -92 -86 56 -22 149 89 -94 277 -149 265 234 -104 28 266
6448B66k28K4N8K84l95l0L48l43j31R9K28k37K25o58N50j08j74K2L79j04P0L27
$$ 266 38 62 120 404 9 -21 327 -16 -147 -48 180 -57 168 -490 60 -48 -222 -200 179 75 145 472
6470D72l54k40Jj97N2L15k48L94j29O3L9j08Q3k09M0J97J44m43K54j25k3J36j39
$$ 472 118 -122 -121 -318 -266 49 -199 195 66 129 168 60 143 -66 -26 171 315 -128 126 1 -22 114 -25
6493b5O8kj66J09J06J64j10j48k76J46j06J94j58J20J80l42r7L75k12J54Q1j19
$$ -25 43 41 -125 -16 90 254 144 -4 -280 -134 -240 -46 -204 -84 96 -246 -343 32 -180 -26 55 -64
6515f4O6K7k69K78j1l06J35J64J2LK76m98Lq3L06j16K0j50O48l37r7O6l01K89
$$ -64 2 29 -240 38 27 -279 -144 20 32 35 311 -187 -184 -267 39 -77 -57 -207 441 104 7 73 -228 61
6539F1k99M86j51O6j94r9J43l9n3L0L7Q8j55Q8K37j2k60k14K38J42j21j77K6N42
$$ 61 -238 248 97 163 -31 -130 13 -26 -79 -49 -12 76 -79 9 246 234 -26 -240 -2 140 19 -158 -132 410
6563D10n44K71j24j86M96k70o1k44K52J18j40J10j58j28L19j0J14l84N4J71j15
$$ 410 -134 137 13 -173 323 53 -8 -252 0 118 -22 88 -70 -198 121 111 225 -159 -105 66 -49
6584d9j22P8j0J12K5L00o32J52J48l8k29L67k5J09r5m9n4K10J9J0m7q9R9r9K6
$$ -49 -171 -93 -103 9 34 334 -298 -146 2 -36 -265 102 77 186 91 42 -12 198 217 227 180 91 190 91 117
6609A17k41L92m04K40J07q3J35j47j36j18j7K27n5Q3K1j65k06K71j89n2M11j12
$$ 117 -124 268 -136 104 211 128 263 116 -20 -138 -155 72 17 100 121 -44 -250 21 -168 -220 191 79
6631G9K3kk90j24K27l9L7j9J81k11J26R2m9l04K47Q2o0k21M31l33K64l63J44p9
$$ 79 102 100 -190 -314 -87 -126 -89 -108 73 -138 -12 80 31 -273 -26 56 -4 -225 206 -127 137 -226 -82 -161
6655a61k1J86m4mM4Q3k60L40m34K44J22j19j31N7K57k54L4J34j32l3o4J96j46
$$ -161 -182 4 -40 -44 0 83 -177 163 -271 -27 95 -24 -155 -98 159 -95 -61 73 -59 -92 -156 40 -106
6678a06K88l34J13r4R0L26Q0l77J84m39K67JK06j71p9J62j18K65j85Q2j46o7K45
$$ -106 182 -152 -39 -133 -43 283 363 -14 170 -269 -2 -1 205 34 -45 117 -1 264 79 161 15 -52 193
6701A93J11j96qk43L38n27P36l09P6j22J33m3j19n9k35L52lr5K05J02k41k61J71
$$ 193 304 108 100 -143 195 -332 404 95 171 49 182 139 20 -39 -274 78 75 -20 185 287 46 -215 -44
6724d4P8j13J13J31j26J74l01K90p0j01O3O2k98K90l52N02j83k43J90l32L38k33
$$ -44 34 -79 34 165 39 213 -88 202 132 31 94 156 -142 148 -204 298 115 -128 62 -270 68 -165
6746a65L46j47J16k4n55L17J40L3m62M0K90o4kL4N4l43N27n83N36r7O2L3j50L45
$$ -165 181 34 150 126 -429 -112 28 61 -401 -361 -71 -135 -137 -103 -49 -392 135 -448 88 -9 53 86 -64 281
6770B81m04j12n7J41J33K7L2k97K20J07j53J19J36l48K53j52M8L02l04K22q6J76
$$ 281 -123 -235 -292 -151 -18 9 41 -256 -36 71 -82 37 173 -175 78 -74 -26 276 -28 194 108 284
6792B84m83J46l8J16j12L27j80k33J63o3j61R5K44J08l59J46K80n73L70k51J60
$$ 284 -199 -53 -91 25 -87 240 60 -173 -10 -73 -234 -139 105 213 -146 0 280 -293 77 -174 -14
6813a4l3K39k99K4J93j39p1K24J01k62J3n4J94k54M9J41R5j47K11l07N3K3j39
$$ -14 -47 192 -107 -83 110 -29 -100 124 225 -37 -24 -78 116 -138 -89 52 147 0 211 -96 -43 -20 -159
6836a59K77l3J1J5j58j88L39j97L74j27j84K55k72J68l36J17N0N5J38k50R9j62
$$ -159 118 85 96 111 -47 -235 104 -93 281 154 -30 225 -47 121 -215 -98 -48 7 145 -105 -6 -168
6858a68L09j70L13k96m1N7M5q9l49M10j14J1J47J33o01K09L82j04l22L6p0J9P7
$$ -168 141 -29 284 -12 -53 4 49 -40 -389 21 -93 -82 65 198 -403 -194 188 84 -238 -202 -272 -253 -176
6881a76K09j58J58j59K56q9k04L87n18K74l51M02j06M1j13m6J15K31j16k79K35
$$ -176 33 -125 33 -126 130 41 -163 224 -294 -20 -371 31 -75 -34 -147 -193 -78 153 37 -242 -7
6902gN3j28l5Q6j48j12K9K81j28j2J34Q8j91k2j87J72L10l18J32k00j6K5k81M18
$$ -7 46 -82 -117 -31 -179 -291 -262 19 -109 -121 13 101 -90 -112 -299 -127 183 -135 -3 -203 -219 -194 -475 -57
6926e7k43K75k7K14r0l64L01J09K4j44J82m20J05oL56j6m78K76o8nn6O8Lj06O2
$$ -57 -300 -25 -52 162 72 -292 9 118 142 -2 180 -240 -135 -141 215 199 -279 -3 -71 -76 -132 -64 -61 -167 -105
6951a05m7K76J1p0J11k77L58j24k66J60p2K7KJ41j21q7L54l87J72l05K54j2k5
$$ -105 -152 124 135 65 176 -101 257 133 -133 27 -45 -18 -16 125 4 -83 271 -116 56 -249 5 -7 -32
6974c2K80l36j07K44K13O6k75j22K16J43k12J56Ql18J16r7L67k67K31j99L0k71
$$ -32 248 -88 -195 49 262 328 53 -69 147 290 78 234 242 -76 40 -57 310 43 274 75 105 -166
6996a66K78J08k91K33R4j91L25n33K58l3J74j83K31m23J97P3k52J73r9J18p4R
$$ -166 112 220 -71 162 256 65 390 -143 115 82 256 73 304 -119 78 151 -101 72 -27 91 17 26
7018B6k27J19j05M62k04j70P5On4m7J32p9n3o7M5J27J94k13P5J37j74J69j60j71
$$ 26 -201 -82 -187 275 71 -99 -24 -18 -72 -119 13 -66 -119 -186 -141 -14 180 -33 42 179 5 174 14 -157
7042a57J96J13j46J19R1m44L43k75L95n6J12l77R2k05K33r4J17J76k36J87m45
$$ -157 39 152 6 125 216 -228 115 -160 235 179 291 -86 6 -199 34 -60 57 233 -3 184 -261
7063b61K19j49j03K65L15k28N3m9k13L88m31M28m11L01q3k97M5j10K78N08o75
$$ -261 -42 -191 -294 -29 286 58 111 62 -151 237 -194 234 -177 124 41 -256 -211 -321 -43 465 -210
7084b10L05Nk09J27j75k6J11r3K31P8P9k12L52k68k6p9K87m9m80L36j30L33k43
$$ -210 95 100 -109 18 -157 -183 -72 -165 66 144 223 11 363 95 69 -10 277 228 -252 84 -46 287 44
7107D4K32l21J79j68n0J50j50J53j51K12l19K2K04m3M8K74l60R0J70k30j35J08
$$ 44 276 -45 134 -34 -84 66 -84 69 -82 130 -189 -167 37 -6 42 316 -44 46 216 -14 -149 -41
7129d1R4l2j78K75j69j06n8L86j25k0k06MK33k02L98k26j15K36l09J88j74k7J91
$$ -41 53 21 -157 118 -51 -157 -215 171 46 26 -180 -176 57 -145 253 27 -88 148 -161 27 -147 -174 17
7152A7r4q7K8K1L9L25l68K1l06L03k08M74k59R3P2L1m07N98n88L20J16j13k70
$$ 17 -77 -164 -136 -115 -76 249 -119 -98 -404 -101 -309 165 -94 -1 71 102 -305 293 -295 25 141 28 -242
7175b42L86k86L5K66k04q3j2P0J73j63R4K48p00N78j64q0J7K41j38j03m64M87
$$ -242 144 -142 -107 159 -45 -128 -140 -70 103 -60 34 282 -418 160 -4 -84 -67 174 36 -67 -531 -44
7197d4M6j91K1m1N1L4J95j16K2k8m9j15K89J42o6l3l69L15j5R5k22kO6Q4Q2l19
$$ -44 2 -189 -168 -209 -158 -124 71 -45 -23 -51 -100 -215 74 216 150 117 -252 63 48 143 -79 -81 -15 69 151 -168
7223a68J96k21L10j26K10O0k83q9n2P4J38q6J59k19J72L13m28J11K0K6j17K74
$$ -168 28 -193 117 -9 201 261 -22 -111 -163 -89 49 -37 122 -97 75 388 -40 71 91 117 0 274
7245B74p3j47Rk18J95j45m0K99k77K10j97J90j86k3K17j66K93k21J65k55J53M4
$$ 274 201 54 63 -155 40 -105 -145 154 -123 87 -110 80 -106 -129 88 -78 215 -6 159 -96 57 101
7267A01k96J89M0J28k09j99J05M51j99k58M48l13q3L20l26L72k57J45j38o3m1
$$ 101 -195 -6 34 162 -47 -246 -141 310 111 -147 301 -12 -95 225 -101 271 14 159 21 -42 -83
7288h3J57k01L3l78N32J08k63l0L64j09j7k20J85k7K40l92R6j64M51m26P2J71
$$ -83 74 -127 -94 -472 60 168 -95 -125 239 130 113 -107 78 51 291 -101 -5 -169 282 -144 -72 99
7310I9l28J74j2J32j56p8P3J46q7J20K64l66m2K94k19j52p6J38R8j88J23N3p1
$$ 99 -229 -55 -67 65 -91 -169 -96 50 -37 83 347 -19 -61 233 14 -138 -214 -76 22 -166 -43 10 -61
7333f1p6P4K21J80k44J71l98L08p7rP9k38J47j83L73n37R8L96m77L58K24J0j86
$$ -61 -137 -63 158 338 94 265 -133 175 98 89 168 -70 77 -106 267 -270 -172 224 -253 105 329 339 153
7356A53L8j02R4n6o4J0l1N1n1k1q1Q7q2J96k13j48N24m38OL03l81K29j16J10K75
$$ 153 191 89 183 127 63 73 42 93 42 21 -60 27 -55 141 -72 -220 304 -134 -128 175 -206 23 -93 17 292
7381B92n03J91j62k4K96k24P7J26J69j57m4j08J88k8j21j58q9o1L32J42k41J69
$$ 292 -211 -20 -182 -206 90 -134 -57 69 238 81 37 -71 117 89 -32 -190 -279 -340 -8 134 -107 62
7403F2J0O2k52J97j28rj42Q2M3o6J0R9L39j07j30J79k08K39m21K31k49J6KK89
$$ 62 72 134 -118 79 -49 -58 -200 -118 -75 -141 -131 -32 307 200 70 249 41 280 -141 90 -159 -143 -141 148
7427A48l30K47j21L70l71k76M26l73M54p5l57K27J3Q3q5J03k17l4q0L52l31J77
$$ 148 -182 65 -56 314 -57 -333 93 -280 174 99 -258 -31 -18 65 -20 83 -134 -168 -248 104 -227 -50
7449e0j06oJ09pK20k80J10n1J95r6k01M6L17l61L72r3k03R6k0P7n2J11k69q6M04
$$ -50 -156 -162 -53 -60 160 -120 -10 -61 134 38 -163 -117 200 -161 211 118 -85 11 -9 68 16 127 -142 -228 176
7474A76k51K23L5k02M8p0j8J50j94K4M22n53M66q8l15K29k25j25Q8L36l3l0J73
$$ 176 -75 148 183 -19 29 -41 -59 91 -103 -79 343 -210 256 168 -147 82 -143 -268 -180 156 123 93 266
7497B66j18l2J78j76J8rj25P2j19M28l80n2j7J02P8r2j52K43j40j73N22n67K8
$$ 266 148 116 294 118 136 127 2 74 -45 383 3 -49 -66 36 114 22 -130 113 -27 -200 322 -245 -217
7520b17N01m44J75N2k69J8K04J43j66o7n6J99m3L00m87M40l96L49k76m89O96n
$$ -217 284 -160 15 67 -202 -184 20 163 -3 -70 -126 73 30 330 -157 283 -113 236 -40 -529 167 162
7542A62j43K03k80J29j26k5J23K6q5k92K28K24j68l43L26j09J87o7J22K7L3l01
$$ 162 19 222 -58 71 -55 -80 43 69 -16 -308 -80 144 -24 -367 -41 -150 37 -30 92 119 152 -149
7564a49o2L74j35K3j26n4L24k70J40o9N0j0m5r9K35n5j35J41k98L34j9J95Q1l91
$$ -149 -211 163 28 51 -75 -129 195 -75 65 -4 46 36 -9 -108 127 72 -63 78 -220 114 95 290 371 -20
7588b0J92O1l28K92j88P0O3l31J54J57p7l07J25K07k14J67j67J46O2n7r3K67k98
$$ -20 172 233 -95 197 9 79 142 -189 -35 122 45 -262 -137 70 -144 23 -144 2 64 7 -86 181 -117
7611a17j03K94k18k9K92k91J7J37P7j48J57k75K25N4j05L34k77l22K59K02j82
$$ -117 -220 74 -144 -173 119 -172 -155 -18 59 -89 68 -207 18 72 -33 301 24 -298 -39 163 -19
7632a9j77J72L70l35j11LR6M48k58k24j99L7L54n42J94K16p1K20j64j52P4K49
$$ -19 -196 -24 346 11 -100 -97 -1 447 189 -35 -234 -197 157 -385 -191 25 -46 174 10 -142 -68 181
7654A81p0n09O94n25M6J69J04R0j78j57O3J44J41j90J49l96L52R1j42Mk24L39
$$ 181 111 -398 296 -229 -183 -14 90 180 2 -155 -92 52 193 3 152 -244 108 199 57 61 -163 176
7676A76j64L06l03j44K2J30k62J19qJ75l52L90O3j03K9M2J10l39k6RK42k58J47
$$ 176 12 318 15 -129 -107 23 -239 -120 -128 47 -305 85 148 45 74 116 226 -113 -139 -130 112 -146 1
7699Am4J12lJ15o7J9k38J54j62K36L40n76M7M43n26L55ol17K61l71K62J16l6J95
$$ 1 -43 69 66 181 114 133 -105 49 -113 123 463 -113 -66 377 -149 206 200 -117 144 -227 35 151 115 310
7723C10k19N8J65m75J7M19l25J10m2J21k19K5K92j90l8L08k40j70N6Q4k0J56j92
$$ 310 91 149 314 -161 -144 275 -50 60 18 139 -80 -55 237 47 9 317 77 -93 -37 47 27 183 -9
7746ik12L39j61j62L45j36J92r2m06N65k11J49N3m50j1K37j79k30O44k47M6k48
$$ -9 -221 118 -43 -205 140 4 196 104 -302 263 52 201 254 -196 -207 30 -149 -379 265 18 64 -184
7768a84L57l01K0Q1K77l01K5m5%J25R1j22K00l32J45j88Q0J30n4K6q0M59m16J52
$$ -184 173 -128 -108 -27 250 -51 -26 -71 -71 54 145 23 223 -109 36 -152 -72 58 4 30 -50 409 -7 145
7792A45j99j16L83J03l35ml1Lj74J54M44o19K30Q7l6j22K4J70J7O2n53L87J24
$$ 145 -54 -170 213 316 -19 -23 -54 -51 -225 -71 373 -246 -16 71 35 -87 -63 107 124 186 -367 20 144
7815A44j69k0K8K84k11j57J12q0N8O3J03j06L5j78j98J36P1O9j14J99k8m2j88
$$ 144 -25 -45 -17 267 56 -101 11 -69 -11 52 155 49 84 -94 -292 -156 -85 -16 -130 69 41 -1 -189
7838a89p3R0L9M7l2J97l7N8j32L59l46m67M73K16l47K50j14K29k11j6k62L76q8
$$ -189 -262 -172 -133 -86 -118 79 42 100 -32 327 -19 -486 -13 203 -144 106 -8 221 10 -6 -268 108 20
7861B0r6j33J09J1j14K24K01l3l39L10M2p6Q4n29N7n7M75O1j91j32M9J11j93K45
$$ 20 -76 -209 -100 -89 -203 21 222 189 -150 160 202 126 210 -319 -262 -319 156 217 26 -106 -57 54 -139 106
7885A06l8K54k73R1K68k87j23R0j52J50j03L91j08k41q2P0k02L56j40p0O2j14
$$ 106 68 322 49 140 408 121 -2 88 -64 86 -17 374 266 25 -57 13 -189 167 27 -43 19 -95
7907i5j54J00Kk21L34j65K47k38K18k5J0N0J16Q8k49L6J70k83L2K17j51n2N0j36
$$ -95 -249 -149 -147 -368 -34 -199 48 -190 28 3 13 63 179 267 18 54 224 -59 -27 190 39 -13 37 -99
7931i9k66L61K01j49J69l91J49L73m98K95k51J75j0Ql76J43k8pr0J85N5j04j75
$$ -99 -365 -4 197 48 217 -174 -25 348 -150 145 -106 69 59 67 -309 -166 -194 -201 -291 -106 -51 -155 -330
7954c30R9K89K42o24k1M79j64k30K46k01L13j38P0o1K00k0m2k10L36j70l58L82
$$ -330 -231 58 300 -324 -345 134 -30 -260 -14 -215 98 -40 30 -31 169 149 107 -103 233 63 -295 87
7976H7l2j55k3L10l28K01j00J59j71L2o6j5j64J54l2J95n8j6kl5J19Q3QJ27n15
$$ 87 55 -100 -123 187 -141 60 -40 119 -52 -20 -86 -101 -265 -111 -143 52 -6 -22 -24 -59 60 143 151 278 -237
8001b37L64k57J79n0P3P1k19J98l15J30n4M03k26O1k42Ok2J15jJ0j65J47PL20
$$ -237 127 -130 49 -1 72 143 -76 122 -193 -63 -117 286 60 121 -121 -115 -137 -22 -23 -13 -178 -31 -24 296
8025B96k63m0J15K60n22K70j45N6l65M41j19k07J40K91l51L6J98J1l88L21M1N1
$$ 296 33 -7 108 368 -154 116 -29 27 -338 103 -16 -223 -83 208 -143 -107 91 102 -286 35 76 127
8047A27j2Pl87L57k37J34J1j13J15p3K27j35k62O10k46l70Q5j41L74k25J20J43
$$ 127 115 122 -265 92 -145 -11 0 -113 2 -71 156 21 -241 369 123 -247 -162 -303 71 -154 -34 109
8069A09j85J62j0k54K94l48N0J50k28j54O50l79j16K18Q3N5l07K75q1j02K03J00
$$ 109 -76 86 76 -178 116 -232 -182 -32 -260 -414 236 -143 -259 -41 42 97 -210 65 -16 -118 85 185
8091A85j82J70k08K31l44K45L9j58K26l43L85j63Q6n5k31K82j27k28K22l2K85
$$ 185 3 173 -35 196 -148 97 136 -22 204 -139 246 83 169 114 -117 165 38 -190 32 0 285
8112B85k75K24oN4l94q0K52K21m90J38P7n4K17j61P1j87K4P8n7o5L97m27J39j7
$$ 285 10 234 228 282 -112 -192 60 281 -209 -71 6 -48 169 8 79 -108 -84 -6 -63 -128 269 -158 -19 -36
8136c6n4K63k92J5K17m24L52N3J58m26J47R6k28K99k36N1N8L36j97k17M5J40J08
$$ -36 -90 173 -119 -104 113 -311 41 94 252 -174 -27 69 -159 140 -96 -45 13 349 152 -65 -20 120 228
8159B28j62j2J94m09R8M5J64k96L70k63K68n36N93R8m1k71n6R6k08n9J1K33l7
$$ 228 66 54 248 -161 -63 -18 146 -150 220 -43 225 -311 282 380 339 68 12 108 -100 -159 -148 85 48
8182D8l28M59l47qJ39L1Q2k25K70
$$ 48 -280 179 -168 -176 -37 -6 76 -149 121
8191A21
$$ Imaginary data points
##PAGE= N=2
##DATA TABLE= (X++(I..I)), XYDATA
0@%%%%%%%%JrJ6j6J6j6K4l2L6m4N2o0P2q6R8j12J30j51J73j95K20k50K82l15L55
$$ 0 0 0 0 0 0 0 0 0 1 -8 8 -8 8 -8 16 -16 20 -24 28 -32 40 -46 52 -60 70 -81 92 -103 117 -133 149 -166 189
33A89m00M46m96N52o14O82p58Q38r25J027j139J260j396J552j727J925k157K429
$$ 189 -211 235 -261 291 -323 359 -399 439 -486 541 -598 662 -734 818 -909 1016 -1141 1288
51A288k752L143l632M266n117O331q220J1602j9577P4129P2190m6639j367j0429
$$ 1288 -1464 1679 -1953 2313 -2804 3527 -4693 6909 -12668 61461 133651 87012 85645 75216
65G5216J720j5571l686q754m576j0526q08j040K780k178M499L217K729k208J976
$$ 75216 76936 61365 57679 48925 44349 33823 33015 31975 34755 32577 37076 40293 43022 40814 42790
80D2790K67l242q508o042o712q223j1862q591p201n962o663l164n62J648J196
$$ 42790 43057 39815 31307 25265 18553 10330 -1532 -10123 -17324 -23286 -29949 -33113 -33675 -32027 -30831
95c0831K940M784N208L403K596L267J489j594k215j476l353m863m885k264j706
$$ -30831 -27891 -23107 -17899 -14496 -11900 -8633 -7144 -8738 -10953 -12429 -15782 -20645 -25530 -27794 -29500
110b9500k630j220K215L956K292K960O011N747K950K897M410K314n31q71N80j269
$$ -29500 -32130 -33350 -31135 -27179 -24887 -21927 -15916 -10169 -7219 -4322 88 2402 1871 1000 1580 311
126C11l679k507k73j336k691j558K039J049j155L81K453J416j218l31J129m21
$$ 311 -3368 -5875 -6148 -7484 -10175 -11733 -9694 -8645 -9800 -9419 -6966 -5550 -6768 -7099 -5970 -6391
142f391k504r28J56j174j611k07J457K27o23J358J766Q00n31q40O81k34k455k151
$$ -6391 -8895 -9823 -9667 -10841 -12452 -12659 -11202 -10975 -11598 -10240 -8474 -7674 -8205 -9045 -8364 -8598 -11053 -13204
160a3204p24j191k174j233M40J336R50J725L864L935K683K809M092L160O34n05
$$ -13204 -13928 -15119 -17293 -18526 -18086 -16750 -15800 -14075 -10211 -6276 -3593 -784 3308 6468 7102 6597
176F597k97o22l161m616k613k468l656l353n72P96J8J855M151L989L714L047M330
$$ 6597 6300 5678 2517 -2099 -4712 -7180 -10836 -14189 -14761 -13965 -13947 -12092 -7941 -3952 -238 2809 7139
193G139L954N70q63k41j437m109m964l839l532m791l558j497m01L51J876L624
$$ 7139 11093 11663 10800 10559 9122 5013 49 -3790 -7322 -12113 -15671 -17168 -17569 -17218 -15342 -11718
209a1718L941L940M279M613M121J998O64J95l04k647l406l234l322l138l778j610
$$ -11718 -7777 -3837 442 5055 9176 11174 11838 12033 11729 9082 5676 2442 -880 -4018 -7796 -9406
225i406j6m22P10K836L376L115K600L438L485J442k18K94j25k535l733k202k349
$$ -9406 -9422 -9844 -9134 -6298 -2922 193 2793 6231 9716 11158 10940 11234 11109 8574 4841 2639 290
242B90l846l362j574o52j261p62J138J359P00K04J271J461o81j153m67l69j878
$$ 290 -3556 -6918 -8492 -9144 -10405 -11167 -10029 -8670 -7970 -7766 -6495 -5034 -5715 -6868 -7335 -7704 -9582
259i582k279j196l42j282j575P01Q43O20m17J559J255M28J03L47M21l47j244m57
$$ -9582 -11861 -13057 -13399 -14681 -16256 -15555 -14712 -14092 -14509 -12950 -11695 -11267 -11164 -10817 -10396 -10743 -11987 -12444
277a2444O69n58l46N77J817J334J462K872K819K056J530K068J320K22j80q54j308
$$ -12444 -11775 -12333 -12679 -12102 -10285 -8951 -7489 -4617 -1798 258 1788 3856 5176 5398 5218 4364 3056
294C056j288k055k088o31r23n79P95J503J896K095L276L242K474J521J885J349
$$ 3056 1768 -287 -2375 -3006 -3929 -4508 -3713 -2210 -314 1781 5057 8299 10773 12294 14179 15528
310A5528p62j726j892k119k939l652l186j911j813j475J58J608J583J980L021
$$ 15528 14766 13040 11148 9029 6090 2438 -748 -2659 -4472 -5947 -5789 -4181 -2598 -618 2403
325B403L946K667J848J479J715J32j453k252k057k707l964l004j959j925j702
$$ 2403 6349 9016 10864 12343 14058 14190 12737 10485 8428 5721 1757 -1247 -3206 -5131 -6833
340f833P7J258J722J494K677L252K692J351J315J548K0j073j655j716k346l060
$$ -6833 -6756 -5498 -3776 -2282 395 3647 6339 7690 9005 10553 10573 9500 7845 6129 3783 723
356G23k788j393j104j415j54J094J455Q52J508K536J690Q73P97M48m76j327j200
$$ 723 -2065 -3458 -4562 -5977 -6131 -5037 -3582 -2730 -1222 1314 3004 3877 4674 5122 4646 3319 2119
373B119j425j380k313j436n29j36m73Q0J484Q52M09J247J061J084m23j46n84m31
$$ 2119 694 -686 -2999 -4435 -4964 -5100 -5573 -5493 -4009 -3157 -2748 -1501 -440 644 221 75 -509 -940
391i40j487j254q42p93o44n88Q97P54P06Q36J851J185J035L57N28J17j019j347
$$ -940 -2427 -3681 -4523 -5316 -5960 -6548 -5651 -4897 -4191 -3355 -1504 -319 716 1073 1601 1718 699 -648
409f48p58j241j404j318p00j27j79M01J889J745J471J732K503J488J269J62M50
$$ -648 -1406 -2647 -4051 -5369 -6069 -6196 -6375 -5974 -4085 -2340 -869 863 3366 4854 6123 6285 6735
426F735l64j473j822j323j793j848j393o09J48M96M87K165K689J639K146K601
$$ 6735 6371 4898 3076 1753 -40 -1888 -3281 -3890 -3742 -3246 -2759 -594 2095 3734 5880 8481
442H481J688P61L84j81m27k111k116j879j574k031j863q99K25K91P85J898J912
$$ 8481 10169 10930 11314 11133 10706 8595 6479 4600 3026 995 -868 -1767 -1542 -1251 -466 1432 3344
459C344J906J678J798J750j12m05m38o37k272k220j693j958j589j430q02L70L30
$$ 3344 5250 6928 8726 10476 10364 9959 9521 8884 6612 4392 2699 741 -848 -2278 -3080 -2710 -2380
476b380M33J427J950J639R70J162J303o65p20q22q60j644k469j210j209j671q74
$$ -2380 -1947 -520 1430 3069 4039 5201 6504 5839 5119 4297 3437 1793 -676 -1886 -3095 -4766 -5640
493e640j12P14M13Q49J471J485J098M78Q59K11o84j479r15j442j630j977r69k13
$$ -5640 -5752 -5038 -4625 -3776 -2305 -820 278 756 1615 1826 1142 -337 -1252 -2694 -4324 -6301 -7270 -7483
511g483q64m71O47J004J366J109J213K009N44LJ29J57o78j488j170j313j133j143
$$ -7483 -8347 -8818 -8171 -7167 -5801 -4692 -3479 -1470 -926 -923 -794 -637 -1315 -2803 -3973 -5286 -6419 -7562
529g562n35M61N47O57J201J701J844J148J895J622Q30j97K68J61j326j424j105
$$ -7562 -8097 -7636 -7089 -6432 -5231 -3530 -1686 -538 1357 2979 3809 3612 3880 4041 2715 1291 186
546A86n30j245n06j56O84J051R20J787J872J814R74J492J354K25l66p37o03p31
$$ 186 -344 -1589 -2095 -2251 -1567 -516 404 2191 4063 5877 6851 8343 9697 9922 9556 8819 8216 7485
564G485k439q69j015r60o85k2R80N92Q37J249J760R88Q55K17L80O7j470j197j551
$$ 7485 5046 4177 3162 2202 1517 1495 2475 3067 3904 5153 6913 7901 8756 8973 9353 9420 7950 6753 5202
583E202j835j565j071j110q59p24M0O04P24Q61O39J234M08o9k96j48q89j914j558
$$ 5202 3367 1802 731 -379 -1238 -1962 -1922 -1318 -594 267 906 2140 2548 2479 2183 2035 1146 -768 -2326
602b326j654j613k050j141k67r34m3O85J058J208P32Q63J409L19p4m31o26n91
$$ -2326 -3980 -5593 -7643 -8784 -9051 -9985 -10028 -9343 -8285 -7077 -6345 -5482 -4073 -3754 -3828 -4259 -4885 -5476
620e476j796j421j078j018j063o48Q36J42P94J392J642K181J272J500J636J048
$$ -5476 -7272 -8693 -9771 -10789 -11852 -12500 -11664 -11522 -10728 -9336 -7694 -5513 -4241 -2741 -1105 -57
636e7k14l48K8j145j117q50o75n78m51P7L44J218J331J390K254J660J297J073
$$ -57 -271 -619 -591 -1736 -2853 -3703 -4378 -4956 -5407 -5330 -4986 -3768 -2437 -1047 1207 2867 4164 5237
654E237P10J060n09j35r99o30j496j105j073m89o52j32P93M92O82J095J917J328
$$ 5237 5947 7007 6498 6363 5364 4734 3238 2133 1060 571 -81 -213 580 1072 1754 2849 4766 6094
672F094O70L38N82J64p63j306o86j021j353j313n21o89j82J68K49J043O60O40
$$ 6094 6764 7102 7684 7848 7085 5779 5093 4072 2719 1406 885 196 14 182 431 1474 2134 2774
690B774J312R90k68N7j35k67n29j392q43p70r14q78j48j14N38J44R25R19R78L13
$$ 2774 4086 5076 4808 4865 4730 4463 3934 2542 1699 929 15 -863 -1011 -1125 -587 -443 482 1401 2379 2692
710B692Q13Kl7l42q34p53j289j110o73n54q72l50M78M46L78R87J217J319P72J19
$$ 2692 3505 3507 3470 3128 2294 1541 252 -858 -1531 -2085 -2957 -3307 -2829 -2383 -2005 -1018 199 1518 2290 2409
730B409N98L38n57q30o79r27j616q72m79J22o22M84P19J323J096J217J902J387
$$ 2409 3007 3345 2788 1958 1279 352 -1264 -2136 -2615 -2493 -3115 -2631 -1912 -589 507 1724 3626 5013
748E013R65R13l00L15n84j064j009j292j348j312o64k93l64q1R02J365Q35J316
$$ 5013 5978 6891 6591 6906 6322 5258 4249 2957 1609 297 -367 -660 -1024 -1105 -203 1162 1997 3313
766C313J215R08L71K19k43n31q82j853j259j412j932j289q77n06l40J74L82Q50
$$ 3313 4528 5436 5807 6026 5783 5252 4370 2517 1258 -154 -2086 -3375 -4252 -4758 -5098 -4924 -4542 -3692
784c692J296M66J217P31O76L60R8l88o69p19j032j043p70l71o2K91K77O09Q94
$$ -3692 -2396 -1930 -713 18 694 1054 1152 764 95 -624 -1656 -2699 -3469 -3840 -3902 -3611 -3334 -2725 -1831
803a831J702J111J174J143N59J332J5K90L7m23M7j111L50l15k75K09O39O44M00
$$ -1831 -129 982 2156 3299 3858 5190 5205 5495 5532 5109 5156 4045 4395 4080 3805 4014 4653 5297 5697
822E697R63J041P00j75P20J90m26k38o73n97r49o39n14l69m02J1N25M15L31M73
$$ 5697 6660 7701 8401 8226 8946 9136 8710 8472 7799 7202 6253 5614 5100 4731 4329 4340 4865 5280 5611 6084
842F084M16M77R6m69l7n89m18j705j320k87p23j307k32J43L81M0P23J287N93J157
$$ 6084 6500 6977 7073 6604 6567 5978 5560 3855 2535 2248 1525 218 -14 129 510 550 1273 2560 3153 4310
862D310M12P17L36m77q05o78p22j455j305q23o74j129k6L31M15J92J036J503Q43
$$ 4310 4722 5439 5775 5298 4493 3815 3093 1638 333 -490 -1164 -2293 -2319 -1988 -1573 -1381 -345 1158 2001
881B001Q90M51P01kl82p51o48j596j449j151j484p84o65l35k39O24Q25Q81R21
$$ 2001 2891 3342 4043 4041 3659 2908 2260 664 -785 -1936 -3420 -4204 -4869 -5204 -5443 -4819 -3994 -3113 -2192
900b192P99J031N34Q71k40k58m09n43j152j095r15q53m14m27k12M12P99O07J189
$$ -2192 -1393 -362 172 1043 803 545 136 -407 -1559 -2654 -3569 -4422 -4836 -5263 -5475 -5063 -4264 -3657 -2468
919b468J160P51M58O78M95K61K1l91n47o86p00m23m78k35l59K56K93M43M77L23
$$ -2468 -1308 -557 -99 579 1074 1335 1356 965 418 -268 -968 -1391 -1869 -2104 -2463 -2207 -1914 -1471 -994 -671
939f71P16N85L04j03P2m39l79j063k90m83l48o96N4j56M08rP45O59R5L48n0L37
$$ -671 45 630 934 831 903 464 85 -978 -1268 -1751 -2099 -2795 -2741 -2897 -2489 -2498 -1753 -1094 -999 -651 -701 -364
961c64l05l08l1l67r24o37l32k47l0o8N17P19M60J017P54Q39M33N09K41K8m36
$$ -364 -669 -977 -1008 -1375 -2299 -2936 -3268 -3515 -3545 -3613 -3096 -2377 -1917 -900 -146 693 1126 1635 1876 1904 1468
982A468m94q57m61j021n01k51k76j53L78P89Q27O09J255P89J057L68J65l22O1
$$ 1468 974 117 -344 -1365 -1866 -2117 -2393 -2546 -2168 -1379 -552 57 1312 2101 3158 3526 3691 3369 3430
1001C430p45j008j014j027r70j023n80m51R9K37K48J017J076Q84L49J086M15J02
$$ 3430 2685 1677 663 -364 -1334 -2357 -2937 -3388 -3289 -3052 -2804 -1787 -711 173 522 1608 2023 2125
1019B125o3l29m08j278r33q38p46n36j014k7K64q0O99N42J108O76Q31N38N30K9
$$ 2125 2062 1733 1325 47 -886 -1724 -2470 -3006 -4020 -4047 -3783 -3863 -3164 -2622 -1514 -838 -7 531 1061 1090
1039A090l50R4q29m88o34p20o81m11m27J60L32L03N67N63N16Q04P07O94P1l55
$$ 1090 740 834 5 -483 -1117 -1837 -2518 -2929 -3356 -3196 -2864 -2561 -1994 -1431 -915 -111 596 1290 1361 1006
1059A006l56J25n87j099K58m93k14j93R8L26M29O51M23K12J066L08j77j0J71p39
$$ 1006 650 775 188 -911 -653 -1146 -1360 -1553 -1455 -1129 -700 -49 374 586 1652 1960 1783 1773 1944 1205
1079A205k41n51k00o07j65l5j76M59q1N63O34P44M29L40K43J65o24K23q12r79
$$ 1205 964 413 213 -394 -559 -594 -770 -311 -392 171 805 1549 1978 2318 2561 2726 2102 2325 1513 534
1099E34j40p00m11l06m62J7M64P2O07O70R74M22L58O19K12j88n58m62m58p01o13
$$ 534 394 -306 -717 -1023 -1485 -1468 -1004 -932 -325 345 1319 1741 2099 2718 2930 2742 2184 1722 1264 563 -50
1120e0j114m97l84K52J05K06M22Q76J013P32O46L42K34L98m93q9r04o71l53j173
$$ -50 -1164 -1661 -2045 -1793 -1688 -1482 -1060 -184 829 1561 2207 2549 2783 3181 2688 2599 1695 1024 671 -502
1140e02m12o52j32m4J61M05L68Q08O40M43O20L65Q9K3o76n96l73r11m48r05n15
$$ -502 -914 -1566 -1698 -1742 -1581 -1176 -808 0 640 1083 1703 2068 2157 2180 1504 908 535 -376 -824 -1729 -2244
1161b244p5m09q0N14K32L84O28K79R73k9M42k13K03l48m45l79o82m46k36n80M01
$$ -2244 -2319 -2728 -2808 -2294 -2062 -1678 -1050 -771 202 173 615 402 605 257 -188 -567 -1249 -1695 -1931 -2511 -2110
1182b110M5J89O08N68MJ071M22L62k5J79k26J03o22o48l41l34n18q7k18L10J90
$$ -2110 -2065 -1876 -1268 -700 -696 375 797 1159 1134 1313 1087 1190 568 -80 -421 -755 -1273 -1360 -1578 -1268 -1078
1203a078K26R79K70K21L03M20r7j20n17n26j69p63o74l50m80m0j49R9L54M76P47
$$ -1078 -852 127 397 618 921 1341 1244 1124 607 81 -88 -851 -1525 -1875 -2355 -2395 -2544 -2445 -2091 -1615 -868
1224h68L11L25M96L37K01j15L3q55m39k81m90k42m21j34J86L2N38L42O88R79N58
$$ -868 -557 -232 264 601 802 687 720 -135 -574 -855 -1345 -1587 -2008 -2142 -1956 -1924 -1386 -1044 -356 623 1181
1245A181P99M67j2R0l3m43l65m71n24o58k76k03j72j11M72N26N45L03N14M15O30
$$ 1181 1980 2447 2435 2525 2492 2049 1684 1213 689 31 -245 -448 -620 -731 -259 267 812 1115 1629 2044 2674
1266B674j29K8k27n88q3j053n55k92p56o20l96L43j03Q8M27O49Q4N89M65J96k30
$$ 2674 2545 2573 2346 1758 1675 622 67 -225 -981 -1601 -1997 -1654 -1757 -1669 -1242 -593 -509 80 545 741 511
1287E11op0p89k34m86o59l46J29m16J5P2K61N52O45M47K44L37M15K69l51N1m90
$$ 511 505 435 -354 -588 -1074 -1733 -2079 -1950 -2366 -2351 -2279 -2018 -1466 -821 -374 -130 207 622 891 540 591 101
1309A01k16k35n32n47%n0l6P3N85J41M70O93O56L0o3N6R2j91j86o04n69j09o37
$$ 101 -115 -350 -882 -1429 -1429 -1479 -1515 -1442 -857 -716 -246 447 1103 1133 1070 1126 1218 1027 841 237 -332 -441 -1078
1332a078l86m6J39K01Q8L61L50N74K66N78J84M62N1l14n57j30l35k69l34j96j90
$$ -1078 -1464 -1510 -1371 -1170 -1082 -721 -371 203 469 1047 1231 1693 1744 1430 873 743 408 139 -195 -391 -581
1353e81M88Q4J82P41K83P83L43L88N63M09l77k6k50j14m72m66k67m38j93O2M5
$$ -581 -93 -9 173 914 1197 1980 2323 2711 3274 3683 3306 3280 3030 2916 2444 1978 1711 1273 1080 1142 1187
1374A187o8l6P32M49M76M25n2L5kl99m40l30l33p36p93j9k75n11l30N31K36J01
$$ 1187 1119 1083 1815 2264 2740 3165 3113 3148 3146 2747 2307 1977 1644 908 115 96 -179 -690 -1020 -489 -253 -152
1396a52L09N40J22L79j79J1J57r96K70p24m21m23n47j27N3k32N50J11J70N65L71
$$ -152 157 697 819 1198 1019 1030 1187 191 461 -263 -684 -1107 -1654 -1781 -1728 -1960 -1410 -1299 -1129 -564 -193
1417a93P70J01K77k11K88l56p93k62l72m78m36L02m38M8K10p6N53O21L67L49L05
$$ -193 577 678 955 744 1032 676 -117 -379 -751 -1229 -1665 -1363 -1801 -1753 -1543 -1619 -1066 -445 -78 271 576
1438E76j0L98m17Kk97n71m15n28j14k20k13j18J67K48L95P38P3N87Q0K63MJ08
$$ 576 566 964 547 549 252 -319 -734 -1262 -1376 -1596 -1809 -1927 -1760 -1512 -1117 -379 -306 281 361 624 628 736
1460G36l65m8j68o28l73k97J02m35J50J11L04N59L38J37Q89M38L76pp5Lk19m10
$$ 736 371 323 155 -473 -846 -1143 -1041 -1476 -1326 -1215 -911 -352 -14 123 1012 1450 1826 1819 1744 1747 1528 1118
1482A118j42n63k43k62L9l15j01M87N25K27K52P28M70Q2j45k03q1J73o81n04n36
$$ 1118 976 413 170 -92 -53 -368 -469 18 543 770 1022 1750 2220 2302 2157 1954 1873 2046 1365 861 325
1503C25m7k76k4k10K41k05M56j6L91N15K35J5K50j74L6j59p93n15k39l31j97l06
$$ 325 278 2 -22 -232 9 -196 260 244 635 1150 1385 1400 1650 1476 1512 1353 560 45 -194 -525 -722 -1028
1525a028p3o2K68M23J88J17M67L83L78j42j92j79L44o21o18m16j57l97k15j94
$$ -1028 -1101 -1163 -895 -472 -284 -167 300 683 1061 919 727 548 892 271 -347 -763 -920 -1317 -1532 -1726
1545a726M54j47L35J29N22N21Q1K71m9L81m48k8k71l34k54n40m01k2p2R9j0L54
$$ -1726 -1272 -1419 -1084 -955 -433 88 169 440 391 772 324 296 25 -309 -563 -1103 -1504 -1526 -1598 -1499 -1509 -1155
1567a155M73K94M32J57J62K46J50q4l23m02j2l86o94O3M6n14j6M36L23L96M71
$$ -1155 -682 -388 44 201 363 609 759 675 352 -50 -62 -448 -1142 -1079 -1033 -1547 -1563 -1127 -804 -408 63
1588F3J46M01M8K66q1L2j36J45m66m8p36k72j88m3J86k90N08M22K85L02J82O23
$$ 63 209 610 658 924 843 875 739 884 418 370 -366 -638 -826 -869 -683 -973 -465 -43 242 544 726 1349
1610A349M3K33m43J4k18q9l04j78o77l1n8r8M53L9K25K33Q24J80L27K15J1m3M4
$$ 1349 1392 1625 1182 1196 978 889 585 407 -270 -301 -359 -457 -4 35 260 493 1317 1497 1824 2039 2050 2007 2051
1633B051o57j21l89l24j8n79l6J25J1l36P29M03J22M56n3L65q8m6m8l60l62m52
$$ 2051 1394 1273 884 560 542 -37 -73 52 63 -273 456 859 981 1437 1384 1749 1661 1615 1567 1207 845 393
1655C93k48m03j41k13J08k35L89j14N39m7K61L73q9J06m44K75k38k43k58l47n44
$$ 393 145 -258 -399 -612 -504 -739 -350 -464 75 28 289 662 573 679 235 510 272 29 -229 -576 -1120
1676a120j84l08J67k21L1J56K67J25L25J10K61k02L34m18K91ro82l55l14k51l27
$$ -1120 -1304 -1612 -1445 -1666 -1635 -1479 -1212 -1087 -762 -652 -391 -593 -259 -677 -386 -395 -1077 -1432 -1746 -1997 -2324
1697b324N62k04m6J30K71J10N16J98L07K25K37l49k65K18m40k71l97R4pJ8K19
$$ -2324 -1762 -1966 -2012 -1882 -1611 -1501 -985 -787 -480 -255 -18 -367 -632 -414 -854 -1125 -1522 -1428 -1435 -1417 -1198
1718a198J01K52M27M1P67j28M27J17L10m33o0%k89m1j92m47J03j78L69k91R12
$$ -1198 -1097 -845 -418 -377 390 262 689 806 1116 683 623 623 334 293 101 -346 -243 -421 -52 -343 569
1739E69M9N44K69L38P1J26o8j83k9j43K5p64J43k98m66j38L08j70L25n2Q28k00
$$ 569 618 1162 1431 1769 1840 1966 1898 1715 1686 1543 1568 804 947 649 183 45 353 183 508 456 1284 1084
1761A084P32j30K01k04J46j90l89l58k06k84l40k11k36J89j94j91J84K18J45J69
$$ 1084 1816 1686 1887 1683 1829 1639 1250 892 686 402 62 -149 -385 -196 -390 -581 -397 -179 -34 135
1781A35J56N47m65L18l77Om77p8n5m03n02r0J4j09L8J05m7M07M10N5L3L14n3J81
$$ 135 291 838 373 691 314 320 -157 -235 -290 -693 -1195 -1285 -1271 -1380 -1342 -1237 -1284 -877 -467 -412 -379 -65 -118 63
1805F3m43m35Lj93m23k18L2J27j71J44l8J38N72Q0L28R0L19l13K41k11n33L37
$$ 63 -380 -815 -812 -1005 -1428 -1646 -1614 -1487 -1658 -1514 -1552 -1414 -842 -762 -434 -344 -25 -338 -97 -308 -841 -504
1827e04l97k36N5J13m13J18M23M0L23L40j97O17K67j01k27L85k96j55j60m43j28
$$ -504 -901 -1137 -1082 -969 -1382 -1264 -841 -801 -478 -138 -335 282 549 448 221 606 310 155 -5 -448 -576
1848e76L3j75N2j23K87N3K70N43K05K71L15j70j36m1k94j99j39J2n6l34l93N1
$$ -576 -543 -718 -666 -789 -502 -449 -179 364 569 840 1155 985 849 808 514 315 176 188 132 -202 -595 -544
1870e44M17k13L21J2M88L32K1L24K99j15J67j84l5j64l16m68j28K01k20J10j99
$$ -544 -127 -340 -19 -7 481 813 834 1158 1457 1342 1509 1325 1290 1126 810 342 214 415 195 305 106
1891A06J61k5M08M67O9L47K03J16l29Q7l13Q8n30l74j29n84J48q1j68K12M5K32
$$ 106 267 242 650 1117 1186 1533 1736 1852 1523 1610 1297 1385 855 481 352 -232 -84 -165 -333 -121 -76 156
1913A56J91L21P7L5K5l20K43p1k57m19k02J2m65k25k14K92l5j7J52K04J82L15
$$ 156 347 668 745 780 805 485 728 657 400 -19 -221 -209 -674 -899 -1113 -821 -856 -873 -721 -517 -335 -20
1935b0j58K94q3j98j99j6r1l71m54K26j02J14Kj56M56j02M71j70K70K22j41k13
$$ -20 -178 116 33 -165 -364 -380 -471 -842 -1296 -1070 -1172 -1058 -1056 -1212 -756 -858 -387 -557 -287 -65 -206 -419
1957d19j86o0N5j68k24j12j14j28K85K8O8K14K16J67L45K27p4r0J2J24m19j97
$$ -419 -605 -665 -610 -778 -1002 -1114 -1228 -1356 -1071 -1043 -975 -761 -545 -378 -33 194 120 30 42 166 -253 -450
1979d50M0J1l04l37Q7M41k34L1M24K57J90L43Q39n20K87J1K72o72Lk41K62l39
$$ -450 -410 -399 -703 -1040 -953 -512 -746 -715 -291 -34 156 499 1338 818 1105 1116 1388 716 719 478 740 401
2001D01m69j60J80K92M4M63m45N88K24K50N58j88L15j27l4p0m16j17l05m91L58
$$ 401 -68 -228 -48 244 288 751 306 894 1118 1368 1926 1738 2053 1926 1892 1822 1406 1289 984 493 851
2022H51m66NL5J31J10l5O03j71O31m77M19K99n56n3k68l81k94L02l35j92k34L21
$$ 851 385 390 425 556 666 631 1234 1063 1694 1217 1636 1935 1379 1326 1058 677 383 685 350 158 -76 245
2044B45p3j00K51L15O5J5K96J55l77P2mr8n67Rk42j31J05m33M30K6j68M64N6k98
$$ 245 172 72 323 638 703 718 1014 1169 792 864 860 762 195 204 -38 -169 -64 -497 -67 -41 -209 255 311 13
2068A3L46J82m53N03l49k53Nj89k32k93J19o8k07J46k14N03K33m5K04J16j90N6
$$ 13 359 541 88 591 242 -11 -6 -195 -427 -720 -601 -669 -876 -730 -944 -441 -208 -253 -49 67 -123 -67
2090f7k06qq1j07k79j66k48j23j40L25p0J59J22k7L17M04K46j60L10j28n0k00
$$ -67 -273 -281 -362 -469 -748 -914 -1162 -1285 -1425 -1100 -1170 -1011 -889 -916 -599 -195 51 -109 201 73 23 -177
2112a77m36j55j45n1l29J14K11m1J60j21M73L13L39j14Q6K53L8J75l34l4k96k08
$$ -177 -613 -768 -913 -964 -1293 -1179 -968 -1009 -849 -970 -497 -184 155 41 127 380 418 593 259 225 -71 -279
2134b79j96l80K3J29j94L17L1J2L80J50K89J53K61k64K61j01L1m15k27j86R9l14
$$ -279 -475 -855 -832 -703 -897 -580 -549 -537 -157 -7 282 435 696 432 693 592 623 208 -19 -205 -106 -420
2156d20M3l5k86J87N5L97j17K29K26o7L12o30L35k97j35j1r1o2m87J09J70j57
$$ -420 -377 -412 -698 -511 -456 -59 -176 53 279 212 524 -106 229 -68 -203 -214 -305 -367 -854 -745 -575 -732
2178g32K83l04K48n37P82J36l03M62P8o23R3P4n09J9m17l0q2J58L23q4K55j35
$$ -732 -449 -753 -505 -1042 -260 -124 -427 35 113 -510 -417 -343 -852 -833 -1250 -1280 -1362 -1204 -881 -965 -710 -845
2200h45N80k58J67k4o7J28o11Q0l8n3N4k9m89N1K92J19j86L52R1L43O6o7J40r7
$$ -845 -265 -523 -356 -380 -447 -319 -930 -850 -888 -941 -887 -916 -1405 -1354 -1062 -943 -1129 -777 -686 -343 -277 -344 -204 -301
2224c01K67l98J79J65k80j90j50m2k61L60O0M05j01M54L08OO5K66j91k5PJ4nk47
$$ -301 -34 -432 -253 -88 -368 -558 -708 -750 -1011 -651 -591 -186 -287 167 475 481 546 812 621 596 603 617 612 365
2248C65p2k18p9j50o2K83R6L2K41K69L6M48l4L2J09J28l25l5k06l11l39jj40Q7
$$ 365 293 75 -4 -154 -216 67 163 195 436 705 741 1189 1155 1187 1296 1424 1099 1064 858 547 208 207 67 154
2272A54O0l0k8J44L69L96j33J07J8j33j73J8j34J74l64l07Mm34O2J05L8m2K41
$$ 154 214 184 156 300 669 1065 932 1039 1057 924 751 769 635 809 445 138 142 -292 -230 -125 -87 -129 112
2295A12l03L40K53Q9j39K8K28k99l35J48k72l42n9k6J29j20M03j68L7N4K12j89
$$ 112 -191 149 402 491 352 380 608 309 -26 122 -150 -492 -551 -577 -448 -568 -165 -333 -296 -242 -30 -219
2317b19J35L8M3J05m21J27j83J62J1m09J24j57K20o1k30M96J06Q9J16R0J5N5R4
$$ -219 -84 -46 -3 102 -319 -192 -375 -213 -202 -611 -487 -644 -424 -485 -715 -219 -113 -24 92 182 197 252 346
2340C46j58M2l16p2m9l29K8J86l53L04J7K28J67R6K46n9L31k37j83j15n1j6k07
$$ 346 188 230 -86 -158 -207 -536 -508 -322 -675 -371 -354 -126 41 137 383 324 655 418 235 120 69 53 -154
2363a54K00m7k76k39J12M3L1l4K17L20K08J38j60K18K11k88k00q1n4l9m33Q6j2
$$ -154 46 -1 -277 -516 -404 -361 -330 -364 -147 173 381 519 359 577 788 500 300 219 165 126 -307 -221 -233
2386b33j73j78M51j56L88L95j81L54m3K91P2l59k18J37j10l14J86p6l57K67l47
$$ -233 -406 -584 -133 -289 99 494 313 667 624 915 987 628 410 547 437 123 309 233 -124 143 -204
2407b04L91J34J12j8r1J36M77J50k38k0j45l57L07j35j78n4m30K43p7J96k81J42
$$ -204 187 321 433 415 324 460 937 1087 849 829 684 327 634 499 321 267 -163 80 3 199 -82 60
2429F0M78J14j87L13o9k61K5j04J67l98rl02j80j92m3J99N6M1J22M9k46N86l07
$$ 60 538 652 465 778 709 448 473 369 536 138 129 -173 -353 -545 -588 -389 -333 -292 -170 -121 -367 219 -88
2452h8N0r3K09k50k91K01n05k14J84p8r6Q8l41M64K26J5L04l01lK72j37P5rk61
$$ -88 -38 -131 78 -172 -463 -262 -767 -981 -797 -875 -971 -883 -1224 -760 -534 -519 -215 -516 -519 -247 -384 -309 -318 -579
2476e79m0n1j75p6j29L6J15k00L21K99k3J65P1R1K16p0j46N26k45K21p89K23l4
$$ -579 -619 -670 -845 -921 -1050 -1014 -899 -1099 -778 -479 -502 -337 -266 -175 41 -29 -175 351 106 327 -462 -239 -273
2499b73j95J75L26l9%K20R3J85J12n1L91r9L8j6j03m17R7Q0L75o81L3M13n0N0
$$ -273 -468 -293 33 -6 -6 214 307 492 604 553 944 845 883 867 764 347 444 524 899 218 251 664 614 664
2523F64M9L71RK29q0M1ll44M6J39j41J29k71m89J34Q1J12j14k46L57n1NJ14qL48
$$ 664 713 1084 1093 1322 1242 1283 1280 936 982 1121 980 1109 838 349 483 564 676 562 316 673 622 627 741 733 1081
2548A081k68p6j06j38r8k17j23l7k23J45r0j44J35k43K43L59j3p3j52n5p5P3j76
$$ 1081 813 737 631 493 395 178 55 18 -205 -60 -150 -294 -159 -402 -159 200 187 114 -38 -93 -168 -95 -271
2571b71Q4l60J70m63K66k53j53J81j21K6L83j32J48K74m22L81L16l15k71Pk68
$$ -271 -187 -547 -377 -840 -574 -827 -980 -799 -920 -894 -511 -643 -495 -221 -643 -262 54 -261 -532 -525 -793
2592g93J19n21L58l68L80j41O7M29r7o4j41M16l59L67K4j09Ql72L44k93o9K87
$$ -793 -674 -1195 -837 -1205 -825 -966 -899 -470 -567 -631 -772 -356 -715 -348 -324 -433 -425 -797 -453 -746 -815 -528
2614e28k89R7K37k25K23k08O8L04Q3J82O8k25J3Qj69M48q32J97N6m9J41j99j43
$$ -528 -817 -720 -483 -708 -485 -693 -625 -321 -238 -56 12 -213 -200 -192 -361 87 -745 -548 -492 -541 -400 -599 -742
2637g42L10M92k74r2N12m02J98kM73o10M5J80J67j50r1l37J26j92K34K56k20K70
$$ -742 -432 60 -214 -306 206 -196 2 0 473 -137 -92 88 255 105 14 -323 -197 -389 -155 101 -119 151
2659A51R4j13k5J91K86m50K85O5k06J22p8k11J8L2J0j22J43J05k6l9K68R2J50
$$ 151 245 132 107 298 584 134 419 484 278 400 322 111 129 161 171 49 192 297 271 232 500 592 742
2682G42j66j05j81K00J10k77j50J39N6l83L5J88j71J76L63m43M00J22l7j51j04
$$ 742 576 471 290 490 600 323 173 312 368 -15 20 208 37 213 576 133 533 655 618 467 363
2703C63J93J51m39j77R9k50rj71J22L3j8K7K4L62J73J06o57L26M7j3j14L8l41
$$ 363 556 707 268 91 190 -60 -69 -240 -118 -85 -103 -76 -52 310 483 589 -68 258 305 292 178 216 -125
2726a25L51n12O3r6k35M58O9k04J22R2L7N6K13m0N1J53k85L08j77o01L52l03K06
$$ -125 226 -286 -223 -319 -554 -96 -27 -231 -109 -17 20 76 289 249 300 453 168 476 299 -302 50 -253 -47
2749d7k8M9k50J83L56k98N20k00J09k09K47k1Q6m06M30m97J43M1j68J95j56L54
$$ -47 -75 -26 -276 -93 263 -35 485 285 394 185 432 411 497 91 521 24 167 208 40 235 79 433
2771D33K2L4k8L4K44l3L68m98J84J17j50J41l72P4J13l87L93L53j89l08K95R7
$$ 433 455 489 461 495 739 706 1074 576 760 877 727 868 496 570 683 296 689 1042 853 545 840 937
2793I37k01J06o3J81J81m05J07n43M67j51m3J52m23k41J97J9J35j57J88j82M30
$$ 937 736 842 779 960 1141 736 843 300 767 616 573 725 302 61 258 277 412 255 443 261 691
2814F91m13J52O6k14J54j96q7j34j22n7R6k4j86p2J67j53O15m88J79J10p7K54
$$ 691 278 430 496 282 436 240 153 19 -103 -160 -64 -88 -274 -346 -179 -332 283 -205 -26 84 7 261
2836B61j45p5j23Pj28R3k86j78L7j4K42j04Jl3R9R6K21j99K76k02j7L1L0q8J9
$$ 261 116 41 -82 -75 -203 -110 -396 -574 -537 -551 -309 -413 -412 -445 -346 -250 -29 -228 48 -154 -171 -140 -110 -198 -179
2861a79j58k37j53K41L58m63K58p2M00k46k0K18J4Jr5K08m56J10j02K4K91n76
$$ -179 -337 -574 -727 -486 -128 -591 -333 -405 -5 -251 -271 -53 -39 -38 -133 75 -381 -271 -373 -349 -58 -634
2883f34L34m9k5M6L42k70J99J94l22K40J24k04K1R9J18n29R0k06J11K07k24M35
$$ -634 -300 -349 -374 -328 14 -256 -57 137 -185 55 179 -25 -4 95 213 -316 -226 -432 -321 -114 -338 97
2905I7k84K00L51O9j45k27k4K60j21q5J28j63j23nj33K4o5j15K57k4l7O02k37
$$ 97 -187 13 364 433 288 61 37 297 176 91 219 56 -67 -72 -205 -181 -246 -361 -104 -128 -165 437 200
2928B00k69n3L41k71M08k24j18j94k36k0k15K90q7L60j60j39J85j26L19l38L71
$$ 200 -69 -122 219 -52 356 132 14 -180 -416 -436 -651 -361 -448 -88 -248 -387 -202 -328 -9 -347 24
2949B4k1j43P9Pp2k18J03R3l72K8L12k93J45j00k7KJ54p6R9L02n4j71k54J82m58
$$ 24 3 -140 -61 -54 -126 -344 -241 -148 -520 -492 -180 -473 -328 -428 -455 -453 -299 -375 -276 26 -28 -199 -453 -271 -729
2974g29K37r3m08M47j68P8k77M48l17K00J87J27J0l3J12r3l19L65j46n5k44K75
$$ -729 -492 -585 -993 -546 -714 -636 -913 -465 -782 -582 -395 -268 -258 -291 -179 -272 -591 -226 -372 -427 -671 -396
2996c96k46L43k30j51m5K70J4J43K25j5j80K55k2j49jJ47J03l28L10k84pj3J75
$$ -396 -642 -299 -529 -680 -725 -455 -441 -298 -73 -88 -268 -13 -35 -184 -185 -38 65 -263 47 -237 -244 -257 -82
3019h2k55L15L51J2l17K78K4L29k78L8j21M8j14J57j13l03o9K84J79j34K68j86
$$ -82 -337 -22 329 341 24 302 326 655 377 415 294 342 228 385 272 -31 -100 184 363 229 497 311
3041C11j2M4J94k16k04O73m05P5o8k33N8m9k04JK76j31J9J32l51N80q5l20R7J49
$$ 311 299 343 537 321 117 790 385 460 392 159 217 168 -36 -35 241 110 129 261 -90 490 405 85 182 331
3065C31k56j42J74k0j92J52k47J2j86L48n9J36k71K63O1n8K28j80J8k08J18m9
$$ 331 75 -67 107 87 -105 47 -200 -188 -374 -26 -85 51 -220 43 104 46 274 94 112 -96 22 -27
3087b7j05j78K80m02L99j68l9j96O6j64L75MJ88k1n8j88K00j51J8J32r8j02K18
$$ -27 -132 -310 -30 -432 -33 -201 -240 -436 -370 -534 -159 -155 33 12 -46 -234 -34 -185 -167 -35 -133 -235 -17
3110a7j80L2j37j6N8j62M46j4p2N9M7J08k2K6j49J34l59J68P7k71n6L28k51J59
$$ -17 -197 -165 -302 -318 -260 -422 24 10 -62 -3 44 152 130 156 7 141 -218 -50 27 -244 -300 28 -223 -64
3134f4k3N5N8j34L52k50QL4J71l04N24m83J3N6J05q4ok54K2J70j00P3P0N31N7
$$ -64 -87 -32 26 -108 244 -6 2 36 207 -97 427 -56 -43 13 118 34 28 -226 -204 -34 -134 -61 9 540 597
3159E97p6k91J25O9k06J03Q8m44N32l06K07r0R2l19L77J69l35J44m9K17j18J55
$$ 597 521 230 355 424 218 321 409 -35 497 191 398 308 400 81 458 627 292 436 387 604 486 641
3181F41k99Q5R9l81J66P0k03m8J55o3j12J10Nk82J96P7O3r5K41j93k76L81l48
$$ 641 342 427 526 145 311 381 178 130 285 222 110 220 225 -57 139 216 279 184 425 232 -44 337 -11
3204a1R6l4m6k6l0j52J02j3J95M7lj95K13J8K07m13O9k97L16k74k0J04J8l66O
$$ -11 85 51 5 -21 -51 -203 -101 -114 81 128 125 -70 143 161 368 -45 24 -273 43 -231 -251 -147 -129 -495 -489
3229d89J49p2J9K02n3L1N0N2k58q2M9K43n7j34m8j78J6J0j92K36l08K29J87j64
$$ -489 -340 -412 -393 -191 -244 -213 -163 -111 -369 -451 -402 -159 -216 -350 -398 -576 -560 -550 -742 -506 -814 -585 -398 -562
3253e62J01%JJ5K87m09Qo8J07l9J20J00j80j92M44k41J87K09n0r0R3J51n2J7J12
$$ -562 -461 -461 -460 -445 -158 -567 -559 -627 -520 -559 -439 -339 -519 -711 -267 -508 -321 -112 -162 -252 -159 -8 -60 -43 69
3278F9K03n17N27ll50J50kJ89L9k85N75l45L3K22j17K63m25K65m2R4m8n9j87M80
$$ 69 272 -245 282 279 -71 79 77 266 305 20 595 250 283 505 388 651 226 491 449 543 495 436 249 729
3302G29m75K85L1j13ro0K16j66J07J12m45K08L4J7J41m46J01k6J70m16qL88l43
$$ 729 254 539 570 457 448 388 604 438 545 657 212 420 454 471 612 166 267 241 411 -5 -13 375 32
3325C2N15k27j05J49l6L7J53o2j9k11o6J64K99m57L17l07l2J27o6j52R9k65O25
$$ 32 547 320 215 364 328 365 518 456 437 226 160 324 623 166 483 176 144 271 205 53 152 -113 512
3348E12j62k27J86k93J33j95J94j95K36j04j35j38K0l2j37K80r5l2K88Q0r8j80
$$ 512 350 123 309 16 149 -46 148 -47 189 85 -50 -188 -168 -200 -337 -57 -152 -184 104 184 86 -94
3370i4P4j12K82j20j43N15o33J68k41j59M91k28M2K51j0l4J63j98J68k35n1M64
$$ -94 -20 -132 150 30 -113 402 -231 -63 -304 -463 28 -200 -158 93 83 49 212 14 182 -53 -104 360
3392C60n95M18j15K41l53L2J69j32L93m02P0L61k8m57N93j86k86R2K26p3k13K55
$$ 360 -235 183 68 309 -44 -12 157 25 418 16 86 447 419 -38 555 369 83 175 401 328 115 370
3414C70k08J71l54M53o10J09K59J93j11p6l90K73k32L45l1J30n12K00J57J20K9
$$ 370 162 333 -21 432 -178 -69 190 383 272 196 -194 79 -153 192 161 291 -221 -21 136 256 285
3435B85l72J85j42Q4P5j54J95P4o46M82p2l2K56l08K12j34l41N26r2l86L28k3
$$ 285 -87 98 -44 40 115 -39 156 230 -416 66 -6 -38 218 -90 122 -12 -353 173 81 -305 23 0
3457@j71j0l5L37Lj80k5K56P6r1j20l9j86J75j80p3m1k54L92l4q3PJ51L5R8n5
$$ 0 -171 -181 -216 121 124 -56 -81 175 251 160 40 1 -185 -10 -190 -263 -304 -558 -166 -200 -283 -276 -125 -90 8 -47
3483d7j15n1J95l37L3K46N0k13k99L56l0P6k0o7j0kk04K81j64L93m62K58j14K81
$$ -47 -162 -213 -18 -355 -322 -76 -26 -239 -538 -182 -212 -136 -156 -223 -233 -235 -439 -158 -322 71 -391 -133 -247 34
3507C4l0k49k13K61K06m45M21N9j75P5r6j03J51j36j49K25K73l18N26n48K9K17
$$ 34 4 -245 -458 -197 9 -436 -15 44 -131 -56 -152 -255 -104 -240 -389 -164 109 -209 317 -231 -202 15
3529A5Q4k09j77L81l02N6L69j71j37K80j80L1j00J53q5J00k49J16K28l52L02Q1
$$ 15 99 -110 -287 94 -208 -152 217 46 -91 189 9 40 -60 93 8 108 -141 -25 203 -149 153 234
3551B34j56J0P8R3m1O6J49k66O3J37J25R9k89j74K01k02m7j00J49J06J04l38R0
$$ 234 78 88 166 259 218 284 433 167 230 367 492 591 302 128 329 127 80 -20 129 235 339 1 91
3574I1J42J00r9K26N5j32j06j28J87l89j4K63J58q4l22K50k63K46j05K89m03K44
$$ 91 233 333 234 460 515 383 277 149 336 -53 -67 196 354 270 -52 198 -65 181 76 365 -38 206
3596B06l9l5r9J30m1k07K7l11M35l98J16K00m5j51J41m58L97K5Rp1j01J12r9j07
$$ 206 167 132 33 163 122 -85 -58 -369 66 -332 -216 -16 -61 -212 -71 -529 -132 -107 -98 -169 -270 -158 -257 -364
3620c64K25l35M17j03k0l54J55p8K61M3l42K81j61J73K01k44j67J52k03L77o7
$$ -364 -139 -474 -57 -160 -180 -534 -379 -457 -196 -153 -495 -214 -375 -202 -1 -245 -412 -260 -463 -86 -153
3641a53r3J09j07j49J04N1J72k55J42r8J08J25k43R7M23k58n2J29r0L10m64J52
$$ -153 -246 -137 -244 -393 -289 -238 -66 -321 -179 -277 -169 -44 -287 -190 233 -25 -77 52 -38 272 -192 -40
3663d0r9J46l02J13O01k78R4L4l31O9L15j95o2J33J0k92J44q4Q4J42l08Q3J3J61
$$ -40 -139 7 -295 -182 419 141 235 269 -62 7 322 127 65 198 208 -84 60 -24 60 202 -106 -23 -10 151
3687A51N6k04l0J13m7J58K02L4m18J32j02R3j47p7P4J08j92n6J60j63j35K15k7
$$ 151 207 3 -27 86 39 197 399 433 15 147 45 138 -9 -86 -12 96 -96 -152 8 -155 -290 -75 -102
3710a02P9J15Q6j90M4j08J29o7Q5M0j49l9l70M07J7o1j02PQ0J94m64R9L39jn7
$$ -102 -23 92 178 -12 32 -76 53 -14 71 111 -38 -77 -447 -40 -23 -84 -186 -179 -99 95 -369 -270 69 68 11
3735A1J07k10Ml24M30j76J89m88J80K68o5j03n1N1qJ86j13o8K37r6R2k7k40j49
$$ 11 118 -92 -88 -412 18 -158 31 -457 -277 -9 -74 -177 -228 -177 -185 1 -112 -180 57 -39 53 26 -214 -363
3759c63J80j30j68K46P0Q9k3Q5J56k51j06J19J22p1J20R9n55N46k28p2j2J71P6
$$ -363 -183 -313 -481 -235 -165 -76 -99 -14 142 -109 -215 -96 26 -45 75 174 -381 165 -63 -135 -147 24 100
3782A00k84l7l6J75K21L89n64L97m98L01J01k34Q5L79o17L41k06k9K85j32J13
$$ 100 -184 -221 -257 -82 139 528 -36 361 -137 164 265 31 116 495 -122 219 13 -16 269 137 250
3803B50k14J60k78M9M23j9Q9j45j77O7K89o00M20j67L12l06q6LL28m05p7J58J1
$$ 250 36 196 -82 -33 390 371 460 315 138 205 494 -106 314 147 459 153 67 70 398 -7 -84 74 85
3826H5J19L2n0J37O9l9k50K73k70oM60m78K5M3%p2J74j9Lk23K2K28m17K26p2L
$$ 85 204 236 186 323 392 353 103 376 106 100 560 82 107 150 150 78 252 233 236 13 35 263 -154 72 0 3
3852CJ50l19J00K20j42l5j20J05k51K22j05J71o0j54K5K77q1J73k27L21k92q7
$$ 3 153 -166 -66 154 12 -23 -143 -38 -289 -67 -172 -1 -61 -215 -190 87 6 179 -48 273 -19 -106
3874a06j78N4J96m6j8Q1j27o1L4j41J17k09M87k40J41k14lr4J90n6K0M8N2j71
$$ -106 -284 -230 -34 -80 -98 -17 -144 -205 -171 -312 -195 -404 83 -157 -16 -230 -233 -327 -137 -193 -173 -125 -73 -244
3898b44KqK31j66Q8j67%J43N7j11k25L16j41j0L06Jj86L14l68J35L78p7l21J00
$$ -244 -242 -250 -19 -185 -97 -264 -264 -121 -64 -175 -400 -84 -225 -235 71 72 -114 200 -168 -33 345 268 -53 47
3922D7J60k52K76K5k5l0k52K2K16j6j48r7o3N38m01k2k34J61O9N0K02N3q9J16
$$ 47 207 -45 231 256 231 201 -51 -29 187 171 23 -74 -137 401 0 -22 -256 -95 -26 24 226 279 190 306
3946C06j36k43M19m13J50j03k66N89l12l0J44l84O3n9Q2J48oj53kK09M1n1OK94
$$ 306 170 -73 346 -67 83 -20 -286 303 -9 -39 105 -279 -216 -275 -193 -45 -51 -204 -206 3 44 -7 -1 293
3970B93j39l8k44J26J66N0O6l25L24rj15K2j5Qn0j64J59j73k2j25J85P5j52J9
$$ 293 154 116 -128 -2 164 214 280 -45 279 270 155 177 162 170 120 -44 115 -58 -80 -205 -20 55 -97 -78
3994g8k13M31l56J9Q8k73K15K21O5j91L5k13k72K51j70L47l7j52m8J65Q0j44L0
$$ -78 -291 140 -216 -197 -109 -382 -167 54 119 -72 -37 -250 -522 -271 -441 -94 -131 -283 -331 -166 -86 -230 -200
4017b00j23J98n0k2o3L55l51K59j08j30M67m90J93J28k29K62k83K44J38k87J32
$$ -200 -323 -125 -175 -197 -260 95 -256 3 -105 -235 232 -258 -65 63 -166 96 -187 57 195 -92 40
4038D0J63K3J8j98k6R7j78J60j83K42j98j6J55J57k16K33j39J31J28j35q0J13
$$ 40 203 226 244 46 20 117 -61 99 -84 158 -40 -56 99 256 40 273 134 265 393 258 178 291
4060B91k10J80j70J62j21J28n48K25p9L93j55N7k42L23p6n4K39m17J49p9J77K49
$$ 291 81 261 91 253 132 260 -288 -63 -142 251 96 153 -89 234 158 104 343 -74 75 -4 173 422
4082D22j62K15k26k32N2L03j66Rj82M01k14j6J30j48K10o9K71k11j17K7q7K74
$$ 422 260 475 249 17 69 372 206 215 33 434 220 204 334 186 396 327 598 387 270 297 210 484
4104D84j24l79K05J64j1m05N80j67l68K31j69m6L50j90K34m53k0R3j49QK35k36
$$ 484 360 -19 186 350 339 -66 514 347 -21 210 41 -5 345 155 389 -64 -84 9 -140 -132 103 -133
4126a33j1J5M36m10j27L3J22J85j79q0K80l9Mk34L09m90K21j5QjK90j1k51K17
$$ -133 -144 -129 307 -103 -230 -197 -75 110 -69 -149 131 92 96 -138 171 -319 -98 -113 -105 -106 184 173 -78 139
4150A39j52J79k34L3M5K95k1l14J96l68N77j01j54K90o17J29J95j43l3J50j20
$$ 139 -13 166 -68 -35 10 305 284 -30 166 -202 375 274 120 410 -207 -78 117 -26 -59 91 -29
4171b9Qr8L55j49M3J50p6l62M7M11l24K1j34L20k2np4J61l63K92K32k20q2J2L8
$$ -29 -21 -119 236 87 130 280 204 -158 -111 300 -24 -3 -137 183 161 156 82 243 -120 172 404 184 102 114 152
4196A52j70j32M08k70K74l73K5M20n36K44J64l21J04K04n8j50K61j08L6k25J80
$$ 152 -18 -150 258 -12 262 -111 -86 334 -202 42 206 -115 -11 193 135 -15 246 138 174 -51 129
4217A29R2k52K55k21L28k57J54j76L39m09L12P6k83j79L04k09j18M4K65j04q1
$$ 129 221 -31 224 3 331 74 228 52 391 -18 294 370 87 -92 212 3 -115 -71 194 90 9
4238Io3K2m4k5k14J43K3M9k31L20k16K33k38K11m6p8j46L1M86m37j93o7K06M65
$$ 9 -54 -32 -76 -101 -315 -172 -149 -100 -331 -11 -227 6 -232 -21 -67 -145 -291 -260 226 -211 -404 -471 -265 200
4262B00k47j08J35j17k20L35l0j00r4N81m52m7K70l09L80k64o2R5n7j25p4L31
$$ 200 -47 -155 -20 -137 -357 -22 -52 -152 -246 335 -117 -164 106 -203 177 -87 -149 -54 -111 -236 -310 21
4284B1l45K79l03N72j41j46P7j89K15j51o8j1R9J00l55O3K54J37q9K42j96J32
$$ 21 -324 -45 -348 224 83 -63 14 -175 40 -111 -179 -190 -91 9 -346 -283 -29 108 19 261 65 197
4306A97m50J36P0j82K66k9j05R7q5r5Q8L63k31j78J46K71j16r1L4j0K8O3q6j77
$$ 197 -253 -117 -47 -229 37 8 -97 0 -85 -180 -92 271 40 -138 8 279 163 72 106 96 124 187 101 -76
4330g6L73k57mL4j26J43J64j93K9k28K49Q1n9n4k4Q6J96p2k01J0J43j13Qj55Q8
$$ -76 297 40 36 70 -56 87 251 58 87 -141 108 189 130 76 52 138 334 262 61 71 214 101 109 -46 42
4355D2L6K3j11m7M46j45j97R4J75k13n3k20R4J79m33K00j76J29N7l70K70J50O7
$$ 42 78 101 -10 -57 389 244 47 141 316 103 50 -170 -76 103 -330 -130 -306 -177 -120 -490 -220 -70 -3
4378cr3o9J95Q8m5m37J39M01l61m4q6N71o34K04J67j59m6J3j03l4j61N38pj57
$$ -3 -96 -165 30 118 73 -364 -225 176 -185 -229 -315 256 -378 -174 -7 -166 -212 -199 -302 -336 -497 41 34 -123
4402a23N51l96j30L43l09k12K64j36j27J94j05J33J42l43j90K38J18j86J19J05
$$ -123 428 32 -98 245 -64 -276 -12 -148 -275 -81 -186 -53 89 -254 -444 -206 -88 -274 -155 -50
4422e0p5N07m75J9L0J34J88l66J27j63K79j90P2J56n7k34j07M84k64o0Q7q3Q3
$$ -50 -125 382 -93 -74 -44 90 278 -88 39 -124 155 -35 37 193 136 -98 -205 279 15 -45 42 -41 42
4445D2J60j85J43k20J37J34l42J68P0k68K35p1J64J45k02j25J01O3P8J68n08J69
$$ 42 202 17 160 -60 77 211 -131 37 107 -161 74 3 167 312 110 -15 86 149 227 395 -113 56
4467E6l30L46q7j97O24m30j8K45k69r7J50q9L60m4j38R9l9O5l95K03k58J00K52
$$ 56 -274 72 -15 -212 412 -18 -36 209 -60 -157 -7 -96 264 220 82 181 142 207 -188 15 -243 -143 109
4490A09l09L38k79j56K98j93M2j09K41R4n5o2l06K46L43j41K00l58J05j48M3j13
$$ 109 -200 138 -141 -297 1 -192 -150 -259 -18 76 21 -41 -347 -101 242 101 301 -57 48 -100 -57 -170
4512a70J13nM6J15O4j20J14l8p1N8m79M31j13J18p0O0j86J79K71L5k84j7M04m58
$$ -170 -57 -62 -16 99 163 43 157 119 48 106 -373 58 -55 63 -7 53 -133 46 317 352 68 51 455 -3
4536cK08j47R8j05j35M0L97l71O1j43L06k8m40J79J27o2k33J62j14K98m59L66
$$ -3 205 58 156 51 -84 -44 353 -18 43 -100 206 178 -262 -83 44 -18 -251 -89 -203 95 -364 2
4558Bq4m4K24j31J87p7j10l8J63n95M61k15J08K66k24J61l76O28k99J26J99j45
$$ 2 -82 -126 98 -33 154 77 -33 -71 92 -503 -42 -257 -149 117 -107 54 -322 306 7 133 332 187
4580A87n0j31J49k62oJ28J14k31j69K57NJ4J72O6l77j86O92n88O24k61o8O9j51
$$ 187 137 6 155 -107 -113 15 129 -102 -271 -14 -9 5 177 243 -134 -320 372 -216 408 147 79 148 -3
4603cP8o3LmL8k28L77k14k20L00QJ08j85j19N74n00p2lj47L10j62J11j17R2K74
$$ -3 75 12 15 11 49 -179 198 -16 -236 64 72 180 -5 -124 450 -50 -122 -125 -272 38 -124 -13 -130 -38 236
4628B36m73J82j44P0j23M75k3j87m03M35K43l93K86m30N6J81q8k65M35m84L89
$$ 236 -237 -55 -199 -129 -252 223 200 13 -390 45 288 -105 181 -249 -193 -12 -100 -365 70 -414 -25
4649b5J71j47J12l06J30J91j16l22kL91nl29L85j51m65J65K98J12J12k46m6j9
$$ -25 146 -1 111 -195 -65 126 10 -312 -314 77 72 -257 128 -23 -488 -323 -25 87 199 -47 -93 -112
4671a12l62J40R6K10O4J3M8J12m19J16o5J78j54j98O3K32J87j74j49K00j62R5
$$ -112 -474 -334 -238 -28 36 49 97 209 -210 -94 -159 19 -135 -333 -270 -38 149 -25 -174 26 -136 -41
4693d1k60L50k43L79j54j09n6K48k27P4l6K47r6J4M02k75J34k34j16J2J49L7k25
$$ -41 -301 49 -194 185 31 -78 -134 114 -113 -39 -75 172 76 90 492 217 351 117 1 13 162 199 -26
4716b6J99j09J82o8L3j91j69M00j97K5k90K53J46m20K92O4L5j20j40J16m6K1K25
$$ -26 173 64 246 178 211 20 -149 251 54 79 -211 42 188 -232 60 124 159 39 -101 15 -31 -10 215
4739B15j91M0O5M0j31R5j05j12J34J3k70l6M01r9K5j33Q7M1Pj50J29p4j43J38
$$ 215 24 64 129 169 38 133 28 -84 50 63 -207 -243 158 59 84 -49 38 79 86 -64 65 -9 -152 -14
4763a4j31Q8k81L83l8q3J51k49O0kJ09l18N28m9k68J50k13P2L3n4K14j89J20l40
$$ -14 -145 -57 -338 45 7 -76 75 -174 -114 -116 -7 -325 203 154 -114 36 -177 -105 -72 -126 88 -101 19 -321
4787c21L00M6K04k02k18J85l29J70k8K86K3k24jj4J34O6j34J14p7J78j24Q9k35
$$ -321 -21 25 229 27 -191 -6 -335 -165 -193 93 116 -108 -109 -123 11 77 -57 57 -20 158 34 123 -112
4810a12J43J47j53l2j9l04J17J51k03J44K1M3J71l18K93P5k83L1N6Q5l22M37j08
$$ -112 31 178 25 -7 -26 -330 -213 -62 -265 -121 -100 -57 114 -204 89 164 -119 -88 -32 53 -269 168 60
4833F0l57K67J74j50j9k0q0J13O1j2R2j56P3l73L66L68m04J50J26N5j94k36K68
$$ 60 -297 -30 144 -6 -25 -45 -125 -12 49 37 129 -27 46 -327 39 407 3 153 279 334 140 -96 172
4856A72l6P8J37n81J02L91k36o3J49P1k80L28j98j22R0K33k8l52N22l37p5J18
$$ 172 136 214 351 -230 -128 263 27 -36 113 184 -96 232 34 -88 2 235 207 -145 377 40 -35 83
4878H3n0n2r8K11K5r5P6K8p0j87K90o1Rj21J87O0j64r5j8K82m30K25k22J60j6
$$ 83 33 -19 -117 94 119 24 100 128 58 -129 161 100 109 -12 175 235 71 -24 -42 240 -190 35 -187 -27 -43
4903d3k08L49k45j6K98j80j9j92L12n2j08P2L11k51l43J64R9K10k06j49M45J08
$$ -43 -251 98 -147 -163 135 -45 -64 -256 56 4 -104 -32 279 28 -315 -151 -52 158 -48 -197 248 356
4925C56l73M8p4Q7j61q7J11n2p1O43n99J73J59J53p04M02k2J70k38Qk4Pk4K88
$$ 356 -17 31 -43 44 -117 -204 -93 -145 -216 427 -172 1 160 313 -391 11 -11 159 -79 -71 -95 -88 -112 176
4949A76l32N9K42k01K55l42J42j33K52k10J46l15J60J84mm4J4l68L11%j63K84
$$ 176 -156 -97 145 -56 199 -143 -1 -134 118 -92 54 -261 -101 83 79 35 49 -319 -8 -8 -171 113
4971A13k4j29r8J18J48M9q8j79L17l76R5K60k28p0J16N2J03l15K9J6Q1L75n22
$$ 113 89 -40 -138 -20 128 177 89 -90 227 -149 -54 206 -22 -92 24 76 179 -136 -107 -91 -10 365 -157
4994a57J25M1k1j70M41l65n5J5K06J49l29J68J49n1j83j52L30j03j70n0K48J06
$$ -157 -32 9 -12 -182 259 -106 -161 -146 60 209 -120 48 197 146 -37 -189 141 38 -132 -182 66 172
5016A72j06l04L45j26n3K27k56M1J03r0j02R1J71o8qk66L88r1p1j26M2o3j10K78
$$ 172 66 -238 107 -19 -72 155 -101 -60 43 -47 -149 -58 113 45 37 -229 159 68 -3 -129 -87 -150 -260 18
5040A8mKKO8j27R4j47M6j12P8L8L1k6n2j51J60J4KN0k10J57J9j47J72m5q9J49
$$ 18 14 16 18 86 -41 53 -94 -48 -160 -82 -44 -13 -39 -91 -242 -82 -68 -66 -16 -226 -69 -50 -197 -25 -70 -159 -10
5067a0l45K73K3k8K37m23K79J6Q0k08L60k99k7L7K11l16J82k7k43J96J53l43K88
$$ -10 -355 -82 -59 -87 150 -273 6 22 102 -106 254 -45 -72 -35 176 -140 42 15 -228 -32 121 -222 66
5090F6J10j36l9m8J90m68N21k21j17K84J9j43n3k76L73N0oj52j3M5o4M06l37k47
$$ 66 176 40 1 -47 143 -325 196 -25 -142 142 161 18 -35 -311 62 112 106 -46 -59 -14 -78 328 -9 -256
5114b56K90J12j21K59J70N1j95l64J09j57K44R6l37J65N9K0ll34K34M3j21J39
$$ -256 34 146 25 284 454 505 310 -54 55 -102 142 238 -99 66 125 145 142 -192 42 85 -36 103
5136A03K97l60r5J78p9n9n0J01J70l9n6k80K90q0j87J89p0r3J51O1J29l40K04
$$ 103 400 40 -55 123 44 -15 -65 36 206 167 111 -169 121 41 -146 43 -27 -120 31 92 221 -119 85
5159H5j08j59K04j39q0J43J67l5jj47J80k05k53M20j29q2k5K20M7j45J81n2k69
$$ 85 -23 -182 22 -117 -197 -54 113 78 77 -70 110 -95 -348 72 -57 -139 -164 56 103 -42 139 87 -182
5182a82J83k45K43j63K90l31J75J05k8J51m79K43o8L88j36J4k23j1M7j23K57m66
$$ -182 1 -244 -1 -164 126 -205 -30 75 47 198 -281 -38 -106 282 146 160 -63 -74 -27 -150 107 -359
5204c59m6M01J19k45J51j56J13j0o9L49l68K77k34L1J70k50j08J67k0K16l82L99
$$ -359 -405 -4 115 -130 21 -135 -22 -32 -101 248 -120 157 -77 -46 124 -126 -234 -67 -87 129 -253 146
5226A46k04N8L03l11k56N78j8k83J54q2J25K03o60M35k11J11k37PM42j20n2o9
$$ 146 -58 0 303 -8 -264 314 296 13 167 85 210 413 -247 188 -23 88 -149 -142 300 180 128 59
5248E9K7l0K57j50j50j16j12K61j38o7J31j61N3L23k10J97j21k56N57n15j10P3
$$ 59 86 56 313 163 13 -103 -215 46 -92 -159 -28 -189 -136 187 -23 174 53 -203 354 -161 -271 -198
5270a98K85k36J19O6o4j1k2k33N59l25K53m78L19L09k25o3k52K42j3J3L36m97
$$ -198 87 -149 -30 36 -28 -39 -61 -294 265 -60 193 -285 34 343 118 55 -197 45 32 45 381 -116
5292a16L7j67M04j50Q2J96k84k25K26r0j07L16k91L43j00J06m83J66m6j5K08L3
$$ -116 -79 -246 158 8 90 286 2 -223 3 -87 -194 122 -169 174 74 180 -303 -137 -183 -198 10 43
5314D3k95K61N5q8M7n3m12O80j37l51K60j20J89j42o8N6L36m62M60j37L6n5l26
$$ 43 -252 9 64 -24 23 -30 -442 238 101 -250 10 -110 79 -63 -131 -75 261 -201 259 122 158 103 -223
5337b23K54k73R2M99m37J87l94J72M0K28m10K60j35M43j26J27q3j25r4J07jK01
$$ -223 31 -242 -150 349 -88 99 -295 -123 -83 145 -265 -5 -140 303 177 304 221 96 2 109 108 309
5359C09k95M9j20K76l95J90L98n15J84l9k9k02K18q5J78j08J29m0J69k94K92k53
$$ 309 14 63 -57 219 -176 14 412 -103 81 42 13 -189 29 -56 122 14 143 103 272 -22 270 17
5381A7j37J56K69k03Q7j98j36N1pJ28n3R1P0j38L1J09m4K09k22j38J2M22k08P4
$$ 17 -120 36 305 102 189 -9 -145 -94 -101 27 -26 65 135 -3 28 137 93 302 80 -58 -46 376 168 242
5405B42j27j34M5L6j99J62J23j40m3J0j74J86Q1pl9O0Jj37p0m5K72k52J26l89
$$ 242 115 -19 26 62 -137 25 148 8 -35 -25 -199 -13 68 61 22 82 83 -54 -124 -169 103 -149 -23 -412
5429d12M65p4R2l10K61J88m29j21L77N8l60K91l5j08m3O7O9J03l49lq7L55l13
$$ -412 53 -21 71 -239 22 210 -219 -340 37 95 -265 26 -9 -117 -160 -93 -24 79 -270 -273 -360 -5 -318
5452c18K2J52K03j12j1j72L31L2k21q0L20k73K63l3l4J59o43M9J51K92J10M2q4
$$ -318 -296 -144 59 -53 -64 -236 95 127 -94 -174 146 -127 136 103 69 228 -415 -366 -215 77 187 229 145
5475A45m6j9J07k79K29Rk47l5K77m1o6q0m2J12L4k71K67K41m54J72L7Ok89K64
$$ 145 99 80 187 -92 137 146 -101 -136 141 100 34 -46 -88 24 58 -213 54 295 -159 13 50 56 -233 31
5499C1N9P7k70M1J38Q8k99q0J52K55l71O64k27k61J6ql6j7J54Q8oJ22m38LO4M
$$ 31 90 167 -103 -62 76 164 -135 -215 -63 192 -179 485 258 -3 13 5 -31 -48 106 194 188 310 -128 -125 -61 -57
5525e7P5j88J3N1M10j69J2J2J28J04k03m2k84R2K92j18k5k90K43k10J26l29K25
$$ -57 18 -170 -157 -106 304 135 147 159 287 391 188 146 -138 -46 246 128 103 -187 56 -154 -28 -357 -132
5548a32m3J31M39n70K80j43M2L11m82J79j23J03J57k55k56L51m6j00M2K48j07
$$ -132 -175 -44 395 -175 105 -38 4 315 -167 12 -111 -8 149 -106 -362 -11 -57 -157 -115 133 26
5569B6k31M03j59j13J11k54K31j08J2M1J54o7l95J55N31l57Q7k19N0N5J95j24
$$ 26 -205 198 39 -74 37 -217 14 -94 -82 -41 113 46 -349 -194 337 -20 67 -152 -102 -47 148 24
5591B4l10N69l43k30J55L54k80K95n11K87j6j3J06l72K00M0K91m71L97m26J68
$$ 24 -286 283 -60 -290 -135 219 -61 234 -277 10 -6 -19 87 -285 -85 -45 246 -225 172 -254 -86
5612h6L4J6q2O9Q1Lj73j90L25jq7j02K31J56m24M42l41J62m1K11k27l21P2L04
$$ -86 -52 -36 -118 -49 32 35 -138 -328 -3 -4 -91 -193 38 194 -230 212 -129 33 -8 203 -24 -345 -273 31
5636C1J80k53j10K54k1Q8j71q6K38j68L24k85J14l39N09l75j09K37m2O4L8J9M7
$$ 31 211 -42 -152 102 81 169 -2 -88 150 -18 306 21 135 -204 305 -70 -179 58 16 80 118 137 184
5659A84l89J26%K67m22O40l97j93K18j43J05Mj02k77K65K12l71R1J19r4n2R2l3
$$ 184 -205 -79 -79 188 -234 406 9 -184 34 -109 -4 0 -102 -379 -114 98 -273 -182 -63 -157 -209 -117 -150
5682a50M67l55j13J65J60k28om1m1L31O3p53K01M45o1l24K00J65o9k6L9j79q6
$$ -150 317 -38 -151 14 174 -54 -60 -101 -142 189 252 -501 -300 145 84 -240 -40 125 56 30 69 -110 -196
5705a96J65kj25j18K50j73J70k4Q9l18L60l32o8J51J01k68N94j73J8j18k05j5
$$ -196 -31 -33 -158 -276 -26 -199 -29 -53 36 -282 78 -254 -322 -171 -70 -338 256 83 101 -17 -222 -237
5727b37jL57n1K91m45K1K32l10K19j5r6K61m79M01m6k90K05J3K03o1k92j8K33
$$ -237 -238 119 68 359 -86 -65 167 -143 76 61 -35 226 -253 148 102 -188 17 30 233 172 -120 -138 95
5750I5k36J86q6r1M9L9M41k81j81J52o1K47O0j68m26L86j4q0j68oK80m78M07M9
$$ 95 -141 45 -41 -132 -83 -44 397 116 -65 87 26 273 333 165 -261 125 111 31 -137 -143 137 -341 66 115
5774A15j55L00j83K66k80K90l32Q6k98L03J7N2j77o1M19m44L07j66j25L5M7j40
$$ 115 -40 260 77 343 63 353 21 107 -191 112 129 181 4 -57 362 -82 225 59 -66 -31 16 -124
5796a24N5N77m27k48K91r6j63MK31k28rK68l3l8K92l29N9O7m38K06K5k1KK9k4
$$ -124 -69 508 81 -167 124 28 -135 -131 100 -128 -137 131 98 60 352 23 82 149 -289 -83 -58 -79 -77 -48 -72
5821g2L81l98l6M6n4K46j87j65K94J8o6j18J21p6K50q3J58l82j81K89k3K4K6m33
$$ -72 309 -89 -125 -79 -133 113 -74 -239 55 73 7 -111 10 -66 184 101 259 -123 -304 -15 -38 -14 12 -421
5845d21N29j93M3q1L8j9k2j13J4J72j56L46l0j79L7J18j59M16l45P3lj84N05m34
$$ -421 108 -85 -42 -123 -85 -104 -126 -239 -225 -53 -209 137 107 -72 -35 83 -76 340 -5 68 65 -119 386 -48
5869d8j54M80l64M25k72M7p9R1j91J18l82J28k8K08p5L78l53J29j12N4l7j3K93
$$ -48 -202 278 -86 339 67 114 35 126 -65 53 -329 -201 -229 -21 -96 282 -71 58 -54 0 -37 -50 243
5892B43k98K54m37L72m8M1j53N3J15k55J76L4j35M4K12j53J46p0j68J99p2R5l31
$$ 243 -55 199 -238 134 86 127 -26 27 142 -113 63 97 -38 6 218 65 211 141 -27 172 100 195 -136
5915a36K18j27K05k82Q3K31m54M06l09K28M2j47L4N3k59K29j58j95M16j43J65
$$ -136 82 -45 160 -122 -39 192 -262 144 -165 63 105 -42 -8 45 -214 15 -143 -338 78 -65 100
5936A00j65K93m34k16N10K9l49N59l32J69Rl39K90k90K73k8n8P6n6q3J19j71q0
$$ 100 -65 228 -206 -422 88 117 -232 327 -5 164 173 -166 124 -166 107 79 21 97 41 -42 77 -94 -174
5959a74j6j55L56l6k13M16k86m12L68r5P9l0J02L31l94m1O7K5j06L22K01j81k00
$$ -174 -190 -345 11 -25 -238 178 -108 -520 -152 -247 -168 -198 -96 235 -159 -200 -133 -108 -214 108 309 128 -72
5982g2K36k06J8O2J03q1J2j80p1K96J22k87J69N8k97J70MK1k10K42j87J41J14
$$ -72 164 -42 -24 38 141 60 72 -108 -179 117 239 -48 121 179 -118 52 56 77 -133 109 -78 63 177
6005A77Mm7l52J42r8K53k35R8L7K0J19j30L83m58J62J0K12m55J49J69k01K23j58
$$ 177 181 134 -218 -76 -174 79 -156 -58 -21 -1 118 -12 371 -87 75 85 297 -158 -9 160 -41 182 24
$$ [...]
8191C7
##END NTUPLES=NMR FID
##END=
