##TITLE=1H_K-376/2
 DMSO, 8 sc, 
 26.12.2019
##JCAMPDX= 6.0         $$ Bruker NMR JCAMP-DX V2.0
##DATA TYPE= NMR FID
##DATA CLASS= NTUPLES
##ORIGIN= UXNMR, Bruker Analytische Messtechnik GmbH
##OWNER= root
$$ XWIN-NMR		Version 3.5
$$ Thu Dec 26 14:37:50 2019 Russian Standard Time (UT+4h)  she@DPX200
##.OBSERVE FREQUENCY= 200.1315
##.OBSERVE NUCLEUS= ^1H
##.DELAY= (6, 6)
##.ACQUISITION MODE= SIMULTANEOUS
##.ACQUISITION SCHEME= undefined
##.AVERAGES= 8
##.DIGITISER RES= 18
##SPECTROMETER/DATA SYSTEM= spect
##.PULSE SEQUENCE= zg30
##.SOLVENT NAME= CDCl3
##.SHIFT REFERENCE= (INTERNAL, CDCl3, 0, 15.7039)
##AUDIT TRAIL= $$ (NUMBER, WHEN, WHO, WHERE, WHAT)
$$ ##TITLE= Audit trail, XWIN-NMR		Version 3.5
$$ ##JCAMPDX= 5.01
$$ ##ORIGIN= Bruker BioSpin GmbH
$$ ##OWNER= she
$$ F:/spectra/data/she/nmr/H-F/1/audita.txt
$$ ##AUDIT TRAIL=  $$ (NUMBER, WHEN, WHO, WHERE, WHAT)
(   1,<2019-12-26 14:36:53.46 +0400>,<she>,<DPX200>,
      <created by zg, POWCHK disabled, PULCHK disabled
       configuration hash MD5:
       00 E9 B6 7A A2 85 ED C7 34 08 36 98 17 FE 4E 26
       data hash MD5: 16K
       71 F1 57 4A 13 AC 86 DD 0A 25 E9 28 E9 BC 88 E6>)
$$ ##END=
$$ 
$$ hash MD5
$$ 8E 81 AA DB 8B 01 CA 3A 24 1D 89 94 60 2F E5 6A
##$RELAX= 
##$RELAX= 
##$RELAX= 
##$RELAX= 
##$RELAX= 
##$RELAX= 
$$ Bruker specific parameters
$$ --------------------------
##$DU= <F:/spectra>
##$EXPNO= 1
##$NAME= <H-F>
##$PROCNO= 1
##$TYPE= <nmr>
##$USER= <she>
##$AMP= (0..31)
100 100 100 100 100 100 100 100 100 100 100 100 100 100 100 100 100 100 
100 100 100 100 100 100 100 100 100 100 100 100 100 100 
##$AQSEQ= 0
##$AQ_mod= 1
##$AUNM= <au_zg>
##$AUTOPOS= <>
##$BF1= 200.13
##$BF2= 200.13
##$BF3= 200.13
##$BF4= 200.13
##$BF5= 200.13
##$BF6= 200.13
##$BF7= 200.13
##$BF8= 200.13
##$BYTORDA= 1
##$CFDGTYP= 0
##$CFRGTYP= 5
##$CHEMSTR= <none>
##$CNST= (0..31)
1 1 145 1 1 1 1 1 1 1 1 1 1 1 1 1 1 1 1 1 1 1 1 1 1 1 1 1 1 1 1 1 
##$CPDPRG= <>
##$CPDPRG1= <>
##$CPDPRG2= <>
##$CPDPRG3= <>
##$CPDPRG4= <mlev>
##$CPDPRG5= <mlev>
##$CPDPRG6= <mlev>
##$CPDPRG7= <mlev>
##$CPDPRG8= <mlev>
##$CPDPRGB= <>
##$CPDPRGT= <>
##$D= (0..31)
0 1.2 0 0 0 0 0 0 0 0.06 0 0.03 0 0 0 0 0.0002 0 0 0 0 0 0 0 0 0 0 0 0 
0 0 0 
##$DATE= 1577356612
##$DBL= (0..7)
120 120 120 120 120 120 120 120 
##$DBP= (0..7)
150 150 150 150 150 150 150 150 
##$DBP07= 0
##$DBPNAM0= <>
##$DBPNAM1= <>
##$DBPNAM2= <>
##$DBPNAM3= <>
##$DBPNAM4= <>
##$DBPNAM5= <>
##$DBPNAM6= <>
##$DBPNAM7= <>
##$DBPOAL= (0..7)
0.5 0.5 0.5 0.5 0.5 0.5 0.5 0.5 
##$DBPOFFS= (0..7)
0 0 0 0 0 0 0 0 
##$DE= 6
##$DECBNUC= <off>
##$DECIM= 24
##$DECNUC= <off>
##$DECSTAT= 4
##$DIGMOD= 1
##$DIGTYP= 9
##$DL= (0..7)
0 120 120 120 120 120 120 120 
##$DP= (0..7)
150 150 150 150 150 150 150 150 
##$DP07= 0
##$DPNAME0= <>
##$DPNAME1= <>
##$DPNAME2= <>
##$DPNAME3= <>
##$DPNAME4= <>
##$DPNAME5= <>
##$DPNAME6= <>
##$DPNAME7= <>
##$DPOAL= (0..7)
0.5 0.5 0.5 0.5 0.5 0.5 0.5 0.5 
##$DPOFFS= (0..7)
0 0 0 0 0 0 0 0 
##$DQDMODE= 0
##$DR= 18
##$DS= 0
##$DSLIST= <SSSSSSSSSSSSSSS>
$$ [...]
##$SUBNAM2= <"">
##$SUBNAM3= <"">
##$SUBNAM4= <"">
##$SUBNAM5= <"">
##$SUBNAM6= <"">
##$SUBNAM7= <"">
##$SUBNAM8= <"">
##$SUBNAM9= <"">
##$SW= 24.9337058887773
##$SWIBOX= (0..15)
0 0 2 0 0 0 0 0 0 0 0 0 0 0 0 0 
##$SW_h= 4990.01996007984
##$TD= 16384
##$TD0= 1
##$TE= 0
##$TE2= 300
##$TE3= 300
##$TEG= 300
##$TL= (0..7)
0 120 120 120 120 120 120 120 
##$TP= (0..7)
150 150 150 150 150 150 150 150 
##$TP07= 0
##$TPNAME0= <>
##$TPNAME1= <>
##$TPNAME2= <>
##$TPNAME3= <>
##$TPNAME4= <>
##$TPNAME5= <>
##$TPNAME6= <>
##$TPNAME7= <>
##$TPOAL= (0..7)
0.5 0.5 0.5 0.5 0.5 0.5 0.5 0.5 
##$TPOFFS= (0..7)
0 0 0 0 0 0 0 0 
##$TUNHIN= 0
##$TUNHOUT= 0
##$TUNXOUT= 0
##$USERA1= <user>
##$USERA2= <user>
##$USERA3= <user>
##$USERA4= <user>
##$USERA5= <user>
##$V9= 5
##$VALIST= <valist>
##$VCLIST= <CCCCCCCCCCCCCCC>
##$VD= 0
##$VDLIST= <DDDDDDDDDDDDDDD>
##$VPLIST= <PPPPPPPPPPPPPPP>
##$VTLIST= <TTTTTTTTTTTTTTT>
##$WBST= 1024
##$WBSW= 4
##$XGAIN= (0..3)
0 0 0 0 
##$XL= 0
##$YL= 0
##$YMAX_a= 147332
##$YMIN_a= -129393
##$ZGOPTNS= <>
##$ZL1= 120
##$ZL2= 120
##$ZL3= 120
##$ZL4= 120
##$ABSF1= 10
##$ABSF2= 0
##$ABSG= 5
##$ABSL= 3
##$ALPHA= 0
##$AQORDER= 0
##$ASSFAC= 0
##$ASSFACI= 0
##$ASSFACX= 0
##$ASSWID= 0
##$AUNMP= <proc_1d>
##$AZFE= 0.1
##$AZFW= 0.1
##$BCFW= 1
##$BC_mod= 2
##$BYTORDP= 1
##$COROFFS= 0
##$CY= 11.3945322036743
##$DATMOD= 1
##$DC= 2
##$DFILT= <>
##$DTYPP= 0
##$F1P= 16.9975609425685
##$F2P= -3.02152046262296
##$FCOR= 0.5
##$FTSIZE= 0
##$FT_mod= 4
##$GAMMA= 1
##$GB= 0.15
##$INTBC= 1
##$INTSCL= 1
##$ISEN= 128
##$LB= 0.24
##$LEV0= 0
##$LPBIN= 0
##$MAXI= 10000
##$MC2= 0
##$MEAN= 0
##$ME_mod= 0
##$MI= 1.114404
##$NCOEF= 0
##$NC_proc= 0
##$NLEV= 6
##$NOISF1= 3.799351
##$NOISF2= 2.8
##$NSP= 1
##$NTH_PI= 0
##$NZP= 0
##$OFFSET= 15.70392
##$PC= 1
##$PHC0= -10158.98
##$PHC1= 27.6008
##$PH_mod= 1
##$PKNL= yes
##$PPARMOD= 0
##$PSCAL= 0
##$PSIGN= 0
##$REVERSE= no
##$SF= 200.130013532006
##$SI= 16384
##$SIGF1= 3
##$SIGF2= 2
##$SINO= 400
##$SIOLD= 16384
##$SREGLST= <1H.CDCl3>
##$SSB= 0
##$STSI= 0
##$STSR= 0
##$SW_p= 3612.71676300578
##$SYMM= 0
##$S_DEV= 0
##$TDeff= 0
##$TDoff= 0
##$TI= <>
##$TILT= no
##$TM1= 0
##$TM2= 0
##$TOPLEV= 0
##$USERP1= <user>
##$USERP2= <user>
##$USERP3= <user>
##$USERP4= <user>
##$USERP5= <user>
##$WDW= 1
##$XDIM= 8192
##$YMAX_p= 0
##$YMIN_p= 0
$$ End of Bruker specific parameters
$$ ---------------------------------
##NTUPLES= NMR FID
##VAR_NAME=  TIME,          FID/REAL,        FID/IMAG
##SYMBOL=    X,             R,               I
##VAR_TYPE=  INDEPENDENT,   DEPENDENT,       DEPENDENT
##VAR_FORM=  AFFN,          ASDF,            ASDF
##VAR_DIM=   8192,          8192,            8192
##UNITS=     SECONDS,       ARBITRARY UNITS, ARBITRARY UNITS
##FACTOR=    0.0002004,     1,               1
##FIRST=     0,             0,               0
##LAST=      1.6414764,     0,               0
##MIN=       0,             -129393,         0
##MAX=       1.6414764,     147332,          0
$$ Real data points
##PAGE= N=1
##DATA TABLE= (X++(R..R)), XYDATA
0@%%%%%%%%%%qJ6j6J6j6J6k4L2l3M1m9N7p1P9q8J04j20J36j54J77k00K24k51K80
34A48l16L53l90M35m84N35n94O61p29Q04q94R91j101J226j365J527j716J940k212
53a181K549k977L547m346N556p635J2191m3171M7850P4943o6149j01885m8685
66a29393O3052Q9260L3988n2909o9740k3552M0459N7470L3472j4551m5201m5910
78f3555k006N2983O8602J2118o6450q4181q283Q1338Q7525l402r2103q4144J4086
91h7472R3477P1713k3670q7323n7092K6049P4754M6663j8993n7378m0926P763
103e2435M5036M4546Q972l5381n4002k4425L4747O8174L5003m2559q3604l6260
115i2188N5567R0863K6983o8183q9041j4233P2794P7053K032o6625o1623K045
$$ y = [0, 0, 0, 0, 0, 0, 0, 0, 0, 0, 0, -8, 8, -8, 8, -8, 8, -16, 16, -17, 24, -25, 32, -39, 40, -48, 56, -64, 72, -82, 95, -105, 119, -132, 148, -168, 185, -205, 230, -254, 281, -313, 348, -381, 423, -471, 520, -581, 645, -720, 807, -909, 1031, -1181, 1368, -1609, 1938, -2408, 3148, -4487, 7704, -35467, 12383, 87326, 21177, -80708, -129393, -66341, 22919, 56907, 3998, -65742, -89294, -48835, 8635, 42107, 27556, -17645, -63555, -65561, -12578, 56024, 68142, 1692, -82489, -90772, -9434, 78091, 74689, -17414, -101558, -87472, 6005, 77718, 54048, -33275, -90367, -64318, 10436, 57099, 38106, -19272, -60198, -52435, -7399, 37147, 46119, 10738, -43264, -67689, -32942, 35232, 70235, 27676, -55928, -92188, -36621, 54242, 81225, 13042, -75999, -90232, -17438, 59615, 61647, -4978, -66601, -64556]
127f4556N3373M9153M134l5927m1983j5647K2924M6161L2111j3895n3718m3385
139f1255J5177O6109N2056j9933p5669n1995K8852Q1223M6372l8074q1108l7536
151g5781M2635P2527K6149m1232o0216j9922L2104M6818K1280j6931l6590k8478
163c7637K838L6748M3161Q422m2143n5907r142N3298O3075M173o4239o4705M202
176e7856O7205N6695j4361o7275m8533J6293N7545L8555j5273m7618l3192Q082
188c9733L6427L3163L789k7189l6110j4463K4980M6506K5295k5734n6128k9046
200e8243L4073O5304K6173m2907o8000j8737M8873O2883R479n0511n3764l457
212d8834M3730M1429L210l2076l4217j0020J9994L2808K0297j1126l7107l0814
$$ y = [-64556, -11183, 37970, 42104, 6177, -35806, -51453, -28529, 17632, 49743, 35848, -17870, -61255, -46078, 20031, 72087, 52154, -23515, -75510, -46658, 34565, 80937, 42863, -38245, -75781, -33146, 39381, 65530, 24298, -35918, -55840, -23736, 23082, 44362, 27431, -9159, -37637, -34799, 1949, 45110, 53532, 11389, -44518, -53660, -362, 62713, 66886, 2647, -62058, -57856, 9349, 66044, 51683, -15592, -64125, -47832, 9713, 48268, 32995, -14623, -47815, -39733, -3306, 29857, 33646, 6457, -29653, -44116, -19136, 27370, 52665, 26931, -29197, -58243, -24170, 41134, 67307, 24400, -43600, -62337, -13464, 49419, 58898, 8387, -45377, -48834, -5104, 36325, 39535, 7459, -26758, -36778, -16784, 16024, 36321, 25195, -11912, -42726]
224d2726Q198M4744L8422j0095n2890m1486J4832N8357L9927k2289o0575l4731
236f0312K6388N7281K7300k8444n0452k1114K4571M0911J8076j5760l1830k0851
248c4236O015K7460K9230N061k7915l7931r980L5523M8331Q881m2285n0678l224
261d5748M9043M8456l179n0467m3054Q116M6372L4499r775l9522k9971N293L0543
274F06K6503R07k3736k7932r952J9479L2680J7944j8001l9468k2736K1676M7473
287B5443K4465k6409n1488k0411L3203N1842J4182l6102m6018q892L4489L7795
299C2099M288k7852l0872p738J7939K6200J3591j0542k8555k1638N728L1756K9127
312C3531n490l7598l2450Q624M2958L3995j2255m4969l0339J7202M5522K6259
$$ y = [-42726, -34528, 10216, 48638, 38543, -14347, -55833, -41001, 17356, 57283, 34994, -25581, -60312, -33924, 23357, 50657, 22213, -28239, -49353, -24782, 16129, 34205, 18445, -13385, -34236, -28221, -761, 28469, 33530, 5615, -32316, -42296, -6773, 41558, 50439, 8154, -42524, -45748, 3295, 51751, 48572, -1895, -44949, -36833, 9539, 44038, 34263, -5259, -35230, -29937, 606, 27109, 28016, 4280, -23652, -33604, -14125, 18555, 36499, 18498, -20970, -43706, -22030, 25443, 49908, 23499, -27989, -48400, -15197, 36645, 50827, 14725, -31293, -40185, -5696, 32099, 36387, 8535, -22337, -30075, -12136, 14064, 27655, 17113, -11442, -33080, -27352, 4404, 33531, 28041, -9557, -42007, -33383, 9575, 43570, 31315, -13654, -43993, -26791, 18731, 44990]
324D4990j8495m1206k1279J8368L5534J7574j4079k8931j7501O495K3482K0204
336B5156N49k1913k8053p017K3981L3763Q456k9622l8796o741L4761M0070K002
349C6596l7966l6667L440L7219L1524n040l2685k5723M321K6548K3253O12k1108
362D324k3119n395J6551K5023J1288j4620k9864j6105J5269L3911J8351j8826
374A6788l7959j7989K2256L9649J4636k5580l7620r957K5829L3540P272k2901
386G964k7510o370J7302K3720R710j1056k2092j5021O529K3760K0587m659k8174
399e310k4516N559L1211K5593p725l4368k4848J0410L4852K2061j2886l3125j8802
412c1894J2856K9711J6508j1122k4965j5178P356K1135J6219j674j8353j9846
$$ y = [44990, 26495, -14711, -35990, -17622, 17912, 35486, 21407, -7524, -25025, -18530, 4952, 25156, 25705, 3792, -24261, -31278, -7297, 26466, 34922, 5300, -33496, -40237, -5476, 34594, 36596, -1370, -38037, -34597, 2622, 34146, 29106, -3579, -29302, -24981, 1567, 24820, 25432, 4324, -18795, -24190, -7639, 17384, 28672, 14052, -15812, -31917, -16648, 17263, 35614, 16788, -21171, -39160, -16904, 22745, 37381, 11801, -25819, -35776, -9947, 23593, 30865, 7964, -19546, -25916, -8614, 15106, 24816, 13760, -8332, -23353, -16824, 6936, 27523, 22864, -5310, -29826, -24267, 6944, 32537, 24812, -9556, -34404, -23994, 10858, 32919, 20033, -13092, -31894, -19038, 10673, 27181, 16059, -8906, -24084, -16728, 4407, 20626, 18952, 599, -19247]
424a9247k758J8925K4581N584k1241k8646n853K4579L0330L523k7915k9409m71
437b8018K8151K6273k280k6176k2938J845K2462K0481K22j8350j9227l498J5857
450e196K0119P705j2793k2233j0742J2875K5383J3011j3468k8139j3635J5744
462a1369K8966J2695j8120k9755j0720J8538K7335P754j8203k4193p077J4903
474i246K0908P985j0992j8627j0387P199J9379J4164m064k0684j7957M521K3799
487E998J9471n395k6084j9514O904K6186J8477q739k5957j7089Q449K3669J4921
500B1297q128k1532j3877N900J8661J4064k628j6287j5463J14J5945J8268K906
513A9240j6028k0339m130J8298K3414L698k0000k3551j710K1223K1843K27k1336
$$ y = [-19247, -22005, -3080, 21501, 27085, 5844, -22802, -28655, -4076, 26254, 29777, 1862, -27547, -28018, 133, 26406, 24126, -2050, -24988, -23143, -681, 19800, 20022, 1672, -17555, -21053, -5196, 14923, 22628, 9835, -12398, -23140, -10265, 15118, 28129, 14661, -13478, -27113, -11369, 17597, 30292, 12172, -17583, -28303, -9765, 17570, 25324, 7121, -17072, -24149, -9246, 11662, 19647, 8655, -9972, -20359, -13160, 6219, 20383, 16319, -4365, -22322, -17801, 5998, 25469, 20074, -6010, -25524, -18620, 7566, 26043, 17304, -8653, -25742, -17293, 6376, 21297, 13169, -8363, -22240, -16340, 2321, 16385, 13757, -2530, -17993, -17879, -1934, 16334, 19240, 3212, -17127, -21257, -2959, 20455, 24153, 4153, -19398, -21108, 115, 21958, 22185, 849]
526H49j9873M68J7942J7209K0j5883j7307k289J2813J6334N038j1428j8007p161
540b1275J0984J9322R759j0416k0887r813J2062K2952J0352j2480k2388r312J3388
553g752K2267Q003j3596k0917p902J2147J7941O431j0122j6577q858O346J5908
566C319J0489m977j6513j2427L776J8586J4982l369j9137j4898N450K0605J5407
579B1293n186j9959j3863N560J9372J3017n821j8116j2621L647J6012J1930l735
592A1530j4878j3353N62J3386J3638R46j3358j5835j992J3777J7168L346j4708
605B29j7312k407J6239J8129K018j5429j6407l33J4922J5441J218j3219j4397
618a1308k128J1021J3889L645j0160j4732n848R022J4778O854r153j6667p476
$$ y = [849, -19024, -18556, -614, 16595, 16615, 732, -16575, -18864, -6051, 10283, 15321, 3893, -14114, -21275, -10291, 9031, 18790, 8374, -12513, -22326, -10264, 12688, 23040, 10560, -11828, -21140, -7752, 14515, 22518, 8922, -11995, -19897, -7750, 10191, 16622, 6500, -10077, -18935, -12589, 3319, 13808, 8831, -7682, -20109, -16333, 2253, 17235, 13866, -5271, -20169, -14719, 5886, 21293, 16107, -3852, -17715, -12155, 7217, 20234, 14413, -3703, -16324, -12677, 3335, 15265, 11530, -3348, -16701, -16139, -2753, 10885, 11831, -1527, -17362, -19354, -5577, 11591, 14937, 229, -17083, -19490, -3251, 14878, 16896, 1467, -14940, -15273, -351, 15090, 16308, 3089, -11308, -13436, -2415, 11474, 15119, 4959, -9773, -15621, -6599, 8179, 15033, 5880, -10787, -18263]
631a8263R160J6936P947r253j7082p881R887J7904P864r287j6734o714R596J6195
645A0275O703q005j4330p227O208J3865P661n059j3904j0060L207J3782J0825
658A3941m051j5051j1916L283J5553J1733m067j5275j1169M477J4988J1491l011
671A0926j3789j0494L535J3509J1220k054j2047j1125Q39J1915J1590L14j2021
684B318j2280j631J1070J3002J172j1581j3739k930J1977J4002J859j2256j3915
697a2932j602J1848J2970K010j0814j2189k097R676J2325L766q911j2046l956
710a1952P852J2890N284p805j3002n914P203J3557O184p930j3483o788P049J3357
724F502O787p164j3756o499O641J2779O644o200j2629o587N622J2176O970m418
$$ y = [-18263, -9103, 7833, 15780, 6527, -10555, -18436, -8549, 9355, 17219, 7932, -8802, -15516, -5920, 10275, 16978, 8973, -5357, -12584, -6376, 7489, 15150, 10091, -3813, -13873, -10666, 3116, 13941, 9890, -5161, -17077, -13794, 1759, 13492, 9425, -5850, -17019, -12542, 2446, 13937, 10926, -2863, -13357, -9822, 3687, 14907, 12853, 806, -10319, -9480, 2435, 14025, 14339, 2318, -9962, -11593, -523, 12479, 13651, 2070, -11669, -14599, -2622, 11380, 13239, 983, -12932, -14534, -2686, 10284, 12294, 1480, -10709, -12806, -3130, 9195, 12961, 4050, -7996, -11952, -4100, 8790, 14074, 6269, -6733, -12647, -5444, 8113, 14297, 6367, -7116, -13904, -6855, 6502, 13289, 6125, -7631, -14130, -7489, 5290, 11934, 5734, -6895, -13482, -7860, 4316, 11286, 6868]
738F868j1053p395L488J1622R052l207j1750r399L024J2107R273k706j2580r327
752a1983K237J1973R356k640j1417r310J561J1219R124j283j0442r485N19J0415
766a56R498M33r880j0017o2R317J0260J656q830j1025j871R281J1203J683r266
781B224j1142k019R176J0978J706q778j0627k644P974J0495K906p157j0334l324
795a0566O711J0547M261o218j0973m367N919J1070N243o033j1053n128N958J0679
809F050N461n593j0803n616M974J0491N724m660j0442o465M427J0125N730l758
823E645r744o511L320R666P025k763r514p303K473R768P497k063r619p890K270
838g743R657P504j485r356p522J065Q812Q119p82q795p950M21Q527P720K58q283
$$ y = [6868, -4185, -11580, -8092, 3530, 12582, 9375, -2375, -11774, -8750, 3357, 12630, 9924, -2656, -11983, -9746, 2227, 11583, 8943, -2474, -11784, -10223, 996, 10120, 8837, -1605, -11090, -10571, -156, 9342, 9775, -105, -10122, -10184, -867, 9393, 11049, 2219, -8806, -10677, -1396, 9807, 11490, 2224, -8918, -10937, -1761, 9217, 10923, 2145, -8482, -11126, -3152, 7343, 10249, 3092, -7242, -10566, -3855, 6692, 10953, 4735, -6238, -10605, -4686, 6384, 11627, 5594, -5459, -10587, -4629, 6050, 11511, 5918, -4885, -10501, -5527, 4964, 10688, 6028, -4414, -10879, -6452, 3673, 9403, 5645, -4099, -10610, -7290, 2376, 9401, 6638, -2876, -10179, -7706, 2062, 9559, 7496, -2123, -10013, -7743, 1914, 9418, 7933, -1423, -8945, -7880, 932, 9051, 8269, -526, -8476, -8055, 472, 8192, 8450, 167]
854A67q226p20Q131Q582M13p314q738q94P419Q549J487p191q670k152P460R263
870G566J468o732q799j782O322Q149K540o158q604k777N721Q779K835n138q714
885e324l879M956Q828L835m846q549l991M450R253M072m191q858l976L518Q809
900D107M609l713q229m875L564Q064N463l361q387n009K593Q242N273k621p803
915b083n553J408P995N847j381q324n895J405P891O229j672o972o379J123P092
930G31O773r89o815o431K21P053O635J64o977o843k92O501O921K42o456o958n33
947g053N559P238R32n949o778j358N433O910J853n590o972j525N243P030K127
962G100n015p046k074M750P319K209m298p135k663M062O907L098l913p140l340
$$ y = [167, -8059, -8779, -648, 7934, 8347, 1033, -7705, -8599, -1180, 7369, 8856, 1665, -7005, -9157, -1697, 7566, 9034, 2302, -6497, -8279, -1957, 6192, 8732, 2574, -6030, -8807, -3086, 5693, 8528, 3390, -5324, -9203, -4247, 4581, 8416, 3570, -4979, -8970, -4520, 4733, 8805, 4614, -4244, -8220, -4702, 4107, 8716, 5003, -3226, -8101, -4537, 3527, 8990, 5629, -2758, -7767, -5174, 3068, 8341, 5720, -2083, -7636, -6228, 1767, 7614, 6233, -2091, -7986, -6581, 1310, 7539, 5867, -1105, -7484, -6361, 731, 7504, 6515, -300, -6731, -6510, 543, 7178, 7342, 365, -6478, -6770, -269, 6652, 6894, 438, -6520, -7053, -1494, 5744, 6676, 727, -6051, -7409, -1976, 4934, 6787, 1197, -5775, -7300, -2057, 4973, 7100, 2085, -4961, -7035, -2285, 5034, 7243, 2945, -4190, -6853, -2791, 4116, 7214, 3301, -3839, -7179]
977g179L602P347L211l749p175l475L275P018L573k418p303l874K926O809L887
992F475k204o933l959K197O705M557k165o293m422J595O253M832j783o232m772
1007f149Q57O104N505j576o374m687R01N692N247p28n633n071K64N656N546j69
1023E385n270n647L9N401N479O94n267n363n78M957N440Q48n215n254j195M015
1039a531O137J180m590o089j092M317N520J934m459n671j811L548O193K200l741
1054B045n687k384L717N913K454l014n779k920L170N970K580k596o005l062K670
1069b928N604L086k557n592l097J957N302L992k061n714l862J961N372M076j827
1084C712n005m312J673N543L515j071n069m164Q27N517M032q17m898m344N01N257
$$ y = [-7179, -3577, 3770, 6981, 3232, -3943, -7418, -4143, 2875, 6448, 4030, -3273, -7147, -4221, 2588, 6475, 4271, -2662, -6621, -4424, 2281, 6838, 4673, -1620, -6042, -4447, 1806, 6638, 4855, -1377, -6149, -5292, 812, 6317, 4741, -1633, -6320, -5419, 273, 5520, 4792, -841, -5912, -5648, 8, 5554, 5385, 115, -5532, -5493, -92, 5387, 6081, 814, -4549, -5127, -170, 5270, 6118, 903, -4351, -5546, -1531, 4606, 5786, 1196, -4893, -5985, -1668, 3852, 5786, 1327, -4344, -6155, -2607, 3586, 5786, 2045, -3642, -6026, -2309, 3604, 6058, 3044, -2735, -5655, -2485, 3485, 6065, 3469, -2536, -5598, -2928, 2676, 5762, 3205, -2387, -5484, -3527, 1775, 5767, 3706, -2008, -5870, -3909, 1463, 5539, 3712, -1293, -5605, -3932, 1611, 5126, 4055, -1014, -5178, -4351, 1166, 5198, 4381, -517, -4861, -4360, 897]
1100H97M364n20m914m176J38M460M741k38m641m382m78M522M988M37m836m524
1116d162j75M052M914N28l952n069q10L894M893R37l432n275r51L550M740J454
1132E136l523n303j428L254N179J868l331m761k046K998M844K245k930m567k505
1147d870K752M776K847k790m713k115J915M998K353j749m821k777J936M348K785
1162D875j559m934k889J404M592L137j363m765l162J465M145L436j120m132l652
1177d522Q22M285L908n25m367l660O31M031L885m25m105l618J54L866L465r9l830
1194a04l749j93L567L921P43l748m432m3L329M029N00l164m258q44L417M146Q99
1211D016l077l795j250K809M126J205k691m335j255K565M181J728k770l674j900
$$ y = [897, 5261, 4741, -173, -4349, -4211, 249, 4990, 4752, 111, -4271, -4749, -227, 4761, 5198, 362, -4162, -4337, -285, 4629, 5157, 1205, -3864, -4674, -780, 4113, 5050, 1618, -3657, -4608, -1058, 3682, 5136, 1613, -3690, -5118, -1864, 3315, 5183, 1852, -2909, -4955, -1957, 2887, 5132, 2202, -2365, -4870, -2118, 2658, 5505, 2715, -1998, -4113, -2198, 2800, 5153, 3404, -1417, -4194, -2258, 2090, 4875, 3316, -1618, -4507, -3103, 1489, 4626, 3263, -1502, -4664, -3199, 946, 4382, 3262, -870, -4522, -3700, 585, 4493, 3968, -399, -4059, -3428, 603, 4488, 4063, -42, -3660, -3506, 360, 3825, 3726, -104, -3853, -4046, -479, 3442, 4185, 437, -3995, -4038, -709, 3320, 3820, 656, -3602, -4446, -1029, 3117, 4016, 939, -2856, -4106, -1297, 2829, 4034, 1343, -2992, -4247, -1682, 2499, 4227, 1457, -2217, -4117]
1226d117K490L513J776k256l657k028J762M068K123j804m090k486J781M095K711
1241C881k016m168k177J819L737K695j646l873k494J534L931K413r82m051k602
1256c999R30L746K993j175l703k839N54L237L374m15l344l319O54L744K791m9
1272C180l598l033J08L177L464Ml492l033r3K966L401L62k844l545m39K884L103
1289B572J039l042l452j000K958L342J152k950l674r42K648L824N49j759l627
1304b362j411K411L585J254k484l109j520K131L327J643j934l437j614J730L345
1319A555K121j501l345k440J729L452K083j613l123k326J505K991K103j008l473
1334a290j999O64L403K594j192l162k498J122K790K671o87l196k203N30K736K807
$$ y = [-4117, -1627, 1886, 3662, 1406, -2251, -4279, -2517, 1551, 3674, 1870, -2220, -4706, -2925, 1170, 3881, 1865, -2303, -4480, -2661, 1076, 3771, 2125, -1748, -4242, -2708, 1223, 3636, 2654, -1397, -3999, -3069, 677, 3670, 2495, -1208, -4047, -3493, -256, 3118, 2703, -641, -3960, -3306, 438, 3229, 3180, -418, -3451, -3343, -166, 3298, 3302, -190, -3223, -3316, -350, 3051, 3413, 569, -2976, -3415, -531, 2572, 3611, 569, -2883, -3883, -925, 2417, 3569, 619, -3055, -3997, -1349, 2475, 3024, 1265, -2362, -3773, -1362, 2223, 3477, 993, -2116, -3636, -1505, 1822, 3465, 1531, -1906, -3520, -1790, 1555, 3676, 2175, -1170, -3610, -1881, 1571, 3654, 2041, -1082, -3408, -1903, 1088, 3191, 2183, -1290, -3289, -2625, 778, 3372, 2180, -982, -3480, -2358, 432, 3103, 2416, -780, -2983, -2453, 283, 3090]
1350C090k42k919k968M35K939K728p0l085k975L89K611L054p4k818k709J4K389
1367b11K720M91k433l362q6K467K508P33j969l189l10K021L084R64k315l055p98
1384b740K043L228R28k136l121j125K315K767Q36j600k988j217J769K899J064
1399B922j782k346j708J157K894J723j180l235j650J141L523J593j013l311j504
1414b776J160L068J681j078k668j922R78K721J735o25k881j939P26K455K150o69
1430B116k816j758j27K871K022l94k177k291j43K616K697l4k692k500N66K109
1446F5K592K37k663k217k76K586J998N69k188k489k56J424K703M78j914k479q04
1463b634J787K461J009k338k056r78J727K573P23j349k739p62J295K800J293j611
$$ y = [3090, 2848, -71, -3039, -2604, 335, 3063, 2993, -92, -3067, -2678, -67, 2987, 2913, 95, -2614, -2600, -211, 2509, 3000, 567, -2795, -2881, -414, 2094, 2827, 858, -2331, -2641, -620, 2464, 3428, 1113, -1942, -2740, -697, 2531, 3459, 1323, -1798, -2923, -608, 2159, 2995, 1395, -1593, -2810, -1041, 1858, 2922, 1140, -1206, -2914, -1757, 1137, 2860, 1680, -1555, -3205, -2064, 1459, 3052, 2039, -1272, -2776, -1616, 1452, 3133, 2055, -613, -2535, -1557, 1164, 2899, 2274, -607, -2546, -1820, 635, 2785, 2116, -700, -2458, -2585, 286, 2308, 1914, -263, -2554, -2697, -81, 2616, 2582, -110, -2610, -2044, 65, 2657, 2894, 231, -1986, -2262, 324, 2322, 2891, 703, -1786, -2042, -618, 2085, 2563, 649, -1830, -2634, -847, 1614, 2623, 285, -1771, -2749, -1022, 1551, 2274, 925, -1814, -2576, -1281, 1519, 2812, 1201]
1479A201k809p95J349K536Q84j047k561j232J147K686R79j052k315j573J024K592
1495A014J425q70k301j860Q88K463J671q71k590j695J172K275J408n63k323j700
1511b457N57K302J856l4k441k170O20J796K253k58k319j907j00K057K055L5j861
1528a6k518J72K010K268K42j956k160j46J684K318J54j763k132k34J860J960N68
1545B311j774k134l44J514J933Q12j349k380q79J341K554O03j385k403q14J091
1561a303K276J126j502j668j258J050K454R00j139j948j152R71K273J055q40j981
1577f86j143O83K086J354m57k552j077M27J981J676p45k231j458L69K434J313
1593A974m64k274j440O17J802J796l02j830j636M0J897J691n5k004j725M65J977
$$ y = [1201, -1608, -2403, -1054, 1482, 2366, 1319, -1242, -2474, -1327, 1359, 2338, 1286, -1029, -2602, -1578, 1014, 2439, 1569, -732, -2592, -1704, 759, 2430, 1559, -1031, -2726, -1554, 721, 2129, 1566, -757, -2457, -1900, 402, 2258, 2224, -217, -2387, -1767, 29, 2282, 2024, -295, -2202, -2302, -245, 1810, 1845, -16, -2534, -2362, -352, 1916, 2158, 202, -1958, -2104, -420, 1898, 2052, 289, -1843, -2077, -217, 1743, 2311, 537, -1597, -1941, -427, 1506, 2318, 969, -1411, -2290, -949, 1605, 2208, 823, -1580, -2394, -1303, 973, 2099, 597, -1071, -2329, -1279, 1175, 2075, 936, -1012, -2164, -1193, 1080, 2135, 1295, -686, -1829, -1146, 940, 2294, 1837, -715, -1792, -1365, 616, 2292, 1547, -684, -2142, -1773, 661, 1974, 1510, -764, -2204, -1587, 215, 2011, 1709, -121, -1757, -1717, 180, 1871, 1816, -188, -1913, -1448, 529]
1610E29J476j8j744k030K75J542J886J76j670j814n33J966J938j31j512j870n17
1627b051J592J859N19j484j881l13R73K216O35j573j677p68J345J710O96j091
1643G07j847r23J510J672R87j261j853q83N96K201J116j181k037p72Q91J755J654
1660B332j395j799j192N80J811J506q94j498j356P94J646J008m20j866r02n0J907
1677B12J464m26j632j567O96J633J343m77j750j107q5J863J418k12j774r83k87
1694a671J282J713q6j259j612J90J340J665j02j278j528l53J801R90L98j284j371
1711a165m85J350J289Q19j437j169r04J269J362N81p93j657q55Q90J568J038j100
1728F01j839l57Q12J753N54o70j741n95R45J322Q70l57j757j126Q42J480J086
$$ y = [529, 2005, 1987, 243, -1787, -1512, 30, 1916, 2092, 422, -1392, -1925, 41, 1979, 1848, 336, -1534, -2051, -459, 1400, 1919, 435, -1446, -1759, -786, 1430, 2065, 492, -1185, -1953, -608, 1102, 1798, 707, -1140, -2063, -553, 1119, 2106, 845, -1008, -1891, -1295, 906, 2022, 841, -1196, -1968, -1077, 678, 2332, 937, -862, -2054, -1474, 337, 1843, 949, -549, -1905, -1111, 535, 1543, 1123, -743, -1645, -1695, 212, 1676, 1250, -382, -1949, -1253, 380, 1723, 1246, -504, -1611, -1696, 167, 1585, 1373, -401, -1384, -1671, -389, 1324, 1238, -21, -1633, -1443, -103, 1562, 1460, 182, -1346, -1699, 102, 1092, 1490, 206, -1165, -1650, -300, 989, 1808, 371, -798, -1702, -433, 929, 1510, 717, -940, -1795, -905, 663, 1701, 601, -1238, -1595, -783, 970, 1524, 854, -887, -1482, -537, 785, 1655, 1298, -459, -1585, -743, 737, 1823]
1745A823q20j476r49L17J668Q68m42j708r01N06J207J659p79j471j167M63J303
1762A01J361j88j643j264K21J541J178k08j226j125J35J381J270l4j464r49k02
1779a115J344J125k63q59j153m27J429J075L03j291j514k88J409J450L59j277
1795C07j413j50R98J126N70q15j634k78P10J709M38r16j579l81N11J596O06p74
1813F31r82j085R54J189R50p66j671o23L50J678P88o77j227r10Q52R98Q73m47
1831H75j246q59L32J267R46m02r89j380N15J350P62j24j390r53K9J324J164k67
1849I54j337j072L05J055J190j38r92j087j09J232J032N1p47j162l34J081J252
1866A174l1q97j146K1J068R46K67j009j525J53Q72J067M3q40j260m80R86J073
$$ y = [1823, 1003, -473, -1422, -1105, 563, 1431, 989, -719, -1620, -1114, 93, 1752, 973, -498, -1665, -1202, 101, 1462, 1274, -369, -1633, -1412, 129, 1307, 1099, -127, -1252, -1117, 264, 1534, 1500, 36, -913, -1115, 229, 1354, 1091, 232, -921, -1348, 81, 1156, 1459, 168, -1346, -1634, -225, 1225, 1584, 307, -1106, -1256, -258, 868, 1438, 623, -1011, -1289, -579, 1130, 1568, 652, -927, -1308, -797, 799, 1405, 631, -351, -1436, -482, 707, 1657, 891, -780, -1403, -1053, 625, 1413, 736, -491, -1401, -549, 449, 1322, 875, -371, -1230, -898, 369, 1315, 913, -76, -1456, -941, 409, 1171, 1047, -343, -1296, -1267, 57, 1221, 954, -383, -1455, -1150, -95, 1095, 957, -35, -1122, -1231, 1, 1033, 1084, 337, -825, -1159, -78, 1174, 1143, 246, -900, -879, 189, 1135, 1402, 393, -1132, -979, -107, 960, 1003, 163, -1097, -1577, -591, 482]
1884D82O44o80j254p39J035J323J12m46j033l47L37J249N15o32r29q51Q11R88
1902E85Q92r48q61p38K09J390O52m46j461p97N18J506O50l62j197r56M38J118
1920A92P96m9j194j055O15P97J109l83j106j014L26R76J123o0j295n43k05J220
1938B50P87j23j057q26j2J045J225o86n04j284Q2R52J154j37o46j180K8N22R85
1957E75K96o39p78m92N58J198L29p12q77n72O73J318q2m66j177l85N87J203M94
1976A051q71q74p00N99J303N47o92r66n28L10J279N68m36j339r0K36Q80R28n37
1995F68q96p00O51P83M25j06j028q75M05P41J014n35r09n55K06M91R71k43p27
2014b19q21L7R09R30L9r66p83j89J156P37j00m99j203J01J325M55M1p78j128j43
$$ y = [482, 1126, 446, -808, -1547, -512, 811, 923, 477, -556, -903, -566, 683, 1198, 566, -363, -1214, -403, 585, 1477, 529, -332, -1070, -861, 529, 1181, 735, -726, -1523, -1005, 501, 1151, 789, -408, -1364, -926, 192, 988, 939, -255, -1310, -695, 102, 1211, 828, -278, -1292, -966, 10, 1133, 1073, -222, -765, -970, 250, 1037, 914, -143, -969, -981, 64, 1289, 603, 99, -1185, -1103, -151, 1003, 866, 220, -960, -932, -410, 575, 871, 232, -546, -1038, -480, 718, 1047, 335, -542, -1114, -441, 877, 795, 329, -848, -1233, -646, 557, 1051, 180, -694, -1394, -795, 508, 1055, 363, -603, -1131, -821, 458, 1026, 590, -749, -839, -603, 277, 1205, 668, -228, -928, -277, 506, 931, 825, -203, -1078, -673, 68, 1082, 547, -362, -917, -711, -220, 751, 508, -219, -1040, -1003, -94, 836, 875, -91, -874, -1063, 93, 830, 730, 231, -972, -871, 454, 909, 950, 172, -956, -1099]
2034a099J020P56rn40q16m75R65Q76L68r47r82j48P00P57M33n00r59k85N59Q58
2054E32M05n80o58m28K47R88M68m06q82m67M17Q53L77m45r05l66J45J068O11p87
2074A87m46p08K45R83O49j77r37p91K05J217P4N1r99j37j37O03R48l00l32q00
2094f02k37J114N18j6q43o78j65Q01O10r2n64p54J50Q31Q85n14o61m54R1M12P97
2115F29Rn10n97l60P39J019k77k76r42j21N89P14K80l76j210j75O49Q15J66l94
2135C71r29m05R24O69L02m98q08l37q6J199Q4j38o91m75N86N55Q1r6m66m87J20
2156e25P66O20m97n67m24J54N21O21K1j330n5l1R62L16j74o33k40j14P67L66j5
2177E09n55n72K41M31J009l55p57l09j37M49Q37J18r36o83j71O42J004k56m58
$$ y = [-1099, -79, 677, 668, 128, -688, -1163, -198, 678, 1046, 99, -883, -1031, -331, 426, 859, 359, -600, -885, -326, 532, 937, 357, -301, -729, -482, 506, 974, 568, -314, -781, -364, 489, 866, 421, -484, -850, -705, 363, 974, 187, -259, -967, -722, 261, 910, 733, -204, -995, -790, 427, 501, 552, -447, -584, -721, -118, 830, 530, 198, -602, -839, 275, 793, 777, -66, -744, -909, -108, 502, 410, -154, -908, -758, 73, 958, 444, -217, -671, -580, -168, 629, 638, 128, -469, -829, -90, 929, 652, 376, -566, -687, -98, 616, 896, 520, -690, -865, -216, 599, 765, 371, -558, -963, -39, 630, 932, 434, -374, -711, -797, 402, 486, 348, -343, -818, -232, 323, 404, 308, -158, -645, -525, 241, 861, 364, -203, -627, -473, 48, 669, 690, -640, -695, -726, 236, 552, 378, -255, -495, -609, 158, 524, 509, -46, -618, -377, 54, 1063, 708, -49, -358, -495, -46, 791, 909, -27, -710, -881, -239, 765, 509, 51]
2196E1q17K0O21R39k57k80p29J11J25P25K21q28m49r6K64O24N00k25q31n06L13
2217e04J085L15n11r45j63O69P15j8o57k19o70O97L44L63j66o13m14P3N63M72
2237D16P5o04m35J90O30M37Nq48o88M65M97M23k61l90k84j46R37K80j86o24j97
2258c08P4L40N86l91n06l13K17M48M14m5l27n34j78L21R24q2p24k98k49L77O90
2279D36Ol51o86j51Q93N02k18j69m96j58K45N85l3j70p27K9J89O07M83n04q07
2300d95j87K95P86M69o25j82p43M68P22J88j68r77j04N1P93N79m80q20j16L25
2320b21J92P33k52n28l60k87R52L09%n29l31k46R05N0l8m85o90J33R67L31j35
2341D70m47m84j77P48K90q6n93R6r3J91O68r4l83o17j69L45R69M4n42o61J04K65
$$ y = [51, -766, -746, -125, 814, 557, 277, -452, -341, -216, 509, 730, -98, -547, -643, -379, 245, 745, 520, -311, -817, -504, 581, 896, 385, -560, -723, -54, 661, 643, -14, -233, -903, -206, 138, 501, 335, -278, -692, -619, -56, 416, 491, -113, -548, -358, 272, 709, 714, -134, -822, -357, 140, 563, 302, -88, -372, -518, 419, 699, 513, -111, -308, -234, 106, 692, 301, -205, -518, -301, 147, 561, 516, 189, -345, -523, -202, 722, 640, -84, -382, -631, -254, 436, 442, 91, -595, -746, 147, 649, 431, 262, -234, -392, -147, 438, 405, 235, -492, -463, -274, 333, 816, 312, -495, -682, -387, 399, 868, 243, 61, -682, -214, 508, 696, 528, -449, -553, -502, 291, 870, 390, -430, -546, -221, -29, 704, 452, -76, -436, -723, 229, 538, 538, 9, -322, -568, 337, 387, 349, -136, -826, -693, 274, 605, 470, 23, -461, -638, 110, 400, 314, -279, -183, -276, -85, 583, 489, 106, -511, -680, -335, 634, 678, 136, -525, -421, -156]
2363a56M93N1K4r05K4K32P89P7m45n59j01L11K60N14n22k94j26j80O76K38j69
2384B32l55m87J18O64J47no51k97M16K97K69j9q10j86M58Q04om34m40k06L89K12
2406A10K41k66k76l41J19J48L51N30o20n64j04J043J08ol11n66M4M56L92j05m94
2427a11m80J77L34M87j99l15r5K03l16M83K32Qr63J38J33O41R1k42k50n83L98
2448b29O75n6l59n44k26P43L00J92n46m51j47O09K20J45k27j3m32N11k60J88K58
2469C51m72j84O9N22J12qq56L6L55J69N49k19p48j87J00P02J15n37q9k17K96K96
2491A55J1J37m92m4j35N91r9K87j85n93m2N85K39J08p02k87pM03N39M1l24n71
2513c85J60J74L62K58n31j66m20M66L1O20k66m17k74L99N36m82k7k32l56K83L72
$$ y = [-156, 337, 388, 412, -493, -469, -237, 552, 629, 184, -375, -476, -165, 95, 609, 87, -207, -333, -513, 163, 401, 232, -123, -610, -492, 172, 319, 314, -337, -634, -218, 79, 348, 329, -481, -667, -209, 595, 589, 155, -285, -491, -102, 110, 351, 85, -191, -532, -413, -265, 86, 616, -4, -568, -672, 371, 479, 473, 162, -404, -360, 96, 488, 383, -111, -591, -414, -80, 407, 208, -107, -202, 1, -315, 168, 400, 408, -555, -417, -284, 357, 448, 206, -44, -627, -229, 446, 390, 31, -513, -739, 4, 304, 496, -50, -501, -648, -39, 181, 326, 99, 86, -346, 165, -95, 93, 351, -121, -305, -236, 286, 398, 390, -466, -430, -75, 94, 643, 424, -324, -511, -411, 291, 406, -131, -220, -437, -141, 155, 166, 303, -189, -233, -368, 223, 124, 411, 226, -367, -409, 176, 415, 523, -179, -466, -473, -70, 469, 510, 186, -385, -225, -51, 311, 569, 38, -128, -548, -82, -51, 569, 303, -114, -388, 11, 547, 65, 38, -194, -550, -267, 105]
2534A05J32r3p4n26K8J048q6m98l28k17L46M13K9l75Mj14J3L61K8oK36n90k06
2557c70N08M1K28o58k26R1K86M88j36m26N6J72N36j86j49k75l8m2K08o4J86l85
2579a55J4J02n0Q4J02O2l35j37K0L30M89k52r36L96L66K03J2j29l43m06N37OJ03
2602H3j72j22J96R8N0N3j47N1l08k9K48N41p1n61j07k26O96j34p7k94k43L72L02
2625A99J13j20m99j00K72K34J98k35k41P3P2NL12k94K05k54m16M17L85J07n67
2646a34k27J16J37K18K5k98m39L02L73J03L0l57r6j61M10K60r9m8m89M09k69M31
2668A97o3K25n82k62L5M51M07j47o60K00J85L6M49k40n32o3O06j61J67j50l29
2689b31Q0J42J27K72j8k83m80Q7L59j01K66l70j14Q9L06K91j28n36l5K00L24K82
$$ y = [105, 237, 144, 70, -456, -428, 620, 534, 36, -292, -509, -163, 250, 279, -96, -92, -206, -193, 168, 196, 190, 426, -164, -370, 138, 179, 407, -251, -477, -386, -100, 388, 252, -174, -118, 54, 590, 404, 255, -20, -58, -100, 108, 44, 230, -155, -141, -39, -89, -5, 97, 159, -176, -313, -293, 37, 526, 274, -662, -266, 100, 303, 315, 186, -157, -563, -26, -20, 83, -89, -211, -15, 83, 133, 186, 39, 90, -218, -247, 1, 542, 471, -90, -197, -423, 273, 139, 62, -232, -475, -103, 199, 312, 192, -307, -407, -135, 99, 297, 62, -179, -106, -34, -29, 283, -11, 194, -60, -476, -59, 326, 433, -134, -361, -245, -108, 110, 135, -163, -602, -300, 73, 176, 206, -151, -247, -408, 2, 262, 163, 115, -374, 35, -234, 197, 134, 359, -223, -485, -450, 1, 408, 261, -399, -199, -14, 22, 471, 231, -301, -364, 242, 81, 248, 98, -231, -151, -9, 118, 390, 372, 89, -391, -304, 55, -46, 220, -150, -264, -175, 131, 422, 294, -242, -277, -77, 247, 529]
2711E29q5m02m42J87L66M09m49k43jm0M88l74K66j19m85J83L1L63J34n39n0J42
2733a31o2N59o3j59l41k33K73L62j91J0j63k5M6L41j82M5l59K88j67K67j54K33
2755A94L6o73K74K98K04n49j1Rk37M47J95K90o29o2J75L30j86j95j01k04M71J18
2777A94j70J46m44k41L19J9L97j18k36R8k1j07J97M59n35o49N76J06L03k25o3
2798EL1k68M15j04Jl73k0M53j12J49o8j56j00M4P06m36j40O6m03o5K14J66N27
2821E32o37m11q9O77L36j02l75m34L34K08L23j23k82L0j47N5J93j15K16l77L22
2842A34m8J57L9k42j86m75P36L43k05j11k02n12N63J63P1j38l41k39N57K49l11
2863Br9K41m68J11L24j69K87k25j42O6L7n3M48k38m82O5L01L96m4l05j21L6K63
$$ y = [529, 444, 42, -400, -213, 153, 562, 113, -130, -131, -171, 317, -57, 209, 90, -395, -212, -181, 182, 316, -223, -273, -131, -193, 366, 303, 144, -197, -430, -157, 205, 14, 24, -139, -164, -118, 223, 41, 86, -273, 15, -152, 115, -39, 194, 230, -443, -169, 129, 333, -216, -227, -218, -455, -8, 187, 477, -152, -214, -39, 291, 105, -90, -191, -395, 76, 194, 24, 170, -274, -515, -196, -177, 220, 102, -134, -36, -57, -164, 33, 492, -43, -692, -116, -10, 293, 68, 5, 36, -232, 183, 79, 80, -293, -313, 140, 28, 177, 109, -47, -147, -103, 603, 167, 27, 93, -310, -375, -161, 5, 532, -105, -516, -605, 72, 408, 306, -69, -503, -169, 39, 362, 239, -43, -13, -160, -105, 88, -27, 189, -188, 134, 86, 243, 282, 40, -146, -621, 115, 458, 253, 142, -60, -572, -9, 154, 225, 87, -254, -493, 64, 313, 2, -97, 144, -324, -213, 111, -58, 229, 4, -138, -72, -35, -88, 360, 122, -360, -295, 6, 402, 358, 53, -68, -32, 231]
2886B31N3j48l95J78k5J42M3r9o9j70K53q6L49l12M14p32K48j18M01O7o5o30p4
2909e44L92L67P6q8p7o0k34M75l0o32O2K46J47P9o2M5m12K85J97j58o6K61J13
2932C82q06N17P3L28m15j52k63j5L59L61j51m31K03M7k15K71J20l81K73J23j87
2953D1J70N4n3l07O7q8K20J14l2l41J1K96J97J56o79m8l9N57j81K68m45P5%j18
2977a05L28K2j22l58L04k7L31p7l01m2k03K00L44J07r2n44K5K06J83Q7k35k85
2999b54O4K5N53Ml40k99k70N74J34nj32q0k73J53R3N09m49O4n41K75K03Q7K02
3022B97j59n22L35J13J06J7l40K2p9K41N9rj02k58M4K7K50J74l90K29l66K83J54
3045A26o4j52kk59N16K48j02k54l17J61K76k44M40l90j24K1J20j13P05l78m91
$$ y = [231, 284, 136, -259, -81, -106, 36, 79, -20, -89, -259, -6, -92, 257, -55, 359, -373, -125, -243, 158, 225, 160, -470, -544, -152, 215, 291, 203, 126, 66, -168, 307, 277, -355, -293, -47, 100, 179, 117, 162, -250, 35, 232, 74, 8, 269, 382, -424, 93, 166, 494, 79, -73, -336, -351, 8, 369, 218, -213, -10, 37, -178, 93, 213, -168, 105, 228, 41, 211, 265, 212, -95, -28, -116, 104, 218, 186, -155, -144, 152, 349, 505, -174, -222, -261, 296, 115, 383, -62, 13, 13, -105, 223, 245, 123, -235, 69, 42, 373, 296, -5, -47, -250, -50, 294, 401, 309, -235, -210, -4, 179, 266, 31, -254, -190, -165, 388, 392, 52, -247, -517, 57, 191, 186, 54, -26, -299, -146, -53, 456, 7, 71, -470, -195, 8, 95, 297, 138, -384, -49, 64, 170, 187, -153, -131, -210, 31, 90, 81, -21, -279, -235, -208, 42, 216, -174, 55, -311, -28, 126, 62, -90, -92, -351, 165, 413, 311, 57, -260, -99, 177, -67, 373, -17, -141, -120, 0, -113, 592, 214, -277]
3066b77J8K62j24J56j43k08j9J21L37K5L9n31J24J41K60p8P6l38r5M6M38J68n15
3089a17L7k76K52J81j44MJ7k6l81L07J46N6n3k61k20P07K80m9m49l41K48J19K19
3112B56j35n14M00P1m4L17m72r4r1L70K49j63j55k8m6q5l6Q2K76k99R6k3P7K63
3136B72j18n8j30j86K2O68k14o3k17km6L33k47j32L09l79M18q9R9k23q8J39j70
3159a02J43K5J37j48j65L1L82l06L9r2p9MJ36L03j77l79J84J16P1K2j66j71K44
3182E2l25M21J73l32k84J56O9K73k34K4j13J04J5L3M01n33J05j31k5M66j17j91
3204GM5l77K70l5K67J08k42j25k6n7M88k65K4l23K92j5M6Q9j01k57L2N0L81Oj94
3229H8l22j91M31K15K05m54k4k81K06K48J59l29k81K1K30R6l8O1l11R9n0L22K04
$$ y = [-277, -259, 3, -121, 35, -108, -316, -335, -214, 123, 148, 187, -344, -220, -79, 181, 103, 179, -159, -254, -208, 230, 398, -117, -80, -356, -104, 77, -67, -63, -46, -72, -453, -146, 0, 56, 3, -258, -478, 229, 509, 460, 11, -330, -82, 37, 256, 121, -393, 7, 78, 34, 351, -121, -215, -306, 64, 313, 150, -5, -33, -79, -164, -200, -118, 158, -141, -45, -68, 9, 272, 154, 96, -34, -220, -198, 470, 256, 193, -24, -26, -72, 261, 14, -118, 191, -188, 230, 141, 240, 17, -71, 68, -102, 41, 66, 203, 55, -110, -79, 303, -3, 36, -56, -135, -131, 5, 308, 131, -248, -64, 52, 123, 145, -21, -192, 52, -273, 148, 321, -11, -295, -139, -70, 203, -31, -7, -120, -16, -1, 32, 433, -100, 5, -126, -151, 315, 198, 7, 52, -325, -55, -90, 177, 285, 43, -82, -108, -165, 323, 58, 82, -241, 51, 36, 82, 171, 70, -187, -155, -105, 276, 282, 88, -234, -425, 6, 221, 426, -28, -52, -333, -127, 121, 280, -49, -330, -309, -79, 17, -21, 40, -271, -172, -222, 100, 304]
3252C04j28j47o60N68L29K52m17j05k69N9kN53n01p8K01K03K52l37n9j72k52M84
3274G8l7J4M5n4rn9J22L10j51l80n3J4K24n9K99l60k27L74n3j3J20j48j58K09
3298D8J56j19J37j81j10j21Q4K44K99m25l13J05K68M10l84M2q1l56J85J95K05
3319B88k99j24j30N6M59J55k92j89K25k53lL84q5r5l69M56N6J83l94l59k06L31
3341b05J65L10j28m55R2J23N5J24K73n77K58P0K7K0kn27J79M23L3J31j68k3k74
3364g6j19K19K19k50j83j20K56P5K13J7l40j20K27K18p6m15L16j2k38J0L48J95
3386C64l35M4m83L91j19R4n8Q1j56m1N53j73k04m3j9k1K97j05k16j33J17J17M11
3409C63m15J70j60o6M38j33j3O1n28J93K94j73K41r6p7j17k58N22ol79J1j95J65
$$ y = [304, 176, 29, -631, -63, 266, 518, 101, -4, -273, -214, -216, 337, -164, -242, -41, 162, 414, 77, 18, -154, -406, 78, 41, 55, 100, 46, 37, -22, 100, 410, 259, -121, -174, -160, 64, 5, 304, -56, -283, 91, 38, 25, 145, -3, -161, 48, 204, 85, 222, 41, -69, -190, -106, 138, 437, 12, -301, -196, 72, 482, 98, 140, 59, -297, -112, 83, 288, -11, -135, -265, -209, 250, 405, 113, -76, 149, -104, -107, 277, 192, 97, -272, 184, 240, 423, 29, -330, -536, -205, -40, 270, 142, -313, -221, -98, -43, 81, 354, -223, 35, 105, 132, 152, 150, -377, -198, 225, 258, 389, 221, 198, -76, -195, 24, 243, -7, -190, -310, -54, 21, 234, 251, -89, -209, 18, 236, 160, -255, 61, 49, -189, -179, 169, 364, 29, 73, -410, -19, -138, -44, -102, -21, -177, -218, 335, 162, -42, -85, -104, -125, 172, 67, -149, -282, -165, -48, 363, -52, 118, -42, -108, 330, 197, 184, 245, -283, -90, 204, 31, 272, 176, 99, -18, -276, 246, 240, -139, -128, -323, -158]
3432a58M16Rk96J44r7Q5r8J19P2l70P5j9J71M10l92l73K85o3j71M46j55r6J18
3455F2j03j21L23k77j89m4K42K66j47L73o45j43L10J83k4o3K94n64K83K10L5p6
3477A85j94j62J57j01%M12L0m69J33k88O80j28n3m76L9K04Q8Ql4Ok63M95m05L90
3501B54k73k19j95M18J18J58j38j95J33k00L41J11k21n1j46J89K39m5p3l88K14
3522C1l00L66R6J32k74l84K67L33m7j91Kj66K64K29k03j79O8j93K08n5J84j93
3544ej6k38L59k00L37p1J02l47j5K21N9P6l11j03j51K08L18k03j63j16K78k75
3566b56K42j4KO9j35M3r9L12j21k23r8K90J07L62n49j76r2L61J21j1j92k44K28
3589g3j73K72N10m41p0j62j25K98L18j95K5l82Q8J24N8k42M2L34l99M40J10m15
$$ y = [-158, 258, 267, -29, 115, 18, 103, 5, 124, 196, -174, -99, -118, 53, 463, 71, -302, -17, -80, -251, 195, 40, -56, 62, -41, -162, 161, -116, -305, -349, -107, 159, 12, 385, -260, -403, -93, 90, 66, 3, 297, -267, 16, 226, 261, 185, -9, -171, -14, -115, -115, 297, 327, -142, -9, -297, 383, 255, 202, -274, -235, -31, 57, 65, 31, 37, -226, 269, -136, 254, -19, -238, -433, -15, 103, 261, 123, -72, 61, -139, 202, 313, 92, 41, -105, 84, 323, 278, 205, -183, 31, -269, 97, 193, 325, 51, -333, -66, 267, 220, 29, 31, -135, 129, 358, 155, -24, 44, -149, 59, 4, 188, -5, -21, -259, 100, -100, 237, 166, 268, -79, -94, 127, 186, 262, -49, -152, -303, -95, 223, 20, -143, -259, 19, -256, -14, -28, -26, 43, -92, -49, -148, 164, 43, -180, -278, 12, 119, 481, -68, -244, -336, 25, 146, 135, -57, -301, -73, -246, 26, 536, 95, 25, -137, -262, 36, 354, 159, 184, -198, -110, 14, 72, -170, -128, 206, -193, 247, 357, -58]
3611e8p9M4m6ro7K39k65o4J94o9L07J02p6m35Q3J83j22L21j24k41K7K92n3K2J06
3636B12j02k45J19P3L85m20P8P0Q6p4K43n71N6j21O3M43m1n50J30j23K55J98l7
3659A27r2k39j7J31K81P0j27m31M09j77K22M9j49k22K08j43K28j23J64k79l65
3680d75N42j36J19K00l28k98k5K15O34L8q69L48q3J73Oj04J16j67k1M9J65K81
3702C80q12J25R7N3K35J41l07o9K30R2j40n9n8J8k15O94l08M36o39m56P2O10L12
3725D32l17j4q4m31M81J91R4l06m8m28L77J26l1k06O6q7J98rJ11j10K4k83p2K41
3749h5K28J45m36l1k72Q56j64O8k63M2k65L82J67k87k83k55K01R3L61L0k75j84
3771b27JL53k0N6m28q9N9M29q2l63L23j01J49j8K44j48J8n42L83j97N36l51k56
$$ y = [-58, -137, -93, -139, -148, -215, 24, -241, -305, -111, -180, 127, 229, 153, -282, -199, -16, -138, 183, 59, -182, -155, 137, 84, 106, 212, 110, -135, -16, 57, 442, 22, 100, 170, 256, 182, 425, -146, -90, -211, -148, 295, 254, -296, -166, -289, -34, 164, 127, 35, -204, -221, -90, 191, 261, 134, -297, 112, -65, 157, 206, 57, -165, 43, -100, 128, 5, 169, -110, -475, 67, -69, 50, 250, -78, -376, -401, -186, 448, 486, -383, -35, -118, 55, 61, -43, 73, -94, -115, -66, 99, 380, -432, -307, -210, -157, 78, 219, -88, -157, 73, 165, 25, -34, -92, -74, -289, 405, 97, 533, -106, -562, -490, 120, 432, 115, 101, 17, -414, 67, 258, 352, 46, -2, -430, -53, 73, 42, -164, -98, -185, 13, 4, 115, 5, 29, -254, -326, -85, 143, 288, -148, -179, -451, 405, 241, 309, 46, 88, -177, 205, 372, 85, -198, -453, -252, -159, 202, 232, -43, -227, -226, 127, 107, 163, -265, -354, -295, 134, 52, -311, 12, -89, 60, 42, 286, 138, 156, -386, -3, -200, 336, -15, -271]
3794b71lL50NL1J01k74r1J79N7j9j6M5q1j13J12K26O2l92j46k01M84K22j38n9
3818G0l78J2L08Q2K19p05K2L48K9j49K45L1l74J95J83J81j54k86pk3R9J70K20
3841C38l12m8j0k88N54R3l51R2j96mL51J26j38l63J4J43K53o2o8j95k23J8M92
3864B16o8l68MK03J83k9L1k17K42k62l85O14l4J24k10k26j30N10k05M5r0j44M7
3887a49L48K01j62l09k9R8N4O4L4j42l72L11pK79Jk11m73O92m38M80j05k05k71
3910c11K56L54j17J8R2m63j7J55l4M10k83l13q7K17kL19j49K2j30k95M17K24q
3933B75n70L46j3J72j70r6p7p6J1J93J34k77J16r6j16K55K09l43Q0k38J47J41
3955GK49j22k79Q7j98L07j75N4k4r3J31N7K2Q6l36L07j39P9K33k36j11l04J79
$$ y = [-271, -274, 76, 81, 112, 213, -61, -152, 27, 84, 65, 49, 94, 13, -100, 12, 238, 300, -92, -238, -439, 45, 267, 129, 70, -308, -296, 12, 94, 313, -392, -370, -22, 7, -142, 103, 134, -240, -45, 138, 319, 165, -121, -128, -151, -52, 118, 338, 26, -22, -32, -320, 234, 327, -24, 68, -128, -132, 219, 345, 207, -156, -142, 1, 254, 192, 124, -71, -294, -276, 216, 148, -220, -216, -13, 170, 141, 172, -45, 197, -65, -450, 164, 130, 254, 44, -182, -312, 198, -7, 38, -52, -196, -149, 199, 400, 238, -71, -100, -2, 52, 116, 150, 8, -364, -53, -60, 219, 220, 9, -464, 228, -210, 270, 165, -40, -311, -55, 299, 182, 200, 292, -171, -188, -33, -67, 343, 60, -253, -340, -123, -125, 194, 45, 67, -63, -358, 59, 283, 275, -295, 51, 38, 210, 40, -56, -133, -209, -198, -5, 129, -148, -32, -128, -244, 11, 220, -123, -43, -281, -134, 7, 256, 134, -145, -58, -256, 51, -124, -70, -94, -187, -56, 1, 23, 109, -227, 80, -59, 20, 253, 17, -94, -398, -219]
3978b19M17R0j90k01m6R5q3K49Q3j98k4j41N22l88jK29j49j33m1K80j83K00m25
4001b57o3R3K38K77l41r4l7J91K53j10k92n0j86K27M01j56k52R1J35j63M29m25
4023i1L16o42O41m14K18M39k91p6l94L08o8J9n5J65m90K96L69k96K02j69j89K27
4045B5K01o9l6q6J36R5k12l4N0l03J58J20J30N3j57J54m08J96m0J25K12j94p0
4068D6k35J41PL08j61l19R6p2L71j03k01J43j68J9L70k79J77n44N25p7K2J85r0
4091A61k98j18M80k34K90m11K2k08J0N46L2k17k17J96j45J39K55p04K34J79o7
4112g5K25K16k53m42M50L6k17l3K10o6k48Q0L43L4k94j2O8k02K09K73j84k74n0
4135b06J21m4J82K34o27j01J01P76j07k37L1j02j20K81J93k37j57L3J10o1K21
$$ y = [-219, 198, 288, 98, -103, -149, -54, -137, 112, 195, -3, -27, -168, 354, -34, -35, 194, 45, -88, -129, 151, -32, 168, -257, -320, -227, 11, 288, -53, -147, -184, 7, 260, 150, -142, -192, -378, -151, 250, 94, -158, -67, 68, -95, 334, -91, 225, -417, 224, -190, 28, 467, 176, 100, -294, 14, -54, -35, -90, 75, -415, -119, 250, -46, 156, -13, -202, 25, 226, 157, 121, 35, 171, 266, 54, 20, 70, -233, -75, 45, 175, 228, 71, 225, -183, 13, -27, 98, 310, 116, 46, -189, -48, -41, 267, 106, -213, -117, -189, 182, 79, -122, 21, -147, -128, 242, -37, 140, -404, 121, 44, 66, 251, 161, -137, -255, 225, -9, 281, -130, -108, -316, -306, 240, 272, 55, -162, 34, -111, 28, 283, -421, -187, -8, -75, 150, 366, 113, -329, 121, 157, -60, -93, 117, 51, -197, -117, 226, 260, -34, -46, 22, -180, 29, 302, 118, -156, -206, -85, -129, 53, 287, -340, -441, -340, 436, 329, 92, 123, 21, -99, 182, 375, 138, -19, 14, 124, 63, 284]
4156B84M9k18j67Ll0M01k68o6j0k19m1L69J25r8n3k12O8K52j48K20l43j4K24j81
4180g3N1K19J8l85N29n29N19l90J1j31j1J29M12l46j9J33k29K6M91l21j17l12
4202c25m0K06N8L15m33K45J10k03K84o5j78j34M56m30K68mJ19m93J77K70j51O5
4224A17k39P1o3j42M48Q3m85j2K68J74j21Pn8l47J99K87k07J89k49j68J8Q5J76
4247C1P3j57p5n5rM37k84m3K02k23o1J55J56m16J0K92O8J36P4j54j11n9m4L54
4271B97N4k14m85J51J51J87K24n77N4j74K28J09J09K4k38J30k76J72K49j98j00
4292a23m6J98J58J38j18k51k90J61L56m30N37o7l58J26l7Q9R5l17M1J24n6J69
4314I9m4l4J29j10J21O1k16p4k18L20L1m0J22o2j13J8J47j16l79K99j18J24Q0
$$ y = [284, 333, 115, -52, -49, -79, 322, 54, -12, -22, -241, -282, 87, 212, 114, 61, -151, -83, 169, 21, 241, -102, -116, 108, -73, -22, 197, 215, -170, 359, -170, 349, -41, -30, -161, -172, -43, 369, 23, 4, 137, -92, -66, 425, 104, -13, -325, -365, -159, -101, 214, -219, 26, 136, -67, 217, 152, -26, -160, 296, -134, 134, 130, 249, -244, -67, 203, 52, 117, -122, -51, -114, -256, 192, 275, -210, -222, 46, 220, 99, 106, 48, -299, -100, 187, -20, 169, -80, -248, -230, -145, 31, 104, -53, -128, -183, -192, 245, -39, -82, 120, -103, -164, -9, 147, -269, -259, 33, 101, 237, 311, 157, 46, -13, -57, 297, 351, 137, -348, -197, -46, 141, 365, -212, -158, -332, -104, 5, 114, 138, -100, 30, -246, -74, 175, -23, -123, -169, 29, 187, 325, 207, -44, -334, -173, 183, -247, 290, 223, -135, -9, -46, 43, 138, -179, -138, -14, -70, 99, 55, 21, 150, 40, 161, 222, 6, -68, -286, 34, 65, 25, 147, 85, -28, -10, 137, 21, -358, -59, -177, -53, 27]
4337B7j38K23J19n55K5J00M24n2q1k95L6K63qP6j55j55K19p6L25q9k49k9K2J38
4361A15l74L90j15M4k30J8J93P3j4rm7k6R4K37j95k96L13k46RJ90l0l2l45J74
4385a09j6P4K41Om63K23K36k58J58J32k53O1kJ59J12j62j46P1K4j34K35m2m97
4408c50K53M6L25r9j64NJ4k04L21%p2Q2k92r2N3J74J57k97j23K63p5L53l42k76
4432c40K54K26o9m4K1k38n0Q7K94j77R1K12j77k63M17j9m74L33o4Q1k69N0J49
4455C1j30j6r6M36k52l6k59M84k26J40j42J52J5k14J85L1j02L0k48k0J44k00M48
4478A55j38k00J04j67J3L10J42k02k99K56J78P9M1l86L4j38L91j18p5J4p4K40
4500A60l37K60j05K94m30p5o1N04j94J58l82j09J05J58n0J10J19j77J83LM19n24
$$ y = [27, -111, 112, 231, -324, -299, -199, 225, 173, 92, -203, -167, 96, 88, 164, 9, -146, 73, -3, 322, 233, -16, -45, -23, 115, -259, 131, 16, 60, -170, -152, 41, 114, 100, 91, 44, 18, 112, 349, 154, -142, 171, -75, -66, 124, 94, 62, -283, -109, -125, -51, 190, 196, -267, -44, 192, -66, 92, 224, -29, 32, 30, 189, 301, 139, -7, 64, 88, -46, 189, 147, -350, -97, -51, 274, 175, 11, 16, 30, -174, 147, 147, 75, 157, -135, -227, -174, 0, 157, -140, -263, 0, -75, 278, -64, -340, -86, 140, 71, 27, 48, -190, -240, -153, 141, -36, 55, 267, 90, -173, 244, 225, -249, 84, 20, 101, -168, -118, 31, -99, -115, -211, 225, -27, -63, -322, 162, -64, 76, -66, 86, 101, -113, 72, 103, 1, 31, -217, -237, -93, -293, 155, 17, -183, -79, -246, -233, 77, 219, 17, -282, -26, 152, 231, 272, -114, -80, -218, 173, 55, -20, -6, -80, 160, -177, 83, -22, 272, -158, -233, -294, 210, 16, 174, -208, -317, -212, -54, -104, 6, 125, -52, 131, 134, 553, 29]
4522B9k51K18j30J61N5J35n09K74j26L38j69jm08N67k37K96K4l82k47K54J47q6
4544d8R9J77l97K90l07K93J19n00L23j77j15M63j67k02j60K64R3M8nN8k66j89
4566c06K42k88N64M3l49K36k83K43L04m05l0J18o2j59M06k28J10k43o0K64j85
4587f8Q5J23m96R3L44K21q8j33k11J19P2k05K66j15j70K30q4L12O8n36L76m24
4609b21J87J12j59p8K50k83J17J75j66O4R4j93J00l24K25RJL58m52L86o5k70J45
4632A2J02m99N64M2j50J24l60J42k3J58l01O7OJ0K57j41j30j66j47N33O2j41K7
4655D8j55l0N20m34J30o3k79L24k73K87K79l05j07k94L13L19l73M76r0q4l37M52
4677C24j80j37K22j03l37M52k6k25J0k36J32J69q8K20k75l29M52j71L11O3j60
$$ y = [29, -222, -4, -134, 27, 82, 217, -292, -18, -144, 194, 25, 24, -384, 183, -54, 242, 266, -116, -363, -109, 38, -48, 51, 228, -169, 121, -186, 107, 226, -274, 49, -128, -243, 220, 53, -149, -309, -45, 48, 96, 91, 149, -117, -306, -64, -352, 212, 255, -94, 142, -141, 102, 406, 1, -29, 89, 27, -132, 274, 46, 156, -87, -147, 117, -68, 17, 140, -356, -263, 81, 302, 214, 81, -130, -11, 61, -144, 122, 7, -163, 67, -17, 295, 363, -173, 203, -221, -34, 78, -81, -159, 91, -192, -75, 100, -66, -2, 92, -101, -1, -325, -100, -91, -90, 268, -184, 202, 137, -133, 12, 114, -385, 179, 221, 71, 195, -165, -23, -46, 112, -189, -122, -116, -106, 151, 10, -120, -286, -433, 100, 162, 21, 48, -107, -137, 383, -51, 79, 16, -263, 61, -212, 75, 354, 49, -58, -352, -39, 280, -93, 383, 293, 209, -128, 324, 144, 7, 229, 126, -211, 241, 215, -10, 0, -236, -104, 65, -23, 197, -78, -407, 45, -126, 185, 248, 88]
4698H8k47K31j87O4L1j48k7L3J53r1K23l18J33l38L06M8p9J28r7J20r4m3K53l58
4722b16N7P5K26j13l3J09j13R2Kk06J10k66J20Q1Jn8J99J48k35k0N0k07M14k92
4746g5J68r4m40K76K29L5j83j81L90M0l98N62l70P3q1k15L83k2j02K12l57J46
4768dO6J52n8m94J31P1j28K54l5k85L13nJJ51Rm43N08M0k77K97j55k45K76m1j0
4793H9j10J83Mm62K90J26J77l13K76n75oM66L3j3j39K00m48L91k51R2N9J0j15
4816c6k4J71J68m16J11J88k2k00J88l32J71j12M67k10j65r6k9M79l61N7J67k05
4838d1k16K46q4j81K71n3k11J68P7o8K41j61k78R9J46K69j74m0Q6q5J69j7k1j78
4862c6l03L42o6L93k32K82n96L85j99R6j84Q9j44J99Q6k27J53k72J03LQ5K25j06
$$ y = [88, -159, 72, -115, -51, -20, -168, -195, -162, -9, -100, 123, -195, -62, -400, -94, -46, -125, 3, -94, 26, -68, -111, 142, -216, -159, -84, 142, 29, -4, 105, -8, 84, 86, -120, -10, -276, -156, -75, -74, -132, 67, 215, -20, -40, 10, -197, 217, -75, 93, -1, -441, -165, 64, 99, -84, -265, 125, 165, -233, 329, -41, 32, -49, -264, 119, 97, -5, 207, -150, -4, 62, 214, 156, -338, -207, -136, -264, -10, -45, -330, -17, -22, -21, 130, 139, -304, 204, 244, -33, 264, 109, -136, 140, 99, 89, -21, 162, 166, -296, -6, 120, 297, -16, 260, -315, -321, 145, 178, 165, 26, 226, -222, 169, -82, 10, 69, 79, -36, -60, 111, 279, -137, -26, 162, 140, -60, 128, -204, -33, -145, 322, 112, -53, -149, -178, 301, -60, -3, 164, -41, -257, -11, -95, -276, -5, -58, -269, -101, -24, -92, 149, -12, -290, -191, -45, 224, 50, 10, 96, 11, 180, 163, 142, -36, -339, 3, -63, 330, 98, 380, -216, 169, -30, 66, -118, -29, -173, 26, 112, -115, 38, -234, -131, -128, -43, 182, 76]
4885G6n7m3j38r2L58m2j66L97m88R6k3J6J22j0J1Q2L28k95j8j52j3j70KN28m39
4910a30OMJ22KJ35k79M81j68m15N60k69J86l48K96j36JM2p7q5Q8N8Q7l5k14K1
4935f7L85k73K44m12o7K11Q2Q0k09J91l39O6J06M9j40J16J28n4j36j8Q1k01N7
4958a20j19J92J52q7n1K16J07k85M2j68K86j43J35J21o48L72j4K4j12J79j20Q3
4980D2J00L8M4Lm36K89j64O1P7l78L07j71O7J54k73M78m04L69k45n3J64m57K30
5003a58K94O1k40k10J20J13n5J9J53m2k33l7K65M2j10J25k04J19l84K13J61l0
5025a8k7J71K4k7k80J12Kj8j10K13J74k79O7k68K70K37k97j41K71J09j78j71L98
5048B34l95K92r5J65j17O2k97n0K20k67K95r3Q8J35l49N47k14m6q0j24J30m92
$$ y = [76, 19, -24, -162, -254, 104, 62, -104, 293, -195, -99, -122, -106, 16, 6, 17, 99, 427, 132, 114, -38, -51, -221, -219, 309, -130, -124, -120, 2, 4, 139, -140, 341, 173, -242, 318, 49, 235, -113, 183, 47, 48, 90, 13, -72, 16, 74, 161, 126, -88, -67, 318, 45, 289, -123, -190, 21, 103, 183, -26, 165, -174, -108, -2, 47, -93, 23, 151, 97, -39, -57, 24, -177, -120, -239, -47, 105, 18, -33, 183, 290, 5, 47, -121, 165, 22, 157, 278, -370, 2, -12, 12, -100, 79, -41, 42, 142, 180, 224, 227, -209, 80, -84, -23, 54, -324, -17, -188, -121, 33, -240, 238, -166, 203, -42, -95, 69, -388, -158, 136, 197, -43, -253, -133, -20, -75, -56, 97, 55, -178, -215, 50, 92, -18, 107, -97, 22, -362, -149, 12, -18, -45, 126, 150, 123, -157, -45, -43, -61, -171, 42, 216, -63, 4, -264, 6, 243, -54, -195, 76, 185, 7, -164, 234, -161, 131, 36, 201, 84, 146, -151, -201, 19, -248, 47, -46, 42, 177, -172, 375, 161, 115, 35, -89, 41, -451]
5070d51M88r8l7O2q3k4K26j67K8J54k3Mk92N6J95K51n02K55j11q3J12M8j88J23
5094e7J93j26Q6K69j24j83l1J32M0j9q9R9l80r2O30k62k33J58j03J35L91m52j93
5117b11J43R6J44k76K08J01l06j72K36K02J33l10mo4J17J34l0l24N40n35J8L90
5139B30l54K12L9m81M70n2J45k39j88O7M4K08J89l04k82K36j63M02l44L12j58
5160a1K56j50k73j7L15j25J43r6K15l03k51L54n7k15K87L4%j97K4M2l1M3O6J63
5184B16j31l01j50M21j70L96m20J63k15J84L7%M4p0n5K84k37j80K04K41k77r6
5206a12L29k42L52r1j03j21l08M21n1k01J72K49m23K10k82o1J83K8k40J89N5q9
5228a36J89n0J23K01j71k10N3J96J05m59J84J81l47L24K1j35N8m1M8k23K02P2
$$ y = [-451, 37, -61, -98, -36, -119, -143, 83, -84, -56, 98, 75, 79, -213, -157, 38, 289, -213, 42, -69, -152, -40, 8, -180, -57, 136, 10, 96, 365, 241, 58, 27, 159, 199, 180, 91, 190, -190, -282, 348, 86, -147, 11, -92, 43, 434, -18, -211, -68, 28, 172, -104, 104, 205, -101, -273, -37, 165, 298, -12, -16, -80, 37, 171, 141, -183, 357, -178, -160, 230, -124, 88, 127, -354, 116, 64, 209, -30, -218, -151, -107, 101, 290, -14, -296, -60, -223, 179, -165, 147, -11, 245, 95, -178, -195, 120, -5, 138, 42, 257, -46, -297, 57, 0, -215, 72, 106, 106, -91, -67, -25, -56, -13, 53, 216, 85, -216, -366, 55, -115, 281, -139, 24, -191, -7, 30, 30, 74, 4, -51, 233, -4, -184, 20, 261, -16, -112, 217, -25, 327, 236, 133, 12, -296, 125, 74, -127, 45, 294, -129, 81, -201, -262, -79, -51, -291, -102, -47, -136, 53, 3, 126, 327, 156, -54, -1, 195, 300, -159, 25, 206, -141, 183, 204, 69, 127, 86, 134, -89, 113, 185]
5250A85k22J08K74m54J1L25l0l28n5p3M96l34J6O6J66l56K26J77l12M05n00o9
5272b78J95J33k58K76J30m45K97L17l66K9m5k62L23j72J2Q4K1k32R2N9J06j09
5294i3J35j94L26Qj99o0K4P9j12K14j12j80P8L0L48j24J58l16K08n32L17K0j21
5317i8M14m80K51m8k94M35k37J88k35L92kN1k48K5m47L10K00n2j68j25J40L35
5339C07m67K97O5j55r7k44M21j33K03k57N8k7J21K14l14j91J06lL18j83J57l70
5361a74M4K49k87p1J63K86j38k50J60k20K21o8J37qJ44o4r2k8m54J50K99L5Q9
5384A23J90m01q7R3p9J8K91j66P0L1O8j10j56J25j85J86j93P8j38M54j04O0k18
5407e0K08j84nJ72r6J07J27l73J0o6Q7L49l50j46J77rJ91l10L11r4j63K05k10
$$ y = [185, -37, 71, 345, -109, -98, 227, 197, -131, -186, -259, 237, -97, -81, -15, 151, -205, 21, 198, -114, 291, -209, -278, -83, 50, -208, 68, 198, -247, 50, 367, 1, 30, -15, -277, 46, -126, -114, -30, -9, -241, -149, -90, 16, -93, 42, -152, 174, 182, -17, -77, -53, 26, -86, 128, 16, -164, -86, -56, 292, 168, 326, 10, 218, -314, 3, 23, -98, 316, -164, 87, 39, -255, 180, -57, 131, -104, 288, 286, 337, 89, 114, -333, -23, 177, 125, -43, -168, -28, 307, -160, 137, 202, 47, -50, -294, 127, -6, 197, -60, -2, -29, 92, 306, -8, -199, -93, -96, 222, 39, 196, -174, -130, 119, -168, -239, -76, 210, 72, -178, -18, -238, -17, -85, 52, 44, 188, 124, 32, 4, -450, -300, -1, 34, 123, 313, -88, -175, -82, -161, -143, 148, -18, 52, 83, 151, 41, -115, 10, -175, 11, -182, -104, -242, 212, 108, 168, -50, 158, -26, -31, 141, 45, 152, 279, -94, -84, -150, -63, 286, -64, -210, -33, -42, 149, -161, 150, 56, -107, 98, -112]
5430a12m3J00k81J46J74o8j6R2n0l3K29m28M15j81o6L73o99N16p6q7q5K67j68
5453h1J89j94r4R0Jp3K58M9m18J82R3l56L10J41P8k90J28k50M18j62n8R5Lp3J3
5478aK28m45N09n98M10j08r1po4L11l05m0J30K9o1L47n64J02L49K76n56p7N8L14
5502A46k05K24J92k98j14J10r3O7r3J86k09m9K20l37O4J88m4l6k9L04k42K06J78
5525C36n47K51K18k81j71M25m1o0l50K58k01R5m7p1M2K59k28K41J82k31j59O4
5547a6K95k20j46L94m66q6J47J43l67O09j58p4q8j87K96r1J62k98LK61J20l46
5569a13K01J9r5M9m09N84k03l8K23l79K85j80j47J83N6j67J54k39K3r8L88k3q0
5592fJ6J7m8N7K3n3j19rN6L48M3k57k31J45P4j11J4j8N1P7j81j43K93o9qj95K58
$$ y = [-112, -155, -55, -336, -190, -16, -84, -100, -8, -58, -91, 138, -290, 125, -56, -122, 251, -448, 68, -8, -95, -180, 87, -81, 108, -86, -180, -90, -89, -162, 96, 145, -273, -91, 2, -354, -44, 97, 175, -115, 13, -237, 181, 19, -39, 56, 59, -14, -1, 227, -218, 291, -307, 103, -5, -96, -103, -167, 144, -161, -201, -71, -42, -103, 244, -320, -218, 131, 407, -149, -226, -168, 146, -59, 165, 357, 59, -55, 55, -38, 29, -64, 122, -87, -136, 84, -253, -189, -1, -45, -81, -110, 194, -48, 158, 336, -211, 40, 258, -23, -194, 231, 190, 130, -220, 38, -163, -68, -115, -186, -144, 115, -113, 128, 310, 79, -80, -16, 279, 59, -87, 307, -159, -245, -98, 45, -322, 287, 129, 55, -33, -220, 76, -15, 147, -151, -148, 113, 233, -113, 88, 107, 12, 61, -348, 236, 33, -5, 218, -161, 124, -56, -203, -20, 36, -131, 23, -216, -193, -291, 97, 74, -6, 10, 27, -21, 36, 59, 6, -113, -122, -66, 282, 325, 68, -163, -18, 56, -55, -41, -59, -8, 69, -112, -255, 38, -31, -39, -234, 24]
5619B4j58J57O0k96L05j15rK6Rm7l07N59l89J45J82l56J74R3l22K08k50M45k17
5642g9m2L40l26M4n3r4K12k0K23j82l29j37K81L1N5K02n01L42J23r6k79K75l8
5665d8j20P5L74m18L28k05MJ75l3J49j11j22n8K29l28K95j04j10q2K26Mk7j63
5688g0K67j52l6L3l00M69k43m5R0qo5N4r9J01j98K55j76pR9m6QJ70q1k0K72l75
5714a03K92m14R4J61j31j04N11j90M3j00m02M03j56J67O2J90n55K86O2R4m4l5
5736A31j66J4J01j67J83rn35M11M6k76J54j4K56j29J16m77M88j73K87m5l21Q2
5758d3L5J05q7q7J25j70J19J23k42K12o0k8j1J83o00L20N3J34K55l57K4j03R4
5781fp7J72l17K33P7j98J82j22J85k88L6L76l85L48k11%K7J74k05J13l67J82q1
$$ y = [24, -134, 23, 83, -213, 92, -23, -32, -6, 3, -44, -351, 208, -181, -36, 146, -210, -36, 57, -265, -57, -307, 138, -79, -121, 219, -107, -63, -116, -210, 2, -18, 205, 23, -306, -443, -162, -131, -76, 126, -375, -33, 90, -6, -285, -10, -48, -168, -93, 281, -137, 191, -14, -10, 165, 132, 281, 170, 48, -10, 219, -109, 186, 82, -28, -110, 116, 120, 93, -70, 197, 45, 9, 42, -258, 211, -32, -77, 13, 5, -60, -6, -105, -4, -202, 53, -123, -130, -31, -77, -69, 101, 20, 0, 272, -103, 189, -225, -131, 30, -101, -205, 306, 116, 159, 59, -343, 60, -96, 71, 133, 323, -232, 54, 116, 210, 166, 131, -35, -21, 80, -87, 96, 87, -448, -37, 9, -267, -113, -127, 129, 0, 116, -361, 127, -46, 241, 196, -125, -43, -8, 97, 10, -77, 48, -122, -3, 120, -122, 90, 30, 2, -9, 174, -426, -106, -53, 81, 336, -21, 3, -100, -6, -83, 89, -228, 5, 82, -116, 66, -56, 129, -159, -123, 253, -132, 216, 5, 5, 32, 206, 1, 114, -253, -71, -152]
5804a52o4J46L13p8j78j18K58m35L41j31P5n6l9o8K33R7k91L46j0j16L29n22N4
5827f6n3j60J39J92R8N6j31m86J39oK50l0LJ78l07K94l8j06Q8n2k14jK49k51L11
5852I6l67J40M4N41k70j91j20K13J35j54o9o7L20l44Mj08L97j06N9k40j95J93
5874h9O2l6k56L26K8J62k54j22K32r6j1m9L27k68j58K58k98J33J41k93M94j04
5896A29j91J83j31k15K38J43k34J97k97Q5J99k6m8J11l29J93n9L32m61N6K05r3
5918a3O2N3K32m54J02j94N21j49j0o1J84l24j99N13l45j53J18M75l72k11M35k56
5940d6K59k38K22m21K19J41k73M63j47k75j1n3N8K91j57n1K39l52LJ66j15L7J52
5963A11k77J27K21j89K1l1L16m98L4J86q2K19j24l0j74J08J35l72K86N9j31K30
$$ y = [-152, -216, -70, 243, 165, -13, -131, 127, -308, 33, -98, -23, -79, -118, -186, 47, 144, -147, 199, 189, 73, 402, -120, -66, -119, -279, -140, 52, 150, 206, 75, -411, -272, -278, -28, -58, -55, 123, -184, 110, 72, -34, 54, 2, -212, -213, 36, -215, 96, -271, -131, -87, 454, 184, -7, -127, 86, 221, 67, -2, -69, 251, -93, -89, -197, 200, 94, 153, -87, -282, -89, -27, -63, -319, 7, 35, 197, -57, -179, 53, -43, -54, -103, 224, -44, -202, 56, -242, -109, 32, -261, 233, 129, -62, 121, -10, -225, 13, 156, -78, 119, -178, -93, 106, 80, 32, 143, -186, 7, -52, 280, -181, -125, 80, -13, 49, 102, 334, -120, -18, -212, 309, 160, 150, 89, 273, -51, -250, 263, -82, -235, -117, 358, -14, -225, 210, -46, 213, -25, 197, -224, -5, 136, -137, 326, 179, -96, -107, -160, -102, 189, 32, -19, 220, -132, -129, 37, -78, -41, 111, -166, -39, 182, -7, 14, -17, 299, -199, -165, 21, -61, 158, 34, 4, -170, -62, 73, -299, -13, 46, -85, 145]
5985A45j0m93K03p4K49J6j91M18k42pJ13j8k94J77m68P47m17K37L1J09j92J30
6007A69k29N5O7j86J41M8k06l0J99k02L92j77K81l06J90j39l9k69M03Q9m79M6
6029a82J96Q8j00K3N7j%l92L43j79K91j64O2j91j28K42o0M00k7k77j80J10J72
6052A03J57o12J75J75j93J04J00j26Q7M0K93k95k69J68K4L83k62m1j90R3J86j6
6074H4r6K1K06k62J33N0J3R1o03K01QK31O1k43j9m2K56J03k17R1kJ84l0o17N87
6099A89M8j97O3Q8l47J63L8o9L4p8Q3k22J01J14j1j6k73Q07m03k13J62m03N47
6122B05j73j35j02j35K48J48j56p2M40l84J24j51K36j50O8R8M2Oj33J11k45J51
6144D1j57J51r4J38L3J2j82k6Q5j6J12j20O4M6k14M1P5j6n7L01l25n7J52k93J98
$$ y = [145, 135, -358, -155, -229, 20, 36, -155, 263, 21, 14, 127, 109, -185, -8, -476, 271, -146, 91, 122, 231, 39, 169, -60, -5, 62, -124, 17, 65, -141, -171, 28, -174, 218, 41, 322, 16, 206, 67, 28, -241, 162, 251, -228, -182, 14, 102, 2, 25, 82, 81, 81, -311, 32, -147, 144, -20, 42, -149, -277, -35, -95, 305, 278, 1, -179, -69, 103, 260, -352, -177, -2, -195, -91, 9, -117, -30, 10, 303, 8, -261, -93, -69, 314, 52, 11, -179, -86, 100, 84, -12, 9, 215, -47, 86, 136, 149, 240, -363, -162, -154, 77, 138, -105, -124, -166, 90, 193, -24, 67, 65, 249, 219, -398, 189, 237, 40, 103, 191, -156, 7, 45, -24, 10, -68, 15, -207, -106, 8, -3, -19, -292, 515, 112, -101, 61, -342, 205, 32, -103, -205, -340, -92, 56, -100, -172, 268, -116, 8, -143, 93, -57, 11, 109, 151, 157, 24, 135, -110, 41, -116, 35, -59, 79, 112, 124, -58, -84, 1, -15, 97, -23, 41, 87, -127, -86, -11, -27, -84, 217, -108, -165, -13, -306, -108]
6169a08k47L61r1K00j75k50L43k31K75p7O3K19m95J17L5J4o5J13J37p8j7n4Q0
6192F9J2K6k66J07J55n8n1J52j03j05Q4Q5k3k60K89l02L33n07K54R3M07k86j47
6215d2K69n80L32j46j4P4jL79k18k40K83j89K90j7j67L13l75q7K14k63m6QLL90
6239A70j17j73J8P7L66o76L37K85l36J28k12J60J91j16Q9k47J39K10l94J02M71
6260D72l78l25K16j44P8Q7l4O9J77l42k20L64j3L9J12k28M61n35K26o1l57K53
6282h3P5j38L6L63j18j40k14L27k3m8q2j1M1m7N5j3J45j58k5Rj53L28j29J33j99
6307f9K78j22n6K41l29l7J01Q0j23J02K33J6l18J12j23J66n20N34k24k6j3J55
6329E8j66K36J61j53m9j23j18O0J16k6K2n1j17M88k62k22O8l45K05n5J73K70O4
$$ y = [-108, -355, 6, -85, 115, -60, -310, 33, -198, 77, 0, 63, 282, -213, -96, -61, -47, -112, 1, 138, 60, 43, -11, 69, 81, 107, -159, -52, 103, 45, -6, 146, 43, -62, 22, 107, 84, -176, 113, -189, 144, -363, -109, -16, 391, 105, -42, 227, -353, -21, -167, -181, -107, -108, 271, 53, -187, 96, -93, 197, 180, 13, 326, -49, -136, 78, -185, -231, -223, -220, 170, 53, -120, -102, -25, 341, -335, 2, 287, -49, 79, -133, 27, 218, 102, 191, -56, 83, 293, -101, 1, 472, 94, -231, -15, -159, -81, 6, -28, 41, 218, -124, -344, 20, 7, 46, 158, -70, 391, -144, 82, 21, -336, -83, -8, -146, -110, 253, 135, -5, -219, 108, 85, 37, -45, -56, -15, -62, -7, -20, 125, -33, -58, -49, -202, 126, -3, 130, -69, 209, 87, 31, 272, -57, -94, 7, 87, -36, 66, 299, 315, -3, 109, -14, 152, -368, 166, -58, -84, -97, 58, -108, 128, 289, 136, 87, -36, -154, -94, 22, -4, 18, -33, -150, 338, 76, -146, -78, -423, -218, -273, -100, 170, 234]
6352B34j45p2m1P0l72L35o8j68K51k52K84k82J89Q8j73L7K26p6J92j09k4N6j9
6375A61k02j68M84l84p0O7J32m6Kk05J66K5k55J68K14J96l13j03L5J19j24K4R6
6398A9k07K48j28L64l13J27Q7j25Lk26N4J0L31m93J2K18R0o4j66J22K39p2r8j81
6422a49O2J99k70K49pL8k47J77J85n34M88k94J23l01L17r9M6L84k28Pl21o0L98
6445A63J80n00K88l27M72k55j66l3L70l40L37k11J13K06k29j37k30L26J33k4N
6466A41r3l51M19N0l84O9R9J07m6M9k09M71k87n4L35n07J86L03j65J7l02M34k20
6489F2J40k31L66l42k85K23Q7L8k14R3j7r0L06k8j96J62j13J66r5j18N4j37J40
6512b9K92m52k36J63K41N2N1k75M73k10j64J36O5j4J74l23L25l0k84J52K09k73
$$ y = [234, 89, 17, -24, 46, -326, 9, -59, -227, 24, -228, 56, -226, -37, 51, -122, -85, 141, 65, 257, 148, 124, 180, 161, -41, -209, 275, -109, -179, -112, 20, -26, -24, -229, -63, -38, -293, -125, 89, 285, -28, -131, -96, 23, -101, -77, 19, -188, 60, -68, 296, -17, 110, 197, 72, 75, -151, -97, -87, 244, -249, -237, -19, 71, 7, -159, -37, 202, 130, 32, -149, -87, 112, -158, 91, 84, 122, -125, 52, 237, -297, 191, -103, 20, -281, 36, -63, -17, 367, 139, 146, -175, -235, 163, 343, -157, 131, -196, 276, 21, -145, -178, 192, -148, 189, -22, 91, 297, 68, -69, -299, 27, 160, 136, 141, 48, -303, 116, 166, -218, -149, -50, 57, 11, 60, -149, 322, 35, -19, 316, -191, -5, 298, 133, 150, -152, 282, 62, 202, -29, 337, -5, -290, -67, 20, 58, -156, -63, -80, -170, 136, 108, -88, 74, -39, 127, 32, -86, -32, -169, -29, 263, -189, -425, -262, -21, 31, 82, -193, 280, 70, -94, 42, 107, 93, 267, -56, 269, 239, -45, 107, 316, 43]
6534D3n2J3M3P2l09J02m8j53M86m03m3L09m4k41K20O1Mn9M2m77L41R1P7k03K42
6559A14j66J02L1k60J69J09j28J06L9j76L13k43M3K24l41J54r2J2j3J94k4l04
6581a37j0J7L95m98L27J91m00M01m75J12J33l19O55m38J28l33K30j62L71j4k81
6602a07K1K45k63p3J20J15j07j94K79l93L19PNn28N27K16j03k27P4j21J29j9J71
6625I3l88K01K3J12J41j20j82K16L2r9K3r7J55N0k21K86j07j30J02O7M3l75j9
6648a94J87L53n53L41M3j50R5l3r1l6q7K10m8j86J88J55j65q3KJ67J2k3L44n31
6672h3R0l23M21j01M0M4L30m57K9j40J65qo7J05J10k59J34j96M8L7O8k51L2K55
6696B3l10K28q4L0K39k10m6J37l3j44J4K08K14p1j89j1N2K98n99M02o3l76J28
$$ y = [43, -9, 4, 47, 119, -190, -88, -136, -289, 197, -206, -249, 60, 16, -225, -5, 56, 60, 1, 43, -434, -93, -2, 75, -128, 114, -52, 50, 81, -179, -10, 99, -29, 77, 116, -60, 253, 10, 53, 277, -64, 90, -2, 10, -3, 191, 167, -137, -147, -130, 265, -233, 94, 285, -115, 286, -189, -77, 56, -263, 392, -46, 82, -251, -21, -183, 188, 174, -107, -86, 159, -104, -177, -57, 58, -49, -243, 36, -357, -38, -31, -26, -554, -27, 189, 86, -141, -67, -188, -59, -78, 93, -295, -94, -71, 41, 182, 62, -120, 96, 128, 29, 52, -45, 110, 160, -61, 225, 118, -12, 90, 157, 200, -175, -194, -7, 346, -207, 134, 177, 27, 122, 89, -2, -38, -125, 85, 37, -149, 39, 194, 29, -54, -52, 115, 127, 104, 448, -83, 7, -316, 105, 4, 44, 88, 418, -39, -10, -150, 15, 7, -60, 45, 155, -104, 30, -166, -118, -81, -13, -264, -232, 23, -287, -59, -143, -113, 126, -84, -130, 7, -26, -170, -156, 52, 266, 195, 6, -5, 47, 345, -254, 148, 85, -291, -163]
6719a63K98J16q0j00o6K34o3k83M09m56M51o69J32j2o8L13q1J84l9K62k83q2Q4
6742C8k44L42k22j7J35m7j14j9J41l37M27N5j39K2%O3Oj68L9J54n52M73l21N02
6766B17P4k36p5J61N4o87K76L52j88L41N6l38K18k97K5N7J08R7L5l71o5K94J37
6789B45k16q4K29j53k43J60j33N3K42n6j2l77K82J70k89L47l38J37j57J64l70
6810c99M32k6j01J41j56M1L3n5J3O1RK04k19O8k7J23l8r5p3K05m05M32l82K97
6834H3K64l11j8l5J3k15K93k39J58k72J08K25k17J05N0k91M55l31J09L98l01q9
6856e8O0J92j45Q8r0k97O7J20j79K31j14K52j29J32k17N4J11J25n13K51k61J54
6878a66j11J42J19K60l34K31P6P3j83m04K63J1J32k68L91k46J2qJ60k05j12J48
$$ y = [-163, 135, 251, 171, 71, 5, 239, 176, -107, 302, -154, 297, -372, -240, -252, -320, -7, -88, 96, 57, 319, 36, -46, 38, -206, 136, -86, -103, 32, -15, -129, -148, -7, -344, 83, 138, -1, 21, 21, 84, 90, -78, -39, 115, -437, 36, -285, 217, 291, 55, -20, 141, 195, -492, -216, 136, -52, 289, 345, 7, 225, -72, -47, 10, 118, 215, 250, -121, -186, 108, 245, 29, -55, 174, 21, -222, -62, -195, -142, 100, 44, 32, -345, -63, 107, -182, 165, -173, -36, -193, -29, -399, 33, 7, -94, 47, -109, -68, -35, -90, -77, -16, -7, 197, -22, 46, 19, 142, 104, 9, -64, 141, -264, 168, -214, 83, 347, 36, 18, -17, -4, -219, 74, -165, -7, -279, -171, 54, -163, -58, -8, -299, 156, -175, -66, 332, 31, -58, 2, 194, 49, 137, 47, -250, -183, -63, -242, -11, -125, 127, -2, 130, -87, -33, 78, 203, -310, -59, -320, -166, -277, -135, -16, 244, -90, 141, 217, 290, 107, -297, -34, -23, 109, -159, 232, -14, -2, -10, 150, -55, -167, -19]
6900a9P2N5M0K15m29K53l14j69m5M08O1k19q3M08l0J9n29J41L03j21q5J31m2k45
6924b24L05j25J66k01k24M35j72J92k16L4n8O3p2j38O32o23P8J54k6m7lJ18l17
6947b69K47j22J37j16J79r2J46m6Q8l58R8J24rjl0p3O5J68Q0k15J21L7j44n1J34
6972I8k69n1J08Lj39j45L67P6p6J34j01j04J40n1k03m0L81M18o07j24J46J53M9
6995A63l84Q5K04J97l22J40n2J06j87j44K29qL6n4J48k06L12o34K33K23J0Pj82
7018h0Q9j98K46k53l2L99q6j17J41L2l7k53K50j72K09j40L8J23m16L12j06n6L85
7041B78q1l4k51J14J31q4j7j07jK19k09K70k51r0j73J84J51nl02M00j05l22L41
7064E6k41J2N52l97J40j88LO1O0Mq2p0n2J93P9j19J02j2l09L8K98j97K0O8k2J3
$$ y = [-19, 53, 108, 148, 363, -66, 187, -127, -296, -341, 67, 128, -91, -174, 234, 204, 223, -306, -165, 138, 17, -68, 63, 21, -224, 81, -44, 122, -79, -303, 132, -40, 152, -64, -30, -88, -25, -97, -235, 397, -226, -148, 6, -20, -67, -70, 48, -269, -22, -144, -7, -123, 56, -36, 110, 64, 152, -206, -108, 16, 7, 6, -24, -97, -32, 136, 216, 1, 122, 159, 15, -36, 98, -171, -222, -114, -111, -250, -395, -28, 48, -28, 106, 5, -99, 41, -10, -213, -253, 128, 546, -61, -185, -39, 114, 163, -221, -136, 68, 265, -57, 83, 31, 137, -50, -194, 35, 27, 63, 9, 157, -49, 263, -371, -138, 85, 95, 102, -80, 9, -189, 57, -196, -228, 171, 85, -32, 109, 141, 104, -149, 101, -71, 138, -2, 36, 159, -257, 55, -51, -107, 278, 197, 163, -88, 26, 157, 73, 56, -51, -52, 167, -42, 228, -23, -113, -286, -102, 49, 44, -258, 142, 37, -285, 56, -185, -173, 379, -18, 122, -66, -63, -2, 58, 62, -20, -90, -142, 51, 130, 11, 113, 101, -208, -170, 128, -69, -49, 19, -3, 10]
7090A0k38J66L25l87M4q0J74l49L87J95n24L63J2k81K15l2P8j1k19K03k5Q8O2
7113A76j03O6n6k00Q7j82J68J22j01J38l9RJ3q1R3J06k91J34O3j63K41J47m81
7136a34J94K9k53K22m8Q9O2j78q6l3j7J67J19k15j52K98q3n6J26j30K19k01P4
7159A3j93K86n1k74J64J36J58k60K08l85O5K29j76Q8n9K49p3j15K98k22M5l68
7181b37J86jJ62n2m37L06J31j20K22l96J50K94l91n7K25O2K20k31n4q0J76l35
7203b57K26K73m07K48L12l46m2J99m55K34N9l48kM18K8Q7k74N1M6Q3l68K25j74
7226a84L27k57J93M7m6j56J75j40l23J49n3N2L0L60k35r2k25K34K69K54m33j0
7248f4J3j06j05K48R2r5O2K22l22J81j70j84L03K09k10j67L4O7K49m40J9q2K81
$$ y = [10, -228, -62, 263, -124, -80, -160, 14, -335, 52, 247, -277, 86, 98, -183, 32, 0, 78, 67, -152, 51, 26, 114, 176, 73, 139, 83, -117, -30, -212, -44, 78, -23, 115, 76, 85, 98, 17, 110, 216, -75, 59, 122, -41, 200, 347, -134, 60, 89, -164, 58, 10, 99, 161, -17, -103, -136, -153, 14, 133, -82, -234, 64, -19, -75, 51, -79, 140, -61, 13, -180, 106, 55, -219, -55, 81, 239, -21, 187, -198, -133, 96, -80, 8, -51, 198, 125, 10, 308, 86, 131, -237, -51, -52, 110, 58, -379, -73, 58, -62, 160, -236, -86, 208, -183, -240, -15, 47, 267, 36, -18, -98, 78, -257, -31, 242, -165, 83, 395, 49, 7, 206, -249, -15, 44, -304, -306, 112, 140, 227, -47, 4, 50, 133, -235, -10, -184, 143, -114, 79, 126, 80, -76, 99, -41, -364, -215, -268, -216, -186, 174, -61, -153, -378, -144, 125, 379, -54, -64, -51, -157, -262, -14, 78, -17, 45, 267, -55, 126, -44, -228, 75, 284, 74, -93, -59, 8, 257, -183, -164, -246, 35]
7271C5j16K31j8k6Mj21p1L35l80q6L48j32o7K27l17M6MK88j90j08L39k72K93l63
7295a17L58l37j29L07K06k66Q1n6J34m63J61J65j66J8K07j33P2j91k36M44K9J48
7317B36r3j42n5P6p4M2j68L84j07l3q2k12J34P2j5j71L96j30j26O1k16K52p3R0
7341D6J28k30j51J30l0J17J75r1K06l85j36OL89r0l51L42P0k16K00l42M35j86
7363C6q3L03k11K10J72k60Kl43K48j78q7L18l4k51K85j54k54N13k10L05k74m85
7385d32N37r5K2k29K41k8Q4k71J24J20K10o5j10k12j74L16k47K31o4r7K83K07
7407C51j80k22J87k8M6O3m77M7J94M30k23m71L51j8k58M13m78K53o5o4R5l4P1
7430a7Q8J68l47j9K82j26L77k87m2N1J03r3k9Kn0Q0k18k00J88j23J76o2p1K46
$$ y = [35, -81, 150, 132, 106, 110, -11, -82, 253, -127, -213, 135, 3, -64, 163, -154, -108, -104, 184, -6, -114, 225, -47, 246, -117, 241, -96, -225, 82, 288, 22, 103, 47, 181, -282, -121, 44, -122, -104, 103, -30, 42, -149, -385, 59, 88, 236, 143, 1, -54, 22, -52, -10, -178, 206, 99, 66, -16, -228, -94, -22, -37, -208, 188, 58, -68, -7, -223, 29, -44, 46, 174, -56, -207, -77, -107, 10, 185, 94, 300, -85, -221, -215, 174, 84, -267, 75, 145, -71, 129, -213, 222, 36, -47, 256, 45, 255, 427, 167, 169, -174, 74, -104, -191, 127, 93, -158, 127, -27, -281, 232, 22, 327, 53, -432, 105, 10, 32, -197, 44, 16, 100, -171, -47, 73, 283, 218, 108, -104, -278, 38, -209, 22, -42, -139, 144, 351, 171, -51, 136, 108, 154, 217, -260, -213, -19, 411, 188, -283, 68, 50, -208, 205, -273, -20, -85, -149, -54, -88, -17, 71, 239, -108, -127, 155, 29, 406, 119, 77, 128, 231, 138, 109, 111, 61, 141, -77, -277, -89, -212, -36, -98, -169, 77]
7454G7k65J86p2O6o5j5Jk08q5K31J54rJ26k84K36K2k3q2J65j90J28Q0P0l34P2
7479a8M1J73j24j33K23k44O0k43L41j39k31L90l69J87k0J09p6J08K28j85j50P9
7501GP2K69m60J86J97l89M1p1L51l12K08R2l78M2J79k80J54j95L56k60M06m18
7523b03K62k1M8R7j98j26j38R0O4P2k68L03j10J35O5k73K46P6k41j76M57k91J50
7546B0j76J41L79m72L5j3K36J36o26J25R9o7J93k5p5Ll7jJ40J13j17j8K84k21
7570E6j94K93j75K45l24J84J2j64j27j31J66j30J34oL36l27R9K51q0k7m19K29
7592i9J45NN0k38o1J01J08Q3l19L72j59j68LJ44M7j62j18K8o2M64l01K12o0k15
7616b00O8L7k0J64L8k58K58l75N73j76j9j70L6prp2Q7j87K09k26K35R9j86O1L5
$$ y = [77, -188, -2, -74, -8, -73, -88, -87, -295, -380, -149, 5, -4, 122, -162, 74, 96, 73, -9, 156, -34, 94, 174, 244, -90, -18, 23, 196, 72, -61, 162, -82, -22, -265, 76, -63, -294, 96, -273, -86, -106, 3, -73, 35, 263, 78, -72, 7, 79, 348, -112, 74, 271, -118, -77, -148, 203, -109, 99, 191, -187, -145, 34, -246, -92, -287, 69, -191, 215, -203, 59, 38, 86, 183, -15, -141, -279, -189, -125, -53, -321, -18, -128, 7, 72, -201, 45, 121, -120, -296, 161, -130, 20, -156, -15, 364, -108, -73, -86, 150, 286, -340, -215, -116, -183, 10, -15, -90, -87, -124, -125, 15, 128, 11, -7, 277, 56, -138, 155, -20, 225, -99, 85, 97, -67, -194, -325, -159, -289, -155, -161, 175, -152, -53, 198, 118, 91, -328, -99, 46, 51, 101, -137, -198, -97, 11, 94, -225, 147, -12, -180, -177, -33, 14, -148, -266, -238, -300, 164, -137, 75, 15, -200, -132, -95, -115, 49, 87, -171, 87, -288, 285, 109, 90, -80, -44, -51, -60, -132, -45, -232, -23, -249, -14, 85, -101, -40, -5]
7641ej40m7L36k9k67J00K37o7J42j86k47J40mLj30J77j62L39j33J5mk94M02j88
7665a2m3K96r9n2K8L2n2j31j13j38L13k84L5K94k59P7M7K11j97rK12j27q1K07
7689A55j66J14j30J44o6k89L32q3r8R8j70J65j33N70l95N5Rl00Q3k79N81k34n4
7712i1P9k8j5j90L79Q9l88o6L68j28K00l56L13j61j65O3K11L9k68L47k02k62J29
7735a03K37m61J75N9L97r2k16L8J74l97K98M9k23M84m51J8J7j07o5Q7J25Q7k30
7758a00J86n7k01L9J99j16J04M8r6o6m2n4J32J68j07J1j91K0J04K98m53L48O1
7781B35l75N2K3L1j6M2J4K00k29m9K66k51J85j93OK67j45L3M2n4k28J85K24k63
7805Bl1J59jj05j2J90o9k00Q2k4J31m91J79J83K66m74M56k37J88k38J76n1j46
$$ y = [-5, -145, -192, 144, 115, -152, -52, 185, 118, 260, 74, -173, -33, -37, -34, -164, 13, -149, 190, 57, 72, 68, -226, 176, -12, -55, 241, 142, 90, 118, 150, 98, -33, -146, -284, 29, -255, -220, 74, -185, -108, -61, 150, -47, -56, 156, 29, -52, 155, -11, 103, -27, 117, 51, -238, 94, 11, -87, 11, -159, 6, -127, 443, 48, 103, 112, -188, -105, -384, 197, -37, -91, -12, -40, -55, -245, 134, 223, -165, -231, 137, 9, 209, -147, 166, 5, -160, -97, 114, 153, -115, 232, 30, -232, -103, 134, -327, -152, -93, 304, 212, -4, 34, 208, -189, 109, 158, -65, 419, -32, -14, 3, -104, -169, -82, 43, 130, -100, 86, 29, -172, -133, 66, -50, 54, 102, 6, -60, -102, -156, -24, 144, 37, 48, -143, -123, -19, 279, -174, 174, 235, -140, -88, -65, -34, -50, -8, 6, 206, -23, -72, 194, -57, 128, -65, -59, 208, 63, 96, 138, 84, -144, 41, 265, 2, -29, 130, 129, 24, 12, 202, 133, -67, 15, -9, 122, -369, -190, -7, 259, -215, 241, 4, 192, -46, 130, 79, -67]
7828f7N3N4Q8O0m06K82q1J68l19L90l17J25J10j26K9p8k0L94m60J88J82j79j56
7851h6Q6j8j33J32k83J12K97j78j64O31m44J02L26n70M45k10j68K52j22p0K6j8
7873e5N4L26n44N43m04K0L8J64k03j16K65q0K11j17k57n1N77m92j01J90P8j48
7895a02J99K9k17n5K52k02p9J97J8L55m18m7L24l54J1J44P6L8m58K85n7l5q9J38
7919d7K7k37L21p2M4l21L00k00M48k66j1o8K3J13J66k34O3n3O5Kk94K14n4K47
7943A76k67j17M01l57J80j45Q2n3Q8j82L69m17K83p0q6J37l2kK04j93k16K03r0
7966a04K88n5j6k75P7p8K18k07J29J85k11q3J10L5J41j23j29p1J20K9L5J3k37
7989b09K15J15l9j06J54k93j39K19K44j75J10p5k01l6K19N6q5J53l1K6k13LQ0
$$ y = [-67, -14, 40, 128, 188, -218, 64, -17, 151, -168, 222, -95, 30, 140, 14, 43, -35, -55, 339, -121, 67, 249, 70, -86, 0, -18, -151, -19, -302, -190, 107, -71, -235, 396, -48, 54, 380, -190, 255, 45, -123, 129, 7, -63, -37, -55, -1, 325, -219, 324, -80, -60, -22, 142, -61, -177, 88, 8, 219, 102, -155, -206, 371, -121, -222, -32, 46, -102, 97, 126, -91, -146, 106, -96, -175, 22, 40, 395, -23, -70, 254, -100, -89, 55, 131, 169, -289, -4, -61, -96, -185, -47, -20, -257, 64, -8, 36, -285, 15, -185, 263, -3, -14, -82, -59, 54, 220, -14, 49, -4, 61, 63, -231, -17, -71, 176, -91, -208, 193, -164, 16, -129, -47, -100, -12, -194, 175, -242, 41, -29, -115, 22, -10, -12, 192, -1, -217, -14, -104, 184, 129, 113, -162, -85, -163, 55, -152, -23, 162, -49, -132, -22, 13, 154, 31, -98, -169, -49, -20, 15, 28, -209, 6, 121, 82, -24, 130, -163, -302, -83, 161, -14, 96, 21, -180, -216, 3, 59, -26, 127, 96, 122, -91, -88, -8]
8012hL36l30Q0p9N5j51Qp5K72k83K42J97k10O3j56K56k43l6K43l09p3j11J67J39
8036fJ76l2j75j48J89R3j40k56L81J44j87J14l54q8K79o7J37L16m54J80J88j54
8058A36n0M1k08J48N0J07l45K92k16K04l29M75m75J48J2M8k44J33L80m91n6P4
8080a66K96l27L64k71OK08j22M7k14J68j22K39j87L09l50j95L36j91m2K49Q0l61
8102b46L21n9n5m09M69J01l69L82k29J02N8j67N5R1j66L13k95j43K03o5J85j5
8124F2p3j63J57J31Q4m29K54L4K4pk85L9j16M17m8J1lj62q9J3P8Mm2J26n1J91
8150A57j94J8j53j29N98r0j76P3k06R2L9k36K51O5n4j84J70l18K99L9J36k48J80
8173A29k38J33l8j1J60k39K31k41M0j71K19J62j56J41k63K53q0J59
$$ y = [-8, 328, -2, 78, -1, 54, -97, -89, -164, 108, -175, 67, 264, 54, 117, -39, 217, -26, -62, 181, -128, -201, -312, -145, -6, 170, 138, -37, -185, 4, 97, -43, -299, 82, 226, 39, 153, -201, -289, -10, -77, 60, 376, -78, 102, 290, 136, 86, 127, -81, 67, 117, 224, -121, 171, -45, 159, -170, 305, -170, -22, -10, 38, -206, -73, 307, -184, -240, -166, 130, -197, 167, -104, -98, 110, -12, 35, -179, -11, -133, 106, -81, 228, -122, -317, 19, -172, -214, 35, 115, -246, 75, 16, -39, -448, 21, 122, -247, 135, -94, 8, 66, -101, -46, 45, -121, 192, -103, -246, -43, -108, 77, 62, -11, -174, -17, 114, 198, -231, 23, 57, 81, 74, -211, -172, -288, 129, 81, 92, 89, -73, -162, -149, -71, -67, -109, 17, -34, 157, -37, -19, -172, -301, 297, 207, 31, 104, -102, -10, 29, -207, 44, 109, 55, -129, 41, -277, 22, 61, 197, -51, 129, -109, 24, -14, -25, 135, -104, 127, -114, -74, -245, -26, 136, -20, 121, -142, 111, 31, 190]
8191A90
$$ Imaginary data points
##PAGE= N=2
##DATA TABLE= (X++(I..I)), XYDATA
0@%%%%%%%%%qJ6j6J6k4L2l3M1m9N7p2Q2r2J08j24J45j69J91k18K47k79L16l57
32a90L99m46N01n57O21o89P62q47R40j041J152j275J413j569J743j939K164k423
50a281K728l093L536m090M805n770P150r306J3183k2344Q4124P7690j27185q3453
64f3306j337R6443O5398j3436q5908o1723J011O0564M9181M137m7082n2539k2060
77g0657L3296O0247L9638k8034p2229m8439L6307Q9960N4998m3986r8061m7584
89i4544N8846J02727L6170o7932r4462k1741O6702P7165J0591n6638o1258j3507
101e7881L5485M8277K3015j9376m8364m1344N781N5581N6336l191o8444o6162
113h0287R053Q1278O9018j8056q7027o1792K9354Q8504N3022l5188q0054m1012
$$ y = [0, 0, 0, 0, 0, 0, 0, 0, 0, 0, -8, 8, -8, 8, -16, 16, -17, 24, -25, 32, -40, 42, -50, 58, -66, 79, -90, 101, -117, 130, -149, 167, -190, 209, -237, 264, -293, 328, -361, 401, -446, 494, -547, 605, -670, 743, -826, 917, -1022, 1142, -1281, 1447, -1646, 1890, -2200, 2605, -3165, 3985, -5321, 7862, -14482, 69642, 147332, 20147, -63306, -64643, 31800, 97198, 83762, -2146, -63869, -62858, -2294, 46887, 51024, 3942, -48597, -70657, -37361, 22886, 62524, 34490, -37739, -86178, -49871, 40089, 95087, 51101, -46960, -94544, -35698, 67029, 103199, 35267, -59195, -80936, -14234, 62931, 73522, 16884, -44374, -57881, -22396, 25881, 48896, 29520, -18844, -60188, -54407, 1174, 57510, 54319, -14125, -80287, -71234, 10044, 79062, 61006, -26021, -87813, -58459, 30045, 83067, 47879, -32175, -73187]
125g3187L4972O8195L2012k9077n4400l0618J3458L9884L4088R65l6447m8183
137d8338j7177L8195O2937K2021m8993p4235j8749O2772P9401R672o9012p1788
149g3294M048P1687O1847r089o2326m8192R546N0167M0718k444l6998l8463j0086
162d2879K5884M1796K1846k1270n0772l3217K1967O0871L9003k7723o9275l8347
174g2116L6841P5061L3003m4056p2378k2043M8098O3567J3812m3911n0747r997
186d4866L2229L9387J4210j8542l5010k4873N819L6742L7029p03m4890m8276R14
199e0830N4428N2054p283o2362n1669J5381O4482M5250k0960o1860l6781K3627
211c6523N5567K9628k0033m4027k4673J3836L5134K6546j425k7371l1763r179
$$ y = [-73187, -38215, 29980, 61992, 32915, -21485, -52103, -38645, 1239, 35327, 36292, -155, -48338, -65515, -27320, 35617, 57638, 8645, -65590, -84339, -21567, 57834, 67506, -1506, -73294, -69246, 2441, 64288, 55199, -7127, -55319, -45773, 4394, 45112, 42668, 5670, -32793, -42879, -16995, 24801, 46647, 25377, -25395, -58612, -36645, 24226, 63229, 35506, -33769, -72116, -35275, 39786, 72789, 28733, -43645, -65688, -17590, 45977, 59789, 15878, -34869, -44866, -12637, 26750, 40960, 22418, -12592, -37465, -31646, 5096, 42125, 41422, -3468, -51744, -50830, 3598, 55652, 48369, -13993, -65662, -50281, 14201, 59451, 38491, -23369, -60150, -36523, 19044, 48672, 28639, -15388, -40061, -26225, 8909, 35455, 34030, 6659, -25104, -34283]
223c4283K6193M2493J7318l1194n2927j9297L8494N7867J4355m7982n9698o648
235e5309M9989N1993j760m9101m3332L345M0838L4894j401l0792l0487n835K2478
248a4480L1459J5366j5368l5212k3371J4671M2977L0129j5966m9962l2223K2019
260b9961N5173K9798k7420n6613k4956L2227N2142J7339l2720m4887j2325K6675
272a5528L5549J1676j7498k8800j6836P731K7312K5723K42l0288l4202k236L8170
285A015M1097l19m3827m2231O212M7229L9408j0353m8120l4233J3766M4094K8085
298D1823j4475l7903k3949R663L0567K2247l961k4201k4720m741K1076L0353J1564
311C3343k1244l6922j5542K5741M3594J5683l1854m6057j0483L6827M3612N209
$$ y = [-34283, -8090, 34403, 51721, 20527, -32400, -51697, -13203, 44664, 59019, 11037, -48661, -55309, -5320, 46673, 44913, -4188, -47520, -44175, -3337, 31557, 30156, -636, -31123, -36958, -14480, 16979, 32345, 16977, -18235, -41606, -26935, 16042, 46171, 30205, -19757, -51980, -29961, 25212, 55010, 27590, -29023, -53979, -21752, 30390, 47729, 15009, -29878, -42203, -15528, 20021, 31697, 14199, -14601, -31437, -23706, 3606, 29329, 29571, -717, -34919, -37155, 1015, 42112, 41793, -2034, -44265, -38053, 9176, 48584, 38231, -9889, -44122, -30356, 13738, 41823, 27348, -10555, -34504, -24841, 5726, 27973, 24012, -189, -24909, -29650, -8574, 21779, 33343, 12099, -24823, -40365, -14624, 28970, 44653, 12799, -33258, -43741, -6914, 36698, 41907]
323D1907l7596l8139j280L3658L1724L32k7143k7370l515J9366K5008J0078j3709
336A3321k7121j6496J0983L1629K2462j0904l6544k5052J4484M0894K5786j7807
348B5635m3136k2340K1354M2479J8380k3886l8405j3483K0977L1544J0846j6268
360A3697k6365j3314Q934K2146J7958k670k3297k4606j188K7095L0134J583l1576
373a469l2602K075L5908L2628n311l6497k8289Q811L4775K4793r269l1136k1379
386b6962P373K6215J8994l742k2227k0673r69J7402K2662O462j7395k6861j1332
399c1053J9235L1520J2038k1723l4602j0263K6383L4930P354k7917l1796k613
411b8507K7160K7893J529k2549k4031k905J8220K0765O541j3515k1822j1455R185
$$ y = [41907, 4311, -33828, -35108, -1450, 30274, 30606, 3463, -23907, -27422, -8056, 16952, 27030, 13321, -13800, -30296, -19313, 12316, 34778, 23874, -12670, -37722, -23238, 17656, 43442, 25635, -17501, -39841, -18487, 23992, 42372, 18486, -19919, -33402, -12425, 19119, 29965, 13697, -12668, -25982, -17048, 5098, 23056, 20386, -2911, -27517, -28705, -1610, 28524, 30107, -1469, -34071, -31996, 3912, 36540, 31229, -5268, -33557, -24746, 10029, 34822, 25553, -5583, -26962, -19589, 6626, 25620, 21878, -349, -21022, -21991, -4589, 18073, 24535, 7140, -19721, -31053, -11818, 19702, 31740, 10017, -24585, -34848, -8465, 26465, 33819, 5902, -25894, -28507, -1347, 26546, 28075, 5526, -18505, -21410, -3190, 17575, 24116, 10601, -11221, -22676, -13491]
424a3491K3614J5324r411k7562j8509J0270L0151J9251j2071l2284j8515J5227
436a8006L2712J6299j5773l0478j3024J6075K7781J1367j3513k3471j1059R777
448a1313K0097J2668m934j8828j7578J017J9829K1102M94k3449k4055K68K5983
461A301K4985k726k7246k3558M761K7755K1209n589k5364j8348N475K2322J6946
474B1923k953j8608j6745kJ6421J8299L063j4995k0136o581J4710K2857Q262j6064
488I451k5829q762J8120K6479O989k0028k6438n345K0852K3454L213j8390k1017
501a7251k841J5466J8638M957j1532j8202p683R145J9000J1550q307k0609j3428
514b1097P984K2778J4317r036k4072j4942J0215K4667J3697j1065k3865j2563
$$ y = [-13491, 10123, 25447, 16036, -11526, -30035, -19765, 10386, 29637, 17566, -14718, -33233, -18006, 14706, 31005, 15232, -15246, -28270, -12195, 15586, 26953, 13440, -10031, -21090, -11313, 8784, 21452, 16518, -2310, -19888, -18871, 958, 22060, 22554, -895, -24950, -24682, 1301, 26286, 23560, -3686, -27244, -22483, 5272, 26481, 20892, -4472, -22820, -17345, 4977, 21923, 18970, 362, -16383, -16385, 36, 18335, 21398, 6403, -13733, -20314, -5604, 17253, 25515, 9451, -16378, -25140, -7020, 19459, 26448, 6420, -20018, -25363, -4511, 18943, 22156, 3766, -17251, -20092, -4626, 14012, 18969, 7437, -10765, -18448, -9303, 9697, 21247, 12940, -7669, -21097, -13113, 9665, 23982, 14946, -9126, -24068, -13853, 10814, 24511, 13446, -10419, -22982]
526b2982J1488K2490J1074j0238j9741j0777Q266J8172J0898n496j6292j2718
538a5856K609J5874J5123j33j8055j7777k56J9574J9248j236k1083j8564K255
551a8277K1146J8043l268j9794j6445L275J8357J5009j971j6230j4890J18J4096
564h31J4922K014j3091j6647m187J2304J7523N671j2741j8850o749J3795K0401
577A3534O628j4479k0239n205J5054K0195M063j4209j7492l770J2687J6473M316
590A7556j0940j5634n844P775J5632Q401p658j6501j0538O493J7689J0937p068
603A0300j8738j1598P611J9496J0961q033j8959j0367P736J8037J0409p565j6811
616g521r787O755J5118J0402n190j4489j0419L378J3393J2001j357j4354j3115
$$ y = [-22982, -11494, 10996, 22070, 11832, -7909, -18686, -10420, 7752, 18650, 13154, -3138, -15856, -13247, 2627, 17750, 17617, -438, -18215, -18471, 1103, 20351, 19115, -1968, -20532, -18277, 2869, 20912, 17644, -2150, -18595, -15320, 3037, 18046, 16075, -155, -15045, -14927, -831, 14091, 16105, 3014, -13633, -17820, -5516, 12007, 17678, 4937, -13913, -20662, -6867, 13534, 20162, 5683, -14556, -19761, -4707, 15488, 19551, 5342, -12150, -15920, -3233, 13240, 17556, 6616, -9018, -14862, -7087, 8545, 16946, 9288, -7213, -17751, -11258, 6431, 17368, 10300, -8438, -20036, -12425, 7071, 18032, 9999, -8960, -19327, -11591, 6446, 16855, 9290, -7521, -17308, -10553, 4565, 14967, 9777, -4712, -15131, -11753, 1640, 13641, 12284, -2070, -15185]
629a5185L12J4823J4804r17j5360j5041J157J6262J3921j282j5716j3741J586
642a4377J5059J2834o22j3431j2159l29J2218J3001J251j1052j3232k566J0598
655b807J4023L332j0174j4991m902J0609J5029N229j1155j5986n012J0845J5904
668I944M026j1005j4613m414J0379J4245M535q834j3057n191P783J3168O408o458
682F916j3270p039N765J4088Q104n309j4677r123N849J4845R005n660j4904r203
696a4613N785J4729Q748n595j3474q927M763J2942R075l902j2513r383L342J1680
710B657R400j964j1546j0338P69J1815J1072m14j2048j1837L85J2774J1532m51
724A1806j2151j1789R05J1579J1511m15j0917j0873m24J0186J0789J523r745j1288
$$ y = [-15185, -14873, -50, 14754, 13837, -1523, -16564, -15407, 855, 14776, 13494, -2222, -15963, -14377, 682, 13516, 12894, -537, -12696, -13025, -807, 12194, 13445, 2393, -10839, -13405, -2807, 11216, 14548, 4374, -10617, -15519, -4910, 10119, 15348, 4193, -11793, -16805, -5960, 9944, 13970, 2965, -11648, -16062, -5683, 8562, 13097, 4263, -8794, -13985, -6202, 6966, 13374, 6916, -6354, -13393, -7628, 6460, 14564, 9255, -5422, -14545, -8696, 6149, 15154, 9494, -5410, -14613, -8828, 5901, 14649, 9054, -4420, -13347, -8584, 4358, 13433, 9531, -2982, -12365, -9023, 2657, 12057, 10093, -1453, -11791, -11022, 793, 11865, 11451, -597, -12434, -12049, 725, 12257, 11806, -345, -12134, -11229, 350, 11861, 11446, 529, -10344, -10768, -582, 10207, 11730, 1985, -9303]
738i303k006R154J1372K559q500j2234l204Q542J2147L742r028j2286m193Q475
752d763J2624M362q379j2327m119Q177J1973M490p637j1416m337O691J1012N198
766A1549n626j1135o085N427J1156O493m504j2165o796M460J1406P439m499j1879
780d759p524L982J1487P193l706j1139p541L553J0852Q046k943j0441p738K546
794h132J0274Q251k093r401q216J167R433Q961m13r680r203j02R663R082J21r523
810A89r569j67R408R162K93r167r253k87Q317R228J134p872r511j588Q109R369
826G795K427p327r676k463P088R592L173p125r936l119O533R600L554o569r999
841f452m123O238R862L763n834r875m179N412R669M267m866q995m723M245R634
$$ y = [-9303, -11309, -2155, 9217, 11776, 3276, -8958, -12162, -3620, 8527, 12269, 3241, -9045, -13238, -4763, 7861, 12223, 3844, -8483, -12602, -4425, 7548, 12038, 4401, -7015, -11352, -4661, 6351, 11549, 5923, -5212, -11297, -5870, 5286, 11779, 7275, -4890, -11686, -7226, 4180, 11619, 7120, -4759, -12283, -8301, 3186, 10379, 6673, -4466, -12007, -8454, 2398, 10444, 7501, -2940, -10678, -8132, 2142, 10393, 8300, -1101, -9317, -8150, 1283, 10244, 9831, 151, -9052, -9154, 509, 9591, 9712, 189, -9380, -9547, -139, 9023, 9316, 149, -9104, -9391, -1074, 8154, 9288, 1416, -8095, -9683, -1574, 7795, 10222, 2895, -6781, -9244, -2156, 7436, 10609, 3484, -6452, -9571, -3038, 6562, 10116, 3547, -6452, -10575, -4337, 5525, 9288, 3454, -6421, -10600, -5188, 4481, 8748, 3882, -5113, -9836, -5591, 4043]
856D043N253l704r589n054L675R545N784l768r199n882L379R223N914k993r323
871b696n990K232Q620O485j920r132o539J587Q588O804j698q346o499J213P895
886F04P111r02p680p098M06P684P921l69p312p941J70P421P502O33p250p938n40
903g578O955P360R86o391q074j449O458P472J976o073q021j773N956P780K498
918H082n757p757k342N014Q112L001n016p556l125M578Q121L050m472p915l500
933g482M203P770L581m203p932l527L197P933M070l398p745m237K780P511N157
948G678l166p514m703K783P523M886k528o809n288K078P260M993j603o771n636
963f817J506P012N557j463p163n362J172O603N468j206n959n876J66O532N738
$$ y = [4043, 9296, 5592, -3997, -9051, -5376, 4169, 9953, 6185, -3014, -8896, -5517, 3706, 9620, 6627, -2696, -8686, -6454, 2166, 8651, 6731, -2401, -8940, -7353, 1235, 8039, 6341, -2005, -8504, -7291, 604, 7715, 6813, -867, -7965, -7559, 125, 8046, 7677, 365, -7576, -7406, 15, 7517, 8150, 900, -7038, -7578, -623, 6737, 7723, 1332, -6742, -8191, -1733, 5739, 7715, 1642, -6379, -8152, -2196, 5584, 8082, 2325, -5432, -7774, -2760, 5352, 8353, 3337, -4219, -7344, -2766, 5355, 8405, 3933, -3982, -7482, -3279, 4491, 8072, 3869, -4063, -7590, -4393, 3540, 7610, 4212, -3533, -7770, -4990, 2521, 7678, 4512, -3002, -7705, -4922, 2601, 7487, 4959, -1850, -7138, -5060, 2200, 7193, 5590, -1181, -6817, -5311, 1701, 7258, 5795, -1368, -6730, -5558, 1045, 6513, 5307, -652, -6528, -6362, 170, 5908]
978E908j9o355n829k78O297O517k7n798o089m69N643O411O93n446o336r72N125
995a024O641J057m920o663j706M924O560J491m535o577j762M123O424K272m080
1010B225o406k800L963O678K747l784o708k308L417O301K926k824o782k998L262
1025c091O053L401k412o436l490K530N818L889k412o007m061K084N993M186j955
1040D090o393l995J813N893M242j397o011m540J543N761M405p61n825m355O43
1055d887N789M790m90n632m624K87N101N107m49m670n289o0M879M633K47m723
1071In132m94N018M971M80m849m617q17M030N464R86l945n111j446M306N201J489
1088E543l675n297j666L696N168J977l797n349j961K875N514K169l099o012k255
$$ y = [5908, 5889, -466, -6295, -6573, -276, 6241, 6214, 416, -5673, -6142, -499, 5912, 6605, 1159, -5177, -6149, -1024, 5617, 6674, 1754, -4909, -6615, -1691, 4869, 6360, 1825, -4752, -6514, -2391, 4033, 6305, 2225, -4181, -6981, -3018, 3660, 6407, 2623, -4085, -6393, -2976, 3325, 6251, 3427, -3355, -6353, -3091, 2962, 6363, 3951, -2485, -5975, -3445, 2373, 6262, 3850, -2157, -6218, -4134, 1859, 6045, 4090, -2303, -6298, -4485, 1408, 5650, 4253, -1758, -6298, -4755, 1006, 5411, 4650, -1175, -5530, -4887, 902, 5692, 5202, -430, -5054, -4767, 334, 5441, 4992, 322, -4967, -5027, -148, 4485, 4732, 9, -5123, -5617, -599, 4372, 4852, 3, -4614, -5431, -1401, 4063, 5049, 1104, -4007, -5453, -1147, 4054, 5543, 1868, -3429, -5095, -1399, 3769, 5746, 1949, -3400, -5361, -2486, 3028, 5197, 2098, -3914, -6169]
1103f169L252N272K461k991m880k589K711N065K846k001n262l099K374N067L244
1118E301j638n037l352J517N316L535j720n256l595J510M795L692j232m959l802
1133d925R18M453L906p62n002l861O63M700L759p9m555m237P04M372M206m3m239
1150b2m007L56L550M913J48l921m257n91M113M226K15l455m612r45L777L873J235
1167D596l396m776q75L185M114J783l418m645r78K661M960J376k610m245j990
1182d258K761M775J864k490m536k090K495M315K401k566m079k799K266M257K394
1197D710j932m867k251J777M107K781j337m653k989J616M536K902j476m125k899
1212d100J231M195L509j191l892l198J132M017K771p87l852l149P06L635L118
$$ y = [-6169, -2917, 2355, 4816, 1825, -3055, -5644, -2933, 2132, 4978, 2977, -2285, -5384, -3010, 2057, 5301, 3663, -1374, -4726, -3209, 2107, 5642, 3922, -1334, -4929, -3419, 1376, 5068, 3836, -1123, -4925, -4007, 446, 4352, 3590, -1412, -5273, -4610, 90, 3849, 3770, -785, -5022, -4318, 54, 4260, 4217, -22, -4029, -3673, -123, 4790, 4938, 1017, -3240, -3831, 282, 4508, 4723, 1268, -3344, -4289, -512, 3361, 4596, 1200, -3576, -4451, -1266, 2848, 4631, 1213, -3432, -4410, -1749, 3211, 4587, 1977, -2268, -4258, -1497, 3278, 5142, 2652, -1884, -3974, -1479, 2836, 5237, 2671, -1408, -4207, -1941, 2316, 4710, 2778, -2089, -4340, -2563, 1544, 4325, 2988, -1665, -4654, -3038, 1498, 4400, 2924, -1201, -4100, -2869, 1326, 4835, 3644, -248, -3446, -2314, 1703, 4474, 3687, -165, -3314, -2608, 1027, 4145]
1227D145l93m098l222L0L538L762j02m076l138K8L139L978k98k950l615m10L384
1244b98L749O90l343l753m96L236L453P93k777l928p60K651L677J048k898l908
1260b864j000K199L771J345k334m088j546K585L594K145k701l789j603J906M172
1275A792J970j838l802j486J362M032J828j511l672k066J266L766J747j240l245
1290a097k609Q94L391K883j066l771k520Q68L640K691j000l602k664P64L602K710
1306C114m78l302k986P84L120K901j9l577k566M24K767K804j9k840l105j45K619
1323e04L184L38k998l120l03K852L083L14k411l523l30K759K876J081k624k915
1339b241r66K382L109J119k372l068j045J940L422J103j834l923r69J767L240
$$ y = [4145, 3752, -346, -3568, -3538, 0, 3762, 3660, -416, -3554, -3526, -387, 3591, 3293, 343, -3272, -3682, -298, 3451, 4141, 798, -2955, -3451, -215, 3238, 4031, 1254, -2674, -3434, -783, 2894, 3942, 1044, -2864, -3864, -1665, 2106, 3451, 1117, -2971, -4517, -1932, 1662, 3807, 1106, -2683, -4286, -2380, 1792, 3762, 1924, -1878, -3364, -2002, 2030, 3858, 2347, -1325, -3391, -2125, 1641, 3388, 2148, -1097, -3706, -2812, 579, 3462, 2396, -1375, -3895, -3027, 613, 3304, 2304, -1298, -3962, -3198, 404, 3114, 2636, -666, -3652, -2868, 252, 3153, 3134, -443, -3009, -2585, 182, 2986, 2967, 127, -2978, -3123, -504, 2680, 3018, 20, -3100, -3403, -551, 2532, 2846, 435, -3088, -3418, -659, 2217, 3298, 674, -2241, -3207, -825, 2284, 3403, 1031, -2037, -3082, -1142, 2280, 3383, 1549, -2374, -3343, -1576, 1664]
1354A664J649k056l277j620J702L516J429j508l601j454J211L382J726j078l102
1369a417j768J035L366J564o57l402j860J117K830K241p04k829k753Q09L054K536
1385C162j064k725k738J046K710K242m39k845k327M22K608K476j23k365k676j77
1401b813L010K364J72k531k656j3K343L004J30k514l106j42K385K867J16k313
1417C03k451p95K244K889L88k113k716o02K173K263J053j765k506r83J559K770
1433A711J299j603k891j425J662K886J366j277l200j295J704K960J110j343k880
1448a216j605J276K803J300q96k581j696J051K426J689r61k505j681Q27K574J599
1464B404l44k503k133Q24K492J980m29k355k195K59K656K177m64k596k143O30
$$ y = [1664, 3313, 1257, -2020, -3640, -1938, 1578, 3007, 1499, -2102, -3556, -2345, 1037, 2763, 1685, -1417, -3185, -2150, 1216, 2780, 2123, -1279, -3139, -2022, 808, 3049, 2345, -484, -3237, -2428, 626, 3162, 2098, -627, -3365, -2319, 391, 2633, 2194, -651, -2978, -2556, 52, 2528, 2405, 40, -2636, -2813, 197, 2561, 2733, 202, -2454, -2467, -124, 2880, 3010, 496, -2610, -2752, -367, 2500, 2616, 303, -2148, -2943, -699, 2190, 2578, 465, -2251, -2853, -680, 1583, 2636, 871, -1635, -2618, -1059, 1711, 3010, 1407, -1484, -2909, -1247, 1639, 3005, 1728, -1472, -2767, -1063, 1897, 3007, 1664, -1216, -2821, -1545, 1258, 2558, 1662, -919, -2615, -1564, 862, 2551, 1590, -915, -2596, -1769, 805, 2404, 2060, -443, -2576, -1752, 740, 2720, 2291, -64, -2259, -2000, 656, 2833, 2369, -227, -2370, -1740]
1480a740K208J933j19k314k221K53J829K119J81k019k445P0K036K107N50k061
1496C67k473k01J852K648N92j871k559o57J903K425N68j734k505n22J581K139
1512A553J021j612k370j175J659K219J321j794k420r91J045K506J398j084k412
1527a136j304R52K596J168j435j937j555J168K608J126j119j947j407Q70K073
1542G21J405n69k241j425O65J883J813m70k144j936N76K134J412J01k175j954
1558b204J4K232K074o7k309j976N62J779J958k98j848j684k7J909J390L05j441
1575C69k102j70J544K070L91j759j926m60J483K025M45j368k330o8J176K109Q55
1592B284j578k161m02J308J874O75j212j952p46J096K234P00j134k205n74Q85
$$ y = [-1740, 468, 2401, 2282, -32, -2253, -2000, -171, 1948, 2129, 110, -2335, -2265, -229, 1878, 2428, 367, -2106, -2307, -455, 2193, 2785, 914, -1645, -2302, -399, 2026, 2594, 860, -1645, -2167, -586, 1553, 2574, 962, -1408, -2583, -924, 1295, 2616, 822, -1598, -2589, -1544, 962, 2360, 1276, -1136, -2440, -1488, 1108, 2276, 841, -1096, -2651, -1483, 1125, 2251, 1132, -815, -2222, -1352, 721, 2126, 1557, -684, -2109, -1444, 439, 2252, 1782, -362, -2298, -1722, 412, 1824, 1925, -250, -2204, -2190, 42, 2116, 2049, -260, -2236, -1674, 105, 2063, 1765, -83, -1767, -1794, 115, 1505, 1810, 369, -1733, -1903, -359, 1711, 2102, 343, -1583, -2043, -560, 1465, 1910, 542, -1788, -1856, -680, 1429, 2284, 706, -1455, -1857, -549, 1325, 2000, 788, -1164, -1910, -814, 1420, 2120, 986, -1219, -1793, -908]
1608i08J701J197r13j794j507J056K055R93r74j835j228J122J830J117m71j932
1624d91j067M43J618J472m99j778j618O37J830J753o63j747j455L85J523J824
1640B167n43j656j934O78J080J785j59j860j057k72J666K094m40j486j745J74
1656a508J401J635K29j531j618j29J477J879j60r96k087q4J203K060L0j240j546
1673i85n85J214J317J147j841j374p54J152J637J003j470j553r45J300J485J160
1689A908j131j826n26P49J508J171j030j552p54M53J722J372r89j849j027O45
1705a156J871Q93p17j611r31M11J584J153l12j624j370N10J621J182l34j401r69
1722a200Q5J411J106j21j384j216k32J598J385l37j490j033j61J461J325n7j288
$$ y = [-908, 793, 1990, 1077, -717, -2224, -1168, 887, 1880, 906, -929, -2157, -1035, 795, 1912, 1441, -491, -1558, -1115, 503, 1975, 1476, -302, -1920, -1283, 547, 2300, 1637, -110, -1565, -1180, 343, 2167, 1624, -32, -1966, -1288, -208, 1577, 1418, -442, -1499, -1771, -105, 1989, 1549, 63, -1682, -1508, -107, 1528, 1757, 226, -1392, -1521, -44, 1835, 1675, 679, -1408, -1492, -289, 1771, 1801, 561, -985, -1570, -356, 961, 2108, 267, -1107, -1861, -709, 928, 1931, 461, -1092, -2037, -737, 748, 1908, 777, -1049, -1575, -826, 682, 1853, 823, -729, -1483, -1030, 692, 2064, 1075, -774, -1801, -1156, 715, 1608, 891, -720, -1651, -1240, 344, 1497, 1185, -439, -1809, -1299, 322, 1504, 1170, -231, -1200, -1115, 296, 1402, 1281, -103, -1319, -1551, 47, 1432, 1095, -395, -1428, -1589, -128, 1197, 1140, -148]
1739a48j329k06J527J196L81j507j520J17J173J587K12j286j311l41J149J351
1755A045N10r13j656l04N95J772Q14j246j812k85R90J263P30p55j892o44J019
1772g69J390P29q82j552p78P39J718N37n06j639o18Q61J380Q49p57r20j383O57
1790i44J395J059m96j520n99K05J326Q85j52j408j087J20J223J301l31j489r43
1807a455J74J306J166l44r23j392K91J049J361J11j637p50k6J434O98M77j474
1824F6j274j58J076J361K54j012j350k18Q70J388M23j041j373m79J153J174M57
1841A317q86j264k96Q85J102M89p07j356m25L23J490O06q13j056q31Q05J024R54
1859A361o30j580n82M17J842N59n97j281o23L33J485L09j99j422l63M27J117P40
$$ y = [-148, -1477, -1683, -156, 1040, 1421, -86, -1606, -1489, -316, 1271, 1483, 197, -1114, -1455, -306, 1045, 1555, 642, -1014, -1318, -723, 1049, 1863, 617, -1195, -1480, -490, 773, 1503, 748, -1144, -1788, -769, 621, 1350, 468, -1084, -1862, -1123, 595, 1132, 626, -1013, -1631, -770, 610, 1459, 702, -218, -1601, -944, 451, 1510, 1014, -506, -1105, -900, 426, 1311, 1159, -249, -1336, -1216, 7, 1308, 977, -512, -1455, -1281, 25, 1191, 847, -76, -1468, -1177, -128, 1233, 1344, -293, -1043, -1069, 365, 1063, 1540, 66, -1208, -1366, -290, 1071, 1325, 313, -1037, -1255, -385, 1003, 1426, 385, -988, -1467, -314, 860, 1317, 431, -833, -1129, -244, 858, 1347, 640, -716, -1141, -818, 672, 1278, 465, -591, -1422, -617, 407, 1361, 731, -849, -1431, -1014, 828, 1387, 790, -491, -1114, -781, 704, 1013, 814, -608, -971, -544, 573, 1313]
1877A313n86p35j077L79J060Q04k22r44j084L60Q21R43J34j068j137M77M21J205
1895A064M7j441m79j22O86J062K21q78j301J95R18J043N3p42j176k57O36J426
1913I55J23m24j643K88N60Q63M53o04j230o8L72J130O68q76j301o00R96J354K24
1932A240j033r17o88P07J417J74m31j156n35Q08P29O01j15j076p99J57J088J119
1950A290p00r92o49M73J059N37l2j268n26M7R91R22K25j633o79J40J177M73l10
1969E45o44p86n8J364N13k31j089m32J5P41O63J31o95j053J12Q15R97O7p54r53
1989g32k63J059Q41L69j085j139j86J005J123K90r53j318p5R51P78j7m56r09k88
2008a005Q02P30M18m02j217j74L28R22P33m22j192m70K90J226M60m95j045m41
$$ y = [1313, 727, -8, -1085, -706, 354, 1158, 936, -8, -1092, -732, 89, 1032, 1166, 98, -1039, -562, -141, 1064, 1111, -330, -809, -931, -245, 817, 1038, 160, -1141, -946, -28, 1015, 1068, 326, -850, -1107, -471, 955, 1078, 654, -989, -701, -141, 722, 1175, 571, -659, -727, -355, 775, 1443, 567, -734, -1334, -338, 1016, 1240, 207, -710, -1398, -691, 726, 900, 469, -687, -1222, -414, 315, 916, 801, -275, -1074, -917, 171, 1290, 590, -402, -1051, -578, 481, 1018, 986, -282, -808, -761, 230, 1152, 1377, -256, -935, -795, 382, 855, 545, -99, -885, -943, 421, 934, 703, -386, -818, -803, -62, 601, 732, 37, -1016, -904, -89, 908, 975, 221, -732, -995, 64, 905, 1274, 189, -950, -1136, -131, 992, 1282, 329, -989, -1064, -113, 665, 648, 192, -717, -1005, -203, 527, 945, 543, -674, -848, -520, 402, 1135, 713, -479, -949, -659, 567, 1027, 532, -513, -954]
2026i54L23J153Q02r48r02m03M51R49L86l40j052n94J94J005R26p37o71n53M73
2045d92O07Q57n76o79n05j13Q44R58J3j066q07j06J339M66Kq17p51K98O11Q30
2065I13k95q09m58m27P86R45J61p87q18rJ033M52K71r91n22k29O93P47o7l07j192
2086i10K24N25R56o5m22o78l58L40J011J80m95j023m04O97R80K87l20j034m73
2105i82M57R10L22k00r29m58J44J021R38o52p61l59j67J375l1k26m82p15K33P72
2125B10N48j53r25l97K25O39M78J70j001o90L27O05O07Lq70l58L61M22P13n20
2145C94l98q58J47L06J054L32p01r15oM58Q07K41m43o11o89O80N45J17k82r71
2165g93N6L44P49N21p57q07k15N73P72J53l80q67J30J27N71O33k63q82o62O43
$$ y = [-954, -631, 522, 1324, 376, -526, -929, -478, 471, 857, 517, -535, -1129, -935, 70, 996, 259, -412, -965, -492, 115, 972, 396, -283, -788, -901, -57, 901, 914, -152, -959, -1065, 274, 740, 742, -75, -826, -528, 83, 913, 618, -191, -649, -1076, -290, 655, 816, 29, -789, -798, 235, 687, 958, -33, -555, -784, -91, 656, 589, 282, -910, -686, -161, 795, 730, 308, -370, -728, -388, 623, 803, 308, -715, -1119, -422, 558, 845, 525, -509, -982, -525, 385, 707, 507, -422, -880, -736, 285, 1223, 571, -190, -549, -716, 659, 628, 402, -80, -795, -562, 210, 758, 605, -320, -717, -492, 147, 625, 795, -206, -896, -569, 36, 643, 646, -224, -582, -221, 201, 914, 394, -4, -862, -715, -409, 645, 977, 276, -639, -645, -187, 620, 861, 418, -193, -882, -202, 343, 460, 178, -793, -737, -393, 356, 877, 120, -687, -902, -329, 443, 596, 216, -651, -521, -394, 177, 810, 547, -335, -997, -354]
2185c54Q39K28L7j311k81L12Q64K14j65p88m40K19P13M71l60m72j98M7N30M14
2205E19J43q45p28K73O24M71N9q93J72k35N53N87R8j032n77K84P37P77j15j116
2225b44m36j58R17N18J20r03l45M3K71P63j92l57r0m25L47O63L78o88o82k92O65
2246a27P98o9m36p89j86N00J087l41r2o58m18O48M95J40n73k34n32M87N49K59
2266E08k0o71n11L50O77M34j08p74n17J15Q23N55m09o35l82M84K94L00l42m88
2286c17k53M30L36N29k91m80k83k30P64J71J6m81m35r3N27P90j32m86n01j33P25
2307A73P99m88o68m72J82M00P54l0p13l50K37K90K88p6m24k65oj4O31N0N1q46
2329d97p7L26O87L5j89q36k90O72O24K74o67l77k07L55N22K19k37n03j62M7N03
$$ y = [-354, 485, 713, 750, -561, -842, -530, 334, 548, 383, -405, -845, -626, 87, 558, 198, -274, -472, -425, 105, 519, 662, -183, -911, -638, -14, 457, 516, -377, -205, -440, 113, 700, 798, -234, -811, -527, 210, 987, 872, -244, -680, -838, 79, 597, 717, -186, -531, -488, -217, 546, 354, -3, -93, -518, -171, 492, 870, 182, -500, -792, -127, 671, 602, 166, -623, -809, -309, 778, 437, 345, -313, -731, -83, 412, 552, -21, -255, -787, -300, 249, 508, 488, -183, -694, -344, 333, 767, 659, -115, -632, -517, 306, 861, 452, -183, -565, -81, 213, 513, 171, -317, -570, -140, 196, 725, 434, -46, -329, -559, 205, 376, 392, -89, -524, -617, -90, 700, 568, 82, -419, -552, 173, 972, 484, -184, -656, -474, -74, 680, 650, -63, -413, -176, 114, 402, 326, -98, -363, -369, -383, 248, 298, 349, -497, -574, -248, 439, 474, 285, -551, -841, -169, 455, 729, 62, -315, -522, -167, 355, 574, 337, -166, -328, -281, 222]
2350B22R5j20K6n93J58L91J87J05o58o82O22N79K58k20o46k93M07O21r8J70n62
2371c1o90L36O57K17P7p38j41p3L68K40K59n00l96j10K44P35j63j22n84j80Q46
2392B51L33k4o10m93L11L87R5K96p06j05OL66K71q4l03j95R6j00O58P5l02k71
2414d8j73j11M37K21k53l25n19N33M14M35o13l37k14N46M56K10p32j89m8K79K56
2435B25K10l16k17m88K4P21j42N36o98k10k94O66N36m5o32n02JO41P26m40m21
2456a19k57J59L18L15j90j44m32N2L07j5J56K00q78N02P6J39j02J02o25J65J48
2477a23M93K84p26qk95J94K36K94j89l55j21K87J58J87k99k31k16M28K11l55L48
2498B02k12m09K11N05K31k82m14l01J95O11K82l37j021J48N64J22J69m2o77j1
$$ y = [222, 317, 197, 223, -370, -212, 179, 366, 471, -187, -869, -247, 332, 590, 370, -276, -569, -162, 459, 361, 531, -31, -721, -385, 272, 489, 566, -172, -313, -386, -18, 222, 481, -19, -415, -525, -281, 454, 291, 169, -415, -595, 251, 584, 560, -50, -543, -232, 155, 250, 546, -160, -265, -259, 107, 378, 294, -9, -204, -108, -208, 450, 525, 223, -48, -221, -332, 105, 326, 73, -252, -771, -238, 176, 611, -2, -339, -553, -7, 449, 659, -73, -262, -310, -31, 225, 435, 119, -98, -586, -562, 159, 17, 553, -145, -355, -649, 17, 553, 508, -124, -626, -625, 16, 742, 302, -119, -376, -217, 101, 416, 226, 82, -350, -298, 9, -6, 150, 350, -528, -26, 50, 189, 87, 189, -436, -271, -123, 370, 654, -72, -80, -375, -181, 55, 349, 160, -195, -316, -29, 129, 316, 17, -214, -430, -2, 209, -146, 202, -10, -419, -208, 297, 528, 246, -168, -469, -274, 337, 619, 282, -739, -591, -27, 95, 264, 222, -455, -466]
2518d66M73P0J01K46m74m98K80M22L17l28j16l64j03L36O18k8l14n25O0N76J7
2539C00J90l15n73L6M83J67M3p47l2M43q9N49j75o1m47P0j09L90M30n62j91l83
$$ y = [-466, 7, 77, 178, 424, -50, -548, -268, 154, 471, 143, 27, -337, -440, -104, 514, 486, 172, -353, -293, 283, 300, 490, 175, -398, -362, 121, 288, 331, -416, -448, -5, -94, 455, 280, 219, -228, -158, -267, 123, 553, -9, -200, -583]
$$ [...]
8191B28
##END NTUPLES=NMR FID
##END=
