##TITLE=1H_K-371/2
 DMSO/CCl4, 8 sc, 
 19.12.2019
##JCAMPDX= 6.0         $$ Bruker NMR JCAMP-DX V2.0
##DATA TYPE= NMR FID
##DATA CLASS= NTUPLES
##ORIGIN= UXNMR, Bruker Analytische Messtechnik GmbH
##OWNER= root
$$ XWIN-NMR		Version 3.5
$$ Thu Dec 19 15:12:03 2019 Russian Standard Time (UT+4h)  she@DPX200
##.OBSERVE FREQUENCY= 200.1315
##.OBSERVE NUCLEUS= ^1H
##.DELAY= (6, 6)
##.ACQUISITION MODE= SIMULTANEOUS
##.ACQUISITION SCHEME= undefined
##.AVERAGES= 8
##.DIGITISER RES= 18
##SPECTROMETER/DATA SYSTEM= spect
##.PULSE SEQUENCE= zg30
##.SOLVENT NAME= DMSO
##.SHIFT REFERENCE= (INTERNAL, DMSO, 0, 15.7039)
##AUDIT TRAIL= $$ (NUMBER, WHEN, WHO, WHERE, WHAT)
$$ ##TITLE= Audit trail, XWIN-NMR		Version 3.5
$$ ##JCAMPDX= 5.01
$$ ##ORIGIN= Bruker BioSpin GmbH
$$ ##OWNER= she
$$ F:/spectra/data/she/nmr/H-F/1/audita.txt
$$ ##AUDIT TRAIL=  $$ (NUMBER, WHEN, WHO, WHERE, WHAT)
(   1,<2019-12-19 15:10:23.50 +0400>,<she>,<DPX200>,
      <created by zg, POWCHK disabled, PULCHK disabled
       configuration hash MD5:
       00 E9 B6 7A A2 85 ED C7 34 08 36 98 17 FE 4E 26
       data hash MD5: 16K
       80 A2 E2 6D 55 BE A1 C1 65 4B FB CB C4 CF 3C 15>)
$$ ##END=
$$ 
$$ hash MD5
$$ 47 FA 1E F8 98 72 73 53 59 C2 22 92 FF C6 57 FF
##$RELAX= 
##$RELAX= 
##$RELAX= 
##$RELAX= 
##$RELAX= 
##$RELAX= 
$$ Bruker specific parameters
$$ --------------------------
##$DU= <F:/spectra>
##$EXPNO= 1
##$NAME= <H-F>
##$PROCNO= 1
##$TYPE= <nmr>
##$USER= <she>
##$AMP= (0..31)
100 100 100 100 100 100 100 100 100 100 100 100 100 100 100 100 100 100 
100 100 100 100 100 100 100 100 100 100 100 100 100 100 
##$AQSEQ= 0
##$AQ_mod= 1
##$AUNM= <au_zg>
##$AUTOPOS= <>
##$BF1= 200.13
##$BF2= 200.13
##$BF3= 200.13
##$BF4= 200.13
##$BF5= 200.13
##$BF6= 200.13
##$BF7= 200.13
##$BF8= 200.13
##$BYTORDA= 1
##$CFDGTYP= 0
##$CFRGTYP= 5
##$CHEMSTR= <none>
##$CNST= (0..31)
1 1 145 1 1 1 1 1 1 1 1 1 1 1 1 1 1 1 1 1 1 1 1 1 1 1 1 1 1 1 1 1 
##$CPDPRG= <>
##$CPDPRG1= <>
##$CPDPRG2= <>
##$CPDPRG3= <>
##$CPDPRG4= <mlev>
##$CPDPRG5= <mlev>
##$CPDPRG6= <mlev>
##$CPDPRG7= <mlev>
##$CPDPRG8= <mlev>
##$CPDPRGB= <>
##$CPDPRGT= <>
##$D= (0..31)
0 1.2 0 0 0 0 0 0 0 0.06 0 0.03 0 0 0 0 0.0002 0 0 0 0 0 0 0 0 0 0 0 0 
0 0 0 
##$DATE= 1576753822
##$DBL= (0..7)
120 120 120 120 120 120 120 120 
##$DBP= (0..7)
150 150 150 150 150 150 150 150 
##$DBP07= 0
##$DBPNAM0= <>
##$DBPNAM1= <>
##$DBPNAM2= <>
##$DBPNAM3= <>
##$DBPNAM4= <>
##$DBPNAM5= <>
##$DBPNAM6= <>
##$DBPNAM7= <>
##$DBPOAL= (0..7)
0.5 0.5 0.5 0.5 0.5 0.5 0.5 0.5 
##$DBPOFFS= (0..7)
0 0 0 0 0 0 0 0 
##$DE= 6
##$DECBNUC= <off>
##$DECIM= 24
##$DECNUC= <off>
##$DECSTAT= 4
##$DIGMOD= 1
##$DIGTYP= 9
##$DL= (0..7)
0 120 120 120 120 120 120 120 
##$DP= (0..7)
150 150 150 150 150 150 150 150 
##$DP07= 0
##$DPNAME0= <>
##$DPNAME1= <>
##$DPNAME2= <>
##$DPNAME3= <>
##$DPNAME4= <>
##$DPNAME5= <>
##$DPNAME6= <>
##$DPNAME7= <>
##$DPOAL= (0..7)
0.5 0.5 0.5 0.5 0.5 0.5 0.5 0.5 
##$DPOFFS= (0..7)
0 0 0 0 0 0 0 0 
##$DQDMODE= 0
##$DR= 18
##$DS= 0
##$DSLIST= <SSSSSSSSSSSSSSS>
$$ [...]
##$SUBNAM2= <"">
##$SUBNAM3= <"">
##$SUBNAM4= <"">
##$SUBNAM5= <"">
##$SUBNAM6= <"">
##$SUBNAM7= <"">
##$SUBNAM8= <"">
##$SUBNAM9= <"">
##$SW= 24.9337058887773
##$SWIBOX= (0..15)
0 0 2 0 0 0 0 0 0 0 0 0 0 0 0 0 
##$SW_h= 4990.01996007984
##$TD= 16384
##$TD0= 1
##$TE= 0
##$TE2= 300
##$TE3= 300
##$TEG= 300
##$TL= (0..7)
0 120 120 120 120 120 120 120 
##$TP= (0..7)
150 150 150 150 150 150 150 150 
##$TP07= 0
##$TPNAME0= <>
##$TPNAME1= <>
##$TPNAME2= <>
##$TPNAME3= <>
##$TPNAME4= <>
##$TPNAME5= <>
##$TPNAME6= <>
##$TPNAME7= <>
##$TPOAL= (0..7)
0.5 0.5 0.5 0.5 0.5 0.5 0.5 0.5 
##$TPOFFS= (0..7)
0 0 0 0 0 0 0 0 
##$TUNHIN= 0
##$TUNHOUT= 0
##$TUNXOUT= 0
##$USERA1= <user>
##$USERA2= <user>
##$USERA3= <user>
##$USERA4= <user>
##$USERA5= <user>
##$V9= 5
##$VALIST= <valist>
##$VCLIST= <CCCCCCCCCCCCCCC>
##$VD= 0
##$VDLIST= <DDDDDDDDDDDDDDD>
##$VPLIST= <PPPPPPPPPPPPPPP>
##$VTLIST= <TTTTTTTTTTTTTTT>
##$WBST= 1024
##$WBSW= 4
##$XGAIN= (0..3)
0 0 0 0 
##$XL= 0
##$YL= 0
##$YMAX_a= 125999
##$YMIN_a= -81658
##$ZGOPTNS= <>
##$ZL1= 120
##$ZL2= 120
##$ZL3= 120
##$ZL4= 120
##$ABSF1= 10
##$ABSF2= 0
##$ABSG= 5
##$ABSL= 3
##$ALPHA= 0
##$AQORDER= 0
##$ASSFAC= 0
##$ASSFACI= 0
##$ASSFACX= 0
##$ASSWID= 0
##$AUNMP= <proc_1d>
##$AZFE= 0.1
##$AZFW= 0.1
##$BCFW= 1
##$BC_mod= 2
##$BYTORDP= 1
##$COROFFS= 0
##$CY= 11.3945322036743
##$DATMOD= 1
##$DC= 2
##$DFILT= <>
##$DTYPP= 0
##$F1P= 16.9975609425685
##$F2P= -3.02152046262296
##$FCOR= 0.5
##$FTSIZE= 0
##$FT_mod= 4
##$GAMMA= 1
##$GB= 0.15
##$INTBC= 1
##$INTSCL= 1
##$ISEN= 128
##$LB= 0.24
##$LEV0= 0
##$LPBIN= 0
##$MAXI= 10000
##$MC2= 0
##$MEAN= 0
##$ME_mod= 0
##$MI= 1.114404
##$NCOEF= 0
##$NC_proc= 0
##$NLEV= 6
##$NOISF1= 3.799351
##$NOISF2= 2.8
##$NSP= 1
##$NTH_PI= 0
##$NZP= 0
##$OFFSET= 15.70392
##$PC= 1
##$PHC0= -10151.8
##$PHC1= 16.0008
##$PH_mod= 1
##$PKNL= yes
##$PPARMOD= 0
##$PSCAL= 0
##$PSIGN= 0
##$REVERSE= no
##$SF= 200.130013532006
##$SI= 16384
##$SIGF1= 3
##$SIGF2= 2
##$SINO= 400
##$SIOLD= 16384
##$SREGLST= <1H.CDCl3>
##$SSB= 0
##$STSI= 0
##$STSR= 0
##$SW_p= 3612.71676300578
##$SYMM= 0
##$S_DEV= 0
##$TDeff= 0
##$TDoff= 0
##$TI= <>
##$TILT= no
##$TM1= 0
##$TM2= 0
##$TOPLEV= 0
##$USERP1= <user>
##$USERP2= <user>
##$USERP3= <user>
##$USERP4= <user>
##$USERP5= <user>
##$WDW= 1
##$XDIM= 8192
##$YMAX_p= 0
##$YMIN_p= 0
$$ End of Bruker specific parameters
$$ ---------------------------------
##NTUPLES= NMR FID
##VAR_NAME=  TIME,          FID/REAL,        FID/IMAG
##SYMBOL=    X,             R,               I
##VAR_TYPE=  INDEPENDENT,   DEPENDENT,       DEPENDENT
##VAR_FORM=  AFFN,          ASDF,            ASDF
##VAR_DIM=   8192,          8192,            8192
##UNITS=     SECONDS,       ARBITRARY UNITS, ARBITRARY UNITS
##FACTOR=    0.0002004,     1,               1
##FIRST=     0,             0,               0
##LAST=      1.6414764,     0,               0
##MIN=       0,             -81658,          0
##MAX=       1.6414764,     125999,          0
$$ Real data points
##PAGE= N=1
##DATA TABLE= (X++(R..R)), XYDATA
$$ [...]
$$ plain form
2023 -283 -1726 -1198 -135 845 97 -1187 -1160 -332 316 224 -342 -413 -421 -523 -252 105 158 -70 -840 -848 -206 1037
2045 1037 520 -733 -1151 -701 1164 1345 -89 -1433 -1161 592 1336 931 -696 -1506 -51 1390 1038
2062 1038 -242 -894 -96 829 1071 461 -149 -148 73 359 557 547 354 315 -169 302 1269 1199 212 -428 -391
2083 -391 731 1696 936 -344 -1023 63 1795 1340 -197 -1103 -222 1104 1492 -73 -935 -795 456
2100 456 1312 811 -421 -816 -81 332 774 207 -265 -114 -402 -145 -67 474 -74 -544 -804 -110 690 766
2120 766 -178 -1115 -612 583 1108 -110 -1639 -1094 339 1282 536 -1013 -1076 -449 954 776 -342 -1036
2138 -1036 -555 365 561 -193 -478 -585 7 270 285 93 159 -62 -236 -70 118 603 282 -1068 -1072 190
2158 190 988 667 -1019 -1308 -459 1164 879 17 -1377 -429 645 1025 107 -975 -923 -281 665 -16 -1044
$$ packed form
2023b83j443N28J063R80p48j284K7Q28O48r2n66p1qj02K71L57N3k28p70qO42J243
2045A037n17j253m18M50J865J81j434j344K72J753P44m05j627q10J455J441l52
2062A038j280o52P98R25K42o10o10JK21K86J98j0j93l9m84M71R67p0r87o40L7
2083c91J122R65p60j280o79J086J732m55j537r06Q81J326L88j565q62J40J251
2100D56Q56n01j232l95P35M13M42n67m72J51k88K57P8N41n48m70k60O94Q00P6
2120G66r44r37N03J195N25j218j529N45J433R43p46j549o3O27J403j78j118o94
2138a036M81R20J96p54k85j07N92K63J5j92O6k21j74J66J88M85l21j350mJ262
2158A90P98l21j686k89Q49J623k85q62j394R48J074L80r18j082N2O42R46o81j028
$$ plain form
2177 -1044 -819 -673 333 243 -81 -484 -549 -25 -269 198 -147 -26 -382 -530 54 639 264 -113 -1171 -680
2197 -680 532 987 195 -1197 -933 61 1008 557 -558 -842 -289 978 912 321 -703 -75 565 659 304
2216 304 -118 -531 -110 484 693 465 255 111 -52 312 678 827 240 -540 -367 720 1002 980 -190 -243
2236 -243 92 1027 1305 191 -890 -514 928 1173 747 -382 -462 228 877 924 86 -404 -43 504 505 242
2256 242 -20 -145 -345 77 352 143 -264 -352 -597 115 588 559 -328 -731 -682 641 716 62 -719 -632 380
2277 380 508 41 -994 -1098 -171 403 -5 -317 -961 -526 17 -186 148 -536 -789 -520 -344 128 169 -280
2297 -280 -893 -668 -187 307 294 -337 -1037 -878 104 512 -159 -501 -1059 188 893 534 -485 -1003 -486 493
2317 493 903 -54 -481 -476 228 526 297 -109 -77 60 472 286 440 317 -37 -138 256 743 825 570 20
$$ packed form
2177a044K25J46J006r0l24m03o5N24k44M67l45J21l56j48N84N85l75l77j058M91
2197f80J212M55p92j392K64R94R47m51j115k84N53J267o6n91j024O28O40R4l55
2216C04m22m13M21N94K09k28k10j44j63L64L66J49n87p80J73J087K82k2j170n3
2236b43L35R35K78j114j081L76J442K45m26j129q0O90O49M7q38m90L61N47Jk63
2256B42k62j25k00M22K75k09m07q8k45P12M73k9q87m03M9J323P5o54p81Q7J012
2277C80J28m67j035j04R27N74m08l12o44M35N43k03L34o84k53K69J76M72M1m49
2297b80o13K25M81M94j3o31p00J59R82M08o71l42n58J247P05l59j019n18N17R79
2317D93M10r57m27NP04K98k29m06L2J37M12j86J54j23l54j01L94M87Q2k55n50
$$ plain form
2338 20 -181 266 1321 1069 -103 -648 161 1401 1232 362 -684 -223 1002 1543 700 -204 -400 16 1004
2357 1004 743 -31 -213 -80 534 553 445 48 -86 -47 -223 123 115 28 -483 -428 -530 -2 273 7 -1240
2378 -1240 -847 -31 968 36 -1028 -1191 -621 606 375 -886 -1159 -629 219 575 -279 -1045 -802 -28 312
2397 312 41 -468 -613 -258 38 203 -335 -258 -445 -220 -279 -334 -506 145 -321 -552 -204 525 651 -28 -523
2418 -523 -459 600 1028 494 -664 -943 657 1243 775 -240 -413 285 930 888 277 -367 5 726 1250
2437 1250 556 208 86 421 428 764 655 359 361 179 434 521 937 483 221 117 448 726 675 43 -418 -29
2459 -29 1209 1450 119 -490 -789 467 1094 191 -359 -620 -42 668 377 -12 -815 -253 267 403 -216
2478 -216 -288 -671 -429 -386 -102 -235 -614 -614 -454 -301 -459 -347 -670 -742 -1046 -258 99 -286 -1104 -1247 -923 -58
$$ packed form
2338B0k01M47J055k52j172n45Q09J240j69q70j046M61J225N41q43r04j96M16R88
2357A004k61p74j82J33O14J9j08l97j34L9j76L46qq7n11N5j02N28K75k66j247
2378a240L93Q16R99r32j064j63N70J227k31j261k73N30Q48L56q54p66K43P74L40
2397C12k71n09j45L55K96J65n38P7j87K25n9n5j72O51m66k31L48P29J26o79m95
2418e23O4J059M28n34j158k79J600N86m68j015j73O98O45m2o11o44L72P21N24
2437A250o94l48j22L35PL36j09k96Kj82K55Q7M16m54k62j04L31K78n1o32m61L89
2459b9J238K41j331o09k99J256O27r03n50k61N78P10k91l89q03N62N20J36o19
2478b16p2l83K42M3K84j33l79%J60J53j58J12l23p2l04P88L57l85q18j43L24Q65
$$ plain form
2500 -58 68 -702 -1408 -964 -359 397 -365 -1076 -1150 -248 -83 88 -511 -1022 -458 -373 -231 -55 -166 -735 -498
2521 -498 -63 307 148 -136 -227 -18 56 243 352 -267 -251 132 846 578 243 -182 21 372 830 671 579
2542 579 -93 244 388 742 632 235 219 224 496 1073 381 339 119 450 900 722 475 86 79 566 723 312
2564 312 38 -155 118 725 645 254 -129 -85 156 606 471 -301 -294 178 9 406 171 -250 -282 -524 145 312
2586 312 187 -428 -610 -290 -75 64 -29 -742 -579 -87 300 396 -527 -903 -319 203 263 -202 -899 -588 -396
2607 -396 335 101 -672 -852 -405 85 -175 -222 -203 -523 -362 -274 -206 -89 -426 -477 -347 -444 139 -96 -436 -844
2629 -844 -366 125 213 -15 -720 -418 -97 583 440 -316 -926 -117 468 453 45 -510 -254 213 624 147 -313
2650 -313 -412 -136 451 422 -84 -323 -28 129 270 365 131 15 120 -113 214 135 413 230 -249 19 -14 871
$$ packed form
2500e8J26p70p06M44O05P56p62p11p4R02J65J71n99n11N64Q5J42J76j11n69K37
2521d98M35L70j59k84r1K09P4J87J09o19J6L83P14k68l35m25K03L51M58j59r2
2542E79o72L37J44L54j10l97j6NK72N77o92m2k20L31M50j78k47l89pM87J57m11
2564C12k74j93K73O07q0l91l83M4K41M50j35p72PM72j69L97k35m21l2k42O69J67
2586C12j25o15j82L20K15J39r3p13J63M92L87R6r23l76N84N22O0m65o97L11J92
2607c96P31k34p73j80M47M90k60m7J9l20J61Q8O8J17l37n1J30r7N83k35l40m08
2629h44M78M91Q8k28p05L02L21O80j43p56o10Q09N85j5m08n55K56M67M11m77m60
2650c13r9K76N87k9n06k39K95J57J41R5k34j16J05k33L27p9K78j83m79K68l3Q85
$$ plain form
2672 871 157 -471 -379 481 771 443 -604 -615 -88 626 685 -115 -838 -175 234 844 53 -684 -431 254 123
2693 123 342 -285 -100 -153 74 146 63 -66 106 82 -114 -296 71 109 18 -392 -82 291 346 -366 -897 -641
2715 -641 155 481 36 -505 -803 -100 302 574 -248 -703 -129 261 588 -88 -681 -302 187 226 123 -126
2735 -126 -380 173 64 -210 -145 -120 -82 -256 13 -125 203 364 -88 -362 -252 -68 320 -452 -308 -342 422
2756 422 515 288 -463 -213 225 627 344 -247 -236 -134 103 414 -62 -574 -202 228 360 309 -27 -327 -275
2777 -275 311 211 22 -20 24 -74 -132 -152 539 -293 -107 -17 -116 541 50 50 -47 -143 313 493 35 -322 -371 -8
2801 -8 674 380 168 -22 -160 451 337 72 -134 159 153 635 567 -235 97 -147 -11 -161 204 156 79 -158
2823 -158 -187 450 20 2 -55 159 91 225 114 59 -340 40 100 382 80 -103 -433 -476 374 316 -211 -469 -214
$$ packed form
2672H71p14o28R2Q60K90l28j047j1N27P14N9q00p23O63M09O10p91p37K53O85j31
2693A23K19o27J85n3K27P2q3j29J72k4j96j82L67L8r1m10L10L73N5p12n31K56
2715f41P96L26m45n41k98P03M02K72q22m55N74L90L27o76n93L79M89L9j03k49
2735a26k54N53j09k74O5K5L8j74K69j38L28J61m52k74J10J84L88p72J44l4P64
2756D22R3k27p51K50M38M02k83n91J1J02K37L11m76n12L72M30J32n1l36l00N2
2777b75N86j00j89m2M4r8n8k0O91q32J86R0r9O57m91%r7r6M56J80m58l57m9L63
2801hO82k94k12j90j38O11j14k65k06K93oM82o8q02L32k44J36j50L65m8p7k37
2823a58k9O37m30j8n7K14o8J34j11n5l99L80O0K82l02j83l30m3Q50n8n27k58K55
$$ plain form
2846 -214 -63 -82 -239 -324 -673 77 116 238 -182 -503 31 96 297 -279 -17 -133 -100 43 273 -165 -511 -116
2868 -116 79 260 -86 -129 -201 -195 -189 241 165 -238 -556 -428 -10 464 60 62 -376 -209 122 160 -81 -283 -13
2891 -13 -234 385 110 69 21 -177 533 681 359 -118 -342 227 512 173 111 -305 172 559 455 44 -157
2912 -157 -78 -58 257 445 437 272 106 -176 129 420 376 139 -129 206 332 527 32 -316 46 90 378 195
2934 195 39 -242 -87 142 638 100 -192 -133 38 413 59 -106 -332 -195 250 168 -45 -75 -189 -59 -6
2955 -6 287 355 -237 -45 -374 -102 -99 -54 -560 -552 -393 234 366 -300 -382 -485 152 86 266 -441 -634 -275 166
2978 166 -63 -129 -504 -250 -91 37 -53 -169 -239 -432 153 20 -88 -83 -208 -29 21 91 -18 -1 151 -16 109
3001 109 270 305 -35 4 213 326 355 -217 -46 -5 266 218 469 -124 26 68 352 384 167 -265 -165 63
$$ packed form
2846b14J51j9j57q5l49P50L9J22m20l21N34O5K01n76K62j16L3J43K30m38l46L95
2868a16J95J81l46m3p2OOM30p6m03l18J28M18M74m04Km38J67L31L8k41k02K70
2891a3k21O19k75m1m8j98P10J48l22m77k24N69K85l39o2m16M77L87j04m11k01
2912a57P9K0L15J88qj65j66k82L05K91m4k37k68L35J26J95m95l48L62M4K88j83
2934A95j56k81J55K29M96n38k92N9J71L75l54j65k26J37M45q2k13l0j14J30N3
2955fK93O8n92J92l29K72LM5n06QJ59O27J32o66q2j03O37o6J80p07j93L59M41
2978A66k29o6l75K54J59J28r0j16p0j93N85j33j08Nj25J79N0P0j09J7J52j67J25
3001A09J61L5l40L9K09J13K9n72J71M1K71m8K51n93J50M2K84L2k17m32J00K28
$$ plain form
3023 63 668 511 -146 307 -56 281 240 191 -156 -32 363 311 334 185 290 48 355 12 414 103 -279 -39
3045 -39 131 -137 210 -355 -193 40 151 298 253 -303 -463 -180 235 230 16 -429 -53 71 208 -372 -238
3066 -238 -401 98 84 47 -230 -82 -438 -113 -21 2 -270 -539 -166 -23 118 4 -387 -163 -565 -124 74
3087 74 -40 -151 -153 -110 -86 55 -55 135 -151 205 129 235 -144 -149 -268 233 263 17 -19 -117 114 86 307 90
3111 90 -197 103 212 322 381 -22 5 91 217 477 332 -79 -304 -167 266 325 177 151 -4 265 366 199
3133 199 -35 66 -113 -17 466 521 143 69 11 56 8 -12 188 -235 141 49 422 5 -337 -204 87 255 66
3156 66 53 -81 -80 72 259 -311 -14 142 -61 324 127 68 -247 -311 -184 67 62 -122 -100 -251 -116 72 -190
3179 -190 -379 -288 -165 147 122 -71 -351 -394 -208 -4 113 -313 -121 -531 1 323 -85 -76 -132 -71 27 -179 -82
$$ packed form
3023F3O05j57o57M53l63L37m1m9l47J24L95n2K3j49J05k42L07l43M02l11l82K40
3045c9J70k68L47n65J62K33J11J47m5n56j60K83M15nk14m45L76J24J37n80J34
3066b38j63M99j4l7k77J48l56L25R2K3k72k69L73J43J41j14l91K24m02M41J98
3087G4j14j11kM3K4J41j10J90k86L56p6J06l79nj19N01L0k46l6r8K31k8K21k17
3111I0k87L00J09J10N9m03K7Q6J26K60j45m11k25J37M33N9j48k6j55K69J01j67
3133A99k34J01j79R6M83N5l78p4n8M5m8k0K00m23L76r2L73m17l42J33K91J68j89
3156F6j3j34JJ52J87n70K97J56k03L85j97n9l15o4J27K51nj84K2j51J35J88k62
3179a90j89R1J23L12k5j93k80m3J86K04J17m26J92m10N32L22m08Rn6O1R8k06R7
$$ plain form
3202 -82 -114 7 152 -201 -116 -258 -362 -111 133 182 104 -212 -189 -7 -65 124 237 25 -98 -269 350 120
3224 120 -83 98 -197 403 16 256 -15 -265 -65 197 255 276 -176 -267 174 392 317 65 30 -362 -37 -126
3246 -126 176 75 -114 -23 -12 274 350 240 115 -289 308 291 -132 -209 -219 -53 32 268 55 -148 -205 2 99
3269 99 215 22 315 56 268 -36 -103 -374 -119 -156 216 177 -25 -310 -234 26 6 123 -16 -60 -61 46 -249
3292 -249 58 108 -118 54 190 -12 144 11 360 33 -4 47 -115 -347 -134 -266 -6 33 -21 -262 -52 88
3314 88 374 87 -92 98 -150 44 -51 -231 -167 -277 46 72 13 -240 -218 -131 167 85 32 -59 -249 -156 272 -80
3338 -80 -291 56 67 -59 -84 229 93 -126 63 127 124 204 -153 -47 -176 -226 33 266 33 -128 129 228 322
3361 322 -148 77 -226 149 133 140 -17 -39 -114 184 174 -228 17 -44 -186 42 -204 15 -164 -256 211 72 387
$$ packed form
3202h2l2J21J45l53Q5j42j04K51K44M9p8l16K3J82n8J89J13k12j23j71O19k30
3224A20k03J81k95O00l87K40k71k50K00K62N8K1m52r1M41K18p5k52l5l92L25q9
3246a26L02j01j89R1J1K86P6j10j25m04N97j7m23p7j0J66Q5K36k13k03n7K07R7
3269I9J16j93K93k59K12l04o7k71K55l7L72l9k02k85P6K60k0J17j39m4jJ07k95
3292b49L07N0k26J72J36k02J56j33L49l27l7N1j62k32K13j32K60L9n4k41K10J40
3314H8K86k87j79J90k48J94r5j80O4j10L23K6n9k53K2Q7K98q2n3r1j90R3M28l52
3338h0k11L47J1j26k5L13j36k19J89O4lQ0l57J06j29n0K59K33k33j61K57R9R4
3361C22m70K25l03L75j6Pj57k2p5K98j0m02K45o1j42K28k46K19j79r2M67j39L15
$$ plain form
3384 387 80 -261 -51 85 -73 127 22 -197 -209 51 29 -265 -135 -89 145 372 320 205 61 -26 36 -88
3406 -88 -4 2 51 240 102 -225 -320 -151 98 64 226 220 250 143 -302 317 -226 -22 54 -83 -86 -136 126 31 -82
3431 -82 -7 -58 259 388 -32 126 -304 72 -2 -178 -187 -4 -35 334 -281 -179 -54 -143 189 -113 -305 -162 -122
3454 -122 -109 270 -199 -16 -84 -63 -91 228 -54 32 -30 -253 41 245 96 -149 65 -343 4 197 -2 57
3476 57 -109 -99 466 260 56 178 -121 -109 -51 -60 -162 -92 89 -94 9 341 34 303 128 65 57 139 -282 -258
3500 -258 -16 127 -153 125 -22 -258 378 -182 183 296 -168 -76 192 181 -129 -2 -126 15 24 87 -92 -225
3522 -225 -265 68 9 292 -163 -70 54 -121 116 7 24 -78 -145 204 -53 -106 -127 -186 -189 223 9 -224 29
3545 29 3 80 27 -139 -23 43 -124 -66 -24 100 14 241 -4 7 119 207 -64 -70 212 -17 68 -14 -250 -178 241
$$ packed form
3384C87l07l41K10J36j58K00j05k19j2K60k2k94J30M6K34K27n2j15j44q7O2j24
3406h8Q4OM9J89j38l27r5J69K49l4J62oL0j07m45O19n43K04P6j37ln0K62r5j13
3431h2P5n1L17J29m20J58m30L76p4j76rJ83l1L69o15J02J25q9L32l02j92J43M0
3454a22J3L79m69J83o8K1k8L19k82Q6o2k23K94K04j49k45K14m08L47J93j99N9
3476E7j66J0N65k06k04J22k99J2N8rj02P0J81j83J03L32l07K69j75o3qQ2m21K4
3500b58K42J43k80K78j47k36O36n60L65J13m64R2K68j1l10J27j24J41RO3j79j33
3522b25m0L33n9K83m55R3J24j75K37j09J7j02o7L49k57n3k1n9lM12k14k33K53
3545B9k6P7n3j66J16O6j67N8M2J24q6K27k45J1J12Q8k71oK82k29Q5q2k36P2M19
$$ plain form
3570 241 2 -48 72 238 -74 -132 -21 50 -246 -78 -108 127 -136 -172 144 -382 -36 51 77 85 -337 34 -11
3593 -11 -154 -100 106 -80 -6 95 106 -30 52 211 69 -48 -175 7 177 -295 -32 5 81 -142 -17 -216
3615 -216 58 22 -71 -24 -175 -131 -26 -131 -119 -62 -41 169 -104 -209 43 -202 216 49 -94 130 0 63 24
3638 24 94 205 -73 22 -341 70 120 -264 72 -298 -166 107 228 85 152 -32 -229 130 205 10 1 -111 -239
3661 -239 -86 169 -170 126 -107 197 60 -200 -49 13 -39 148 35 -145 207 11 27 -260 -386 43 -204
3682 -204 -122 199 117 18 156 31 -63 47 467 -13 89 -205 94 5 281 -92 -52 83 66 3 148 37 -94
3705 -94 216 -23 0 -175 124 81 -90 -25 308 95 468 16 83 149 -31 -171 166 234 -140 229 -17 3 62
3728 62 121 -74 10 186 -25 -73 -230 -182 273 -322 -86 -106 176 173 -4 173 -304 66 -178 -134 -154 378 96
$$ packed form
3570B41k39n0J20J66l12n8J11P1k96J68l0K35k63l6L16n26L46Q7K6Qm22L71m5
3593a1j43N4K06j86P4J01J1j36Q2J59j42j17j27J82J70m72K63L7P6k23J25j99
3615b16K74l6r3M7j51M4J05j05J2N7K1K10k73j05K52k45M18j67j43K24j30O3l9
3638B4P0J11k78R5l63M11N0l84L36l70J32K73J21j43O7j84j97L59P5j95rj12j28
3661b39J53K55l39K96k33L04j37k60J51O2n2J87j13j80L52j96J6k87j26M29k47
3682b04Q2L21q2r9J38j25r4J10M20m80J02k94K99q9K76l73M0J35j7o3J45j11j31
3705i4L10k39K3j75K99m3j71O5L33k13L73m52O7O6j80j40L37O8l74L69k46K0N9
3728F2N9j95Q4J76k11m8j57M8M55n95K36k0K82lj77J77m77L70k44M4k0N32k82
$$ plain form
3751 96 19 205 188 -103 -46 -163 117 -13 -236 -10 -264 40 67 -39 -170 -175 -172 -169 -59 -47 -77 44 -40 -236 190
3776 190 24 4 -101 -138 122 199 101 219 141 74 79 -12 -35 -13 -76 -87 358 -135 -37 -21 -95 -31 104 -324 -90 -22
3802 -22 -146 213 291 -44 -168 -69 -81 -18 328 -19 38 72 1 -109 8 39 -84 92 -116 -155 28 27 -231 8
3826 8 -117 -201 23 -104 32 -121 169 295 -55 266 90 -105 151 235 79 136 72 263 -124 -414 -100 32
3848 32 11 211 -36 -14 -35 14 69 43 19 91 17 -166 -76 175 73 -82 -240 -195 156 131 -203 9 -21 5 178
3873 178 122 -19 -78 196 15 142 65 181 28 7 -122 -192 495 -130 86 217 -54 -234 116 19 155 -22
3895 -22 162 213 -113 86 -57 284 -37 397 -177 143 236 -276 13 -90 226 -36 62 266 84 315 123
3916 123 -34 378 -103 85 -167 166 -49 115 232 -179 197 42 -37 208 9 -189 -10 -32 -51 -82 -11 9
$$ packed form
3751I6p7J86j7k91N7j17K80j30k23K26k54L04K7j06j31nLLJ10J2l0J21q4j96M26
3776A90j66k0j05l7K60P7r8J18p8o7Nr1k3K2o3j1M45m93R8J6p4O4J35m28K34O8
3802b2j24L59P8l35j24R9j2O3L46l47N7L4p1j10J17L1j23J76k08l9J83jk58K39
3826Hj25q4K24j27J36j53K90J26l50L21j76j95K56Q4j56N7o4J91l87k90L14J32
3848C2k1K00k47K2k1M9N5k6k4P2p4j83R0K51j02j55j58M5L51k5l34K12l0K6J73
3873A78n6j41n9K74j81J27p7J16j53k1j29p0O87o25K16J31k71j80L50r7J36j77
3895b2J84N1l26J99j43L41l21M34n74L20R3n12K89j03L16k62R8K04j82K31j92
3916A23j57M12m81J88k52L33k15J64J17m11L76j55p9K45j99j98J79k2j9l1P1K0
$$ plain form
3938 9 -84 124 -85 119 -69 -258 86 169 301 -59 196 226 239 41 87 207 8 -201 -38 48 -7 106 147
3961 147 -145 30 141 -70 -305 -9 -49 -66 215 -164 -165 127 -102 30 98 -249 -227 -213 -158 275 48 -125 -49
3984 -49 210 167 101 -32 -239 -58 425 202 -43 113 -111 -102 -145 149 15 -199 -270 58 -5 262 -91 180 142
4007 142 -262 96 122 -61 14 -141 -135 157 40 97 -48 -162 40 252 -100 -273 -50 -164 -289 332 123 194
4029 194 27 170 -40 -100 110 63 212 66 -97 182 145 -198 -279 121 -137 -9 39 156 348 -253 -1 -30
4051 -30 -37 -356 332 140 -17 -37 -202 -10 12 219 -39 -121 11 -35 115 176 111 -194 138 -113 116 43 -57
4074 -57 -158 -80 7 187 446 -87 16 -76 21 78 -136 -307 -26 -337 32 112 204 221 -60 107 225 15 187
4097 187 -167 178 -97 -201 31 -6 -81 -154 -73 -141 123 -240 -125 217 51 122 -102 -19 80 -9 -80 -27 -405 -4
$$ packed form
3938Ir3K08k09K04j88j89L44Q3J32l60K55L0J3j98M6J20j99k09J63Q6n5J13M1
3961A47k92J75J11k11k35K96m0j7K81l79jK92k29J32O8l47K2J4N5M33k27j73P6
3984d9K59m3o6j33k07J81M83k23k45J56k24Rm3K94j34k14p1L28o3K67l53K71l8
4007A42m04L58K6j83P5j55OK92j17N7j45j14K02K12l52j73K23j14j25O21k09P1
4029A94j67J43k10o0K10m7J49j46j63K79l7l43q1M00k58J28M8J17J92o01K52k9
4051c0pl19O88j92j57k0j65J92K2K07k58q2J32m6J50O1o5l05L32k51K29p3j00
4074e7j01P8Q7J80K59n33J03r2R7N7k14j71K81l11L69Q0R2J7k81J67J18k10J72
4097A87l54L45k75j04K32l7p5p3Q1o8K64l63J15L42j66P1k24Q3R9q9p1N3l78M01
$$ plain form
4121 -4 -42 -110 -55 41 297 -74 235 402 70 -28 -221 -245 255 197 71 242 190 -243 -185 18 -111 -133 -235 369
4145 369 -134 88 -4 -2 408 272 179 -92 -7 -271 -148 197 -63 -90 44 23 -14 -33 -133 -40 -69 -205 111 182
4169 182 -41 92 -106 -42 24 -190 -34 197 120 -8 179 101 41 -142 7 8 -12 -76 66 23 -41 -66 -159 24
4193 24 58 -265 58 -1 -39 -207 -22 74 -48 -68 -191 103 -105 -65 -41 146 -28 -102 -98 -152 8 -22 -200 123
4217 123 52 36 -4 -46 -59 211 -45 74 35 279 -68 98 156 -81 300 68 -151 -431 -322 53 -82 -216
4239 -216 -60 -75 -58 133 -158 -35 -263 -142 -56 15 118 -141 30 -34 137 -90 -137 -44 242 -37 139 6
4261 6 -210 198 62 -39 15 69 -12 -249 -87 7 22 -176 -290 103 19 -155 -51 47 -301 102 70 -155 167
4284 167 170 135 -249 157 167 161 -96 304 17 235 -69 -132 -152 -66 125 -46 308 102 8 -51 -109 18 -40 -104 -183
$$ packed form
4121dl8o8N5R6K56l71L09J67l32r8j93k4N00n8j26J71n2m33N8K03j29k2j02O04
4145C69n03K22r2KM10j36r3k71Q5k64J23L45k60k7J34k1l7j9j00R3k9j36L16P1
4169A82k23J33j98O4O6k14J56K31p7j28J87p8o0j83J49Jk0o4J42m3o4k5r3J83
4193B4L4l23L23n9l8j68J85R6j22k0j23K94k08M0K4J87j74p4Mn4J60l0j78L23
4217A23p1j6m0m2j3K70k56J19l9K44l47J66N8k37L81k32k19k80J09L75j35j34
4239b16J56j5J7J91k91J23k28J21Q6P1J03k59J71o4J71k27m7R3K86k79J76j33
4261Fk16M08j36j01N4N4q1k37J62R4J5j98j14L93q4j74J04R8l48M03l2k25L22
4284A67Ll5l84M06J0ok57M00k87K18l04o3k0Q6J91j71L54k06r4n9n8J27n8o4p9
$$ plain form
4309 -183 15 321 -142 7 35 -173 -143 -38 121 22 -130 285 -116 198 126 -293 -303 161 -277 34 506 40
4331 40 69 33 -190 -31 131 -210 -205 -137 -165 98 59 -228 -154 -286 -184 -45 -40 109 111 -25 -144 -161 -131 -125 207 207
4357 207 -36 -126 13 52 0 -95 41 -94 -94 -92 275 160 42 71 -88 -74 -59 148 26 -42 -96 -45 94 -93 161
4382 161 -98 -47 172 -203 -60 32 89 -33 -210 -103 225 169 -61 110 0 175 1 87 242 112 -238 -348
4404 -348 72 -163 123 171 -279 -89 -29 -48 -173 101 167 282 162 -176 267 -32 -43 -24 83 -295 116 42
4426 42 196 -182 -12 5 38 -96 -271 -47 -172 47 113 -278 -35 -102 -88 81 -219 102 -128 0 137 -57
4448 -57 24 -103 -149 27 -240 -5 -11 -6 -162 -153 -69 7 85 136 -78 -164 -278 219 247 80 84 -89 -82 159 169 102 -51
4475 -51 -61 -85 -59 84 -220 -16 155 225 -194 -99 41 1 -17 35 118 184 14 69 -232 219 21 -230 -172 28
$$ packed form
4309a83J98L06m63J49K8k08L0J05J59r9j52M15m01L14p2m19j0M64m38L11M72m66
4331D0K9l6k23J59J62l41NO8k8K63l9k87P4j32J02J39NJ49Kj36j19j7L0OL32%
4357B07k43r0J39L9n2r5J36j35%KL67j15j18K9j59J4J5K07j22o8n4N1J39j87K54
4382A61k59N1K19l75J43R2N7j22j77J07L28n6k30J71j10J75j74Q6J55j30l50j10
4404c48M20k35K86M8m50J90O0j9j25K74O6J15j20l38M43k99j1J9J07l78M11p4
4426D2J54l78J70J7L3j34j75K24j25K19O6l91K43o7J4J69l00L21k30J28J37j94
4448e7Q1j27m6J76k67K35oNj56RQ4P6P8N1k14q6j14M97K8j67Mj73PK41J0o7j53
4475e1j0k4K6J43l04K04J71P0m19R5J40m0j8N2Q3O6j70N5l01M51j98k51N8K00
$$ plain form
4499 28 -146 121 82 154 184 102 110 -51 16 -234 -18 -95 128 66 -232 -49 81 -220 -147 190 -31 -113 -205 101
4523 101 214 131 52 170 4 -117 37 55 -136 10 89 1 127 -300 216 -49 -29 225 -63 -111 45 25 -33
4546 -33 -2 21 -61 178 -77 303 83 -218 -73 -138 -10 -123 -19 85 -46 -51 -89 -91 321 -6 153 -4 -98 -264
4570 -264 52 -103 97 271 -17 -123 -224 63 33 -188 -235 119 -153 183 -121 115 86 152 96 -172 -247 175
4592 175 218 185 3 -62 189 -217 174 360 -48 -57 -104 166 -120 -134 -127 -40 82 182 113 198 185 -2 -115 36
4616 36 -132 -43 -186 -197 -62 109 119 -118 -110 -130 -163 5 174 90 283 -128 -39 237 103 92 84 30 -247 -65 298
4641 298 170 -37 -204 276 71 -66 -80 -265 90 254 32 155 131 -52 128 -201 161 89 -210 69 36
4662 36 59 -294 -105 -221 -116 -105 92 43 -59 98 -227 -13 -78 16 212 23 -384 86 -78 -106 138 29
$$ packed form
4499B8j74K67l9P2L0q2Qj61O7k50K16p7K23o2k98J83J30l01P3L37k21q2r2L06
4523A01J13q3p9J18j66j21J54J8j91J46P9q8J26m27N16k65K0K54k88m8J56k0n8
4546c3L1K3q2K39k55L80k20l01J45o5J28j13J04J04j31nl8kM12l27J59j57r4j66
4570b64L16j55K00J74k88j06j01K87l0k21m7L54k72L36l04K36k9O6n6k68p5M22
4592A75M3l3j82o5K51m06L91J86m08rm7K70k86j4PQ7J22J00o9Q5j3j87j13J51
4616C6j68Q9j43j1J35J71J0k37Qk0l3J68J69q4J93m11Q9K76j34j1qn4k77J82L63
4641B98j28k07j67M80k05j37j4j85L55J64k22J23k4j83J80l29L62p2k99K79l3
4662C6K3l53J89j16J05J1J97m9j02J57l25K14o5R4J96j89m07M70j64k8K44j09
$$ plain form
4684 29 -178 63 -195 378 -11 -357 -136 -207 215 -490 -176 -101 266 -227 42 99 71 -57 -56 -226 69 -112
4706 -112 131 290 -41 -49 -61 20 218 -8 -58 -100 26 -201 251 -154 119 88 -117 172 148 12 -8 269 115
4729 115 -154 -28 17 307 -71 15 50 133 -15 142 172 -129 -110 76 -118 121 -48 201 -115 -86 160 296
4751 296 104 143 61 250 -133 -71 -218 9 233 -46 -106 136 -65 117 -42 -18 -104 -18 43 89 34 64 -41 -192
4775 -192 -7 -176 -88 -25 364 0 190 157 130 -67 -159 -257 -80 111 15 421 -115 204 154 -45 -305 83 112
4798 112 -183 -230 32 158 242 -72 16 101 121 210 254 -155 -124 -229 -25 403 212 8 149 -84 -48 -91 16
4821 16 -78 -87 -162 -135 205 208 111 3 35 -89 -30 -24 -27 197 43 18 19 -73 269 9 -149 0 -39 4 122 -241 122
4848 122 102 -32 45 76 -159 10 -245 130 -407 -247 179 -76 183 93 31 -69 1 89 33 -135 -42 90 -192
$$ packed form
4684B9k07K41k58N73l89l46K21p1M22p05L14P5L67m93K69N7k8j28Jj70K95j81
4706a12K43J59l31qj2Q1J98k26n0m2J26k27M52m05K73l1k05K89k4j36k0K77j54
4729A15k69J26M5K90l78Q6L5Q3j48J57L0l01J9J86j94K39j69K49l16K9K46J36
4751B96j92L9q2J89l83O2j47K27K24k79o0K42k01J82j59K4q6Q6O1M6n5L0j05j51
4775a92J85j69Q8O3L89l64J90l3k7j97r2r8J77J91r6M06n36L19n0j99k60L88K9
4798A12k95m7K62J26Q4l14Q8Q5K0Q9M4m09L1j05K04M28j91k04J41k33L6m3J07
4821A6r4rp5K7L40Lr7j08L2j24N9OlK24j54k5Jr2L42k60j58J49l9M3J18l63L63
4848A22k0j34P7L1k35J69k55L75n37J60M26k55K59r0o2j00P0Q8n6j68R3J32k82
$$ plain form
4871 -192 202 -203 28 -45 -257 158 -576 -342 -292 -153 46 11 -329 65 17 166 -78 -193 173 196 12 -458
4893 -458 -62 137 275 124 -62 -63 11 -161 -205 8 361 19 115 134 74 199 14 94 98 -164 109 29 5 100
4917 100 -49 129 -198 -265 -92 -29 -51 -3 -247 -91 128 106 51 51 -89 111 -49 -116 58 182 356 -51 289
4940 289 13 240 118 102 -139 -92 -95 -231 -63 -21 -172 -207 22 215 289 -140 146 339 13 85 -7 -5 5 41
4964 41 -87 243 -63 3 -12 -226 -61 -105 -325 -90 -132 38 -50 41 128 -64 -124 109 11 92 204 -191 76 -141
4988 -141 -179 -134 63 -56 -117 15 66 -56 -11 97 44 -182 -178 -118 135 -40 -11 54 82 -124 63 235 -232 -10
5012 -10 147 -302 -165 -85 52 107 -39 100 32 224 251 48 -216 -168 45 -37 -219 128 110 218 403 42 375
5035 375 5 33 292 -239 71 -28 -157 -312 -150 -37 -163 125 -1 206 152 280 -67 -145 10 66 95 -26
$$ packed form
4871a92L94m05K31p3k12M15p34K34N0J39J99l5l40L94m8J49k44j15L66K3j84m70
4893d58L96J99J38j51j86jP4j72m4K13L53l42R6J9o0J25j85Q0Mk62K73q0k4R5
4917A00j49J78l27o7J73O3k2M8k44J56K19k2n5%j40K00j60o7J74J24J74m07L40
4940B89k76K27j22j6k41M7lj36J68M2j51l5K29J93P4m29K86J93l26P2r2KJ0L6
4964D1j28L30l06O6j5k14J65m4k20K35m2J70q8R1Q7j92o0K33r8Q1J12l95K67k17
4988a41l8M5J97j19o1J32N1j22M5J08n3k26MO0K53j75K9O5K8k06J87J72m67K22
5012a0J57m49J37Q0J37N5j46J39o8J92K7k03k64M8K13q2j82L47j8J08J85l61L33
5035C75l70K8K59n31L10r9j29j55J62J13j26K88j26K07n4J28l47p8J55N6K9j21
$$ plain form
5057 -26 228 276 -157 -4 202 0 -76 -182 -329 40 -167 462 -160 -100 74 68 -224 167 -14 50 128 332 10
5080 10 10 -104 238 -149 -119 164 -150 99 -127 103 -75 183 190 -389 79 203 -26 19 -24 -268 106 -319 168
5103 168 127 18 248 -306 -79 77 -99 -35 -23 146 -47 -162 -129 -39 121 -94 65 -276 -101 -70 157 121
5125 121 -436 -70 119 -177 37 -288 169 147 72 -95 -399 71 19 77 -77 -52 57 -44 346 60 -124 10
5147 10 -194 196 -333 -190 -41 -222 323 -46 62 79 -2 -118 -54 205 -20 -7 -36 167 -11 -39 160 78 -281
5170 -281 7 -152 76 -14 -54 -104 -151 -212 77 -148 327 70 21 -84 -24 -27 -232 183 -165 -67 -3 -140 41 -135
5194 -135 151 -81 -41 161 23 227 21 -85 91 85 77 -30 -63 63 129 155 -144 -54 -56 -137 77 64 -10 -25 -364
5219 -364 -2 190 -163 -157 87 -236 -190 -79 182 115 96 376 176 196 131 -70 -78 -81 47 -145 -47 -48 -168 176 14
$$ packed form
5057b6K54M8m33J53K06k02p6j06j47L69k07O29o22O0J74ok92L91j81O4P8K04l22
5080A0%j14L42l87L0K83l14K49k26K30j78K58Pn79M68J24k29M5m3k44L74m25M87
5103A68m1j09K30n54K27J56j76O4J2J69j93j15L3R0J60k15J59l41J75L1K27l6
5125A21n57L66J89k96K14l25M57k2p5j67l04M70n2N8j54K5J09j01L90k86j84J34
5147A0k04L90n29J43J49j81N45l69J08J7q1j16O4K59k25J3k9K03j78k8J99q2l59
5170b81K88j59K28r0m0n0m7o1K89k25M75k57m9j05O0lk05M15l48R8O4j37J81j76
5194a35K86k32M0K02j38K04k06j06J76oqj07l3J26O6K6k99R0kq1K14j3p4j5l39
5219c64L62J92l53OK44l23M6J11K61o7j9K80k00K0o5k01qlJ28j92R8jj20L44j62
$$ plain form
5244 14 34 12 -9 273 83 233 168 -10 237 52 -94 106 49 21 162 255 115 -68 -17 -202 71 -72 89
5267 89 170 -263 -201 -74 -215 -84 -56 117 362 45 139 156 -115 -18 -25 18 480 -23 -124 126 121 134 126 -204 -149
5292 -149 63 100 -164 219 -17 23 261 -43 164 -88 -66 -164 -205 -201 27 23 -249 -120 -17 151 269 -47 49
5315 49 -45 -157 -9 -13 123 -43 -37 7 -21 -110 117 127 169 -32 62 -96 106 -149 7 -196 17 226 -7 93
5339 93 106 154 -112 -142 -243 35 -67 -152 -19 -68 -92 -119 -91 31 -176 -3 148 71 -111 134 -321 156 -111
5362 -111 -216 -357 -110 77 108 -361 -38 -198 -51 -370 31 -121 -91 144 -126 236 -68 -378 -72 -70 -174
5383 -174 184 -9 156 -32 139 -35 -37 238 -134 -298 22 -208 330 173 208 21 71 -185 -156 -119 84 -147
5405 -147 -107 232 -33 -9 -101 -87 194 -34 91 -104 -194 -129 40 -31 -49 -45 73 38 185 66 89 -47 98 -225
$$ packed form
5244A4K0k2k1K82j90J50o5j78K47j85j46K00n7k8J41R3j40j83N1j85K73j43J61
5267H9Q1m33O2J27j41J31K8J73K45l17R4J7k71R7pM3M62n03j01K50nJ3ql30N5
5292a49K12L7k64L83k36M0K38l04K07k52K2r8m1MK28mk72J29J03J68J18l16R6
5315D9r4j12J48mJ36j66OM4k8q9K27J0M2k01R4j58K02k55J56k03K13K09k33J00
5339I3J3M8k66l0j01K78j02q5J33m9k4k7K8J22k07J73J51p7j82K45m55M77k67
5362a11j05j41K47J87L1m69L23j60J47l19M01j52L0K35k70L62l04l10L06Kj04
5383a74L58j93J65j88J71j74kK75l72j64L20k30N38j57L5j87N0k56K9L7K03k31
5405a47M0L39k65K4r2J4K81k28J25j95r0O5J69p1j8MJ18l5J47j19K3j36J45l23
$$ plain form
5429 -225 260 -34 -27 55 -62 -237 69 59 -130 253 11 -10 24 -222 54 103 14 261 202 198 -100 51 -102 -37
5453 -37 207 -106 -114 -46 56 80 44 70 -45 -318 -242 -55 14 -223 59 138 189 -211 92 -114 35 35 54 321 104
5478 104 366 -369 76 -124 -139 150 136 136 -65 4 -169 304 69 43 73 -171 -19 -122 155 -236 140 209 86
5501 86 76 -43 74 -95 -51 -56 -142 94 57 -120 47 165 -18 13 -146 -357 52 -169 13 5 289 -39 -216
5524 -216 193 256 116 -181 5 29 121 -146 -166 57 -138 33 -45 17 60 -23 -136 208 50 -222 28 345 85
5547 85 -234 99 -194 93 -96 -75 224 27 223 107 -38 -107 49 170 -271 -195 73 38 -88 -82 134 91 -40
5570 -40 33 129 -186 -209 -58 -108 -368 27 44 -91 116 -55 47 174 -45 166 180 -78 104 135 -27 -39 291
5593 291 -73 118 -53 -129 520 -202 -84 283 -70 -167 -156 -131 276 -146 15 9 155 139 11 270 85 -201
$$ packed form
5429b25M85k94PQ2j17j75L06j0j89L83k42k1L4k46K76M9q9K47n9mk98J51j53O5
5453c7K44l13qO8J02K4l6K6j15k73P6J87O9k37K82P9N1m00L03k06J49%J9K67k17
5478A04K62p35M45k00j5K89j4%k01O9j73M73k35k6L0k44J52j03K77l91L76O9j23
5501H6j0j19J17j69M4nq6K36l7j77J67J18j83L1j59k11M09k21J82qK84l28j77
5524b16M09O3j40k97J86K4R2k67k0K23j95J71p8O2M3q3j13L44j58k72K50L17k60
5547H5l19L33k93K87j89K1K99j97J96j16j45o9J56J21m41P6K68l5j26OK16m3j31
5570d0P3R6l15k3J51n0k60L95J7j35K07j71J02J27k19K11J4k58J82L1j62j2L30
5593B91l64J91j71p6O49p22J18L67l53r7J1K5M07m22J61oJ46j6j28K59j85k86
$$ plain form
5615 -201 73 -8 245 -73 -163 130 335 -41 7 -226 -42 241 206 -39 -15 316 207 35 241 -16 65 22
5637 22 29 73 -56 -127 -210 -162 -101 -38 92 206 -22 -199 71 120 126 44 141 44 -164 -146 -294 -56 -312 -88 -246
5662 -246 -106 172 27 -244 -194 -9 180 -167 244 30 167 -23 145 294 -67 188 97 -64 -143 -142 123 52
5684 52 -226 -124 -106 -47 -122 -296 126 -65 83 -70 -76 58 195 17 311 -136 -196 64 -181 0 204 -129
5706 -129 27 -70 -52 -98 128 98 45 -99 53 -118 -67 59 -105 281 75 -3 -163 13 94 109 158 -4 105
5729 105 -133 204 38 21 -35 62 -281 136 -211 -128 250 25 114 -210 293 110 -22 -171 -122 99 252 -58
5751 -58 -98 20 484 76 -104 0 -16 -24 -202 76 101 124 56 41 54 201 40 -104 83 -15 7 -91 112 -151
5775 -151 130 146 176 120 -153 -196 34 106 -103 161 -44 -34 -129 -114 -110 166 -39 -8 22 106 -180 9 87 -162 -197
$$ packed form
5615b01K74q1K53l18r0K93K05l76M8k33J84K83l5k45K4L31j09j72K06k57Q1m3
5637B2PM4j29p1q3M8O1O3J30J14k28j77K70M9Oq2R7r7k08J8j48K38k56K24j58
5662b46J40K78j45k71N0J85J89l47M11k14J37j90J68J49l61K55r1j61p9JK65p1
5684E2k78J02J8N9p5j74M22j91J48j53oJ34J37j78K94m47o0K60k45J81K04l33
5706a29J56r7J8m6K26l0n3j44J52j71N1J26j64L86k06p8j60J76Q1J5M9j62J09
5729A05k38L37j66j7n6R7l43M17l47Q3L78k25Q9l24N03j83j32j49M9K21J53l10
5751e8m0J18M64m08j80J04j6qj78K78K5K3o8j5J3J47j61j44J87r8K2r8K03k63
5775a51K81J6L0n6k73m3K30P2k09K64k05J0r5J5MK76k05L1L0Q4k86J89P8k49l5
$$ plain form
5800 -197 262 139 -87 -28 39 -10 253 35 116 151 -101 10 125 162 197 -99 53 -181 74 16 21 158 94 233
5824 233 -56 82 -93 -54 -173 40 -118 60 -8 -47 -269 -167 16 113 268 -35 -26 -183 -83 -34 -68 151 63
5847 63 -95 -2 -26 70 -29 50 -17 -122 -26 -207 -229 71 310 175 -294 179 176 -271 -76 309 52 -189 97 43
5871 43 109 237 61 179 -10 157 -241 70 -247 -248 66 117 22 297 127 53 448 182 374 207 -98 308
5893 308 162 -69 49 -137 31 65 -159 -40 -66 -44 32 -10 -282 -22 131 168 107 0 59 -10 -286 62 35
5916 35 -84 62 -152 200 -31 -250 203 44 -225 137 191 -84 -27 -115 95 81 125 -102 -31 -13 52 108 51 -155
5940 -155 77 178 97 291 -3 -120 -24 111 184 -18 -159 -177 127 -77 -44 81 -99 -253 196 -179 -154 -141
5962 -141 277 97 -57 -157 183 -135 117 -163 -76 -118 207 -49 -84 -7 2 369 66 -127 183 142 -70 -179
$$ packed form
5800a97M59j23k26N9O7m9K63k18Q1L5k52J11J15L7L5k96J52k34K55n8NJ37o4J39
5824B33k89J38j75L9j19K13j58J78o8l9k22J02J83R7J55l03Rj57J00M9l4K19q8
5847F3j58R3k4R6r9P9o7j05R6j81k2L00K39j35m69M73lm47J95L85k57k41K86n4
5871D3O6J28j76J18j89J67l98L11l17jL14N1r5K75j70p4L95k66J92j67l05M06
5893C08j46k31J18j86J68L4k24J19k6K2P6m2k72K60J53L7o1j07N9o9k76L48k7
5916C5j19J46k14L52k31k19M53j59k69L62N4k75N7q8K10j4M4k27P1J8O5N6n7k06
5940a55K32J01q1J94k94j17R6J35P3k02j41j8L04k04L3J25j80j54M49l75K5J3
5962a41M18j80j54j00L40l18K52k80Q7m2L25k56l5P7RL67l03j93L10m1k12j09
$$ plain form
5984 -179 -197 214 -5 -63 19 -82 30 -31 -165 -120 -173 -88 230 -276 234 -80 73 -49 161 153 331 -51 -217
6007 -217 39 183 140 -22 -61 -193 -202 137 -189 96 -231 -24 134 -207 191 330 124 -22 -61 -161 35 -168
6029 -168 184 -186 -221 -95 -203 204 -366 144 -25 -148 -319 -84 -169 -121 -107 -7 -4 -42 -151 66 162 -29 -8
6052 -8 -101 47 -84 138 153 41 37 -22 -266 24 -287 22 -60 48 -366 77 227 -427 156 -66 146 0 30
6075 30 -354 86 241 56 -59 126 -37 64 52 155 -108 -52 9 82 206 -14 -298 -197 50 -28 -97 -103 -227
6098 -227 -128 104 156 -130 -66 -42 -327 1 -13 0 206 -275 -87 -102 -243 39 26 -26 -54 251 17 -102 118
6121 118 -19 6 -120 29 33 14 158 163 217 -96 203 -178 41 51 -114 42 -3 35 167 19 396 -172 -153 -173
6145 -173 57 223 -47 -174 -56 -180 -100 -53 -1 80 23 198 157 -42 136 -19 183 81 -215 -140 -125 112 131
$$ packed form
5984a79j8M11k19n8Q2j01J12o1j34M5n3Q5L18n06N10l14J53j22K10qJ78l82j66
6007b17K56J44m3j62l9j32rL39l26K85l27K07J58l41L98J39k06j46l9j00J96k03
6029a68L52l70l5J26j08M07n70N10j69j23j71K35q5M8J4J00Ll8j09K17R6j91K1
6052hr3J48j31K22J5j12mn9k44K90l11L09q2J08m14M43J50o54N83k22K12j46L0
6075C0l84M40J55j85j15J85j63J01j2J03k63N6O1P3J24k20k84J01K47p8o9oj24
6098b27R9K32N2k86O4K4k85L28j4J3K06m81J88j5j41K82j3n2k8L05k34j19K20
6121A18j37K5j26J49Mj9J44NN4l13K99l81K19J0j65J56m5L8J32j48L77n68J9k0
6145a73K30J66k70j27J18j24Q0M7N2Q1n7J75m1j99J78j55K02j02k96P5J5K37J9
$$ plain form
6168 131 74 -177 99 201 -96 181 150 -205 -157 -128 97 108 55 38 -337 -90 64 -75 51 -3 -102 -94 -90 -253
6192 -253 -179 -101 110 -93 -136 -246 -57 -257 -44 -13 37 271 266 72 -37 212 -163 -12 273 139 -324 43
6214 43 271 -189 -209 -155 -169 288 -219 -122 133 -231 74 -135 -165 -84 -122 53 -24 171 178 -41 7 -72 69 112 -35
6239 -35 -77 -20 -28 124 -373 -12 266 -54 -323 291 -12 46 350 162 161 246 -141 89 17 62 -72 -229 113 -81
6263 -81 -145 -83 -330 67 -64 23 37 -87 104 204 113 362 104 -67 184 -170 -136 -65 287 157 352 78 -188
6286 -188 51 -66 72 168 -67 151 125 79 -28 242 96 91 114 -103 -217 -44 -46 170 109 16 -18 -212 -260 -21
6310 -21 -224 98 -70 379 -226 -53 -162 -154 5 208 -225 63 193 -384 146 76 -40 -75 -281 108 -380 -164
6332 -164 59 -132 -143 32 82 274 -71 247 -166 105 82 -212 232 -228 -53 56 135 59 -97 -116 -139 42
$$ packed form
6168A31n7k51K76J02k97K77l1l55M8K9K25J1n3j7l75K47J54j39J26n4r9QMj63
6192b53P4P8K11k03m3j10J89k00K13L1N0K34nj94j09K49l75J51K85j34m63L67
6214D3K28m60k0N4j4M57n07R7K55l64L05k09l0Q1l8J75p7J95Pk19M8p9J41M3j47
6239c5m2N7qJ52m97L61K78l20k69O14l03N8L04j88jQ5l87K30p2M5j34j57L42j94
6263h1o4O2k47L97j31Q7J4j24J91J00r1K49k58j71K51l54L4P1L52j30J95k74k66
6286a88K39j17J38R6k35K18k6m6j07K70j46nK3k17j14J73kK16o1r3l4j94m8K39
6310b1k03L22j68M49o05J73j09QJ59K03m33K88J30n77N30p0j16l5k06L89m88K16
6332a64K23j91j1J75N0J92l45L18m13K71k3k94M44m60J75J09P9p6j56j9k3J81
$$ plain form
6354 42 36 -275 -167 -161 -55 52 -27 125 245 32 118 -3 -352 -147 234 314 83 294 74 106 62 -83 -251
6377 -251 161 187 -109 -164 26 -44 -55 131 -194 -58 157 -148 -340 -40 -87 -273 149 53 -48 153 -55 -263
6399 -263 335 49 -169 190 165 63 -446 -74 141 -134 120 74 -247 -156 132 180 -173 -120 -101 -31 -146 71
6421 71 18 -304 -126 -22 94 -166 174 87 29 60 -67 -66 172 -83 21 -233 -172 11 -15 56 -113 -295 9
6444 9 206 249 37 128 142 8 -476 41 -168 -102 33 123 -198 12 100 116 -116 268 14 -98 267 164 274
6467 274 55 -40 46 -181 -24 -253 -109 -94 143 360 -139 212 377 -39 126 146 19 64 96 72 219 -136
6489 -136 227 206 340 74 65 7 -34 83 -110 -216 26 67 -160 -137 42 -46 148 -291 -188 83 -118 -126 82
6512 82 212 -30 171 -86 3 -56 159 94 33 -41 47 -320 140 53 -20 -201 230 126 -8 -41 -276 -160 78
$$ packed form
6354D2ol11J08OJ06J07p9J52J20k13Q6j21l49K05L81Q0k31K11k20L2m4j45j68
6377b51M12K6k96n5J90p0j1J86l25J36K15l05j92L00m7j86M22r6j01K01k08k08
6399b63N98k86k18L59k5j02n09L72K15k75K54m6l21R1K88M8l53N3J9P0j15K17
6421G1n3l22J78J04J16k60L40q7n8L1j27JK38k55J04k54O1J83k6P1j69j82L04
6444IJ97M3k12R1J4j34m84N17k09O6J35R0l21K10Q8J6k32L84k54j12L65j03J10
6467B74k19r5Q6k27J57k29J44J5K37K17m99L51J65m16J65K0j27M5L2k4J47l55
6489a36L63k1J34k66rn8m1J17j93j06K42M1k27K3J79q8J94m39J03K71k01qK08
6512H2J30k42K01k57Q9n9K15o5o1p4Q8l67M60q7p3j81M31j04j34l3k35J16K38
$$ plain form
6535 78 179 -185 185 168 45 120 -155 -278 18 8 78 39 -128 -86 4 -266 -99 -258 -2 39 109 70 296 61
6559 61 -17 -105 75 97 183 162 202 168 -13 55 125 77 141 552 46 -12 -222 -345 37 -90 -97 19 128 78 -138
6584 -138 162 -201 223 33 -75 -180 -135 -202 445 -24 -89 -132 -124 -128 45 214 264 -31 -88 -22 -95 -76 265 -2
6608 -2 -66 -341 -35 -139 381 122 -202 16 -433 7 22 -283 87 72 -26 90 44 379 101 266 -86 134
6630 134 238 262 -121 122 -167 105 154 -111 -185 121 -141 42 114 -74 55 -29 54 130 155 -154 224 123 103
6653 103 118 160 -52 -17 177 -91 509 59 -86 137 -104 -82 57 127 8 -61 -18 -123 -250 78 -59 -178
6675 -178 -211 -45 -158 163 217 76 -137 7 9 -88 222 468 55 -129 102 145 83 124 -91 -200 -204 85 135 -123
6699 -123 -88 -247 37 27 -2 1 12 -47 -91 30 74 -75 -29 42 -28 232 128 38 -107 -351 151 -34 -13 -90 -10
$$ packed form
6535G8J01l64L70j7j23P5k75j23K96j0P0l9j67M2R0k70J67j59K56M1P0l9K26k35
6559F1p8q8J80K2Q6k1M0l4j81O8P0m8O4M11n06n8k10j23L82j27pJ16J09n0k16
6584a38L00l63M24j90j08j05M5o7O47m69o5m3QmJ73J69N0k95n7O6p3J9L41k67
6608bo4k75L06j04N20k59l24K18m49M40J5l05L70j5r8J16m6L35k78J65l52K20
6630A34J04K4l83K43k89K72M9k65p4L06k62J83P2j88J29q4Q3P6K5l09L78j01k0
6653A03J5M2k12L5J94k68O00m50j45K23k41K2J39P0j19o9M3j05j27L28j37j19
6675a78l3J66j13L21N4j41k13J44Kr7L10K46m13j84K31M3o2M1k15j09mK89N0k58
6699a23L5j59K84j0k9LJ1n9m4J21M4j49M6P1p0K60j04r0j45k44N02j85K1p7Q0
$$ plain form
6724 -10 112 -7 -255 54 137 20 -2 143 -53 -21 55 -143 148 278 -107 63 -102 17 -161 177 13 -273
6746 -273 -224 335 -130 -15 36 -35 -225 285 -163 -145 5 -226 207 34 93 -17 -105 25 -145 199 -71 85
6768 85 38 202 154 10 -75 68 -44 -142 -83 18 -129 181 -275 -77 55 -9 42 166 28 39 357 -44 -6
6791 -6 259 -169 161 -40 -97 275 86 21 -114 -181 -138 134 -156 -33 28 2 -113 -4 -199 291 151 163 82
6814 82 -125 -14 -82 120 -181 -118 -221 218 -111 -140 159 -162 110 -213 -302 -15 285 122 -189 -19 -76 -136
6836 -136 -6 -118 -105 43 -45 127 -31 -71 -229 221 96 -188 -99 -55 44 108 -238 -26 -5 -28 -29 -31 108 28 201
6861 201 65 108 -117 172 295 -59 236 78 34 -53 -273 -141 250 -26 -88 55 -9 2 23 -107 -83 -190 -160
6884 -160 63 -66 5 146 126 -18 324 -59 -20 -150 -154 53 -94 -44 74 45 -224 -250 183 46 85 31 219
$$ packed form
6724a0J22j19k48L09Q3j17k2J45j96L2P6j98K91J30l85J70j65J19j78L38j64k86
6746b73M9N59m65J15N1p1j90N10m48J8J50k31M33j73N9j10q8J30j70L44k70J56
6768H5m7J64m8j44q5J43j12r8N9J01j47L10m56J98J32o4N1J24j38J1L18m01L8
6791fK65m28L30k01n7L72j89o5j35o7M3K72k90J23O1k6j15J09j95M90j40J2q1
6814H2k07J11o8K02l01O3j03M39l29k9K99l21K72l23q9K87L00j63l11J70n7o0
6836a36J30j12J3J48q8J72j58m0j58M50j25k84Q9M4R9O4l46K12K1k3jkJ39q0J73
6861B01j36M3k25K89J23l54K95j58m4q7k20J32L91k76o2J43o4J1K1j30K4j07L0
6884a60K23j29P1J41k0j44L42l83L9j30mK07j47N0J18k9k69k6M33j37L9n4J88
$$ plain form
6907 219 -110 9 -183 -105 21 81 4 -134 -298 190 -242 60 -294 -118 33 -42 227 53 207 -2 344
6928 344 86 72 -188 -119 101 -220 -98 -102 25 39 215 231 -162 323 -58 -135 135 49 -198 -212 -74 203 -82
6951 -82 0 39 87 -19 61 111 -190 -352 97 -15 -14 1 267 -3 -238 123 -109 157 -49 56 128 27 -58 -189
6975 -189 -54 -232 -23 141 -43 -202 0 -76 -72 -159 -52 -93 89 203 222 -171 224 136 87 112 -82 218 249
6998 249 -121 38 -41 -250 -48 150 24 459 40 21 183 -9 -42 246 23 -225 202 77 -255 -99 -232
7019 -232 -45 59 88 -282 128 -389 -58 335 -84 -86 138 207 -67 -238 48 -144 -110 130 -259 93 -142 -48
7041 -48 100 116 -53 0 -244 7 291 91 -206 -174 49 -402 61 -164 -109 -252 -92 130 -274 -129 54 54
7063 54 -82 -72 -478 210 235 15 172 405 81 38 147 -81 144 99 92 -39 -296 55 36 74 173 20 28 284
$$ packed form
6907B19l29J19j92P8J26O0p7j38j64M88m32L02l54J76J51p5K69j74J54k09L46
6928C44k58j4k60O9K20l21J22mJ27J4J76J6l93M85l81p7K70q6k47j4J38K77k85
6951h2Q2L9M8j06Q0N0l01j62M49j12JJ5K66k70k35L61k32K66k06J05P2j01q5j31
6975a89J35j78K09J64j84j59K02p6Mq7J07m1J82J14J9l93L95q8m9K5j94L00L1
6998B49l70J59p9k09K02J98j26M35m19j9J62j92l3K88k23k48M27j25l32J56j33
7019b32J87J04K9l70M10n17L31L93m19kK24O9k74j71K86j92L4K40l89L52k35R4
7041d8J48J6j69N3k44K51K84k00k97L2K23m51M63k25N5j43J60K22m04J45J83%
7063E4j36J0m06O88K5k20J57K33l24m3J09k28K25m5pj31k57L51j9L8R9j53QK56
$$ plain form
7087 284 -25 -166 164 19 250 -34 -150 -50 -141 32 95 63 -52 330 -157 -35 144 213 76 -146 258
7108 258 59 117 -106 57 16 62 -195 347 143 41 -220 193 49 -53 2 -158 127 128 330 46 -51 -315
7130 -315 307 165 -96 -56 -301 70 -133 80 84 282 7 -100 -211 -54 -77 17 -111 -9 -140 31 195 34
7152 34 272 -69 -47 -7 182 57 -87 50 135 -202 332 -56 -21 -123 75 -196 302 152 -150 223 102 26
7174 26 4 189 -214 71 69 93 79 -199 111 -128 77 210 121 104 268 206 -56 63 -17 -208 -75 283 -281
7197 -281 -274 9 -61 96 146 2 154 15 -123 -35 295 -240 -91 124 206 -225 61 -89 62 -298 13 -374
7219 -374 46 40 -44 -47 -77 108 -18 -132 -26 452 -181 88 -117 -149 129 -200 61 -162 123 23 170 33
7241 33 304 86 6 20 9 281 149 -72 -1 40 120 -153 -38 138 -179 69 -142 -32 161 38 266 -284
$$ packed form
7087B84l09j41L30j45K31k84j16J00r1J73O3l2j15L82m87J22J79O9j37k22M04
7108B58j99N8k23J63m1M6k57N42k04j02k61M13j44j02N5j60K85JK02k84r7k64
7130c15O22j42k61M0k45L71k03K13MJ98k75j07j11J57k3R4j28J02j31J71J64j61
7152C4K38l41K2M0J89j25j44J37Q5l37N34l88L5j02J98k71M98j50l02L73j21p6
7174B6k2J85m03K85kK4j4k78L10k39K05J33q9j7J64o2k62J19q0j91J33L58n64
7197b81PK83p0J57N0j44J52j39j38Q8L30n35J49K15Q2m31K86j50J51l60L11l87
7219c74M20oq4ll0J85j26j14J06M78o33K69k05l2K78l29K61k23K85j00J47j37
7241C3K71k18q0J4j1K72j32k21P1M1Q0k73J15J76l17K48k11J10J93j23K28n50
$$ plain form
7263 -284 -193 91 -174 -179 -288 -16 -178 155 227 -119 76 180 -141 -6 -12 -26 226 111 -26 -130 194 311
7285 311 16 106 42 348 64 -79 188 -49 -17 46 0 93 143 -38 136 -91 175 115 173 -39 -51 -51 -241 -210
7309 -210 -38 54 134 91 203 83 133 8 120 104 -224 13 91 -96 -40 53 -80 -48 -263 -294 6 92 -249 162
7333 162 166 150 -276 67 -120 138 -242 -70 125 41 75 184 95 3 164 -49 -81 -18 13 104 -169 -48 24 -20
7357 -20 -24 197 315 -83 234 -67 -177 -226 73 32 170 -36 -140 -86 -107 172 93 -10 81 75 86 10 -123 -265
7381 -265 -2 -126 -58 -152 -58 -215 -224 7 -221 -7 -225 115 215 139 -71 -126 -191 110 23 94 1 -46 239 143
7405 143 63 -154 -328 31 51 -30 219 -4 17 -23 197 70 -174 172 382 -108 -102 188 233 -4 -117 -38 -28
7428 -28 169 25 -39 -200 85 -36 -1 -33 53 -117 -97 -18 82 -67 -106 -83 318 13 -135 -13 -41 -80 -30 278
$$ packed form
7263b84R1K84k65nj09K72j62L33P2l46J95J04l21J35oj4K52j15j37j04L24J17
7285C11k95R0o4L06k84j43K67k37L2O3m6R3N0j81J74k27K66o0N8k12j2%j90L1
7309b10J72R2Q0m3J12j20N0j25J12j6l28K37P8j87N6R3j33L2k15l1L00Q6l41M11
7333A62Mj6m26L43j87K58l80J72J95q4L4J09q9r2J61k13l2O3L1R1k73J21P2m4
7357b0mK21J18l98L17l01j10m9K99m1J38k06j04N4k1K79p9j03R1oJ1p6j33j42
7381b65K63j24O8r4R4j57rK31k28K14k18L40J00p6k10n5o5L01q7P1r3m7K85r6
7405A43q0k17j74L59K0q1K49k23K1m0K20j27k44L46K10m90OK90M5k37j13P9J0
7428b8J97j44o4j61K85j21L5l2Q6j70K0P9J00j49l9K3M01l05j48J22k8l9N0L08
$$ plain form
7452 278 129 -183 204 -89 -1 -25 -15 -278 53 26 -210 127 -9 132 -15 130 -69 69 92 -83 -134 2
7474 2 51 174 16 140 87 98 36 261 113 152 -49 292 3 77 -11 182 -32 6 -42 201 122 -191 -52 64
7498 64 70 -70 106 -184 -22 224 -212 -139 -93 -94 84 3 -59 -196 152 -132 196 -193 -264 -163 -333 -128 5
7521 5 -257 160 -158 -299 -231 -191 -89 347 -138 -467 -65 371 44 -242 0 106 127 -224 -8 66 153 -119
7543 -119 135 94 -90 -73 166 71 -135 -52 257 -133 -21 66 176 -395 -483 -38 -243 56 124 66 -136 79 89
7566 89 205 76 104 -319 -40 -9 535 33 73 23 37 92 4 -31 181 111 -25 368 -3 131 -23 -192 184
7589 184 63 -82 253 104 7 -67 32 -104 149 -136 100 206 110 -42 -338 -73 -51 92 150 121 -72 -235
7611 -235 213 88 237 48 140 -89 -132 108 9 -99 104 -53 -295 -6 -162 56 -331 -68 101 -129 251
$$ packed form
7452B78j49l12L87k93Q8k4J0k63L31k7k36L37j36J41j47J45j99J38K3j75n1J36
7474BM9J23j58J24n3J1o2K25j48L9k01L41k89P4q8J93k14L8m8K43p9l13J39J16
7498F4Oj40J76k90J62K46m36P3M6jJ78q1o2j37L48k84L28l89p1J01j70K05J33
7521Ek62M17l18j41O8M0J02M36m85l29M02M36l27k86K42J06K1l51K16P4Q7k72
7543a19K54m1j84J7K39r5k06Q3L09l90J12Q7J10n71q8M45k05K99O8n8k02K15J0
7566H9J16j29K8m23K79L1N44n02M0n0J4N5q8l5K12p0j36L93l71J34j54j69L76
7589A84j21j45L35j49r7p4R9j36K53k85K36J06r6j52k96K65K2J43N8k9j93j63
7611b35M48j25J49j89R2k29m3K40r9j08K03j57k42K89j56K18l87K63J69k30L80
$$ plain form
7632 251 -53 -318 -169 171 -230 43 324 6 36 0 10 171 37 -122 177 -200 -69 257 29 -94 246
7653 246 -23 -91 -123 -228 -26 153 67 229 253 66 -26 -182 -65 -391 193 228 -128 -214 -137 -232 156 22 -187
7676 -187 -77 -38 -55 -247 -174 7 -140 35 -253 -55 48 -315 295 -133 231 45 211 443 -185 47 144
7697 144 86 -314 -4 10 -168 -174 -229 16 -172 234 -17 -139 -174 128 156 -167 4 81 105 -347 111 12 193
7720 193 -118 -41 37 43 29 -99 93 139 -87 -246 110 -301 -53 90 86 -74 46 -91 231 -99 2 110 120
7743 120 42 88 -2 96 -41 175 216 208 -69 -163 187 -102 10 -161 285 -102 -213 80 -19 110 46 73 246 66
7767 66 -242 23 -200 19 88 -428 -197 41 201 -6 59 76 123 185 46 -273 -259 -106 -108 237 206 10 -180
7790 -180 -16 -151 -86 70 107 -192 -21 27 61 44 119 -121 -41 -288 83 -5 -167 16 80 -247 -129 226 318
$$ packed form
7632B51l04k65J49L40m01K73K81l18L0l6J0J61j34j59K99l77J31L26k28j23L40
7653B46k69o8l2j05K02J79q6J62K4j87r2j56J17l26N84L5l56q6P7r5L88j34k09
7676a87J10L9j7j92P3J81j47J75k88J98J03l63O10m28L64j86J66K32o28K32R7
7697A44n8m00L10J4j78on5K45j88M06k51j22l5L02K8l23J71P7K4m52M58r9J81
7720A93l11P7P8Oj4j28J92M6k26j59L56m11K48J43mj60J20j37L22l30J01J08J0
7743A20p8M6r0R8j37K16M1qk77r4L50k89J12j71M46l87j11K93r9J29o4K7J73j80
7767F6l08K65k23K19O9n16K31K38J60k07O5J7M7O2j39l19J4J53kL45l1j96j90
7790a80J64j35O5J56L7k99J71M8L4j7P5k40Q0k47L71q8j62J83O4l27J18L55R2
$$ plain form
7813 318 46 -262 189 -139 127 -291 -30 166 -24 -5 43 -229 -161 -148 -229 140 -94 -124 -204 -168 164 -57 118
7836 118 -256 -322 149 -95 169 -129 -18 -27 -14 -193 18 146 158 -139 134 18 -61 6 123 85 -242 -32 -85
7859 -85 39 -65 193 -70 -109 152 -132 4 -218 -83 -103 9 -12 -84 41 -24 1 209 138 70 -103 -34 99
7882 99 86 40 -271 -265 134 -81 -55 -77 -279 -112 107 -145 76 -134 37 -33 -281 -11 12 157 100 -32 -74 243
7906 243 -29 197 206 171 -136 42 112 -26 -361 -85 -22 -140 12 -30 0 82 -87 85 -192 21 -19 -11 170 -186
7930 -186 -400 -54 -31 72 -52 121 -225 126 113 -109 -63 -36 140 -64 -110 256 -255 -76 146 -164 115 -202
7952 -202 -173 -46 123 159 -44 -228 101 -215 2 18 138 -242 124 14 -60 -184 28 32 303 381 50 277
7974 277 -186 197 110 70 64 110 59 -210 74 -120 -274 -73 -130 170 -67 -58 147 60 -12 103 48 -24 109 6
$$ packed form
7813C18k72l08M51l28K66m18K61J96j90J9M8k72O8J3q1L69k34l0q0L6L32k21J75
7836A18l74o6M71k44K64k98J11rJ3j79K11J28J2k97K73j16p9O7J17l8l27K10n3
7859h5J24j04K58k63l9K61k84J36k22J35k0J12k1p2J25o5K5K08p1o8j73O9J33
7882I9j3m6l11OL99k15K6k2k02J67K19k52K21k10J71p0k48K70K3J45n7j32m2L17
7906B43k72K26Rl5l07J78P0j38l35K76O3j18J52m2L0Q2j69J72k77K13m0QJ81l56
7930a86k14L46K3J03j24J73l46L51j3k22M6K7J76k04m6L66n11J79K22l10K79l17
7952b02K9J27J69L6k03j84L29l16K17J6J20l80L66j10p4j24K12MK71P8l31K27
7974B77m63L83q7m0oM6n1k69K84j94j54K01n7L00k37RK05q7p2J15n5p2J33j03
$$ plain form
7998 6 -262 15 -130 -81 -110 -243 -133 -316 -265 -1 -142 143 68 19 86 156 -135 124 64 296 22 334 12
8021 12 -350 261 70 41 71 85 64 98 -211 139 70 192 113 143 18 121 66 187 20 170 27 -3 151 -185
8045 -185 0 -69 122 -296 81 -121 104 76 -56 -214 108 -13 233 -76 -149 62 78 291 242 -126 -84 148
8067 148 200 27 -192 -31 -246 102 126 88 -85 -6 120 113 197 146 -234 -165 -187 78 3 83 -174 -97 102 -107
8091 -107 195 89 -161 -285 -60 -51 -8 -53 -50 -68 -10 -141 35 -49 -40 121 -106 -365 -133 118 -42 140 -167 -31
8115 -31 149 236 53 122 -2 -108 86 386 115 4 33 -71 324 -2 137 116 -101 276 -4 36 37 -204 -172
8138 -172 79 -104 -7 54 -44 -6 -276 85 -268 -51 -250 26 68 115 -459 -17 192 -13 -231 -106 -14 150
8160 150 317 -228 210 190 81 -312 -45 247 70 37 123 123 31 -79 -110 -179 8 75 9 -94 136 10 99 180
$$ packed form
7998Fk68K77j45M9k9j33J10j83N1K64j41K85p5m9O7P0k91K59o0K32k74L12l22
8021A2l62O11j91k9L0J4k1L4l09L50o9J22p9L0j25J03n5J21j67J50j43l0J54l36
8045a85J85o9J91m18L77k02K25k8j32j58L22j21K46l09p3K11J6K13m9l68M2K32
8067A48N2j73k19J61k15L48K4l8j73P9J26pQ4n1l80O9k2K65p5Q0k57P7J99k09
8091a07L02j06k50j24K25RM3m5Lj8N8j31J76q4RJ61k27k59K32K51j60J82l07J36
8115c1J80Q7j83O9j24j06J94L00k71j11K9j04L95l26J39k1k17L77k80M0Jk41L2
8138a72K51j83R7O1r8L8k70L61l53K17j99K76M2M7n74M42K09k05k18J25R2J64
8160A50J67n45M38k0j09l93K67K92j77l3Q6%r2j10l1o9J87O7o6j03K30j26Q9Q1
$$ plain form
8184 180 121 148 66 -142 66 -132 6
$$ packed form
8184A80n9K7q2k08K08j98J38
8191F
$$ Imaginary data points
##PAGE= N=2
##DATA TABLE= (X++(I..I)), XYDATA
$$ plain form
0 0 0 0 0 0 0 0 0 0 0 -6 8 -8 8 -8 16 -16 17 -24 24 -32 38 -41 48 -56 65 -76 86 -97 110 -124 140 -158 176
33 176 -197 221 -245 273 -304 337 -372 413 -459 506 -561 622 -689 767 -853 953 -1071 1208
51 1208 -1377 1582 -1841 2181 -2651 3343 -4467 6611 -12200 58796 125999 29911 -14382 10641
65 10641 90025 106229 56949 -2668 7085 56779 85592 54999 14772 8120 36061 47957 33765
78 33765 17126 21412 26002 13374 -4415 4521 29321 29635 -9153 -41451 -23984 25074 36952
91 36952 -12033 -66209 -55962 6068 40071 -2073 -69430 -78649 -19108 32161 9585 -56215
103 -56215 -81658 -38214 14867 12143 -35371 -64581 -42711 -4599 3442 -18710 -36299 -29755 -14439
116 -14439 -11000 -14985 -11132 -3054 -8145 -23919 -24080 1683 25291 11405 -27012 -37595 -139
$$ packed form
0@%%%%%%%%%oJ4j6J6j6K4l2L3m1M8n6P0p9Q9j04J21j41J62j83K07k34K64k98L34
33A76l73M18m66N18n77O41p09P85q72R65j067J183j311J456j620J806k024K279
51A208k585K959l423M022m832N994p810J1078j8811P0996O7203r6088m4293K5023
65A0641P9384J6204m9280n9617R753M9694K8813l0593m0227o652K7941J1896j4192
78C3765j6639M286M590j2628j7789Q936K4800L14l8788l2298J7467M9058J1878
91C6952m8985n4176J0247O2030L4003m2144o7357r219N9541N1269k2576o5800
103e6215k5443M3444N3081k724m7514k9210K1870L8112Q041k2152j7589O544J5316
116a4439L439l985L853Q078n091j5774j61K5763K3608j3886l8417j0583L7456
$$ plain form
129 -139 42083 33471 -16930 -45415 -13779 40038 48886 1259 -42611 -28492 24167 48976 17110
142 17110 -29346 -33195 4712 32953 19598 -12337 -24539 -9058 8596 9334 -1719 -8922 -10151
155 -10151 -11920 -11495 -3710 6090 1012 -19553 -32152 -16926 12429 17767 -12066 -42484 -32897 7682
169 7682 29712 4708 -36750 -41800 -3844 30829 20865 -18602 -37748 -13772 21558 27842 1966
182 1966 -21247 -14949 8752 22707 14922 1356 -3729 896 8056 14781 19468 15316 2606 -6143
196 -6143 3801 25071 32597 13531 -12433 -12704 16461 40050 27201 -9262 -24810 -27 34082
209 34082 34699 8 -26891 -15402 17204 29891 8850 -18957 -21391 -831 15125 9518 -6712
222 -6712 -15831 -11787 -4215 -109 1160 -1279 -9928 -18792 -15579 634 13134 3045 -21151 -29607
$$ packed form
129a39M2222q612n0401k8485L1636N3817Q848m7627m3870J4119N2659K4809l1866
142A7110m6456l849L7907K8241j3355l1935j2202J5481J7654P38j1053p203j229
155a0151j769M25P785R800n078k0565j2599J5226K9355N338k9833l0418R587M0579
169G682K2030k5004m1458n050L7956L4673r964l9467j9146K3976L5330O284k5876
182A966k3213O298K3701J3955p785j3566n085M625P160O725M687m152j2710q749
196f143R944K1270P526j9066k5964k71K9165K3589j2849l6463j5548K4783L4109
209C4082O17l4691k6899J1489L2606J2687k1041k7807k434K0560J5956n607j6230
222f712r119M044P572M106J269k439q649q864L213J6213J2500j0089k4196q456
$$ plain form
236 -29607 -7128 21281 20351 -11030 -33670 -17190 19863 32951 6018 -25800 -22402 11952 35354
249 35354 20673 -10018 -17458 4883 28352 25751 6151 -4301 4038 16609 19058 14849 12333
262 12333 11803 7847 5189 11246 23238 24474 6921 -9598 -2852 23404 35315 13260 -18863
275 -18863 -20707 11875 37736 20883 -18901 -33601 -5629 28307 23910 -13404 -37063 -20555
287 -20555 12319 18071 -7874 -31480 -25884 -3653 4625 -8381 -21856 -20315 -11994 -11411 -16182 -14260
301 -14260 -7502 -9043 -22095 -28263 -14129 5899 3668 -21438 -37751 -19805 13400 19803 -11190
314 -11190 -39974 -27435 12740 30546 3812 -31804 -30312 6721 32419 16291 -17857 -25714
326 -25714 197 25600 20022 -3496 -13877 -448 15297 13834 2379 -461 6383 7899 806
$$ packed form
236b9607K2479K8409r30l1381k2640J6480L7053J3088k6933l1818L398L4354K3402
249C5354j4681l0691p440K2341K3469k601j9600j0452Q339J2571K449m209k516
262A2333n30l956k658O057J1992J236j7553j6519O746K6256J1911k2055l2123
275a8863j844L2582K5861j6853l9784j4700K7972L3936m397l7314k3659J6508
287b0555L2874N752k5945k3606N596K2231Q278j3006j3475J541Q321N83m771J922
301a4260O758j541j3052o168J4134K0028k231k5106j6313J7946L3205O403l0993
314a1190k8784J2539M0175J7806k6734l5616J492L7033K5698j6128l4148p857
326b5714K5911K5403n578k3518j0381J3429J5745j463j1455k840O844J516p093
$$ plain form
339 806 -1318 8959 16850 7156 -11843 -12739 8716 26460 13012 -17665 -26687 -60 28913 20855
353 20855 -15883 -35727 -12959 22965 25545 -8699 -35399 -22357 11551 22441 -1052 -26866
365 -26866 -23347 960 13450 1754 -15393 -15428 -3151 2607 -2471 -6657 -1709 1872 -4033 -11596
379 -11596 -4580 11331 14132 -3247 -19042 -9079 17397 26956 5499 -20585 -16033 15457 35020
392 35020 16850 -14927 -20026 8380 34079 25386 -5218 -18216 759 25805 25741 3985 -10026
405 -10026 -2107 14305 17164 7191 -742 1513 5567 4238 1997 5401 9285 4100 -7439 -8863
419 -8863 4778 16692 8876 -12664 -20695 -2698 19504 15843 -10078 -27033 -12882 15231 20583
432 20583 -2953 -25352 -19434 6460 19053 4509 -16917 -18969 -1434 12068 6983 -6613 -11320
$$ packed form
339H06k124J0277P891r694j8999q96K1455J7744j3448l0677r022K6627K8973q058
353B0855l6738j9844K2768L5924K580l4244k6700J3042L3908J0890k3493k5814
365b6866L519K4307J2490j1696j7147l5J2277N758n078m186M948L581n905p563
379a1596P016J5911K801j7379j5795R963K6476R559k1457k6084M552L1490J9563
392C5020j8170l1777n099K8406K5699q693l0604j2998J8975K5046o4k1756j4011
405a0026P919J6412K859r973p933K255M054j329k241L404L884n185j1539j424
419h863J3641J1914p816k1540q031J7997K2202l661k5921j6955J4151K8113N352
432B0583k3536k2399N918K5894J2593j4544k1426k052J7535J3502n085j3596m707
$$ plain form
445 -11320 -4204 3244 3202 699 508 341 -3231 -4601 1163 9884 9444 -3139 -12788 -4627 13491 18951
461 18951 2475 -16628 -13026 9852 23229 9425 -14820 -18959 982 19197 13635 -8187 -19380
474 -19380 -7806 9954 11477 -2693 -14860 -11826 -1239 3019 -2064 -7668 -9401 -8594 -8312 -6288
488 -6288 -2270 -1485 -9461 -17641 -14873 -1986 6169 -3523 -20282 -23361 -6575 9931 5298 -15659
502 -15659 -26475 -12690 9021 11958 -6103 -22373 -15671 4397 13395 2111 -12886 -12444 724
515 724 9519 6818 -1429 -3530 425 4070 5128 6043 7556 5625 -44 -1165 6992 16807 14464 312
531 312 -8161 2085 19669 22349 5005 -11384 -5487 15479 25549 11042 -9654 -11010 7282
544 7282 22040 14116 -5164 -12024 -398 13002 11753 -997 -8110 -4009 3458 3613 26 -2348
$$ packed form
445a1320P116P448m2k503j91j67l572j370N764Q721m40j2583r649Q161J8118N460
461A8951j6476j9103L602K2878J3377j3804k4245m139J9941J8215n562k1822j1193
474a9380J1574J7760J523j4170j2167L034J0587M258n083n604j733Q07K82K024
488f288M018P85p976q180K768J2887Q155r692j6759l079J6786J6506m633k0957
502a5659j0816J3785K1711K937j8061j6270O702K0068Q998j1284j4997M42J3168
515G24Q795k701q247k101L955L645J058R15J513j931n669j121Q157R815k343j4152
531C12q473J0246J7584K680j7344j6389N897K0966J0070j4507k0696j356J8292
544G282J4758p924j9280o860J1626J3400j249j2750p113M101P467J55l587k374
$$ plain form
558 -2348 -1588 -3145 -5918 -4353 2241 4725 -2970 -13221 -11859 2368 11472 1826 -15270 -18806 -1903
573 -1903 14797 9330 -11633 -21466 -6890 13170 14828 -3884 -17872 -9946 9139 15263 3158
586 3158 -10062 -8451 4465 10875 5575 -1614 -1812 3323 4569 2459 3162 6884 6768 -1 -4115
601 -4115 2888 13583 12786 -505 -10618 -2485 14904 18906 2879 -14091 -9499 10905 21325
614 21325 7770 -12458 -14460 3741 18212 10548 -7865 -14555 -2614 10837 8855 -3198 -9809
627 -9809 -4440 3089 3274 -1724 -3808 -1016 -1423 -4482 -5150 754 4906 -702 -10781 -10991 1127 10792
643 10792 3882 -12262 -17046 -2721 13286 9920 -8650 -19304 -7993 11230 13468 -2983 -17040
656 -17040 -11307 5622 12342 1691 -11716 -11113 338 6955 2287 -5763 -6786 -2384 -221 -2166
$$ packed form
558b348P60j557k773J565O594K484p695j0251J362J4227R104r646j7096l536J6903
573a903J6700n467k0963r833J4576K0060J658j8712j3988P926J9085O124j2105
586C158j3220J611J2916O410n300p189j98N135J246k110P03L722j16o769m114
601d115P003J0695p97j3291j0113Q133J7389M002j6027j6970M592K0404J0420
614B1325j3555k0228k002J8201J4471p664j8413o690J1941J3451j982j2053o611
627i809N369P529J85m998k084K792m07l059o68N904M152n608j0079k10J2118R665
643A0792o910j6144m784J4325J6007l366j8570j0654J1311J9223K238j6451j4057
656a7040N733J6929O720j0651j3407O03J1451O617m668q050j023M402K163j945
$$ plain form
670 -2166 -3231 -819 -611 -5542 -9185 -4794 3671 4110 -6550 -15897 -9950 4528 9229 -3682 -18411
685 -18411 -15802 1236 11587 1452 -15891 -18595 -3451 9708 5251 -10116 -16341 -6582 6020
698 6020 6066 -3880 -10093 -5872 1982 3720 -55 -1773 35 765 -780 -14 4790 8020 4271 -2990
714 -2990 -2602 7650 16075 11072 -1984 -5438 6264 20044 17976 3039 -6069 3038 19178 22133
728 22133 9041 -2824 616 14616 21574 13067 1767 837 9740 15869 12566 5514 3777 6521
742 6521 8561 7509 6513 7868 6835 2137 -684 2989 9834 9404 -95 -8032 -3770 8248 11496
757 11496 533 -12528 -11015 3074 11070 2579 -12396 -15685 -3314 7849 4112 -9419 -15449
770 -15449 -8420 1900 2744 -6024 -11628 -9090 -3252 -2215 -4944 -6610 -5948 -5712 -7495 -6819 -2923 -218
$$ packed form
670b166j065K412K08m931l643M391Q465M39j0660r347N947J4478M701j2911j4729
685a8411K609J7038J0351j0135j7343k704J5144J3159m457j5367o225R759J2602
698F020M6r946o213M221P854J738l775j718J808P30j545P66M804L230l749p261
714b990L88J0252Q425n003j3056l454J1702J3780k068j4937r108R107J6140K955
728B2133j3092j1865L440J4000O958q507j1300r30Q903O129l303p052j737K744
742F521K040j052r96J355j033m698k821L673O845m30r499p937M262J2018L248
757A1496j0963j3061J513J4089P996q491j4975l289J2371J1163l737j3531o030
770a5449P029J0320Q44q768n604K538N838J037k729j666O62K36j783O76L896K705
$$ plain form
786 -218 -4255 -11098 -11085 -2226 5022 114 -11297 -14942 -4258 7300 5652 -7717 -15888 -8145 5960
801 5960 8661 -2930 -13481 -10321 2586 8056 973 -8630 -9136 -1113 4306 1608 -3321 -4523 -1984
816 -1984 -349 -907 -985 791 444 -3298 -5839 -1484 5374 5654 -2246 -9438 -4577 7013 10887 981
832 981 -9723 -7700 5524 13526 6176 -6904 -9157 2196 12991 9840 -1680 -6409 571 9794
846 9794 9767 2702 -1736 816 6096 7413 4383 3676 4575 4646 2655 2925 6904 9385 5870 -1171 -1537
863 -1537 6447 12986 8713 -2516 -6274 2701 13556 11495 -619 -8511 -1983 10236 12453 1738
877 1738 -8212 -5269 5095 9646 3126 -5710 -6119 185 4572 1831 -2832 -3924 -1814 -1149 -2455
892 -2455 -1954 -116 -800 -4340 -7275 -3905 2824 2933 -4721 -10893 -6948 3153 6542 -1616 -11628
$$ packed form
786b18m037o843J3Q859P248m908j1411l645J0684J1558j648j3369q171P743J4105
801E960K701j1591j0551L160J2907N470p083r603n06Q023N419k698m929j202K539
816a984J635n58p8J776l47l742k541M355O858K80p900p192M861J1590L874r906
832I81j0704K023J3224Q002p350j3080k253J1353J0795l151j1520m729O980R223
846I794k7p065m438K552N280J317l030p07Q99P1j991K70L979K481l515p041l66
863a537P984O539m273j1229l758Q975J0855k061j2114p892O528J2219K217j0715
877A738r950K943J0364M551o520q836m09O304M387k741m663j092K110O65j306
892b455N01J838o84l540k935L370O729J09p654o172L945J0101L389q158j0012
$$ plain form
907 -11628 -10257 1513 8633 2390 -9184 -11248 -1449 8292 5158 -4709 -9135 -3000 4961 5399 -817
922 -817 -4770 -2297 2094 2857 1078 35 1209 650 -874 -706 2947 5683 2122 -4018 -4228 2939
938 2939 8887 5395 -4210 -8063 171 9270 8406 -2665 -9660 -4205 7175 9106 219 -8353 -6113
953 -6113 3010 7440 2087 -5283 -5975 -269 3416 1694 -2177 -3388 -1241 -735 -1447 -902 726 470
969 470 -2747 -5071 -1761 3996 4225 -2310 -7915 -4654 4332 7635 850 -8352 -6988 2721 9429 4309
985 4309 -5820 -7775 75 8180 6332 -2117 -6530 -1848 5443 6022 710 -2967 -1484 2404 3074
1000 3074 1407 495 1266 926 -863 -549 2466 4651 1525 -3884 -4566 1469 7085 3862 -4548 -7689
1016 -7689 -1411 7266 6198 -3179 -9240 -4704 4762 7047 -710 -8011 -6545 1520 5807 1092 -5495
$$ packed form
907a1628J371J1770P120o243j1574k064R799R741l134r867m426O135P961M38o216
922h17l953K473M391P63j779j043J174n59j524J68L653K736l561o140k10P167
938B939N948l492r605l853Q234R099q64j1071o995N455J1380J931q887q572K240
953f113R123M430n353p370o92N706L685j722l871j211K147N06p12N45J628k56
969D70l217k324L310N757K29o535n605L261Q986L303o785r202J364R709O708n120
985D309j0129j955P850Q105j848q449m413M682P291N79n312l677J483L888O70
1000C074j667r12P71l40j789L14L015K185l126n409o82O035N616l223q410l141
1016g689O278Q677j068r377o061M536R466K285p757p301J466Q065M287m715o587
$$ plain form
1031 -5495 -5817 -997 2610 1368 -2483 -3143 -1594 -803 -1362 -1068 714 625 -2407 -4423 -1618 3359 4302
1048 4302 -1672 -6672 -3928 4099 7227 1356 -6905 -5980 2896 9131 4509 -4489 -6915 324 7733
1063 7733 6662 -1506 -5106 -1339 4946 5760 1089 -2198 -823 2498 3013 1269 728 1472 1060 -509
1079 -509 -652 2199 4452 1618 -3068 -3881 1377 6841 4145 -3398 -6491 -656 7065 6491 -1794 -7354
1095 -7354 -3260 5316 7732 389 -6369 -4941 2452 6234 2445 -3060 -3543 480 3683 2451 -627
1110 -627 -744 21 843 329 359 2007 1613 -661 -2849 -467 4097 4706 -612 -5219 -3000 4069 6726
1127 6726 1440 -6115 -5762 2209 7090 3328 -4653 -7117 -584 5528 4200 -3172 -6358 -2978 2344
1142 2344 2802 -1353 -4513 -3204 -680 -153 -2015 -2430 -1601 -2241 -3959 -3848 -1021 711 -1884 -6230
$$ packed form
1031e495l22M820L607j242l851o60J549P91n59K94J782q9l032k016K805M977R43
1048D302n974n000K744Q027L128n871q261R25Q876O235m622q998k426P239P409
1063G733j071q168l600L767O285Q14m671l287J375L321N15j744n41P44m12j569
1079e09j43K851K253k834m686q13N258N464k696p543l093N835P721n74q285n560
1095g354M094Q576K416p343o758J428P393L782l789n505m83M023L203j232l078
1110f27j17P65Q22n14L0J648l94k274k188K382M564O09n318m607K219P069K657
1127F726n286p555L53P971M881l762p981k464O533O112j328p372l186L380N322
1142B344M58m155l160J309K524N27j862m15Q29o40j718J11K827J732k595m346
$$ plain form
1158 -6230 -7408 -2056 2887 685 -6474 -9309 -3785 3331 2890 -4669 -9398 -5834 2238 4541 -1550
1173 -1550 -7709 -5874 492 3886 331 -4268 -4539 -709 2110 1005 -869 -1246 -145 438 234 613
1189 613 2493 2510 -290 -1871 581 4857 5466 1099 -2940 -1242 5362 8195 3308 -3309 -3172 4272
1205 4272 8777 5846 -1407 -3265 1868 7746 6590 500 -2568 398 5248 5553 1676 -576 651
1220 651 2362 2854 1567 1560 1785 1398 -199 -176 2019 3763 1818 -2171 -3453 1389 5471 3362 -2824
1237 -2824 -5376 -979 5242 4682 -1676 -6432 -3338 3235 5126 63 -5427 -4359 1077 3980 1088
1252 1088 -3294 -3943 -748 1357 598 -1404 -2212 -1012 -949 -1527 -1124 16 361 -2244 -4003 -1964 1290
1269 1290 2163 -1857 -6214 -4039 1400 3652 -540 -6424 -6027 -128 3929 1487 -5018 -6654 -2170
$$ packed form
1158f230j178N352M943k202p159k835N524P116m41p559m729L564Q072K303o091
1173a550o159J835O366L394l555m599k71L830K819j105j874l77J101N83k04L79
1189F13J880J7k800j581K452M276O09m367m039J698O604K833m887o617J37P444
1205D272M505k931p253j858N133N878j156o090l068K966M850L05l877k252J227
1220F51J711M92j287pK25l87j597K3K195J744j945l989j282M842M082k109o186
1237b824k552M397O221n60o358m756L094O573J891n063n490J068N436K903k892
1252A088m382o49L195K105p59k002q08J200O3n78M03J140L45k605j759K039L254
1269A290Q73m020m357K175N439K252m192n884L97N899M057k442o505j636M484
$$ plain form
1284 -2170 2805 2217 -2995 -5660 -3304 1165 1491 -1221 -3276 -2764 -684 -166 -844 -923 -505 -1074 -1865
1301 -1865 -1995 408 1755 205 -2878 -3334 485 4237 3052 -2428 -4560 -688 4892 5099 -750 -4393
1317 -4393 -2261 3965 5826 1785 -3266 -2482 2329 5238 3036 -644 -1548 924 3501 2668 717 280
1333 280 1010 1220 865 1126 2429 1877 12 -1495 -149 3142 3721 99 -3324 -2346 2643 5050 1095
1350 1095 -4101 -4176 857 4710 2406 -3182 -5081 -1364 3424 2949 -1859 -4384 -2469 1284 2230 -652
1366 -652 -2618 -2104 -362 153 -608 -776 -618 -877 -1533 -1974 246 1608 273 -2554 -3290 15 3565
1383 3565 2371 -2545 -4210 -927 3712 3989 -899 -4403 -2216 3239 4715 1089 -3104 -2692 1661
1398 1661 4224 2216 -1323 -1691 708 2184 1958 525 176 240 302 -78 655 2036 1540 -470 -1606
$$ packed form
1284b170M975n88n212k665K356M469L26k712k055N12K080N18o78p9M18n69p91
1301a865j30K403J347j550l083m56L819L752j185n480k132L872N580K07n849l643
1317d393K132O226J861m041n051P84M811K909k202l680r04K472K577q33j951m37
1333B80P30K10l55K61J303n52j865j507J346L291N79l622l423R78M989K407l955
1350A095n196p5N033L853k304n588j899L717M788m75m808k525J915L753R46k882
1366f52j966N14J742N15p61j68J58k59o56m41K220J362j335k827p36L305L550
1383C565j194m916j665L283M639K77m888l504K187N455J476l626m193M12M353
1398A661K563k008l539l68K399J476k26j433l49O4O2l80P33J381m96k010j136
$$ plain form
1415 -1606 -221 2727 3365 -113 -3359 -1921 2605 4350 1022 -3535 -3399 919 4309 2555 -2700
1430 -2700 -4139 -568 3258 2538 -1067 -3280 -1673 1226 1714 -263 -1786 -1346 -312 13 -32 -123 14
1447 14 -39 -1850 -1283 795 1966 302 -2302 -3040 -175 3084 1816 -2250 -4346 -1306 3083 3130 -1414
1464 -1414 -4484 -2437 2026 3509 412 -3506 -2843 588 2654 1051 -2284 -2488 -622 882 515 -951
1480 -951 -679 -365 -571 -1003 -510 912 467 -954 -2724 -982 1839 2170 -600 -3533 -2471 1616 3260
1497 3260 661 -3137 -3629 351 3691 1969 -2394 -3810 -653 2935 2842 -573 -2619 -1166 1818 2175
1513 2175 486 -892 -680 785 953 453 747 1094 315 -380 -406 1254 2462 1567 -1153 -1817 1277 3696
1531 3696 3057 -927 -2903 -211 3481 3639 217 -2983 -1539 2687 4112 1085 -2044 -2151 1114 3199
$$ packed form
1415a606J385K948O38l478l246J438M526J745l328m557J36M318L390j754n255
1430b700j439L571L826p20l605k213J607K899M88j977j523M40J034L25m5r1J37
1447A4n3j811N67K078J171j664k604p38K865L259j268m066k096L040M389M7m544
1464a414l070K047M463J483l097l918O63L431K066j603l335k04J866J504l67j466
1480i51K72L14k06m32M93J422m45j421j770J742K821L31k770k933J062M087J644
1497C260k599l798m92L980L340j722m363j416L157L588r3l415k046J453K984L57
1513B175j689j378K12J465J68n00K94L47p79o95k6J660J208q95k720o64L094K419
1531C696o39l984j976K692L692J58l422l200J444M226J425l027l129j07L265K085
$$ plain form
1547 3199 1579 -834 -1530 -194 1425 1189 -11 -385 18 40 -417 -87 881 856 -542 -2044 -730 1487
1565 1487 2206 -180 -2770 -2232 1148 3259 940 -2847 -3146 454 3125 2010 -1620 -3149 -355 2586
1581 2586 2407 -667 -2285 -1130 1451 2263 410 -1048 -428 257 677 440 235 519 105 -529 -503 964
1599 964 2158 903 -1292 -1992 385 2556 2117 -1187 -2912 -981 2554 2891 -403 -2966 -2202 1627
1615 1627 2984 627 -2481 -2615 206 2041 781 -1322 -2475 -747 501 319 -559 -912 -699 -751 -991
1632 -991 -475 336 152 -1106 -2008 -1330 1099 1509 -439 -3032 -2069 930 2556 819 -2617 -3130 67
1649 67 2726 1593 -1656 -3132 -877 2074 1982 -549 -1862 -1044 1250 1708 470 -510 -520 389 655 438
1667 438 652 753 239 -331 -9 1017 1855 1053 -632 -1391 789 2760 2344 -377 -1966 -423 2838
$$ packed form
1547C199j620k413o96J336J619k36j200l74M03K2m57L30R68k5j398j502J314K217
1565A487P19k386k590N38L380K111k319l787k99L600K671j115l630j529K794K941
1581B586j79l074j618J155K581Q12j853j458O20O85M20k37k05K84m14o34K6J467
1599I64J194j255k195p00K377K171m39l304j725J931L535L37l294k563P64L829
1615A627J357k357l108j34K821J835j260k103j153J728J248j82q78l53K13n2k40
1632i91N16Q11j84j258r02O78K429M10j948k593R63K999J626j737l436n13L197
1649F7K659j133l249j476K255K951r2k531j313Q18K294M58j238r80j0R09K66k17
1667D38K14J01n14n70L22J026Q38q02j685p59K180J971m16k721j589J543L261
$$ plain form
1684 2838 2676 176 -2230 -1559 2058 2952 1316 -1508 -1414 557 2224 1459 -617 -1015 16 1004 853
1701 853 167 112 216 -144 72 366 912 912 -465 -1035 -132 1590 2084 -31 -2279 -1572 941 2697 975
1720 975 -1883 -2276 428 2684 1809 -1323 -2442 -604 1909 1858 -544 -1893 -1065 692 1147 135 -697
1737 -697 -576 -329 -279 132 330 26 -185 -894 -1327 301 1166 439 -1700 -2093 196 1746 1431 -1425 -2953
1756 -2953 -1205 1489 2236 -620 -2536 -1927 721 2176 141 -2346 -1727 8 1433 1050 -531 -1121
1772 -1121 -79 511 672 235 -101 223 34 -24 381 1261 834 -51 -839 -126 1596 1952 37 -1622 -505
1791 -505 1671 2813 1105 -1279 -1349 646 2721 1902 -648 -1777 -251 1908 1965 -42 -1371 -663 693
1808 693 1178 369 -384 -626 -58 62 -99 173 -292 -474 -1055 -1056 -27 717 78 -1960 -2211 -822 965
$$ packed form
1684B838j62k500k406O71L617Q94j636k824R4J971J667p65k076l98J031R88j51
1701H53o86n5J04l60K16K94N46%j377n70R03J722M94k115k248P07K513J756j722
1720I75k858l93K704K256q75l132j119J838K513n1k402j349Q28J757M55j012q32
1737f97J21K47N0M11J98l04k11p09m33J628Q65p27k139l93K289J550l15k856j528
1756b953J748K694P47k856j916O09K648J455k035k487O19J735J425l83j581n90
1772a121J042N90J61m37l36L24j89n8M05Q80m27q85p88P13J722L56j915j659J117
1791e05K176J142j708k384p0J995K075q19k550j129J526K159N7k007j329P08J356
1808F93M85q09p53k42N68J20j61K72m65j82n81jJ029P44o39k038k51J389J787
$$ plain form
1827 965 937 -1538 -2666 -1499 711 1479 -1060 -2502 -2437 69 1174 -44 -1978 -2442 -651 616 191
1844 191 -1162 -1696 -791 71 4 -228 -432 -459 -677 -572 -180 557 554 -528 -1333 -543 1147 1434 215 -1533
1864 -1533 -1160 965 2277 1118 -1066 -1625 373 2351 2034 -177 -1344 373 1840 2355 472 -606
1880 -606 139 1239 1877 1151 397 226 575 945 929 893 1105 733 9 171 1163 1911 1292 -181 -528 667
1900 667 2507 1566 -117 -1292 -394 1559 2144 337 -1331 -755 1091 2165 748 -983 -1319 283
1916 283 1240 772 -615 -910 -598 196 38 -392 -550 -392 -714 -486 -266 61 241 -1159 -1860 -1061 245
1935 245 732 -938 -2003 -1825 -119 788 -315 -2275 -2627 -874 672 595 -1589 -2637 -1702 217 38
1952 38 -994 -2231 -1946 -614 -147 -393 -1137 -1229 -1102 -582 -415 -414 -387 -829 -1100 -922 -30 233 94 -1265
$$ packed form
1827I65k8k475j128J167K210P68k539j442O5K506J105j218j934m64J791J267m25
1844A91j353n34R05Q62o7k32k04k7k18J05L92P37lj082q05P90J690K87j219j748
1864a533L73K125J312j159k184n59J998J978l17k211j167J717J467N15j883j078
1880f06P45J100O38p26p54j71L49L70j6l6K12l72p24J62R92P48o19j473l47J195
1900F67J840r41j683j175Q98J953N85j807j668N76J846J074j417j731l36J602
1916B83R57m68j387k95L12P94j58m30j58J58l22K28K20L27J80j400p01P99J306
1935B45M87j670j065J78J706R07j103j960l52J753J546p7k184j048R35J919j79
1952C8j032j237K85J332M67k46p44r2J27N20J67JK7m42k71J78Q92K63j39j359
$$ plain form
1972 -1265 -1562 -373 1206 849 -976 -1733 -436 1085 1734 144 -1328 -1043 534 1796 957 -423
1988 -423 -712 338 1366 1149 176 -199 287 989 1166 826 588 403 574 323 788 1283 1284 116 -421 261
2008 261 1273 1703 553 -654 -588 1279 2047 695 -855 -1165 444 1838 1353 -286 -970 -448 1021
2025 1021 1554 351 -700 -568 430 583 -177 -211 -432 -408 85 -157 -202 139 -141 -1037 -786 129 966 -6
2045 -6 -1039 -1376 -583 843 890 -991 -1944 -975 970 1211 -219 -1661 -1615 420 843 103 -956 -1361 -454
2064 -454 424 582 -238 -707 -230 -191 24 -120 -180 -382 -510 -663 -156 423 508 -470 -1070 -667 664 772 91
2085 91 -1198 -1040 309 1232 443 -1582 -1378 -79 1171 1025 -685 -1295 -490 827 832 99 -1065 -670
2103 -670 -162 411 277 70 -129 -197 329 87 381 452 -82 -519 -270 306 1003 466 -724 -1065 136 977
$$ packed form
1972a265k97J189J579l57j825p57J297J521O49j590j472K85J577J262q39j380
1988d23k89J050J028k17r73l75M86P02J77l40k38j85J71k51M65M95Jj168n37O82
2008B61J012M30j150j207O6J867P68j352j550l10J609J394m85j639o84N22J469
2025A021N33j203j051J32R98J53p60l4k21K4M93k42m5L41k80q96K51R15Q37r72
2045fj033l37P93J426M7j881r53R69J945K41j430j442M6K035M23p40j059m05R07
2064d54Q78J58q20m69M77L9K15j44o0k02j28j53N07N79Q5r78o00M03J331J08o81
2085I1j289J58J349R23p89k025K04J299J250j46j710o10Q05J317Np33j164L95
2103f70N08N73j34k07j99o8N26k42K94P1n34m37K49N76O97n37j190l41J201Q41
$$ plain form
2123 977 1251 -174 -1339 -502 853 976 383 -1022 -832 689 1549 554 -870 -950 -75 944 394 -231
2141 -231 -520 -312 312 333 110 -25 2 -402 -511 101 713 122 -97 -944 -348 394 840 -34 -1218 -929
2161 -929 298 1110 747 -883 -1265 -216 751 770 -538 -1023 -741 745 682 -34 -912 -843 61 576 229
2180 229 -98 -554 -321 7 113 355 324 -27 -598 -427 248 323 249 -603 -709 -256 823 970 -314 -1252
2200 -1252 -777 561 972 -152 -832 -1090 130 1017 674 -550 -1389 -363 611 465 -405 -735 -645 -170
2218 -170 236 129 -270 -340 -303 15 -3 331 156 -491 -538 -110 406 629 -86 -656 -726 490 1170 457 -414
2239 -414 -1118 -114 1063 1041 191 -511 -458 397 842 484 -121 -324 377 624 824 442 -188 10 316 782
2259 782 727 558 0 41 112 607 697 340 -219 -244 281 1288 883 -5 -711 -303 1116 984 386 -777 -458
$$ packed form
2123I77K74j425j165Q37J355J23n93j405J90J521Q60r95j424q0Q75J019n50o25
2141b31k89K08O24K1k23j35K7m04j09O12O12n91k19q47N96P42M46q74j184K89
2161i29J227Q12l63j630l82J049R67J9j308m85K82J486o3p16q78O9R04N15l47
2180B29l27m56K33L28J06K42l1l51n71J71O75P5p4q52j06M53J079J47j284r38
2200a252M75J338M11j124o80k58J220Q87l43j224q39J026R74j46q70l30R0M75
2218a70M06j07l99p0L7L18j8L34j75o47m7M28N16K23p15n70p0J216O80p13q71
2239d14p04J004J177k2q50p02N3Q55M45l58o05k03P01K47K00l82o30J98L06M66
2259G82n5j69n58M1P1M95R0l57n59k5N25J007m05q88p06M08J419j32n98j163L19
$$ plain form
2280 -458 67 507 478 -291 -750 -246 270 512 36 -294 -212 -248 -382 -168 -119 -685 -901 -995 15 310 91
2301 91 -950 -1227 -969 291 277 -640 -1567 -1110 93 413 -230 -1069 -1416 -485 388 196 -618 -1382 -502 -163
2321 -163 -54 -115 -836 -698 -69 166 114 -301 -473 -356 -454 -180 39 391 -219 -536 -533 433 620 483 -346 -1050
2343 -1050 225 1097 781 -36 -676 -125 822 1103 445 -465 -253 934 1223 698 243 141 387 1198 1064
2362 1064 463 334 549 740 483 757 1206 781 329 408 888 1005 1130 366 -99 239 1008 1270 727 -168
2382 -168 13 760 1305 778 -401 -802 86 839 1113 59 -648 -219 631 681 30 -329 -430 307 203 0
2402 0 -181 -271 -210 -75 -155 -138 6 -109 -594 -539 -247 100 42 -783 -1323 -651 169 282 -572 -1481 -1219 -79
2424 -79 58 -158 -1272 -1463 -652 440 -154 -931 -1033 -647 134 135 -523 -877 -591 -167 108 -181 -329 -76
$$ packed form
2280d58N25M40k9p69m59N04N16K42m76l30Q2l6j34K14M9n66k16r4J010K95k19
2301I1j041k77K58J260j4r17r27M57J203L20o43q39l47R31Q73j92q14p64Q80L39
2321a63J09o1p21J38O29K35n2m15j72J17r8K74K19L52o10l17LR66J87j37q29p04
2343a050J275Q72l16q17o40N51R47K81o58r10K12J187K89n25m55j02K46Q11j34
2362A064o01j29K15J91k57K74M49m25m52P9M80J17J25p64m65L38P69K62n43q95
2382a68J81P47N45n27j179m01Q88P53K74j054p07M29Q50N0o51l59j01P37j04k03
2402@j81r0O1J35q0J7J44j15m85N5K92L47n8q25n40O72Q20J13q54r09K62J140
2424g9J37k16j114j91Q11J092n94p77j02L86P81Jo58l54K86M24K75k89j48K53
$$ plain form
2444 -76 -163 -238 -74 181 79 -85 -240 -468 366 863 115 -648 -181 31 1200 816 -208 -515 -91 1029
2464 1029 1237 562 -165 55 481 987 911 175 -153 373 979 435 568 462 265 722 484 732 374 135
2484 135 472 315 306 462 527 297 -193 -21 348 664 202 -240 -156 220 893 343 -304 -701 -121 551 732
2505 732 71 -873 -324 140 465 244 -345 -517 -179 50 364 -194 -328 -316 -141 -190 -133 -322 -622 -487 -249
2526 -249 -258 -195 35 -372 -485 -322 -230 -57 -548 -512 -608 -32 155 -78 -457 -455 49 205 237 28 -663 -507 -30
2549 -30 275 106 -267 -310 -144 211 382 -30 -229 -321 178 428 323 206 -198 -182 205 500 236 301 -279 -175
2571 -175 509 464 226 54 217 209 760 556 333 252 -22 211 684 818 202 98 110 250 674 593 -29 -485
2593 -485 -92 303 673 182 -260 -366 -39 833 868 52 -456 -372 358 335 -10 -543 -384 -166 266 -185 -219
$$ packed form
2444g6q7p5J64K55j02j64j55k28Q34M97p48p63M67K12J169l84j024l07M24J120
2464A029K08o75p27K20M26N06p6p36l28N26O06n44J33j06j97M57k38K48l58k39
2484A35L37j57rJ56O5k30m90J72L69L16m62m42Q4L76O73n50o47l97N80O72J81
2505G32o61r44N49M64L25k21n89j72L38K29L14n58j34J2J75m9N7j89l00J35K38
2526b49rO3K30m07j13J63R2J73m91L6r6N76J87k33l79KN04J56L2k09o91J56M77
2549c0L05j69l73m3J66L55J71m12j99r2M99K50j05j17m04J6L87K95k64O5n80J04
2571a75O84m5k38j72J63qN51k04k23q1k74K33M73J34o16j04J2J40M24q1o22m56
2593d85L93L95L70m91m42j06L27Q72L5q16n08Q4P30k3l45n33J59K18M32m51l4
$$ plain form
2614 -219 -543 -362 -397 -222 -283 -165 -496 -376 -117 -153 93 -193 -429 -749 -282 -127 216 -374 -768 -663 230
2635 230 338 -228 -1048 -664 102 373 234 -554 -360 -452 245 533 -434 -638 -457 82 132 -172 -406 -300 -262
2656 -262 31 370 -43 179 -217 -166 45 289 317 350 88 -179 -110 386 379 38 -65 -146 538 648 519 -518
2678 -518 -263 210 887 619 -240 -536 229 848 526 -192 -500 72 333 398 327 -299 -210 191 263 278 -61 -216
2700 -216 81 60 274 79 124 48 -124 -331 81 578 313 -125 -696 -281 564 670 -188 -486 -579 371 495
2721 495 251 -676 -493 -67 596 402 -450 -230 -387 332 344 -111 -274 -600 -139 251 45 -68 -52 -27 -195
2742 -195 36 -104 162 -77 -396 -891 -163 196 30 -160 -601 -194 208 467 88 -773 -463 430 342 33
2762 33 -380 -527 -59 154 390 -544 -461 -439 168 298 -135 -252 -500 -43 182 86 -200 -410 -311 -231 326 -146
$$ packed form
2614b19l24J81l5J75o1J18l31J20K59l6K46k86k36l20M67J55L43n90l94J05Q93
2635B30J08n66q20L84P66K71j39p88J94r2O97K88r67k04J81N39N0l04k34J06L8
2656b62K93L39m13K22l96N1K11K44K8L3k62k67O9M96pl41j03q1O84J10j29j037
2678e18K55M73O77k68q59k96P65O19l22p18l08N72K61O5p1o26Q9M01P2J5l39j55
2700b16K97k1K14j95M5p6j72k07M12M97k65m38n71M15Q45J06q58k98r3R50J24
2721D95k44r27J83M26O63j94q52K20j57P19J2m55j63l26M61L90k06j13J6K5j68
2742a95K31j40K66k39l19m95P28L59j66j90m41M07M02K59l79q61L10Q93q8l09
2762C3m13j47M68K13K36r34Q3K2O07J30m33j17k48M57K25r6k86k10R9Q0N57m72
$$ plain form
2784 -146 -82 6 -216 -7 -70 536 318 -306 -386 -293 67 139 -101 -278 -607 114 279 167 -324 -373 282 300 229
2807 229 -156 -257 -153 83 167 -99 -385 42 223 397 20 -44 -399 -244 -186 -131 386 4 -32 4 -303 171
2829 171 136 300 -536 -110 100 309 175 153 -161 183 218 387 301 -155 -530 99 548 327 -79 -274 -535
2850 -535 548 244 65 -79 -402 298 276 274 394 -177 -184 82 309 308 -271 -124 -356 21 238 -8 -224 -121
2872 -121 -39 91 117 -75 -109 -298 -146 105 121 -220 -446 -198 -101 172 115 -173 -473 -561 -70 235 -287 -509
2894 -509 -632 -507 121 240 -289 -348 -534 -108 239 -134 -445 -620 -352 82 287 10 -458 -270 65 127 86
2915 86 -120 -295 -169 172 -260 -107 3 30 56 -77 343 394 79 -179 -85 112 541 346 -29 -187 191 227
2937 227 203 42 -58 -73 183 185 56 -75 174 181 -60 -1 78 -45 117 282 36 84 81 379 -103 -48 238 394
$$ packed form
2784a46O4Q8k22K09o3O06k18o24q0R3L60P2k40j77l29P21J65j12m91m9O55J8p1
2807B29l85j01J04K36Q4k66k86M27J81J74l77o4l55J55N8N5N17l82l6L6l07M74
2829A71l5J64q36M26K10K09j34k2l14L44L5J69q6m56l75O29M49k21m06j95k61
2850e35J083l04j79j44l23P00k2kJ20n71pK66K27jn79J47k32L77K17k46k16J03
2872a21Q2J30K6j92l4j89J52K51J6l41k26K48R7K73n7k88l00q8M91L05n22k22
2894e09j23J25O28J19n29n9j86M26L47l73l11j75K68M34K05k77m68J88L35O2m1
2915H6k06j75J26L41m32J53J10K7K6j33M20N1l15k58R4J97M29j95l75j58L78L6
2937B27k4j61j00j5K56Kj29j31K49Pk41N9P9j23J62J65k46M8lK98m82N5K86J56
$$ plain form
2961 394 443 18 -379 -30 414 582 -139 -107 -334 -65 492 -216 -149 -554 102 -62 -278 -340 -708 -152 260
2982 260 464 -115 -425 -434 7 -133 34 -88 -472 -239 -67 46 -196 -172 -172 -125 -68 -218 -122 -185 26 -183 28
3005 28 179 -14 -488 -145 -208 -335 283 27 -135 -250 -13 155 -55 -77 -147 -177 111 312 -244 -333 38 205
3027 205 313 -42 80 -109 310 225 -116 23 48 249 327 139 521 105 323 274 -191 -132 695 785 179 105
3049 105 377 563 292 252 -274 -28 220 544 368 -87 -237 230 485 491 486 -119 -73 11 456 -109 1 -240
3071 -240 -116 611 17 -50 -116 -164 3 97 -78 222 -48 -233 88 -73 -128 146 -43 -311 -113 -129 309 -427
3093 -427 -415 -231 -175 135 -183 -255 -181 49 -66 11 24 -233 -38 -131 81 -101 -268 -213 -83 -231 -38 -68 -213
3116 -213 -309 -205 -202 108 3 -100 -205 24 201 156 -73 -265 -69 71 541 91 81 -491 -156 45 311 115
$$ packed form
2961C94M9m25l97L49M44J68p21L2k27K69N57p08O7m05O56j64k16o2l68N56M12
2982B60K04n79l10rM41j40J67j22l84K33J72J13k42K4%M7N7j50R6o3K11k09K11
3005B8J51j93m74L43o3j27O18k56j62j15K37J68k10k2p0l0K88K01n56q9L71J67
3027B05J08l55J22j89M19q5l41J39K5K01P8j88L82m16K18m9m65N9Q27R0o06p4
3049A05K72J86k71m0n26K46K48L24j76m55j50M67K55Ono05M6Q4M45n65J10k41
3071b40J24P27n94o7o6m8J67R4j75L00k70j85L21j61n5K74j89k68J98j6M38p36
3093d27J2J84N6L10l18p2P4K30j15P7J3k57J95r3K12j82j67N5J30j48J93l0j45
3116b13r6J04LL10j05j03j05K29J77m5k29j92J96J40M70m50j0n72L35K01K66j96
$$ plain form
3138 115 -249 -356 114 195 441 172 -30 -16 327 321 240 226 -124 -58 437 394 399 57 47 363 418 64 157 245 -47
3163 -47 214 64 235 96 52 54 166 172 189 255 -146 71 50 106 213 -193 -48 268 223 252 -256 -125 -229 -92
3187 -92 -22 86 69 -221 -206 279 122 -43 -272 -235 34 -182 169 -105 -62 -269 207 -63 -25 -87 -130 18 -141
3210 -141 238 28 -116 -153 -90 -414 71 129 8 -207 21 246 46 -255 -97 25 -80 -121 208 -113 -556
3231 -556 70 -13 379 66 -80 -65 302 150 186 -74 -232 299 -287 138 27 -214 -82 233 285 258 198 -23
3253 -23 -32 1 179 208 163 23 62 113 34 214 56 299 -73 299 221 180 -211 -115 213 18 47 226 -151 -131 -29
3278 -29 150 53 -108 195 104 188 88 -279 -269 -16 16 -43 -6 109 -84 97 -102 -121 201 313 144 -111 269
3301 269 226 -111 -25 -152 20 -138 178 -134 -309 108 203 141 -49 -157 -331 -1 74 -3 125 -223 -136 -139 -106
$$ packed form
3138A15l64j07M70Q1K46k69k02J4L43oq1j4l50O6M95m3Nl42j0L16N5l54R3Q8k92
3163d7K61j50J71j39m4KJ12OJ7O6m01K17k1N6J07m06J45L16m5K9n08J31j04J37
3187i2P0J08j7k90J5M85j57j65k29L7K69k16L51k74M3k07M76k70L8o2m3J48j59
3210a41L79k10j44l7O3l24M85N8j21k15K28K25k00l01J58J22j05m1L29l21m43
3231e56O26q3L92l13j46J5L67j52L6k60j58N31n86M25j11k41J32L15N2k7o0k21
3253b3rL3J78K9m5j40L9N1p9J80j58K43l72L72p8m1l91R6L28j95K9J79l77K0J02
3278b9J79r7j61L03r1Q4j00l67J0K53L2n9L7J15j93J81j99j9L22J12j69k55L80
3301B69m3l37Q6j27J72j58L16l12j75M17R5o2j90j08j74L30P5p7J28l48Q7lL3
$$ plain form
3324 -106 -103 -34 -254 -126 -59 46 -18 -100 49 297 -210 113 111 -56 -11 -53 207 207 67 22 -108 49 242 221 331
3349 331 -347 140 85 251 226 -90 88 -35 351 -60 -118 -379 -67 6 325 -37 196 91 -212 76 236
3370 236 -132 245 -64 124 142 402 28 -2 130 -160 378 39 131 -266 127 192 -35 77 -177 136 -89
3391 -89 24 204 -105 -91 -210 275 38 289 362 -144 -76 38 333 -76 190 100 -53 289 259 -90 -79 -20 -85
3414 -85 201 378 -215 -226 -57 -68 84 28 -145 104 -121 -46 -310 -60 45 -1 -144 -115 177 87 -47 -99 45
3437 45 -50 -12 -69 -19 -213 54 123 89 -117 -270 -19 -29 106 -82 61 -278 61 46 28 -27 -159 -1 -167 73
3461 73 48 -4 78 181 -41 -31 -234 -113 -49 -302 19 119 15 -352 231 -121 -124 170 -82 76 -62 -34 264
3484 264 335 177 139 -133 57 127 -23 132 -54 -245 6 143 -3 -46 -45 41 275 7 168 -3 -120 238
$$ packed form
3324a06LO9k20J28O7J05o4q2J49K48n07L23kj67M5m2K60%j40m5j30J57J93k1J10
3349C31o78M87n5J66k5l16J78j23L86m11n8k61L12P3L19l62K33j05l03K88J60
3370B36l68L77l09J88J8K60l74l0J32k90N38l39R2l97L93O5k27J12k54L13k25
3391h9J13J80l09J4j19M85k37K51P3n06O8J14K95m09K66r0j53L42l0l49J1N9o5
3414h5K86J77n93j1J69j1J52n6j73K49k25P5k64K50J05m6j43K9K92r0j34n2J44
3437D5r5L8n7N0j94K67O9l4k06j53K51j0J35j88J43l39L39j5j8n5j32J58j66K40
3461G3k5n2Q2J03k22J0k03J21O4k53L21J00j04l67N83l52lK94k52J58j38K8K98
3484B64P1j58l8k72J90P0j50J55j86j91K51J37j46m3JQ6K34k68J61j71j17L58
$$ plain form
3506 238 346 -3 -44 -209 -104 49 159 17 177 65 -331 232 346 -132 -173 -112 173 62 94 49 -73 -92
3528 -92 270 151 -44 -123 -126 -32 67 13 217 -232 175 -3 19 67 -254 87 253 34 -122 245 -107 -2 276
3551 276 76 -83 -141 43 -216 -357 16 205 -105 -80 52 244 4 192 -169 -208 -61 144 -24 0 -310
3572 -310 -62 275 -11 134 45 12 -295 -52 54 -21 -13 -144 -50 -183 47 53 -327 12 375 215 166 41 -183
3595 -183 48 98 155 217 -2 -51 31 179 119 17 200 -87 -90 200 -209 37 -191 39 22 -92 -75 200 -460
3618 -460 43 256 -50 50 -14 83 -127 49 42 238 -341 216 -85 285 -1 -136 78 -102 119 43 245 -187
3640 -187 -102 -160 110 105 -2 195 -280 22 316 5 57 -239 -205 -9 42 192 -47 -75 51 2 350 -156 -7
3663 -7 112 79 304 -41 -23 -105 -84 -48 107 22 -46 -8 26 -127 54 -297 -238 -296 -51 -15 -43 54 -38 -127 1 -225
$$ packed form
3506B38J08l49m1j65J05J53J10j42J60j12l96N63J14m78m1O1K85j11L2m5j22j9
3528i2L62j19j95p9lR4R9n4K04m49M07j78K2M8l21L41J66k19j56L67l52J05K78
3551B76k00j59n8J84k59j41L73J89l10K5J32J92k40J88l61l9J47K05j68K4l10
3572c10K48L37k86J45q9l3l07K43J06p5Qj31R4j33K30Ol80L39L63j60m9j25k24
3595a83K31N0N7O2k19m9Q2J48o0j02J83k87lK90m09K46k28K30j7j14J7K75o60
3618d60N03K13l06J00o4R7k10J76pJ96n79N57l01L70k86j35K14j80K21p6K02m32
3640a87Q5n8K70nj07J97m75L02K94l11N2k96L4J96N1J50k39k8J26m9L48n06J49
3663gJ19l3K25l45J8q2K1L6J55q5o8L8L4j53J81l51N9n8K45L6k8R7r2q9J28k26
$$ plain form
3689 -225 57 -127 -234 -126 40 -44 32 -190 251 -167 -63 177 -5 -153 -158 -119 56 116 -152 -338 -246 -80
3711 -80 14 -348 -185 245 136 -93 100 -22 -188 -163 269 -75 407 138 -126 266 45 130 167 -229 -154 -147 175
3734 175 315 -72 -65 51 86 -98 93 183 135 -67 -122 269 -237 -286 -103 7 86 185 41 -191 -189 274 77 74
3758 74 93 -126 -85 -17 117 208 202 67 -161 -200 101 -152 -38 -194 365 115 141 177 -66 -130 -232 62 -222 -117
3782 -117 -190 -118 -144 161 -75 -77 42 -158 -77 36 7 -83 -124 -184 -4 -58 -150 89 -181 15 21 129 95 190 -226
3807 -226 -369 -152 234 -454 251 -45 124 -21 -64 47 -189 -78 178 1 48 257 -157 122 -17 -126 -58
3828 -58 -237 5 -29 -345 -94 -474 -199 114 -191 339 148 -155 -125 -163 -113 255 -112 -57 208 61 195 -31
3850 -31 -160 -124 66 13 -173 163 -70 -63 -343 -67 170 -205 50 -205 277 59 144 -194 -174 -158 -114 -213 118
$$ packed form
3689b25K82j84j07J08J66q4P6k22M41m18J04K40j82j48nL9J75O0k68j86R2J66
3711h0R4l62J63M30j09k29J93j22j66K5M32l44M82k69k64L92k21Q5L7l96P5PL22
3734A75J40l87PJ16L5j84J91R0m8k02n5L91n06m9J83J10P9R9j44k32KM63j97l
3758G4J9k19M1O8J34R1oj35k28l9L01k53J14j56N59k50K6L6k43o4j02K94k84J05
3782a17p3P2k6L05k36kJ19k00Q1J13k9r0m1o0J80n4r2K39k70J96OJ08l4R5m16
3807b26j43K17L86o88P05k96J69j45m3J11k36J11K56j77M7K09m14K79j39j09O8
3828e8j79K42l4l16K51l80K75L13l05N30j91l03L0l8N0L68l67N5K65j47J34k26
3850c1j29L6J90n3j86L36k33Pk80K76K37l75K55k55M82k18Q5l38K0J6M4r9L31
$$ plain form
3873 118 199 -100 245 -75 119 -98 114 150 199 310 -10 -17 407 105 136 228 -226 23 -23 83 161 -85 -213
3896 -213 -114 182 -106 21 -92 -136 -120 156 74 -29 -46 183 -43 -171 -211 96 23 -216 18 117 210 158 -329
3919 -329 75 48 166 -39 -12 74 243 156 292 -66 -54 -59 299 141 -7 21 -11 -328 81 158 83 77 -323 -215
3943 -215 182 -154 -130 21 -142 -32 -185 86 -162 41 62 -1 -95 -284 274 68 75 225 66 -37 -38 -74 -72 96
3967 96 -87 67 -18 -566 180 -260 -125 70 -132 71 27 306 64 82 106 -69 -255 181 347 0 -162 310
3989 310 -60 95 119 -69 -79 90 181 246 164 103 127 -6 -195 -235 -44 93 111 30 12 -40 -49 102 236 150 110
4014 110 -130 -191 -227 -87 90 206 193 -60 84 51 91 78 -57 146 153 -179 109 56 -49 -203 -124 76 61 -62
4038 -62 -291 104 -150 -22 -92 -63 -21 -39 124 196 92 -81 236 -56 -344 -297 -130 -42 -298 518 -135 8 -219
$$ packed form
3873A18Q1k99L45l20J94k17K12L6M9J11l20pM24l02L1R2m54K49m6J06P8k46j28
3896b13R9K96k88J27j13m4J6K76q2j03j7K29k26j28m0L07p3k39K34R9R3n2m87
3919c29M04k7J18k05K7Q6J69q7J36l58J2nL58j58j48K8l2l17M09P7p5om00J08
3943b15L97l36K4J51j63J10j53K71k48K03K1o3r4j89N58k06PJ50j59j03jl6KJ68
3967I6j83J54q5n48P46m40J35J95k02K03m4K79k42J8K4j75j86M36J66l47j62M72
3989C10l70J55K4j88j0J69R1O5q2o1K4j33j89m0J91J37J8q1j8n2rJ51J34q6m0
4014A10k40o1l6J40J77J16j3k53J44l3M0j3j35K03Pl32K88n3j05j54P9K00j5j23
4038f2k29L95k54J28p0K9M2j8J63P2j04j73L17k92k88M7J67Q8k56Q16o53J43k27
$$ plain form
4061 -219 -25 30 -57 235 -186 435 58 95 -166 -57 49 -9 31 191 107 -53 11 95 181 67 -82 119 3
4084 3 53 -110 -207 52 -3 -95 -94 -191 184 71 -9 129 134 -101 -24 -52 -163 28 166 112 113 105 254 -164 155 -24
4110 -24 39 52 156 178 -167 4 -56 231 167 -21 -147 -15 0 -60 -55 75 -18 174 -110 12 -83 65 -16 -73 -76
4135 -76 33 29 -139 -176 -33 37 -40 91 -109 257 -195 177 -43 1 204 -151 172 18 187 -25 197 284 -178
4158 -178 -123 -24 234 -215 169 -220 -136 -23 25 195 55 53 -72 -9 75 -276 158 -54 -104 -220 -46 -34 -77 -284
4182 -284 234 408 -133 -399 -197 -402 -37 105 141 137 -155 -2 199 -117 -166 165 38 -109 200 -85 -114 -76
4204 -76 50 -209 -216 -81 -141 126 -38 -212 -90 -139 157 115 -30 -132 -18 -64 -60 82 97 -219 -25 58 -71 117
4228 117 -63 279 -181 35 232 314 -134 -299 163 -77 73 206 -171 -241 76 -156 -184 -237 157 -119 -44 -273
$$ packed form
4061b19J94N5q7K92m21O21l77L7k61J09J06n8M0J60q4j60O4Q4Q6j14j49K01j16
4084CN0j63r7K59n5r2Jr7L75j13q0J38Nk35P7k8j11J91J38n4JqJ49m18L19j79
4110b4O3J3J04K2l45J71o0K87o4j88j26J32J5o0NJ30r3J92k84J22r5J48q1n7l
4135g6J09mj68l7J43P0p7J31k00L66m52L72k20M4K03l55L23j54J69k12K22Q7m62
4158a78N5R9K58m49L84l89Q4J13M8J70j40kj25O3Q4l51M34k12n0j16J74J2m3k07
4182b84N18J74n41k66K02k05L65J42L6mk92J53K01l16m9L31j27j47L09k85k9L8
4204g6J26k59pJ35o0K67j64j74J22m9K96m2j45j02J14m6MJ42J5l16J94Q3j29J88
4228A17j80L42m60K16J97Q2m48j65M62k40J50J33l77p0L17k32k8n3L94k76P5k29
$$ plain form
4250 -273 109 -25 285 11 13 166 127 257 148 40 -3 48 10 -73 84 340 -159 -41 -111 89 547 -300 -63
4273 -63 28 -51 -167 -233 -154 -327 -2 333 -82 -111 268 -93 -149 -33 -164 253 246 -141 152 -55 -181 -13 121
4296 121 -138 70 33 -164 100 -243 81 99 -460 79 -168 156 118 -161 -366 272 179 -62 10 -18 -270 -240
4318 -240 196 29 193 191 248 1 -132 110 -8 1 141 120 61 -65 -341 226 159 -400 5 -212 63 28 -180
4341 -180 -32 167 -255 142 329 -149 -215 33 141 147 168 430 -28 114 -86 23 -298 -64 1 141 228 -246
4363 -246 -121 192 -178 -162 93 -98 200 66 -151 187 -273 252 51 -164 -142 70 -235 -28 -60 -27 -111 348
4385 348 143 132 -309 38 -7 75 -75 -223 128 4 -132 256 -153 -85 -149 37 -21 -184 112 270 115 -148
4407 -148 -4 114 210 -42 -144 494 -76 51 44 80 54 254 163 71 -30 3 264 35 -96 -9 111 246 -205
$$ packed form
4250b73L82j34L10k74KJ53l9J30j09j08m3N1l8q3J57K56m99J18p0K00M58q47K37
4273f3R1p9j16o6P9j73L25L35m15k9L79l61n6J16j31M17pl87K93k07j26J68J34
4296A21k59K08l7j97K64l43L24J8n59N39k47L24l8k79k05O38r3k41P2k8k52L0
4318b40M36j67J64kN7k47j33K42j18RJ40k1n9j26k76N67o7n59M05k17K75l5k08
4341a80J48J99m22L97J87m78o6K48J08OK1K62m58J42k00J09l21K34O5J40Q7m74
4363b46J25L13l70J6K55j91K98j34k17L38m60N25k01k15K2K12l05K07l2L3q4M59
4385C48k05j1m41L47m5Q2j50j48L51j24j36L88m09O8o4J86n8j63K96J58j55k63
4407a48J44J18R6k52j02O38n70J27pL6k6K00r1r2j01L3K61k29j31Q7J20J35m51
$$ plain form
4430 -205 -44 98 156 -14 -210 -120 243 135 -498 -164 -236 -118 166 18 -298 26 75 -159 73 -414 203
4451 203 77 -168 49 -210 -40 189 -6 -89 -114 -233 -365 136 4 -44 -40 -153 -233 -75 -165 355 -173 460
4473 460 18 -190 -279 -177 -38 121 -86 -68 -110 259 33 -27 96 -33 101 -144 203 34 76 -40 -46 -36 -131
4496 -131 50 33 -80 114 -276 -189 136 -18 97 -205 -145 -155 109 -128 -151 166 128 -139 204 125 -44 8 -228
4519 -228 -212 -93 167 -166 54 -302 -169 -190 88 -341 178 32 276 -85 7 16 -238 -98 -202 48 -100 -361
4541 -361 -393 5 123 -173 223 182 6 -203 -40 -83 102 -88 -280 -11 186 -215 -121 -65 -66 99 -85 47
4563 47 44 311 -120 203 -124 -76 -146 -33 -163 -9 30 129 135 -19 -240 51 -248 -184 209 60 -27 19 132 -237
4587 -237 -48 86 116 -215 27 -178 149 176 12 286 -118 -8 -189 83 -373 -125 172 -67 -139 150 76
$$ packed form
4430b05J61J42N8j70j96R0L63j08o33L34p2J18K84j48l16L24M9k34K32m87O17
4451B03j26k45K17k59J70K29j95q3k5j19j32N01j32m8Mj13q0J58r0N20n28O33
4473D60m42k08q9J02J39J59k07J8m2L69k26o0J23j29J34k45L47j69M2j16oJ0r5
4496a31J81j7j13J94l90Q7L25j54J15l02O0j0K64k37k3L17l8k67L43p9j69N2k36
4519b28J6J19K60l33K20l56J33k1K78m29N19j46K44l61R2Rk54J40j04K50j48k61
4541c61l2L98J18k96L96m1j76k09J63m3J85j90j92K69J97m01R4N6jJ65j84J32
4563D7lK67m31L23l27M8p0J13j30J54L9R9Oj54k21K91k99O4L93j49q7M6J13l69
4587b37J89J34L0l31K42k05L27K7j64K74m04J10j81K72m56K48K97k39p2K89p4
$$ plain form
4608 76 243 -52 -26 -107 146 151 -8 -246 199 75 -152 126 -292 221 3 215 -64 54 51 91 192 -86 167
4631 167 -95 -29 48 46 149 -39 131 -37 -72 380 260 -63 -81 64 -85 -39 -228 -370 -538 51 -105 -40 -115
4654 -115 -207 -218 105 -38 167 -133 -387 -132 -128 147 -61 61 -93 24 96 -152 -196 182 -147 178 -317 -68
4676 -68 268 -76 -52 -181 -37 123 203 35 63 -223 -91 167 130 50 189 20 85 108 -223 -29 257 246 88
4699 88 208 -162 -124 49 -32 -1 -163 -291 158 -162 115 84 -129 -60 197 142 -38 -59 -247 115 -250 322 215
4722 215 -57 -404 89 43 117 -5 71 4 230 -370 -280 54 -196 79 -180 167 -39 0 -99 -132 -33 127 -91
4745 -91 6 -301 384 -111 -84 -177 -295 -103 98 -224 102 23 5 28 -10 -104 -101 -265 207 -74 35 -120 95 -27
4769 -27 -32 212 107 -1 3 -22 34 -122 -32 -20 -74 109 -162 47 -147 -94 -67 85 -185 -196 -20 233 252 32 54
$$ packed form
4608G6J67k95K6q1K53Nj59k38M45j24k27K78m18N13k18K12k79J18lM0J01k78K53
4631A67k62O6P7kJ03j88J70j68l5M52j20l23j8J45j49M6j89j42j68N89j56O5p5
4654a15r2j1L23j43K05l00k54K55MK75k08J22j54J17P2k48m4L78l29L25m95K49
4676f8L36l44K4j29J44J60Q0j68K8k86J32K58l7q0J39j69O5K3l31J94K86j1j58
4699H8J20l70L8J73q1L1j62j28M49l20K77l1k13O9K57n5j80k1j88L62l65N72j07
4722B15k72l47M93m6P4j22P6o7K26o00R0L34k50K75k59L47k06L9r9l3R9J60k18
4745i1R7l07O85m95K7r3j18J92K01l22L26p9j8K3l8r4Lj64M72k81J09j55K15j22
4769b7nK44j05j08Mk5N6j56R0J2n4J83k71K09j94N3K7J52k70j1J76K53J9k20K2
$$ plain form
4794 54 291 -228 -146 106 243 227 -118 -218 147 -184 -66 -145 39 -22 -14 39 -71 237 20 -76 -211 205 388
4817 388 206 -70 -65 -23 344 30 -17 112 20 -114 -148 -188 210 85 -92 55 215 185 -97 11 38 253 -49
4840 -49 -78 213 -61 -12 -172 143 246 137 -112 -106 -65 -120 -87 -160 40 148 -70 -387 5 148 15 -316 59
4863 59 -25 86 -19 299 233 -178 75 161 -180 317 -4 90 281 -52 -12 436 -344 202 71 23 291 346 211
4886 211 -269 76 -147 -62 -158 -23 204 -34 99 -123 -23 -222 -10 26 36 -81 -10 170 198 161 -170 208
4908 208 196 -72 -50 -76 18 154 51 51 -111 18 -137 555 103 26 -4 -35 162 -192 158 122 85 -167 -49 109
4932 109 238 210 97 -104 363 -372 45 -69 -32 6 -18 -103 139 136 -295 -22 137 -42 97 -244 -61 -314
4954 -314 38 -179 -73 135 49 90 -97 24 -216 -126 5 5 -253 114 -177 -84 72 -16 -110 51 232 57 3
$$ packed form
4794E4K37n19Q2K52J37j6l45j00L65l31J18p9J84o1QN3j10L08k17r6j35M16J83
4817C88j82k76NM2L67l14m7J29r2j34l4m0L98j25j77J47J60l0k82J08K7K15l02
4840d9k9K91k74M9j60L15J03j09k49OM1n5L3p3K00J08k18l17L92J43j33l31L75
4863E9q4J11j05L18o6m11K53Q6l41M97l21R4J91l33M0M48p80N46j31m8K68N5j35
4886B11m80L45k23Q5r6J35K27k38J33k22J00j99K12L6J0j17P1J80K8l7l31L78
4908B08j2k68K2k6R4J36j03%j62J29j55O92m52p7l0l1J97l54L50l6l7k52J18J58
4932A09J29k8j13k01M67p35M17j14L7L8k4q5K42lm31K73J59j79J39l41J83k53
4954c14L52k17J06K08q6M1j87J21k40R0J31%k58L67k91R3J56q8r4J61J81j75n4
$$ plain form
4977 3 -93 28 -37 209 -219 -181 -9 114 -257 157 -25 -429 -9 -57 -160 -57 -34 37 26 93 237 180 325 -210
5001 -210 -73 110 -173 157 -129 -31 -72 -15 -32 39 260 182 18 148 -80 -71 67 -49 240 -128 -57 9 119
5024 119 -7 -265 349 -90 339 -233 45 -96 23 195 236 173 -165 -42 25 8 92 -59 -9 200 -79 -19
5046 -19 235 -49 -139 -140 121 16 -194 206 254 -133 -7 -74 157 56 -380 -79 -180 179 -52 -46 -29 -336 80
5069 80 -35 -31 -159 12 196 47 175 -99 -114 -106 35 39 -65 -25 -299 127 -110 71 24 -120 312 -145 -91 111
5093 111 -195 -87 -34 -14 131 -319 96 144 9 -91 254 60 -78 -159 -218 77 70 -41 -76 9 -106 -86 -116 -22
5117 -22 91 342 -68 124 293 246 -303 -155 -225 -399 136 98 98 221 83 -24 -89 -263 -96 -251 359 -110
5139 -110 22 133 -137 -187 48 212 -80 166 -90 94 -41 -46 16 -39 -91 -44 131 -160 16 209 -249 -230 -81
$$ packed form
4977Cr6J21o5K46m28L8J72J23l71M14j82m04M20m8j03J03K3P1j1O7J44n7J45n35
5001b10J37J83k83L30k86R8m1N7j7P1K21p8j64J30k28RJ38j16K89l68P1O6J10
5024A19j26k58O14m39M29n72K78j41J19J72M1o3l38J23O7j7Q4j51N0K09k79O0
5046a9K54k84r0jK61j05k10M00M8l87J26o7K31j01m36L01j01L59k31OJ7l07M16
5069H0j15Mj28J71J84j49J28k74j5QJ41Mj04M0k74M26k37J81m7j44M32m57N4K02
5093A11l06J08N3K0J45m50M15M8j35j00L45j94j38q1n9K95pj11l5Q5j15K0l0R4
5117b2J13K51m10J92J69m7n49J48p0j74N35l8%J23j38j07o5j74J67j55O10m69
5139a10J32J11k70n0K35J64k92K46k56J84j35nO2n5n2M7J75k91J76J93m58J9J49
$$ plain form
5162 -81 145 40 -207 89 61 -208 214 -48 -88 4 12 -252 166 -274 -317 137 13 -32 -79 -425 10 -66 -93 -107
5186 -107 21 -125 -156 70 94 -86 -160 -173 -188 -156 -85 -283 1 88 63 -33 -138 280 265 -35 181 186 86 128 -63
5211 -63 -189 -10 76 -185 -48 -232 -25 34 77 24 146 24 72 97 -106 19 40 186 62 -234 170 -23 -72
5234 -72 -96 203 -176 80 -172 117 75 -257 -302 -20 -42 110 212 -121 171 -343 214 -164 -39 -119 -5 173
5256 173 64 39 22 96 -116 -55 -42 -86 -327 221 -28 -5 -3 -10 4 61 -248 -99 71 -111 -60 -153 153 323 -48
5281 -48 -6 -14 -200 136 22 107 -285 82 -57 128 -69 243 -7 -141 254 158 225 50 -95 189 170 -20 -156
5304 -156 137 162 -179 1 83 193 169 -201 -69 190 32 197 -46 -166 -24 39 301 -149 -98 72 -24 86
5326 86 -135 -221 -165 -11 7 -35 -280 135 136 94 -51 -224 99 -67 251 178 -16 -48 -33 133 -198 -130 13 139
$$ packed form
5162h1K26j05k47K96k8k69M22k62m0R2Qk64M18m40m3M54j24m5m7l46M35p6k7j4
5186a07J28j46l1K26K4j80p4j3j5L2P1j98K84Q7k5r6j05M18j5l00K16Nj00M2j91
5211f3j26J79Q6k61J37j84K07N9M3n3J22j22M8K5k03J25K1J46j24k96M04j93m9
5234g2k4K99l79K56k52K89m2l32m5K82k2J52J02l33K92n14N57l78J25q0J14J78
5256A73j09k5j7P4k12O1J3m4k41N48k49K3KpJ4N7l09J49J70j82N1r3L06J70l71
5281d8M2qj86L36j14Q5l92L67j39J85j97L12k50j34L95r6O7j75j45K84j9j90j36
5304a56K93K5l41J80Q2J10k4l70J32K59j58J65k43j20J42O3K62m50N1J70r6J10
5326H6k21q6N6J54J8m2k45M15Jm2j45j73L23j66L18p3j94l2J5J66l31O8J43J26
$$ plain form
5350 139 253 254 266 278 -126 287 -158 -160 185 -47 33 27 -8 43 337 -372 -206 63 201 83 -168 269 23 57
5374 57 89 -79 -12 70 224 242 -243 -42 -5 96 -25 -316 -157 -6 94 -152 116 -29 161 -268 321 214
5396 214 -91 -15 -58 0 120 -99 -351 -56 6 49 145 -4 -23 218 140 46 65 -90 264 3 218 -265 44
5419 44 -26 -56 -175 173 -156 -5 126 -53 -152 32 154 -210 217 212 -41 77 235 -40 -4 -239 61 3 -12
5442 -12 65 -218 32 425 -145 39 85 -90 -185 100 -156 210 -50 -96 15 -10 -216 50 184 118 1 -76 -268
5465 -268 191 -120 9 -297 -25 -236 -61 319 198 -417 -55 319 217 -187 -52 -11 -197 -120 -213 -128 -97 159
5487 159 182 113 -36 -236 -87 47 -23 -298 256 -55 109 197 -25 190 97 32 358 27 133 -74 6 -35 -46
5510 -46 281 -81 7 153 497 -25 82 -147 -396 304 -106 54 2 5 16 52 59 -104 -149 -130 131 -150 264 108
$$ packed form
5350A39J14JJ2J2m04M13m45kL45k32Q0ol5N1K94p09J66K69J38j18k51M37k46L4
5374E7L2j68O7Q2J54J8m85K01L7J01j21k91J59J51J00k46K68j45J90m29N89j07
5396B14l05P6m3N8J20k19k52K95O2M3R6j49j9K41p8r4J9j55L54k61K15m83L09
5419D4p0l0j19L48l29J51J31j79r9J84J22l64M27nk53J18J58k75L6k35L00n8j5
5442a2P7k83K50L93n70J84M6j75r5K85k56L66k60m6J11k5k06K66J34o6j17p7j92
5465b68M59l11J29l06K72k11J75L80j21o15L62L74j02m04J35M1j86P7r3Q5L1K56
5487A59K3o9j49k00J49J34p0k75N54l11J64Q8k22K15r3o5L26l31J06k07Q0m1j1
5510d6L27l62Q8J46L44n22J07k29k49P00m10J60n2LJ1L6Pj63m5J9K61k81M14j56
$$ plain form
5534 108 120 -148 -30 -139 -223 212 -268 281 -274 26 -18 113 50 -93 336 155 200 81 258 -188 -24 58
5556 58 -119 -48 234 -63 131 98 -41 -111 -109 31 90 -166 21 22 -85 292 116 122 -33 -74 209 -78 -260 -43
$$ packed form
5534A08J2k68J18j09q4M35m80N49n55L00m4J31o3j43M29j81M5j19J77m46J64Q2
5556E8j77P1K82k97J94l3j39p0KJ40N9k56J87Jj07L77j76Oj55m1K83k87j82K17
$$ [...]
8191d19
##END NTUPLES=NMR FID
##END=
