##TITLE=1H_K-371/1
 DMSO+CCl4, 8 sc, 
 12.11.2019
##JCAMPDX= 6.0         $$ Bruker NMR JCAMP-DX V2.0
##DATA TYPE= NMR FID
##DATA CLASS= NTUPLES
##ORIGIN= UXNMR, Bruker Analytische Messtechnik GmbH
##OWNER= root
$$ XWIN-NMR		Version 3.5
$$ Tue Nov 12 14:21:25 2019 Russian Standard Time (UT+4h)  she@DPX200
##.OBSERVE FREQUENCY= 200.1315
##.OBSERVE NUCLEUS= ^1H
##.DELAY= (6, 6)
##.ACQUISITION MODE= SIMULTANEOUS
##.ACQUISITION SCHEME= undefined
##.AVERAGES= 8
##.DIGITISER RES= 18
##SPECTROMETER/DATA SYSTEM= spect
##.PULSE SEQUENCE= zg30
##.SOLVENT NAME= DMSO
##.SHIFT REFERENCE= (INTERNAL, DMSO, 0, 15.7039)
##AUDIT TRAIL= $$ (NUMBER, WHEN, WHO, WHERE, WHAT)
$$ ##TITLE= Audit trail, XWIN-NMR		Version 3.5
$$ ##JCAMPDX= 5.01
$$ ##ORIGIN= Bruker BioSpin GmbH
$$ ##OWNER= she
$$ F:/spectra/data/she/nmr/H-F/1/audita.txt
$$ ##AUDIT TRAIL=  $$ (NUMBER, WHEN, WHO, WHERE, WHAT)
(   1,<2019-11-12 14:20:28.81 +0400>,<she>,<DPX200>,
      <created by zg, POWCHK disabled, PULCHK disabled
       configuration hash MD5:
       00 E9 B6 7A A2 85 ED C7 34 08 36 98 17 FE 4E 26
       data hash MD5: 16K
       74 E1 79 E2 7E 3F 15 0E FD 9A 81 10 58 81 61 D0>)
$$ ##END=
$$ 
$$ hash MD5
$$ D1 EA 0E 09 00 69 A1 CE 55 E4 35 66 75 EB 29 8E
##$RELAX= 
##$RELAX= 
##$RELAX= 
##$RELAX= 
##$RELAX= 
##$RELAX= 
$$ Bruker specific parameters
$$ --------------------------
##$DU= <F:/spectra>
##$EXPNO= 1
##$NAME= <H-F>
##$PROCNO= 1
##$TYPE= <nmr>
##$USER= <she>
##$AMP= (0..31)
100 100 100 100 100 100 100 100 100 100 100 100 100 100 100 100 100 100 
100 100 100 100 100 100 100 100 100 100 100 100 100 100 
##$AQSEQ= 0
##$AQ_mod= 1
##$AUNM= <au_zg>
##$AUTOPOS= <>
##$BF1= 200.13
##$BF2= 200.13
##$BF3= 200.13
##$BF4= 200.13
##$BF5= 200.13
##$BF6= 200.13
##$BF7= 200.13
##$BF8= 200.13
##$BYTORDA= 1
##$CFDGTYP= 0
##$CFRGTYP= 5
##$CHEMSTR= <none>
##$CNST= (0..31)
1 1 145 1 1 1 1 1 1 1 1 1 1 1 1 1 1 1 1 1 1 1 1 1 1 1 1 1 1 1 1 1 
##$CPDPRG= <>
##$CPDPRG1= <>
##$CPDPRG2= <>
##$CPDPRG3= <>
##$CPDPRG4= <mlev>
##$CPDPRG5= <mlev>
##$CPDPRG6= <mlev>
##$CPDPRG7= <mlev>
##$CPDPRG8= <mlev>
##$CPDPRGB= <>
##$CPDPRGT= <>
##$D= (0..31)
0 1.2 0 0 0 0 0 0 0 0.06 0 0.03 0 0 0 0 0.0002 0 0 0 0 0 0 0 0 0 0 0 0 
0 0 0 
##$DATE= 1573554028
##$DBL= (0..7)
120 120 120 120 120 120 120 120 
##$DBP= (0..7)
150 150 150 150 150 150 150 150 
##$DBP07= 0
##$DBPNAM0= <>
##$DBPNAM1= <>
##$DBPNAM2= <>
##$DBPNAM3= <>
##$DBPNAM4= <>
##$DBPNAM5= <>
##$DBPNAM6= <>
##$DBPNAM7= <>
##$DBPOAL= (0..7)
0.5 0.5 0.5 0.5 0.5 0.5 0.5 0.5 
##$DBPOFFS= (0..7)
0 0 0 0 0 0 0 0 
##$DE= 6
##$DECBNUC= <off>
##$DECIM= 24
##$DECNUC= <off>
##$DECSTAT= 4
##$DIGMOD= 1
##$DIGTYP= 9
##$DL= (0..7)
0 120 120 120 120 120 120 120 
##$DP= (0..7)
150 150 150 150 150 150 150 150 
##$DP07= 0
##$DPNAME0= <>
##$DPNAME1= <>
##$DPNAME2= <>
##$DPNAME3= <>
##$DPNAME4= <>
##$DPNAME5= <>
##$DPNAME6= <>
##$DPNAME7= <>
##$DPOAL= (0..7)
0.5 0.5 0.5 0.5 0.5 0.5 0.5 0.5 
##$DPOFFS= (0..7)
0 0 0 0 0 0 0 0 
##$DQDMODE= 0
##$DR= 18
##$DS= 0
##$DSLIST= <SSSSSSSSSSSSSSS>
$$ [...]
##$SUBNAM2= <"">
##$SUBNAM3= <"">
##$SUBNAM4= <"">
##$SUBNAM5= <"">
##$SUBNAM6= <"">
##$SUBNAM7= <"">
##$SUBNAM8= <"">
##$SUBNAM9= <"">
##$SW= 24.0689530833862
##$SWIBOX= (0..15)
0 0 2 0 0 0 0 0 0 0 0 0 0 0 0 0 
##$SW_h= 4816.95568400771
##$TD= 16384
##$TD0= 1
##$TE= 0
##$TE2= 300
##$TE3= 300
##$TEG= 300
##$TL= (0..7)
0 120 120 120 120 120 120 120 
##$TP= (0..7)
150 150 150 150 150 150 150 150 
##$TP07= 0
##$TPNAME0= <>
##$TPNAME1= <>
##$TPNAME2= <>
##$TPNAME3= <>
##$TPNAME4= <>
##$TPNAME5= <>
##$TPNAME6= <>
##$TPNAME7= <>
##$TPOAL= (0..7)
0.5 0.5 0.5 0.5 0.5 0.5 0.5 0.5 
##$TPOFFS= (0..7)
0 0 0 0 0 0 0 0 
##$TUNHIN= 0
##$TUNHOUT= 0
##$TUNXOUT= 0
##$USERA1= <user>
##$USERA2= <user>
##$USERA3= <user>
##$USERA4= <user>
##$USERA5= <user>
##$V9= 5
##$VALIST= <valist>
##$VCLIST= <CCCCCCCCCCCCCCC>
##$VD= 0
##$VDLIST= <DDDDDDDDDDDDDDD>
##$VPLIST= <PPPPPPPPPPPPPPP>
##$VTLIST= <TTTTTTTTTTTTTTT>
##$WBST= 1024
##$WBSW= 4
##$XGAIN= (0..3)
0 0 0 0 
##$XL= 0
##$YL= 0
##$YMAX_a= 105925
##$YMIN_a= -75097
##$ZGOPTNS= <>
##$ZL1= 120
##$ZL2= 120
##$ZL3= 120
##$ZL4= 120
##$ABSF1= 10
##$ABSF2= 0
##$ABSG= 5
##$ABSL= 3
##$ALPHA= 0
##$AQORDER= 0
##$ASSFAC= 0
##$ASSFACI= 0
##$ASSFACX= 0
##$ASSWID= 0
##$AUNMP= <proc_1d>
##$AZFE= 0.1
##$AZFW= 0.1
##$BCFW= 1
##$BC_mod= 2
##$BYTORDP= 1
##$COROFFS= 0
##$CY= 11.3945322036743
##$DATMOD= 1
##$DC= 2
##$DFILT= <>
##$DTYPP= 0
##$F1P= 19.5091578491511
##$F2P= -0.509923556040331
##$FCOR= 0.5
##$FTSIZE= 0
##$FT_mod= 4
##$GAMMA= 1
##$GB= 0.15
##$INTBC= 1
##$INTSCL= 1
##$ISEN= 128
##$LB= 0.24
##$LEV0= 0
##$LPBIN= 0
##$MAXI= 10000
##$MC2= 0
##$MEAN= 0
##$ME_mod= 0
##$MI= 1.114404
##$NCOEF= 0
##$NC_proc= 0
##$NLEV= 6
##$NOISF1= 3.799351
##$NOISF2= 2.8
##$NSP= 1
##$NTH_PI= 0
##$NZP= 0
##$OFFSET= 15.70392
##$PC= 1
##$PHC0= -9460.898
##$PHC1= 21.60088
##$PH_mod= 1
##$PKNL= yes
##$PPARMOD= 0
##$PSCAL= 0
##$PSIGN= 0
##$REVERSE= no
##$SF= 200.130013532006
##$SI= 16384
##$SIGF1= 3
##$SIGF2= 2
##$SINO= 400
##$SIOLD= 16384
##$SREGLST= <1H.CDCl3>
##$SSB= 0
##$STSI= 0
##$STSR= 0
##$SW_p= 3612.71676300578
##$SYMM= 0
##$S_DEV= 0
##$TDeff= 0
##$TDoff= 0
##$TI= <>
##$TILT= no
##$TM1= 0
##$TM2= 0
##$TOPLEV= 0
##$USERP1= <user>
##$USERP2= <user>
##$USERP3= <user>
##$USERP4= <user>
##$USERP5= <user>
##$WDW= 1
##$XDIM= 8192
##$YMAX_p= 0
##$YMIN_p= 0
$$ End of Bruker specific parameters
$$ ---------------------------------
##NTUPLES= NMR FID
##VAR_NAME=  TIME,          FID/REAL,        FID/IMAG
##SYMBOL=    X,             R,               I
##VAR_TYPE=  INDEPENDENT,   DEPENDENT,       DEPENDENT
##VAR_FORM=  AFFN,          ASDF,            ASDF
##VAR_DIM=   8192,          8192,            8192
##UNITS=     SECONDS,       ARBITRARY UNITS, ARBITRARY UNITS
##FACTOR=    0.0002076,     1,               1
##FIRST=     0,             0,               0
##LAST=      1.7004516,     0,               0
##MIN=       0,             -75097,          0
##MAX=       1.7004516,     105925,          0
$$ Real data points
##PAGE= N=1
##DATA TABLE= (X++(R..R)), XYDATA
$$ [...]
1980f63l40j63L2O37j11j80n52N40M83o29j77n50N59N31k56n23J22J70J54J02
$$ -663 -1003 -1166 -1134 -497 -608 -788 -1340 -800 -317 -946 -1123 -1673 -1114 -583 -839 -1362 -1240 -1070 -916 -814
2000h14m52J20L49J70m27o8L07J95j26p3j4j61K97Jo85J40L24L97m27m40K52M01
$$ -814 -1266 -1146 -797 -627 -1054 -1122 -815 -620 -746 -819 -833 -994 -697 -696 -1381 -1241 -917 -520 -947 -1387 -1135 -734
2022g34lj91k53K18N98k89k74j35j98M13K93l07k84M81J63Jm95m2O75l26r0j03
$$ -734 -737 -928 -1181 -963 -365 -654 -928 -1063 -1261 -848 -555 -862 -1146 -665 -502 -501 -996 -1038 -363 -689 -779 -882
2044h82M70k19K71n53j03j97Q09n2j12l14J44N17q41N67l85N66j20L5k07k00M57
$$ -882 -412 -631 -360 -913 -1016 -1213 -404 -456 -568 -882 -738 -221 -1062 -495 -880 -314 -434 -399 -606 -806 -349
2065c49j84j70n28M11L95l06k36N6K42J08J50n44k04O04J86k29l59M32L8M1j14
$$ -349 -533 -703 -1231 -820 -425 -731 -967 -911 -669 -561 -411 -955 -1159 -555 -369 -598 -957 -525 -487 -446 -560
2086e60m18M80J27l76k10M03q8K6K07k91P2l1K06L1J57n7j29N6j53k13L49J55
$$ -560 -978 -498 -371 -747 -957 -554 -642 -616 -409 -700 -628 -659 -453 -422 -265 -322 -451 -395 -548 -761 -412 -257
2108b57m57K70r1K25O7l13q8J32L9L07l02l52M47J36l67J0R9J30M4k09k68q0J55
$$ -257 -714 -444 -535 -310 -243 -556 -644 -512 -473 -166 -468 -820 -373 -237 -604 -594 -495 -365 -321 -530 -798 -878 -723
2131g23K61l35J30j56N86k39l2L0Jj25J18m07K3P00j47j08m03L08M27Q8k96k97
$$ -723 -462 -797 -667 -823 -237 -476 -508 -478 -477 -602 -484 -891 -868 -168 -315 -423 -826 -518 -91 -3 -299 -596
2153e96m8M53k14O9k73M47L99n99j68nM13J65l56j81K67R3lj82k82L74L40m5p17
$$ -596 -644 -191 -405 -336 -609 -162 237 -362 -530 -535 -122 43 -313 -494 -227 -134 -137 -319 -601 -227 113 68 -649
2176f49RN47j8N5l74J5M84L9m59l82L18O74o3j91l87K59N80k01m86k4R2O12m28
$$ -649 -640 -93 -111 -56 -430 -415 69 108 -351 -733 -415 259 196 5 -382 -123 457 256 -230 -254 -162 450 22
2199B2J00l91J0N78r4j48k80L84Q8n7j88k40M84K04l97k37l8M77K27q73j8J58
$$ 22 122 -269 -259 319 225 77 -203 181 269 212 24 -216 268 472 75 -162 -200 277 504 -369 -387 -229
2221b29N58j03o36j7J58N84l38n46L25M31j98o4k17q2K95K57k94m73N66J64rl60
$$ -229 329 226 -410 -427 -269 315 -23 -569 -244 187 -11 -75 -292 -374 -79 178 -116 -589 -23 141 132 -228
2243b28l17J76N00j89k12j7J39N99l22l98PL84K44m15m37L51M28j28l14j37J24
$$ -228 -545 -369 131 -58 -270 -287 -148 451 129 -269 -262 122 366 -49 -486 -135 293 165 -149 -286 -162
2264a62M25J01j16p55N17M15j06m62R5K62L18l44l19l5K11O79o1o36K65L46K7
$$ -162 263 364 248 -507 10 425 319 -143 -48 214 532 188 -131 -166 45 724 663 27 292 638 665
2285F65l89q6K89R3Mj53o9N45%k86l31J1L41K74l33j19k18N20J7J7l22q4L91j69
$$ 665 276 190 479 572 576 423 354 899 899 613 282 293 634 908 575 456 238 758 775 792 470 386 777 608
2309F08R5m07r9M91p5k71J85k74L33J60n10M1N1K07P0n42L8n8O09p7p37L27L10
$$ 608 703 296 197 688 613 342 527 253 586 746 236 277 328 535 605 63 101 43 652 575 -162 165 475
2332D75q2p1k15L5J93Qj52k01mK93k17k5K70k50J2M36m05k42L05P7J09mj15lk44
$$ 475 393 322 107 142 335 343 191 -10 -14 279 62 37 307 57 69 505 100 -142 163 240 349 345 230 227 -17
2357a7L93m71%L06nJ07L6qJ9K0k14j70J91j8J0k18M01l29J92J26J05p9j15K96
$$ -17 376 -95 -95 211 206 313 349 341 360 380 166 -4 187 169 179 -39 362 33 225 351 456 377 262 558
2381E58J8nk73O7K27j02K5J76n18L9N84qp8m9N5J82M2n03K13L90n6l38J8L14j55
$$ 558 576 571 298 365 592 490 515 691 173 212 796 788 710 661 716 898 940 437 650 1040 984 646 664 978 823
2406H23K56L3p89M95J92r1l7k39J18J54K61o38p5M41K68j55n91P6J96K15j20m18
$$ 823 1079 1112 323 818 1010 919 882 643 761 915 1176 538 463 904 1172 1017 426 502 698 913 793 375
2428C75p8N49J52l49k96J15L45Jk73j37J14J57N0m61j52K49M39k17j63l14O83
$$ 375 297 846 998 649 353 468 813 814 541 404 518 675 725 264 112 361 800 583 420 106 789
2449G89j9l04k35k93N89q4l68lJ33J49N73q20j74LP64o7n89j30J48N95J18n90
$$ 789 770 466 231 -62 527 443 75 72 205 354 927 107 -67 -64 700 633 44 -86 62 657 775 185
2471A85oj44P14m67k70J27L78Q4j25l14oK9N31k63j88j18O73J52q14j15K45M13
$$ 185 179 35 749 282 12 139 517 601 476 162 156 185 716 453 265 147 820 972 158 43 288 701
2493G01j3m02k84M15L42k30l20J63K9M34l49k55n0R16m9Ko44K41P4K49l48n49
$$ 701 688 286 2 417 759 529 209 372 401 835 486 231 181 1097 1048 1050 406 647 721 970 622 73
2515G3M8N23L78k08o72N10J42l3l69K7J14K16k65k29Q7J58J39r4l72k3N30L31
$$ 73 121 644 1022 814 142 652 794 761 392 419 533 749 484 255 342 500 639 545 173 150 680 1011
2537A011m19p58L74L29J14m79k4KN28K67m88o55L62L98L0n34L40k65N00k44l58
$$ 1011 592 -166 208 537 651 172 148 150 678 945 457 -198 164 562 592 58 398 133 633 389 31
2558C1J34J25L50n6n05J12J5%J08m71K44O39j46l96l30R0M89qo7j01k20J27K56
$$ 31 165 290 640 584 79 191 206 206 314 -157 87 726 580 184 -146 -56 433 425 358 257 37 164 420
2581D20j14l02k4M46l25o5j4J95J83l2j01j46L18L1J50o09M3K45R6P5l28R2P0
$$ 420 306 4 -20 426 101 36 22 217 400 368 267 121 439 470 620 11 54 299 395 470 142 234 304
2604C04J34L0k66L16l0m14L27j37JL3o9j8k87L72K30m4k47k15N67l35J37k90J57
$$ 304 438 468 202 518 488 74 401 264 265 298 229 211 -76 296 526 482 235 20 587 252 389 99 256
2627B56l01P65n11r7R4o3L15n25N2J98J97k09r1j86OJ32P7N3j60J67n9j66M6L45
$$ 256 -45 720 209 112 206 143 458 -67 -15 183 380 171 80 -106 -100 32 109 162 2 169 110 -56 -10 335
2651C35k95K78k2J03m71K25M6o8m8k41K93k7K31n35K01R6K10k24J45r8J1K51l28
$$ 335 40 318 296 399 -72 153 199 131 83 -158 135 108 339 -196 5 101 311 87 232 134 145 396 68
2674F8l09L32J94k39Q5l97o6M75l36J04j57RJ68Nj78P4oJ04R1k94j33M94K91k53
$$ 68 -241 91 285 46 131 -266 -332 143 -193 -89 -246 -237 -69 -64 -242 -168 -174 -70 21 -273 -406 88 379 126
2698A26l49P2M10k21p3k43l6L07q0p0O8k38N79M6l32m47K97L92o6k45m50K52M10
$$ 126 -223 -151 259 38 -35 -278 -314 -7 -87 -157 -89 -327 252 298 -34 -481 -184 208 142 -103 -553 -301 109
2721A09k76k20k46N33p7l49J08j1K33M17m69l36J97K36J08m50o8O7L05K95m95
$$ 109 -167 -387 -633 -100 -177 -526 -418 -429 -196 221 -248 -584 -387 -151 -43 -493 -561 -494 -189 106 -389
2742c89j88N88j72j58J46j68L03n2L7p2j31R5mM80k94m32L59K21j40m57O2N66
$$ -389 -577 11 -161 -319 -173 -341 -38 -90 -53 -125 -256 -161 -165 315 21 -411 -52 169 29 -428 -366 200
2764B00k18j60k5M05j31M0o58K22J94K38k79J25k75K27K72k84k59K14k11Q6K70
$$ 200 -18 -178 -203 202 71 111 -547 -325 -131 107 -172 -47 -322 -95 177 -107 -366 -152 -363 -277 -7
2785gn02k9L16K90m51l20M54K94k32m0l75O5M29j32j30o6O9K79P7m21J45N5K50
$$ -7 -509 -538 -222 68 -383 -703 -249 45 -187 -227 -602 -537 -108 -240 -370 -436 -367 -88 -11 -432 -287 -232 18
2808A8k03r8k58O00j66k92K4j24N17k05l69mK50L25l49n8l15J93M89l14j86J7
$$ 18 -185 -283 -541 59 -107 -399 -375 -499 18 -187 -556 -560 -310 15 -334 -392 -707 -514 -25 -339 -525 -508
2830e08j87K55K22l30o9K18k8p9K19k01J33J13m3J8m87M45j1k06m4K49Q0Q0l90
$$ -508 -695 -440 -218 -548 -617 -399 -427 -506 -287 -488 -355 -242 -285 -267 -754 -309 -320 -526 -570 -321 -241 -161 -551
2853e51K22J70n0k47J39l48L56L40k26j43m3L47Q1m24J69k95L97K37k76j69j06
$$ -551 -329 -159 -209 -456 -317 -665 -309 31 -195 -338 -381 -34 47 -377 -208 -503 -106 131 -145 -314 -420
2874d20J66R5j93J14k1j57M6M07m88K90j14p6q4L6K31m9om6j36K20P6q8p3j23
$$ -420 -254 -159 -352 -238 -259 -416 -370 37 -451 -161 -275 -351 -435 -399 -168 -217 -223 -269 -405 -185 -109 -197 -270 -393
2898c93j66L14K44m42K4rK23R6j29k96N36K2k82j09l9J89j0k85P9p6k35M67m33
$$ -393 -559 -245 -1 -443 -419 -428 -205 -109 -238 -534 2 24 -258 -367 -406 -217 -227 -512 -433 -509 -744 -277 -710
2921g10N16k61j3P3j0k08J13J06j69j32j28O23k49R9j94j06M47K9k77o3K15r8
$$ -710 -194 -455 -468 -395 -405 -613 -500 -394 -563 -695 -823 -200 -449 -350 -544 -650 -203 -174 -451 -514 -299 -397
2943c97q8J62k67J23J54j08K29k45O4J95q4n8J87k24M4r1j4JJ86p9K60l40q7M20
$$ -397 -485 -323 -590 -467 -313 -421 -192 -437 -373 -178 -262 -320 -133 -357 -313 -404 -418 -417 -231 -310 -50 -390 -477 -57
2967e7K27l31k49J64K6LJ90m63K86J04l24M28l64R7J34L7r0j33k3K45n7j74q6
$$ -57 170 -161 -410 -246 -220 -217 -27 -490 -204 -100 -424 4 -360 -263 -129 -92 -182 -315 -338 -93 -150 -324 -410
2990d10K79j85K59Ok42n4J24%k6r7Q8J95k44j8N8K31J46n05L7M4J02J9j28j65
$$ -410 -131 -316 -57 -51 -293 -347 -223 -223 -249 -346 -258 -63 -307 -325 -267 -36 110 -395 -358 -314 -212 -193 -321 -486
3014d86J56J43j30J39j83J65q5J66m15R5O9K4J47k35J24J40j27J0J2m5q6M89j63
$$ -486 -330 -187 -317 -178 -361 -196 -281 -115 -530 -435 -366 -342 -195 -430 -306 -166 -293 -283 -271 -316 -402 87 -76
3037g6l35n6K47L6o4LN9K70l62Rk43J72L12k63j28K02j77L45M6q6oj98N5J57k63
$$ -76 -411 -467 -220 -184 -248 -245 -186 84 -278 -269 -512 -340 -28 -291 -419 -217 -394 -49 -3 -89 -95 -293 -238 -81 -344
3062c44K04J37K4k49K24k52L53nk72KK39L3j41p8J41j50P5M2j0K3J0L60m40k73
$$ -344 -140 -3 21 -228 -4 -256 97 92 -180 -178 61 94 -47 -125 16 -134 -59 -17 -27 -4 6 366 -74 -347
3086c47M13l15K78j76J57j11J3L86q2m04K97M9l16J56j07o2M22l65NJ01n3O0k58
$$ -347 66 -249 29 -147 10 -101 -88 298 216 -188 109 158 -158 -2 -109 -171 251 -114 -109 -8 -61 -1 -259
3109b59O4J98j02R2m9l13K50L8O1L8l80L11j32J40K24k05O2j35j19j4J64o4Q8
$$ -259 -195 3 -99 -7 -56 -369 -119 -81 -20 18 -362 -51 -183 -43 181 -24 38 -97 -216 -230 -66 -130 -42
3132d2L86m20k4P1k77K16k41J33L71k23K50l72L20k47K95j30j13Q1j03k4K05j58
$$ -42 344 -76 -100 -29 -306 -90 -331 -198 173 -50 200 -172 148 -99 196 66 -47 34 -69 -93 112 -46
3154d6J50l4K09l20j86j15L17J76l6J23l28N2J18K4P0j05lL2k12L0K89k66L53
$$ -46 104 70 279 -41 -227 -342 -25 151 115 238 -90 -38 80 104 174 69 66 98 -114 -84 205 -61 292
3177B92k32J00k71J87J07j22j35J5L27j69k08J81J69L3j21K6j56j18L90k87k19
$$ 292 60 160 -111 76 183 61 -74 -59 268 99 -109 72 241 274 153 179 23 -95 295 8 -211
3198b11J29J34R5k01P8q2L33j69j28J83k18K28J97l00j06K44J2k2m81K99K4j60
$$ -211 -82 52 147 -54 24 -58 275 106 -22 161 -57 171 368 68 -38 206 218 196 -285 14 38 -122
3220a22K51J05k8k40K41J86j60K02m17k19K70M2K57l57N7jq5J8M23l75p4K50j15
$$ -122 129 234 206 -34 207 393 233 435 18 -201 69 111 368 11 68 67 -18 0 423 48 -26 224 109
3243A09k24L89O3k99J67j02j77j12M60j8O6J16m21M8l4J25J1j11J63K3R2k22R7
$$ 109 -115 274 337 38 205 103 -74 -186 274 256 322 438 17 65 31 156 167 56 219 242 334 112 209
3266B09J33j65L43L2k46k15J11KR1J25l07K85j62k68K85m2J20r0J85k52n3KQ6
$$ 209 342 177 520 552 306 91 202 204 295 420 113 398 236 -32 253 211 331 241 426 174 121 123 209
3289B09N6R5q5j49L4j71p4K52J08j18J63N9k00P0Oj16K64l9k07k2K73l21L61m96
$$ 209 265 360 275 126 160 -11 -85 167 275 157 320 379 179 249 255 139 403 364 157 135 408 87 448 -48
3313d8M51m09JK22j35K30j04l6R3R4j96J44j92r3J34K36k70j11K88j45l03N27
$$ -48 403 -6 -5 217 82 312 208 172 265 359 163 307 115 22 156 392 122 11 299 154 -149 378
3335C78l41n7J65rK76k38J89j04k2j38q2L96l38J0K80o2n8jj32J15J39j98K7M46
$$ 378 37 -20 145 136 412 174 363 259 237 99 17 413 75 85 365 303 245 244 112 227 366 168 195 641
3359F41j70j13k48K0O70m16l4j55R6k86M09m15J82r1J62o9R1j98M3o9L91o1j52
$$ 641 471 358 110 130 800 384 350 195 291 5 414 -1 181 90 252 183 274 76 119 50 441 380 228
3382B28j6k51K71m83L98j96M6J94j53K66J66j31rk72J34O3r5J05R3l88J37K83
$$ 228 212 -39 232 -251 147 -49 -3 191 38 304 470 339 330 58 192 255 160 265 358 -30 107 390
3404C90m29J16k37N15l16M2J79o8lJ24j30R2k06J81P7m9j89J53l71L49M6k3l3
$$ 390 -39 77 -160 355 39 81 260 192 189 313 183 275 69 250 327 278 89 242 -129 220 266 243 210
3427B10L6k27J48L34m01K61J8l38O6J87q0p6Q6j73J25K71l64K80l05J78j16O8
$$ 210 246 19 167 501 100 361 379 41 107 294 214 138 224 51 176 447 83 363 58 236 120 188
3449A88L8l7k9J42J43j41r6j29J28k54N00j29l12L15j90n7J20pj29J96J5j75j48
$$ 188 226 189 160 302 445 304 208 79 207 -47 453 324 12 327 137 80 200 193 64 260 275 100 -48
3472d8K03k07L27j41J31o3J35Rq5j57N5K1J4Kj34n9J64j33K33l17K32N1k72L04
$$ -48 155 -52 275 134 265 202 337 346 261 104 159 180 194 196 62 3 167 34 267 -50 182 233 -39 265
3496B65k17O5k28J90J66j37N1k4M4j8O5j59q8M40n93M72k59MQ6j5R8j28L36k68
$$ 265 48 113 -115 75 241 104 155 131 175 157 222 63 -25 415 -178 294 35 39 125 110 208 80 416 148
3520A48r3j03K78o6r4l7j16N5J61R8j73M1R2l54J44k7mJ05%K51k87p8L61k32J01
$$ 148 55 -48 230 164 70 33 -83 -28 133 231 58 99 191 -163 -19 -46 -50 55 55 306 19 -59 302 70 171
3545A71p9k8M01j39n1l68J06K54l13K93l78lK87k34j32O29r4k72J70j56k5N5k08
$$ 171 92 64 465 326 275 -93 13 267 -46 247 -131 -134 153 -81 -213 416 322 50 220 64 39 94 -114
3568a14J21J8k46J51qJ38j10P8J96k38q2P2J05l4j72J11%l4J71M9J78l63j52K26
$$ -114 7 25 -221 -70 -78 60 -50 28 224 -14 -96 -24 81 47 -125 -14 -14 -48 123 172 350 -13 -165 61
3592F1o7j8L85j59k76j55M28j18j36l5K56k19m6K29j46Lq9j10k1M8m7K77pm18
$$ 61 -6 -24 361 202 -74 -229 199 81 -55 -90 166 -53 -99 130 -16 -13 -102 -212 -233 -185 -232 45 38 -380
3616c80L14J86l18K92k97Q1J3n5J19P6j44j71J23K47j50K12n95L62L1j36j00J35
$$ -380 -66 120 -198 94 -203 -122 -109 -164 -45 31 -113 -284 -161 86 -64 148 -447 -85 -54 -190 -290 -155
3638a55j31J31K08m59M14q8j12j0K58j23J29j28J98j12j7J12j73j16K56l08K60
$$ -155 -286 -155 53 -406 8 -80 -192 -202 56 -67 62 -66 132 20 3 115 -58 -174 82 -226 34
3659C4N8k43OJ27n2l1r8J61q6J55j10J04r3M8p2M0J0Jl1l87K83K5k6nQ3k95J34
$$ 34 92 -151 -145 -18 -70 -101 -199 -38 -124 31 -79 25 -68 -20 -92 -52 -42 -41 -72 -459 -176 -151 -177 -182 -99 -394 -260
3686b60L33l19O7P8j56P3J62j02r3J54j14K63j60j83J21j69P4K23j69J81k24L45
$$ -260 73 -246 -179 -101 -257 -184 -22 -124 -217 -63 -177 86 -74 -257 -136 -305 -231 -8 -177 4 -220 125
3708A25k37K0k92J37J3j02p4J90o0K49j9M4j61p6P4m7L69m86J95j6k65N8L17j95
$$ 125 -112 -92 -384 -247 -234 -336 -410 -220 -280 -31 -50 -6 -167 -243 -169 -216 153 -333 -138 -154 -419 -361 -44 -239
3732b39j58P8J04M3J99k32K6O7k43J99kJ53l2k5j11j83L90J29k73K0k12l4K63
$$ -239 -397 -319 -215 -172 27 -205 -179 -112 -355 -156 -158 -5 -37 -62 -173 -356 34 163 -110 -90 -302 -336 -73
3755g3J27o7j28j00L83l44j3M55k80r3J47k15L25q6K8k77qp8j4L03n08M03p6O2
$$ -73 54 -13 -141 -241 142 -202 -215 240 -40 -133 14 -201 124 38 66 -211 -219 -297 -311 -8 -516 -113 -189 -127
3779a27j12j83K25Q0J3R1k01m2j3R8J39j37K25M4k05J49k2k86R8m4m1M6p6N7J3
$$ -127 -239 -422 -197 -117 -104 -13 -214 -256 -269 -171 -32 -169 56 100 -105 44 22 -264 -166 -210 -251 -205 -281 -224 -211
3804b11k11L42m1j4k34J61m0l6p0M33J0j93K24l08n9Q5l8J00r9J69o4o3J9j22
$$ -211 -422 -80 -121 -135 -369 -208 -248 -284 -354 79 89 -104 120 -188 -247 -162 -200 -100 -199 -30 -94 -157 -138 -260
3828b60L54j19m4J78k5j91j92J42rk09L18j49n4j4k6K53q2j1j21J5O3O1J40l36
$$ -260 94 -25 -69 109 84 -107 -299 -157 -166 -375 -57 -206 -260 -274 -300 -47 -129 -140 -261 -246 -183 -122 18 -318
3852c18J62j23q8L93l09rK69j78Q7p6j00J13P7O1J77l42k19K32K61k16j41J32
$$ -318 -156 -279 -367 26 -283 -292 -23 -201 -114 -190 -290 -177 -100 -39 138 -204 -423 -191 70 -146 -287 -155
3874a55J31L8k78M01m92K77j99N1K27j29O4J01K19l31R1j07J39m13K90k8j5L04
$$ -155 -24 14 -264 137 -355 -78 -277 -226 1 -128 -64 37 256 -75 16 -91 48 -365 -75 -103 -118 186
3896A86n23K82j12J89k56O1J29O1m1o7K5J15m7K26l88J0J55p2p6K24j82J87j93
$$ 186 -337 -55 -167 22 -234 -173 -44 17 -24 -91 -66 49 2 228 -160 -150 5 -67 -143 81 -101 86 -107
3919a07n3L00j39Q0j37n8J53l1k19Q7j01R3k9kj92K68r5j16RJ92L39l44j79K95
$$ -107 -160 140 1 81 -56 -114 39 8 -211 -124 -225 -132 -161 -163 -355 -87 -182 -298 -289 -97 242 -102 -281 14
3943A4M1j31kj35K09j09J20J73j0n48L82n5O4P6j41q6J58j24j22M0l8J94K23l07
$$ 14 55 -76 -78 -213 -4 -113 7 180 170 -378 4 -51 13 89 -52 -138 20 -104 -226 -186 -224 -30 193 -114
3967a14p5p4K12m4k0q0nJ65k8mk21K17k21N5J73KJ69N8j67r9Qj08M2j0J09o9K75
$$ -114 -189 -263 -51 -95 -115 -195 -200 -35 -63 -67 -288 -71 -292 -237 -64 -62 107 165 -2 -101 -93 -201 -159 -169 -60 -129 146
3994A46j59o2M7j97J30j88M53k24k23J08L86l34J01J50j87K15k17m3K09l92Q1
$$ 146 -13 -75 -28 -225 -95 -283 170 -54 -277 -169 217 -117 -16 134 -53 162 -55 -98 111 -281 -200
4015b00K67M5P9k73J34PO6L2j99m7Qj28J72J70k5n7n6L68j36k20k22o7L65k0j97
$$ -200 67 112 191 -82 52 59 125 157 -42 -89 -81 -209 -37 133 108 51 -5 363 227 7 -215 -282 83 63 -134
4040a34OJ52l4J78k57J14j23K15l25K45m10L03k8jK89k36R3j47Q7qQ1k43j8L12
$$ -134 -128 24 -10 168 -89 25 -98 117 -208 37 -373 -70 -98 -99 190 -46 47 -100 -13 -21 60 -183 -201 111
4064A11l32L96k27J46M2k1j38N2Q9k41l4K10o2R6m33J14R9R2L15k71j0j19K60
$$ 111 -221 175 -52 94 136 115 -23 29 118 -123 -157 53 -9 87 -346 -232 -133 -41 274 3 -7 -126 134
4087A34J6J1k04O9J5P6l99M41j78k27J44M9m3l0J41n7O4J2Q8j59L32k90J26k52
$$ 134 150 161 -43 26 41 117 -282 159 -19 -246 -102 -53 -96 -126 15 -42 22 34 122 -37 295 5 131 -121
4111a21M31j14j89oJ98M4l0k39K71l75K80n5q6L9k6O0p3K62k96L5J5J12Nk09J79
$$ -121 310 196 7 1 199 243 213 -26 245 -130 150 95 9 48 22 82 9 271 -25 10 25 137 142 -67 112
4136A12K7l29L00p7J01J73k79k46K43r7J24N6j79J45l56M02mJ4J0R0j42J11k24
$$ 112 139 -190 110 33 134 307 28 -218 25 -72 52 108 -71 74 -282 120 116 130 140 230 88 199 -25
4159b5J30K5J90j93k02L18j50L00j20O6n8k64LN9K28j73l40K83j57L2K2K48l01
$$ -25 105 130 320 127 -75 243 93 393 273 339 281 17 20 79 307 134 -206 77 -80 -48 -26 222 -79
4182g9N22j89j03Q1l5j48j22J75j94J47J22j50K12l11K62j49m6j10N12k68m8J31
$$ -79 443 254 151 232 197 49 -73 102 -92 55 177 27 239 -72 190 41 -5 -115 397 129 81 212
4204B12k78K34N9l71L12K10k15J2j73jP4J5J70k19J21q5j36J21J11k23L18j32
$$ 212 -66 168 227 -144 168 378 163 175 2 1 75 90 260 41 162 77 -59 62 173 -50 268 136
4226A36N8O5j02R8J7k91J45q7K01k87N6J08J8M0j62k2j37J29J41l5j13J18n9K43
$$ 136 194 259 157 255 272 -19 126 39 240 -47 9 117 135 175 13 -9 -146 -17 124 89 -24 94 35 278
4250B78k70K10j87L17k18j89K58k4j35R8j03K99k89M1o4K40j64k69L79k33N04
$$ 278 8 218 31 348 130 -59 199 175 40 138 35 334 45 86 22 262 98 -171 208 -25 479
4271D79k47Q6j47J1J14o8m4k30L81l68j9L37j2l74M07r2J40j57k86J32k54N53
$$ 479 232 318 171 182 296 228 184 -46 335 -33 -52 285 273 -101 306 214 354 197 -89 43 -211 342
4293C42j82k48J07j16L43j1k11K09q3j11k08L17k42K48r4J45l36K99k75K70J92
$$ 342 160 -88 19 -97 246 235 24 233 150 39 -169 148 -94 154 60 205 -131 168 -107 163 355
4314C55n23N34k30O7p1l04J86n4J42j0j29N7J66r3j87K52k26L58o7r6j55m6j18
$$ 355 -168 366 136 203 132 -172 14 -40 102 92 -37 20 186 93 -94 158 -68 290 223 127 -28 -74 -192
4337a92L72k54K35L1K54l31O4n2k04o8L75J36l86j59J04J05l3J92L8k08J75j57
$$ -192 180 -74 161 192 446 115 179 127 -77 -145 230 366 -20 -179 -75 30 -3 189 227 19 194 37
4359C7r2j60M83k12P0J79p3k86K31r1K16j55j19nNm1m6n2L59p1k5P6j41qK37k89
$$ 37 -55 -215 268 56 126 305 232 -54 177 86 302 147 28 23 28 -13 -59 -111 248 177 152 228 87 79 316 27
4385B7P1o0o4j29qM42j72r8q2j50L43K28j15m7j78n5J63j1j64l2M7J07J72J94
$$ 27 98 38 -26 -155 -163 279 107 9 -73 -223 120 348 233 186 8 -47 116 105 -59 -91 -44 63 235 429
4409D29j52j57j60j78K41J98r1P1k57K83j93K9p4J96j37j36o7K0kL70k06R6j97
$$ 429 277 120 -40 -218 23 221 130 201 -56 227 34 63 -11 185 48 -88 -155 -135 -137 233 27 123 -74
4432g4j1L88k05k88L92M7k21J4J8j38q4J48R9l14L93J9j13k33K71L9K32j88L91
$$ -74 -85 303 98 -190 202 249 28 42 60 -78 -162 -14 85 -229 164 183 70 -163 108 147 379 191 582
4455E82k27k59j15K6n1M51l68j26K31j87o9J34P8J93k91k33L33j08l8k9K31k11
$$ 582 355 96 -19 7 -44 407 39 -87 144 -43 -112 22 100 293 2 -231 102 -6 -44 -73 158 -53
4477e3L6J48j52j65L88k20J87j62j03j55M06n9m08M10j30K48l70N4n2J44J97j01
$$ -53 -17 131 -21 -186 202 -18 169 7 -96 -251 155 96 -312 98 -32 216 -154 -100 -152 -8 189 88
4499H8m0p4K8K67m07Q9l0j2K76k7M4k77R7M21n13J66P6j93KL6k78JK46J72%j80
$$ 88 48 -26 2 269 -138 -49 -79 -91 185 158 202 -75 22 443 -70 96 172 -21 -19 17 -261 -260 -14 158 158 -22
4525b2j98K29L9L4P3j36o7p7J09K81k60K93j70J82k04J43k23k33K24K46j09j92
$$ -22 -220 9 48 82 155 19 -48 -125 -16 265 5 298 128 310 106 249 26 -207 17 263 154 -38
4547c8J9j63J26L0q2K77k41J18J18l42J08k60M16O8k78J38l09L32r8P2k7K4O4
$$ -38 -19 -182 -56 -26 -108 169 -72 46 164 -178 -70 -330 86 154 -124 14 -295 37 -61 11 -16 8 72
4570G2j06m1j27K5O9j28L45j47j60Q0N2K8J50j97j23L07J56l75l2K71Mj25L0o
$$ 72 -34 -75 -202 -177 -108 -236 109 -38 -198 -118 -66 -38 112 -85 -208 99 255 -120 -152 119 123 -2 28 22
4594B2r2j10J29k8j21J81l59M54l15P2O8r5o1K50n2j01K07p9k96K66n0q7k12N40
$$ 22 -70 -180 -51 -79 -200 -19 -378 76 -239 -167 -99 -194 -255 -5 -57 -158 49 -30 -326 -60 -110 -197 -409 131
4618A31j99J63j49J22j43k4K08n9p4K77j74n1P3j20J61j57n7j42M16m39j91M22
$$ 131 -68 95 -54 68 -75 -99 109 50 -24 253 79 28 101 -19 142 -15 -72 -214 202 -237 -428 -6
4640fj32J59k20J29k95J14QL20n9j3K7j8J87n71rL1K65J1K05k74K22k40q6K05
$$ -6 -138 21 -199 -70 -365 -251 -243 77 18 5 32 14 201 -370 -379 -348 -83 -72 133 -141 81 -159 -245 -40
4664d0K51j50m75M60L7j3Q2k70m7J42m41M99j78RJ71r9p9J22q9o2J41P1l79J33
$$ -40 211 61 -414 46 83 70 152 -118 -165 -23 -464 35 -143 -134 37 -62 -141 -19 -108 -170 -29 42 -337 -204
4688b04p3K08M6m4K11k32K26Mj58j65n4J60m2P0j95n2M9K34j0j15K49j41j64J67
$$ -204 -277 -69 -23 -67 144 -88 138 142 -16 -181 -235 -75 -117 -47 -242 -294 -245 -11 -21 -136 113 -28 -192 -25
4712b5k4j1Q2l7j89N4k62N63q4p9n8J2k09K49L5j17J12L0r0k25K69K20o16L31
$$ -25 -49 -60 22 -15 -204 -150 -412 151 67 -12 -70 -58 -267 -18 17 -100 12 42 -48 -273 -4 216 -400 -69
4736f9j30K65p4j35K03q9J01j5p9L28l76K51k08J43k75N9QK06k60l7R7j43N3K13
$$ -69 -199 66 -8 -143 60 -29 72 57 -22 306 -70 181 -27 116 -159 -100 -92 114 -146 -183 -86 -229 -176 37
4760C7l69N20q1l72J37n7K71o7j32L5N4q7KJ37j7n8n2j6Q8Q5j43k52J14J06k53
$$ 37 -332 188 107 -265 -128 -185 86 19 -113 -78 -24 -111 -109 28 11 -47 -99 -115 -27 58 -85 -337 -223 -117 -370
4785c70L4N21k28q6j2J8j82J60L42m60K58j73LK5K57Kq2n1O6%J78l00j7R3j44
$$ -370 -336 185 -43 -129 -141 -123 -305 -145 197 -263 -5 -178 -175 -150 107 109 27 -24 42 42 220 -80 -97 -4 -148
4810a48K00J16j39l2M9j62o4K98qn4k93j0K58lj9k09K45R6j61L18l18J20k43J68
$$ -148 52 168 29 -3 46 -116 -180 118 110 56 -237 -247 11 8 -11 -220 25 121 -40 278 -40 80 -163 5
4834Ep5m7J98p0m6J37l73K72K78l41k17K55K91n74N01j80n8J7k77K56Q0pM4j29
$$ 5 -70 -117 81 11 -35 102 -271 1 279 -62 -279 -24 267 -307 194 14 -44 -27 -304 -48 32 25 69 -60
4858f0J11L3k59jJ97K99j03j10j22n2l9L7k11K77j12L57k92k51J14O5J64oJ1j55
$$ -60 51 84 -175 -176 21 320 217 107 -15 -67 -106 -69 -280 -3 -115 242 -50 -301 -187 -122 42 36 47 -108
4882a08j00J16K09m6o5k3j83L06K4n6k78J7j3L80J28m76L21k76J7R4O6m4J46k68
$$ -108 -208 -92 117 71 6 -17 -200 106 130 74 -204 -187 -200 180 308 -168 153 -123 -106 -12 54 10 156 -112
4906a12L0J91j53J86k38kJ28j5J33n06J88N5M52m66j61J86j4K67k46K99k68R5
$$ -112 -82 109 -44 142 -96 -98 30 15 148 -358 -170 -115 337 -129 -290 -104 -118 149 -97 202 -66 29
4928B9J48K34o98K85Nr8o8p3L08K1o3j68m1K70j89N3LJ16j74P6q3J97o4n4k19
$$ 29 177 411 -287 -2 3 -95 -163 -236 72 93 30 -138 -179 91 -98 -45 -42 74 -100 -24 -107 90 26 -28 -247
4953b47K91m3jM8p1J77J0l74L66j37J26k61R9J87nJ8m08M98l43K59k42K61j85
$$ -247 44 1 0 48 -23 154 164 -210 156 19 145 -116 -17 170 165 183 -225 273 -70 189 -53 208 23
4976B3j75J74j24K52k43MJ2J62j71P8J26n7j66J2J24N0K11n07K37M3j0M2L11n14
$$ 23 -152 22 -102 150 -93 -89 -77 85 -86 -8 118 61 -105 -93 31 81 292 -215 22 65 55 97 408 -106
5000a06K32J39n00L86K9k41RR0j72N15m18j59K86M8l59O8RK43kK0k55j88K59M3
$$ -106 126 265 -235 151 180 -61 -52 38 -134 381 -37 -196 90 138 -221 -153 -144 99 97 117 -138 -326 -67 -24
5024b4q6J67q4q3L69m26J9L07m1k27K72k10m6J37r2J00J46k86J25J79n6l3J8l80
$$ -24 -110 57 -27 -110 259 -167 -148 159 118 -109 163 -47 -93 44 -48 52 198 -88 37 216 160 127 145 -235
5048b35K9O1Q9L8J86k25M0M1n4J39N5j13k69M35j2l83J04J67R5l58L19j05p0O3
$$ -235 -206 -145 -56 -18 168 -57 -17 24 -30 109 164 51 -218 217 205 -178 -74 93 188 -170 149 44 -26 37
5072C7k41L60n31L47L8k89K65j23K85m47L57n4j5M3K05Q3m80K47K65m00K34j82
$$ 37 -204 156 -375 -28 10 -279 -14 -137 148 -299 58 4 -11 32 237 320 -160 87 352 -48 186 4
5094Dj6J13NJ29j73j27J15l10L70k27K3K49k28J65k7p7j27K47j25m4M6pL52m20
$$ 4 -12 101 106 235 62 -65 50 -260 110 -117 -94 155 -73 92 65 -12 -139 108 -17 -61 -15 -22 330 -90
5118i0M0M2K38n08M29l87N22j70j16oR1k42J20K91j54m6j2m2p4L29k7k77J0k18
$$ -90 -50 -8 230 -278 151 -236 286 116 0 -6 85 -157 -37 254 100 54 42 0 -74 255 228 -49 -39 -257
5142b57m3N39j42L40n35J82K9l9j19M6J99k86K23O4j51n8J62k63L0Q1j6K7j33
$$ -257 -300 239 97 437 -98 84 113 74 -45 1 200 -86 137 201 50 -8 154 -109 -79 2 -14 13 -120
5165a20J62k13J84K3j96L32p0m7kO2l12K46j20J98j91K55k97O7J47J83j19k73
$$ -120 42 -171 13 36 -160 172 102 55 53 115 -197 49 -71 127 -64 191 -106 -39 108 291 172 -101
5187a01mJ87R6k9R7l96J66Pj50J39j49J09L78k37k8k88J63O3n5k07M93mj15k30
$$ -101 -105 82 178 149 246 -150 16 23 -127 12 -137 -28 350 113 85 -203 -40 23 -32 -239 254 250 135 -95
5211i5J40J35l30K40q5R1p4M8M2O0k20n5L22k77jJ0l16L50k50L35k01K67%j71
$$ -95 45 180 -150 90 5 96 22 70 112 172 -48 -103 219 -58 -59 -49 -365 -15 -265 70 -131 136 136 -35
5235c5o1m1q8K43j16K63j60n0K87l01K51r1r5L25k73l0J53j41J36n4m45N45l00
$$ -35 -96 -137 -225 18 -98 165 5 -45 242 -59 192 101 6 331 58 28 181 40 176 122 -323 222 -78
5258g8K8L5O5n4J71j1k1Qj4R7j34O6J5j45P6J04m1k12J49l48L00J91k1j53k58
$$ -78 -50 -15 50 -4 167 156 135 143 129 226 92 158 173 28 104 208 167 -45 104 -244 56 247 226 73 -185
5283a85N86l73N1M9l2K19m45J62K8k60K24J50l60K03K34nn00M51M2l76P0J23k6
$$ -185 401 28 79 128 96 315 -130 32 60 -200 24 174 -186 17 251 246 -254 197 239 -137 -67 56 30
5306C0J88k30o4l7J82M6k5J06j61L66n81J79L06l58L4J36k9kJ9k57K83j61J57
$$ 30 218 -12 -76 -113 69 115 90 196 35 401 -180 -1 305 -53 -19 117 88 86 105 -152 131 -30 127
5329A27J33l36q0R4M19l48P4j1n3n20P21k32j06K01J73n22K9N3L53n9j89K57k75
$$ 127 260 -76 -156 -62 357 9 83 72 19 -501 220 -12 -118 83 256 -266 -237 -184 169 110 -79 178 -97
5352i7K66l36M8K32P3j89K9K40l27J88J62n08L48o7pj12M44l40k7J75n8j13R0
$$ -97 169 -167 -119 113 186 -3 26 266 -61 127 289 -219 129 62 55 -57 387 47 20 195 137 24 114
5375A14j68K65j02r8l3P4l43K43j89J11J53NJ9J49j34K66l42P7j41m7N18l41J76
$$ 114 -54 211 109 11 -22 52 -291 -48 -237 -126 27 32 51 200 66 332 -10 67 -74 -121 397 56 232
5398B32j86k1K66k57l14L74n1K4j98L44j20j06j04j36M9j31O12l19L5K41j98Q5
$$ 232 46 25 291 34 -280 94 43 67 -131 213 93 -13 -117 -253 -204 -335 277 -42 -7 234 36 121
5420A21k96O6N8N1J8J64m6J45j42j58o8J24j18Q5r7L1K65p6l73L66J43k95J17
$$ 121 -175 -109 -51 0 18 182 136 281 139 -19 -87 37 -81 4 -93 -62 203 127 -246 120 263 -32 85
5443H5m7L36n43M01k83n3r2O7J74m9J91m1J86l23P1k18K55l38K73q7k5M9j26K60
$$ 85 38 374 -169 232 -51 -104 -196 -129 45 -4 187 146 332 9 80 -138 117 -221 52 -35 -60 -11 -137 123
5467A23k74L58M8k48k30K94l11P7K89l40L03p7o8k81K34K76j56J68k41K64k46
$$ 123 -151 207 255 7 -223 71 -240 -163 126 -214 89 12 -56 -337 -103 173 17 185 -56 208 -38
5488c8J33k54J42J18o9J9jJ66p3k15Q7mmn1k25L71j86j56J47M66m20p4J40k8m2
$$ -38 95 -159 -17 101 32 51 50 216 143 -72 15 11 7 -44 -269 102 -84 -240 -93 373 -47 -121 19 -9 -51
5513e1J89J87l04k5J17J37k31NR4k59M25l74j24K27K02p54M96M4j14N6J39k8J3
$$ -51 138 325 21 -4 113 250 19 24 118 -141 284 -90 -214 13 215 -539 -43 1 -113 -57 82 54 67
5536F7J60k55j0J17r3r7L43k24j3l6K08k31j57J53k7L65j0n19M87l6m14L05J13
$$ 67 227 -28 -38 79 -14 -111 232 8 -5 -41 167 -64 -221 -68 -95 270 260 -259 228 192 -222 83 196
5559A96k67K76l70Q6K34Q3k23l22L49j93J43j38J87l42L80j36M4J5N7n1j72K38
$$ 196 -71 205 -165 -79 155 238 15 -307 42 -151 -8 -146 41 -301 79 -57 -13 2 59 8 -164 74
5581G4Kj84J84p8j22j58J07j68M10j76m2m24M64K01l86L29L9k9j28K74j87j90
$$ 74 76 -108 76 -2 -124 -282 -175 -343 67 -109 -151 -575 -111 90 -296 33 72 43 -85 189 2 -188
5603a88J93j02J1N2K09k89j62O00j54n8j68j48J06L66m22O2J65O5oj50j54L05
$$ -188 5 -97 -86 -34 175 -114 -276 324 170 112 -56 -204 -98 268 -154 -92 73 138 132 -18 -172 133
5625A33o9pJ8K2m2j32j98O0l5L64k70o6L87k46NK41J0l43J34j38J56J82l05K84
$$ 133 64 57 75 97 55 -77 -275 -215 -250 114 -156 -222 165 -81 -76 165 175 -168 -34 -172 -16 166 -139 145
5649A45l88K62O5k83J45L87j05l24J34K40k79k33M00m12J12L17m01K52m8p7J77
$$ 145 -243 19 84 -199 -54 333 228 -96 38 278 -1 -234 166 -246 -134 183 -218 34 -14 -91 86
5670H6m4k07Q8K1j28M26k68J36k78Rj75L41j14r7J18k15K29K08j83N4R7k7l46
$$ 86 42 -165 -77 -56 -184 242 -26 110 -168 -159 -334 7 -107 -204 -86 -301 -72 136 -47 7 104 77 -269
5693b69L57l00l8P2R7N1m2m6K19j14j62J3n8J91j99J70%k25L93m14L77k9k4n8
$$ -269 88 -212 -250 -178 -81 -30 -72 -118 101 -13 -175 -162 -220 -29 -228 -58 -58 -283 110 -304 73 44 20 -38
5717c8J57n7J08l40K02K2j67J51k91J52J12J15k88J96j63j62M37J2J0j93J0l50
$$ -38 119 62 170 -170 32 54 -113 38 -253 -101 11 126 -162 34 -129 -291 146 158 168 -25 -15 -365
5739c65L00J71K98k57l39J83n4rk09K84J62l36K76j94N4k2l8k19P9M05j46lk09
$$ -365 -65 106 404 147 -192 -9 -63 -72 -281 3 165 -171 105 -89 -35 -57 -95 -314 -235 170 24 21 -188
5762a88M27l47o0L28m29J71l2%J14l9K4jl2J04j64R2j63J05K36j30J40l00M0j47
$$ -188 239 -108 -168 160 -269 -98 -130 -130 -16 -55 -31 -32 -64 40 -124 -32 -195 -90 146 16 156 -144 -104 -251
5786b51M31k72K2K62j68k20jL96k00K1k87M47N3l78K7J72j33J00p7j15l2N49l83
$$ -251 180 -92 -70 192 24 -196 -197 199 -1 20 -267 180 233 -145 -118 54 -79 21 -56 -171 -203 346 -37
5809c7J73k32J66j02r5M9M0n0K47m10J11J7p3J48m2K00k39J71K13q0j98j37L15
$$ -37 136 -96 70 -32 -127 -78 -38 -88 159 -251 -140 -123 -196 -48 -90 110 -129 42 255 175 -23 -160 155
5832A55q6j51K17r3R7j13j1J07j35K2M06l45j4O1Mj80q2M5L27j57j19p7QL07k84
$$ 155 69 -82 135 42 139 26 15 122 -13 9 415 70 56 117 121 -59 -141 -96 231 74 -45 -122 -114 193 -91
5857i1K01M1k41J14k36K8N13j28m51J10K92j49n0K7k36j4L06L6R6j07m31N25k67
$$ -91 110 151 -90 24 -212 -184 329 201 -250 -140 152 3 -47 -20 -256 -270 36 72 168 61 -370 155 -112
5880a12K11m08J09M11k24j22J62K14m73O9O60o94L77o1j7j52m4mJ32K3K7J43j76
$$ -112 99 -309 -200 211 -13 -135 27 241 -232 -163 497 -197 180 119 102 -50 -94 -98 34 57 84 227 51
5903E1p9oL02l7q0j64p7L61k91n4M7j08q8K35m9L56l87R5j10q6l3L66J12l55K72
$$ 51 -28 -34 268 231 151 -13 -90 271 -20 -74 -27 -135 -223 12 -37 319 -68 27 -83 -169 -202 164 276 -79 193
5928A93k16r4J96j31J45K4l09K0L91k03J64o3k59L2L61j61RJ86j77q4o4J8j95
$$ 193 -23 -117 79 -52 93 117 -192 -172 219 16 180 117 -142 -110 251 90 99 285 108 24 -40 -22 -217
5951b17L9K84l50N01l42L32k09j25K17k03J35j87K80k32k4q1L57k7O8o4J35o36
$$ -217 -178 106 -244 257 -85 247 38 -87 130 -73 62 -125 155 -77 -101 -182 175 148 216 152 287 -349
5973c49L69q5K19j21N0j63R6j24L46k61m0J87k2J23k42K45m28M03m6m02J64J44
$$ -349 20 -65 154 33 83 -80 16 -108 238 -23 -63 124 102 225 -17 228 -200 203 157 -245 -81 63
5995F3k04L67n48L03l7J76j85O9R2o6k98L28L4j75K15J73k03j22j18J3J10j34
$$ 63 -141 226 -322 -19 -56 120 -65 4 96 30 -268 60 94 -81 134 307 104 -18 -136 -123 -13 -147
6017a47NK22J77l77J66j65K83l05J10n3q2PN8k4K15J7q6j90Q9p9L25k63J1J58
$$ -147 -142 80 257 -120 46 -119 164 -141 -31 -84 -166 -159 -101 -125 90 107 21 -169 -80 -159 166 -97 -86 72
6041G2R0j72N9O6m3o9J1m8J97J56m93K02Q3j95P1j15l9J12j51l1M43k46r3J1M71
$$ 72 162 -10 49 115 72 3 14 -34 163 319 -174 28 111 -84 -13 -128 -167 -55 -206 -237 206 -40 -133 -122 349
6066C49m87K70J16j77Kj01J39k0K48n36P3L90k88R3r1K60l34R4j22M1J33Q6j93
$$ 349 -138 132 248 71 73 -28 111 91 339 -197 -124 266 -22 71 -20 240 -94 0 -122 -81 52 138 -55
6089e5M5J90k95J68j76L86l52L5K72j95k61M99m4m4k65J12k61K13Pj92L98j52
$$ -55 -10 180 -115 53 -123 263 -89 -54 218 23 -238 261 217 173 -92 20 -241 -28 -21 -213 185 33
6111C3N5p2r9K67o1L1k32O6K78j60n9O1PP8r2r1oK29k39O1p1qJ24Q4l23j03M01
$$ 33 88 16 -83 184 123 154 -78 -12 266 106 47 108 115 193 101 10 4 233 -6 55 -16 -24 100 184 -139 -242 159
6138A59k88K21j6j7l1k5k71J0K85M8k24p0M62k62K80k13P0p0M8Q6j34q5j69L84
$$ 159 -129 92 76 59 28 3 -268 -258 27 75 -149 -219 243 -19 261 48 118 48 96 182 48 -37 -206 178
6162A78k05j22J16K08n43M36o9k41J25Q2j58P3K04o4j39j7J24K90r1l9j19j77
$$ 178 -27 -149 -33 175 -368 68 -1 -242 -117 -35 -193 -120 84 20 -119 -136 -12 278 187 148 29 -148
6184a48J88L60k17K14J5l96J6J01k60J24o1J02L8M6m70N02j86J38n1j94J82j5
$$ -148 40 400 183 397 412 16 32 133 -127 -3 -64 38 76 122 -348 154 -32 106 55 -139 43 28
6206B8j16j22L15l22L17L9o7k52J3J82k25L32J88j42k89J94J76j89J00J5j66J62
$$ 28 -88 -210 105 -217 100 139 72 -180 -167 15 -210 122 310 168 -121 73 249 60 160 175 9 171
6228A71p5k54k7K35Q9l65L81j19K65k26j22K40k37q3J50J91l25K3m3P5l1j04J09
$$ 171 96 -158 -185 50 139 -226 155 36 301 75 -47 193 -44 -127 23 214 -111 -88 -131 -56 -87 -191 -82
6251h2K0j3J65M2k65K04j15J20k43K02M9k38l6J8Q4K38j95J51k71J54O0P4P0j71
$$ -82 -62 -75 90 132 -133 71 -44 76 -167 35 84 -154 -190 -172 -88 150 -45 106 -165 -11 49 123 193 22
6275B2q1k1K06k7qJ30k63Q9j70L57j94K36j88N1k5M8n9j53rj59K67j75L9L69m8
$$ 22 -59 -80 126 99 91 221 -42 47 -123 234 40 276 88 139 114 162 103 -50 -59 -218 49 -126 -87 282 234
6300B34j63k74K55oq8P6J04j44j01%J77l30M87l15J17l4j2nK16l22m2J48j7L7
$$ 234 71 -203 52 46 -42 34 138 -6 -107 -107 70 -260 227 -88 29 -5 -17 -22 194 -128 -170 -22 -39 -2
6324bk35L01J8J93m35J93j68K57q2m4P5N8k79K51j83j01K16k63J17K78m47M12
$$ -2 -237 64 82 275 -160 33 -135 122 40 -4 71 129 -150 101 -82 -183 33 -230 -113 165 -282 130
6346A30k30m1L10Kl85K47j1k15KK45K5Pl81N84k55j34K80l03q4L5k8L67l21L15
$$ 130 -100 -141 169 171 -214 33 22 -193 -191 54 79 86 -295 289 34 -100 180 -123 -207 -172 -200 167 -154 161
6370A61m6k53J25j25L97l15J36m9k45J7Q5J39l20L54j20J99r9n4L7mr4K5K30l12
$$ 161 115 -138 -13 -138 259 -56 80 31 -214 -197 -112 27 -293 61 -59 140 41 -13 24 20 -74 -49 181 -131
6394a31o9K40L4j87J28L4l5k81L11L9j86M12k79j2K2j27p2n0L41j50n6K40m35
$$ -131 -200 40 74 -113 15 49 14 -267 44 83 -103 309 30 18 40 -87 -159 -209 132 -18 -74 166 -269
6417b69L49j44n0Q1l20L14k3L1J10k81K02j95K20n3l3K25j28N9n3r2M6j42J40
$$ -269 80 -64 -114 -33 -353 -39 -62 -31 79 -202 0 -195 25 -28 -61 164 36 95 42 -50 -4 -146 -6
6440fJ27l43K82l6l30M03P4k29J40j01J55J23R3k96l08J74j9J86lm2n9j02k10
$$ -6 121 -222 60 24 -306 97 171 -58 82 -19 136 259 352 56 -252 -78 -97 89 86 44 -15 -117 -327
6463c27L97j46q3J12k08JJ21K78k25M6o9J76j11O7O2J70j23l2k82q7M46k53J40
$$ -327 70 -76 -159 -47 -255 -254 -133 145 -80 -34 -103 73 -38 29 91 261 138 106 -176 -263 183 -70 70
6486G0p5J70l46o4J41R8M44q48J92N7J37J04k41L15J37r1k88O26p82J94O8j94
$$ 70 -5 165 -181 -245 -104 -6 438 -410 -218 -161 -24 80 -161 154 291 200 -88 538 -244 -50 18 -176
6508a76J81l6M9m47O04j70j79J66R3r8RK2j05k55K67r4M43k37pj20m5K34k72K34
$$ -176 5 -31 18 -429 175 5 -174 -8 85 -13 -4 18 -87 -342 -75 -169 274 37 30 -90 -135 99 -173 61
6532F1R2j14J96m17M2J39J76j85l5Q8k6r4L62k71r6R8l7J02j59P9L4K15j59q1
$$ 61 153 39 235 -182 -140 -1 175 -10 -45 43 17 -77 285 14 -82 16 -21 81 -78 1 35 250 91 10
6556A0j83J85N6j58L13j23m76J88J09%R3qm7p3M8m7L11j88j56J89r1L4L54j32
$$ 10 -173 12 68 -90 223 100 -376 -188 -79 -79 14 6 -41 -114 -66 -113 198 10 -146 43 -48 -14 340 208
6580B08k45o8K47o3k56J97k43k8J93j31J72k22J72J8M0p9P3J84o3rJ16m85L13
$$ 208 -37 -105 142 79 -177 20 -223 -251 -58 -189 -17 -239 -67 -49 -9 -88 -15 169 106 97 213 -272 41
6603D1J9L2Q5j96K09j33n5K2L5j90J76J01j99J93j66k37K77J60j29r3P9K01j60
$$ 41 60 92 177 -19 190 57 2 24 59 -131 45 146 -53 140 -26 -263 14 174 45 -48 31 232 72
6626G2o4K9n8J5kj43J58m0K46k26p4Q8L6j82K29J49j89j01P5j7j11L72Pk41j50
$$ 72 8 37 -21 -6 -8 -151 7 -33 213 -13 -87 1 37 -145 84 233 44 -57 18 1 -110 262 269 28 -122
6651a22J88j94k6J83r6Rj89L09n4O7mp4m4m5lk4J64Q3r1l12K23nj4P2o3r9J29
$$ -122 66 -128 -154 29 -67 -58 -247 62 8 75 71 -3 -47 -92 -95 -119 45 128 37 -275 -52 -57 -71 1 -62 -161 -32
6678c2o2j37N79k76k42K44J1p8j07N0o6n0Q8p9O2K99p5k74J12O0r2J57J08l62
$$ -32 -94 -231 348 72 -170 74 85 7 -100 -50 -116 -166 -78 -157 -95 204 129 -145 -33 27 -65 92 200 -162
6702a62L5K40k14N20n11K87j93l13M53m8l16L95k03l0k42K34K43k2k95R7K98j42
$$ -162 -127 113 -101 419 -92 195 2 -311 142 94 -222 173 -30 -60 -302 -68 175 153 -142 -45 253 111
6724A11p3l4K72k40k54M62j42P7K6k57j29J01j51M82k41j31K2K24J91j79j80J22
$$ 111 38 4 276 36 -218 244 102 179 205 -52 -181 -80 -231 251 10 -121 -99 125 316 137 -43 79
6746G9q3l39L64j08J18L8J01l34J09J05j08K37l04p7K04j40J89J36k63j9Q0Pm9
$$ 79 -4 -343 21 -87 31 69 170 -164 -55 50 -58 179 -125 -202 2 -138 51 187 -76 -95 -15 -8 -57
6769e7M65l04j2k21p4K98J03l44K11K9l7j55J51j22K22j47j20J75p1Q1j30N0m0
$$ -57 408 104 92 -129 -203 95 198 -146 65 94 57 -98 53 -69 153 6 -114 61 -10 71 -59 -9 -49
6792d9J97q5j50J09M0j34L6N3N2p6j1J34j15N0K15k30k88N00J74n74K3K67j18
$$ -49 148 63 -87 22 62 -72 -36 17 69 -7 -18 116 1 51 266 36 -252 248 422 -152 -129 138 20
6815B0kK03l68n0l9q5K68j0J53k93J93p1j41K87k80M32k25J43p0l31J37K10K4
$$ 20 18 221 -147 -197 -236 -321 -53 -63 90 -203 -10 -81 -222 65 -215 217 -8 135 65 -266 -129 81 105
6838A05m2lj10k0O3R6L8l60L53k08j85K65k84P4J01J34n6K08p0M3j18K4R9L9j41
$$ 105 63 60 -50 -70 -7 89 127 -233 120 -88 -273 -8 -292 -218 -117 17 -39 169 99 142 24 48 147 186 45
6863D5N5j55J77J11k98K14k0j31J57r8k2q8j0j48L00j78j39K70p6l2P7j55j8L64
$$ 45 100 -55 122 233 -65 149 129 -2 155 57 35 -53 -63 -211 89 -89 -228 42 -34 -66 11 -144 -162 202
6887B02k32L26l38j89L33k20K48k25J87J42k36M2O0l0o0j6j51P2M25l80j78L24
$$ 202 -30 296 -42 -231 102 -118 130 -95 92 234 -2 40 100 70 10 -6 -157 -85 340 -40 -218 106
6909A06j0l11M0K3J6q6Q2M0L61k19k62M39l96J14K48k96lQ2K48K4q8o7j1l13N93
$$ 106 96 -215 -175 -152 -136 -222 -140 -100 261 42 -220 219 -177 -63 185 -111 -114 -32 216 240 152 85 74 -239 354
6934C54m30L5j0OOK5J08K4j53k14J60Q1j13K86k34J68o0R2j63J34r4O4p3LK54
$$ 354 -76 -41 -51 -45 -39 -14 94 118 -35 -249 -89 -8 -121 165 -69 99 39 131 -32 102 8 72 -1 2 256
6959B56m51K44J06O9r0l9j92Q4j71J94Q7J28j40R3l64J23j69M77j02k13r5K46
$$ 256 -195 49 155 224 134 95 -97 -13 -184 10 97 225 85 178 -186 -63 -232 245 143 -70 -165 81
6981H1j68R6R2j40k2J56j71J54j75j68J16J81P6j1m8K18m87L49k97K70k76J13
$$ 81 -87 9 101 -39 -61 95 -76 78 -97 -265 -149 32 108 97 49 267 -220 129 -168 102 -174 -61
7003f1q8J66M5j72j9M04K29o46M16j69k9j36N8L3k1oj06J25k64M50j30k03L74
$$ -61 -149 17 62 -110 -129 275 504 -142 274 105 76 -60 -2 31 10 4 -102 23 -241 209 79 -124 250
7026B50l98L99k72Q8qJ11j26M2J42k66j70K05M0j06J53k02L07j56J25j14J2k01
$$ 250 -148 251 -21 67 59 170 44 86 228 -38 -208 -3 37 -69 84 -118 189 33 158 44 56 -145
7048a45Q1Q1l07K8N1P0K1J71j09J24j01R0P2j66j36P2J48N2j76K56k54J44j17
$$ -145 -64 17 -290 -262 -211 -141 -120 51 -58 66 -35 55 127 -39 -175 -103 45 97 -79 177 -77 67 -50
7071e0J06O7q4j5J52l60R2pQ5p8N1K00l60J64o8J72l3M5n4m5P1q3M44o84K23M1
$$ -50 56 123 39 24 176 -184 -92 -99 -14 -92 -41 159 -201 -37 -105 67 34 79 25 -20 51 -32 412 -272 -49 -8
7097hOM6P8l5k21M9j99J95L47q0j95J18k34k4K66n6J58p7p3O1j80J98Q6m14J58
$$ -8 -2 44 122 87 -134 -85 -284 -89 258 178 -17 101 -133 -157 109 53 211 134 61 122 -58 140 226 -188 -30
7122c0N1J71k66J02l6R4j20p0P7kK40m25mK80j24K03j84Q2L2j25J23J6n0k17J29
$$ -30 21 192 -74 28 -8 86 -34 -104 -27 -29 211 -214 -218 62 -62 141 -43 39 71 -54 69 85 35 -182 -53
7147e3K2l67M74j29%%p9J63q3J69J41n9r3Q0m20L14n5J34k23n6J24r4KJ39P6m17
$$ -53 -31 -398 76 -53 -53 -53 -132 31 -52 117 258 199 106 186 -234 80 25 159 -64 -120 4 -90 -88 51 127 -290
7173b90L03J31k53L44l7k2J22n7k21J91m30J68J09j84J50J43k45J09N8m54N0L35
$$ -290 13 144 -109 235 198 176 298 241 20 211 -219 -51 58 -126 24 167 -78 31 89 -365 -315 20
7195B0j77l5P9K12j24K53l01K94n27K35L78k87p5J79j96j40J1J6L03n5kj99Q4
$$ 20 -157 -192 -113 99 -25 228 -73 221 -306 -71 307 20 -55 124 -72 -212 -201 -185 118 63 61 -138 -54
7218e4N1k50L70l64K37J93k51J75r0J51l73pL33j87J10K5J98j81j90J14l70J85
$$ -54 -3 -253 117 -247 -10 183 -68 107 17 168 -205 -212 121 -66 44 69 267 86 -104 10 -360 -175
7240a75N7J54O3J51k33R0j06Kj57R1P2J50J5j22j73N3L79j8l77K31k0j26qk96
$$ -175 -118 36 99 250 17 107 1 3 -154 -63 9 159 174 52 -121 -68 311 293 -84 147 127 1 -7 -303
7264c03N78l66K82k60K8j48L26r6r7p0l61M43j77N6K29k24J21p5K4J92q1o9j0
$$ -303 275 -91 191 -69 -41 -189 137 41 -56 -126 -487 -44 -221 -165 64 -160 -39 -114 -90 102 21 -48 -58
7287e8j2j08J35K34k68M4J90q8J92j85j70J31K96k79j59K27l25M72l69k7oJ86
$$ -58 -70 -178 -43 191 -77 -33 157 69 261 76 -94 37 333 54 -105 122 -203 269 -100 -127 -133 53
7309E3j91L82l03R0J52m41J80L7p7K8M93o72O43l39k35J81J1J13m75K26R4O5k26
$$ 53 -138 244 -59 31 183 -258 -78 -41 -118 -90 403 -269 374 35 -200 -19 -8 105 -370 -144 -50 15 -211
7332b11L25k13M25m31J41K92n71L13j9K8o8K93m23K80pj16O5J65k65K65k34p4
$$ -211 114 -99 326 -105 36 328 -243 70 51 79 11 304 -119 161 154 38 103 268 3 268 34 -40
7354d0po6j1J64j78p0L12j10J90j82l4n4L60k44l9p8J78R6o8l52L44j10j46k13
$$ -40 -47 -113 -124 40 -138 -208 104 -6 184 2 -32 -86 274 30 -9 -87 91 187 119 -233 111 1 -145 -358
7378c58L57n3J51K42l72L1K03k66J18o6l84K12M42j02k13q1k7NJ58K0j93J72m18
$$ -358 -1 -54 97 339 -33 -2 201 -65 53 -13 -397 -185 257 155 -58 -139 -166 -161 -3 17 -176 -4 -422
7401d22M34j75J57j3J23k55j92M36k5j36K09j31j18J50q8K54Jk28k09M79k26k7
$$ -422 12 -163 -6 -19 104 -151 -343 93 68 -68 141 10 -108 42 -46 208 209 -19 -228 251 25 -2
7423bM9j90J73mJ46n4m79P1J17J23N1O0o0q8N3P0K7J86j14j13J39k78L9M3Q4J3
$$ -2 47 -143 30 26 172 118 -361 -290 -173 -50 1 61 1 -87 -34 36 63 249 135 22 161 -117 -78 -35 49 62
7449F2k34j13N34k16J42lk40K54m8j25K8l7J06L6j47j43K01qJ6N7J17k89L2K59
$$ 62 -172 -285 249 33 175 172 -68 186 138 13 41 4 110 146 -1 -144 57 49 65 122 239 -50 -18 241
7473B41L5j78N9l65R1J81j90K51k95O4K77P0l58j01R4J86k37N45k15q5q5J58l63
$$ 241 276 98 157 -208 -117 64 -126 125 -170 -106 171 241 -117 -218 -124 62 -175 370 155 70 -15 143 -220
7496b20K1J91p8q3L07k43O4p4J38RK4j24K81l92R3L52J31l67l4j04P4Kk49L45
$$ -220 -199 -8 -86 -169 138 -105 -41 -115 23 32 56 -68 213 -179 -86 266 397 30 -4 -108 -34 -32 -281 64
7520F4m2L5j15OK53l05kM13k01K44n82L16j59K76J83q06K34J57K63k00j83L5J40
$$ 64 22 57 -58 -52 201 -104 -106 307 106 350 -232 84 -75 201 384 -422 -188 -31 232 32 -151 -116 24
7543B4L05j08k23JN4j32j10J41J78K00m93K39o2K0j58m3J21N4j99K50Qk52J47
$$ 24 329 221 -2 -1 53 -79 -189 -48 130 330 -163 76 14 34 -124 -167 -46 8 -191 59 67 -185 -38
7566c8P5j00O6J9j51L7n8l1J52K17k08k0M6M4k85K76k71J4K99j43K3K26l85ON3
$$ -38 37 -63 3 22 -129 -92 -150 -181 -29 188 -20 -40 6 50 -235 41 -230 -216 83 -60 -37 189 -196 -190 -137
7591a37J33N5k19M8N4J66J67l66K43r5l84M43j27L57k62j06k4r4J50K20k21J31
$$ -137 -4 51 -168 -120 -66 100 267 -99 144 49 -335 108 -19 338 76 -30 -54 -148 2 222 1 132
7613A32J34j16m07L70k17K92k94l1K42j47L7j00R1O4J3J44k20J2j31j8n5K41k07
$$ 132 266 150 -257 113 -104 188 -106 -137 105 -42 -5 -105 -14 50 63 207 -13 -1 -132 -150 -205 36 -171
7636a71K00j8j36j03K80K19j13k11o2j4L08k47j06l6L02l7k5j40K61n6o7J49j60
$$ -171 29 11 -125 -228 52 271 158 -53 -115 -129 179 -68 -174 -210 92 55 30 -110 151 95 28 177 17
7659A7p7n1K21k65J65M1j21k52N28l30J48l27M53n53K89J32r1R2r1J44K07m85
$$ 17 -60 -111 110 -155 10 51 -70 -322 206 -124 24 -303 150 -403 -114 18 -73 19 -72 72 279 -206
7681b06L40j45Q0l57K74K46k38j8L38l06q5N10m90K54l26K93j91J75k09j61K24
$$ -206 134 -11 69 -288 -14 232 -6 -24 314 8 -77 433 -57 197 -129 164 -27 148 -61 -222 2
7702BJ4J23o5k29K59J02k60J96k17RL6qn6K36l45Q9J41J14k55J69O4K14m02oM4
$$ 2 16 139 74 -155 104 206 -54 142 -75 -66 -30 -38 -94 142 -203 -114 27 141 -114 55 119 333 -69 -75 -31
7727c1K33k57q5N9j0j4K15k24L37j18j63l5K09J26l50L36k91j80K94k9q6J91l41
$$ -31 202 -55 -140 -81 -91 -105 110 -114 223 105 -58 -93 116 242 -108 228 -63 -243 51 22 -64 127 -214
7750b14J48L7k4J02q1J02j82J93Q9K2k24p5K54j4N5j23J04j73p2l6M2K68j34k9
$$ -214 -66 -29 -53 49 -32 70 -112 81 170 192 -32 -107 147 133 188 65 169 -4 -76 -112 -70 198 64 35
7774C5k56J25J63k51K47m4K32l51K3R5j08J68k47K07J51m17J81L4J09J05j23k51
$$ 35 -221 -96 67 -184 63 19 251 -100 -77 18 -90 78 -169 38 189 -228 -47 -13 96 201 78 -173
7796a73L74l61Q7M1K02l7j08J2j3m2j63%k8K61J83k06J53j16k49L08k4J08m48
$$ -173 201 -160 -73 -32 170 133 25 37 24 -18 -181 -181 -209 52 235 29 182 66 -183 125 101 209 -239
7819b39Q5L41j73P2K06l41qk17L54P4l31M35k66R5k05j03P2K01%rk11K57l74L27
$$ -239 -154 187 14 86 292 -49 -57 -274 80 154 -177 258 -8 87 -118 -221 -149 52 52 43 -168 89 -285 42
7843D2o0j50K15j02J27j23l2Q9L5J92k46K01l12J50j14J5M09k27q7j37R9j38K84
$$ 42 -18 -168 47 -55 72 -51 -83 6 41 233 -13 188 -124 26 -88 -73 336 109 22 -115 -16 -154 130
7866A30J1M4j86j26k26L17J36l76J64J46K50k18j33K30l3j22j2P2j45J00j91K52
$$ 130 141 185 -1 -127 -353 -36 100 -276 -112 34 284 66 -67 163 130 8 -4 68 -77 23 -168 84
7888H4k2j88J48j30K18j37J76m29K94L12m30L7k8K83j57N6k15Q8q9NM19k77j22
$$ 84 62 -126 22 -108 110 -27 149 -280 14 326 -104 -67 -95 188 31 87 -128 -40 -129 -124 295 18 -104
7911a04L51q7k70j18K47j44N4R4R6L7l64J15P8J52l94J55M78l65K1m5j3K50j89
$$ -104 247 160 -110 -228 19 -125 -71 23 119 156 -208 -93 -15 137 -257 -102 376 11 32 -13 -26 224 35
7934C5k36j1k5J38K34j09n4N1J68l34M91j17l36q6M12j76r7lQ2J10q4P0O2k7o8
$$ 35 -201 -212 -237 -99 135 26 -28 23 191 -143 348 231 -105 -191 221 45 -52 -55 27 137 53 123 185 158 90
7959I0k26L72l36K11J28m14O1N0O9k9p7J39m5m4K71m61K64j8J4K99k04k57L16
$$ 90 -136 236 -100 111 239 -175 -114 -64 5 -24 -101 38 -7 -51 220 -241 23 5 19 318 114 -143 173
7982A73j84N4k2l9Jr6j32K91k59K84K66k53j52J23j48K2J2j65J60K78n21L72J4
$$ 173 -11 43 21 -18 -17 -113 -245 46 -213 71 337 84 -68 55 -93 -71 -59 -224 -64 214 -307 65 79
8005G9O6p2l66M5K92k05J13l3n6J96q9j36L04j2m01L91n54L15J00j35K18l9o1
$$ 79 145 73 -293 -248 44 -161 -48 -81 -137 59 -30 -166 138 126 -275 116 -438 -123 -23 -158 60 21 -40
8028d0m3J31jj03p5J83r0k26J59J7L51o70O40k38j4J25K09M2m19l6P1k8j1J95
$$ -40 -83 48 47 -56 -131 52 -38 -264 -105 -88 263 -407 233 -5 -19 106 315 357 -62 -98 -27 -55 -66 129
8052A29k95L22k34L96l43R7m19K50m4K41r7k59j7K32K41Qj60j34J26O5k97l1o7
$$ 129 -166 156 -78 318 -25 72 -347 -97 -141 100 3 -256 -273 -41 200 208 48 -86 40 105 -192 -223 -290
8075b90K49J32K8K0l24Q4J48j47K10l13M83n91M21j06j86K53k04K59k66J96j55
$$ -290 -41 91 119 139 -185 -101 47 -100 110 -203 280 -311 110 4 -182 71 -133 126 -140 56 -99
8096i9M96k44k89J77J90j25j55K01J35k83Q3J00o4k63K16O0r4n3j30P3j54K28
$$ -99 397 153 -136 41 231 106 -49 152 287 4 87 187 123 -140 76 136 42 -11 -141 -68 -222 6
8118FK32k33q3q6m4L29j77r6M04m22R7J36l46K9N13l15q9K3K87m14L54q2J2j22
$$ 6 238 5 -78 -164 -208 121 -56 -152 252 -170 -73 63 -283 -254 259 -56 -145 -122 165 -249 105 23 35 -87
8142h7J72k14L6%J35Q8j55k25K80k14r4K57j09%n9J63J88k53P3L30k45k98K75
$$ -87 85 -129 -93 -93 42 130 -25 -250 30 -184 -278 -21 -130 -130 -189 -26 162 -91 -18 312 67 -231 44
8165D4J82k52J22o6j20K8kJ1M79m37n5K4O9K8p7K62o21M29K9K22k87J92j19j61
$$ 44 226 -26 96 30 -90 -62 -64 -53 426 -11 -66 -42 27 55 -22 240 -381 48 77 299 12 204 85 -76
8189g6O0L
$$ -76 -16 -13
8191a3
$$ Imaginary data points
##PAGE= N=2
##DATA TABLE= (X++(I..I)), XYDATA
0@%%%%%%%%Oj4J6j6J6k4L2l2M0m8N6p2Q2r0J04j23J46j67J91k18K46k79L14l53
$$ 0 0 0 0 0 0 0 0 0 6 -8 8 -8 8 -16 16 -16 24 -24 32 -40 42 -48 56 -67 79 -88 103 -115 131 -148 166 -187
32a87L97m45M97n54O16o84P60q43R34j034J144j266J403j556J727j923K148k404
$$ -187 210 -235 262 -292 324 -360 400 -443 491 -543 601 -665 738 -818 909 -1014 1134 -1270
50a270K703l063L503m048M748n693P038r124J2839k1480P9979L9793j09684n527
$$ -1270 1433 -1630 1873 -2175 2573 -3120 3918 -5206 7633 -13847 66132 105925 -3759 -9286
64i286N1251O2314j9517n9298m3744L0580N0545J0859m6568l3748N201K7245J1484
$$ -9286 41965 104279 84762 25464 -18280 12300 62845 73704 27136 -6612 -1411 25834 37318
77C7318j855j5822j9140r799J6491K5178P128k7139l7113n664M2850L9005k2099
$$ 37318 35463 19641 501 -9298 7193 32371 39499 12360 -24753 -30417 12433 51438 29339
90B9339o4352k3278M8822N6815q958o3606m0512L3620O5710J4591n4649n0843
$$ 29339 -35013 -58291 -9469 47346 38388 -25218 -65730 -32110 33600 48191 -6458 -57301
102e7301J8311N8773K3022l2556m0725k443L1451K7856l523k6053j7407O360J8781
$$ -57301 -38990 19783 42805 10249 -30476 -32919 -1468 26388 22865 -3188 -20595 -14235 4546
115D546J3961J415j4678k1902l161K7604L0240p743m0589k3315K5921M6011Q579
$$ 4546 18507 19922 5244 -16658 -19819 7785 38025 30282 -10307 -33622 -7701 38310 46889
128D6889m3418m3743J1887N2782K4966l5812n0871l518M3918L4757j6327m4309
$$ 46889 3471 -40272 -28385 24397 49363 13551 -37320 -40838 3080 37837 21510 -22799
140b2799j7843K7372L6120L733k6409k2312M672K3143J8852k040j9826j7127L789
$$ -22799 -40642 -13270 22850 26583 174 -22138 -17466 5677 24529 22489 2663 -14464 -10675
153a0675K3216J8339p875k7988j8003J5126L3438J1413k8272l4998L376L8470
$$ -10675 12541 30880 23005 -4983 -22986 -7860 25578 36991 8719 -26279 -22903 15567
165A5567K6793j7462l8085j1607L0128L5580m05l2879k3888J3693L2998J4202
$$ 15567 42360 24898 -13187 -24794 5334 40914 40509 7630 -16258 -2565 30433 44635
177D4635j8475k7832o120J9961K3372N85k1811k0916J868K2960J9038p505k7860
$$ 44635 26160 -1672 -7792 12169 35541 36126 14315 -6601 -4733 18227 37265 29760 1900
190A900j6338J5236L0213Q181k4292k8682J731K9097K1428j2885l2281j3041K0533
$$ 1900 -14438 798 31011 39192 14900 -13782 -12051 17046 38474 25589 -6692 -19733 800
203H00K7284P49k5172k0905M929K2886J3845r265k1896j1013J0392K0815Q314
$$ 800 28084 28833 3661 -17244 -12315 10571 24416 15151 -6745 -17758 -7366 13449 21763
216B1763j4286k2523o772J8518K2949r05k6736k2504R950L0670J3481k1936l1231
$$ 21763 7477 -15046 -21818 -3300 19649 18744 -7992 -30496 -20546 10124 23605 1669 -29562
229b9562k068L0715K3992j1055l1069j1314K1622K6545J452k2119j6134P351K0338
$$ -29562 -31630 -915 23077 12022 -19047 -30361 -8739 17806 19258 -2861 -18995 -11644 8694
242H694J0108p828j4190n832N351J1957Q054l861j5206j1933Q392K1500R387j7366
$$ 8694 18802 10974 -3216 -9048 -3697 8260 16314 12453 -2753 -14686 -6294 15206 24593 7227
256G227k5408p68K8083K2547j2426l3600j1381K6586L0773m388l4137j9340J8658
$$ 7227 -18181 -18949 9134 31681 19255 -14345 -25726 860 31633 27245 -6892 -26232 -7574
269g574L0835K993k6409k1302P860K2532P505j3391j5105j316Q039P009L68l130
$$ -7574 23261 26254 -155 -21457 -13597 8935 16440 3049 -12056 -13372 -5333 1676 2044 -1086
283a086n937p087p19J1523J2142m731k0985j1364J6716K5787J041k8965k1276
$$ -1086 -7023 -14110 -14829 -3306 8836 4105 -16880 -28244 -11528 14259 15300 -13665 -34941
296c4941J5452L3974Q769k8974k8089R548L4695J4850k2688k8818L052K7979J5400
$$ -34941 -19489 14485 23254 -5720 -33809 -24261 10434 25284 2596 -26222 -23170 4809 20209
309B0209j3490k0959j832J5014J0633l576q432k626J397N64L207N890J797r803
$$ 20209 6719 -14240 -16072 -1058 9575 5999 -2433 -5059 -3662 -3098 109 5999 7796 -2007
323b007j2032L951J9942R754j6547k3953J505K7769J7760j7343l1001l767K8750
$$ -2007 -14039 -10088 9854 19608 3061 -20892 -19387 8382 26142 8799 -22202 -25969 2781
336B781K2878j3363l1652r023K3392K3276o702k5541j1134J4556J8050j515j4467
$$ 2781 25659 12296 -19356 -28379 -4987 18289 11587 -13954 -25088 -10532 7518 6003 -8464
349h464p806M937O772J198j030k80k476o011l15R861R946n762j7520n464J7157
$$ -8464 -16270 -11333 -4561 -3363 -4393 -4673 -7149 -13160 -13475 -3614 6332 570 -16950 -22414 -5257
364e257J9491m445k5159j1996J8173K5713n91k6270j6900J4323K6210L775k1368
$$ -5257 14234 9789 -15370 -27366 -9193 16520 15929 -10341 -27241 -12918 13292 17067 -4301
377d301j7492P825K1000O698j2402j3816J459J1499O164k844n307k395n12J401
$$ -4301 -21793 -13968 7032 13730 1328 -12488 -11029 470 6634 3790 -1517 -3912 -4424 -3023
391c023M639M917l286j0769n554Q834J3657l5j6573j3019P887K0267N516j7523
$$ -3023 1616 6533 3247 -7522 -13076 -4242 9415 9380 -7193 -20212 -12325 7942 13458 -4065
405d065j8480M521K1532J0442j3897j9458j28J6894J1987o893j5259m441Q564
$$ -4065 -22545 -18024 3508 13950 53 -19405 -19533 -2639 9348 2455 -12804 -17245 -8681
418h681R972P7p554o195O6M610M815J897l232p100l446O761J0820J533j1509j0577
$$ -8681 1291 1368 -6186 -12381 -12315 -7705 -2890 -993 -4225 -11325 -14771 -8010 2810 4343 -7166 -17743
434a7743N229J5621P022j1686j5643L86J5741J1492q301j6366m245J1984J2443
$$ -17743 -12514 3107 10129 -1557 -17200 -16814 -1073 10419 2118 -14248 -18493 -6509 5934
447E934k125j2889o865N427J0038L056n317o978j716L754O253K501m147p957l865
$$ 5934 3809 -9080 -15945 -10518 -480 2576 -2741 -9719 -11435 -7681 -1428 1073 -3074 -11031 -14896
462a4896N838R165J024j0583j0276K252J3086P104r306j4504j478J3567J0916
$$ -14896 -9058 107 1131 -9452 -19728 -17476 -4390 2714 -6592 -21096 -22574 -9007 1909
475A909n304j4026n326J0052J1484p33r823o989L754Q257L394m003n566k178K185
$$ 1909 -3395 -17421 -22747 -12695 -1211 -1944 -11767 -18756 -15002 -6745 -3351 -7354 -12920 -15098 -12913
490a2913M634M000p91o182m866M128J0321N011p257j0627N54J3577J0381o036
$$ -12913 -8279 -4279 -5070 -11252 -16118 -11990 -1669 3342 -3915 -14542 -13988 -411 9970 3934
504C934j4531l561J2417J3151l172j5003o226Q955J2492n5j0726o964M295Q678
$$ 3934 -10597 -14158 -1741 11410 8238 -6765 -12991 -4036 8456 8401 -2325 -9289 -4994 3684
518C684K125m569l575J74K259J486K070J073k846n326j119O509O719l556j2193
$$ 3684 5809 1240 -2335 -2161 98 1584 3654 4727 1881 -3445 -4564 1945 8664 5108 -7085
533g085n270R760J1897k311j5281q109Q938J4941K88j4340r898O670J4710K925
$$ -7085 -12355 -2595 9302 6991 -8290 -16399 -7461 7480 7768 -6572 -16470 -9800 4910 7835
547G835j0965r677L847J0444K675o159o040P23M348P05j660k79M43k568l110K471
$$ 7835 -3130 -12807 -8960 1484 4159 -2000 -8040 -7317 -2969 -2264 -3924 -4203 -3760 -6328 -9438 -6967
563f967O944R51q114p073M767J2117L593j1037j1732M143J4556O146j1510j4210
$$ -6967 -23 928 -7186 -14259 -9492 2625 6218 -4819 -16551 -12408 2148 8294 -3216 -17426
577a7426K149J4369P124r775j2742N58J1244O561o066q205k40O930L438k641k346
$$ -17426 -15277 -908 6216 -3559 -16301 -15743 -4499 2062 -4004 -12209 -12449 -5519 -2081 -4722 -7068
592g068Q52J307j230n02L821K913l689o908j27Q675N960n844j1416j106J1886
$$ -7068 -6216 -4909 -6139 -6641 -2820 93 -3596 -10504 -10631 -1956 4004 -1840 -13256 -14362 -2476
607b476R123o262j3544k390J2596J0692m363j2928l463J0188R491k636r887l605
$$ -2476 6647 385 -13159 -15549 -2953 7739 3376 -9552 -13015 -2827 6664 4028 -5859 -9464
621i464O071O243j594n012j563J913J068o54P02J660j72m361j502N314O813j959
$$ -9464 -3393 2850 1256 -3756 -5319 -3406 -2338 -2992 -2290 -630 -802 -5163 -6665 -1351 5462 3503
637C503q315l632P503J0177j401j1256o024Q154J1203n71j1405o998O155J0462
$$ 3503 -4812 -8444 -941 9236 7835 -3421 -9445 -1291 9912 9341 -2064 -9062 -2907 7555
651G555R02r084o058M063P534J055m747l389J592K681N82j008K36j91k360j687
$$ 7555 8457 -627 -6685 -2622 4912 5967 1220 -2169 -577 2104 2686 1678 1914 1723 -637 -2324
667b324J824M066j75o451n062L789P895Q12q518p157L690J0480K275q285q001
$$ -2324 -500 3566 3391 -3060 -8122 -4333 3562 4374 -4144 -11301 -7611 2869 5144 -3141 -11142
682a1142K983J0155L662o581p003J007P463L554m102m648L29L534J672o70q03
$$ -11142 -8159 1996 5658 -923 -7926 -6919 544 4098 -4 -4652 -4323 -789 883 213 -590
697e90K23n07q72J677L752J502l743m042K658P091K820n802o663J676Q829M168
$$ -590 -367 -874 -1746 -69 3683 5185 1442 -2600 58 7149 9969 4167 -2496 -820 8009 12177
713A2177o064q498K18Q314M667m610q160r26O393M114k723n353r82L182K350j159
$$ 12177 6113 -2385 -2167 6147 10814 6204 -1956 -2882 3511 7625 4902 -451 -1433 1749 4099 2940
729B940j968m4n3j015p1J999J472k734m635J8N068L580l788p615q0P370N074l665
$$ 2940 972 928 875 -140 -211 1788 3260 526 -4109 -4091 977 4557 769 -6846 -6926 444 5518 1853
747A853q206j422P525O276k739p645j853N723N573j244n417k073L329L594p75
$$ 1853 -6353 -7775 -250 6026 3287 -4358 -6211 -488 5085 3841 -1576 -3649 -320 3274 2499
762B499k754k30J124m00k55Q09K052p83l476j077M090M081j439o031k481N238
$$ 2499 -255 -485 639 239 -16 793 2845 2062 -1414 -2491 1599 5680 4241 -1790 -4271 967
778I67O617j480p950l756N310P254o57p736m436M749O415n12n358l372L093M345
$$ 967 7584 6104 -1846 -5602 -292 6962 6305 -1431 -5867 -1118 5297 4785 -573 -3945 -852 3493
794C493L1l355j008J738J488n48l80J632R21k529k196J959M505O95n192l305L096
$$ 3493 3524 169 -839 899 2387 1839 1459 3091 4012 1483 -713 1246 5751 6446 1254 -2051 1045
811A045O688Q55o072n103L567P851J722o740n379L241P102J593n150m549J952
$$ 1045 7733 8588 2516 -2587 980 8831 10553 3813 -1566 1675 8777 10370 5220 671 2623
826B623N140J167l462k541J603J839l37j305J56J527q91k242J61L264J994l753
$$ 2623 7763 8930 5468 2927 4530 6369 6032 4727 4883 6410 5519 3277 3438 6702 8696 4943
842D943m247P31N822K416m829n661P87O764L018m945o652R83O217L276m010o097
$$ 4943 696 1427 7249 9665 4836 -825 -38 6726 9744 4799 -1853 -870 5347 8623 4613 -1484
858a484K73M910K507k834l744K46K805R31k051r87J318O42j513j086J866K358
$$ -1484 -1211 3699 6206 3372 -372 -126 2679 3610 1559 572 1890 2532 1019 -67 1799 4157
874D157j187m050q27M189L854k757n464q80N265M629k607o499q00M814N052k483
$$ 4157 2970 -1080 -1907 2282 6136 3379 -2085 -2965 2300 6929 4322 -2177 -2977 1837 6889 4406
890D406n576j404M653M117j990m197r82L644J414j208j429N48J204m80j273O76
$$ 4406 -1170 -2574 2079 6196 4206 9 -973 2671 4085 2877 1448 1996 3200 2720 1447 2123
906B123K370Pk931j722K531L845q40m651k172L569N179p95n384l230M496M946
$$ 2123 4493 4500 1569 -153 2378 6223 5383 732 -1440 2129 7308 6513 1129 -2101 2395 7341
922G341o23m879l004K946M909m36l851k182K209K790o49k372m75J331N62j172
$$ 7341 6718 1839 -1165 1781 6690 6254 2403 221 2430 5220 4571 2199 1724 3055 3617 2445
938B445k48J273J096k014j761J057L121O02l431k915J956M633O97m409l776K174
$$ 2445 2197 3470 4566 2552 791 1848 4969 5571 2140 -775 1181 5814 6511 2102 -1674 500
954E00N447R63m604l775K003M398J363l790k981J529L658M78k733j002J152J634
$$ 500 5947 6910 2306 -1469 534 4932 6295 2505 -476 1053 4711 5189 2456 1454 2606 4240
970D240o66q07K41J498p87j663m08K517J482k385l179K42M285K133l129m371O25
$$ 4240 3574 2767 3008 4506 3719 2056 1648 4165 5647 3262 83 325 4610 6743 3614 -757 -132
987a32M399K705l095m316K1M547K619k999m033J34L397J453j883k592N92K225
$$ -132 4267 6972 3877 -439 -418 4129 6748 3749 -284 -150 3247 4700 2817 225 817 3042
1003C042j92j508m99J293M08j294j088J263K370j151k751q19K846K955r99m271
$$ 3042 2850 1342 843 2136 2544 1250 162 1425 3795 2644 -107 -926 1920 4875 3876 -395
1019c95j234L757L554j682m884r94L869L283j457m279q23L129K664j362k819m73
$$ -395 -1629 2128 5682 4000 -884 -1878 1991 5274 3817 -462 -1285 1844 4508 3146 327 -146
1035a46K474J353j301j241L84J337n73j574N06J558K50k049j962J315L356l42
$$ -146 2328 3681 2380 1139 1523 2860 2287 713 1219 2777 3027 978 -984 331 3687 3345
1051C345l551k261K665L851n37m132k069L055L727n14l879k118K370L669o43l411
$$ 3345 -206 -2467 198 4049 3512 -620 -2689 366 4093 3579 -300 -2418 -48 3621 2978 -433
1067d33j237J961K165q75k005j77J587J22r55o99J295J125j371j691M24L063J083
$$ -433 -1670 291 2456 1581 -424 -601 986 1108 153 -546 749 1874 503 -1188 -764 2299 3382
1084C382k709k447J365L353J344l653l206J876M143O19l530k939J678L459O30
$$ 3382 673 -1774 -409 2944 4288 635 -2571 -695 3448 4067 537 -2402 -724 2735 3365
1099C365l050j837J301K724jk176r60J625J052r83j317O97J625n85j731j026K366
$$ 3365 315 -1522 -221 2503 2502 326 -634 991 2043 1060 -257 440 2065 1480 -251 -1277 1089
1116A089J270j706l047J41L056J739k072l639N78L584J959k846l312N32L554J413
$$ 1089 2359 653 -2394 -2253 803 2542 470 -3169 -2591 993 2952 106 -3206 -2674 880 2293
1132B293k339k864P37K651N80j890j758Q70J857j67j658k9J183J185j630j155
$$ 2293 -46 -2910 -2173 478 1058 -832 -2590 -1720 137 -30 -1688 -1717 -534 651 -979 -2134
1148b134J299K311o91k208q08K294K510j352k801j111K893K600j222l583q76L165
$$ -2134 -835 1476 785 -1423 -2231 63 2573 1221 -1580 -2691 202 2802 1580 -2003 -2879 286
1164B86K454j278l169n93K696J931j601j811J59J625R29j620l95O71R42p55j171
$$ 286 2740 1462 -1707 -2300 396 2327 726 -1085 -926 699 1628 8 -387 284 1226 471 -700
1181g00L1J823M00k127j373J055K556l90k406j777J903K673l91k958j628K098
$$ -700 -669 1154 1554 -573 -1946 -891 1665 1275 -1131 -2908 -1005 1668 1277 -1681 -3309 -1211
1197a211L068o55k711j449J858K136k59k842l80J512J203r02j405M23Q32Q4j291
$$ -1211 1857 1202 -1509 -2958 -1100 1036 777 -2065 -2445 -933 270 -632 -2037 -1614 -782 -698 -1989
1214a989k98R62R78q24j685N40J977M76j854k176R06K713M92k335k219J041K521
$$ -1989 -2287 -1325 -347 -1171 -2856 -2316 -339 137 -1717 -3893 -2987 -274 218 -2117 -4336 -3295 -774
1231g74M88k322j970J113K463K24k027j266J031J727k68j294o62R61J130n77j187
$$ -774 -286 -2608 -4578 -3465 -1002 -778 -2805 -4071 -3040 -1313 -1581 -2875 -3537 -2576 -1446 -2023 -3210
1248c210L76R37K66j430n05J526R73r35j843P9K159J434j577k003r2K642J402
$$ -3210 -2834 -1897 -1631 -3061 -3566 -2040 -1067 -2002 -3845 -3766 -1607 -173 -1750 -3753 -3845 -1203 199
1265A99j783j922M16K538Q62j528k014P01K081L29j444r14N98J535k38r60j76
$$ 199 -1584 -3506 -3090 -552 310 -1218 -3232 -2531 -450 -121 -1565 -2479 -1881 -346 -584 -1544 -1720
1282a720J197J44o98q43Q59J586j38j666r48J593J837q06k091o17J926J724p92
$$ -1720 -523 -379 -1077 -1920 -1061 525 387 -1279 -2227 -634 1203 397 -1694 -2311 -385 1339 547
1299E47k601k58K336J072j103k065j68J762J145j083j412Q8J300N59j142m23N53
$$ 547 -2054 -2312 24 1096 -7 -2072 -2240 -478 667 -416 -1828 -1740 -440 119 -1023 -1446 -893
1316h93M03l64j137R1J185L60j745j030R43J570k23j906j372J796J463m1k180
$$ -893 -490 -854 -1991 -1900 -715 -355 -2100 -3130 -2187 -617 -840 -2746 -4118 -2322 -859 -900 -3080
1333c080j388J703K074l39k474o42J617J388r84j579j57J229J464j249j079M66
$$ -3080 -4468 -2765 -691 -1030 -3504 -4146 -2529 -1141 -2125 -3704 -3861 -2632 -1168 -2417 -3496 -3030
1349c030J155J32j293n93J239J025p99j392K57K006M35j552j424O17K171N87j864
$$ -3030 -1875 -1743 -3036 -3629 -2390 -1365 -2164 -3556 -3299 -1293 -858 -2410 -3834 -3217 -1046 -459 -2323
1366b323j758R60K235M89k015j361J293J806q8j696q82J312J132n94q42k60J195
$$ -2323 -4081 -3121 -886 -397 -2412 -3773 -2480 -674 -762 -2458 -3340 -2028 -896 -1490 -2332 -2592 -1397
1383a397N04j110q12R25J125j04j707j27J356J120q23j890L89J933P80j246k068
$$ -1397 -893 -2003 -2815 -1890 -765 -869 -2576 -2703 -1347 -227 -1050 -2940 -2551 -618 162 -1084 -3152
1400c152N89K181R47j714j635N35J956Q39j600j509R75J730l95j224n42Q95J078
$$ -3152 -2563 -382 565 -1149 -2784 -2249 -293 546 -1054 -2563 -1588 142 -253 -1477 -2019 -1124 -46
1417d6o08j003N6J311K14j180r30R68J505m09j377p92J382J541q93j967l54J915
$$ -46 -654 -1657 -1601 -290 -76 -1256 -2186 -1218 287 -122 -1499 -2291 -909 632 -261 -2228 -2582 -667
1435f67P93n23j898k23J720Q66p64j746R4J547P70j111j029K19R16J92o29p85
$$ -667 126 -397 -2295 -2518 -798 68 -696 -2442 -2348 -801 -31 -1142 -2171 -1952 -1036 -844 -1473 -2258
1453b258N56P05l14j302N00R74O90j211j166J008J532J3j469p62O85J844k17j691
$$ -2258 -1702 -997 -1311 -2613 -2113 -1139 -449 -1660 -2826 -1818 -286 -273 -1742 -2504 -1819 25 -192 -1883
1471a883p13J237J523m11j087r51J335J085m61j008l54Q51P03n50r73O76J021
$$ -1883 -2596 -1359 164 -247 -1334 -2285 -950 135 -326 -1334 -1688 -837 -134 -684 -1657 -981 40
1488D0m47m74m14O49Q58l38j135j01J233N26r70j403M08J748K94j163j047N35
$$ 40 -407 -881 -1295 -646 212 -126 -1261 -1362 -129 397 -573 -1976 -1568 180 474 -689 -1736 -1201
1506a201J202K41r63r48O08J255K60j551n94J111O84k27q52n96J514K36n30q27
$$ -1201 1 242 -721 -1669 -1061 194 454 -1097 -1691 -580 104 -123 -975 -1571 -57 179 -351 -1178
1524a178N21Q18j4j075J06M50R28m44j238RR86J022p29j424R8J406P85j087j154
$$ -1178 -657 161 147 -928 -822 -372 556 112 -1126 -1117 -131 891 162 -1262 -1164 242 1027 -60 -1214
1543a214L67J271P53j224r84K42J246L24r46n85O20P08k47j065J40R98P2p15l37
$$ -1214 -847 424 1177 -47 -1031 -789 457 781 -165 -750 -130 578 331 -734 -594 404 476 -239 -576
1562e76J92Q63K5r03o67J059R50o02q21m70J021J091m03j411n03J442R00r06r66
$$ -576 -384 479 504 -399 -1066 -7 943 341 -480 -950 71 1162 759 -652 -1155 287 1187 281 -685
1581f85R4J144K15r76q54R35P26j54o53o05Q61N55k83o98k27J084K43q36r79O19
$$ -685 -591 553 768 -208 -1062 -127 599 445 -208 -813 48 603 320 -378 -605 479 722 -114 -1093 -474
1601d74J378O9j081r36J047J226j24j269n89R21R38J04j440l38J092O30m51q37
$$ -474 904 973 -108 -1044 3 1229 1105 -164 -753 168 1106 1210 -230 -568 524 1154 703 -134
1619a34J52O13N08n59p29N89P88P2o46l94O86O75l90r11n6J098O27r25r74L73
$$ -134 18 631 1139 580 -149 440 1228 1300 654 260 946 1621 1231 320 264 1362 1989 1064 90 463
1639D63J479J06j083p80L23J442r5r67p26P20O65J80j189l92P88P71m51m91J96
$$ 463 1942 2048 965 185 508 1950 1855 888 162 882 1547 1727 538 146 934 1705 1254 763 959
1658I59N97K6r07o2L91P82j80r44l25J071L84j13j412q7J049N24m99j124j38J520
$$ 959 1556 1582 675 613 1004 1786 1606 662 337 1408 1792 1679 267 180 1229 1753 1254 130 -8 1512
1678A512L69p49r84L31P42N3m28q65O18P73K9j076p2J48Q07k88o59m05O12O30
$$ 1512 1881 1132 148 479 1221 1274 846 -19 599 1372 1401 325 253 401 1208 920 261 -144 468 1098
1698A098r21n85L43J073j60n32n09N58Q05l23j066k68P79J089n59q55n26J234
$$ 1098 177 -408 -65 1008 848 316 -193 365 1170 847 -219 -487 292 1381 822 -33 -559 675
1716F75N99n40p24m3R54J05l48o79J92O98Q9m03k63P62K68l55m95M5P81J14l35
$$ 675 1274 734 10 -33 921 1026 678 -1 191 889 978 575 312 1074 1342 987 492 537 1318 1432 1097
1737A097l71L56N33L03q56m33M58J356n94q95o2P02N30Rr76j12P77L49o8n88j01
$$ 1097 726 1082 1615 1918 1062 629 1087 2443 1849 954 892 1594 2124 2133 1157 1045 1822 2171 2103 1515 1414
1758A414L04N08n25k00J02R13n27n69k71P47L64n07m59k38R94L57p54p07L1J017
$$ 1414 1718 2226 1701 1501 1603 2516 1989 1420 1149 1896 2260 1753 1294 1056 2050 2407 1653 946 977 1994
1778A994M50j031o66L94O98k12n06l21QJ044j57p66k79N07K78j36o76J92J84M31
$$ 1994 2444 1413 747 1141 1839 1627 1121 800 808 1852 1695 929 650 1157 1435 1299 623 815 999 1430
1798A430n24n70M73K20K23n16o31P64N56l14j056mJ081j26k41r08J59J122l72
$$ 1430 906 336 809 1029 1252 736 105 869 1425 1111 55 51 1132 1006 765 -143 16 1138 766
1817G66j11p23j33R91L30p56k38J61M90J85n02j95M09M28m51n62L51O80l9j49
$$ 766 655 -68 -201 790 1120 364 126 287 777 962 460 265 674 1102 651 89 440 1120 1081 932
1837I32n90j13Q72K00r08j21K97Q09k50p58o9O23O84m49n47q6N60O11o10l51o3
$$ 932 342 229 1101 1301 393 272 569 1378 1128 370 301 924 1608 1159 612 526 1086 1697 1087 736 673
1858F73M85L05m44n75L31O84o7m65j84L36K45k63k74N5K58L42p4o36J88P07mn87
$$ 673 1158 1463 1019 444 775 1459 1392 927 743 1079 1324 1061 787 842 1100 1442 1368 732 920 1627 1623 1036
1880A036q35Q39N22j82p80j04M39M05k39m58l20O58%q3n13K49N37l45j83n00N45
$$ 1036 201 1040 1562 1380 600 496 935 1340 1101 643 323 981 981 898 385 634 1171 826 643 143 688
1901F88J17J67p51k71O04K07j58p12mJ014J2o53n00L51N84J94p27m71M81O89q5
$$ 688 805 972 221 -50 554 761 603 -109 -113 901 913 260 -240 111 695 889 162 -309 172 861 776
1922G76o10n75O53N45k15m54L2K89J78k17j91J74J47J28j89l74L14N75n02n43
$$ 776 166 -409 244 789 574 120 152 441 619 402 211 385 532 660 471 97 411 986 484 -59
1942e9j36Q39M51o12n13N3M89L81k72m53r6N11M10p04j63j14P28R2l37n22Q2O46
$$ -59 -195 644 1095 483 -30 23 512 893 621 168 72 583 993 289 126 12 740 832 495 -27 55 701
1964G01p2q40R3O72P7j82k85j63N96Q5m25m68M00N45k31l81l98M65K51J88n53
$$ 701 629 -211 -118 554 631 449 164 1 597 682 257 -211 189 734 503 122 -276 189 440 628 75
1985G5j59N28J67l85J5m36N81j01l17p7j07L63j12J07l61J17J66L85o94m6k47
$$ 75 -84 444 611 226 241 -195 386 285 -32 -109 -216 147 35 142 -219 -102 64 449 -245 -291 -538
2006e38L74p0K89l72N01m4k59m44J29P98k64p4l80oL21J33m7o03L83O72n66m35
$$ -538 -164 -234 55 -317 184 140 -119 -563 -434 364 100 26 -354 -360 -39 94 47 -556 -173 499 -67 -502
2028e02k11K66N37Rq29J69K64K02l42j89K75N91k49k05r8r8L22k37m50K48J78
$$ -502 -713 -447 90 99 -730 -561 -297 -95 -437 -626 -351 240 -9 -214 -312 -410 -88 -325 -775 -527 -349
2049c49L35j44o26K78M97K42n43k4K2K4M85l40k45k51M27qp5r1j87K61r4K4L93
$$ -349 -14 -158 -784 -506 -9 233 -310 -334 -312 -288 197 -143 -388 -639 -212 -220 -295 -386 -573 -312 -406 -382 11
2072A1k51J21j06m37L31K94j46p0k14K36J8O2n89J51J16J56j40k89R1K6O00p9
$$ 11 -240 -119 -225 -662 -331 -37 -183 -253 -467 -231 -213 -151 -740 -589 -473 -317 -457 -746 -655 -629 -29 -108
2094a08n89K79K46p1j23m18L40K68r9k40r8J62N45n24J38n74O50J20k08j22k17
$$ -108 -697 -418 -172 -243 -366 -784 -444 -176 -275 -515 -613 -451 94 -430 -292 -866 -216 -96 -304 -426 -643
2115f43O51k32o9k33K19J85l45M2k11O32l89R7m51n5M12K30o31K52j05K74l2m76
$$ -643 8 -224 -293 -526 -307 -122 -467 -425 -636 -4 -393 -296 -747 -802 -390 -160 -791 -539 -644 -370 -402 -878
2137h78k6K56J78rm24k8L75J36k89l8J51O9J57o20J63J39M38l33o65j4R06j36
$$ -878 -904 -648 -470 -479 -903 -931 -556 -420 -709 -747 -596 -527 -370 -990 -827 -688 -250 -583 -1248 -1262 -356 -492
2159d92k37j88N21m2k2J10o56L04M00k60m67k8J14L79j0l31k71J97M25k49m01
$$ -492 -729 -917 -396 -438 -460 -350 -1006 -702 -302 -562 -1029 -1057 -943 -564 -574 -905 -1176 -979 -554 -803 -1204
2180a204K20J98L06m37k96J13N25N9k35m98%P71n7o52n8M76L21l77L5j03J57N09
$$ -1204 -984 -786 -480 -917 -1213 -1100 -575 -516 -751 -1249 -1249 -478 -535 -1187 -1245 -769 -448 -825 -790 -893 -736 -227
2202b27m32k69J68J84L82l7p55P46K19l01j86k50J55J053o25l96j62L51N01k34
$$ -227 -659 -928 -760 -576 -194 -231 -986 -240 -21 -322 -508 -758 -603 450 -175 -571 -733 -382 119 -115
2222a15m90J9N14J74j46p29R8L45J16pk78j96L29K13m48j94j36P13J15l27n55
$$ -115 -605 -586 -72 102 -44 -773 -675 -330 -214 -221 -499 -695 -366 -153 -601 -795 -931 -218 -103 -430 -985
2243i85L33N62m12l08k86M00L65m72k02J4N99J57n22m55N78L01L24p55j54M80
$$ -985 -652 -90 -502 -810 -1096 -696 -331 -803 -1005 -991 -392 -235 -757 -1212 -634 -333 -9 -764 -918 -438
2263d38K20k17l29k79K33M02l42N5l61J98L91n20m17L98K68L33m41o02L17L10
$$ -438 -218 -435 -764 -1043 -810 -408 -750 -695 -1056 -858 -467 -987 -1404 -1006 -738 -405 -846 -1448 -1131 -821
2283h21j3k18m3J22L35j67Kl9j3M43m64j69j06N81M5r2k77j04M54P6l27J1R5M18
$$ -821 -834 -1052 -1095 -973 -638 -805 -803 -842 -855 -412 -876 -1045 -1151 -570 -525 -617 -894 -998 -544 -468 -795 -784 -689 -271
2307b71r2k38n2K57nJ73j75j43K58M2J38j58K7j21L62j97jj84L58k8Q1k99L4K22
$$ -271 -363 -601 -653 -396 -401 -228 -403 -546 -288 -246 -108 -266 -239 -360 2 -195 -196 -380 -22 -50 31 -268 -234 -12
2331a2m02L51j39q8J41R6k60j44j1L38N0o3k14j48L93k07J64k22k32N15J3j17
$$ -12 -414 -63 -202 -290 -149 -53 -313 -457 -468 -130 -80 -143 -357 -505 -112 -319 -155 -377 -609 -94 -81 -198
2353a98j84k11L47j93J27k39mJ32r3Q1K28k17K20L5n5l48J35J96l39J44o7J31
$$ -198 -382 -593 -246 -439 -312 -551 -555 -423 -516 -435 -207 -424 -204 -169 -224 -572 -437 -241 -580 -436 -503 -372
2375c72J47k06k27P5K31K04m62J57j70L7M04l95M0P2j12M63j80l82L17j06O9L6
$$ -372 -225 -431 -658 -583 -352 -148 -610 -453 -623 -586 -182 -577 -537 -465 -577 -114 -294 -676 -359 -465 -396 -360
2397c60j49j22N66J52j45k83KJ73K85k65m83M85m3J40l46J17L04J20l8m81L40
$$ -360 -509 -631 -65 87 -58 -341 -339 -166 119 -146 -629 -144 -187 -47 -393 -276 28 148 110 -371 -31
2418c1J71L40m19l17L2O08j5k13q1j84M35J64l00l80K59J39J59n45M6J46N49m32
$$ -31 140 480 61 -256 -224 384 369 156 75 -109 326 490 190 -190 69 208 367 -178 -132 14 563 131
2440A31j35P7J25Q0j04k64q8K50L11k45n79J69O73j55l19k02J67N79k58l61k90
$$ 131 -4 73 198 278 174 -90 -178 72 383 138 -441 -272 401 246 -73 -275 -108 471 213 -148 -438
2461d38l1J024m23m57k43N07L67m93j76PJ69M03k48m38J85K25K56r6n34J15M86
$$ -438 -469 555 132 -325 -568 -61 306 -187 -363 -356 -187 216 -32 -470 -285 -60 196 100 -434 -319 167
2482A67J08n91r5K2N94O2m56j5J88J65K7l97J58K24J2k05q5N8J89K57m23l53N21
$$ 167 275 -316 -411 -389 205 267 -189 -204 -16 149 176 -221 -63 161 173 -32 -117 -59 130 387 -36 -389 132
2505A32J16J32l51N6J55NK38l20J29j58J17P9l79l0N29L60k56k83j91K87K14J46
$$ 132 248 380 29 85 240 245 483 163 292 134 251 330 -49 -79 450 810 554 271 80 367 581 727
2527G27n78o3P21J60q63k29K24J58L28k11l40L19N05l26k32m27O03j48K18k2l38
$$ 727 149 86 807 967 104 -125 99 257 585 374 34 353 858 532 300 -127 476 328 546 524 186
2548A86K2N28l9p09P9L56K0r9l62%M88J88m14k85N57j04L92m89r2R4M27k03k57
$$ 186 208 736 697 -12 67 423 443 344 -18 -18 470 658 244 -41 516 412 804 315 223 317 744 541 284
2571B84m32L44N05l21l43J78L43j15m3m19k8M32O3l98K26k66J05K48k96J87K5
$$ 284 -148 196 701 380 37 215 558 443 400 -19 -47 385 448 50 276 10 115 363 67 254 279
2592B79K80j96l79R4j66O46l7r6q7j05K35R9n03J78J60j11J38j88J13p0L10j04
$$ 279 559 363 -16 78 -88 558 521 425 338 233 468 567 64 242 402 291 429 241 354 284 594 490
2614D90p5P5j9K02q4l58j59O00J13j99m40M36j47L65l38p0j55K86K53m37K02l44
$$ 490 415 490 471 673 589 231 72 672 785 586 146 582 435 800 462 392 237 523 776 339 541 197
2636A97J26K56l61J4K29M9Ll42K75J31R8l64J49l87L13R5K6m13L00jo0J23l36
$$ 197 323 579 218 232 461 510 513 171 446 577 675 311 460 73 386 481 507 94 394 393 333 456 120
2659A20J53J87M27m88q8K47KL48k25l09k0L89j8l51L1j56N80j61l39J2O1J53l1
$$ 120 273 460 887 399 311 558 560 908 683 374 354 743 725 374 405 249 829 668 329 341 402 555 524
2682E24j57m8J83L5j40k1j53K13L16j62l16j44M2M24m69r3J63P4L19k81Q7J08
$$ 524 367 319 502 537 397 376 223 436 752 590 274 130 172 596 127 34 197 271 590 309 396 504
2704E04K73k54Q8m01K03K08q7l46k14O49J93o19J14j36K50J59k46K24l17K69K3
$$ 504 777 523 611 210 413 621 534 188 -26 623 816 197 311 175 425 584 338 562 245 514 537
2725E37j23q1J84o1m3j28j57J55K39J29k64k24K8K34q0k84L32p1m0j45J0j59J09
$$ 537 414 333 517 456 413 285 128 283 522 651 387 163 191 425 345 61 393 322 282 137 147 -12 97
2748I7K60J78m59K35O3j3K3o9j45M93k44K4k99J34J09j7j89k71P14j70L93l83
$$ 97 357 535 76 311 374 361 384 315 170 663 419 443 144 278 387 370 181 -90 624 454 847 464
2770D64k64M04R9k60q6j02J76K93l26m39N23J97Q9n08j96J31J58J76l97p2L18
$$ 464 200 604 703 443 357 255 431 724 398 -41 482 679 768 260 64 195 353 529 132 60 378
2791C78mJ44k70j91J98K69L6n63K68j15O8M3r2l47N41L51n49P2o7j78O11m09q1
$$ 378 374 518 248 57 255 524 560 -3 265 150 218 261 169 -178 363 714 165 237 170 -8 603 194 113
2814A13J95R9m8j98L3J60l7J72j97j3j25M06p7k81j41m2K18K8m46M2K58Q2M8l20
$$ 113 308 407 359 161 194 354 317 489 292 279 154 560 483 202 61 19 237 265 -181 -139 119 201 249 -71
2838g1j29N70j70m9j58J50k47K16q3n3K13p8J34l74j80M67j13r0R6M4K9r4J39
$$ -71 -200 370 200 151 -7 143 -104 112 29 -24 189 111 245 -129 -309 158 45 -45 51 95 124 30 169
2861A69m64L25J00L66k91k69J4P1L54Ok54p9O0J56m62r2J63K19M8j64J19J79j66
$$ 169 -295 30 130 496 205 -64 -50 21 375 381 127 48 108 264 -198 -290 -127 92 140 -24 95 274 108
2884A08J8j7Mk11M52J35m56j89M98Q2l92j27J79J33l1n2k67j96M27L97o19K36
$$ 108 126 109 113 -98 354 489 33 -156 342 424 32 -95 84 217 186 134 -133 -329 98 495 -124 112
2906A12n9L10r3j25j83Q2L32k30r9P8oL2k4o8k14J38R5kj3L11k05J99k74k17k1
$$ 112 53 363 270 145 -38 44 376 146 47 125 119 151 127 59 -155 -17 78 76 63 374 169 368 94 -123 -144
2931a44j49N50j60l42j77M44k21n8k7q8O11n25K99p25O19M3j56p0k91L63o1K90
$$ -144 -293 257 97 -245 -422 22 -199 -257 -284 -372 239 -286 13 -712 -93 -50 -206 -276 -567 -204 -265 25
2953B5p9k15J63r9O7J51l10J69q9k3M2k65L99m9m54N24j16J00J55k94k66K66R2
$$ 25 -54 -269 -106 -205 -138 13 -297 -128 -217 -240 -198 -463 -64 -113 -567 -43 -159 -59 96 -198 -464 -198 -106
2976a06L32m40j10K10J70R7j69j59K57J51k58o1j37K09p0J4R7K0o2J16l43O7k17
$$ -106 226 -214 -324 -114 56 153 -16 -175 82 233 -25 -86 -223 -14 -84 -70 27 47 -15 101 -242 -175 -392
2999c92K17N04l11l20l7K64J96j20m15J92N17j46m69L14q6qj70k6J66J89l71K66
$$ -392 -175 329 18 -302 -339 -75 121 1 -414 -222 295 149 -320 -6 -92 -100 -270 -296 -130 59 -312 -46
3021d6k27O9J8j3L12o51M67j50kp4K46j95R4L1k57L0k0K03K25o62J06J32K01j41
$$ -46 -273 -204 -186 -199 113 -538 -71 -221 -223 -297 -51 -246 -152 -121 -378 -348 -368 -165 60 -602 -496 -364 -163 -304
3045c04j58J83l8K49k50k20J27mK17j31j1q0M4J26o4nQ1k33J58J01l72K33P5k77
$$ -304 -462 -279 -317 -68 -318 -538 -411 -415 -198 -329 -340 -420 -376 -250 -314 -319 -238 -471 -313 -212 -584 -351 -276 -553
3069e53J2J00N43l61j01K05k36k7P4J05Pk15M0J31j26J44J63k02M00k98L8k19
$$ -553 -541 -441 102 -259 -360 -155 -391 -418 -344 -239 -232 -447 -407 -276 -402 -258 -95 -297 103 -195 -157 -376
3091c76j16N80l10Qj94Q1K82n46K15K43k30L49k08J1j58L59l78J34k07N51Q0o32
$$ -376 -492 88 -222 -214 -408 -327 -45 -591 -376 -133 -363 -14 -222 -211 -369 -10 -388 -254 -461 90 170 -462
3113d62j48K09J02JJ55k15K5M19k00l39J63J51n9K10k47j63K92k22r8J78j15l6
$$ -462 -610 -401 -299 -298 -143 -358 -333 86 -114 -453 -290 -139 -198 12 -235 -398 -106 -328 -426 -248 -363 -399
3135c99K21O4j28j70K04%j65j31M51m81J47N6r0J65n7j86R4K27m3J98k03j26Q2
$$ -399 -178 -114 -242 -412 -208 -208 -373 -504 -53 -534 -387 -331 -421 -256 -313 -499 -405 -178 -221 -23 -226 -352 -270
3158b70j80K0J86o3Ok26J94J43ml7j25jJ92l07L2K93k51K26l2k42r2K80J23o24
$$ -270 -450 -430 -244 -307 -301 -527 -333 -190 -194 -231 -356 -357 -165 -472 -440 -147 -398 -172 -204 -446 -538 -258 -135 -759
3182g59P11j53%k2J68o7m66O45j27o05N80k16j69J02O1Q8N2lk92J73L14n56J86
$$ -759 -48 -201 -201 -223 -55 -122 -588 57 -70 -675 -95 -311 -480 -378 -317 -229 -177 -180 -472 -299 15 -541 -355
3205c55M9K12j63K18l28K73j9O7o7j53l3J1K93M7l24o6L78k35M5K9j05n7K49l6
$$ -355 -306 -94 -257 -39 -367 -94 -113 -46 -113 -266 -299 -288 5 52 -272 -338 40 -195 -150 -121 -226 -283 -34 -70
3229g0qj2O5j84J75l6L50m38J60n14N96n32M88n52M74j0j58n%K05m59L28j68J32
$$ -70 -78 -90 -25 -209 -34 -70 280 -158 2 -512 84 -448 40 -512 -38 -48 -206 -211 -211 -6 -465 -137 -305 -173
3253a73m4o6r8M61j52R5k83l9m7L30n8r7K1K81j46k92j64K95Rp9J29o4L81l67
$$ -173 -217 -283 -381 80 -72 23 -260 -299 -346 -16 -74 -171 -150 131 -15 -307 -471 -176 -167 -246 -117 -181 200 -167
3277a67j97J02J12K04k05j23O0k14J47J20p2L76l45O2J09m68Q6K99L2j00j55j1
$$ -167 -364 -262 -150 54 -151 -274 -214 -428 -281 -161 -233 143 -202 -140 -31 -499 -413 -114 -82 -182 -337 -348
3299c48L84l01L13j16j72J28j09K2R6o0J41J07k78J80J5j38J24J13n3j2J34k73
$$ -348 36 -265 48 -68 -240 -112 -221 -199 -103 -163 -22 85 -193 -13 2 -136 -12 101 48 36 170 -103
3321a03K16j31J6J06j84J07p3l0j57q7K63k9MJ15k4M2L3r0J01j95j43Q5K85j26
$$ -103 113 -18 -2 104 -80 27 -46 -76 -233 -320 -57 -86 -82 33 9 51 84 -6 95 -100 -243 -158 127 1
3345Aj48j87K29OO0K2Q1k86J22m9K42j05p0k73N10p6J20l48L9Q6NN4jj29K17m0
$$ 1 -147 -334 -105 -99 -39 -17 64 -222 -100 -149 93 -12 -82 -355 155 79 199 -149 -110 -24 -19 35 34 -95 122 82
3371H2J31p6J59k51K5k80J66j24K22j55l4l5K01K29k67o0R4J33m2j23K06p9k91
$$ 82 213 137 296 45 70 -210 -44 -168 54 -101 -135 -170 31 260 -7 -67 27 160 118 -5 201 122 -169
3394a69L12k43N4K08m17J56K08q5j0j2j37J71K36k48J5j33n9j03K56J08o9K32
$$ -169 143 -100 -46 162 -255 -99 109 24 14 2 -135 36 272 24 39 -94 -153 -256 0 108 39 271
3416B71k36M5K70m5j24l00N31o91L09J36j91P1J71j63j12Q3l5j17j56M45q4K0
$$ 271 35 80 350 305 181 -119 412 -279 30 166 -25 46 217 54 -58 25 -10 -127 -283 162 78 98
3438I8k42N26k33R5J69k74k35J51J00k70J66LP0k67J39J82k17K36J1M5j62L58
$$ 98 -144 382 149 244 413 139 -96 55 155 -115 51 54 124 -143 -4 178 -39 197 208 253 91 449
3460D49l06K98k12j90K08M5J1j34kR7k29k4J39n3RJ16q9L6o7J35j91K10p3M8j67
$$ 449 143 441 229 39 247 292 303 169 167 264 35 11 150 97 106 222 133 169 102 237 46 256 183 231 64
3485F4j79L25k70K13j45K91j79J74n48N71k66J01J44N4j04k68K92j13j4r7L09
$$ 64 -115 210 -60 153 8 299 120 294 -254 317 51 152 296 350 246 -22 270 157 143 46 355
3506C55j50mj83k09K62j2P9r8L5K76m23J21N2l4j04L20p7j11n7J95Mj66J53p2
$$ 355 205 201 18 -191 71 59 138 40 75 351 -72 49 101 67 -37 283 206 95 38 233 237 71 224 152
3530A52N2j13J61l51K04j38L1L30P2j59k9J86o2p4j98j19M50l21J10k23M23ll64
$$ 152 204 91 252 -99 105 -33 -2 328 400 241 212 398 336 262 64 -55 395 74 184 -39 384 381 17
3553A7L01l01J02K7J43J30j49k12R8j75L30K16m39J73K60k84l6O0k62K23l66K59
$$ 17 318 17 119 146 289 419 270 58 156 -19 311 527 88 261 521 237 201 261 -1 222 -144 115
3575A15K25k65M27m01R4K5J51k41j59L81o7j92K26o1k8L8Q3j72J06M6O8l7p16
$$ 115 340 75 502 101 195 220 371 130 -29 352 285 93 319 258 230 268 351 179 285 331 399 362 -354
3598c54M49l0J65j36J46j47K85r1j44J99n2p8j78L87j48j16J88l16M6L55j4k01
$$ -354 95 65 230 94 240 93 378 287 143 342 290 212 34 421 273 157 345 29 75 430 416 215
3620B15j48l1l5K46P3j35P7L1k06j15M92k82jL3j39oK13o0qm1L8j70J75k26pL44
$$ 215 67 36 1 247 320 185 262 293 87 -28 464 182 181 214 75 69 282 222 214 173 211 41 216 -10 -17 327
3646C27k41l0j4N5K35k27L84k72M8j73J82k01J65J9o9mj85K28K15k50K1l5l60
$$ 327 86 56 42 97 332 105 489 217 265 92 274 73 238 257 188 184 -1 227 442 192 213 178 -182
3669a82L83k6J28j24j36K32j53J15j9j64J01K34l3k03r3m4J13jK38J8k89L88l29
$$ -182 201 175 303 179 43 275 122 237 218 54 155 389 356 153 60 16 129 128 366 384 95 483 154
3692A54J94m92N77N5k98R7l11K40n1j62P7M0j70K67j09l5k70N09l99J04J60O7
$$ 154 348 -144 433 488 190 287 -24 216 165 3 80 120 -50 217 108 73 -197 312 -87 17 177 244
3714B44l80n8J72lL06J20k42J79j91J14k97K25jk14J89q5N0j92K43k48J18mn5
$$ 244 -136 -194 -22 -25 281 401 159 338 147 261 -36 189 188 -26 163 78 128 -64 179 -69 49 45 -10
3737a0O2m4qo7J58o8J63L4k00K77j61p3l6Jo0L39j21k42j19K80k88K23j03K22
$$ -10 52 8 0 -67 91 23 186 220 20 297 136 63 27 28 -32 307 186 -56 -175 105 -183 40 -63 159
3761A59l23O3R2j1K09J89l80J44m59K76P5J47j75K5J44l45K30K8j63J09J50l78
$$ 159 -164 -101 -9 -20 189 378 -2 142 -317 -41 34 181 6 31 175 -170 60 88 -75 34 184 -194
3783a94J45J77j21p8K21l61K92J17p1NR4l65K93p7k11k15R5N14m83L5K63mm72
$$ -194 -49 128 7 -71 150 -211 81 198 127 132 226 -139 154 77 -134 -349 -254 260 -223 -188 75 71 -401
3806d01L45J0J52k01J10J0K78k84M8J55j18j04R5l31L53j59K8J00j14J04k59K36
$$ -401 -56 -46 106 -95 15 25 303 19 67 222 104 0 95 -236 117 -42 -14 86 -28 76 -183 53
3828E3k04J11o0k5K15j33P4M9l26K36J7P1l13J61j1R9k23J49R1l37K70j71L4J83
$$ 53 -151 -40 -100 -125 90 -43 31 80 -246 -10 7 78 -235 -74 -85 14 -209 -60 31 -306 -36 -207 -173 10
3852A0L22l44K05l04J73o7Rk44L27J0p3q7n5M3J40l5j89L6L3j07Q4N8J34k30P3
$$ 10 332 -12 193 -111 62 -5 4 -240 87 97 24 -63 -118 -75 65 30 -159 -123 -90 -197 -113 -55 79 -151 -78
3877g8J66k32L9j34L46j51o2j11N53l37k03J88j41k77K63L37l48J44j08j8J04
$$ -78 88 -144 -105 -239 107 -44 -106 -217 336 -1 -204 -16 -157 -434 -171 166 -182 -38 -146 -164 -60
3898f0j07J48Q7l0P3k14j46L38k17j61Q8K62p2j40J1m3M1J02j64j67O55m29j3
$$ -60 -167 -19 68 38 111 -103 -249 89 -128 -289 -201 61 -11 -151 -140 -183 -142 -40 -204 -371 284 -145 -158
3921a58L05m15J43J0k6J90j06j47P0J41j73K88l1q7q7K4k36K0k4J71J53j04o0
$$ -158 147 -268 -125 -115 -141 49 -57 -204 -134 7 -166 122 91 4 -83 -59 -295 -275 -299 -128 25 -79 -139
3944a39N4l6j08J89J25j9k55P2q5J67P2j14R8k70J32K64k12k58J6K09K8k7o4k35
$$ -139 -85 -121 -229 -40 85 66 -189 -117 -202 -35 37 -77 21 -249 -117 147 -65 -323 -307 -98 -70 -97 -161 -396
3968c96L40P0n40L89J86J0lp7R1k97J05K59k24L08k25J50k48k10J92o3j14J60
$$ -396 -56 14 -526 -137 49 59 56 -21 70 -227 -122 137 -87 221 -4 146 -102 -312 -120 -183 -297 -137
3990a37J12j70r4J29p8M4J21l86L87J41m60R9j8L7K73J1j42j07l2j36M7J6K7J53
$$ -137 -25 -195 -289 -160 -238 -194 -73 -459 -72 69 -391 -292 -310 -273 0 11 -131 -238 -270 -406 -359 -343 -316 -163
4014a63L24j10R3J28k15J3l15j3K4K04k10n4K80r9J34j01P6j77J06j8P1K99m69
$$ -163 161 51 144 272 57 70 -245 -258 -234 -30 -240 -294 -14 -113 21 -80 -4 -181 -75 -93 -22 277 -192
4037a92m2o7M65j08n80M50M8O4rq9o4k08K61J37l47J32N1k93J04j75N33N9k66
$$ -192 -234 -301 164 56 -524 -74 -26 38 29 -60 -124 -332 -71 66 -281 -149 -98 -391 -287 -462 71 130 -136
4060a36q7j11K07J9J9j0P3j7l61K57j10K22J4J06k06k39J72k6Q1j07M61m76N2
$$ -136 -223 -334 -127 -108 -89 -99 -26 -43 -404 -147 -257 -35 -21 85 -121 -360 -188 -214 -133 -240 221 -255 -203
4083b03Q5q7R5k34kK23LJJ19k84L52j20J21j68j97J23r7J26j82K77k17K18J40
$$ -203 -118 -205 -110 -344 -346 -123 -120 -119 0 -284 68 -52 69 -99 -296 -173 -270 -144 -326 -49 -266 -48 92
4106I2N7J29l39k52J45J86k69K64j55J9LJ12l01J83o5j25M31k4K2l70Q1K20j66
$$ 92 149 278 -61 -313 -168 18 -251 13 -142 -123 -120 -8 -309 -126 -191 -316 115 91 113 -257 -176 44 -122
4129a22j15K66l6l0k08j65J32M9K79Ll20K98N6m7k1j62l6M62j83l60r8l6M30m1
$$ -122 -237 29 -7 -37 -245 -410 -278 -229 50 53 -267 31 87 40 19 -143 -179 283 100 -260 -358 -394 36 -5
4153ej46J68p9j24j30J28M9j86L44k47J29J33j32k07K23J33n18L42K81j16k43
$$ -5 -151 17 -62 -186 -316 -188 -139 -325 19 -228 -99 34 -98 -305 -82 51 -467 -125 156 40 -203
4174b03j36J66k4L53k64j78K69J02m80J7L67k29j39J95K20m05O36m31K14J5k48
$$ -203 -339 -173 -197 156 -108 -286 -17 85 -395 -378 -11 -240 -379 -184 36 -369 267 -164 50 65 -183
4195a83M2L1L9l7L31n08M62m44K71k08k0K47p6j13m9J94j3j31jn0j8j81L81P5
$$ -183 -141 -110 -71 -108 223 -285 177 -267 4 -204 -224 23 -53 -166 -215 -21 -34 -165 -166 -216 -234 -415 -34 41
4219D1j4j5K18M7n01K33j00J42j08j01N2M9p0N8K59l36j69K11J70k67K80l08N
$$ 41 27 12 230 277 -224 9 -91 51 -57 -158 -106 -57 -127 -69 190 -146 -315 -104 66 -201 79 -229 -224
4242b24K64nQ6k37nJK01l7l25O8J92j93K95k45m3K69l8j35k84O40o34N02o1l1
$$ -224 40 35 121 -116 -121 -120 81 44 -281 -213 -21 -214 81 -164 -207 62 24 -111 -395 245 -389 113 52 21
4266B1P5J58l54K77l7j16j85Q6q1J27o7J90J48m93L32Q8k91J68m25M26j88j3O3
$$ 21 96 254 -100 177 140 24 -161 -75 -156 -29 -96 94 242 -251 81 169 -122 46 -379 47 -141 -154 -91
4289i1L21l18K07j20pJ34J10L7J06l60j20q4J68j3J4K27m68M66l50J49QJ43p1
$$ -91 230 -88 119 -1 -8 126 236 273 379 19 -101 -185 -17 -30 -16 211 -257 209 -141 8 16 159 88
4312H8j55K89k09K45l44K24j33R9j26K03l66K14K13j83N8l47M1J99N2j06Oo6J19
$$ 88 -67 222 13 258 -86 138 5 104 -22 181 -185 29 242 59 117 -230 -189 10 62 -44 -38 -104 15
4335A5k14K58M0J35k15j29J32o9j35J02P4L24l95J45K9q1q3N3K87j23j99K17k21
$$ 15 -199 59 99 234 19 -110 22 -47 -182 -80 -6 318 -77 68 97 16 -67 -14 273 150 -49 168 -53
4358e3QJ16k37L30j67j93L5J67J69j15J73j12O4l30J52J11j37K55N7m57L64o5
$$ -53 -45 71 -166 164 -3 -196 -161 6 175 60 233 121 185 -145 7 118 -19 236 293 -164 200 135
4380A35j58K70k99j2Q4p4j2J83k66O49k67k99J28J6k04K5K89k19J20q1Q3OJ45
$$ 135 -23 247 -52 -64 20 -54 -66 117 -149 500 233 -66 62 78 -126 -101 188 -31 89 8 91 97 242
4403B42j38k12K55k55O1m7k5O2J9K09N8k46J45p1J97k34JP8j70j5N6J46K26k48
$$ 242 104 -108 147 -108 -47 -94 -119 -57 -38 171 229 -17 128 57 254 20 21 99 -71 -86 -30 116 342 94
4427I4j3k07M10l08Q7k3oj10R3J54l66M02k15j5O9K6M9K52k75l05L40j5kj16O8
$$ 94 81 -126 284 -24 63 40 34 -76 17 171 -195 207 -8 -23 46 72 121 373 98 -207 133 118 116 0 68
4452F8J69l7j04R8j90M50j87l59J35j13K21j0J27j11n8K85l40M0l4L96l34J57
$$ 68 237 200 96 194 4 454 267 -92 43 -70 151 141 268 157 99 384 44 84 50 446 112 269
4474B69j05J17l1j96R6q5j45K12r3J67j82K54j08O2M8j40j33J73j13L9j77J13
$$ 269 164 281 250 54 150 65 -80 132 39 206 24 278 170 232 280 140 7 180 67 106 -71 42
4496D2j12k3lL59j38m35K98L30K76o88K95k06J97m6l14L43k50j6J99j02M5L6k61
$$ 42 -70 -93 -96 263 125 -310 -12 318 594 -94 201 -5 192 146 -168 175 -75 -91 108 6 51 87 -174
4519a74L62j36L9j55J80l8J80j07n77O88k50K70l70k5J27J00J18N0j13k41L8L47
$$ -174 188 52 91 -64 116 78 258 151 -426 262 12 282 -88 -113 14 114 232 282 169 -72 -34 313
4541C13k3j86P7j3L57o51R8K48j9j51k1J17j36J48J24j72k94O7o5K61k6P8j81
$$ 313 290 104 181 168 525 -126 -28 220 201 50 29 146 10 158 282 110 -184 -117 -182 79 53 131 -50
4564e0P2N3p3K17m10M99j27j92K1mK34m88L52J97m10Q2J49J20l45J53r7L17l55
$$ -50 22 75 2 219 -191 308 181 -11 10 6 240 -248 104 301 -109 -27 122 242 -103 50 -47 270 -85
4587h5J54j34J94J22j88L16m31J27N7Q3k28j4J81j87k27M06P1Q2J0N2j97k41J27
$$ -85 69 -65 129 251 63 379 -52 75 132 215 -13 -27 154 -33 -260 146 217 299 309 361 164 -77 50
4610E0j50J76J13j0k80J93o7O0Q6q9j60N7j26L32l29J80J98l68K25j87K94K5o2
$$ 50 -100 76 189 179 -101 92 25 85 171 82 -78 -21 -147 185 -144 36 234 -134 91 -96 198 223 161
4633A61m3%K19k44l0K9j01k51K67O8K07j70j85L2K95l54J02o1J39L5j69J13n3
$$ 161 118 118 337 93 63 92 -9 -260 7 75 282 112 -73 -41 254 -100 2 -59 80 115 -54 59 6
4656Fj62K75k83L15p4Q3J92j03l54n0K63l05K00rk0K15k77O6K45l72K94k14J38
$$ 6 -156 119 -164 151 77 160 352 249 -105 -155 108 -197 3 -6 -26 189 -88 -22 223 -149 145 -69 69
4679F9r8j83N73m54K99j53k32J67R5k2J14m91M14L3l1J8j54J80L0l68J49q8L40
$$ 69 -29 -212 361 -93 206 53 -179 -12 83 61 175 -316 98 131 100 118 -36 144 174 -194 -45 -133 207
4702B07n20O5K4J88L6p7Q5R7k7j13r7L86j65J33j54R1k20k48K79J79j73r7q1Q6
$$ 207 -313 -248 -224 -36 0 -77 8 105 78 -35 -132 254 89 222 68 159 -61 -309 -30 149 -24 -121 -202 -116
4726a16K96O8k26k9P8j46k4K53J9K2J93l16l76M37n6R9q0R2j69o4K48j4P5m98
$$ -116 180 248 22 -7 71 -75 -99 154 173 195 388 72 -304 133 77 176 96 188 19 -45 203 189 264 -234
4750b34L18K2O9k1j17P1k57K55j85l18K41K90k43J54j48n6J93n3N4J77k42Jl2
$$ -234 84 106 175 154 37 108 -149 106 -79 -397 -156 134 -109 45 -103 -159 34 -19 35 212 -30 -29 -61
4773f1j9rj73L71L7j05k18J01o4K68l54p3J93K63k68K80j47k11J12L7M6J8k39
$$ -61 -80 -89 -262 109 146 41 -177 -76 -140 128 -226 -299 -106 157 -111 169 22 -189 -77 -40 6 24 -215
4796b15pK16J93k74k2j42R4m7r5J31n6M58j03r4m8K56l19K2L1nj55L12J22l19
$$ -215 -222 -6 187 -87 -109 -251 -157 -204 -299 -168 -224 234 131 37 -11 245 -74 -52 -21 -26 -181 131 253 -66
4820f6r5K84n9j80K95k59N1J51l3j25j00J07J56M9O8l16K79n4k50J37k62J8K11
$$ -66 -161 123 64 -116 179 -80 -29 122 89 -36 -136 -29 127 176 244 -72 207 153 -97 40 -222 -204 7
4843Gj41Q2M8k41K55q6J15m5j84J47nK51l21J47q7J76pk33L71j63n3P5j34J63
$$ 7 -134 -52 -4 -245 10 -76 39 -6 -190 -43 -48 203 -118 29 -58 118 111 -122 249 86 33 108 -26 137
4867A37j35R0l41M40k04L8l9J52J76m82J86j74j00J10n6J18K62l94K24j17J29
$$ 137 2 92 -249 191 -13 25 -14 138 314 -168 18 -156 -256 -146 -202 -84 178 -216 8 -109 20
4888B0J23l56Rn9j04L44k69R3J41P9l1j83Q4k3M54m26L84m06K4J55pj23K13j79
$$ 20 143 -213 -204 -263 -367 -23 -292 -199 -58 21 -10 -193 -109 -132 322 -104 280 -126 -102 53 46 -77 136 -43
4912d3j06L7k72L76j06r2R9K97l39j10K07k75N07k85m1K42k22j19m6K77j27J75
$$ -43 -149 -112 -384 -8 -114 -206 -107 190 -149 -259 -52 -327 180 -105 -146 96 -126 -245 -291 -14 -141 34
4934C4O9n6j55J70J4J21j52q3l4J3N9q0k9J47J44m95N18j20o7j97J23J21j0j21
$$ 34 103 47 -108 62 76 197 45 -38 -72 -59 0 -80 -109 38 182 -313 205 85 18 -179 -56 65 55 -66
4958f6J86l44K59p2J55J7P3k43L32o19K80J71k58J57j07J13O2o9k76J07K39l95
$$ -66 120 -224 35 -37 118 135 208 -35 297 -322 -42 129 -129 28 -79 34 96 27 -249 -142 97 -298
4980b98L07m03L17O1j04K4k55K11K25l20R2Jl6L29k33J5J4l75M87k20J32O2p4
$$ -298 9 -394 -77 -16 -120 -96 -351 -140 85 -235 -143 -142 -178 151 -82 -67 -53 -428 59 -161 -29 33 -41
5003d1J90l92M28k22P5L51o13r9K34j8j65L34j14j99L7J37J37q7k02J04K21l19
$$ -41 149 -243 185 -37 38 389 -224 -323 -89 -107 -272 62 -52 -251 -214 -77 60 -27 -229 -125 96 -223
5025b23L38o0q1O8k60J95m29J06J53K88n7O0l72K18M2N1n9J85j70j05j86J78M50
$$ -223 115 55 -26 42 -218 -23 -452 -346 -193 95 38 98 -274 -56 -14 37 -22 163 -7 -112 -298 -120 330
5048C30j40k57j42k43L49M24o10K23J93m9R3j28j38J68m24M20k90j19M67l8l16
$$ 330 190 -67 -209 -452 -103 321 -289 -66 127 78 171 43 -95 73 -351 69 -221 -340 127 89 -227
5069b27N07l96j94L94j24J23N8k30L71j3j49j51p5N8n1J53J19l47K09K0k20K71
$$ -227 280 -116 -310 84 -40 83 141 -89 282 269 120 -31 -106 -48 -99 54 173 -174 35 55 -165 106
5091A06J8j48J97l24M22n65K99J44o25N36j15J21j42p6o8K66k0J01j24R5m1J06
$$ 106 124 -24 173 -151 271 -294 5 149 -476 60 -55 66 -76 -152 -220 46 26 127 3 98 57 163
5113A63l95K12N9j49J8L7k05K67k67M9j05K80m0K46j53o7K01p0j09J22l92J02
$$ 163 -232 -20 39 -110 -92 -55 -260 7 -260 -211 -316 -36 -76 170 17 -50 151 81 -28 94 -298 -196
5135a96K57l9j04j5lK20j23QJ24J30j99j15R9j64K50k25qk9K69o2q2K32m45M13
$$ -196 61 22 -82 -97 -100 120 -3 5 129 259 60 -55 44 -120 130 -95 -103 -132 137 75 -7 225 -220 193
5159A93k1%k29j17J60p8M3L6j50K12J09j03l00M6L20M4j77r0L28k93Q0k34L32
$$ 193 172 172 -57 -174 -14 -92 -49 -13 -163 49 158 55 -245 -199 121 165 -12 -102 226 -67 13 -221 111
5182A11k23j73J87Jj42J47J99N8j87j11K25k26J08l0M0j89R2K30j09m3n8K36j20
$$ 111 -112 -285 -98 -97 -239 -92 107 165 -22 -133 92 -134 -26 -56 -16 -205 -113 117 8 -35 -93 143 23
5205B3l5j27o4K50R1k15J57J7k46J15J86j20K4j59M0J54j69L30k24M1j69O9J44
$$ 23 -12 -139 -203 47 138 -77 80 97 -149 -34 152 32 56 -103 -63 91 -78 252 28 69 -100 -31 113
5228A13q4K43k9k82J84k26J68J05k81m0Q1J63jk7j81j18M99l74l43O88k95L1M7
$$ 113 29 272 243 -39 145 -81 87 192 -89 -129 -48 115 114 87 -94 -212 287 -87 -430 258 -37 -6 41
5251D1j89J41k02L88j82oJ32m82K72K77k44j56J23l7j68M27P9J60n55K75m9J24
$$ 41 -148 -7 -209 179 -3 -9 123 -359 -87 190 -54 -210 -87 -124 -292 135 214 374 -181 94 45 169
5273A69j40P9j04j35j54L41oQ6n6K0nQ5k01j30l4O3MQ9R4j70NJ11q2P0j17K10
$$ 169 29 108 4 -131 -285 56 50 136 80 100 95 180 -21 -151 -185 -122 -118 -29 65 -105 -100 11 -71 -1 -118 92
5299I2J75j96K63l41R3l04J57j24K85l4j40J4P7m8%J49J6k51L11l32O3M54m41
$$ 92 267 71 334 -7 86 -218 -61 -185 100 66 -74 -60 17 -31 -31 118 134 -117 194 -138 -75 379 -62
5322f2N3L28l77L05j98l56N66j41J67j82n8l4p6J09j21K61j18j05l22K36J28K04
$$ -62 -9 319 -58 247 49 -307 259 118 285 103 45 11 -65 44 -77 184 66 -39 -361 -125 3 207
5344B07N4k10j05p2L92P4r2k55m8N7R0K0j78j28K41k28J06j51M70l69j01J05J58
$$ 207 261 51 -54 -126 266 340 248 -7 -55 2 92 112 -66 -194 47 -181 -75 -226 244 -125 -226 -121 37
5367C7o9L19q5j90Q5m0p6L9mK44k06n9J51k45o1J32J26N1j11l1j1N2J07jk09J98
$$ 37 -32 287 202 12 97 57 -19 20 16 260 54 -5 146 -99 -160 -28 98 149 38 7 -4 48 155 154 -55 143
5393A43j29r6p0J27L31k81O6J52j11Mj15J81k16o2K78m11L37l0l4J15k32k3K54
$$ 143 14 -82 -152 -25 306 25 91 243 132 136 21 202 -14 -76 202 -209 128 98 64 179 -53 -76 178
5416A78k9k85L8j26M31k82Q7k20o7R3K75l31L80j58K00k14P8J83k56m3j06L34
$$ 178 149 -136 -98 -224 207 -75 12 -208 -275 -182 93 -238 142 -16 184 -30 48 231 -25 -68 -174 160
5438A60j95k02K30J32k13J27J20k40L40m12k5p7L23l36L99k15K13K36n4l00N7
$$ 160 -35 -237 -7 125 -88 39 159 -81 259 -153 -178 -255 68 -268 131 -84 129 365 311 11 68
5459F8j09J37j20J32j5j60r3O5J09j3K27k87J40K0k18r0L26k08J16J70P4m00J97
$$ 68 -41 96 -24 108 93 -67 -160 -95 14 1 228 -59 81 101 -117 -207 119 -89 27 197 271 -129 68
5482F8j43J5K38k11p7K09N3o2k93J71M5j92K84k97K13N1N2p0k25K22J5j47J92
$$ 68 -75 -60 178 -33 -110 99 152 90 -203 -32 13 -179 105 -192 21 72 124 54 -171 51 66 -81 111
5505A11K4q2oN8J62o5j89J55k17k0J41N3J38k42J11l36K98j4k22J19N9j85L12
$$ 111 135 53 47 105 267 202 13 168 -49 -69 72 125 263 21 132 -204 94 80 -142 -23 36 -149 163
5528A63k50L2K56j24J65m84L39P2j97j89M82m37J21K43k77K37P4m09L19N6j47
$$ 163 -87 -55 201 77 242 -242 97 169 -28 -217 265 -172 -51 192 -85 152 226 -183 136 192 45
5549D5K2j32J62j59J13m5m8p5K44k11K33O6q9j6k15oK08K12l87M5L80l18j78K18
$$ 45 67 -65 97 -62 51 6 -42 -117 127 -84 149 215 126 110 -105 -111 97 309 -78 -33 347 29 -149 69
5573F9jl07L07j67O4J05J09j86J6r2j5J95Jj63J24r5N3N4J15j97j73K79m6m1m9
$$ 69 68 -239 68 -99 -35 70 179 -7 9 -83 -98 97 98 -65 59 -36 17 71 186 -11 -184 95 49 8 -41
5598d1J46M9k30L9J27j33J41K5l79M10j38K26k25l03J95K6l75J79L27j87K66%
$$ -41 105 154 -76 -37 90 -43 98 123 -256 154 16 242 17 -286 -91 -65 -440 -261 66 -121 145 145
5620A45j23j18K48k15L26K7j62rn5j02M13m08P9K79k74Q3R2k29R5j61K29k19J63
$$ 145 22 -96 152 -63 263 290 128 119 64 -38 375 -33 46 325 51 134 226 -3 92 -69 160 -59 104
5643A04M0l77nMK86k16K95l59L92k80K60j36J13l18M00N9m79M61k30j52J81J9
$$ 104 144 -233 -238 -234 52 -164 131 -228 164 -116 144 8 121 -197 203 262 -217 244 14 -138 43 62
5665F2l63J72P1J28K73n04O9K89j98O3J09l52J57J1NL3k85L47m71O09j02k02J96
$$ 62 -301 -129 -58 70 343 -161 -92 197 -1 62 171 -181 -24 -13 -8 25 -260 87 -384 225 123 -79 117
5688A17pl12L78j08j4p6j69MJ72J86k64K0K60o7K5J94k13P5l01J12r5L61n64M99
$$ 117 110 -202 176 68 54 -22 -191 -187 -15 171 -93 -73 187 120 145 339 126 201 -100 12 -83 278 -286 213
5712B13k44k7J30o7m8k14L06O5p0p2jJ1J04%j22j28L5JP1J49q1j12MJ06j32K22
$$ 213 -31 -58 72 5 -43 -257 49 114 44 -28 -29 -18 86 86 -36 -164 -129 -128 -57 92 11 -101 -97 9 -123 99
$$ [...]
8191A80
##END NTUPLES=NMR FID
##END=
