##TITLE=1H_K-351/2_2
 DMSO-d6+CCl4, 8 sc, 
 25.6.2019
##JCAMPDX= 6.0         $$ Bruker NMR JCAMP-DX V2.0
##DATA TYPE= NMR FID
##DATA CLASS= NTUPLES
##ORIGIN= UXNMR, Bruker Analytische Messtechnik GmbH
##OWNER= root
$$ XWIN-NMR		Version 3.5
$$ Tue Jun 25 15:50:02 2019 Russian Standard Time (UT+4h)  she@DPX200
##.OBSERVE FREQUENCY= 200.13155
##.OBSERVE NUCLEUS= ^1H
##.DELAY= (6, 6)
##.ACQUISITION MODE= SIMULTANEOUS
##.ACQUISITION SCHEME= undefined
##.AVERAGES= 8
##.DIGITISER RES= 18
##SPECTROMETER/DATA SYSTEM= spect
##.PULSE SEQUENCE= zg30
##.SOLVENT NAME= DMSO
##.SHIFT REFERENCE= (INTERNAL, DMSO, 0, 15.7039)
##AUDIT TRAIL= $$ (NUMBER, WHEN, WHO, WHERE, WHAT)
$$ ##TITLE= Audit trail, XWIN-NMR		Version 3.5
$$ ##JCAMPDX= 5.01
$$ ##ORIGIN= Bruker BioSpin GmbH
$$ ##OWNER= she
$$ F:/spectra/data/she/nmr/H-F/1/audita.txt
$$ ##AUDIT TRAIL=  $$ (NUMBER, WHEN, WHO, WHERE, WHAT)
(   1,<2019-06-25 15:48:39.64 +0400>,<she>,<DPX200>,
      <created by zg, POWCHK disabled, PULCHK disabled
       configuration hash MD5:
       00 E9 B6 7A A2 85 ED C7 34 08 36 98 17 FE 4E 26
       data hash MD5: 16K
       4E AA B0 36 EC 5E E7 FB B0 C7 FC EC 76 D9 3F 3A>)
$$ ##END=
$$ 
$$ hash MD5
$$ FD 4F 2C 04 81 11 8F C9 32 DC 48 91 7E FF 34 61
##$RELAX= 
##$RELAX= 
##$RELAX= 
##$RELAX= 
##$RELAX= 
##$RELAX= 
$$ Bruker specific parameters
$$ --------------------------
##$DU= <F:/spectra>
##$EXPNO= 1
##$NAME= <H-F>
##$PROCNO= 1
##$TYPE= <nmr>
##$USER= <she>
##$AMP= (0..31)
100 100 100 100 100 100 100 100 100 100 100 100 100 100 100 100 100 100 
100 100 100 100 100 100 100 100 100 100 100 100 100 100 
##$AQSEQ= 0
##$AQ_mod= 1
##$AUNM= <au_zg>
##$AUTOPOS= <>
##$BF1= 200.13
##$BF2= 200.13
##$BF3= 200.13
##$BF4= 200.13
##$BF5= 200.13
##$BF6= 200.13
##$BF7= 200.13
##$BF8= 200.13
##$BYTORDA= 1
##$CFDGTYP= 0
##$CFRGTYP= 5
##$CHEMSTR= <none>
##$CNST= (0..31)
1 1 145 1 1 1 1 1 1 1 1 1 1 1 1 1 1 1 1 1 1 1 1 1 1 1 1 1 1 1 1 1 
##$CPDPRG= <>
##$CPDPRG1= <>
##$CPDPRG2= <>
##$CPDPRG3= <>
##$CPDPRG4= <mlev>
##$CPDPRG5= <mlev>
##$CPDPRG6= <mlev>
##$CPDPRG7= <mlev>
##$CPDPRG8= <mlev>
##$CPDPRGB= <>
##$CPDPRGT= <>
##$D= (0..31)
0 1.2 0 0 0 0 0 0 0 0 0 0.03 0 0 0 0 0 0 0 0 0 0 0 0 0 0 0 0 0 0 0 0 
##$DATE= 1561463319
##$DBL= (0..7)
120 120 120 120 120 120 120 120 
##$DBP= (0..7)
150 150 150 150 150 150 150 150 
##$DBP07= 0
##$DBPNAM0= <>
##$DBPNAM1= <>
##$DBPNAM2= <>
##$DBPNAM3= <>
##$DBPNAM4= <>
##$DBPNAM5= <>
##$DBPNAM6= <>
##$DBPNAM7= <>
##$DBPOAL= (0..7)
0.5 0.5 0.5 0.5 0.5 0.5 0.5 0.5 
##$DBPOFFS= (0..7)
0 0 0 0 0 0 0 0 
##$DE= 6
##$DECBNUC= <off>
##$DECIM= 24
##$DECNUC= <off>
##$DECSTAT= 4
##$DIGMOD= 1
##$DIGTYP= 9
##$DL= (0..7)
0 120 120 120 120 120 120 120 
##$DP= (0..7)
150 150 150 150 150 150 150 150 
##$DP07= 0
##$DPNAME0= <>
##$DPNAME1= <>
##$DPNAME2= <>
##$DPNAME3= <>
##$DPNAME4= <>
##$DPNAME5= <>
##$DPNAME6= <>
##$DPNAME7= <>
##$DPOAL= (0..7)
0.5 0.5 0.5 0.5 0.5 0.5 0.5 0.5 
##$DPOFFS= (0..7)
0 0 0 0 0 0 0 0 
##$DQDMODE= 0
##$DR= 18
##$DS= 0
##$DSLIST= <SSSSSSSSSSSSSSS>
$$ [...]
##$SUBNAM2= <"">
##$SUBNAM3= <"">
##$SUBNAM4= <"">
##$SUBNAM5= <"">
##$SUBNAM6= <"">
##$SUBNAM7= <"">
##$SUBNAM8= <"">
##$SUBNAM9= <"">
##$SW= 24.9336996594482
##$SWIBOX= (0..15)
0 0 2 0 0 0 0 0 0 0 0 0 0 0 0 0 
##$SW_h= 4990.01996007984
##$TD= 16384
##$TD0= 1
##$TE= 0
##$TE2= 300
##$TE3= 300
##$TEG= 300
##$TL= (0..7)
0 120 120 120 120 120 120 120 
##$TP= (0..7)
150 150 150 150 150 150 150 150 
##$TP07= 0
##$TPNAME0= <>
##$TPNAME1= <>
##$TPNAME2= <>
##$TPNAME3= <>
##$TPNAME4= <>
##$TPNAME5= <>
##$TPNAME6= <>
##$TPNAME7= <>
##$TPOAL= (0..7)
0.5 0.5 0.5 0.5 0.5 0.5 0.5 0.5 
##$TPOFFS= (0..7)
0 0 0 0 0 0 0 0 
##$TUNHIN= 0
##$TUNHOUT= 0
##$TUNXOUT= 0
##$USERA1= <user>
##$USERA2= <user>
##$USERA3= <user>
##$USERA4= <user>
##$USERA5= <user>
##$V9= 5
##$VALIST= <valist>
##$VCLIST= <CCCCCCCCCCCCCCC>
##$VD= 0
##$VDLIST= <DDDDDDDDDDDDDDD>
##$VPLIST= <PPPPPPPPPPPPPPP>
##$VTLIST= <TTTTTTTTTTTTTTT>
##$WBST= 1024
##$WBSW= 4
##$XGAIN= (0..3)
0 0 0 0 
##$XL= 0
##$YL= 0
##$YMAX_a= 116702
##$YMIN_a= -110832
##$ZGOPTNS= <>
##$ZL1= 120
##$ZL2= 120
##$ZL3= 120
##$ZL4= 120
##$ABSF1= 10
##$ABSF2= 0
##$ABSG= 5
##$ABSL= 3
##$ALPHA= 0
##$AQORDER= 0
##$ASSFAC= 0
##$ASSFACI= 0
##$ASSFACX= 0
##$ASSWID= 0
##$AUNMP= <proc_1d>
##$AZFE= 0.1
##$AZFW= 0.1
##$BCFW= 1
##$BC_mod= 2
##$BYTORDP= 1
##$COROFFS= 0
##$CY= 11.3945322036743
##$DATMOD= 1
##$DC= 2
##$DFILT= <>
##$DTYPP= 0
##$F1P= 18.9103706918063
##$F2P= -1.10871071338519
##$FCOR= 0.5
##$FTSIZE= 0
##$FT_mod= 4
##$GAMMA= 1
##$GB= 0.15
##$INTBC= 1
##$INTSCL= 1
##$ISEN= 128
##$LB= 0.24
##$LEV0= 0
##$LPBIN= 0
##$MAXI= 10000
##$MC2= 0
##$MEAN= 0
##$ME_mod= 0
##$MI= 1.114404
##$NCOEF= 0
##$NC_proc= 0
##$NLEV= 6
##$NOISF1= 3.799351
##$NOISF2= 2.8
##$NSP= 1
##$NTH_PI= 0
##$NZP= 0
##$OFFSET= 15.70392
##$PC= 1
##$PHC0= -8498.415
##$PHC1= 12.40097
##$PH_mod= 1
##$PKNL= yes
##$PPARMOD= 0
##$PSCAL= 0
##$PSIGN= 0
##$REVERSE= no
##$SF= 200.130013532006
##$SI= 16384
##$SIGF1= 3
##$SIGF2= 2
##$SINO= 400
##$SIOLD= 16384
##$SREGLST= <1H.CDCl3>
##$SSB= 0
##$STSI= 0
##$STSR= 0
##$SW_p= 3612.71676300578
##$SYMM= 0
##$S_DEV= 0
##$TDeff= 0
##$TDoff= 0
##$TI= <>
##$TILT= no
##$TM1= 0
##$TM2= 0
##$TOPLEV= 0
##$USERP1= <user>
##$USERP2= <user>
##$USERP3= <user>
##$USERP4= <user>
##$USERP5= <user>
##$WDW= 1
##$XDIM= 8192
##$YMAX_p= 0
##$YMIN_p= 0
$$ End of Bruker specific parameters
$$ ---------------------------------
##NTUPLES= NMR FID
##VAR_NAME=  TIME,          FID/REAL,        FID/IMAG
##SYMBOL=    X,             R,               I
##VAR_TYPE=  INDEPENDENT,   DEPENDENT,       DEPENDENT
##VAR_FORM=  AFFN,          ASDF,            ASDF
##VAR_DIM=   8192,          8192,            8192
##UNITS=     SECONDS,       ARBITRARY UNITS, ARBITRARY UNITS
##FACTOR=    0.0002004,     1,               1
##FIRST=     0,             0,               0
##LAST=      1.6414764,     0,               0
##MIN=       0,             -110832,         0
##MAX=       1.6414764,     116702,          0
$$ Real data points
##PAGE= N=1
##DATA TABLE= (X++(R..R)), XYDATA
$$ [...]
1974c09R83l30n85k17j57R47K77k39n66l63M95K77N16m10l04J3O9L74M10l65q89
1995c73M88M61N64n77o73j53R39M39n87o34l07N56L98J78n43k25l58L37O33J16
2015F79m45o25J37O74L01j92o78O9L32N84J6o85k43L80P13k0o94k67L70L58J31
2036H95m80Jn51J31N22L01k35n34j73J66M69j23m97l43p3M50M24n4j203k51Q21
2057c37Q25k43q05j53K26Q09L61n43o51M1K90L72kq54j11P82k70KK00l04j14k9
2079e08K69P01m70j002J27J94J322l49j009n70R49J213n13q13o06M44J211j97
2097C93r03K04R9M41J58k26k12M2R8m6J27K48l85n30K64L24N28j53j145l41R79
2118c6P33m04p11m57M04J062j52q79o04N68M99M77n80n33J90O44L47n38l00J00
$$ plain form
1974 -309 674 344 -241 -458 -615 332 609 370 -196 -559 -64 213 729 319 15 28 97 471 881 516 -373
1995 -373 115 576 1140 563 -110 -263 676 1115 528 -106 -413 143 541 719 176 -49 -407 -70 563 679
2015 679 234 -391 -254 420 721 529 -149 -80 252 836 852 167 -76 304 1017 997 303 36 406 764 895
2036 895 415 416 -135 -4 518 819 584 50 -123 43 512 389 -108 -451 -524 -74 350 296 -907 -1158 -337
2057 -337 488 245 -560 -713 -487 322 683 140 -511 -470 -180 192 190 -664 -775 7 -263 -261 -61 -365 -479 -508
2079 -508 -239 462 -8 -1010 -883 -689 633 284 -725 -1295 -346 867 354 -459 -1065 -621 590 393
2097 393 -510 -306 -207 234 392 166 -46 -4 94 48 175 423 38 -492 -228 96 624 471 -674 -1015 -36
2118 -36 697 293 -418 -875 -471 591 439 -440 -1044 -476 23 500 -80 -613 -423 221 568 30 -270 -170
2138a70J01j0L04o5L7n55L11k36O41k34k42l27n3R33m8o06l18Q5Q42K68p62n09
2160f13K87Q16k61J3p81n7O04K27l9l38N5K2j02J81M79j90o36j57Q73M67l73p36
2182b59m25O49O51k49n94m50K89N09L06p42k08J36L47m8o4k20m79N87M19J04j85
2203G4l64N8N86M5J8m57j33N7N88l88M9k01k71J54L38L0lp13J89J20Q70l24o78
2226c56M0j43R12n1m68p00K05N21M05m72m95Q9M28L26M2m03l03L28N57j25l43
2247fNj24K55N8O7j03m0k63J70L34J79l27n95q0O13L80m88q84L15N28P68l84r16
2270e38p6R41O07o97j29m46Q76J44l52j17j94K29L1n4J72N3j3k82j86P8N28l3
2292E42j069Q0N93N08l80q66k54N90J054o46o28j19J89J017m19q68l36O85N95
$$ plain form
2138 -170 -69 -79 225 160 197 -358 -47 -283 358 124 -118 -445 -498 435 387 -219 -537 -452 390 658 -104 -613
2160 -613 -326 490 229 242 -539 -596 8 235 196 -142 -87 -65 -167 14 493 303 -333 -490 383 850 477 -259
2182 -259 -684 -35 616 367 -227 -677 -388 121 427 -315 -523 -387 -40 -88 -152 -372 -851 -264 155 259 74
2203 74 -290 -232 354 399 417 -40 -173 -116 472 84 133 -68 -339 -185 153 183 180 -533 -344 -224 646 322 -356
2226 -356 -316 -459 453 402 -66 -766 -561 -40 365 -107 -602 -513 -85 241 283 -120 -423 -95 462 337 -6
2247 -6 -1 -125 130 188 255 152 112 -151 19 353 532 205 -390 -470 143 523 35 -849 -534 -6 762 378 -538
2270 -538 -614 327 934 237 108 -338 538 682 330 213 19 248 279 225 397 450 437 155 -31 47 575 542
2292 542 -527 -447 146 654 274 -592 -846 -256 798 152 -476 -595 -406 611 192 -676 -1012 -327 268
2311B68k48l28j74Q27N6l16l89L45L36q9o02J02M00K58m10k42R5O96nq20p50O52
2333c38R21K0p82o14M26O30O01j208n14N27N18K95o52l11M86M14j56o08M19K68
2353C42j33m44j72P60n8n00l82k51J081Q8n87o89L38P78J49o34o39K91R07L49
2373E94o80o65p8O49N09m76m17r9M74N94m29j95j90M18k2j30O0L7j1k92K09M42
2395C02K73ko29k30K86O82j57p86p10J073R39k75j108l87R36N78l41o61q4O57
2415C56R2K86o78k93O32J4j09l62N56k34J65n12n5P43k50k07k58j96N57K03j69
2436B81n44L54M40J76q15n04N22L25M16o82o07K7R08R7n19l55L87M85O35q74m62
2457c09K88Q81k93p14K42J42K24k28m02J69Q87l63o15l25Q10L70k77j335K01R33
$$ plain form
2311 268 20 -308 -482 345 401 85 -304 41 377 288 -314 -212 188 446 36 -206 -111 585 580 -240 -990 -338
2333 -338 583 603 -179 -793 -367 263 864 -344 -858 -331 187 482 -170 -481 5 419 263 -345 74 342
2353 342 209 -235 -407 353 295 -205 -587 -838 243 331 -256 -945 -607 171 320 -314 -953 -662 245 594
2373 594 -86 -751 -829 -180 329 -147 -564 -663 -189 405 -24 -219 -409 9 -13 -143 -83 -46 -57 -349 -140 302
2395 302 575 573 -56 -286 0 682 525 -261 -971 102 1041 766 -342 -729 207 785 444 -217 -301 356
2415 356 448 734 56 -237 395 409 300 -62 494 260 425 -87 -142 601 351 144 -114 -310 247 450 281
2436 281 -263 91 531 707 -108 -612 -90 235 651 -31 -638 -611 297 394 -125 -480 -93 392 1027 153 -309
2457 -309 -21 860 567 -147 95 237 461 233 -169 0 887 524 -91 -416 394 764 487 -848 -647 286
2477B86M38n71j072L39J025M52o30r44J10P81L37q41k11j51P90K73n85j79K95
2496e8j1K52o64M16K99O2p54l18O59L98Oo95k05M51N83j28q78m79N34J057l03
2517B24j191PP02P42j40r63m23J135L83l91n72l6Q01m5n56O4L55K00j96l20k17
2538d37Q22J44n84n40L66J016M9j050p60N93J070l09o29p45N41J057l65k88n86
2557f35O19L31J56q92j10O20P05n19m79J6N53N6n28n17P44N37K5p32m43N36P21
2578G64m32r55p4R94M66k03j212J09J140L61o77r56K45R67j9p16l25M28M19L13
2598F37l25p86M83N39l01n69P02J52R2n69j94L22J92Qo62m96Q73P70l97o15l09
2619d53M83P15m10m55n64N94R14l59o93l71N73N05j3p15j93M83L71j08m98k96
$$ plain form
2477 286 724 153 -919 -580 445 897 267 -677 -567 214 551 -290 -501 -652 138 411 -174 -353 -58
2496 -58 -69 183 -481 -65 234 296 -458 -776 -117 281 287 -408 -613 -162 421 293 -585 -1064 -530 527 224
2517 224 -967 -960 -258 484 344 -619 -1042 93 476 85 -487 -523 278 233 -323 -259 96 296 100 -220 -437
2538 -437 385 529 -55 -595 -229 787 836 -214 -974 -381 689 380 -249 -994 -453 604 239 -49 -635
2557 -635 -16 315 471 -421 -531 89 794 275 -204 -188 365 421 -107 -624 120 657 682 -50 -493 43 764
2578 764 332 -623 -697 297 763 560 -652 -543 597 958 281 -675 -430 537 518 -198 -523 -95 324 637
2598 637 312 -474 9 548 247 -322 380 532 624 55 -139 183 375 383 -279 -775 98 868 471 -144 -453
2619 -453 30 745 335 -120 -684 -90 824 465 -228 -599 -26 479 466 -249 -442 41 412 304 -194 -490
2639d90J117j19l46l71M34J5j95k48j22P73O2n08o86L09J033K26j101l63M97R00
2659H17j27q41n68N93N52j5j117k2N92O77l67k84k26L56L40m1o91K95M73j23m35
2680a62p5M45K29J14q90m36R25L43j63q24j08O85R86q83q07J8J007K87n64m34
2700c07k64P72P9m00o85O10P05j1n53j55N23L81n18p29K20R95n2o48m02J90J036
2721G87q1j002n18N85J158l86p75l69N41R08k98q94j62M06N69n4q75p9Q35K10
2741E06m54n31O11M11l13j51l83K58N70k91p70q6Q64L93r18PK23M05M16p32o12
2762e77M58P85j90o01l90K56L98L04m78m04K41M77Q8m77m96N80L89o57k58P3Q13
2783C34j36l66m71O84N62m19o21J58N41j99K58j078RQ84K72o26l75O2R09P2m42
$$ plain form
2639 -490 627 508 162 -209 225 240 45 -203 -325 448 510 2 -684 -375 658 884 -217 -580 -83 817
2659 817 690 -151 -719 -126 426 411 -706 -728 -136 541 174 -110 -336 20 360 319 -372 -77 396 273 -162
2680 -162 -237 208 437 551 -339 -775 150 493 330 -494 -602 83 1069 186 -621 -603 404 691 127 -307
2700 -307 -571 201 280 -120 -805 -195 510 499 -54 -209 314 695 177 -552 -332 663 611 -37 -439 -249 787
2721 787 706 -296 -814 -229 929 543 -232 -601 -60 848 550 -344 -506 -100 469 415 -460 -539 296 506
2741 506 52 -479 132 543 230 79 -304 -46 524 233 -537 -623 241 634 -284 -277 -54 351 767 35 -577
2762 -577 -119 666 476 -125 -515 -259 139 443 -35 -439 -198 279 367 -110 -606 -26 363 -294 -552 -479 334
2783 334 198 -168 -639 45 607 188 -433 -275 266 67 325 -753 -744 140 412 -214 -589 -527 382 454 12
2804A2n23J20M39N81l84o46K48K41K23n64Q0J09M46j52l24j13N62pk96o24N00
2825g2N35j55m07k90M82N92n06l85n16Q42N90K46j276j39L52J024n03n41j08K35
2845@P10o14m88L94M30K43l92o60R04j20K61o41l45N98J93l84k73j74J076J24
2865H42p27l28J51M95L60m54n84K3Q14p4j74q29J37O84j05l04n29O03O69j78l41
2886A51n75P12K90k91l92j9N08m1k67j45j01L42L45q87r3K93N43k42o58k08N70
2907a65L16J0r86K95M94K81J39p93J42K05K58J6o91M44R1J04n56K06J60L14k65
2928A9j61k15L41N49o74l20L78M18L0m96m40N77L45L6l94o58O55N18o37l30n1
2949e10M26L65r6o03k48O95K28l36l39K10L80k15j53LJ88K74j97m62J91M31J39
$$ plain form
2804 12 -511 -391 48 629 245 -401 -153 88 311 -253 -173 -64 382 230 -94 -207 355 348 52 -572 -72
2825 -72 463 308 -99 -389 93 685 179 -206 -722 120 710 956 -320 -459 -107 917 414 -127 -235 0
2845 0 710 96 -392 2 432 675 283 -377 527 407 668 27 -318 280 473 89 -184 -358 718 842
2865 842 115 -213 -62 433 793 339 -245 -222 592 518 344 -485 -348 336 231 -73 -602 1 670 492 151
2886 151 -424 288 578 287 -105 -124 384 343 76 -69 -170 172 517 -370 -463 -170 373 131 -527 -735 -165
2907 -165 151 161 -825 -530 -36 245 384 -409 -267 -62 196 212 -479 -35 56 160 -396 -190 -30 284 19
2928 19 -142 -357 -16 533 -141 -461 -83 335 365 -131 -571 6 351 387 -7 -665 -10 508 -129 -459 -510
2949 -510 -84 281 185 -418 -666 29 257 -79 -418 -208 172 -43 -196 -193 -5 269 72 -390 -199 232 371
2970C71k87k87nL5M92m91m39K30P25K6q29K75P3P6K86n42R7mM76K00p97K83L64
2993C28j39j04m1L1j1K56m66k11N47R5K41n85r9M69L4j89m05J13L27J00K39q41
3015c11N7J60K21j61j14j46O99j0k40o19L45N45j36m87K02k1J73k24k10J49L74
3036B46Q9l23n7q0O86j34l16m86L87O81m91k09l0k3K79J8k23j34m7L78K14n21
3058i6R0l8L51%l66J18J4l7L71l39k48K39L1j75n55P29K35k25m19j34N39L87k83
3081A89n30J39K69M40n10j70l14N35M14o52o3P6N77n6o20K24q0J84j9k35j1J17
3103i6K83l85n5K08Q7Oj02j33J0L86k94k74J11K77M51k25m42l17M68Jj06J22j06
3126a25M23l70J37m74j17O25J35l09l71N07K88j53m33L29J19l6m8l8k61M18j9
$$ plain form
2970 371 84 -203 -208 -173 319 -172 -611 -381 344 370 -459 -184 -111 -35 251 -291 -194 -198 278 478 -319 -36 328
2993 328 189 85 44 75 64 320 -146 -357 190 285 526 -59 -158 311 345 156 -249 -136 191 291 530 -311
3015 -311 -254 -94 127 -34 -148 -294 405 395 155 -464 -119 426 290 -197 5 -16 157 -67 -277 -128 246
3036 246 335 12 -45 -125 561 427 111 -375 12 693 202 -7 -37 -60 219 237 14 -120 -167 211 425 -96
3058 -96 -6 -44 307 307 -59 59 73 36 407 68 -180 59 90 -85 -640 89 324 99 -320 -454 85 472 189
3081 189 -341 -202 67 507 -3 -173 -487 48 462 -190 -253 -177 400 344 -276 -52 -132 52 33 -202 -213 -96
3103 -96 187 -198 -253 -45 42 48 -54 -187 -177 209 -85 -359 -248 29 480 255 -187 -504 -36 -35 -141 -19 -125
3126 -125 298 -72 65 -409 -526 99 234 -75 -446 61 349 196 -237 92 211 175 127 89 -172 246 227
3147B27j97k32j46O12P8l80j89J60O01j78n88j15O11k12M0l58J20K38N8j48j13
3168a11J74j44K91j28r8j49M14l14M9%J51P9J29m69j33K82J22k74j52R2K43j38
3190h4l9j36L4K72M23l84j48J41j5K26l85L1J00J51l70J13N8OR3K35l64J75j16
3213A7q0KJ1K11K54k50k18m2J72L33m76k64K62L42k93j90N2j42K71K15q1k33P2
3236e5m7J37Q3j26k70R5L0K81Q7l80K49k6L4j33k73N67k39k37j7R5L07k15r6n
3260a54K31R2J52n43K3J47J95m06k0R4L59j31j86j32L19J55j4j12j50L65p3j50
3282F1j51L87l22L52n77M84J46k89j28j04q9J24J10k08J07L0K16o3K00o94L12
3303i6J30K6P7l60J64o9J91j7j7k58j50M25J8j7l67L66l99M30j88M56n9l90j21
$$ plain form
3147 227 30 -202 -348 264 342 -38 -227 -67 534 356 -232 -347 264 52 92 -266 -146 92 150 2 -111
3168 -111 63 -81 210 82 -16 -165 249 -65 -16 -16 135 214 343 -126 -259 23 145 -129 -281 -189 54 -84
3190 -84 -123 -259 -225 47 470 86 -62 79 64 290 -95 -64 36 187 -183 -70 -12 -6 87 322 -42 133 17
3213 17 -63 -61 -50 161 415 165 -53 -95 77 410 -66 -330 -68 274 -19 -209 -157 -299 -28 187 106 -127 -55
3236 -55 -102 35 118 -8 -278 -183 -153 128 215 -165 84 58 92 -41 -314 253 14 -223 -240 -145 162 -53 -149 -154
3260 -154 77 169 321 -222 -199 -52 143 -263 -283 -189 170 39 -147 -279 40 195 181 69 -81 284 211 61
3282 61 -90 297 -25 327 -250 234 380 91 -37 -141 -230 -106 4 -204 -97 -67 149 86 286 -408 -96
3303 -96 34 60 137 -223 -59 -128 63 46 29 -229 -379 46 64 47 -320 46 -353 77 -111 345 286 -104 -225
3326b25M7L70l16j34M0K55j05K05n35J59J56J98j60k9m4J20O9l22J3J41k7k3K51
3349A04k07k99L76mj89N61j28mj10j5jL1N9k51n1QM39n22O1k32K90j4q9K89K5
3374A27p3j9M1k20M8J06N2m5R4m00J81k4L6K54Jj90K11m69L09n9J4J63k92l6O1
3399a29M21m32J83k89L00k10M22j62l21R3L91k09j49k27J23K49m5K02j86j95J50
3420b0K90L4m69K00N6j25l3J09K29j34j99J03j38o0N1j70M37Lj09q2j6K17J07
3443B81j36k15J07l37K89J61l33L69j98j35k6l0J86o2JJ22k06L03j24l55J71k19
3465c86N84k52j40J54j9kKj34n5K66L8m24K54m2N2o6O4K63k29J2P3j20oO0M4k60
3491b69K40l03L93k84K15N3m28L47l19K07j14M7L14j54R2or3l9oR6j71K06J55
$$ plain form
3326 -225 -178 192 -124 -258 -218 37 -68 137 -398 -239 -83 115 -45 -74 -118 2 71 -251 -238 -97 -124 -147 104
3349 104 -103 -402 -26 -30 -219 342 214 210 100 85 84 115 174 -77 -128 -120 319 -203 -142 -374 -84 -98 -187 102 127
3374 127 54 35 76 -144 -96 10 62 17 111 -289 -108 -132 -96 158 159 -31 180 -289 20 -39 -25 138 -154 -190 -129
3399 -129 292 -140 43 -246 54 -156 266 104 -217 -124 267 58 -91 -318 -195 54 9 211 25 -170 -20
3420 -20 270 304 -165 35 91 -34 -67 42 271 137 -62 41 -97 -157 -106 -276 161 164 55 -27 -43 174 281
3443 281 145 -70 37 -300 -11 150 -183 186 -12 -147 -173 -203 -17 -79 -78 44 -162 141 17 -338 -167 -386
3465 -386 198 -54 -194 -40 -59 -61 -59 -193 -248 18 56 -368 -114 -156 -104 -170 -106 157 -72 -60 13 -107 -113 -53 -9 -269
3491 -269 -29 -332 61 -223 -8 45 -383 -36 -355 -148 -262 -215 99 -55 37 31 -62 -101 -107 -11 -182 24 179
3514A79j71Q3k59K19n5j37K77j62Qq3k5p4N4K56l76K55NL44m97M9J43K29k88L5
3538IK24o84K14J24K82J66n17J44J83P5m68J15K50o3k02j8j35L14l4p6K53m33
3560b77J54J31Q8k96M83p0j30k34K45L6m6q2l44L65M8L73l30m48M14N6J1j85j19
3583a57l3N4J61J07n1j9J56p04O01J98n03K70o7k16K03l5JL75o95M33R0J09n98
3606c20L42m9K6j25M9L07M0j68o6j39P6J41j37p8K3L15m54J42Q4L3j89k9r4M37
3630A67J11m75o9J93q7J48m4J90J40Nm18J5K74j33j21L56l13L47l54o1L11p8j46
3653d2J44l33L29N3j68J33j01J82N0m39J62K13RL2k39k64O4K73k60Q9J26N2k45
3676a80J78m0J91j50P8pj63J48l79K95KQ9Q9j45N6L05k83k3j64K79j86m8k79J66
$$ plain form
3514 179 8 91 -168 51 -4 -141 136 -26 -18 -101 -126 -200 -146 110 -266 -11 -6 338 -159 -110 33 262 -26 9
3538 9 233 -451 -237 -113 169 335 -182 -38 145 220 -248 -133 117 54 -148 -166 -301 13 -21 -97 156 -277
3560 -277 -123 8 96 -200 283 213 83 -151 94 130 84 2 -342 23 71 444 114 -334 80 136 147 -38 -157
3583 -157 -190 -136 25 132 81 62 218 -486 115 313 -190 80 13 -203 0 -35 -34 341 -354 79 169 278 -320
3606 -320 22 -27 -1 -126 -77 230 270 102 36 -103 -27 114 -23 -101 -78 237 -217 -75 9 42 -147 -176 -270 167
3630 167 278 -197 -266 -73 -160 -12 -56 134 274 279 -139 -124 150 17 -104 252 -61 286 -68 -129 182 104 -42
3653 -42 102 -231 98 151 -17 116 15 197 247 -192 -30 183 192 224 -15 -279 -215 58 -202 -113 13 65 -180
3676 -180 -2 -42 149 -1 77 70 -93 55 -324 -29 -27 62 151 6 62 367 84 61 -103 176 -10 -58 -337 -171
3700a71J74K12k15np9K74l40k43L60m5J98m33M77k64K31k23K77l1m9j61j79J56
3722g9K57k92J75Q4l8j22n04O33o6K18k36k66K71K01r2j85kk51L51Q9m51K59Q8
3745D2J32k33l7j5J52m1J94P0k63K26j1j61k35O28o81J09J75J01o3k9n5k43M29
3768A91k96j91J94n1kK59j44L19m71n0K14p2P6k95K20J18k00L48m1l47N2L77K9
3791B37j77j92Jj73K55L7P1J01j30o0j20qK22k05Q0L12k67O6k78J21J47k02J99
3814C7J32p1j81j92N84j35o65N85m59L87n5l19M44k02J49P1l3J01k74J98j43R3
3836E2k45J72o0R7J8j82p9K71P1r4Q5j81m7K16j34K21Oj06k88M41j93q5L41j57
3860A40m5l9k34K79L3K9j91J0J92j33J3m8o0L47l61K86k14l9k4K45j84j15L77
$$ plain form
3700 -171 3 215 0 -5 -84 190 -150 -393 -33 -78 120 -313 164 -100 131 -92 185 154 105 -56 -235 -79
3722 -79 178 -114 61 145 107 -15 -519 114 48 266 30 -236 35 236 144 -41 -43 -294 57 146 -305 -46 42
3745 42 174 -59 -96 -111 41 0 194 264 1 227 216 55 -180 448 -233 -124 51 152 89 60 5 -238 191
3768 191 -105 -296 -102 -153 -155 104 -40 279 -192 -242 -28 -100 -24 -319 -99 19 -181 167 126 -221 -169 208 237
3791 237 60 -132 -131 -304 -49 -12 59 160 30 -30 -150 -158 64 -141 -61 251 -16 50 -228 -107 40 -162 37
3814 37 169 98 -83 -275 309 174 -491 94 -365 22 -33 -352 92 -110 39 110 77 178 -96 102 -41 52
3836 52 -193 -21 -81 16 34 -148 -227 44 115 21 106 -75 -122 94 -40 181 187 81 -207 234 41 -44 297 140
3860 140 95 56 -178 101 134 163 -28 -18 174 41 54 6 -54 293 -68 218 4 -35 -59 186 2 -113 264
3883B64k87K55k26Q0J99l29M4J1ojK17n2j7p1l30L03lJ22l23J25j51J25L01j34
3907A16N5l92L89j66R0L3k0k9k05P6P7j03p9K43K34k44k88K57ok47l3J48j49K87
3931D4mJ92l03L58m84K54k53L24j00L5k80J39J01rj94P2O6j09J4J7K57J9n23K26
3955a41J00K5j45p5K11N9r5r3K60k13J63J46J72l18j05K2O2p2J34J70n68J09K30
3978C8Q8J44n1k28j40K79%j70j77Q4K23M0j52j29M2J82J71k44k38N2K63k20n5
4001a98J8LJ27k74J18K43J84j81l81K72Q8M0J3k51J4K07J1j65K00m00L02k03P0
4024a43M1M09J0n93J54K33m21J14L05j8J22l41J34R1J13k85J36n9j2N9L9J23j84
4047B7n4j71K83j41J38j48J33r6p0M05j04K9J4r2q5k59l2M69l12Q1j35L19M9k24
$$ plain form
3883 264 -23 232 6 86 285 -44 0 11 5 4 221 169 152 81 -249 54 51 173 -150 -25 -176 -51 250 116
3907 116 171 -221 168 2 92 125 105 76 -129 -53 24 -79 -158 85 319 75 -213 44 38 -209 -242 -94 -243 44
3931 44 40 232 -71 287 -197 57 -196 128 28 63 -217 -78 23 14 -180 -108 -42 -151 -137 -120 137 156 -367 -141
3955 -141 -41 -16 -161 -236 -25 34 -61 -154 106 -107 56 202 374 56 -49 -27 35 -37 97 267 -301 -192 38
3978 38 126 270 219 -9 -149 130 130 -40 -217 -133 90 130 -22 -151 -109 73 244 0 -238 -186 77 -143 -198
4001 -198 -180 -177 -50 -324 -206 37 221 40 -341 -69 19 59 72 -179 -165 42 53 -112 88 -312 -10 -213 -143
4024 -143 -102 307 317 -276 -122 111 -310 -196 109 91 213 -128 6 97 210 -75 61 2 -10 49 88 211 27
4047 27 -27 -198 85 -56 82 -66 67 -29 -99 306 202 231 245 153 68 -191 -223 246 -66 15 -120 199 248 24
4071B4q0L80l97J2R6k49K64K85l26q8J54o5k81K38n6Q8k21M54j45o3L6k44P5P
4095a02K21j27k38M66k30J18r8%LJ89rk91k9N8P8j29jK43q9j52L68j11j30j20
4119a12k73M48k11L92k64Pm1K0L3j50N6J32j51M7L2R1k72K96k36L1L18k67j29
4142b03K38O5j95k32K22nK36l48p4K98K0Rj35K85k49l2J66l3k05Q3K93k27J6n6
4166f3j07K81l18N7Q1J08n7J22k38K10j5l1k6j54J81r2M0j03L10L8k17J19q7k49
4190b10K12j8k93N15k20Q6j61M64m59K09j47j09K56j66P4k66K88J49k87K90k75
4211f8K55l55K47%J6Q6k66l9N1J13K23o9J18k97Rjj60L73j10Q9j1Oj10P7k81l5
4237a39J84l11L71M0p5k22J09j9r6L4J21kk7K18k33k61M4L25Q3l24L25j35j15
$$ plain form
4071 24 -56 324 -73 -61 35 -214 50 335 9 -79 75 10 -271 -33 -89 -1 -222 232 87 24 60 -184 -109 -102
4095 -102 119 -8 -246 220 -10 108 10 10 13 202 193 -98 -127 -69 9 -120 -121 122 33 -119 249 138 8 -112
4119 -112 -385 63 -148 244 -20 -13 -54 -34 -1 -151 -95 37 -114 -67 -35 56 -216 80 -156 -125 193 -74 -203
4142 -203 35 100 -95 -327 -105 -110 126 -222 -296 2 22 31 -104 181 -68 -100 66 33 -172 -89 204 -23 -7 -63
4166 -63 -170 111 -207 -150 -69 39 -18 104 -134 76 61 30 4 -150 31 -61 -21 -124 186 224 7 126 39 -210
4190 -210 2 -16 -309 206 -14 72 -89 375 -84 125 -22 -131 125 -41 33 -233 55 204 -83 207 -68
4211 -68 187 -168 79 79 95 181 -85 -124 -73 40 263 194 312 15 24 23 -137 236 126 215 204 210 100 177 -104 -139
4237 -139 45 -266 105 145 70 -152 -43 -62 -158 -124 -3 -5 -32 186 -47 -308 -264 61 144 -180 145 10 -105
4260a05J80m96M57l2n7J10o1J56j64l80M49m6J13k65k1K8m3J82K34l09j0J52j45
4283g3J51k14j13L76j12l5p6J11K4Q5n5j3l51K23k33N76o39M75J04k85J73j09
4305a0Qj7J5J01l86L22Q5k35o2J92q5K88j8k21k46K54K6j63J01K83Jm77O21p14
4329c37K92k59J76j1L34j13l6l28L40L6j22J93k42L76l02Q5j32N7M7j57J05jl7
4352c6J86j80nR8k70kK21j20J19R5o5k59J00K49k89J3q3J62l5J05K7j38O3J04
4376F0M7m9j21QJ49j56K7P3k28K87m1M6o6L9n6K73k10m53L3L51j72J91K22k36
4400A8Q2j05k04K28j44L51k49r1J35j01K84j84N2n4j12M9k7K61n52M03j32L25
4422B33m62K83J60r6o6j09j94JK49K48j92l83M17k06L9M7K37j56k89K97r8n6L1
$$ plain form
4260 -105 75 -421 36 4 -53 57 -4 152 -12 -392 57 11 124 -141 -162 -134 -177 5 239 -70 -80 72 -73
4283 -73 78 -136 -249 127 15 -20 -96 15 39 124 69 56 -295 -72 -305 271 -368 107 211 -74 99 -10
4305 -10 -2 -19 -4 97 -289 33 118 -117 -179 13 -72 216 198 -23 -269 -15 11 -152 -51 232 233 -244 377 -337
4329 -337 -45 -304 -128 -139 195 82 46 -282 58 94 -28 165 -77 299 -3 82 -50 7 54 -103 2 1 -36
4352 -36 150 -30 -35 63 -207 -209 12 -108 11 106 41 -218 -118 131 -158 -145 -228 -66 -101 4 31 -107 -44 60
4376 60 107 58 -63 -55 94 -62 -35 38 -190 97 56 102 36 75 19 292 82 -371 -338 13 -159 32 254 18
4400 18 100 -5 -209 19 -125 226 -23 -114 21 -80 204 20 72 18 -94 -45 -72 189 -363 40 -92 233
4422 233 -229 54 214 118 52 -57 -251 -250 -1 247 55 -328 89 -117 -78 -31 206 50 -239 58 -40 -96 -65
4445f5J14K0K5j36j66J59J04j57K49j16Nj24j33J81j49K82J43l09M3lj46R7q0
4468a62J15M7J2J84l07J92J46l37J88o7p1R7l0r3M56j38k02K56l78jj03K15P6
4491I5MO4l85L05K34k49k95J79j77L30k82R9J43j27K10j92L24j13k34M15j48j2
4513A88l86M4R1p7Q7J00J48k58j7N0j8J10k02J91j86L62j83O8k10J18m3O5k39
4536a97L51k71J68j83J74J74k89J58k68q4K08j89J70M3LN1l57K85J15k35N5Q8
4558c0L95q3l51J10l82K82j68R4k2j37Q0j7K06N4j91R0m1m2K26j06R9k32N0pK82
4583A59k69N0j4Q5K35k60O3J70k76q0J81l2J08k29rJ06J16q5M0l0L00k12m07N36
4607B46j2k30o4j54K97k05R2M68o14J28l8J33K68k84q5K9k8J95K9l45L46m18J85
$$ plain form
4445 -65 49 69 94 -42 -208 -49 55 -102 147 31 36 -88 -221 -40 -189 93 236 -73 -30 -33 -179 -82 -162
4468 -162 -47 0 12 196 -111 81 227 -110 78 11 -60 37 7 -86 370 232 30 286 -92 -93 -196 19 95
4491 95 99 163 -222 83 317 68 -227 -48 -225 105 -177 -78 65 -62 148 -44 280 167 -67 348 200 188
4513 188 -198 -154 -63 -140 -53 47 195 -63 -80 -30 -48 62 -140 51 -135 227 44 112 -98 20 -23 42 -197
4536 -197 154 -117 51 -132 42 216 -73 85 -183 -267 -59 -248 -78 -35 -32 19 -338 -53 62 -173 -118 -30
4558 -30 365 282 -69 41 -341 -59 -227 -133 -155 -292 -212 -229 -23 31 -160 -70 -111 -153 73 -33 66 -166 -116 -123 159
4583 159 -110 -60 -74 11 246 -14 49 219 -57 -137 44 12 120 -109 -118 -12 104 19 59 29 329 117 -290 246
4607 246 234 4 -60 -214 83 -122 -30 438 -176 -48 -86 47 315 31 -54 -25 -53 142 171 -174 172 -246 -61
4630f1k9K66r5N7r5O1J06J61l91L7o7n7L41j67l45M46k72M2L64k03k36J78j2o4
4654c5K04j04J01j25r7Q0j21L04L2k88K5k0K89q8P5J0m26K60l59K91q7L12m90
4677b57L80P2k77R8j0M0k67K72K0k89N9K04N9p1k2J19j06L14o22K23j33J28j67
4700b33K17l6J67K0m17K54p8J8M35n19K57M8N5k31K39k81K29j46l5J57l53K35
4722Bj1k47K41J99m27J79N3j75J5l4j29J47J9O8m2O4K25j28j44L09o3k37l78K80
4746b14j2K54J93l97J44r4J62k57K53p7J62j31L01k82L5j74o1J55j13L40k6j31
4768C0o9J72j10q7K7j02K87n3l2l5kJ18k99m1M3K07K63k61l39J90J36J54j71P4
4792A00l6p2j84K06J05j21K07k75K03j97K95q6l11J36J8J15k66L24k77m2K46O9
$$ plain form
4630 -61 -90 176 81 138 43 104 210 371 -20 17 -50 -107 234 67 -278 168 -104 -62 302 99 -137 41 29 -35
4654 -35 169 65 166 41 -56 24 -97 207 239 -49 -24 -44 245 157 232 242 -184 76 -283 8 -79 233 -257
4677 -257 123 195 -82 16 6 46 -221 51 71 -218 -159 45 104 33 11 130 24 338 -284 -61 -194 -66 -233
4700 -233 -16 -52 115 135 -282 -28 -106 -88 347 -172 85 133 188 -43 196 -85 144 -2 -37 120 -233 2
4722 2 -9 -256 -15 184 -243 -64 -11 -186 -171 -205 -334 -187 -168 -100 -142 -78 147 19 -125 184 121 -116 -494 -214
4746 -214 -226 28 221 -176 -32 -126 36 -221 32 -45 117 -14 287 5 40 -134 -195 -40 -153 187 161 30
4768 30 -39 133 23 -64 -37 -139 148 95 63 28 26 144 -155 -196 -153 54 317 56 -283 -93 43 197 26 100
4792 100 64 -8 -192 14 119 -2 205 -70 133 -64 231 145 -166 -30 -12 103 -163 161 -116 -158 88 157
4814A57j55K36m1j62K7l16K73o0n9J48p3j6K70l47K90l92R0r7L41k42j10j78N36
4837A20j72O0k07M44k05j00K00k52p1n4Q5J25m2r6K2p3M61k88r3K46J6j62J17
4860H1J03l16N7M1j49K15K2J92j5k27j11J71l32L18M5M4k02J42J12m47L08L35
4882C87l45m8K07l5l85L6J19j25L66K9l08K28m9j47j73Q9J66L46n22O31m52O5
4904H0j56J98j52m2J39n9K0j93R6K08k62K39k09M04p41N18L5k71L64k39K35k2
4926A90j20j43J46j55J98L08j31k30K3j85Q3J81j28m1o9J33k48M63n53j43M74
4947E3m2L1r8j6jJ7qM1J8J41k92K07L9k07J1J47P3j57l6J54r1j00J92J6J3p0J19
4974A54l48M10o9j54J0m2p0M1k45K10R6J21K11l25J04J79l19R5k03M21l21j33
$$ plain form
4814 157 2 238 197 35 62 -254 19 -41 -100 48 -25 -41 229 -118 172 -220 -130 -227 114 -128 -238 -416 120
4837 120 -52 8 -199 245 40 -60 140 -112 -183 -237 -152 -27 -69 -165 -143 -216 245 -43 -136 110 126 -36 81
4860 81 184 -132 -75 -34 -183 32 54 246 231 4 -107 64 -268 50 95 139 -63 79 191 -256 52 387
4882 387 42 -6 201 166 -219 -183 -64 -189 177 206 -102 126 77 -70 -243 -154 12 358 -164 467 15 80
4904 80 -76 122 -30 -72 67 8 28 -165 -69 139 -123 116 -93 311 -430 88 123 -148 216 -23 212 190
4926 190 70 -73 73 -82 116 424 293 63 86 -99 -16 165 37 -4 -73 60 -188 275 -278 -421 53
4947 53 11 42 -56 -72 -73 -56 -64 -23 -5 136 -156 51 90 -117 -106 41 114 -43 -79 75 -16 -116 76 92 105 35 154
4974 154 -194 216 147 -7 3 -39 -109 -68 -313 -103 -7 114 325 0 104 283 -36 59 -144 277 -44 -177
4996a77K82j2j02m7l55L69q4K87k43L6l7k4K47j7k30k43L54r4k10K59m9l1J19
5019bJ5N4j69P1K26m38J75l6J68o0l5o6N3M53l96J2j08J06K2k36O74k03l64J70
5043H6j04q8J66k1j8O6M53m13j98K03r0k12J88k7N3L4j14J32l0N1l48J00K11L
5067H3o6K86j85p5j73J83L70k40j94K91j83l37K37J92m17%J81p8J99Q4m2k24J49
5090D1J18m9j7k0r8J20r6m6K02j64K28j16j08l4L85r1k51k62K66k27K24j06j54
5113b55L94m23J35R4K83j78M6l8k52J73J6M3l61M35Mk8R3k07K20l9j54j10k46
5136c55J62L88j43j04K69P7N0m84J25K0n7m9J76j10L56l01J27k39K08k42J60j04
5158g0J52q3J64k40O7Q3l18K13M9o5j05K30k60J63J54j71k27K28J80k06j73K28
$$ plain form
4996 -177 105 93 -9 -56 -411 -42 -126 161 -82 -46 -83 -107 140 123 -107 -350 4 -90 -300 -41 -90 -121 -2
5019 -2 13 67 -102 -31 195 -243 -68 -104 64 4 -31 -97 -44 409 13 25 -83 23 45 -191 483 280 -84 86
5043 86 -18 -106 60 39 21 87 540 127 -71 132 42 -170 18 -9 44 78 -36 96 66 117 -231 -131 80 83
5067 83 17 303 118 43 -130 53 423 183 -11 280 97 -240 -3 189 -228 -228 -47 -125 74 158 116 -108 41
5090 41 159 110 93 73 -25 95 -1 -47 155 -9 219 103 -5 -39 346 255 4 -258 8 -219 5 -101 -255
5113 -255 139 -284 -149 -55 228 50 96 58 -194 -21 -5 38 -323 112 116 88 181 -26 194 155 1 -109 -355
5136 -355 -193 195 52 -52 217 294 344 -140 -15 5 -52 -101 75 -35 321 20 147 -92 116 -126 34 -70
5158 -70 82 -1 163 -77 -10 73 -245 -32 17 -48 -153 77 -183 -20 134 -37 -264 -36 144 -62 -235 -7
5180gK25k91j9J70K40l81L66l73J37J82j04p6j07Q1J38n49J27L06k06L51%j57
5202E3J27k28Q4rL4O6P8j1Q7j12j92Q4J78l26M9J42k23M24j03m53L04M7n2n1L4
5227C1j96M20j70k70p0K12K15j43nJj86K30j93K58m21R2J33o3K07k16L25k77K2
5250f4L69N2j48j28oN9j81j65L21k24j01M37j75P4j54n4K86m7l73J52J38j28J07
5273D7l88J15KN08j10j15j49K38q1j47NN3j5j70J11J81p9j05N5Q6J91k98n3J1
5297a07j09K58j76K04Qj77L75k16j25J71p5O0k96M06k57k10J39J00m72P08m44
5318b35J47J43k08P7J96j2l41J45j66K03K55m23K37k40J91K39j56j66M1K9k43
5339b87K44J36l12RK87m11L64Q3k19J92J93k74j57K21J7K24l49k18K21K0R1k94
$$ plain form
5180 -7 218 -73 -92 78 318 -63 303 -70 67 249 145 69 -38 43 181 -368 -241 65 -141 210 210 53
5202 53 180 -48 36 27 61 127 205 194 281 169 -23 61 239 -87 -38 104 -119 305 202 -251 53 100 48 -3 31
5227 31 -165 255 85 -185 -255 -43 172 29 24 25 -161 69 -124 134 -287 -195 -62 -125 82 -134 191 -86 -64
5250 -64 305 357 209 81 75 134 -47 -212 109 -115 -216 221 46 120 -34 -88 198 151 -222 -70 68 -60 47
5273 47 -341 -226 -224 284 174 59 -90 148 67 -80 -75 -22 -37 -207 -96 85 6 -99 -44 42 233 -65 -118 -107
5297 -107 -216 42 -134 70 78 -99 276 60 -65 106 31 91 -205 201 -56 -266 -127 -27 -499 209 -235
5318 -235 -88 55 -153 -76 120 108 -233 -88 -254 -51 204 -219 18 -222 -31 208 52 -114 -73 -44 -287
5339 -287 -43 93 -219 -210 77 -334 30 113 -106 86 279 5 -152 69 86 310 -39 -257 -36 -16 75 -219
5361b19L02pJ59k62j50J55L59l62J93j77J0R4k24R1K82n14K19m5K65k90N47k58
5383A68j14kM5K28l35M3Kl5K17N2n5L7k54j18M28k37j73L95j80o1j74J97k88J71
5407d3L30k93Q5R3k13k97K60K03k09j87P6K33j13L04l14O8o4NJ15k06J48J32j99
5430h6J84k05K48j27K50j22m6j99N5K00r1k98K61J99k08o7j52M49l43K64k15L71
5452C22k47k25KK33k17j5N9J14p5jnJ7r4j98N76n02L07m94M04Q7oM9m9j02m5k96
5478d01J24K13j22O7J69R6j38m1J13R0j95r3M4J22m1l55M61k78j16N8R5l4J50
5501a2L03m20k46M45K6K44k61l02M69j33p8l79K94k31M61j24k50K87l58L47J90
5522B72n6m37N20l02lm6K46l54M0K99j48K19k6m43K22K25l63J30L0Km9j07p6J65
$$ plain form
5361 -219 83 76 235 -27 -177 -22 337 -25 168 -9 1 95 -129 -38 244 -270 -51 -96 169 -121 426 168
5383 168 54 52 97 325 -10 33 35 0 217 269 214 251 -3 -121 307 70 -103 292 112 51 -123 74 -214 -43
5407 -43 287 -6 79 172 -41 -338 -78 125 -84 -271 -195 38 -75 229 -85 -17 -81 -76 39 -167 -19 113 -86
5430 -86 98 -107 141 14 264 142 96 -103 -48 152 61 -237 24 223 15 -52 -204 245 -98 166 -49 322
5452 322 75 -150 -148 85 -132 -147 -88 26 -49 -50 -55 -38 -132 -330 246 -256 51 -443 -39 48 42 91 42 -60 -105 -401
5478 -401 -277 -64 -186 -119 50 146 8 -33 80 170 -25 -118 -74 48 7 -348 113 -165 -281 -223 -128 -162 -12
5501 -12 291 -129 -375 70 96 340 79 -223 246 113 35 -344 -50 -281 180 56 -194 93 -265 82 272
5522 272 216 -221 299 -3 -6 -52 194 -160 -120 179 31 250 224 -219 3 228 -135 -5 25 27 -22 -129 -205 -40
5546d0k5kM88l33k13o8L43n2m5l38R9L11R8k45Q7J23j91O7k97K48K8j43O5M1J40
5571A46j90J76J08P6m72J60k12M74k07qP7m1j40kQ5k11K25J24j21m2N6K09l01
5594c1nj17J93p8R2l52K50K46m50J15l8J02K83j67M9l13K95l5k69K20J02Q1j20
5617E3j5R3o0j30J83m16J82K02l24J79J32L28l06M9k51l3L85j76k90L31k79J16
5639d7mJ56j76J57Q6k98J68r8J33l72M31k56K34k39J6J10k3j53N1K52k81Q9l64
5662d28L83PK09l06j34M49k43K96l46k13L20K29l33J22j46L23j28l3J42j39r6
5683f5P6J39j1j41j89M00k03r2J9j08J72p0J81l48J35K46j14M0k15K87k40K61
5705A60R7j08L5k09K3R6J66q4n87K38k4J65J94j54J6j70K27n06P64m32j83K63
$$ plain form
5546 -40 -65 -67 421 88 -125 -193 150 98 53 -285 -186 125 223 -22 65 188 -3 64 -233 15 43 -100 -35 6 146
5571 146 -44 132 240 316 -156 4 -208 266 59 51 128 87 -53 -55 30 -181 44 168 47 5 61 270 -31
5594 -31 -36 -153 40 -38 54 -298 -48 198 -252 -137 -175 -73 210 43 92 -221 74 39 -230 -10 92 173 53
5617 53 38 131 71 -59 124 -292 -110 92 -232 -53 79 407 101 150 -101 -134 251 75 -215 116 -163 -47
5639 -47 -51 105 -71 86 172 -126 42 -56 77 -295 136 -120 114 -125 -109 1 -22 -175 -124 128 -153 -64 -428
5662 -428 -45 -38 171 -135 -269 180 -63 233 -113 -326 -6 223 -110 12 -134 189 61 28 170 31 -65
5683 -65 11 150 139 -2 -191 209 6 -86 -67 -175 -3 -73 108 -240 -105 141 27 67 -148 139 -101 160
5705 160 257 149 184 -25 -2 94 260 176 -411 -173 -197 -32 162 8 24 -146 81 -425 339 -93 -276 -13
5727a3J72j68k02K81k00K9N2Q9q8q1J85j66L48k17L04q5m38K54lj29O2P3k36K51
5751G4k55L49j87p7J15N3j46M6q3J95j13j4K8j95m69O41K04l30M46l37j28L03
5773A20l58J94k34J32L4P7O5M2o9l30K11K36P0n39K48k2r3j53J78J75j56M7J31
5796Fn7PL5J35j86Q8n4J07l1k40K90k64J39j43L38m99N32n5o0m3k39N1M02j72
5820H7j37J84R0q0J25k23k43K21J08j27j94K45j29N4qR6l03r4N54M4r7m34J0M09
5844A58Jk52m2J04j04L71j48j41L2qk76J61r8K12J48L15j68m04J12N6k18M02j92
5867B1K65j4j96l49P16m58k11K88k21J64M1q3R3l55L37k4p8O4k85K83j29j81K35
5890g7K19k71j43K31J33j96K34k52L4L0K30l22J95j80K24Mk9k06m1K47l8m4j25
$$ plain form
5727 -13 159 -9 -211 70 -130 -101 -49 40 -48 -129 56 -110 238 21 325 240 -198 56 53 -76 -14 59 -177 74
5751 74 -181 168 -19 -96 19 72 -74 -28 -111 84 -29 -43 -15 -210 -679 -38 166 -164 282 -55 -183 120
5773 120 -238 -44 -278 -146 -112 -35 30 72 3 -327 -116 120 190 -349 -101 -123 -216 -369 -191 -16 -172 -125 6
5796 6 -51 -44 -9 126 -60 28 -26 81 50 -190 100 -164 -25 -168 170 -329 203 148 88 45 -194 -143 259 87
5820 87 -50 134 224 144 269 46 -197 24 132 5 -189 56 -73 -19 -27 69 -234 -328 226 270 173 -261 -251 158
5844 158 159 -93 -135 -31 -135 236 88 -53 -21 -29 -305 -144 -242 -30 118 433 265 -139 -27 29 -189 213 21
5867 21 286 272 76 -273 443 -15 -226 62 -159 5 46 -37 56 -299 38 14 -64 0 -285 -2 -131 -312 -77
5890 -77 142 -129 -272 -41 92 -104 130 -122 -88 -58 172 -150 45 -135 89 93 64 -142 -183 64 26 -18 -143
5913a43K82l36L89k02j83K3M12j76k9r8m8pJ89mj54J90l4o8N1j0j13k15K53L50
5937C19k93l5RJ80q5N2k59L64m11K89J03k33J36j01N8Lj14j21K80q8j27J21M9
5960I6j26LJ40J92k78m9j96O29l54l73K66J55pJ20n4j73O7l3J36k02J60j72q3
5983a36p9L36K54n01K33n9J58l02K7J09J30k62j98P5m3M39j51l62L61k5N3M2k37
6006a38J22M6k72l6K24R0j31K30o3k68m9L78l16k27L48Q7j9m9L12l20N9L42l30
6029B0k42J47K30p1k93M79k94p1J54k45K59l21L05k12P9J35m5j85RL85J8r1r2
6052E8j39L8k24L98o38M92K25l87R3Q9MJ33j02O9p2k39J09r6J4J20J70k67J9o7
6076b00J1M75J19l15k75M86l01q4L16M2l03P8q5K03l11M20l13M2L3k18K08J35
$$ plain form
5913 -143 139 -197 192 -10 -193 -170 242 66 37 -61 -109 -116 73 69 -85 105 71 3 54 44 -69 -284 -31 319
5937 319 26 -9 0 180 95 147 -112 252 -159 130 233 0 136 35 93 96 -18 -139 141 53 -74 47 96
5960 96 -30 -27 113 305 27 -22 -218 411 57 -316 -50 105 98 218 164 -9 58 25 161 -41 119 -53 -136
5983 -136 -215 121 375 -126 107 48 206 -96 -69 40 170 -92 -290 -215 -258 181 30 -332 29 4 57 99 -138
6006 -138 -16 30 -242 -278 -54 36 -95 135 72 -196 -245 133 -183 -410 -62 25 6 -43 269 -51 8 350 20
6029 20 -222 -75 155 84 -209 270 -24 -95 59 -186 73 -248 57 -155 -76 59 14 -171 -162 223 241 150 58
6052 58 -81 -43 -267 131 -507 -15 210 -177 -84 5 9 142 40 109 37 -202 -93 -189 -175 -55 115 -152 -133 -200
6076 -200 -189 286 405 90 -185 301 0 -84 232 274 -29 49 -36 167 -144 276 -37 5 38 -180 28 163
6098A63j90J27k2l53P46m04J52K25n24K61R6m81L9O2p6L5K05M4J65j34l17K53
6120G2k59J19L36k49J05j79K3l6Q5j07K4K92L0j69j95J34P8r4P0R3M0l48p8J90
6144b3K13j54q5oJ16K30k59j60q7M44q3k12N6j40N4K91k23j22J65K37l20j55J52
6167g1K1J01j02l98N65m29L64J14J9j61L5n74N96j27r8L59M4k40l8j14K21p6j22
6190a11r6J29R7j92N21n00L33l74j2M05k21R1N0L7j43m2j67K04k48J08K14j74
6212i1K1L27k66J50j8k26q4J4L36j14K08k91J11j97J07Mk3p2K12k53L81k17J09
6235A28J46n21L29Q9k34J1J57r7J3R8j17q3J19O2j73L60l36J34O8k07J67N7r5
6258G5k84J10M04l60J71k98L5K66j38L27p2j35p1j33JK62j58r2j6M6J69k37k9
$$ plain form
6098 163 -27 100 78 -275 471 67 219 444 -80 181 277 -204 -165 -103 -179 -144 61 105 270 136 -181 72
6120 72 -187 -68 268 19 124 -55 -32 -68 17 -90 -66 226 256 87 -108 26 104 10 80 173 213 -135 -213 -23
6144 -23 190 36 -49 -55 61 291 32 -128 -215 229 146 -66 -10 -150 -96 195 -28 -150 15 252 -68 -223 -71
6167 -71 -50 51 -51 -449 116 -313 51 165 184 23 58 -516 80 -47 -145 214 258 18 -20 -134 87 11 -111
6190 -111 -207 -78 19 -173 348 -152 181 -193 -205 200 -21 70 120 157 14 -28 -195 9 -239 -131 83 -91
6212 -91 -70 257 -9 141 123 -103 -187 -173 163 49 257 -34 77 -120 -13 -9 -32 -104 108 -145 236 19 128
6235 128 274 -247 82 171 -63 -52 105 8 21 119 2 -81 38 100 -73 287 -49 85 153 -54 113 170 75
6258 75 -209 -99 305 -55 116 -182 -147 119 -19 308 236 101 30 -103 -102 160 2 -90 -106 -60 109 -128 -157
6281a57K26J24j52pj33J29l6l8j08J34k17L40l15L41p9N6k22j62K12P8p1J29J92
6304B64l03N7j97L87j20K8j20j90J45Q1NL4j18r0M06j87K11k81k7J23j33K30l81
6327a76J13J70kR4j72nj09j10OK09K6Rj88J99k19J20l23M14qmr6M9k53q8M60j72
6353e6J79p0J16O7l19K14j20j17j44K07J02j15o6J84l07L44Mj44P1k13J85kM6
6376D6j38k61O25l22j59J27M00n29N53k41l16K84k04K78m9Q6po7o08L16L69K09
6398C92m87MJ27mO6k08k1J51K01m38J93j01L47k20J01m13J45qn6K39R6k39K1R9
6422a3k6l08M92k84K1L91l40O6J04n0j67K26J07k15l93O07j61l5J53j27n2J64
6444A60j26K8J39l03J11J1k55N08l35K07k79n0M31m90R2P6P0J04j83j06N2J29
$$ plain form
6281 -157 69 193 41 34 -99 30 -6 -44 -152 -18 -235 105 -210 131 52 108 -114 -276 -64 14 -57 72 264
6304 264 -39 18 -179 208 88 116 -4 -194 -49 32 37 71 -47 -137 269 82 293 12 -15 108 -25 205 -176
6327 -176 -63 107 105 199 27 22 -87 -197 -191 18 44 53 -135 64 -155 -35 -358 56 48 44 -52 -3 -256 -344 116 -56
6353 -56 123 53 169 236 -83 131 11 -106 -250 -43 59 -56 -122 62 -245 99 103 -41 30 -183 2 0 46
6376 46 -92 -353 272 -50 -209 -82 318 -211 342 101 -215 69 -135 143 94 180 173 106 -502 -186 183 392
6398 392 -95 -91 36 32 98 -110 -131 20 221 -217 -24 -125 222 2 103 -310 -165 -173 -229 10 106 -133 -112 -13
6422 -13 -39 -347 145 -139 -118 273 -67 -1 103 53 -114 112 219 4 -389 218 57 22 175 48 -4 160
6444 160 34 62 201 -102 9 20 -235 273 -62 145 -134 -184 247 -243 -151 -75 -5 99 -84 -190 -138 -9
6466iK40l81J97j06J3j1k67L60j82r1N05n23L10J55l07K57j21k4N2K4jk14K6L3
6490f5M13k51k84R8K47j12m8J36q4p8K87j59q2J08j52l1K49k19J91m32L40K75
6512C47m28K7J12j05j61P8J63j82oK3j50L50k20J25J1j3k14K11J98k17N4R2J59
6535B54k00q1J67k19O3k18J76L1k5J75q1k09O6K83l52L43l68K45lJ82k80L17l74
6558a08j21J45J99K8j46P4k07j77N61j99l8k00j7J51J5j74l3J69m8K1J00J79k39
6581f5p6R3M7l07L43R0K6j30L25m70j27J18j36J11M1Q2j1j0l11K85J48L0J18o9
6605A45l07j41K37Q4j55L90n62J84J53j9J58j26J3N7j25J48m5j81J45N0K02k85
6627B0l27L62J46m87J03j03K78K59j01j34J2n1J19j89L41k07k1n5j30K33r7N6
$$ plain form
6466 -9 231 -150 47 -59 -46 -57 -324 36 -146 -237 268 -255 55 210 -97 160 39 15 67 91 90 -124 -98 -65
6490 -65 348 97 -187 -89 158 46 -2 134 50 -28 259 100 18 126 -26 -57 192 -27 164 -268 72 347
6512 347 -81 -54 58 -47 -208 -130 33 -149 -155 -132 -282 68 -152 -27 -16 -29 -243 -32 166 -51 3 95 254
6535 254 54 -27 140 -79 -16 -234 -58 -27 -52 123 42 -167 -101 182 -170 173 -195 50 47 229 -51 266 -108
6558 -108 -229 -84 115 143 -3 71 -136 -313 248 49 11 -189 -206 -55 -40 -214 -247 -78 -126 -105 -5 174 -65
6581 -65 -141 -48 -1 -308 35 125 151 21 346 -124 -251 -133 -269 -158 -117 -35 -46 -56 -367 -82 66 96 214 145
6605 145 -162 -303 -66 18 -137 253 -309 -125 28 9 167 41 54 111 -14 134 89 -92 53 103 305 20
6627 20 -307 55 201 -286 -183 -286 -8 251 150 16 28 -23 96 -93 248 41 20 -35 -165 68 -29 27
6649B7j90L82l19L48k18N9j29J28J04L6m5j95k03NK39Oj46M4J82j04J15m6J5j00
6673er6M11j51J0m1J78l75K2p0j7pj66M47r5q8j08P3J83J95m62j25K18Q3j01J45
6698E8r1MJ82l42J53j2J69l23J94j73K63p1Q4k78P4j08L37k96L44r7k97L92l50
6721a84L25j60J46k23r4K26k53j45N73j36k42K15j32K52m00J84L13k72K31m29
6741b05l7M5K01K97l44J2j07M57l07K6N8k92J2n4J30%Q1j38J27K19O0j34n4k7
6765B6j21j25l6J19J03J56k34K38k3j50j23R8q1J48L6j76L4J41J38j91k73K06
6787i0p2j3jL00L7m65L68J19j96J04N4l02J09j6J23j48O1Q5k17J95k08N2K59J30
6811B68o1j66K23j69q0q8K3k58O67j29l92K89l82M57J32l01Q2o3K5j99L36k25
$$ plain form
6649 27 -163 219 -100 248 30 89 -40 88 192 228 183 -12 -215 -210 29 35 -111 -67 115 11 126 80 95 -5
6673 -5 -101 310 159 169 128 306 -69 -47 -117 -134 -141 -307 140 45 -43 -151 -78 105 300 -162 -287 -69 14 -87 58
6698 58 -33 -29 153 -189 -36 -48 121 -202 -8 -181 82 11 95 -183 -109 -217 120 -176 168 71 -226 166 -184
6721 -184 141 -19 127 -96 -190 36 -217 -362 211 75 -167 48 -84 168 -232 -48 265 -7 224 -205
6741 -205 -242 -197 4 301 -43 -31 -138 319 12 38 96 -196 -184 -238 -108 -108 -27 -165 -38 181 241 107 53 26
6765 26 -95 -220 -256 -137 -34 122 -112 126 103 -47 -170 -72 -153 -5 31 -145 -111 30 168 -23 -296 -90
6787 -90 -162 -175 -176 124 161 -304 64 183 -13 91 145 -157 -48 -64 59 -89 -28 57 -160 35 -173 -121 138 268
6811 268 207 41 264 95 15 -73 -50 -308 359 230 -162 127 -255 202 334 33 115 52 77 -122 214 -11
6833a1J31J90m06k23J13J14K48k80j29OK88p4n9J25l55L90j16O6q2l13N38j27
6855C4L3P0m36M24J01J22j27j86L7M74m02J75m64k4L07r3J12l01J63l6L18k02
6877I9k03K93l41J26q0r2P7K95k56j11N00n09K64o7J83j75j00K67J24k09k04K49
6899A30j91jJ67m5J55k08Q8Km07M30K77o43K35K21j02k41O7R5o7M5p9P4J66l34
6923a66r5L10j04J1k03J81Q4J24P3m91J08L49p8l17j7K92n3j5L1P2m0j92P0J87
6947A21l33M61j89j34J93j16j18j4j43L83K52m26J06q7p3J39J13l7j42j97K92
6968E1J88j58Rm29K16M17j51k62k9K95q2o8J00j23j13K49k52J24K25k02J98Q4
6990B87j60k35K02j99J09m9l8j32K11O3K5p4j8M25n58K00j66j31K34L07n04M25
$$ plain form
6833 -11 120 310 -96 -319 -206 -92 156 -124 -253 -247 41 -33 -92 33 -322 68 -48 18 -64 -377 161 34
6855 34 67 137 -299 125 226 348 221 35 72 546 144 319 -145 -169 138 45 157 -144 19 -17 301 99
6877 99 -104 189 -152 -26 -106 -198 -121 174 -82 -193 307 -202 62 -5 178 3 -97 170 294 85 -119 130
6899 130 -61 -62 105 60 215 7 95 97 -310 120 397 -246 -11 210 108 -133 -66 29 -38 7 -72 2 168 -166
6923 -166 -261 49 -55 -44 -247 -66 18 142 215 -276 -168 181 103 -214 -231 61 8 -7 24 96 56 -136 -66 121
6947 121 -212 249 60 -74 119 3 -115 -129 -272 111 363 -63 43 -44 -117 22 135 98 -44 -241 51
6968 51 239 81 90 -339 -123 294 143 -119 -148 147 65 -3 97 -26 -139 110 -142 -18 207 5 203 287
6990 287 127 -108 94 -105 4 -45 -83 -215 -4 59 84 10 -8 417 -141 59 -107 -238 -4 303 -201 224
7012B24m31J54J6R8Ok1j72r1L48k13J48l18J20K80k78P9k2M8r3K19j85l59L2N5
7036c56M45k24K57j97K79Jl1n4k17N6K91m92M14k36P3Q0J23l06K42j64o14N08
7058a22O4K06J33n31K76Ml75O34k50J12k39J93J14l48R9j09L06Mk40J16M0J17
7080B04k97J77J12k80j88L3J20l2J98j69K89k42L77j81j7K80m85j85J64K95j46
7101B7j46J98K16j51m11L46k04m5J67q7m3J21L28j98J47k38r2Q4O1k89K22n9K58
7124B12N7Q6l69p2k0J20j95K48q8l12L75j39L05l14J56j33P8J53J6j70o0q7K98
7147A45j66J79n06M2p5K93L78k34R4K3n8l45L02j59J50q0r5O8J15j44k19K43n5
7170a04K4j16K51J24l95J97J27M1k61L53n8m49J80j72q8M35k5J95k35j74O6k5
$$ plain form
7012 224 -207 -53 -37 61 67 46 -126 -217 131 -82 66 -252 -132 148 -130 -51 -73 -25 -118 101 -84 -443 -411 -356
7036 -356 89 -135 122 -75 204 205 174 120 -97 -41 250 -242 172 -64 9 89 212 -94 148 -16 -630 -122
7058 -122 -58 148 281 -250 26 30 -345 289 39 151 -88 105 219 -129 -30 -139 167 171 -69 47 87 204
7080 204 -93 84 196 -84 -272 -239 -119 -151 47 -122 167 -75 302 121 104 384 -101 -286 -122 173 27
7101 27 -119 79 295 144 -267 79 -125 -170 -3 -90 -133 -12 316 118 265 27 -65 19 80 -209 13 -46 212
7124 212 269 355 -14 -86 -106 14 -181 67 -21 -333 42 -97 208 -106 50 -83 -5 148 164 -6 -66 -153 145
7147 145 -21 158 -348 -306 -381 -88 290 56 150 173 115 -230 72 -87 63 -17 -112 -44 71 -73 -292 -49 -104
7170 -104 -80 -196 55 179 -216 -19 108 149 -112 241 183 -266 -86 -258 -346 89 64 259 24 -150 -84 -109
7192a09K36l59K00K04j44K4j43M97n12L22j00n9K53j76k21J88k36Q7M3p1J22J42
7214A88k76R0j16L5M20l06r7q1K01m9O5J32J02k16k45j8j82K53L5j15L43m94N28
7237A97k39k39L52j16j65J80m2J37KJ91l83J35J84r6p6l97M66q3j0J3o9j46q5
7260b89M37Oj34p4R2m3P0n2O0L00o3k68Q4k30J12J21J26p6M1p8k45J83j57j09
7284a86Q7Q7Q7L17n80O8J96j40K79k84L6L3R6j12L92m12j25nj5l5J98M71n16J29
7308F6O8K55l92J41k09K78j53j40Q0j42j95M32j32K26k77Q5J26m9m56L24J95k40
7330a09O8j2m1K71k66o5j48K78j88K85j12l1oJ6k4L51r2r6j08O6M5K93l89J62
7354A48j19oK61k69K4J58r6L1k82K9j9L67l39J14j14j43M82m52K69l21K53J92
$$ plain form
7192 -109 127 -232 -32 172 28 52 -91 406 -106 216 116 57 310 134 -87 101 -135 -48 -5 -76 46 188
7214 188 -88 2 -114 -79 341 35 -62 -143 58 9 74 206 308 92 -153 -171 -353 -100 -65 -180 163 -331 197
7237 197 -42 -281 71 -45 -210 -30 -72 65 67 258 -125 10 194 98 22 -375 91 8 -2 11 -58 -204 -289
7260 -289 148 154 20 -54 38 -5 65 13 73 373 310 42 126 -104 8 129 255 179 220 142 -103 80 -77 -186
7284 -186 -99 -12 75 392 -188 -120 76 -64 215 -69 -33 0 96 -16 376 -36 -161 -166 -181 -216 -18 453 -63 66
7308 66 134 389 -3 138 -71 207 54 -86 -6 -148 -343 89 -43 183 -94 -9 117 68 -388 -64 131 -109
7330 -109 -41 -53 -94 177 -89 -154 -302 -24 -212 73 -39 -70 -76 -60 -84 267 175 79 -29 37 82 375 -14 148
7354 148 29 23 284 15 39 197 101 132 -150 -121 -140 227 -112 2 -112 -255 227 -225 44 -277 -24 168
7376A68Q9k42n3J17l15K57j84m1K13j15M45m19j14RJ70J71j4j94J08K5O6k82J65
7399C0Q6j04P0q7j09Q6J75j9p9L13l89J82o4p3J75K4j87J23k15J59J50n12L72
7422A07j54J99l26J06o0j9J46M13k61m4k40J42R0q2M19n21k11J30K41k45Q1o1
7444a50M1M8J45J5o9K4R6l47L03n9p0k25K26k1L62n61K85j03J02J22l32K45L5
7467A12j68K05j6j30K7j30N7p2mK76L5k92M2J75Mj62r0Q2j49L76q0l24O8M45n69
7492b82O9L94n19N24k94J26j81p1J96j44R8K59o7l98L31J80j70k42N5J75j19J01
7514B1k84M04k16J44m4n33N95Q6o8P6j31K09o47K16K94r3j14j52K61qM42o52N40
7537C46p28J02K6M84k13j70o3J6O08m75l6K03k06K7K72j54J00l45K9K15J93k18
$$ plain form
7376 168 257 15 -38 79 -236 21 -163 -204 9 -106 339 -80 -194 -185 -15 156 142 -52 56 81 147 -135 30
7399 30 116 12 82 -5 -114 -28 147 128 49 362 -27 155 91 18 193 217 30 153 -62 97 247 -265 107
7422 107 -47 152 -174 -68 -128 -147 -1 412 151 107 -133 9 99 17 436 -85 -296 -166 75 -170 -89 -150
7444 -150 -109 -61 84 99 30 54 150 -197 106 47 -23 -248 -22 -43 319 -242 43 -60 42 164 -168 77 112
7467 112 -56 149 133 3 30 -100 -43 -115 -119 157 192 -100 -58 117 121 -41 -131 -49 -198 178 98 -226 -158 287 -282
7492 -282 -213 181 -338 186 -108 18 -163 -234 -38 -182 -84 175 108 -290 41 221 51 -191 -136 39 -80 21
7514 21 -263 141 -75 69 25 -508 87 173 105 181 50 259 -388 -172 122 29 -85 -237 24 16 458 -194 346
7537 346 -382 -280 -254 230 17 -153 -216 -200 408 -67 -103 100 -106 -79 193 39 139 -206 -177 38 231 13
7559A3jr5J62j53J99k49J61k41L40k78K86k83L81l55J80l12k9L42O1k62mq5L19
7582I7K53p42O10k20J17P6k00r3J47R8l4j6m0J51j85j03R0n3k64L90l35O24l12
7605E6j84J37J22k03K69j3k69l3K44k87rJ40L8P0J12l16j07M98l70O4M18l48J00
7628A29k82J69o5p6J60k25M06J26l10j37K8N6l0R2j38rK19m23M99k02K2j47J73
7651C5J12p5jj79Q0j9J08j67J61j3k14K72k99m0L2P4K07l38L18j73L11m7m0j56
7675e1l18L82N5J14j36p4N6l56J66N4J08l6L5K06j56o9j2Q5j05r2N28m44K55L1
7699B26k27k29K51j13K99k70pk93L04jj64l6K83J47Q1l06r5L15k62R9j9k44J21
7722a40j2J92k16O4K31k20J06M7n0K09l12m9L45k20L6J70o2k88K04j56L03Q5n40
$$ plain form
7559 13 12 -83 79 -74 125 -124 37 -204 136 -142 144 -139 242 -113 67 -245 -274 68 129 -133 -137 -222 97
7582 97 350 -392 218 -2 115 191 -9 -102 45 143 109 93 53 204 19 -84 6 -47 -311 79 -256 368 56
7605 56 -128 9 131 -72 197 184 -85 -118 126 -161 -170 -30 8 78 190 -126 -233 265 -105 -41 377 29 129
7628 129 -153 16 -49 -125 35 -190 216 342 32 -105 -77 -21 -51 41 -97 -106 113 -310 189 -13 9 -138 35
7651 35 147 72 71 -108 -28 -47 61 -106 55 42 -172 100 -199 -239 -207 -133 74 -264 54 -119 192 145 105 -51
7675 -51 -369 13 68 182 46 -28 28 -328 -162 -108 0 -36 -1 205 49 -20 -32 53 -52 -144 384 -60 195 226
7699 226 -1 -230 21 -92 207 -63 -70 -363 -59 -60 -224 -260 23 170 251 -55 -150 165 -97 2 -17 -261 -140
7722 -140 -152 40 -176 -112 119 -101 5 52 2 211 -101 -150 195 -25 11 181 119 -169 35 -121 182 267 -273
7745b73K49j34N23l17M58o25j68L9jL65j98n8j07J11J03K52k04M7J0J24j13J37
7767B20m34M78l81m5N4K76l03Q7l8J29m0l50N3j61P11o21M15q2k64R8K6K08n2
7790a6M7n18N83k21J4K49k06q2M16l76M92l35m3J02Mj18J33n0j48j5J55k59K71
7813G9k54J00L6R5J60l51%J39j10J23n3K35k76J79k12J25j08K89m11M00k92J15
7835Hk69J76J59r9K84l34j47L27R2k40m5J66Or3K36k66k9j2J28j69J67n1q0K75
7859A90l30K36j14J32L2j80L9rq1J40j14n2K40k34J09k4P2j0j1m39L22J06P2k46
7883a54J40J3j3L64k34j73J15o8L30l33Q0J11l43J5J17L4p8K38n7k11M56l42j40
7906a33L55n7J40j51p7j95J78N8J34k26J25R0k59K7j23q2M9o6J52m8J13K38o1
$$ plain form
7745 -273 -24 -158 365 48 506 -119 -287 -248 -249 116 -82 -140 -247 -136 -33 219 15 62 72 196 83 220
7767 220 -214 264 -117 -162 -108 168 -135 -48 -86 43 3 -347 -294 -455 256 -365 50 -32 -296 -198 -172 36 -16
7790 -16 31 -487 96 -125 -111 138 -68 -150 266 -110 382 47 4 106 110 -8 125 75 -73 -88 67 -192 79
7813 79 -175 -75 -39 56 216 -135 -135 4 -106 17 -36 199 -77 102 -110 15 -93 196 -215 185 -107 8
7835 8 -261 -85 74 -25 259 -75 -222 105 197 -43 -88 78 84 -9 227 -39 -68 -80 48 -121 46 -5 -85 190
7859 190 -140 96 -18 114 146 -34 5 -4 -85 55 -59 -111 129 -105 4 -20 52 42 31 -408 -86 20 92 -154
7883 -154 -14 -1 -14 350 116 -57 58 -10 320 -13 67 178 -165 -150 -33 1 -77 161 104 -107 349 7 -133
7906 -133 222 165 305 154 77 -118 60 118 252 26 151 241 -18 9 -114 -196 -147 -213 -61 -109 4 242 181
7929A81k43J33m17M01j19p2Q3K07J02j36Qk56j85K18J64l67M18J3m51L65j00k3
7951g6m8R5j03L46k05j0km97K99M81j30j28j57J08J7R0m4J09q6J76l16KK02k8
7975I5j63K26n08L63J36m7l4J82l00L04j20k22J0J7J17m11M39q7j18L53l39L19
7997B12Pk24J27j4M8l70K77j75J24j3l28J92J24J58j71P1r3p1k0L57k41J6l2Q5
8021D6J06R3k33J19l94N39j74L59n96J00K33o0k54K73l35L92k49k18J75K98k38
8042a8r5Q2k00K26j29K69k34j87M13m19K35J48m49N51j07j34N7k97L66O7j61N3
8064C7P5l04n7N4L66pq0J05j32M1j63l1K04j94j92p7O08m56O8Q6J53k4J45j89
8088C6k6K63k70j31M0M18l95K38p3j07k61J68K26j48J96l33M24k14J32l1q8K0
$$ plain form
7929 181 -62 71 -346 55 -64 -136 -53 154 256 120 128 -128 -313 -95 69 -298 120 133 -318 47 -53 -76
7951 -76 -124 -29 -132 214 9 -1 -3 -500 -201 280 150 22 -135 -27 -10 80 36 145 59 235 -81 -79 123 95
7975 95 -68 158 -350 13 149 102 68 250 -50 254 134 -88 -78 -61 56 -355 84 -3 -121 232 -107 212
7997 212 219 -5 122 108 156 -214 63 -112 12 -1 -329 -137 -13 145 -26 45 -48 -119 -139 218 -23 -7 -39 46
8021 46 152 245 12 131 -263 276 102 461 -135 -35 198 138 -116 157 -178 214 -35 -253 -78 220 -18
8042 -18 -113 -31 -231 -5 -134 135 -99 -286 127 -292 -57 91 -358 193 86 -48 9 -288 78 145 -16 37
8064 37 112 -192 -249 -195 171 164 84 189 57 98 -65 -96 108 -86 -278 -355 253 -203 -135 -49 104 80 225 36
8088 36 10 273 3 -128 -88 330 -65 173 100 -7 -268 -100 126 -22 174 -159 265 51 183 152 64 84
8110H4J6j20m16L86j8j41L94j62J3K6j70j03K72n5N7J72k72M62m99K77k36j18
8132a51J0J22R5j34K23j91L4m4n8K46j11J22m60K31J37m52J51j69K67K94k52m1
8154a31J51R1P3l57Q1o3p2K70OJ98l14K08j82O5J00n50L98k80N66j05l16K69K54
8177C60m10l0J84J62L3m83J35J35m5J11l18O6L95k85
$$ plain form
8110 84 100 -20 -436 -50 -68 -209 185 23 36 62 -108 -211 61 6 63 235 -37 425 -74 203 -33 -151
8132 -151 -141 -19 76 -58 165 -26 8 -36 -94 152 41 163 -297 -66 71 -381 -230 -399 -132 162 -90 -131
8154 -131 20 111 184 -173 -92 -155 -227 43 49 247 -67 141 -41 24 124 -426 -28 -308 258 153 -163 106 360
8177 360 -50 -80 104 266 299 -184 -49 86 41 152 -166 -100 295 10
8191A0
$$ Imaginary data points
##PAGE= N=2
##DATA TABLE= (X++(I..I)), XYDATA
0@%%%%%%%%%%mJ2j6J6j6J6k3L1l2L6m4N1n9O8p8R0j04J19j35J54j72J90k14K40
34A26k68L00l32L70m11M54n03N58o20O84p57Q41r34J040j161J303j468J664j905
53a019K209k605L141l912N132p362J2761n0177o9000P1774O6141l802p4102l1759
67h2580L8612N7695j721m1717k4273K1824K6165j03j3313J483N067p413q958J9035
81a0197L0731k885m0757j9745L9730N4091o057o0458l3131M5711O4972j113o6787
94e895m2010L8113O4749M474n6902m0128K4987M9509P931l5454k5884J1127K2975
107A7592M892q073l914L6p121n321J3743K1409m655l4337k0985K5344M2740k141
121C9209n2006l6146K8728N4569M460n4374m2115K2829N3886J2525m1312l8284
$$ plain form
0 0 0 0 0 0 0 0 0 0 0 0 -4 8 -8 8 -8 8 -15 16 -16 20 -24 27 -32 36 -42 48 -56 63 -72 82 -90 100 -114 126
34 126 -142 158 -174 196 -215 239 -264 294 -326 358 -399 442 -492 548 -613 690 -778 886 -1019
53 -1019 1190 -1415 1726 -2186 2946 -4416 8345 -41832 -110832 -39058 27083 23281 -50821 -82580
67 -82580 -43968 13727 12006 -29711 -53984 -32160 -5995 -6098 -19411 -17928 -12861 -20274 -29232 -10197
81 -10197 20534 17649 -23108 -42853 -3123 50968 44911 -15547 -48678 -2967 62005 60892 -5895
94 -5895 -47905 -9792 54957 59431 2529 -37599 -12612 36897 44828 9374 -16510 -5383 17592
107 17592 22484 14411 10497 10533 3412 -1909 11834 33243 28588 -5749 -26734 -1390 41350 39209
121 39209 -12797 -48943 -20215 34354 38814 -15560 -57675 -34846 19040 31565 -9747 -48031
133d8031J1345M0477J6705k0952k6426n52J7972J2340p98o280q353p711K099J7458
147g07J5087q794k6396r739K5371L3128j354l4955k2103K1931M0886R426l2857
160H924l1223R362L7525J8096k2117l2287n619K4113K2732m270k4529j7440O596
173a0137K1536J2741j0383k1604j0256J3419K2158N663j8100k1400o57K1648J9010
186B3638p579k5583j3745J2895K3702M817j8594k2873j780J9653J8083m982k3858
199a6206j6908J0049K6112J0538j6923k7317l405K5050K4730o386l0489j6726
211c7881J8182L0997M122k5960k2619Q002K6682J2185j4124j9187j447J4580J3868
224G400R59p479q704j730O980J4204P740j0377j9893m538K1765K2867p808l2490
$$ plain form
133 -48031 -36686 3791 20496 -456 -26882 -27434 -9462 2878 2080 -4200 -12553 -20264 -18165 -707
147 -707 14380 5586 -20810 -30549 -5178 27950 26596 -8359 -30462 -8531 32355 41781 8924
160 8924 -22299 -12937 24588 42684 20567 -11720 -17339 6774 29506 25236 707 -16733 -10137
173 -10137 11399 24140 13757 -7847 -18103 -4684 17474 23137 5037 -16363 -17020 4628 23638
186 23638 16059 -9524 -23269 -10374 13328 18145 -449 -23322 -25102 -5449 12634 7652 -16206
199 -16206 -33114 -23065 3047 13585 -3338 -30655 -34060 -9010 15720 9334 -21155 -37881
211 -37881 -19699 11298 15420 -10540 -33159 -25157 1525 13710 -414 -19601 -21048 -6468 7400
224 7400 8359 880 -7824 -9554 -2574 11630 19370 8993 -10900 -15438 6327 29194 21386 -11104
238a1104j6082K2975L3398p66l6129k3281J8687L6231N843k9733k5245J1105K9185
251A5084R212j8259j8956K588J4675O242m246n197l240l422q59Q511J0716m382
265H467j9774j1247J5945K5854J24l0356k1875J7271L5721O573l2994k9075J3723
278b1643L7443J1463k7962k9055P670L0168J2678j7532k1340J438J7619Q479n794
291C632o981k6Q24p02L957J0008J620j4077j3138R560K4740O158k4086k4737R753
306a3495L2647J2180k6557l0692N735L3437J6649k1620l0194J149K6950J7036
318B3225j2556k1768k235J4390J1397l164q356l835P68J598M163N771J08j0980
332a474r775O137J7990O926j6646k0780L401K5720J3873j6714k7269k185K5915
$$ plain form
238 -11104 -27186 -4211 29187 28421 -7708 -30989 -12302 23929 29772 39 -25206 -14101 15084
251 15084 24296 6037 -12919 -10331 4344 10586 6340 1143 -2097 -5519 -6378 2133 12849 8467
265 8467 -11307 -22554 -6609 19245 19369 -10987 -32862 -15591 20130 26703 -6291 -35366 -21643
278 -21643 15800 27263 -699 -29754 -22084 8084 20762 3230 -18110 -16672 947 9426 3632
291 3632 -3349 -3375 -2551 -3253 704 10712 12332 -1745 -14883 -5323 19417 25575 1489 -23248 -13495
306 -13495 19152 31332 4775 -25917 -20182 13255 29904 8284 -21910 -20761 6189 23225
318 23225 10669 -11099 -13334 1056 12453 9289 933 -2902 -2134 -536 3627 9398 9506 -1474
332 -1474 -11249 -5112 12878 19804 3158 -17622 -14221 11499 25372 8658 -18611 -20796 5119
345E119J9629j2401k7105p971J9765K0530m710k1153j1018J0743J6096J561j0082
358i97q613N99O414N336K777k218p049n810M974J2620N959j0207j6024j62J7634
373E233J4611q929k2547p211J7553K0415l630k2809j3007J2637K1056L267j7104
386d65j5151M302J6384Q356p724j3111l302Q675Q883J777n798q109k271O326R003
401G775K878p845j0717j268J2217J1744l308j5816r161R663J7865L329j6641j5954
415a5239M468J9226R498j2444j8996j578J5996J2841o105j5489o544Q863J1971
428F468J563q416p959n6P310O610J580n614p980j577Q154J0667j71j2783j0365
443a2569O015J5574O280j2962j6046M09J6951J1316q372j6958n097J2697J3990
$$ plain form
345 5119 24748 12347 -14758 -22729 -2964 17566 12856 -8297 -19315 -8572 7524 9085 -997
358 -997 -9610 -9011 -2597 2739 5516 3298 -3751 -9561 -4587 8033 13992 3785 -12239 -12401 5233
373 5233 19844 10915 -11632 -18843 -1290 19125 15495 -7314 -20321 -7684 13372 16639 -465
386 -465 -15616 -11314 5070 13426 5702 -7409 -10711 -2036 6847 8624 2826 -5283 -7554 -1228 7775
401 7775 10653 2808 -7909 -9177 3040 14784 11476 -4340 -13501 -3838 14027 17356 715 -15239
415 -15239 -10771 8455 17953 5509 -13487 -15065 931 13772 7667 -7822 -14366 -5503 6468
428 6468 8031 -385 -8344 -8400 -1090 5520 7100 1486 -6494 -8071 83 10750 10579 -2204 -12569
443 -12569 -6554 9020 15300 2338 -13708 -13299 3652 14968 6596 -10362 -15459 -2762 11228
456A1228j680j4070r442N813J2624M414p693r612j317O566P850J531o326p969
470h083j71P632Q791l38r847q250L825J3392O850q666j4287j426J2971J1962m563
485I792j5376p339Q867J4251J206j2352j0980L289J1723N742n529r802l484N953
499d039Q124K450n842p792j889P824R260j5j0094p712L862J1977O249p482j2118
514g237k056J0931R917k597j2005p158N765J1776L185p731r971r67Q714Q439j158
529G847r779p381M012J0477N200o656j0633k217R228R519j123j0393o885N293
543c491J0492M716o769r067p70P778P460m89p899o480J885Q378N790m084r808
558b358m592O151R755J935r272r856J606J1083O825o076j2488k789R501R816j499
$$ plain form
456 11228 9548 -4522 -13964 -8151 4473 8887 1194 -8418 -9735 -3169 4681 6212 -114 -8083
470 -8083 -8254 -622 8169 7831 -2016 -10266 -6441 6951 13801 5135 -9152 -10578 2393 14355 9792
485 9792 -5584 -12923 -4056 10195 11401 -951 -11931 -8642 3081 8823 3294 -6508 -9992 -4039
499 -4039 4085 6535 693 -7099 -8988 -1164 8096 8081 -2013 -9725 -5863 6114 12363 4881 -7237
514 -7237 -9293 1638 11555 8958 -3047 -10205 -4440 7336 10521 2790 -7181 -8148 566 9005 7847
529 7847 -1932 -9313 -5301 5176 10376 3720 -6913 -9130 98 9617 8494 -1899 -8784 -3491
543 -3491 7001 11717 4948 -4119 -4889 2889 10349 9860 1961 -4519 -2634 5744 11534 7450 -2358
558 -2358 -6950 -799 8956 10891 1619 -8237 -6631 4452 11277 5201 -7287 -10076 -575 9241 7742
573G742j1298o465N143R563L072o200p476p4O153N593l02m603m855k08N420O012
589G217q7p678p582L091J1280N470q102j2637m39J2198R854n256j4734l742J0677
604d70J1027k417j1516o175O546Q662P93o007m790Q05L628K424J530j672m436
619b068l437K863P562L021p398j0106J083J1715P295p724j3837k031J2812J0724
633A0474n728j4189m214J0474J0365k309j0798n268N672P796J172n231l913L89
647e308K591K330J888L54l457m118J688Q153M837n755j0374l15J1258R844n964
662G652j4362l398J2030J1489m370j4074n247R716J0734j808j0249m905N256O693
676E157K08l787k473N03O60R37K603J435l741o080N52Q719N525n808j0965j222
$$ plain form
573 7742 -3556 -10021 -4878 4685 7757 1557 -5919 -5993 160 5753 5451 848 -4007 -4215 1205 7217
589 7217 7130 -548 -8130 -5039 6241 11711 3609 -9028 -9467 2731 12585 7329 -7405 -11147 -470
604 -470 10557 8140 -3376 -9551 -3005 5657 6450 443 -4347 -3542 86 2510 4040 2368 -2068
619 -2068 -5505 -2642 4920 7941 543 -9563 -8480 3235 10530 2806 -11031 -13062 -250 10474
633 10474 4746 -9443 -13657 -3183 7182 4873 -5925 -11193 -5521 2275 3447 -1784 -5697 -5308
647 -5308 -2717 -387 1501 1855 -1602 -5720 -4032 4121 8958 3203 -7171 -7486 3772 13616 7652
662 7652 -6710 -10108 1922 13411 9041 -5033 -10280 -564 10170 8362 -1887 -6792 -1536 5157
676 5157 5365 1578 -895 -392 268 1205 3808 5243 1502 -4578 -4026 4693 10218 4410 -6555 -7777
692g777J1421Q838n826j3585l383J1380R788m030j2577m001P364Q762j187p688
706b501m612K984M820J465j955k427j700m38J919M394J483n073n722J439Q764
721B840N389n592r595l52J0505Q577m466j0956k704R264R006k549r535m261M741
736C12P418R6n262m220P47L135K119L25k019l404j759K489N427J351n973o770
752e988J784Q835M485o057j0253l23R982O624m914j0056j979P487O625k026p030
767b804l116K930M778P45k344k879j663L64L400L021j246o190l323L817P299J566
783D355p817p039K887R543L680o820q485J483R201M904m290p247l38N694M937
798D648o88l788k204J604K402J960N42k514l464p01M073M816r47p350l895M237
$$ plain form
692 -7777 3644 12482 6656 -6929 -10312 1068 10856 6826 -5751 -9752 -2388 6374 5187 -2501
706 -2501 -7113 -4129 691 2156 201 -2226 -3926 -4364 -2445 1949 3432 -1641 -7363 -5924 2840
721 2840 8229 2637 -6958 -7310 3195 11772 7306 -3650 -6354 2910 11916 9367 -168 -4429 312
736 312 7730 7826 2564 -1656 -909 2226 4345 4670 2651 -753 -2512 -23 5404 6755 782 -5988
752 -5988 -4204 4631 9116 3059 -7194 -7517 2465 9089 4175 -5881 -7860 -373 6252 4226 -2804
767 -2804 -5920 -2990 1788 2533 189 -2690 -4353 -3989 -589 2432 1186 -5004 -8327 -4510 2789 4355
783 4355 -3462 -10501 -7614 1929 5609 -1211 -9696 -8213 988 5892 1602 -5645 -5983 -289 4648
798 4648 3960 172 -2032 -428 1974 3934 4476 1962 -1502 -2203 1870 6686 5739 -1611 -5506 -1269
814a269Q389Q58q248o754L540Q685L318p091p678J427P352M018m548o029p40L748
830a022L700p27l037j243m30Q40K536K146j351n043k439M545O633m97p836n455
846h680M825R125J448q567p296L694R392K433o989o539J914P082K725l127m200
861b760J23K470K339O65q70j052j704j12L300L867j510n900k395M997O583o28
877G413q304m511M831P572O72p465n929K751P323K144m857n751P38M705K733j890
893B175l359j200J076J753J536j63k141k562m30L957L782j681o106j934M653O337
909E693k80p058m658M309P611J216o999n338K094O494J704l988m355j63L604K327
925B213n99k233j558k56J493K474J217k359l924J18M757M231k251o396j859N199
$$ plain form
814 -1269 7120 7978 -270 -7024 -3484 5201 8519 1428 -6250 -4823 2529 6547 1999 -4030 -4770 -1022
830 -1022 2678 1951 -1086 -2329 -2759 -1919 617 2763 1412 -3631 -6070 -1525 5108 4611 -3225 -8680
846 -8680 -3855 5270 6718 -1849 -9145 -5451 3941 6374 -615 -7154 -5240 1842 4567 1440 -2760
861 -2760 -2637 -167 2172 2837 1967 915 -789 -901 2399 6266 4756 -1144 -3539 1458 8041 7413
877 7413 -891 -5402 -571 7001 7673 208 -5721 -2970 4353 6497 1640 -4111 -3373 1332 4065 2175
893 2175 -1184 -2384 -1308 445 1981 1818 -323 -2885 -3315 642 4424 2743 -3363 -5297 -644 5693
909 5693 5413 -1645 -6303 -1994 5617 6833 -166 -5504 -3410 3084 4788 800 -3555 -3718 -114 2213
925 2213 1614 -619 -2177 -2433 -940 1534 2751 392 -3532 -3414 1343 5574 3323 -3073 -4932 267
941B67N839j012o694l429L605O461J75n401l504J365M385J840k438k924j102J596
957i71J931R59q77k739k171J370M364R57l443m296K44N473L307k401o104j207
973e604N181M936j035n242k904L086N202P95l685l363P82L174K096j039k615j917
989b152M70K168K136q39l106k406J459L961K035l668m611K2N232L734k243n743
1005c551j673M713M584m29n547k579K486M476N94k962k619K59K138J826M59j624
1021E51k180m71K224K963k5l603l236J554M663K005l932m767K75M687L361k607
1037A462m603j372L415M078n16l485k146J329L080J643r37k459j725J593K798
1052B155J387j875l179j022K666L225l91l781l015J419M129J197k775l629l69
$$ plain form
941 267 6106 5094 -1600 -5029 -1424 5037 5212 -189 -3693 -2328 2057 3897 1459 -1465 -2567 -971
957 -971 960 1919 1042 -1697 -3868 -2498 1866 2823 -620 -4916 -4672 801 4108 1707 -4397 -5604
973 -5604 -423 4513 3478 -1764 -4668 -1582 3620 4415 730 -2633 -1851 1323 3419 2380 -235 -2152
989 -2152 -1682 486 2622 1783 -1323 -3729 -2270 1691 3726 58 -4553 -4531 701 4435 2192 -3551
1005 -3551 -5224 -511 4073 3644 -1903 -4482 -1996 2480 3074 112 -2507 -2248 -110 1716 2175 551
1021 551 -1629 -2100 124 3087 3062 -541 -3777 -2223 2440 4445 513 -4254 -3979 708 4069 1462
1037 1462 -3141 -4513 -1098 2980 2464 -1021 -3167 -1838 1242 2885 1948 -511 -2236 -643 2155
1052 2155 3542 1667 -1512 -2534 132 3357 2966 -815 -3830 -2411 1718 2915 140 -3489 -3858
1067c858L710K836j046m166j819K367L345P58k611k698M08K774K323r01k768j639
1083b985J355K741J375j272l176q66K839L219O9l587k686J619L978J822k673l850
1099b078L3K909K936j626l183j676J648K461R85j803k460r82K062K856M65k486
1115F1k607O56L542K381j624l538q01K912L090p1l484k431J066L465O68k103k458
1132a276q24K122K046k8k318k080J80K865J959j438k448j540J795L011M16k965
1148e23k529N50L447K045j517l659n93K572K670O3k770j846J037K516J486q13
1164B136k787r46J979K302M86k513j811p6K291J905j373k565j814J833K858P95
1180B700k712k697J29K888K281j235k709j191K273K403K7k123j970M59K052J543
$$ plain form
1067 -3858 -148 2688 1642 -2524 -4343 -1976 1369 2127 -484 -3182 -2774 0 2323 1422 -1346 -2985
1083 -2985 -1630 1111 2486 1214 -1962 -2828 11 3230 3299 -288 -2974 -1355 2623 4445 1772 -2078
1099 -2078 -2045 864 3800 2174 -1009 -2685 -1037 1424 2409 606 -1854 -2836 -774 2082 2547 61
1115 61 -2546 -1890 1652 4033 2409 -1129 -1930 982 4072 4001 517 -1914 -848 2617 3285 1182 -1276
1132 -1276 -2100 22 2068 2040 -278 -2358 -2178 687 2646 1208 -1240 -2780 -985 2026 2442 -523
1148 -523 -3052 -2502 945 2990 1473 -2186 -2779 -207 2463 2526 -244 -2090 -1053 1463 2949 2136
1164 2136 -651 -1597 382 2684 3170 657 -1154 -1230 1061 2966 1593 -972 -2786 -953 1905 2700
1180 2700 -12 -2709 -2580 308 2589 1354 -1355 -2546 -273 2130 2157 34 -1936 -1477 575 2118
1196B118o60k452j355Q68K461Q22j713k902m47K340K652n68l636j793J809L404
1212I48K46k670k139O54K521J852j397k383n33J251J540O10q56j506j220K056
1228a026K334N72k329k445O92L628J688k086l163o91L261K522p37l692j222J981
1244g13K348J71k115j710K92J891J013m67j673o06L66J706R64k35j983j181J378
1261e54K423Q37k271k590P10K894K006j902l148p22K575K751p83l621j326J554
1277a167K906O9k303j616L18J668Q97n75j196n06M2P64J391K4j398j910R77K739
1295A124J615k386k955L56L135K647r47m057o21L064K890j487k647o81J512J845
1311B407k14j378j121J77O32Q87O48q63j500q75J403K021jk215j757Q53K662J120
$$ plain form
1196 2118 1458 -994 -2349 -1481 980 1802 89 -2813 -3260 -920 1732 1164 -2472 -4265 -2456 948
1212 948 1194 -1476 -3615 -2961 -440 1412 15 -2368 -2901 -1650 -110 500 -356 -1862 -3082 -1026
1228 -1026 1308 1880 -449 -2894 -2202 1426 3114 1028 -2135 -2826 435 2957 2220 -1472 -2694 -713
1244 -713 1635 1806 -309 -2019 -1727 164 1177 710 -963 -1569 -1203 503 1467 1232 -751 -1932 -554
1261 -554 1869 2706 435 -2155 -1445 1449 3455 1553 -1595 -2317 258 3009 2226 -1395 -2721 -1167
1277 -1167 1739 1808 -495 -2111 -1793 -125 772 197 -999 -1505 -1463 -699 692 716 -682 -2592 -1615 1124
1295 1124 2739 353 -2602 -2246 889 3536 2589 -1468 -2089 975 3865 2378 -269 -950 562 2407
1311 2407 2193 815 -306 -129 503 1390 2038 1175 -325 -1200 203 2224 2223 8 -1749 -896 1766 2886
1329B886k208k793L15L352J575j471k694r57K506K163o90k224j371R92J789O29
1345A799j203j313n22M47J218K04r42j484o26J053K150k21k010j972P24K652J432
1362A386k134k694L4K959J568j200k386n77J784K320k11j783q02M87J493K80K08
1379G32o89r97p7J286J417n48k076j140J731K562p2k341k587J370K844J010k816
1396c91k147N99K751O77j159j737P9J346L45L54o69q07l34K86J254P19p69j994
1414a597p32J751K133p07k746j089J663K600Nk806j751J213K709L18j857j644
1430b537K94K159P61o82j389k52Q91Q27K39K10q97m96j03J439J519p00j838o40
1448a195J442K554o25k730j474K044K735r7k627j947J541K725L35k419j316K57
$$ plain form
1329 2886 678 -2115 -1800 1552 3127 1656 -1038 -1995 511 2674 1984 -240 -1611 -619 1170 1799
1345 1799 596 -717 -1239 -792 426 630 -312 -1796 -2422 -1369 781 560 -1450 -3422 -2698 -46 1386
1362 1386 -748 -3442 -3408 -449 1119 -81 -2467 -3044 -1260 1060 849 -934 -1736 -1249 244 524 732
1379 732 43 -954 -1031 255 1672 1124 -952 -2092 -361 2201 2129 -212 -2799 -1429 1415 2425 -391
1396 -391 -2538 -1939 812 1489 330 -1407 -1328 18 363 717 48 -759 -1093 -807 447 1166 397 -1597
1414 -1597 -2329 -578 1555 848 -1898 -2987 -1324 1276 1281 -1525 -3276 -2063 646 964 -893 -2537
1430 -2537 -2243 -84 677 -5 -1394 -1646 -755 72 311 521 -376 -872 -975 464 1983 1283 -555 -1195
1448 -1195 247 2801 2176 -554 -2028 16 2751 2654 27 -1920 -379 2346 2681 262 -1054 -797
1464g97J901K73o91j024q0M26K23L25P01j96j836l17J881J559o87k830j172K780
1482D39K258m78l108j339K133K335j41k768j174J317J714n4j490j139P06P79M88
1499D78j84l76p41n43P30J006Q20r29j826J32K027J508j323k125n22K085J873
1516B090m53k361j128J799K098K3k492q90J018J288M88j480r23M34M50M12k34
1533A39J01p30j111P68J075M37q14j410l12J936J720j342k173o38K156K021l31
1550A492k693p68J824J743k91j433p32P24J351j16m13o52J9l30L26P67J30j349
1568d01q10K33J697R39j724j811K26J835J413j425k049k24K039J390m71j774p37
1585a654J387R22O9q07r01M64L45Q98j83l59q12k30J061O52J28j374r99O53J323
$$ plain form
1464 -797 1104 1377 686 -338 -418 8 231 556 1257 1061 -775 -1092 789 2348 1661 -1169 -2341 439
1482 439 2697 2219 -889 -2228 -95 2240 2099 -669 -1843 -526 1188 1134 -356 -1495 -789 -10 478
1499 478 294 -82 -823 -1366 -636 370 1190 261 -1565 -1433 594 2102 779 -1346 -1868 217 2090
1516 2090 1637 -724 -1852 -53 2045 2068 -424 -1314 -296 992 1480 0 -923 -489 -39 373 139
1533 139 240 -490 -1601 -833 242 679 -135 -1545 -1857 79 1799 457 -1716 -2354 -198 1823 1492
1550 1492 -1201 -1969 -145 1598 1307 -126 -858 -134 1217 1101 688 36 55 -275 51 818 948 -401
1568 -401 -1211 -978 719 1658 -66 -1877 -1651 184 1597 172 -1877 -2101 -62 1328 857 -917 -1654
1585 -1654 -267 655 724 -83 -984 -520 -175 723 540 181 -631 -861 200 852 980 -394 -1393 -740 583
1604E83O44j367j499L2J776J230r18j823k95J423J476m52j447r84J130R84N92
1621A085j219j01M5J57P21M15l11j031k44N62J399Mj594j152O46J720O46j622
1639A26j562J57J735R68j500j570K80J041P10k65r37k61K64M96M75p3m33q17L5
1658a131P60J481l89j731o9Q90J447k02j561j263J086J755M36j521q51K35J209
1675E81M90m72j306J46N72P13r4o94l17l64Q66N70J72r63l57k07J006R35p72o63
1695a58p09J088J270P8j345j198O21J373Q77j484j268K56J250Q08j136q48m59
1712i84Q84J85L02l42n16l72L02O26Q09m85j604J85J050J507r52j124q30J222
1730a37J739N6j403j072O84J608R7j298n71J38R09K89j71m90o63J60O87L60K44
$$ plain form
1604 583 1227 -140 -1639 -1607 169 1399 481 -1342 -1637 -214 1262 810 -637 -1621 -491 493 1085
1621 1085 -134 -235 -190 -33 688 1103 792 -239 -483 79 1478 1482 -112 -1264 -618 1102 1748 126
1639 126 -1436 -1279 456 1424 -76 -1646 -1366 -325 385 120 -817 -1078 -814 -318 157 84 -349 -1166 -1131
1658 -1131 -371 1110 721 -1010 -1079 -189 1258 1056 -505 -1768 -682 1073 1509 -12 -863 -628 581
1675 581 1071 599 -707 -561 11 724 630 -64 -381 -745 121 691 863 -100 -457 -664 342 1277 505 -158
1695 -158 -867 221 1491 1569 224 -974 -353 1020 1897 413 -855 -599 651 1459 323 -525 -984
1712 -984 -100 85 387 45 -471 -843 -541 85 894 409 -1195 -1010 40 1547 595 -529 -1359 -137
1730 -137 1602 1658 255 -817 -133 1475 1572 274 -297 -159 750 1039 868 378 -285 -125 562 922 1166
1749A166j233o58O49R47M17j002j251o0J388R19m58j689r2Q03R87j45j121n58
1767i91N20P53O93o11n92o76N55P86L14q88n78j55Q87L65l80p21p84N17O85O70
1787C69p12j280K00J011R63m34q49q88J244O07M49j359n91P16P56N31n21o26r4
1806e08L57M38K8k42l98n54N32Q59M8n71r16L16J230L13q87j084j72J259N31m53
1826A26j059k27O84P16j67l24o22L29J96O63O7n88l20l15Q96J010p94j147J50
1845g26P14P90N6j187n77O07N63L22r61n52L39O79M93n69n78j03L11N46J72k38
1865A01q48K38L71J107l9p56m83J13P81N23l48r92q1M55Q60l8l43q78L81O25N72
1886A321o78q24J27M65L53l1q30k67M47J67K17J11q67J11r4P21O19n16r34N2P98
$$ plain form
1749 1166 -67 -725 -76 871 1288 286 -965 -1025 363 1282 824 -865 -957 -154 833 688 -433 -991
1767 -991 -471 282 975 364 -228 -904 -349 437 751 -137 -715 -870 17 382 2 -719 -1503 -986 -301 369
1787 369 -343 -1623 -1423 -412 551 117 -732 -1620 -376 231 680 -679 -1270 -554 202 733 212 -414 -508
1806 -508 -151 287 315 73 -325 -879 -347 512 560 -11 -927 -611 619 932 45 -1039 -1211 48 579 126
1826 126 -933 -1160 -476 240 73 -251 -873 -544 -348 315 382 -206 -526 -841 55 1065 271 -876 -726
1845 -726 -12 778 834 -353 -930 -323 240 562 -399 -951 -612 67 560 -9 -587 -690 -379 167 339 101
1865 101 -747 -509 -138 969 930 174 -309 -196 585 1108 760 -232 -313 142 1002 964 621 -257 124 749 1321
1886 1321 643 -181 -54 411 764 733 -97 -364 83 250 467 578 -289 -178 -272 449 1068 552 -382 -330 468
1907D68Q69o63o40n97J130N19k51r46j30N24M02Q0n36k10j46L36K65N7k48o97
1927d14l04M83O92L42j062n67J83J071J25o32p36K96Q82M94q21n51k16M31N83
1946B79J44n20p01M14P41L56m14q50l4O36K38L2k35l36l80L83Q44Lq45r47L67
1967h25R58J67k87r10r1O20P04k59q84j60N97L31K62l80m63j10N14M99j42m90
1987c49k78J18L55L98j59r00k8L65R72j66q19m11L01M88N06j026k16K73L99O68
2007D91m32p50M8L97O62k37j51O8l19R3N86K08k53p05L21M04N93k14r56k17Q79
2028E16M93J73r80j80m5J009j25n62j82k42K26K59J92l65o02K94L36M47K72q11
2048A23k85l4R45K49o69r15K42J061J98k26r94p2L10Q44p0p65o85N59O41L2o35
$$ plain form
1907 468 1337 674 34 -563 567 1086 835 -111 -241 283 685 765 229 19 -127 209 474 531 283 -414
1927 -414 -718 -235 457 799 -263 -830 -647 424 549 -83 -819 -523 359 853 32 -519 -735 -304 279
1946 279 423 -97 -798 -384 357 713 299 -551 -585 51 289 321 86 -250 -630 -247 597 600 -245 -1192 -825
1967 -825 133 300 13 -897 -988 -368 336 77 -807 -967 -370 -39 223 -157 -620 -730 -216 283 141 -349
1987 -349 -627 -509 -154 244 85 -815 -843 -478 494 328 -491 -902 -601 -113 393 -633 -849 -576 -177 491
2007 491 59 -691 -643 -246 416 179 28 96 -223 -130 456 664 411 -294 27 431 1024 810 -146 -363 516
2028 516 1009 1182 202 22 -23 986 861 299 117 -125 101 360 552 187 -415 -121 215 662 934 123
2048 123 -162 -196 749 998 329 -586 -344 717 915 689 -305 -377 -67 777 707 -58 -743 -184 457 489 -146
2069a46k55J20P8K15K50l13l60K78J8J63n2O7o19m89R84Q34o37p18l15J148P71
2090A022n91n92m75P38R47l01j000k80P57L97k13l75K5J12j43j31mL30m82j95
2110d54k27Q44j13k15o91k71J321L49n95n94j78Q16N99k89q10o8N61K10L79j128
2130e54J63O0N49K8Nj99l03M18K5J09k13K7l25J1L45J99p8q24k83P85P38k16o71
2153b04m95P37N46Mj095k71J033O60j19n35r22O90P86j41n00p3l15L92p1j03L91
2174C95k92n72K88K24M57o28k85j41L71Q01l58n35m69N80N71O3l59q92O52J53
2194B4M35n09l88J35N86L85n07k27l66L50L88J96q26L47j04K93nP7k84mo9M46
2216C73o8l58l30j52L2K92N43l93p17J81K38N15mk46n77M22O10J25n47n06%P45
$$ plain form
2069 -146 -401 -281 -203 12 262 -51 -411 -133 -115 48 -4 63 -556 -1045 -61 773 136 -582 -897 251 1022
2090 1022 431 -161 -636 102 1049 748 -252 -532 225 622 409 34 59 171 28 -103 -107 223 -259 -454
2110 -454 -681 163 50 -165 -856 -1127 194 543 -52 -646 -824 -8 591 302 -508 -576 -15 195 574 -554
2130 -554 -391 -331 218 246 251 52 -251 167 192 301 88 115 -210 -199 146 345 267 -557 -840 -55 683 467 -204
2153 -204 -699 38 584 588 -507 -778 255 915 796 261 -661 29 815 674 174 101 -214 178 107 4 395
2174 395 103 -469 -181 43 500 -128 -413 -554 -183 618 260 -275 -744 -164 407 470 111 -781 -129 24
2194 24 459 -50 -438 -303 283 668 161 -66 -432 -82 306 502 -324 23 -81 212 207 284 0 -4 -73 373
2216 373 305 -53 -383 -535 -503 -211 332 -61 -778 -597 -359 156 152 -94 -671 -249 361 486 -61 -567 -567 178
2238A78J63m86k71k61M70L86o6n13j12M70j15K6L27l59l40J87J57K41j67pn05
2259e97J68P33O7l21p24K68O43K93o08o08J31Q18N86p32q65M89P73P8k32q20L19
2280a41L86j8J28m91K92J94o22k6K85N01n76m51l09P08N07k64j169L11J102M46
2300G93p02n51k51Q25Q72n67n97j73R11K12l30k38l73L65N57n73k30k56M79Q8
2320B61j6j19J72K71o35k73N32N61p4o70l76K54J051j18r82n28Q24Q37R2j517
2340d53p0O20Q72n05p20r8N03K86l04j27p9L13J55p58K11L14J73p42L1K1N36k44
2362f5o73k21O23N33K46n09n76K92N28M72j024j48LR19K87o80m60J23Q53k21l57
2383e5j15j16L58l14J71k58N04m86o0j15O10N4k38o19O6N05P69m18p28j7P32K21
$$ plain form
2238 178 341 -145 -416 -677 -207 179 113 -400 -512 -42 -157 -131 196 -163 -503 -316 -159 82 -85 -92 -597
2259 -597 -429 304 371 50 -674 -406 237 530 -78 -686 -555 263 849 117 -748 -259 514 592 360 -460 -141
2280 -141 245 227 355 -136 156 350 -272 -298 -13 488 -88 -539 -848 -140 367 103 -1066 -755 347 793
2300 793 91 -460 -711 114 986 419 -178 -351 560 772 442 204 -169 196 753 180 -50 -306 173 261
2320 261 245 126 298 569 -66 -339 193 754 680 10 -366 -112 939 821 -161 -689 135 972 1064 -453
2340 -453 -523 97 969 464 -256 -354 149 435 131 4 -75 238 393 -365 -154 160 333 -409 -378 -357 179 -65
2362 -65 -738 -959 -336 197 443 -66 -642 -350 178 650 -374 -522 -519 400 687 7 -453 -330 523 302 -55
2383 -55 -170 -286 72 -242 -71 -329 175 -311 -371 -486 124 178 -60 -679 -613 -108 661 243 -485 -502 230 451
2405D51n47o79n3Q65M63q58m70L28O35J65n26k82j52P61J33n32P0j61N23k50k78
2426c94N1K38P7k53k81O89L29j97n72p76P76P94j37p92m0J40P34J05n88l74M77
2447FN16Rl49l48J90N24J32p58k5L69J01J8m23L49J92o9j23p25P71N50n74n71
2469b38j10P83K00o43j82k45J013K67o06q66M67R90n2p76q47M08R95K88p49m07
2489c10L98M36O6m15l17M88n7R2l89M7M29K39p65l67K65Q81l45p42l51O83J120
2510A086r65m57l09Q50P02l37j046l9O50P64l92o81j90O98L72m89p43J99N09K21
2530D03n22k33N07J56k01q32M16O40j03p86k05M50R07k79r69o6N19J014l23j012
2550e19n43Q19P98j22j043J92L66N34O7p57l23Q11K30j45q85K68M01L64p40j24
$$ plain form
2405 451 -96 -775 -828 37 500 -358 -828 -500 135 300 -226 -508 -660 101 234 -298 -228 -389 134 -116 -394
2426 -394 -343 -105 -28 -281 -562 127 456 259 -313 -1089 -313 481 344 -448 -488 -348 386 491 -97 -471 6
2447 6 522 531 182 -166 24 548 680 -78 -103 266 367 385 -38 311 503 434 311 -414 357 907 333 -238
2469 -238 -348 435 635 -8 -190 -435 578 845 239 -627 -160 830 778 2 -845 -437 558 846 97 -310
2489 -310 88 524 590 175 -142 346 289 381 -8 39 468 707 -58 -425 -160 721 376 -366 -717 -34 1086
2510 1086 121 -336 -645 205 907 570 -476 -515 135 899 507 -174 -364 334 706 217 -526 -327 182 403
2530 403 -119 -352 155 311 110 -722 -306 334 231 -555 -760 -310 597 318 -651 -717 -198 816 493 -519
2550 -519 -1062 -243 555 433 -610 -418 -52 482 549 -208 -531 280 510 365 -520 -252 149 513 -227 -351
2570c51OP90n43m10J75M88L95n82q28K91Q22L35p53q01L40J104K23p67q71M22
2590e15J274j87o38p14O88Q36m82l59l30O48J60K2n51k92O01J39m56j00J78L99
2610C21Q2o08m34O77O66n95q79J83Q15N26m77p73l5P68O40p9j682M97Q12N40o58
2631C07p02mP43K41n57k52K61M12o2n11o25R14O32p33p86O09O41j08o44l65L70
2652b19Q84k79o96m29K44J381n33q57k71Q36O47l00l62n70O79N23l66o51k9P35
2672C67Q5l05j62j03M39O8m66k78L55M59m85l53N8N64J49m38n50L34L93M33j76
2693C88j248L54Q25L05m10p27pP51M63q89j74k6Q46n5r02j10Q47r1O8q51K79N11
2715A47Kp86JL99P64j68q65k59O52P51l55j130K26Q69L08l36j007M13O12M05k04
$$ plain form
2570 -351 -345 445 -98 -508 -333 155 550 -32 -860 -569 253 588 -165 -966 -626 478 701 -66 -937 -515
2590 -515 759 572 -66 -780 -92 744 262 -97 -427 221 381 403 -148 -440 161 300 -156 -256 -78 321
2610 321 403 -205 -639 38 704 109 -770 -587 228 754 277 -496 -531 237 877 798 -884 -387 425 965 307
2631 307 -395 -399 344 585 28 -224 37 449 387 -124 -749 165 797 64 -722 -113 528 420 -224 -589 -219
2652 -219 665 386 -310 -739 -495 886 353 -504 -775 61 708 408 46 -524 155 678 312 -339 -368 367
2672 367 452 147 -15 -118 321 389 -77 -355 0 459 -26 -379 -321 243 392 -46 -596 -262 131 564 388
2693 388 -860 -506 319 624 214 -513 -520 231 694 -195 -369 -395 451 396 -506 -616 231 140 208 -643 -364 147
2715 147 149 -637 -636 -237 527 359 -506 -765 -113 638 283 -847 -621 248 556 220 -787 -374 238 643 439
2736D39q20M17N84l9m50o92O17K77M6n67K63K7L9j08k78J07N24o5m6p32R4R50
2758E87j10p83l23L46Q64j15p23n07O52J024m33n75l56O53O64o15j82n51P28K73
2778E18n69l48L78M73n63j77j53N53K91m74l74L54L81N28j058n40M83L96K19k13
2798A05o39K51M94L51m88p12L85P27J66n36o09O73K52R4o28n6N75k01j08k24J08
2819b0K04K2k95k78m6N58J89n89n9L06M03j40q00o0O48J89l15n82j99Q95P26n12
2841B45m57l80P92l0j83m33L03N15n0m45l39P40j29q0l72k32R40J01p20k91M85
2862b0L69l3p27k6j4P37J64p28k49L44O92k34k59j72M53M60l62n33k43M25M36
2883D80n6m40L0L3J54j20l78N33J92j52k45p10L63Q26k00q07O9Q64m0j31m98k96
$$ plain form
2736 439 -381 36 620 581 131 -561 56 333 379 -188 75 102 141 33 -245 -138 386 321 275 -457 -363 587
2758 587 477 -306 -629 -283 581 466 -257 -764 -112 912 479 -96 -452 201 865 250 68 -483 245 518
2778 518 -51 -399 -21 452 -111 -288 -441 112 403 -71 -445 -91 290 818 -240 -780 -297 99 318 105
2798 105 -534 -283 211 562 74 -638 -253 474 640 104 -505 168 420 514 -114 -170 405 204 96 -128 -20
2819 -20 184 206 -89 -367 -413 145 334 -255 -314 -8 395 255 -545 -605 43 232 -83 -665 -864 31 757 245
2841 245 -212 -592 200 170 -13 -446 -143 372 322 -123 -462 278 149 69 -303 -535 405 506 -214 -505 -20
2862 -20 349 316 -411 -437 -451 286 450 -278 -527 -183 509 275 16 -156 297 757 395 -138 -381 44 480
2883 480 424 -16 14 47 201 81 -297 236 428 276 31 -679 -316 510 310 -497 -428 436 396 265 -233 -529
2905e29R12j9r4r03M47L95J80o22K4K9N99j38l78R9j2L83J92r12K58L30k02k43
2927b04j28M64j42K58k91k23N67L25m40p07K15O22K22k85o02J55K72M85k57k66
2947D0n58P19K80o8p17p2O94J26l06m04L55M30m5o21j37N26J98l20k96k54Q38
2968D08q8o33m18K37P08j14m24j21J23O42l63k47k49M73L07m03K69p59O84J67
2988A99n0m91l2O30l02l00j77L78L00j8l18l8K0K85pl66Q1j48P16m38k33J43J61
3011eL54l32j83k07M35K21o19l19M60R6N91p61j85N16L20k55l93Q3K76M5l50N
3033b07P5J99r5n4n92N59L26j72l61O3J61N96l71j76j63K20L37n37q4K06J37M40
3055E07l93n21Q4M43L37k50m88L24K2J55n64L77n2L18j15l48M9K91K85l34l53
$$ plain form
2905 -529 383 364 270 -633 -186 209 389 -233 -209 -180 419 281 -97 2 -10 373 565 -347 -89 241 39 -204
2927 -204 -332 132 -10 248 -43 -266 301 626 186 -521 -306 316 538 253 -349 -194 78 563 306 40
2947 40 -518 201 481 413 -304 -376 318 444 138 -266 89 519 474 -147 -284 242 440 120 -176 -430 408
2968 408 320 -313 -731 -494 214 100 -324 -445 -322 320 -43 -290 -539 -66 241 -162 107 -652 32 199
2988 199 149 -342 -374 256 -46 -346 -523 -145 155 137 -181 -219 -199 86 79 -287 -206 -354 362 -76 -309 -166 -5
3011 -5 349 17 -166 -373 62 283 -336 -655 -195 -99 492 -269 -454 62 382 127 -266 -183 93 138 -212 -207
3033 -207 -132 67 -28 -82 -674 -115 211 39 -322 -259 -98 498 127 -49 -212 8 345 -192 -276 -70 67 507
3055 507 114 -407 -323 120 457 207 -281 43 65 220 -344 33 -19 299 184 -164 -115 176 461 127 -226
3076b26J48L25J46k36k49r5L41L13o90N1J70M36j17l67j4k14P75m54k22K91k50
3097a38K17L4l79J92J92L9m09J76N6K00k33Q6j98L79L34m40n6m19M33J32k68j33
3119b03k07N34K74k18k87kK44J77j10n60K83P3K93j52k29K57J54j00l67N5J91
3140A00r3K25m33N6L10J01n44Q1K23J95l4l66n8L24L4M5m18R3L58Q9k75o1p7K18
3164I3j40J98o2l11J9K61j27l6K19j97n9k01L97R3j49j0lj37L12j38o5J05j48
3187h6L80J58n92k42Q3N24N6k92j51L80k0J57n21r2L13J38o7n2k60M82P0m34J56
3210H8j94K82k2l84n0K41K05r3m3l32L20J93l02k12P5k62K20k7r4K74K16O3m11
3233b49J03q1J77R1O0k45Q4j77j53R6M15k70M6L3l76M22L51k27l35L77m64L02
$$ plain form
3076 -226 -78 247 393 157 -92 -187 154 467 -223 -172 -2 434 317 -50 -64 -278 497 43 -179 112 -138
3097 -138 79 113 -266 -74 118 157 -252 -76 -20 180 -53 33 -165 214 548 108 52 -367 66 198 -70 -203
3119 -203 -410 124 398 180 -107 -109 135 312 202 -358 -75 -2 291 139 -90 167 321 221 -146 -91 100
3140 100 7 232 -201 -145 165 266 -278 -197 26 221 187 -179 -237 87 121 166 -252 -159 199 288 13 -48 -125 93
3164 93 -47 151 89 -222 -203 58 -69 -105 114 -83 -142 -343 54 147 -2 -12 -15 -152 160 22 -43 62 -86
3187 -86 294 452 -140 -382 -299 225 281 -11 -162 218 198 355 -166 -258 55 193 126 74 -186 296 366 -68 88
3210 88 -106 176 154 -230 -280 -39 166 73 30 -302 18 211 -91 -303 -228 -490 -270 -297 -391 -117 99 162 -249
3233 -249 -146 -227 -50 41 101 -144 -60 -237 -390 -294 121 -149 -103 -70 -446 -24 327 100 -235 142 -322 -20
3255b0L72n36j87J50L46j38k21L07P9J07J18n06K34m1K94J1m03J45j17J77j40
3276C1j38j21J25L39kj51K7K9J87l48N4m7L86k27p62Q46j0n6K6o43M37j5J64j71
3300d0j89K16J99J02M1l45o8L01q9J95o2n70N46j88j50K30j68L03l06K91k10J10
3322A49k52J65k73jL91Q6n10j02L86M96l48L7k93R2K51n6j81j88K93J08j64j76
3344i0K91RJ28l31N1P1K2j56j34J15j59k4p3K50L15j87K83n82J19J18j16j22L39
3367A37l01k1O8O5J21p4r0P4L43r4n87J84o1K82j54J26k68J43j01P3o2K91Km91
3391c95M86j03K75n05K58P1j19J14j25j30K74j89J94l93L54m56K83J13O1k51l8
3412b21k9L96k3N1j03q8R9Q5j45M5m1p6J30k08n2K89j03N8n3m1K77m58J01J90
$$ plain form
3255 -20 352 -184 -371 -221 125 -13 -234 73 152 259 377 -129 105 64 358 369 -34 111 -6 171 31
3276 31 -107 -228 -103 236 234 83 110 139 326 -22 32 -15 371 144 -618 228 218 162 188 -455 -18 -33 131 -40
3300 -40 -229 -13 186 288 329 -16 -84 217 128 323 261 -309 237 49 -101 129 -39 264 -42 249 39 149
3322 149 -103 62 -211 -212 179 265 -245 -347 39 535 187 224 -69 23 274 218 37 -151 142 250 86 -90
3344 -90 201 210 338 7 58 129 151 -5 -139 -24 -183 -207 -280 -30 285 98 381 -201 -82 36 -80 -202 137
3367 137 -164 -185 -117 -52 69 -5 -95 -21 322 228 -359 -175 -236 46 -108 18 -250 -107 -208 -135 -197 94 96 -395
3391 -395 91 -12 263 -242 16 87 -32 82 -43 -173 101 -88 106 -287 67 -389 -106 7 68 -183 -221
3412 -221 -250 146 123 174 71 -17 82 167 22 67 26 -50 80 -128 -180 109 6 64 11 -30 247 -211 -110 80
3436H0k70K32m80M12J04M9Qm2J4q1j0J45l71L24j79Q2Q7j37j01J28J77l06K82
3459A47P8n50L86l87L11j08J70o9j51N7k62L30k35M00p7n3k1P1K04l99m5K41j45
3482a07Pl37K99L74k54J24J10j65j13K69j72p0Rq8J77P5j81k8j90L53K22l03K79
3505B90l5k27J98k07K55m05J37L9K37l76j32K71N2K14l44p8L82k67k9N7j91K55
3527I6QoJ0k02m5K41k73kK10j14K6J56j67J60j84K2m6J07r3N4j77L19R6j78J80
3552A98k70L09n11J89k2K13R0k23L24q1k84L1K69N5k84n0j37K85j37J62l79J87
3574f6J9K87j9m70KJ56N0j94K92j58N5j45L24q8l8o2J02k90P7o5j2l23M59K94
3598A87n40M16l17J03K89k30l1j83J38J82j72m6L28Q8k21M2J07j76j05O5K5K22
$$ plain form
3436 80 -190 42 -438 -26 78 127 135 93 107 26 16 161 -210 114 -65 17 104 -33 -134 -6 171 -135 147
3459 147 225 -325 61 -326 -15 -123 47 -22 -173 -116 -378 -48 -283 117 40 -13 -34 37 241 -158 -203 38 -107
3482 -107 -100 -437 -138 236 -18 106 216 51 -62 207 35 -35 -26 -114 63 138 -43 -71 -261 92 314 11 290
3505 290 255 28 226 19 274 -131 6 45 282 -94 -226 45 97 311 -33 -111 271 4 -25 32 -159 96
3527 96 104 98 108 -94 -139 102 -171 -173 37 -77 -51 105 -62 98 -86 -64 -110 -3 -96 -42 -219 100 196 18 198
3552 198 -72 237 -274 -85 -107 106 196 -27 297 216 -68 -37 232 287 3 -47 -184 101 -36 126 -253 -66
3574 -66 -47 240 221 -249 -247 -91 -41 -235 57 -101 -46 -191 133 45 7 -55 47 -243 -166 -231 -243 -566 -107 187
3598 187 -353 63 -254 -151 138 -92 -123 -306 -168 14 -158 -204 124 212 -9 33 140 -36 -141 -76 -51 171
3620A71j98K2k53N49l44R4J86j28lm11K15O6N5J83l06J25j45J99l37K54K03j84
3642A3k2L3Q3R0k47j31O6J01J74k16m3j4J22o2K9J30J32k69J90k52M11n91L53
3665H0p7j02J80K3q8J86k80K91j6q0k04J51K12n7j98N9J75j10K3j27l4L3K4j8
3689D6l6p4k8J15j5p7J25k90J58J55j03J70K24l50j78k01L17J31J4k39M4k57L82
3712C3k05N4j8N7jJ77j48k68K63l2J71L15n90O3J17L4L22l94J22j29n0L95n9j51
3736G8n0l29M87k91J96M7l83M43k17k25j13K88K71M4l53J29o5J2j38K01m00J66
3758b02J76R0j75J96Rj68J03KK3j5O0k52K56j0n34O34K1l53L64k1k48j52K23p
3782B0k5M7O3k56P8j22qK66n1M0l06P9J73l1m6m9lK25K1K4l02R7M4k96O01m12
$$ plain form
3620 171 -27 -5 -258 291 -53 41 227 99 96 -315 -100 -34 21 204 -102 23 -122 77 -260 -6 197 13
3642 13 -9 24 107 197 -50 -181 -115 -14 160 -56 -99 -113 9 -53 -24 106 238 -31 159 -93 318 -273 80
3665 80 3 -99 81 104 16 202 -78 213 197 117 -87 64 276 219 21 80 255 145 168 41 7 40 64 46
3689 46 10 -64 -92 23 8 -69 56 -234 -76 79 -24 146 370 20 -158 -359 -42 89 103 -136 -92 -349 33
3712 33 -172 -118 -136 -79 -80 97 -51 -319 -56 -88 83 398 -192 -129 -12 22 344 -50 72 -57 -107 288 229 78
3736 78 28 -301 186 -105 91 138 -245 198 -19 -244 -357 -69 202 246 -107 22 -43 -31 -169 32 -368 -202
3758 -202 -26 64 -111 85 94 -74 29 31 54 39 99 -153 103 93 -441 193 214 -139 225 204 -44 -196 27 20
3782 20 -5 42 105 -151 -73 -195 -203 63 12 52 -254 -175 -2 -33 -79 -128 -131 94 115 139 -163 -66 -22 -318 283 -129
3808a29NJ17n6n6Q8k10J94L2o3K58n2j30n43P95j99j11m9M2O1J00l25N4M1K7J34
3833B5j32Q4k83K67K57k90K14j51j55j60N22k13q8L9r0K05J31j31o4J50K6k91
3855a28P8j54M08K7k91J61l15L00k14%k8M7J82M3j40o6K74l66J80j51n4L41l71
3878b37J67L2K21k38J36J66m24K35k15K11l44J32J68l60K94J42k26jK5K54L5n16
3900c43L88q3j52M61l40L59l08j50K10N5m2j32J37j00J58j87K82k98o0o9M62k85
3922c7j01k15K99L38m13J04j7P0k53K09m98M29J20j29q3K49J56M1j07m98N79m34
3944a91N4O7j47J81q5j2J07N5o0m6j58L76r4j0q5R6j99K44j97q6LK74k25K9J03
3969fQk46L57k02J87O0j95r5J87Q9j43j60Q8j6J56l89j99L82J04r8K08j36O0J06
$$ plain form
3808 -129 -124 -7 -63 -119 -31 -241 -47 -15 -78 180 128 -2 -545 250 51 -60 -109 -67 -6 94 -231 -177 -136 -109 25
3833 25 -107 -23 -306 -39 218 -72 142 -9 -164 -324 198 -15 -103 -64 -154 51 182 51 -13 137 163 -128
3855 -128 -50 -204 204 231 -60 101 -214 86 -128 -128 -156 -109 73 116 -24 -90 184 -182 -2 -153 -207 134 -237
3878 -237 -70 -38 183 -55 81 247 -177 58 -157 54 -290 -158 10 -350 -56 86 -140 -141 -116 138 173 -343
3900 -343 45 -38 -190 271 -69 290 -18 -168 42 97 55 -77 60 -40 118 -69 213 -85 -145 -214 248 -37
3922 -37 -138 -353 -54 284 -129 -25 -42 28 -225 -16 -514 -85 35 -94 -177 72 228 269 162 -336 243 -191
3944 -191 -137 -70 -217 -36 -121 -133 -26 29 -31 -77 -235 141 47 37 -48 48 -151 93 -104 -190 -187 87 -138 -109 -6
3969 -6 2 -244 113 -89 98 158 -37 -132 55 144 1 -159 -71 -87 69 -320 -519 -137 -33 -131 77 -59 1 107
3993A07l56J05j16M67Ql81M1K37k78j07M05N1k68M5k06J06L27j13M7m91J52K98
4015H0j6K3k97J75j17m1K66J62p1r8qk8J52j10q0J85p2Q8l14L16n36J07P7K20
4039F3J52k72j81O11m59K12k11J60j95L44k60R5j33J31l21o6O56k87j11j02M16
4060B42j97rj71l2K0j7K04Pk62L91j43J50k63R9K14j2k84K18K9j06Rj22L3l1j54
4085a87M24j06j34K18m21K42j01k01M04l3N8j40p7K39k20K7j20L18L7l67J77P0
4107A07k9r1NO2J04k63J31LJ10k77M47k65j0J06k71k73K98J8L69k65l61K81o1
4130a25K27j66Q5j20J45O5m45L89P4k38J94j99J87k99K68o3j30K53o2m3Q4r8j7
4153c4j48N6l7RL00J35m19J32n0K31n22L35mj03J83jn5j69J89k85K34L65l73l00
$$ plain form
3993 107 -249 -144 -260 207 215 -166 -125 112 -166 -273 132 183 -85 -40 -246 -140 187 74 121 -370 -218 80
4015 80 64 87 -210 -35 -152 -193 73 235 164 66 58 30 182 72 -8 177 105 193 -121 195 -341 -234 -157 63
4039 63 215 -57 -238 373 -86 126 -85 75 -120 224 -36 59 -74 57 -264 -330 326 39 -72 -174 242
4060 242 45 36 -135 -167 -147 -164 40 47 -215 176 33 183 -80 19 233 221 -63 155 184 78 87 -35 -2 -33 -187
4085 -187 237 131 -3 215 -206 36 -65 -266 138 105 163 23 -54 185 -35 -8 -128 190 227 -140 37 107
4107 107 78 -13 -8 54 158 -105 26 29 139 -138 309 44 34 140 -131 -404 -106 -88 281 16 -345 -64 -125
4130 -125 102 -64 21 -99 46 111 -334 55 129 -109 85 -114 73 -226 42 -21 -151 102 40 -3 81 -17 -34
4153 -34 -182 -126 -163 -154 146 281 -138 -6 -56 175 -347 -12 -16 -119 64 63 8 -161 28 -257 -23 342 -31 -331
4177c31L27L9q7j85N29n06M76l75K63q0O5k72j32K38K9K11l96M65l79J18m2P0
4199D5j10L86n70L81j6K90k9k67p2O9m4l63M94k01J81k42K84j46J41l72J30L79
4221C48M5k70k01K09k29J15L3l10K36MJ10l24J35M7J49m4on2J7J24j53p5R8J05
4245A11j23o8Q2K25Q0n67K40P7j0P1k20L50l4k66j23K42Q8j53m8M18k53j46l2
4268e9K90k80J80j98K49m87J21L03Q5k17J04J07J6j12k31J69K51k13k43L12l74
4289b27j26K03P9K08K02m73M5L02O5o59M14R0m9Mj89L55m05L09j54PJ2JJ73l91
4313b04J20q0J11OJ00nq1K33K4m65K30J48k26K38l00M71l94j16J63j28J85R2k34
4336a12k3J75j88O2K21k02j07J87m8m7K32L8k58J17J08m39M73j32p8P5n4K79j83
$$ plain form
4177 -331 -4 35 -52 -237 292 -214 262 -113 150 70 135 -137 -269 -31 -2 209 -187 278 -101 17 -25 45
4199 45 -65 321 -249 132 116 406 377 110 38 107 63 -300 194 -7 174 -68 216 70 211 -161 -31 348
4221 348 393 123 -78 131 -98 17 50 -260 -24 -20 90 -234 -99 -52 97 53 47 -5 12 136 -17 -92 6 111
4245 111 -12 -80 2 227 307 -260 -20 57 47 118 -102 248 214 -52 -175 67 155 2 -46 372 119 -27 -59
4268 -59 231 -49 131 -67 182 -305 -184 119 204 -13 91 198 214 102 -129 40 291 78 -165 147 -227
4289 -227 -353 -150 -71 137 339 -134 -89 213 278 -381 33 123 74 78 -111 244 -161 148 -6 1 13 14 187 -204
4313 -204 -84 -164 -53 -47 53 48 -33 200 224 -241 -11 137 -89 149 -151 320 -74 -190 -27 -155 30 122 -112
4336 -112 -135 40 -148 -86 135 -67 -174 13 -35 -82 150 188 -70 47 155 -284 189 57 -21 54 0 279 96
4359I6o8m1n9K3Q1q3J84m38L93m3j16m1R2k07J85J08l8j00J50j90nK65l77L54
4383A25R6k8M9j11j26k8r1J55R7K8l19K21N9k08P4q4j39L58r1l43K47K21l57r2
4407b87J46K46O8q6o29O69k42K41l13J95j42r4M70l41M9q6k70O26j37Q2K1j00
4429H6P4j88M43o52K34l0k9J39k56L45j32k9M0j50J80j4j28J43K6k69K50%j67
4452h4J69n5j48N0j24K34j04l16N91l00k7k4K83K7k89K31j96J54r6LJ38J00k61
4475d4k07K42L6O4l53K46k2L89j64n6O2l72j04L28j27O2J5r8L93j81k07RL30l35
4499i4K82P5m67J70Q1j0lJ12J21n20n2L54j44K13k8J16j88k6K87k86Q0j71j8J37
4523B1M6m2m85K94M27n40K65J4L44m08K12L9m65L07m85M18R7K64m13L83l32Q7
$$ plain form
4359 96 28 -13 -72 -49 32 -51 133 -305 88 45 -71 -112 -20 -227 -42 66 28 -72 78 -112 -117 148 -229 125
4383 125 221 193 242 131 5 -23 -114 41 138 166 -153 68 127 -81 -7 -91 -230 128 37 -306 -59 162 -195 -287
4407 -287 -141 105 173 87 -542 127 -115 126 -187 8 -134 -228 242 -99 -50 -136 -406 220 83 165 186 86
4429 86 160 -28 415 -237 -3 -33 -62 77 -179 166 34 5 45 -105 75 61 -67 76 102 -167 83 83 -84
4452 -84 85 30 -118 -68 -192 42 -62 -378 213 -87 -114 -138 145 172 -117 114 -82 72 -24 -21 117 217 -44
4475 -44 -251 -9 27 91 -262 -16 -38 351 187 131 193 -179 -283 45 -82 -20 -5 -103 290 109 -98 -89 241 -94
4499 -94 188 263 -204 -34 47 37 34 146 267 -253 -305 49 -95 118 90 206 18 -8 279 -7 73 -98 -116 21
4523 21 67 25 -460 -166 261 -279 -14 0 344 -64 148 187 -278 29 -456 -38 59 323 -90 293 -39 48
4545D8k06K34j40M16j76j32j27R4l2M2l9o1R6k18L04Mj04P2j55J99m01K65O1q2
4569c8J14r4L9j17q4oK13JL86k54k93J78K2l7L01l68L6J99q6N0k50L24r5N6m77
4594b80M82k31L32l08K62j36m9K11k25J3j56n4J41Q5O4j56L8O6o7j13N20l89J12
4617A62j90j14r7P5r3L79k70L16k45L2K2L39l49L05n9m00J10K03j22qJ16k53k24
4640c65K69K61r5J86j71o1KL33k63J19r4J90l36l6Q9l0K77r8l87J3L6J74L21l99
4664f5J58j60J02O6k6P2j13R7J24k85J14j40M7n7r0R0j63J96Q3l8j73j57L78%
4688F0L9j15j54L9M49l66r5J48K28l0K2m53J07l1pL63k69K1L5K82m98J65J68l41
4712b33J16J41O9k86K58j04M7j92J63J84m81L11O4j70L82k13j37l02J76K33P4
$$ plain form
4545 48 -158 76 -64 352 176 44 -83 11 -21 21 -18 -79 17 -201 103 107 3 75 -80 119 -282 -17 44 -38
4569 -38 76 -18 21 -96 -180 -186 27 28 414 160 -133 45 67 30 331 -37 -1 198 112 162 -88 236 141 197 -280
4594 -280 202 -29 303 -5 257 121 72 283 58 71 -85 -139 2 87 151 -5 33 99 32 -81 439 50 162
4617 162 -28 -142 -239 -164 -257 122 -148 168 -77 -45 -23 316 -33 272 213 -187 -77 126 4 -4 112 -141 -365
4640 -365 -96 165 70 256 85 24 26 359 96 215 121 311 -25 -61 28 -2 275 177 -210 -197 -161 13 334 -65
4664 -65 93 -67 35 101 75 147 34 131 255 -30 84 -56 -9 -66 -156 -66 -229 -33 50 12 -161 -318 60 60
4688 60 99 -16 -170 -131 318 -48 -143 5 233 203 225 -228 -121 -152 -159 204 -65 -44 -9 273 -225 -60 108 -233
4712 -233 -117 24 93 -193 65 -39 8 -184 -21 163 -318 -7 57 -113 269 56 -81 -383 -207 26 100
4733A00l57K26j11J53J71j95J33K60m18K51l7j98J79l34K31q5K73j54P9l31K97
4754A33j59R9l94K91j8J50k09K35k36k05M45j80Q5k32N4N18n32L27J01k94k5R4
4776D8k43K43M7m8r1p4K63K43n67J20j36j3j21L03n4j2J69l11J68K07j98pP9p7
4800f2K54j80q2K17l07p9M09l8n3k0Lp6K81j51m4j36J51l7J34k92L21j02j95J04
4824B0o7J97O4j25j50L59m21L60p4o8J38l27j7M58o80M22k22K65J38n16J11J08
4846b7J47J11K8m87L09o8j00L61k76J36k52r6M10l10m8K7j01J00N5K46k71J44
4868C8k77K1K86k23J79j08K46n8k82K49j26m41K63J0K76j68KM1M16m80P0J11j60
4891a15K14o3j68K04K13m04J21j22K59j10o3M0m3m7J3m0K30k18L64l24j21J49
$$ plain form
4733 100 -257 -31 -142 11 182 -13 120 380 -38 213 176 -22 157 -177 54 -31 242 88 167 -164 133
4754 133 -26 73 -321 -30 -48 102 -107 128 -108 -313 132 -48 37 -195 -141 377 -155 172 273 -21 -46 48
4776 48 -195 48 95 47 -44 -118 145 388 -179 -59 -195 -208 -329 -26 -80 -92 77 -234 -66 141 -57 -64 15 -62
4800 -62 192 12 -70 147 -160 -239 170 132 79 59 62 -14 267 116 72 -64 87 50 184 -108 213 111 -84 20
4824 20 -47 150 214 89 -61 298 -123 237 163 95 233 -94 -111 347 -333 89 -133 132 270 -246 -135 -27
4846 -27 120 231 259 -228 81 13 -87 274 -2 134 -118 -214 196 -114 -162 -135 -236 -136 -81 165 -106 38
4868 38 -239 -218 68 -155 24 -84 162 104 -178 71 -55 -496 -233 -223 53 -115 -113 -72 344 -136 -66 45 -115
4891 -115 99 36 -132 72 285 -119 2 -120 139 29 -34 6 -37 -84 -71 -111 119 -99 265 -59 -180 -31
4913c1k5j6o9K04j60J90j40j4L36N1m71r8L08Q7j65j0j26j6K5L55M1l91k0M25
4937B70k81o8j5o4K85l84L18J28k61n9K46l3NK5j25k01J71o7j05n1L23k00M4K12
4961A13k0J84j80P1Ok32j95K25j65K41m6l04K59J44l4l24K37k33K21J42p1q0N9
4984A8j32K81n5q2o5j26M32o8k50j8J14Lj84L36r8N8j72j64l54N52K41j51Jl5
5008H2j00p0jj05Q1J49J84nJ05k07p6J10j80P8M3m2o1K98j54Jj20k7L91j96j83
5033eL27k91k03J92j92J50j88K50r7j45L94j33L1k47K21R5j37kJ1j79J20j04m7
5056a79K45j44j90M26l64j01K05K66q7J90k94j62L47r6k91J11n4o0K83k93J52
5077i0J31J71l17K43k64K90o3N6l9j65K10k34J69o6J75j14P5q3J05j76q0p8J2
$$ plain form
4913 -31 -56 -72 -141 63 -97 93 -47 -61 275 326 -145 -243 65 152 -13 -23 -149 -165 -140 215 256 -135 -155 270
4937 270 -11 -79 -94 -158 127 -257 61 189 -72 -131 115 82 87 112 -13 -214 -43 -110 -215 -266 57 -143 -99 113
4961 113 93 277 97 168 174 -58 -253 -28 -193 48 2 -302 -43 101 67 -257 -20 -253 -32 110 39 -41 18
4984 18 -114 167 112 30 -35 -161 271 203 -47 -65 49 52 -132 204 106 164 -8 -172 -526 26 267 116 117 82
5008 82 -18 -88 -89 -194 -113 36 220 215 320 113 37 147 -33 45 88 46 -15 283 129 130 10 -17 374 178 -5
5033 -5 322 31 -172 20 -172 -22 -210 40 -57 -202 192 59 90 -157 64 159 22 20 31 -148 -28 -132 -179
5056 -179 66 -78 -268 158 -206 -307 -102 164 77 267 -27 -189 158 62 -229 -118 -172 -232 51 -242 -90
5077 -90 41 212 -105 138 -126 164 101 157 118 -47 163 -71 98 32 207 93 168 85 190 14 -66 -144 -132
5100a32J85k51M82j78M64n45j25J29j22j35K38K12k46O3j29j3L14k07KJj84K96
5122A19R5k59M7n9L6L12o17M18l20N8k5L10l21K10o9J01R8l12J35J07l18L39l15
5145b30M96k17J86q8k47K52j29lj45K24j18J62j28K97O1n2j57k03n12N73J1J06
5167A39k18l3j41k36M49L1j15M01j81m44J46j37O17k25k60K56j87%L70m11J33
5188d6m9M9K1j19k15N57r7J23m42L62j18K98n45P5Q4J4M12j51r2J99k91J33j52
5211A0Nj38K03k54L0L94k13J30l4J6l13K70l81M07k36j88L57k95K76j40J11J46
5233A63l8J9k62K60J76l62K07l01K83j0k75j70J43P9L34j67k55M26k00K0k63L6
5255a57K23Q5m9o2j65L01O7l97M8J71R2J65m73J92M1K43k10O7k5m24M52k19n9
$$ plain form
5100 -132 53 -198 284 106 570 25 -100 29 -93 -228 10 222 -24 39 -90 -103 211 4 6 7 -177 119
5122 119 214 -45 2 -57 -21 291 -326 92 -228 -170 -195 115 -206 4 -65 36 134 -178 -43 64 -254 85 -230
5145 -230 266 49 235 147 -100 152 23 20 -125 99 -19 143 15 312 373 321 164 -39 -551 22 33 139
5167 139 -79 -112 -253 -489 -40 -9 -124 277 96 -348 -202 -339 278 53 -207 49 -138 -138 232 -179 -46
5188 -46 -95 -46 -25 -144 -359 198 101 224 -218 144 26 324 -221 -146 -62 -48 364 213 121 320 29 162 10
5211 10 15 -123 80 -174 -144 250 37 167 133 149 -164 106 -275 132 -104 -292 65 -230 46 -94 17 163
5233 163 125 144 -118 142 318 -44 163 -138 145 135 -140 -310 -167 -88 246 79 -176 250 50 70 -193 -157
5255 -157 66 151 102 40 -125 176 243 -154 -106 65 157 322 -151 41 82 325 115 182 157 -267 185 -34 -93
5278i3L6k4l5M26m63J99j08O2N0N5M5j24m8R0k68K19L66k35k99P9K2L54k48l44
5302b86J03N01k49l36J90K49k43K69j68j33K17j90l08K53o7K00K53l07M8r5n2
5323a51L28j79P9R2l79O5n7L46j72Qp6K5K30j44J98q6k31J60j6r2J03k30q8M26
5347A59j67k6J48Kk71Pj5K10l23K17j16j67N31l61J74L8j71K57j95N9j80J15L5
5370d0j32J97L6j19K45k3Oj16J09k7q7P2k62M97k92m1R7k96J48p5K40m9j35l5
5394h2J67K09m74O3K04o6J58r8K61jj53l57N36j05r5m96M63k10L9j8M4J91j60
5417B0O7r0l9J3R3j90J22Q6M2l36R0J34L32l42K53L4k83L6k47L07l5M1n8k33K11
5442B8k0n6J23k97K30L2o6K58K6k70K60j10n9oO7l7j16p9R6P5p1K92q3r2j42l7
$$ plain form
5278 -93 -57 -81 -116 310 -153 46 -62 0 50 105 150 26 -22 68 -200 19 385 150 -149 -70 -48 306 58 -286
5302 -286 -183 318 69 -267 -77 172 -71 198 30 -103 114 -76 -384 -131 -198 2 255 -52 -4 -99 -151
5323 -151 177 -2 77 169 -210 -145 -202 144 -28 -20 -96 -71 159 15 213 127 -104 56 40 -52 51 -179 -267 159
5347 159 -8 -34 114 116 -155 -148 -163 47 -276 -59 -175 -342 189 -172 2 40 -131 126 -69 -10 -190 -75 -40
5370 -40 -172 25 61 -58 187 164 170 54 163 136 49 121 -141 356 64 23 120 -176 -28 -103 137 88 -47 -82
5394 -82 85 294 -180 -117 87 21 179 81 342 341 188 -169 367 262 167 -329 134 -76 -37 -55 -11 180 20
5417 20 87 -3 -42 -29 64 -126 -4 82 124 -212 -122 12 344 2 255 289 6 42 -205 102 67 108 50 -183 28
5442 28 8 -48 75 -222 8 40 -26 232 258 -12 248 138 79 73 140 103 -13 -92 4 79 8 300 217 125 -17 -54
5468e4J93M0j27PJ4j37k40L05pj34J46k29K01%K92l43Q6p0j20J44L8J13J5l30
5492a97L59k19j94L27J8j27k1L11k67n7rj27L58q9Qj03J2oM0r6L49k59j57J89
5516D3P9j09l06J0J03J22R1J41l46K36J87p1J69k38k24r0J66J5j6p0M14n11K18
5539A3J40r9J27j23j23M1J4k67L43j57M9J21r5N6j24j27J57j67J86J39j27O8j3
5562C2j61J07J12J10m40kJ75M0m4j9J70J12j26j58n3N9L05j25m8L1J31j31J64
5585B41j41J39j95R1j61j0J37j51k41L86k46J45q0L2k0M7q3K88k07J90k77K61
5607A45k0m1l32L1K24J04l2J94k60oM9Q3k66K01O5j86qMn5J5K4j28M50o74M07
$$ plain form
5468 -54 139 179 52 59 73 -64 -304 1 -6 -140 6 -223 -22 -22 270 -73 13 -57 -177 -33 5 118 133 -197
5492 -197 162 -57 -251 76 94 -33 -54 257 -10 -67 -76 -203 155 66 74 -29 -17 -23 17 -79 270 11 -146 43
5516 43 122 13 -293 -283 -180 -58 33 174 -172 64 251 180 349 111 -113 -203 -37 -22 -38 -108 306 -205 13
5539 13 153 54 181 58 -65 -24 -10 -277 66 -91 -42 79 -16 40 -84 -211 -54 -221 -35 104 -23 45 32
5562 32 -129 -22 90 200 -240 -242 -67 -27 -71 -90 80 192 66 -92 -145 -86 219 94 46 77 208 77 241
5585 241 100 239 44 135 -26 -36 101 -50 -291 95 -151 -6 -86 -54 -74 -27 -110 178 -29 161 -116 145
5607 145 125 84 -248 -217 7 111 79 273 13 7 56 139 -127 74 139 -47 -55 -51 -106 -91 -67 -195 255 -419 -12
$$ [...]
8191H5
##END NTUPLES=NMR FID
##END=
