##TITLE=1H_K-349/2_1
 CDCl3, 32 sc, 
 25.12.2020
##JCAMPDX= 6.0         $$ Bruker NMR JCAMP-DX V2.0
##DATA TYPE= NMR FID
##DATA CLASS= NTUPLES
##ORIGIN= UXNMR, Bruker Analytische Messtechnik GmbH
##OWNER= root
$$ XWIN-NMR		Version 3.5
$$ Fri Dec 25 10:32:25 2020 Russian Standard Time (UT+4h)  she@DPX200
##.OBSERVE FREQUENCY= 200.1315066352
##.OBSERVE NUCLEUS= ^1H
##.DELAY= (6, 6)
##.ACQUISITION MODE= SIMULTANEOUS
##.ACQUISITION SCHEME= undefined
##.AVERAGES= 32
##.DIGITISER RES= 18
##SPECTROMETER/DATA SYSTEM= spect
##.PULSE SEQUENCE= zg30
##.SOLVENT NAME= CDCl3
##.SHIFT REFERENCE= (INTERNAL, CDCl3, 0, 15.7039)
##AUDIT TRAIL= $$ (NUMBER, WHEN, WHO, WHERE, WHAT)
$$ ##TITLE= Audit trail, XWIN-NMR		Version 3.5
$$ ##JCAMPDX= 5.01
$$ ##ORIGIN= Bruker BioSpin GmbH
$$ ##OWNER= she
$$ F:/spectra/data/she/nmr/H-F/1/audita.txt
$$ ##AUDIT TRAIL=  $$ (NUMBER, WHEN, WHO, WHERE, WHAT)
(   1,<2020-12-25 10:31:20.00 +0400>,<she>,<DPX200>,
      <continue with go, POWCHK disabled, PULCHK disabled
       configuration hash MD5:
       00 E9 B6 7A A2 85 ED C7 34 08 36 98 17 FE 4E 26
       data hash MD5: 16K
       AA 65 65 FA 7D 9A 5A 54 52 19 44 DC FC 8E AC 27>)
$$ ##END=
$$ 
$$ hash MD5
$$ 11 42 D4 07 35 9D 88 19 61 E5 3E A8 71 82 79 6C
##$RELAX= 
##$RELAX= 
##$RELAX= 
##$RELAX= 
##$RELAX= 
##$RELAX= 
$$ Bruker specific parameters
$$ --------------------------
##$DU= <F:/spectra>
##$EXPNO= 1
##$NAME= <H-F>
##$PROCNO= 1
##$TYPE= <nmr>
##$USER= <she>
##$AMP= (0..31)
100 100 100 100 100 100 100 100 100 100 100 100 100 100 100 100 100 100 
100 100 100 100 100 100 100 100 100 100 100 100 100 100 
##$AQSEQ= 0
##$AQ_mod= 1
##$AUNM= <au_zg>
##$AUTOPOS= <>
##$BF1= 200.13
##$BF2= 200.13
##$BF3= 200.13
##$BF4= 200.13
##$BF5= 200.13
##$BF6= 200.13
##$BF7= 200.13
##$BF8= 200.13
##$BYTORDA= 1
##$CFDGTYP= 0
##$CFRGTYP= 5
##$CHEMSTR= <none>
##$CNST= (0..31)
1 1 145 1 1 1 1 1 1 1 1 1 1 1 1 1 1 1 1 1 1 1 1 1 1 1 1 1 1 1 1 1 
##$CPDPRG= <>
##$CPDPRG1= <>
##$CPDPRG2= <>
##$CPDPRG3= <>
##$CPDPRG4= <mlev>
##$CPDPRG5= <mlev>
##$CPDPRG6= <mlev>
##$CPDPRG7= <mlev>
##$CPDPRG8= <mlev>
##$CPDPRGB= <>
##$CPDPRGT= <>
##$D= (0..31)
0 1.2 0 0 0 0 0 0 0 0.06 0 0.03 0 0 0 0 0.0002 0 0 0 0 0 0 0 0 0 0 0 0 
0 0 0 
##$DATE= 1608877754
##$DBL= (0..7)
120 120 120 120 120 120 120 120 
##$DBP= (0..7)
150 150 150 150 150 150 150 150 
##$DBP07= 0
##$DBPNAM0= <>
##$DBPNAM1= <>
##$DBPNAM2= <>
##$DBPNAM3= <>
##$DBPNAM4= <>
##$DBPNAM5= <>
##$DBPNAM6= <>
##$DBPNAM7= <>
##$DBPOAL= (0..7)
0.5 0.5 0.5 0.5 0.5 0.5 0.5 0.5 
##$DBPOFFS= (0..7)
0 0 0 0 0 0 0 0 
##$DE= 6
##$DECBNUC= <off>
##$DECIM= 32
##$DECNUC= <off>
##$DECSTAT= 4
##$DIGMOD= 1
##$DIGTYP= 9
##$DL= (0..7)
0 120 120 120 120 120 120 120 
##$DP= (0..7)
150 150 150 150 150 150 150 150 
##$DP07= 0
##$DPNAME0= <>
##$DPNAME1= <>
##$DPNAME2= <>
##$DPNAME3= <>
##$DPNAME4= <>
##$DPNAME5= <>
##$DPNAME6= <>
##$DPNAME7= <>
##$DPOAL= (0..7)
0.5 0.5 0.5 0.5 0.5 0.5 0.5 0.5 
##$DPOFFS= (0..7)
0 0 0 0 0 0 0 0 
##$DQDMODE= 0
##$DR= 18
##$DS= 0
$$ [...]
##$SUBNAM2= <"">
##$SUBNAM3= <"">
##$SUBNAM4= <"">
##$SUBNAM5= <"">
##$SUBNAM6= <"">
##$SUBNAM7= <"">
##$SUBNAM8= <"">
##$SUBNAM9= <"">
##$SW= 16.9725356469052
##$SWIBOX= (0..15)
0 0 2 0 0 0 0 0 0 0 0 0 0 0 0 0 
##$SW_h= 3396.73913043478
##$TD= 16384
##$TD0= 1
##$TE= 0
##$TE2= 300
##$TE3= 300
##$TEG= 300
##$TL= (0..7)
0 120 120 120 120 120 120 120 
##$TP= (0..7)
150 150 150 150 150 150 150 150 
##$TP07= 0
##$TPNAME0= <>
##$TPNAME1= <>
##$TPNAME2= <>
##$TPNAME3= <>
##$TPNAME4= <>
##$TPNAME5= <>
##$TPNAME6= <>
##$TPNAME7= <>
##$TPOAL= (0..7)
0.5 0.5 0.5 0.5 0.5 0.5 0.5 0.5 
##$TPOFFS= (0..7)
0 0 0 0 0 0 0 0 
##$TUNHIN= 0
##$TUNHOUT= 0
##$TUNXOUT= 0
##$USERA1= <user>
##$USERA2= <user>
##$USERA3= <user>
##$USERA4= <user>
##$USERA5= <user>
##$V9= 5
##$VALIST= <valist>
##$VCLIST= <CCCCCCCCCCCCCCC>
##$VD= 0
##$VDLIST= <DDDDDDDDDDDDDDD>
##$VPLIST= <PPPPPPPPPPPPPPP>
##$VTLIST= <TTTTTTTTTTTTTTT>
##$WBST= 1024
##$WBSW= 4
##$XGAIN= (0..3)
0 0 0 0 
##$XL= 0
##$YL= 0
##$YMAX_a= 486715
##$YMIN_a= -280544
##$ZGOPTNS= <>
##$ZL1= 120
##$ZL2= 120
##$ZL3= 120
##$ZL4= 120
##$ABSF1= 10
##$ABSF2= 0
##$ABSG= 5
##$ABSL= 3
##$ALPHA= 0
##$AQORDER= 0
##$ASSFAC= 0
##$ASSFACI= 0
##$ASSFACX= 0
##$ASSWID= 0
##$AUNMP= <proc_1d>
##$AZFE= 0.1
##$AZFW= 0.1
##$BCFW= 1
##$BC_mod= 2
##$BYTORDP= 1
##$COROFFS= 0
##$CY= 11.3945322036743
##$DATMOD= 1
##$DC= 2
##$DFILT= <>
##$DTYPP= 0
##$F1P= 15.9154993809931
##$F2P= -4.1035820241983
##$FCOR= 0.5
##$FTSIZE= 0
##$FT_mod= 4
##$GAMMA= 1
##$GB= 0.15
##$INTBC= 1
##$INTSCL= 1
##$ISEN= 128
##$LB= 0.24
##$LEV0= 0
##$LPBIN= 0
##$MAXI= 10000
##$MC2= 0
##$MEAN= 0
##$ME_mod= 0
##$MI= 1.114404
##$NCOEF= 0
##$NC_proc= 0
##$NLEV= 6
##$NOISF1= 3.799351
##$NOISF2= 2.8
##$NSP= 1
##$NTH_PI= 0
##$NZP= 0
##$OFFSET= 15.70392
##$PC= 1
##$PHC0= -10759.34
##$PHC1= 5.20095
##$PH_mod= 1
##$PKNL= yes
##$PPARMOD= 0
##$PSCAL= 0
##$PSIGN= 0
##$REVERSE= no
##$SF= 200.130013532006
##$SI= 16384
##$SIGF1= 3
##$SIGF2= 2
##$SINO= 400
##$SIOLD= 16384
##$SREGLST= <1H.CDCl3>
##$SSB= 0
##$STSI= 0
##$STSR= 0
##$SW_p= 3612.71676300578
##$SYMM= 0
##$S_DEV= 0
##$TDeff= 0
##$TDoff= 0
##$TI= <>
##$TILT= no
##$TM1= 0
##$TM2= 0
##$TOPLEV= 0
##$USERP1= <user>
##$USERP2= <user>
##$USERP3= <user>
##$USERP4= <user>
##$USERP5= <user>
##$WDW= 1
##$XDIM= 8192
##$YMAX_p= 0
##$YMIN_p= 0
$$ End of Bruker specific parameters
$$ ---------------------------------
##NTUPLES= NMR FID
##VAR_NAME=  TIME,          FID/REAL,        FID/IMAG
##SYMBOL=    X,             R,               I
##VAR_TYPE=  INDEPENDENT,   DEPENDENT,       DEPENDENT
##VAR_FORM=  AFFN,          ASDF,            ASDF
##VAR_DIM=   8192,          8192,            8192
##UNITS=     SECONDS,       ARBITRARY UNITS, ARBITRARY UNITS
##FACTOR=    0.0002944,     1,               1
##FIRST=     0,             0,               0
##LAST=      2.4114304,     0,               0
##MIN=       0,             -280544,         0
##MAX=       2.4114304,     486715,          0
$$ Real data points
##PAGE= N=1
##DATA TABLE= (X++(R..R)), XYDATA
0 0 0 0 0 0 0 0 0 0 0 0 0 0 0 0 0 32 -32 32 -32 32 -32 64 -64 65 -96 96 -128 129 -160 192 -224 245 -280 318
34 318 -353 393 -449 501 -555 620 -693 771 -852 945 -1045 1156 -1276 1410 -1548 1705 -1881
51 -1881 2072 -2280 2516 -2780 3079 -3413 3804 -4255 4786 -5421 6199 -7180 8449 -10185
65 -10185 12697 -16692 24053 -42346 197674 243520 105882 195375 -12474 -130515 -116801
76 -116801 -89078 -254944 -245222 -158537 -188401 -280544 -214369 -145521 -247803 -252367 -152801 -145897
88 -145897 -195911 -126796 -14284 -44931 -19388 68825 123929 59732 90155 147338 85969 36089
100 36089 46142 44091 -48303 -66238 -39500 -64644 -109991 -79615 -29124 -77205 -55176 -14893
112 -14893 -8525 -45548 -38445 -8640 -54715 -70719 -47212 -28748 -62122 -24975 23338 25667 40035
125 40035 67449 101020 63662 67551 76829 55482 22969 24537 38406 6397 18582 32408 43316
138 43316 24569 29920 41845 8876 -5327 -15739 -21632 -60133 -57491 -51483 -57522 -51828 -40691
151 -40691 -11231 -21810 -763 18156 22856 20161 29702 42226 27187 35816 35970 46713 31937
164 31937 41592 55193 42656 51590 51459 57488 37906 36843 26990 9300 -10033 -26787 -32503 -63089
178 -63089 -59834 -66422 -64634 -64440 -57005 -42423 -44843 -32126 -29742 -18364 -26632 -17440 -9627 -10678
192 -10678 2891 6577 24294 21603 33746 37203 35562 29247 22111 19936 -1137 -634 -12969 -13728
206 -13728 -20963 -21392 -14357 -19771 -11487 -12620 -4410 -11062 -3895 -3742 -6147 -1946 -8040 458 -10038
221 -10038 -4087 -5856 -5027 -5251 -4416 3168 -1595 9300 6218 15033 12313 14607 18151 12870 17700
236 17700 13066 16745 11073 15109 14305 13499 15989 11382 16776 6072 10400 3902 2668 677 -2206
251 -2206 1138 -3177 2663 -1375 4271 -775 348 -114 -5572 -2585 -9739 -5742 -11324 -8889 -9764 -9136
267 -9136 -7893 -10595 -4731 -11900 -4087 -7554 -3712 -2822 -1032 2921 287 4739 1086 4131 -2204
282 -2204 -1204 -4665 -10026 -8324 -14302 -8742 -13490 -9078 -8536 -6012 -2595 -1674 2892 -1215 6205 2781
298 2781 6095 3523 2955 6762 2731 8730 5150 11515 8134 11864 10828 11727 12769 8395 12464 5104
314 5104 6701 1612 581 -1372 -3527 -1996 -4965 -952 -5185 -1083 -4699 -4604 -4643 -8650 -6302 -11385
330 -11385 -8358 -10969 -6914 -6316 -1976 2313 3153 9349 6689 11379 6936 6975 4271 -453 -981 -6217
346 -6217 -3822 -7292 -2967 -4223 13 2216 2800 5844 2714 5861 -166 -1058 -5753 -8277 -11197 -13137
362 -13137 -12369 -14669 -9092 -10302 -6064 -4533 -2368 363 -1251 2525 384 4462 3328 7992 9808
377 9808 14272 19733 20245 27724 25602 27374 23865 21469 15831 8171 2772 -5899 -10015 -17998 -18108 -20899
393 -20899 -19933 -17216 -17796 -11978 -12714 -8207 -9110 -5938 -6554 -6062 -4174 -4319 324 980 7573 9233 14125
410 14125 16282 17867 19546 15798 15168 7747 5667 -2010 -5679 -10103 -14069 -13759 -16427 -13617 -14977
425 -14977 -10938 -11244 -10431 -9770 -11708 -10062 -13685 -10528 -12597 -7656 -5290 -1309 4168 7311 13974 15022
441 15022 19007 17735 18174 15052 11218 9762 5280 5532 1765 2878 1353 2336 3544 3417 5037 2768
457 2768 3300 -824 -1351 -5634 -8708 -10416 -13857 -12375 -14657 -11696 -11886 -7922 -6726 -4113 -1487 -1996
473 -1996 841 -924 1370 188 2503 3600 5598 8406 9739 13933 14306 16362 14622 14210 10954 5957
489 5957 3528 -2918 -4530 -9478 -9851 -11511 -10101 -9159 -8437 -5088 -6189 -2618 -4032 -1393 -1578 -1390
505 -1390 -179 -347 3336 3022 7115 7373 10457 10519 9828 11191 8094 8582 4072 2886 -1377 -3316 -5685
522 -5685 -7605 -8641 -10842 -8623 -10401 -8451 -8193 -7730 -6324 -7214 -5492 -7134 -4807 -5498 -3480 -2090
538 -2090 -106 2418 3750 7315 7327 10016 9179 9450 8677 6669 5938 3384 4006 1507 3631 1913 3526
555 3526 3923 4452 5192 3733 4664 1695 835 -1684 -2058 -3419 -5529 -3765 -6253 -4351 -5924 -4454 -3961
572 -3961 -4161 -4064 -3799 -2406 -3893 -1064 -2335 150 -613 569 1801 732 3186 1459 3255 1761
588 1761 2486 948 53 -170 -2994 -2657 -5344 -4748 -5607 -4524 -4398 -3668 -2476 -2359 294 -467 1014 1459
606 1459 1598 2013 884 2893 1681 3655 2970 3822 4096 4421 5302 3798 4567 2807 2818 1501 1417 1646
624 1646 -91 877 -2138 -975 -958 -789 -2842 -2258 -2580 -3650 -2728 -3035 -1429 -1817 -518 -1232 -654 394
642 394 -13 1206 144 1207 534 1114 471 197 1475 -194 605 -401 -691 -1199 -776 -1496 -1790 -787
660 -787 -1293 -677 -1507 -230 -99 -416 91 -699 268 -1119 -156 -716 -170 -722 -973 -228 -1342 460 -407
679 -407 160 -163 236 1122 1227 2503 1529 2095 856 1709 467 676 853 -702 939 -371 1036 910
697 910 1203 898 1264 555 524 117 -1428 38 -1268 -613 -82 -577 179 -183 932 574 676 -22 -83 453
717 453 -923 -57 -688 929 -72 983 490 1939 1568 798 1982 1224 1249 -1191 -1318 -2095 -2814 -3394
735 -3394 -4667 -3882 -4229 -3257 -4028 -2451 -2461 -1443 -804 146 495 -196 307 650 1055 592 973 1985 2626
754 2626 3396 3342 3219 3074 2960 2262 680 735 -603 412 -1169 -933 -1192 -424 -80 -438 -384 -35 120 231
774 231 -873 -1737 -1386 -1545 -2486 -1306 -987 245 290 1701 1566 2068 2362 2491 2793 1426 1776 836 -223
793 -223 195 -686 120 126 777 494 1370 1284 971 1029 151 821 -1023 -1521 -1885 -1831 -2182 -1682 -1733 -2096 -870 -716
815 -716 -755 -809 -504 -392 -1392 -1334 -1681 -164 -27 -48 503 2013 2312 2173 2310 2276 1964 826 619 -589
835 -589 -2043 -1807 -2765 -3079 -3686 -2161 -2834 -824 -1272 -436 898 51 498 -375 -163 48 1378 673 1431
854 1431 1304 1577 1863 1608 2409 1850 1729 1430 69 -75 -1010 -101 -1177 -956 -1602 -1310 427 -345 191
873 191 -286 620 -636 203 -713 -760 -1166 -2202 147 -1979 -141 -740 998 517 351 1157 669 1810
891 1810 568 979 203 -290 -130 -343 4 -388 -21 213 584 523 35 330 -166 69 -1078 -1347 -1851 -1507
911 -1507 -1575 -870 -785 -665 -366 -895 465 -568 -509 449 1 135 -340 -18 -162 1404 1375 2032 2167 1014
931 1014 1990 1189 2508 1064 1493 294 307 -292 -752 -359 -586 -913 -353 331 -685 -345 111 -787 803
950 803 267 -48 -639 -79 -117 88 -774 -99 189 -1555 -191 64 455 -82 -634 92 -519 51 -408 -7
970 -7 86 -664 -315 -472 -46 27 -157 -344 -1514 -64 -70 70 -793 -442 -467 46 -244 210 560 9 1065 1470
992 1470 1431 459 847 955 332 375 603 1282 452 636 971 840 1098 447 748 -229 925 -544 -147 -547
1012 -547 -428 -465 -1184 -595 -845 -437 -743 -191 -685 -848 -1059 -422 -79 -803 538 -1299 -510 216 882 288
1032 288 794 -539 -489 581 -198 439 257 1317 329 -1081 -374 429 -774 -224 -486 158 -307 435 -394
1051 -394 388 97 -776 451 187 287 618 661 226 999 -118 428 -538 116 163 291 439 531 675 -195
1071 -195 636 35 257 -389 -53 98 -534 -655 -1017 -1541 -1070 -791 -794 -1348 -703 -727 -262 -485 -67 362 -168
1092 -168 587 185 483 380 439 955 991 1196 1186 1145 721 1074 271 622 175 158 402 -414 -267 -540 -306 -529
1114 -529 -336 -183 -543 -41 -232 -325 -721 -105 -502 -342 -936 -467 -441 -111 630 4 735 542 979 493 478
1135 478 1046 350 414 -439 -1 45 -135 -13 320 366 -80 627 180 580 -563 -952 681 -1066 -302 -659
1155 -659 -210 -841 -529 -88 251 283 72 118 -244 -213 -299 -142 -208 -436 -300 -322 2 -183 -71 237 -119 209
1177 209 38 -151 -544 -866 -510 -846 -711 -975 -7 -304 485 106 572 418 779 564 306 904 542 731
1197 731 376 314 774 1039 1391 865 1417 929 806 182 206 164 -287 -55 -500 -507 -107 -276 -484 -75 -48 251
1219 251 -15 -89 -148 -471 -392 -744 -827 -842 -572 -93 -219 -215 32 327 1035 192 466 234 261 412 595 -417
1241 -417 -527 -143 -531 89 -262 71 -388 0 -146 -117 -766 -687 -946 -945 -1054 -923 -349 -620 -229 -175 -349 92
1263 92 -85 148 -133 -92 -33 -202 -353 -221 -59 -94 646 250 527 787 918 300 181 364 -263 538 -446
1284 -446 599 264 150 200 495 177 380 693 473 649 264 380 304 367 484 148 32 168 -141 538 79
1305 79 89 -171 -234 -173 -227 -615 -936 -46 -126 -477 -229 -279 -469 -9 265 242 20 -292 157 -400 -38 -379 -244
1328 -244 -620 -647 -219 -275 13 -453 86 -529 46 235 -297 -478 -341 -286 -97 -327 -444 -367 106 -185 -159 -604
1350 -604 -531 -160 -19 -54 -150 -144 -185 287 95 379 328 -297 86 35 -112 192 716 131 394 -339 149 207 -178
1373 -178 463 313 811 233 170 823 485 536 341 247 130 576 183 35 -56 694 629 -610 163 63 -141
1394 -141 -431 -428 -646 6 -318 -1295 -240 -659 -280 -298 -555 -301 -44 -16 -288 -112 -422 -354 -478 -7 6 -898
1416 -898 24 -254 452 76 31 177 139 26 -46 475 -22 217 219 -224 27 -61 68 104 651 110 -288 -154
1438 -154 309 499 544 -207 178 687 -255 332 64 97 326 304 539 -319 26 -115 -73 -181 299 174 -51
1459 -51 279 -314 -96 -235 -590 -227 -295 364 -255 37 223 -128 -1034 130 35 -350 113 228 -420 26 20
1480 20 352 411 -106 307 343 244 102 -126 93 181 -60 312 -38 330 -468 -396 -250 -334 466 -399 -408 -452 -251
1503 -251 -347 -281 -208 234 579 -74 -156 46 106 343 113 -399 253 250 141 -62 -313 164 386 184 282 -98 -275
1526 -275 122 182 -127 -32 252 -416 41 -46 54 -67 1073 300 73 190 -84 230 -242 142 -110 -59 352
1547 352 19 88 -226 20 498 -272 -554 -198 -93 187 -226 139 -288 500 -332 -368 -440 1 423 -240 55
1568 55 69 336 498 -842 -265 29 290 552 534 -432 711 97 176 194 -14 380 -128 170 415 -336 -328 -590
1590 -590 79 345 -50 151 -44 -612 440 49 -269 -271 79 -260 17 251 -71 10 0 229 195 272 100 31
1612 31 89 -371 -86 580 420 -174 253 199 -424 -87 -259 -568 -329 -570 104 159 -691 129 -250 -239 -441 -523
1634 -523 108 -435 144 -28 26 65 492 -218 573 241 212 -217 -226 543 -568 -73 -609 -348 11 -241 -119
1655 -119 527 -117 85 -290 253 -233 -5 -22 80 21 -3 415 382 73 101 175 438 231 -138 440 -192 380
1677 380 71 141 416 242 -170 310 -355 -37 -72 -123 -268 84 -236 129 47 -191 114 -314 -400 -221 -145 -328
1699 -328 -271 190 -40 -69 118 -189 348 23 104 212 -458 132 4 109 -102 245 -81 -438 -480 -123 -285
1720 -285 -144 -96 191 -245 -258 24 -95 -32 -192 -434 45 269 -202 -322 -658 -123 396 -687 360 31
1740 31 -49 -606 146 229 9 555 -39 -318 -146 289 -276 421 -81 604 -87 -410 -340 -320 -565 -81 -231 298
1762 298 262 510 91 347 -4 -464 216 -242 100 310 -700 -281 848 -34 307 -119 -49 -465 76 151
1782 151 401 277 13 79 -185 -121 -129 192 -27 -191 -24 -140 253 228 -271 -254 -166 -249 -98 -485 122 -681 368
1805 368 -236 -257 -198 41 433 -162 -16 -235 293 490 108 48 70 181 260 -87 120 173 -572 335 272 -21
1827 -21 425 182 158 210 377 175 370 413 -16 118 55 194 -641 -116 174 86 125 394 249 -159 440 107
1849 107 -78 -66 209 -324 553 -134 -326 336 5 -151 63 -238 -286 -188 -257 -297 135 14 173 -264 -304 52
1871 52 -70 265 -45 -173 -473 66 -144 -173 -27 -93 328 -507 -48 -72 187 -227 -299 545 -499 -65 62
1892 62 -446 -215 263 32 -195 -17 -15 -162 83 -232 -83 38 -15 -195 -161 -234 46 -233 -137 49 118 -217 -175
1915 -175 -47 -59 -116 169 91 -545 164 -193 -271 -65 -650 17 -6 33 99 219 -137 -155 -191 -66 -239 0 193
1938 193 57 0 44 35 -60 -14 62 96 317 183 29 264 -261 375 -158 -21 105 315 123 83 241 -541 73
1961 73 189 34 496 -253 -210 432 626 -83 183 111 -115 52 556 -139 -508 125 20 179 195 -152 72
1982 72 -36 72 -227 210 -92 -408 -152 273 209 -69 183 -192 225 522 -392 -255 14 -451 -3 -62 -202
2003 -202 -410 -2 402 -173 -404 -118 -146 546 -475 -70 -59 202 -72 -489 760 -167 -491 -348 -455 341
2023 341 71 -282 498 713 333 -56 -6 221 714 -194 1 -269 -224 -561 -379 -29 -454 -132 -266 -351 -315
2044 -315 198 226 -43 -158 0 279 291 221 -132 360 -106 219 -12 -147 -83 26 223 -596 476 165 -46
2065 -46 1 94 -222 -112 340 203 -116 -25 -231 -227 202 -113 -383 264 -3 47 -32 -18 111 184 -455 142 263
2088 263 -20 88 22 -254 -271 -181 151 68 235 350 -255 150 -124 -168 -65 380 68 109 19 -41 -351 338 -247
2111 -247 -115 59 282 196 -26 339 127 -205 107 -46 -140 -53 -53 -102 -152 195 171 -483 -120 16 100 -222 89
2134 89 49 422 357 342 211 69 -77 -102 -210 259 86 46 203 -50 -13 -342 28 -90 75 424 -88 -49 -212
2157 -212 -240 -464 -106 -501 353 110 214 -34 369 -190 691 -375 413 69 287 -56 92 -298 313 -205
2177 -205 141 178 115 131 -268 -107 -315 48 -205 363 305 135 -175 184 99 -312 -483 222 533 155 326 264
2199 264 115 -131 -102 -498 -380 90 -296 164 -305 605 58 284 185 107 163 -20 280 -188 -177 301 278 -450
2221 -450 417 -62 136 345 -7 162 -95 -165 -148 24 195 -353 93 313 181 577 -147 -302 -517 104 18
2242 18 -190 190 148 161 10 -253 -47 605 29 -314 659 448 -25 42 304 -27 8 538 355 70 -58 10
2264 10 387 -29 69 -10 -258 71 248 -84 -466 114 192 -76 -202 -218 207 198 -19 182 -357 201 -275 -195 209
2287 209 -212 2 -429 -354 -23 -171 -96 -105 -595 -135 -284 147 -62 -171 65 -31 -376 117 -234 125 8 -278
2309 -278 -54 594 -9 214 20 -30 -123 -193 636 -41 -136 -310 42 -260 272 245 -275 -68 -50 66 -1 366
2331 366 405 560 -144 271 208 -137 167 -216 -332 412 -195 150 -204 214 389 334 358 -134 -29 203 -20
2352 -20 -357 66 -187 287 610 -116 6 200 -246 -232 -178 -204 187 304 -14 -365 180 -170 294 -314 36
2373 36 222 122 0 -63 -160 -625 -129 -191 -377 -287 68 -178 -27 93 -32 167 221 59 3 225 -291 -272 267
2396 267 -393 19 -35 59 -352 134 -224 229 -238 -145 167 89 193 -28 -582 45 261 159 -12 268 172 -61
2418 -61 40 265 -283 556 -164 -276 106 -51 299 387 492 -142 70 -260 -156 -184 -57 -217 -572 -197 -185
2439 -185 -158 52 -88 -178 26 -428 -60 274 -156 -63 77 240 -220 31 -409 -454 -236 119 244 -11 7 189
2461 189 173 -244 101 236 -273 -353 -276 23 270 171 -154 -152 -275 -75 151 385 -212 -111 -269 145 -42 -205
2483 -205 -485 5 -310 -259 9 96 241 285 -185 -48 -704 136 -50 -232 -678 -40 -338 241 224 -8 -644
2504 -644 194 -184 -82 371 71 101 282 449 -26 -114 -473 381 -124 171 277 358 148 -86 -27 -122 -291 -426
2526 -426 -302 -184 -284 322 188 293 305 4 7 -80 -338 -242 89 -97 378 -137 -426 87 -119 179 17 189
2548 189 472 56 -55 -539 137 -171 86 62 122 499 123 -281 -294 103 -270 -165 -287 -102 -420 380 219
2569 219 163 170 162 32 51 242 417 260 -257 276 -118 145 242 -404 66 203 -84 -22 286 -45 113 265 259
2592 259 -178 222 118 -681 359 137 -393 -385 84 154 199 234 152 -51 -20 80 49 53 -285 -412 -262 11 120
2615 120 -20 303 -246 -90 -82 519 3 -465 -432 105 -295 -311 63 -4 99 -381 32 187 102 3 169 554
2637 554 28 664 -33 -126 -297 104 318 -183 71 115 -29 -79 70 -516 202 -237 -198 -258 -103 -240 55 109
2659 109 46 -19 216 151 -32 -29 73 -42 -69 122 -266 -348 69 183 79 -346 43 207 206 -179 409 116 248
2682 248 -79 220 3 293 -73 -377 -222 -414 -128 192 -326 -68 -36 -473 -78 -433 43 111 77 234 -413
2703 -413 500 -141 -76 234 89 115 -371 88 80 -130 -519 -250 -54 -216 59 -234 165 -208 -385 -380 30 -42
2725 -42 -417 -123 33 418 11 232 116 -377 246 236 124 -119 -202 207 -42 274 173 77 -115 -9 154
2746 154 -111 -75 378 -71 183 -152 -55 340 -287 -64 161 85 -563 123 -172 448 18 97 -300 -71 -72 -125
2768 -125 -70 -81 295 438 410 -28 612 -236 197 159 -295 -300 -201 -204 -78 -648 254 137 -171 2 -16 58 162 544
2792 544 86 283 101 269 176 199 -84 370 295 -339 73 106 -86 -240 -109 -54 103 335 -11 -79 -50 488
2814 488 -91 13 -176 -217 268 339 331 110 -93 -4 352 -343 -118 -40 618 -464 247 132 -31 -261 -208 67
2836 67 468 100 213 210 1 134 -239 36 -194 -319 34 -343 79 83 -154 4 -288 -61 376 35 308 164
2858 164 -339 369 427 -689 20 -330 8 489 144 572 -481 61 114 63 415 -53 282 -293 477 -188
2878 -188 -222 329 -73 -108 -80 -192 -111 27 -174 -16 -429 121 -267 -172 66 -59 -125 310 -126 192 102 -181
2900 -181 -364 -79 39 130 -580 499 -263 -385 132 256 -75 -125 -116 508 -85 166 433 -163 263 -236 332
2921 332 -263 204 618 298 217 22 -349 -111 -339 292 -12 174 77 123 -332 -117 57 496 9 561 -187
2942 -187 -141 48 -30 -307 -29 -16 145 -137 120 137 -164 -155 241 206 531 500 -164 185 -94 24 198 -29 97
2965 97 -41 -518 23 -7 -217 120 294 220 190 196 340 -5 -8 -485 148 209 -284 163 22 23 203 -253 212 -378
2989 -378 148 272 348 666 -507 -138 -356 73 80 659 27 -83 334 -68 -163 -363 -219 -68 417 -361 348
3010 348 -506 -212 -219 -94 13 4 136 83 7 -47 -472 36 -102 -186 61 -310 -194 -135 -27 279 -140 -439 81
3033 81 -168 -141 237 -479 -636 126 23 -170 -701 -198 113 -633 -211 554 -485 -95 82 -128 39 39 81
3054 81 358 -29 -368 548 83 -75 -431 -270 -85 7 -303 -85 148 -420 -203 -392 -235 256 735 -219 -163
3075 -163 49 810 -26 338 203 -364 -237 -276 135 -358 -261 -142 163 -454 292 -41 -5 -23 -170 280 -589
3096 -589 33 574 -301 -126 543 295 -116 -29 -680 188 -114 95 203 -416 254 62 -609 -414 110 335
3116 335 -55 270 268 -57 576 459 -327 362 78 -170 -324 332 -26 -77 -190 -162 508 -170 -77 -104 32 242
3138 242 -107 252 257 34 124 -57 330 -219 417 -232 387 -62 221 448 38 294 -13 -549 -296 -65 43
3159 43 238 -137 332 26 -285 396 -66 -169 -366 -46 -48 -524 -420 -80 136 -87 168 -328 227 -75 43
3180 43 559 160 -259 139 107 169 -173 91 -299 -127 44 -328 -312 -45 238 171 5 -285 125 -423 417 -144
3202 -144 197 -33 105 346 -557 -199 416 92 252 -108 -189 -358 657 -223 148 -38 603 160 108 -45
3222 -45 -483 -21 -2 189 -588 -123 -441 -281 408 534 -188 -191 -219 -390 632 -252 735 475 -330 189 -104
3243 -104 214 -902 -225 -138 -381 348 289 61 -233 -196 144 79 -113 6 24 64 -485 -933 624 14 -36 150
3265 150 -342 -132 -257 -111 -188 -388 64 52 57 39 190 124 -1 -139 -28 -83 237 -100 184 -101 -404 -133
3287 -133 473 -92 -338 108 -100 98 161 406 -119 2 42 325 -344 16 225 507 -127 132 -81 -279 -351
3308 -351 409 -203 -103 -19 155 -542 6 -235 202 416 -421 -384 -377 -60 113 -164 101 249 138 258 -223
3329 -223 12 161 355 -220 -387 -132 -511 663 423 -402 350 -204 198 -124 -108 130 75 315 -33 -50 -710
3350 -710 688 96 50 -129 -146 -223 -59 -169 -87 222 -654 -32 -292 -131 16 -5 162 195 -138 83 -128 23
3372 23 -408 169 76 79 512 -297 416 -90 258 -24 314 -200 -283 55 371 112 -470 290 -348 -119 47 -176
3394 -176 98 -36 42 -179 19 502 152 131 -303 -91 177 -368 -54 168 -31 -156 -102 45 154 -284 -98
3415 -98 -320 -527 -539 -105 -26 155 -423 -514 -83 113 196 -124 -331 222 -300 715 35 205 -14 -171 173
3436 173 -507 -248 -124 -233 108 261 -353 105 44 -273 -344 55 -38 149 -215 211 37 -338 -368 562 -33
3457 -33 116 -217 -53 209 560 -306 -413 -129 -55 95 -312 223 -140 360 338 270 -274 -84 31 -42 -292 74
3479 74 21 -286 -305 -181 245 323 -90 93 253 92 -385 -47 191 -50 198 -55 158 -201 -32 40 351 578
3501 578 -2 -73 -128 256 204 7 256 130 45 -530 372 -69 -379 31 -328 121 201 -65 -27 85 -298 -15
3523 -15 -61 -130 243 149 22 148 -78 -86 -1 -223 -214 79 -196 -157 81 818 -9 -352 316 57 118 -248 361 318
3547 318 -395 354 281 -34 9 227 31 202 150 124 -78 46 81 -286 -165 -32 347 208 -402 -56 -169 218
3569 218 -111 -23 682 -649 -92 -421 87 64 -239 95 -343 -108 -254 303 -92 -1 93 -523 -182 345 -16
3590 -16 460 189 73 -227 112 93 -79 185 39 -306 -100 64 469 266 879 110 119 706 -376 360 354 -96
3612 -96 -80 -161 -519 202 284 -185 -185 670 -252 -54 122 -233 -80 845 -162 -131 -177 294 121 -738 510 -536
3634 -536 170 -178 426 -492 137 -183 349 1624 4 -251 17 134 -117 876 37 660 -398 -405 151 -496
3654 -496 302 141 225 263 -216 430 -281 -127 242 114 184 -67 115 -484 194 120 -98 195 160 -298 -160 -92
3676 -92 -297 -480 -3 139 192 -121 216 437 -51 -132 -39 58 163 194 -22 200 533 227 -98 -286 -248 -97
3698 -97 -18 167 -33 -78 7 83 -9 -135 -246 -78 216 311 210 -269 295 -170 -180 -94 -655 96 -340 -46 -40 -323
3722 -323 496 197 248 399 114 -289 104 -331 -289 -120 -33 -226 -85 -159 112 414 -341 261 -558 -43 -148
3743 -148 -34 -50 75 396 -771 -69 -24 -8 -790 -426 -78 95 -209 392 116 -185 624 -296 237 -210 43
3764 43 121 -1165 -126 674 417 205 -90 171 -164 -123 -372 680 539 292 -690 301 423 -493 16 62
3784 62 -430 781 -132 65 -339 -43 655 196 114 285 298 -32 13 388 -164 73 -47 -194 178 -363 -333
3805 -333 -327 88 -441 395 237 125 -45 199 -1 -60 199 200 203 138 -255 -49 583 -350 -37 336 -12 93 -182
3828 -182 -10 125 -623 -78 109 140 149 -19 -126 715 -61 -321 152 -188 286 89 74 -314 -145 150 -130
3849 -130 15 -235 -352 278 345 -156 -68 -69 -173 -141 -68 -463 329 259 -147 -390 -58 210 98 -237 118 86 -128
3872 -128 -126 517 58 171 622 52 2 38 -56 246 -300 -127 37 559 -368 7 139 40 30 -480 -18 -19 143
3895 143 242 -25 -70 -197 -117 -198 -409 277 -471 -139 460 131 -337 -71 51 -47 -224 -67 301 222 -120 306
3917 306 140 -189 -225 135 -123 127 -427 -391 -208 100 38 -126 -145 223 -83 81 -38 113 -183 72 -22 98
3939 98 -461 -61 234 -40 -309 -308 -351 -135 95 -214 318 175 40 -497 50 -643 -58 421 486 -151 182 411
3961 411 -9 -176 -27 -240 -279 -33 -153 369 632 -304 555 11 -319 223 -238 -78 6 -15 -50 424 128
3982 128 -51 -202 93 563 -46 262 -37 -16 -226 25 -148 -269 224 -40 -318 356 9 255 57 -90
4002 -90 33 299 209 11 88 11 143 245 134 -376 124 -399 258 -223 36 224 360 17 -29 -518 31 293
4024 293 304 -251 19 128 -315 76 317 163 569 -450 31 206 -235 -85 534 312 -20 -148 -213 -73
4044 -73 -23 -16 -385 -4 -15 155 -9 231 86 173 193 147 -88 -147 220 -552 147 -21 334 196 -131 131 -50
4067 -50 -31 -236 147 -135 -490 -134 166 -707 47 -196 378 156 391 430 -289 268 3 370 -190 -38 388
4088 388 -215 -435 42 -76 222 -53 -78 267 -72 -1 110 -68 -253 248 178 218 208 32 -36 512 29 -418
4110 -418 181 -542 -477 121 318 -350 -196 -318 194 197 91 -113 344 -535 -213 16 -11 71 535 263 234 94
4132 94 532 -185 -79 -482 16 -222 -59 239 16 -7 258 -175 12 -61 171 78 361 74 15 -433 291 625
4154 625 -387 -28 -278 360 -65 11 -127 108 169 220 96 333 -449 -151 -48 75 -1 273 -529 166 7
4175 7 141 -15 340 -87 184 -79 -378 -425 -217 433 -47 111 -2 -1 30 -310 -96 21 -362 -240 248 -174
4197 -174 -205 -199 -76 166 245 -456 14 -48 -30 -72 179 388 127 -268 132 320 34 -139 136 -153 413 -24
4219 -24 -88 -4 375 294 -161 122 -254 -314 208 -10 438 -116 140 -439 -253 -437 -125 -64 -209 205 -217 -80
4241 -80 202 -220 -115 -324 -170 127 -166 -432 -193 297 -305 4 -165 524 -56 104 -404 -65 85 310
4261 310 -227 165 -234 -592 -393 155 -207 -274 311 -206 806 -378 21 -221 -92 -348 -194 122 -33 518
4281 518 -54 198 329 -218 8 -450 193 259 -223 -195 301 125 270 319 -92 223 75 327 210 -48 -142
4302 -142 -218 12 278 189 422 -215 -189 104 -48 337 -86 -236 -172 288 158 6 -544 -74 499 -270 18
4323 18 -54 -42 -192 -103 -594 286 -76 62 85 168 -451 -618 277 243 362 -229 -611 474 331 -305 -194 9
4345 9 270 -50 -108 -50 112 -171 87 -477 -2 -47 15 -265 91 -439 434 465 -4 -198 -126 -180 -18 300 29
4368 29 265 48 143 -161 497 196 86 -151 -82 -96 220 -357 -79 -294 342 -62 -18 319 -17 -252 279 -201
4390 -201 113 139 124 -331 -558 -260 -160 -246 84 -247 50 203 52 61 -258 -126 -215 -117 542 28 -83 -72 -107
4413 -107 -93 -442 176 193 5 336 584 4 -314 -9 35 -7 311 -174 -240 531 119 283 -202 95 79 -52
4435 -52 -257 63 -296 61 356 89 209 56 73 -85 -84 130 -159 22 -393 -426 105 -307 -32 223 -106 39
4457 39 -755 -158 -753 110 521 -111 -189 -604 58 555 -56 -128 75 -207 -104 -44 -297 450 -142 -42 215
4478 215 -443 106 -285 -77 68 -62 -55 133 -43 -41 -427 144 241 -223 -355 189 -75 -45 44 -58 -22 82 -226
4501 -226 128 370 95 40 -88 -219 -199 -176 -435 107 -380 -211 254 252 -292 612 141 -241 -139 -93 201 149
4523 149 762 -45 47 179 -58 -91 158 -104 -85 66 -10 -358 -185 -91 -29 -304 263 -86 222 317 277 -535 -94
4546 -94 -51 28 -135 -426 291 436 -104 -282 -107 -456 -26 194 -441 -87 -58 160 107 419 208 315 -237 242
4568 242 243 392 85 -533 126 153 -274 -277 56 -228 -296 -40 -29 -527 -75 -131 -150 116 -133 -485 43 -58 221
4591 221 574 515 -55 260 404 -191 471 14 -92 4 -365 -282 4 -194 322 158 450 399 148 -539 44
4612 44 -52 734 -167 287 129 -462 -28 55 197 293 427 234 -117 -240 -237 176 -195 27 -239 -840 129 -321
4634 -321 152 189 131 -45 -69 -106 -121 -172 148 -136 -276 -282 153 110 373 384 431 -126 441 -387 -273 61 -153 41
4658 41 88 565 89 -194 217 -140 -10 96 45 -180 -133 122 190 -17 -304 101 -287 -173 -3 146 -219 80
4680 80 -285 33 467 375 -28 425 -304 -276 35 929 109 -308 -169 -101 -107 -546 -47 -323 -183 158 215 -153
4702 -153 232 86 -200 -123 -145 -112 -147 23 88 -15 -356 -96 124 408 -85 40 -27 418 -136 169 137 124 -607
4725 -607 377 79 -5 -373 -210 -127 -229 218 -712 -23 19 397 18 -85 -377 95 328 11 -143 -374 214
4746 214 197 -29 485 129 -194 -41 194 176 -272 107 -252 -499 208 -103 -276 -98 328 294 121 124 255 3
4768 3 67 -205 292 479 55 527 60 -257 270 -107 -182 -132 -68 -219 97 286 52 -295 -491 304 217 -65
4790 -65 -192 -231 -62 -122 365 150 84 -221 -289 867 -479 64 309 64 321 314 -48 138 -50 186 -412 -192
4812 -192 485 123 356 149 199 -454 -293 62 -86 -335 380 7 192 -202 113 -317 43 57 526 -212 3
4833 3 -57 -265 -173 -178 -239 -173 274 -34 -90 -256 109 -165 203 137 -116 -72 270 218 -94 -322 -44 248 423 -150
4857 -150 -241 61 371 -305 81 -488 -53 -30 -8 -5 -144 -393 65 -31 -238 -279 209 -45 -182 322 187 -334
4879 -334 61 -69 302 -183 -52 175 162 328 -428 -132 -122 -237 -165 -420 -149 -97 -290 -176 51 -113 -138 -23
4901 -23 257 -136 203 -182 235 -169 -63 100 -42 -37 -216 48 96 -184 219 140 -74 -314 -194 -150 87 158
4923 158 558 -439 -460 -8 39 313 154 -290 74 -635 242 -166 -170 390 -262 87 161 221 189 190 -403 -3 -461
4946 -461 218 -326 -858 -191 147 -445 -567 306 -81 -270 -140 716 -162 -35 -339 -736 114 379 -168 42
4966 42 146 -384 462 146 -172 -34 -144 -254 79 76 -42 143 -13 114 157 -130 -381 32 -66 535 -49 -165
4988 -165 -264 -95 -69 9 -105 81 -523 -37 -242 109 40 -444 248 599 -145 91 445 -221 -140 314 100 5
5010 5 42 -1 -58 6 502 -508 56 -353 -158 186 -337 -289 73 229 -456 308 -113 409 -62 582 217 163
5032 163 -98 -64 94 -337 -30 -238 26 -382 -23 -228 53 108 383 155 483 -6 -124 97 409 -58 74
5053 74 319 359 282 270 -250 148 -412 397 -258 -232 -148 168 120 209 -168 -230 72 220 -260 227 -80 47 682
5076 682 -263 -172 -234 15 -73 221 -263 229 86 368 -326 -23 90 287 -18 194 194 98 -17 25 -305 -221 147
5099 147 221 170 41 44 -414 107 -98 609 314 171 122 -270 -279 -190 11 400 -306 -19 112 -60 -70 -287 405
5122 405 -281 -188 16 210 69 285 215 209 -383 -110 114 111 56 -181 357 183 272 -98 -184 -180 229 41 -51 222
5146 222 375 474 27 217 -7 99 160 2 107 -226 193 373 -303 654 75 346 -230 -87 -209 259 17
5167 17 -321 -376 35 314 -155 -129 57 173 255 -546 -253 395 37 -118 319 392 549 -82 435 -549 -408 93
5189 93 -691 8 69 107 217 -106 -540 566 59 128 -158 487 -52 -182 -103 -125 -182 -302 645 -517 -397 313
5211 313 280 15 64 522 -428 -93 212 493 -508 -167 20 -281 261 -303 -272 89 -354 -225 -177 -172 -71 -404
5233 -404 194 241 -206 68 -315 515 206 -414 -224 -336 331 155 331 291 -53 232 135 15 -463 -285 303
5254 303 136 -72 -187 48 175 -95 138 -71 289 -322 457 4 -460 -132 67 -74 126 -342 -229 106
5274 106 -221 -2 -188 25 301 279 -16 8 -170 279 126 -91 -188 -9 -193 340 201 70 80 -320 -225 3
5296 3 77 -177 199 -141 -127 221 -275 205 111 427 99 397 98 -392 52 110 208 -129 -482 -55 178 -59
5318 -59 -513 142 27 -235 -276 1 -61 150 199 -24 513 18 323 37 -275 266 -267 240 -208 -318 -285 305
5340 305 -459 -289 -38 114 195 77 -243 -25 113 362 17 -268 277 68 202 -127 54 49 260 128 87
5361 87 -17 -162 367 -163 -500 216 331 -248 -226 80 137 401 105 -94 -134 -129 -153 477 -79 -139 135 427 176
5384 176 -451 92 79 79 119 -49 207 -115 -112 60 244 -59 21 90 -182 -36 -122 -321 -209 213 30 -175 101
5407 101 34 -543 343 -442 80 -98 -111 -56 -441 46 -254 -11 155 181 380 174 38 104 60 -265 -195 -20
5429 -20 -212 139 -57 41 -185 41 -262 1 2 624 -88 23 450 15 -462 368 286 0 354 62 411 54
5451 54 87 134 -88 -438 35 -260 36 -195 -129 177 -167 298 175 400 -89 -432 135 -524 59 -204 -283 246
5473 246 153 345 -68 497 142 -170 127 -66 79 47 262 10 228 -234 -258 443 -406 74 258 34 -127
5494 -127 -247 -20 10 110 -422 337 152 26 -11 -427 -493 -494 -308 392 78 211 145 -13 -144 -179 198 -1
5516 -1 -155 364 373 -218 -92 271 -25 -127 506 232 -42 62 -153 -308 29 -395 -141 -261 664 -13 180
5537 180 44 -184 -111 -134 524 8 207 250 114 68 -44 302 156 53 192 159 766 125 139 86 -75 17 -502
5560 -502 -140 118 -83 -12 204 -399 36 -255 -161 60 278 -281 -136 -164 329 -194 283 -93 196 -700 676
5581 676 -170 -308 167 992 586 -749 123 -116 -177 -630 -164 -152 336 1183 -694 245 46 764 10 450
5601 450 -185 -552 354 7 108 79 -248 643 136 -461 -343 61 97 -211 -76 -112 413 143 255 211 94
5622 94 4 -18 -67 -8 128 -487 -64 143 69 -341 -379 -73 -370 -121 -15 -115 -235 195 477 67 -69 377
5644 377 -21 245 72 -903 327 -261 194 51 -112 168 23 -310 -352 -125 -60 -234 177 -170 -204 361 59
5665 59 -190 2 -224 -120 -32 -271 191 496 -313 324 -127 -233 -250 -296 109 407 -317 -253 309 -41 51 406
5687 406 -360 421 -349 26 -83 -417 -124 -13 -98 -26 459 99 329 243 354 88 -97 -10 195 292 404 -322
5709 -322 80 146 -5 -449 -121 113 237 -208 137 405 488 -246 -676 -345 594 -110 184 330 332 265 -77 -551
5731 -551 -723 85 248 207 -125 110 -99 -60 5 1 -35 29 64 98 591 -36 107 256 275 -331 186 -403 25
5754 25 360 -719 106 -213 174 27 -319 83 286 336 -139 -98 11 270 -231 -317 -589 -149 -447 -399 331
5775 331 -162 358 312 -149 -149 56 -268 -85 -372 -37 154 191 339 -142 55 -107 -369 322 -77 132 551
5796 551 33 -137 39 -105 94 -277 39 -47 -99 176 197 -113 202 -248 72 -36 -548 234 77 47 25 -279
5818 -279 -107 296 -1 -33 97 15 -379 359 37 -423 263 41 -79 121 291 -154 -192 53 -59 -186 108
5839 108 -313 -152 404 -129 -111 279 272 181 459 2 144 -392 242 321 -172 205 -282 204 73 -178 -164 -456
5861 -456 218 249 -335 170 -26 209 89 49 -105 -202 165 -3 -112 42 -199 -22 -85 584 232 81 59 365
5883 365 -318 274 -72 -54 -398 -195 199 -43 258 -274 -6 -448 -316 262 215 239 31 -212 304 96 271
5904 271 18 -365 116 102 -109 28 443 79 -14 -144 -37 320 151 70 331 -157 -243 194 -445 563 -128
5925 -128 -99 204 -280 170 -57 -200 85 -275 -176 -402 -315 132 -137 190 8 390 206 -327 503 427 -121
5946 -121 108 135 236 267 -941 -11 185 81 -272 397 -88 -43 368 -126 -167 330 7 126 -306 -114 -214
5967 -214 29 164 111 -156 -135 200 53 70 175 -20 135 -11 51 539 4 -414 -56 211 -17 505 88
5988 88 254 153 -194 17 -33 406 -150 -1 -117 -77 159 331 -414 -190 78 -68 -12 281 -211 105 416
6009 416 118 -482 -506 -187 -202 17 -10 406 31 -256 39 -59 -338 138 398 39 -155 -90 -322 -66 -366 64
6031 64 540 -347 49 -133 -356 143 -187 131 22 46 -428 662 -51 -376 -99 95 459 -315 205 115 5
6052 5 322 -63 -93 367 -304 471 37 220 21 -192 336 311 180 192 -152 121 -125 -467 -96 -246 11 277
6074 277 424 -92 -312 137 257 -417 -124 331 -86 -119 397 -285 180 100 -93 58 127 -57 -63 -231 -37 13
6096 13 150 -85 -86 -60 -391 501 40 234 476 639 34 432 208 503 -123 -116 -59 234 35 -414 54 -350
6118 -350 267 -607 213 185 277 -5 -293 587 -92 182 7 161 264 -401 19 257 -163 356 90 52 -155
6139 -155 73 -49 242 157 -201 -264 -828 -51 242 53 -154 -362 -81 -427 345 76 132 -892 -648 -121 -148
6160 -148 -180 43 101 -156 -918 423 -427 143 375 -113 -404 -17 417 109 -371 477 487 -501 -5 265 279
6181 279 -133 315 -54 -523 89 -259 -133 396 4 -374 -392 -190 -309 169 -353 71 97 -347 26 -487 9
6202 9 17 -356 238 -466 -292 -420 -120 191 -454 129 513 -53 -100 543 382 -268 -262 -275 270 -54 335 180 -85
6225 -85 297 -42 16 293 57 -285 -163 31 -321 -423 -252 -226 40 48 -262 120 -66 -196 24 -284 202 -84
6247 -84 -129 -47 -217 -131 -79 -17 100 15 383 19 -219 -411 198 43 76 82 286 -49 152 530 22 -36 753 260
6271 260 -26 -59 132 279 80 127 271 -154 135 -246 -62 -40 -307 -13 366 -139 -382 242 309 -21 -220
6292 -220 -173 -351 -497 175 -204 -52 201 -62 72 482 270 -320 -486 -246 370 96 27 -168 648 -480
6312 -480 128 -887 271 36 -231 -427 -573 183 -210 223 -84 40 -26 -179 -40 -131 -237 23 464 512
6332 512 -131 -130 226 -309 49 100 182 -250 116 -84 -297 261 -67 132 -71 122 -305 68 141 212 67 70 407
6355 407 39 21 -174 352 107 271 -70 287 162 45 286 -88 -461 -43 -255 -333 -77 -99 100 -111 25
6376 25 53 -329 119 73 213 170 112 291 147 114 -22 128 669 157 364 69 7 437 -225 115 -402 320
6398 320 -407 218 -16 -23 -208 385 -318 -607 215 259 -154 92 176 -282 516 -184 114 -174 -150 -160 269 -123
6420 -123 776 33 -114 -379 56 254 203 109 200 150 175 -34 164 -68 -162 365 266 -30 -45 -363 -215 493 265
6443 265 -46 -359 -539 -198 -5 120 171 266 -170 -169 -173 -16 -85 -397 249 -422 -96 174 -17 190 -351 17
6465 17 -89 296 -56 -84 176 -61 -196 -85 136 39 -26 420 19 -351 -47 -248 -337 -145 510 79 31 -107
6487 -107 42 31 100 -406 -477 -183 -23 -201 63 4 9 287 -207 16 -72 231 82 -147 51 -227 -115 -252
6509 -252 -72 -160 -260 -407 -278 -241 325 296 -57 -18 -270 -16 67 -634 -303 325 405 -326 11 -175 252 296
6531 296 413 51 -17 -163 49 269 40 470 111 -3 -77 343 542 222 36 -210 342 -248 52 333 24
6552 24 395 -47 713 135 70 198 -20 -126 -239 226 77 -105 213 -34 -242 180 128 -256 251 -269 148
6573 148 134 -98 392 44 -332 -286 82 -332 -126 -86 -95 -255 464 49 -1 -338 96 -19 284 236 -224 44
6595 44 -108 -76 236 47 -55 176 54 -96 -65 498 -127 -323 -190 197 -150 188 -86 352 168 -244 -254
6616 -254 -122 383 -11 -272 62 467 171 -91 -131 150 329 -274 264 -628 -224 391 178 91 9 -190 -157
6637 -157 180 -489 366 -193 -310 253 -442 -124 -205 13 361 -446 -38 -127 63 130 232 -52 177 478 427
6658 427 291 11 80 217 254 195 326 -189 -113 127 443 96 181 217 17 28 54 -41 82 -321 -67 -459 -177
6681 -177 -422 -130 -196 426 56 58 -248 338 -180 20 -547 761 368 -401 82 221 270 397 -41 337 196
6702 196 -404 -293 93 -17 141 327 -31 -209 -399 -279 -174 451 563 -20 745 -119 230 -393 177 643
6722 643 192 -448 263 -148 124 600 -355 -175 -204 293 372 969 -106 -23 629 -428 287 383 -173 -533 -730
6743 -730 95 -72 -112 6 -360 -47 397 180 -304 -180 170 46 372 -68 135 38 1119 -208 251 -292
6763 -292 -46 261 593 -91 9 -499 279 -200 -86 259 -143 69 -284 13 266 250 841 -466 -147 287
6783 287 -423 99 210 146 1186 -63 -379 526 144 57 -571 95 119 -235 691 -535 103 -233 -48 929
6803 929 845 11 -57 450 -148 445 889 75 294 271 -227 407 -131 -89 -273 30 -548 100 -54 -414 -273
6824 -273 326 438 48 143 3 -32 193 39 -130 326 229 192 -460 -69 -98 -82 -233 641 168 -38 469 -410
6846 -410 162 283 698 -205 304 374 188 328 853 243 -217 278 26 -297 381 167 155 -612 484 -20
6866 -20 -550 -277 672 289 -68 -194 -135 105 237 -85 234 -142 -70 170 -234 105 -97 85 -631 103 -585
6887 -585 -137 27 -72 206 -110 -267 9 -206 76 306 192 112 65 -357 48 230 368 -54 480 -26 152
6908 152 -104 770 242 35 -48 12 194 -311 38 -53 102 318 -90 243 -477 362 57 -630 204 -192 180
6929 180 326 -34 -4 -203 -370 -170 -9 20 307 911 143 180 -3 -181 132 -440 392 -183 93 178 101 -57
6951 -57 -82 56 280 328 189 370 16 33 295 -35 -128 50 -389 -242 -30 -403 258 -653 113 -172 290 245
6973 245 -78 -259 370 210 136 136 333 -75 -106 -71 187 -268 518 -33 151 -381 -271 -62 -62 -93 -114 232 -125
6996 -125 -65 -471 143 -273 -754 -102 91 -545 425 35 195 95 142 -264 240 305 -109 -193 137 467 -284
7017 -284 142 -203 -59 96 42 105 17 -22 -39 361 0 -255 -10 -357 -200 48 230 156 235 29 419 159
7039 159 -28 29 87 259 187 -126 20 410 -28 446 217 24 74 8 189 -12 423 -265 214 721 -114 -481
7061 -481 -314 406 -78 -461 85 -107 -226 176 182 -231 99 -3 -11 -441 67 -418 -13 239 109 -81 -90 -271
7083 -271 223 -225 3 -351 117 -343 -117 -677 -253 660 -8 -293 329 329 -44 -394 160 273 -595 148 300
7104 300 -302 -170 259 446 161 -71 155 182 -122 269 -217 -489 176 349 -66 -279 153 -545 18 491
7124 491 145 -240 -279 463 64 468 372 -260 -3 -147 234 -678 -305 13 -39 -254 -24 344 412 254 -211
7145 -211 580 -273 -97 -263 656 565 66 -273 18 -538 321 -430 -252 136 312 79 -445 191 -200 -427
7165 -427 257 -52 17 207 730 149 590 -203 -285 278 24 392 -688 77 588 -345 26 9 -381 -450 -637
7186 -637 206 -18 -308 115 335 23 -334 -32 325 393 253 130 109 -265 103 93 296 154 214 215 -232 -361
7208 -361 -350 -382 31 280 -191 833 139 59 -162 -108 259 214 -74 -117 -47 -270 48 229 -292 74 227 -370
7230 -370 -41 504 -57 -173 -47 295 88 -119 -128 276 39 -89 302 -252 157 -497 -341 -94 -191 -81 26
7251 26 -32 44 -78 -229 166 -60 -205 -359 -210 115 -143 -88 -53 380 -91 26 297 63 -236 -534 248 128
7273 128 97 -80 38 235 -97 81 -416 -322 -174 -243 258 -255 370 -114 -51 -419 171 225 199 30 133 30
7295 30 -394 292 -105 213 -48 309 197 81 17 -131 22 -101 296 192 538 -381 -479 -261 -614 -290 -8
7316 -8 391 -220 -208 -92 65 -438 -193 -103 -199 -135 -57 298 -167 -74 130 27 191 76 28 -92 307 -158 -53
7339 -53 -201 -200 -63 347 115 381 -628 67 450 195 2 88 405 222 -579 253 495 210 -148 381 -137
7360 -137 166 251 -92 366 -84 -182 242 3 155 337 324 452 141 304 64 -284 306 90 197 -301 96
7381 96 -2 127 256 -303 144 -120 -45 -90 43 37 53 -414 -3 -130 -314 223 164 382 542 159 506 231 -536
7404 -536 300 278 -73 85 -90 174 -286 565 -122 104 58 127 -218 65 -219 -287 216 91 30 -416 203 -33
7426 -33 -242 -72 -301 -496 -154 147 314 113 185 -205 60 158 569 -64 -493 323 -17 229 129 18 315
7447 315 -70 -51 134 308 -134 -171 -39 68 -572 -181 50 -407 235 32 228 427 219 271 -72 -92 -157 -126
7469 -126 117 456 368 19 -205 261 407 239 -24 -120 53 612 -27 -19 33 188 221 72 346 -362 -277 -71
7491 -71 409 -128 -648 404 137 67 417 -286 -138 138 466 -222 -104 -318 272 147 250 -215 -74 186
7511 186 -328 67 -324 474 -211 -113 197 125 -90 -99 -7 -104 111 105 136 199 130 443 -108 -260 -580 -132 299 181
7535 181 84 -438 -319 -236 14 459 -98 397 -289 -74 616 899 122 -435 106 -949 -224 94 -323 -50
7555 -50 267 128 7 29 -87 234 132 -370 -74 -110 7 -228 48 -311 14 -90 224 -94 -63 207 -716
7576 -716 -93 -667 105 -58 -96 299 13 309 -434 320 -546 -5 217 79 167 -31 -373 2 0 105 -267
7597 -267 180 39 212 275 -19 -322 -65 -318 85 -389 -437 190 427 425 -105 -139 -214 72 -158 -111 314 -419
7619 -419 -337 123 311 -8 171 483 -92 -200 -109 -92 118 33 255 -233 -73 22 -514 -8 113 -173 317 -282
7641 -282 -124 -63 -223 102 -35 123 118 177 -156 82 229 19 306 250 673 138 -301 -316 71 193 130 -556
7663 -556 127 -317 461 -368 -440 -5 208 358 -114 242 88 119 -219 393 176 137 18 -19 577 16 -40 93
7685 93 35 74 -95 -145 237 -197 -119 -8 277 336 -13 155 140 -85 28 -410 -161 -112 -213 157 -192 -179 460
7708 460 374 -89 354 -157 310 222 -18 315 150 201 133 4 -272 355 -205 -210 50 104 121 261 347 -384 33
7731 33 124 -245 -259 -5 213 -392 -21 -341 501 549 210 -81 142 312 54 237 -64 -5 77 5 212 -530
7753 -530 88 26 486 -163 -33 -89 -1 78 417 209 313 -397 98 -146 0 -241 161 38 -721 -239 420
7774 420 -45 419 252 -98 57 417 241 -33 78 197 -222 -108 -229 48 474 -341 39 26 -93 133
7794 133 -213 -180 290 10 195 -289 16 -139 -87 274 -200 78 -68 -253 204 443 -166 219 -121 130 339
7815 339 421 712 284 -545 141 205 99 -227 -142 -267 59 37 -78 -2 -74 -292 -100 347 613 148 -373 -352
7837 -352 -204 150 283 302 143 -9 36 -539 -76 34 -489 274 77 -60 308 -276 31 -214 395 412 -310
7858 -310 359 174 -289 411 -210 194 452 161 -68 -477 -52 127 144 69 7 255 -362 -626 38 -121 -174
7879 -174 298 206 -4 239 -180 175 155 257 -343 190 4 30 109 342 -114 -312 -383 192 50 -85 -378 -229
7901 -229 11 113 305 -137 -220 -88 -293 139 88 -186 276 109 -51 -75 402 176 98 -345 415 -165 -440
7922 -440 513 182 -533 -202 -114 55 573 275 341 290 280 -253 -509 -83 66 279 -533 -66 132 -45 347
7943 347 104 -174 -301 39 -283 -269 297 56 -262 448 -446 75 325 158 -291 365 -236 -123 322 99
7963 99 154 42 -238 206 101 -145 25 -188 219 -370 428 355 -198 256 -260 267 141 37 45 -66 533 -285
7985 -285 -120 -124 217 -193 149 338 -133 378 134 149 -406 -300 129 -40 -28 495 -155 365 -356 158 306
8006 306 -347 16 289 211 -453 82 -238 -77 -167 66 -126 247 267 122 -115 18 -162 -160 105 324 93 157
8028 157 -197 -241 -131 31 -196 -218 -112 120 485 92 -315 -692 196 157 251 373 444 -625 -96 -372 -244
8049 -244 52 -35 72 -303 134 -146 192 222 -487 583 237 92 -370 -128 300 -420 -128 726 -71 -578
8069 -578 -65 55 -185 -58 78 -65 355 -297 41 16 199 -8 215 -45 264 -386 141 55 -95 -286 160
8090 160 320 -149 58 10 -27 65 218 -246 14 -28 135 -409 372 243 -190 49 112 -25 21 541 -104 7
8112 7 154 284 405 -221 -113 107 -18 74 389 31 -44 236 2 274 -128 -249 309 158 132 -106 -84 -53
8134 -53 128 -21 343 109 196 106 -305 253 333 112 -85 -28 -242 127 -43 474 622 -243 207 -395 -133 -278
8156 -278 381 -38 43 -12 -15 130 374 190 6 -197 -579 322 33 -403 61 -188 -326 -268 -138 -27 -31 329
8178 329 -483 711 -440 138 31 -7 617 85 -149 163 -162 -460 -286
8191b86
$$ Imaginary data points
##PAGE= N=2
##DATA TABLE= (X++(I..I)), XYDATA
0 0 0 0 0 0 0 0 0 0 0 0 0 0 0 0 0 32 -32 32 -32 32 -32 64 -64 64 -96 96 -128 134 -160 192 -221 248 -280 320
34 320 -353 397 -450 501 -560 624 -697 774 -858 952 -1053 1163 -1284 1414 -1561 1718 -1894
51 -1894 2088 -2299 2539 -2804 3105 -3447 3837 -4295 4833 -5477 6271 -7271 8581 -10379
65 -10379 13012 -17268 25319 -46257 238565 486715 334909 425153 484465 374269 238110
76 238110 314681 267485 122757 81682 178997 69735 854 41114 58534 -51969 -101649
87 -101649 -35039 -100909 -192741 -165446 -119991 -187077 -195395 -90994 -79515 -91636 -48137 53178
99 53178 26148 18559 88667 95087 40467 31286 75355 17146 -20851 -6336 4623 -39364 -52687
112 -52687 6239 -19892 -41644 -28681 -10174 -59123 -82360 -62543 -87436 -113566 -117186 -69495
124 -69495 -84884 -71534 -17551 6713 10664 22397 62561 41167 28882 27980 33754 4379 -4865
137 -4865 29618 18029 24804 39104 66985 56115 53966 68803 54098 31521 11531 18357 -20350
150 -20350 -31350 -31874 -40587 -49869 -57485 -36170 -48312 -45693 -40069 -27784 -36383 -32700 -12736 -19696
164 -19696 -8709 -6882 15293 14367 24755 45738 52657 60517 63218 81342 65808 65284 56018 43038
178 43038 24687 2459 2722 -20344 -24399 -29244 -24580 -31707 -27770 -18848 -26711 -22340 -33129 -25450
192 -25450 -36890 -36986 -30466 -31477 -22975 -18013 1256 2321 16575 19784 27793 26408 22011 30162 16798
207 16798 19944 13628 14382 8661 7199 9507 4127 5270 -4619 3134 -8014 -5773 -6856 -11233 -9638
222 -9638 -15023 -8360 -15217 -10523 -13507 -8734 -10501 -9791 -2249 -8494 -415 -4917 -305 -5660 -6861
237 -6861 -5877 -11071 -9576 -14113 -5931 -10685 -1615 -88 4091 10034 7482 15489 9953 14125 9193
252 9193 11850 6693 6507 7764 2237 7065 -815 3916 -1890 -1891 -924 -5128 -1473 -4385 1261 -2401
268 -2401 4584 3027 4792 5255 1662 6176 -469 3841 -1329 1325 -294 585 3046 2393 7362 1941
284 1941 8116 2976 5228 3761 760 2925 -1536 2146 -1469 1921 -1587 523 -2013 -4288 -1639
299 -1639 -9517 -4551 -10701 -9348 -11504 -9773 -7122 -8462 -2874 -3285 4647 2877 9953 9762 11342 13719
315 13719 9262 11635 4993 5473 -358 -507 -3646 -4854 -2801 -5560 -272 -4141 1132 -1663 -1416 -1734
331 -1734 -5427 -4879 -9818 -7510 -12397 -8004 -8822 -5978 -2398 -2687 2588 620 4341 1369 2112 -626
347 -626 -1132 -842 -3455 1643 -667 5844 5559 10274 12721 12726 15284 11359 11667 5210 4300 -2206 -3719
364 -3719 -6689 -10556 -8361 -11531 -6957 -8590 -5709 -5792 -5237 -5483 -8255 -7158 -12422 -9271 -12264 -7104
380 -7104 -5045 -1454 6196 9556 17278 19897 25466 24223 25691 22285 18835 15256 8379 6982 -443
395 -443 -1371 -5340 -6961 -8130 -10414 -10303 -14188 -13178 -18315 -16317 -19181 -19302 -17785 -17469 -11001 -8810
411 -8810 285 4868 12584 16199 20198 22727 20198 21385 14803 13539 6584 2571 -289 -4112 -3358
426 -3358 -5980 -2679 -4925 -1808 -3933 -3723 -5375 -9352 -9062 -13966 -12472 -15785 -13759 -12375 -9362 -5348
442 -5348 -2853 3454 2234 8475 6475 8710 8359 6959 7661 3777 7553 5436 8808 8235 11475 12405
458 12405 12480 14253 9670 10531 5176 2991 -1833 -5343 -9001 -11972 -11747 -14227 -11375 -12991 -9021 -8628
474 -8628 -8157 -6643 -8758 -7198 -10240 -8913 -10577 -8950 -8642 -5762 -1773 954 6380 7703 12141 11934
490 11934 12649 12318 9911 8672 4298 3553 -137 -214 -2346 -1787 -2848 -3639 -2277 -5204 -4357 -7291 -6585
507 -6585 -7780 -7343 -5893 -4844 -1106 419 6232 7889 11759 14139 15259 17087 15395 16054 11570 11349
523 11349 7188 5492 2460 -165 -3 -3892 -3029 -5355 -3881 -5714 -5561 -5741 -7329 -7314 -9348 -8472 -10477
540 -10477 -9941 -9767 -8879 -6022 -5783 -2120 -2550 -601 -586 722 -168 -699 -257 -1397 987 -122 2875
557 2875 3469 5154 6612 6530 7170 6700 6658 3703 3745 1953 934 -404 -1727 -332 -2367 -673 -1786
574 -1786 -390 -70 -474 40 -1094 671 -1551 405 -1551 -146 -354 -204 1622 1360 2546 2528 4006
591 4006 4117 5082 4451 4502 3990 2405 1440 -815 -423 -1784 -3517 -3076 -3709 -3064 -5090 -3805 -4648 -4537
609 -4537 -5253 -5259 -4250 -4847 -2987 -2817 229 -335 2063 2493 3059 4193 2412 4605 2179 2927 1409 1187
627 1187 -156 -117 692 -878 -176 -1883 -913 -2001 -1549 -1835 -2349 -880 -1497 -399 -1087 -210 -294 -247 -623
646 -623 -1457 -865 -1634 -274 -955 70 451 722 1708 1471 2304 1363 2850 1531 1656 1519 1426 2214 1266
665 1266 2147 641 862 308 293 -570 -531 42 -809 328 -357 -16 -492 -938 -1 -451 370 -433 176 -247
685 -247 78 -79 239 449 -1205 -377 -1682 -1013 -2031 -1240 -1250 -1450 -168 -334 949 574 1652 1019 1326
704 1326 1003 -472 -174 -1239 -1385 -2346 -1898 -1281 -1916 -726 -1634 -268 -1115 -148 -430 -288 -89 -348 701
723 701 88 1895 799 2879 1728 2178 3996 2895 3098 2599 3873 2189 2059 1509 544 -500 -1470
740 -1470 -1162 -1383 944 -330 -811 -1046 -20 -695 -2400 -661 -2139 -1591 -3095 -1819 -1407 -1432 1280
757 1280 174 1677 1786 3354 2418 3397 2368 1135 1747 -12 723 -1179 -81 -599 -870 -1364 -1251
774 -1251 -726 -708 -765 -2728 -1009 -3064 -1956 -1919 -3142 -1980 -1827 -568 -1158 -84 -595 639 1324 229
792 229 424 169 -208 -1064 37 -463 -372 954 756 2426 2189 3002 3583 3698 2794 1631 2196 298 199
811 199 -968 -642 -1080 -645 -443 -790 353 -42 263 428 496 -245 -446 -188 -943 -423 -263 609 1174 1496
831 1496 2046 2580 2506 2105 2687 1037 1074 -277 -508 -532 -1611 -986 -1704 -1996 -2461 -599 -1070 -489 -1810
850 -1810 -2460 -1146 -3108 -2041 -2971 -2108 -1739 -2017 262 -426 1504 1726 2431 2325 2223 1463 1021 1245
868 1245 -177 -960 367 -366 -1107 -422 286 -638 907 13 1182 557 107 -97 -918 -1063 -472 -716 -234
887 -234 343 -97 1029 1120 778 1547 834 691 262 545 -341 249 448 2 734 1117 1922 1422 2247 1890
907 1890 1719 1921 743 599 -234 -666 -1322 -1039 -1558 -2211 -982 -1727 -847 -1834 -548 -1315 -425 -814 -1212
926 -1212 -1187 -1322 -710 -1393 -99 373 334 -409 118 606 169 1112 593 -81 299 103 419 213 861 69
946 69 933 213 -232 -155 357 451 365 280 11 -766 -102 -439 687 -49 701 227 664 353 1208 1010 825 1291
968 1291 1489 1063 21 631 -761 122 362 -739 -747 -155 -84 41 190 54 342 -1004 -42 260 -1567
987 -1567 -877 -712 -489 -235 149 -1258 -528 -781 -1355 -951 -995 -536 -454 -1445 -80 -11 62 290 955 469 387
1008 387 347 835 999 879 886 367 684 234 120 -126 -467 -187 -934 -132 -1320 -158 121 314 -218 -349
1028 -349 -156 -301 -81 314 -23 1367 1063 616 -799 -475 -440 229 759 242 935 29 290 -430 601
1047 601 -83 958 -334 309 -5 -344 -53 112 -281 -534 260 -191 4 -654 -384 -144 -455 109 -8
1066 -8 399 179 -255 229 603 452 87 501 214 61 24 -171 -215 -273 -87 -548 -353 -1243 -871 -1128 -787 -680
1088 -680 -923 -840 -1317 -651 -1222 -938 -749 -811 -637 -745 -200 -993 366 -62 225 810 516 1118 844 1536
1108 1536 884 1215 1696 750 779 737 837 -41 582 398 665 745 105 258 122 143 -750 -289 -634 203 -301
1129 -301 -332 174 -399 434 12 246 145 422 517 -444 143 -478 -421 -71 192 -643 -62 449 258 373 361
1150 361 1742 422 -4 430 -284 112 -337 -631 -566 -497 -803 -568 -101 -809 -301 -742 -194 -36 -497 -327
1170 -327 -525 -356 -236 -511 24 165 -31 1002 670 170 284 -797 -296 -777 -620 -1249 -1159 -699 -808 -192
1190 -192 -389 315 390 418 72 110 504 382 145 238 102 -17 396 686 821 889 1076 786 819 1019 801 827
1212 827 135 -171 209 -125 289 -31 200 -529 -24 -128 -59 -442 -586 -574 -1109 -898 -1006 -168 -321 -299 -61
1233 -61 -95 -58 -161 493 203 322 830 -127 116 -108 73 26 -172 374 225 206 61 403 -8 261 37 117
1255 117 336 -316 321 -452 -273 -639 -352 -481 -475 -466 163 -237 -310 -58 -454 -251 47 -227 -164 -471 243 -75
1277 -75 96 560 -266 366 84 -2 -95 129 -7 4 -206 -447 -320 74 388 0 382 -52 714 366 61
1298 61 330 -208 355 43 153 -372 335 -57 497 272 -430 62 -138 399 269 18 221 -222 225 -780
1318 -780 -280 -50 -377 -186 -402 -187 561 266 -637 -127 76 -246 331 -68 125 -370 254 -89 630 -66
1338 -66 187 -107 123 5 188 16 -158 -294 -403 218 55 -18 198 -195 143 529 932 286 159 218 -173
1359 -173 567 142 -41 -603 0 -33 -30 -638 -402 -210 -246 -660 -581 -467 -297 -329 162 -271 22 -28 571 -67
1381 -67 130 -131 -64 -112 315 135 -436 -57 11 840 -11 555 44 585 617 474 224 247 -34 92 -545 -113
1403 -113 130 -133 -309 -151 -221 -635 25 -199 -50 -459 -663 39 -72 19 -674 -109 -325 288 313 311 506 166
1425 166 178 -72 141 561 481 -99 349 398 147 -94 -444 -129 73 -135 -49 -492 -589 -532 -305 -433 -412 -714
1447 -714 -360 -49 -398 -25 104 308 -88 -19 -55 541 -193 344 490 171 194 -231 18 -49 -215 -288 -637 -86
1469 -86 101 -240 -172 -109 -483 -113 -267 -115 -231 -557 290 130 314 375 103 485 203 121 -127 271 -98 172
1491 172 277 687 38 107 300 -211 125 15 171 32 -142 7 -158 -225 -316 29 -57 -296 253 -189 43
1512 43 -39 543 213 -222 -121 120 -103 237 223 -419 511 -195 109 128 35 -168 -109 -112 10 28 108 -337 -236
1535 -236 -239 -201 -380 -46 -205 -166 -462 163 217 68 -276 -244 615 -212 -328 353 295 255 -72 498 728 -68 -179
1558 -179 -158 513 873 -135 86 292 316 -548 558 -1278 31 -474 -81 203 71 -240 -1093 135 57
1577 57 -268 -508 4 293 87 -265 491 677 160 -493 389 118 -45 -131 -420 -105 -243 -314 209 41 245
1598 245 577 -168 -366 -316 212 -391 170 -468 16 -345 -401 -289 306 -622 302 -211 146 224 155 270 -98
1619 -98 249 520 135 568 559 -13 337 -32 -55 -271 173 -731 -190 149 -277 -577 122 -229 -220 -1116 724 119
1641 119 27 545 -83 301 -56 832 310 900 526 475 180 388 -232 551 290 282 -276 377 163 -331 388
1662 388 606 -36 -85 -191 288 256 332 563 -280 -124 119 -230 -256 -307 -131 -443 160 -39 245 -82 -245 -134
1684 -134 -72 341 -177 -288 -274 -86 5 -247 239 93 500 105 -48 83 416 -126 -9 104 270 -284 -44
1705 -44 89 -11 -140 94 -236 -3 265 513 -251 407 -113 -128 301 -176 33 21 431 20 -95 269 -495
1726 -495 260 -94 -553 443 -1369 340 -151 804 -845 -507 -510 281 11 -260 -553 207 -95 190 -409 -369
1746 -369 293 -332 465 -384 325 81 -91 -111 -607 -166 -50 -366 -1078 451 100 -418 153 -299 355 -553
1766 -553 -346 -39 -772 -462 -461 406 -296 1229 365 -1 -408 -376 207 126 -509 140 29 -75 229 435 100
1787 100 131 51 301 79 22 -321 -30 122 129 103 -80 108 44 30 460 665 329 -409 232 -278 -35 -85 234
1810 234 67 9 11 358 -208 -275 -268 -354 -93 -281 -254 126 18 -124 -189 -328 -450 -101 -3 -71 393 166 -471 11
1834 11 -88 50 -458 306 -262 -177 -65 -88 157 34 -66 146 1 -371 25 -75 53 320 -190 281 -373
1855 -373 -245 -635 -262 336 -103 102 -41 287 401 137 179 -114 83 43 487 75 345 -456 393 76 103
1876 103 45 -231 268 -117 -537 -58 2 52 -16 111 -229 -23 -99 -118 -219 36 128 -138 247 -21 309 231 -242
1899 -242 105 116 -24 74 764 -216 -300 -105 180 -364 -264 -6 -190 -165 226 352 93 56 251 -17 189 170
1921 170 -369 86 106 -40 -142 451 -412 -364 -210 -24 -143 67 49 88 -45 -130 498 255 367 12 412 463
1943 463 149 325 -197 153 293 -703 624 2 242 -56 -89 22 199 248 105 -120 -2 288 181 350
1963 350 -163 -204 75 -15 -22 -265 263 -49 -284 -382 164 -122 51 143 -386 131 159 20 -529 331 121 -179
1985 -179 126 65 364 24 -294 -63 358 -344 132 -267 173 293 -47 -301 -125 -229 -414 24 391 -229
2005 -229 203 -335 -238 -229 172 -60 -176 476 -41 -290 -138 -559 -259 93 50 -689 260 1178 -80 -13 323
2026 323 -28 249 417 -383 44 118 457 -10 606 122 -62 136 -197 320 127 -38 -42 -457 -391 96 -69
2047 -69 -384 8 -136 -152 336 61 345 -144 302 374 343 172 -98 403 240 -122 -60 -236 -175 -102 -6 231 254
2070 254 109 77 -189 -38 -784 -521 75 35 -31 249 440 117 75 -50 290 22 69 246 -66 -15 374 135
2092 135 -61 -137 156 172 -182 -181 389 -64 -79 232 152 -136 214 -8 156 99 -285 192 314 254 24 482 86
2115 86 250 299 -347 101 -394 245 261 48 -93 146 269 -227 -216 -397 -29 77 -37 367 432 34 -202 50
2137 50 -81 -145 0 -321 8 89 134 -270 -278 -503 -49 -193 -291 255 -90 118 -432 90 -95 -39 -183 -66 107
2160 107 -412 131 -151 42 270 -321 132 134 -288 177 128 322 -241 -119 -409 202 -271 -395 -515 -66 119
2181 119 188 328 29 -77 -47 54 581 -285 -151 -27 206 -9 154 104 15 -456 -104 -206 139 -18 -463
2202 -463 100 -142 -23 -703 -616 -331 -181 -54 160 430 -8 120 -52 40 -311 -361 -419 153 -123 -214 92 51
2224 51 226 289 26 -272 -90 -152 -60 -27 92 299 158 -195 426 -140 38 31 -261 197 -452 -135 -44 209 256
2247 256 468 472 -317 -552 -22 -40 -77 -349 159 -46 -391 -120 10 12 164 377 400 258 182 -7 428 2 247
2270 247 -454 123 142 -85 333 339 -414 375 -364 -594 -124 -220 9 -556 -130 -31 -247 -90 243 181 5 -269
2292 -269 127 -313 28 515 134 85 32 -321 114 196 -170 -225 303 68 248 -23 -215 -48 -238 -75 108
2313 108 -88 -86 131 -351 -277 77 168 -310 -180 70 -11 -156 88 -182 -37 278 -330 374 176 237 199 159 597
2336 597 8 355 257 -365 538 31 -169 202 -408 234 80 -101 -122 197 273 -253 10 -503 -226 204 57
2357 57 -438 -285 225 -165 154 104 -149 -183 -458 -96 -29 -56 73 253 -106 -211 -158 -752 -127 -133 54 187 133
2380 133 105 113 280 -16 -166 281 47 -48 526 -300 -47 526 -16 -131 -16 127 35 341 -65 -47 -85 -236
2402 -236 150 -130 -35 -164 483 206 149 41 -223 -76 -8 387 -60 223 366 -736 -216 -375 -342 129 50
2423 50 -28 188 -144 162 -124 -60 113 282 -231 -26 -125 -489 105 128 233 -11 16 347 428 364 -133 -444 -204
2446 -204 -577 264 3 82 -101 -223 -52 -282 -136 88 -310 97 -159 -242 156 174 29 68 -86 -40 302 186
2468 186 -133 -184 443 229 -2 359 -106 -63 465 118 -367 215 318 -183 93 -424 12 403 51 109 215
2489 215 -342 -212 170 220 -60 515 -19 -513 83 285 111 -563 -156 -525 -714 815 58 -675 28 -126
2509 -126 196 -61 135 59 243 -478 28 126 -213 -809 -215 259 -147 -387 -71 -56 -508 136 514 -140 -72
2530 -72 -231 20 311 83 510 -63 353 -147 -45 167 463 266 59 -85 0 -67 -37 482 39 69 189 453
2552 453 13 435 -46 92 -229 -171 -38 -471 184 -559 -9 268 -141 -79 -345 -259 628 277 65 358 -104
2573 -104 103 197 88 271 25 -104 9 186 -28 131 -530 -313 360 -159 -173 324 -14 23 -26 62 102 349
2595 349 294 112 391 6 -113 -99 -104 -323 -403 -41 -233 -250 448 85 -48 -231 282 274 333 392 247 204 -265 -47
2619 -47 231 -396 -156 -80 64 26 419 435 -74 219 -465 21 315 323 -238 28 12 -24 -300 -458 526 132 32
2642 32 223 -331 -10 414 82 -278 22 -251 197 -103 92 204 102 -426 82 -11 229 -258 -5 151 268
2663 268 9 -53 229 -359 -150 -190 -21 -41 360 304 -380 224 -75 -243 -7 -135 -14 -8 464 -55 -83 -319
2685 -319 461 207 63 -328 -311 -297 42 261 483 -56 -135 -448 43 96 -49 -190 -236 507 -282 7 173 733
2707 733 257 518 342 95 -299 43 -76 323 -26 -2 -146 271 -72 352 -644 445 -386 26 130 154
2727 154 433 -79 36 -283 198 -160 99 -7 -137 -170 371 61 -79 560 -76 64 117 -248 -87 -465 369
2748 369 196 177 -27 -398 179 94 71 -289 -209 -246 -227 -18 -125 100 -309 59 -23 266 -309 131 -310 -379 -74
2771 -74 131 -233 -122 -68 14 441 -334 305 -349 -392 243 330 29 262 -163 432 -137 -275 43 176 -214 -303
2793 -303 -278 -187 -93 519 -73 131 590 -33 -108 -12 -250 404 -5 -225 -434 130 33 135 164 108 133 64 140 98
2817 98 -276 -100 54 40 -66 -22 -48 288 -119 -58 -125 435 -455 -46 -148 -145 -205 -295 -16 177 -72 -72 -286 17
2841 17 -101 235 -598 -298 222 215 -137 -219 524 -159 -192 -225 -397 -171 -212 -213 -311 -446 -60 -190 2 69 -135 322
2865 322 -339 -115 102 135 2 87 -304 -165 171 585 20 3 282 11 262 -380 -37 -70 -109 407 -21 -152
2887 -152 -40 100 -207 -191 -506 542 10 146 -445 -265 19 332 322 -205 171 -22 181 400 118 -207
2907 -207 -203 -5 -39 135 73 419 156 89 287 135 431 -294 462 556 305 15 182 -518 83 -267 -539 46
2929 46 308 63 -83 94 -293 -363 -36 -34 191 -373 -16 67 -217 200 274 -194 83 153 -54 -62 -93 63 349
2952 349 -44 580 131 -54 17 -267 50 82 147 -11 256 -457 89 78 -152 343 -443 -54 17 -20 -164 -337
2974 -337 6 6 234 76 -312 113 70 -2 -9 43 156 296 22 -89 155 -300 433 -346 -643 193 -226 -186 32
2997 32 110 162 -229 244 258 -116 168 -277 -88 618 -114 101 518 -10 -124 307 6 13 23 93 -163 5 199
3020 199 -646 -55 -17 6 -299 -146 -22 69 334 -61 125 50 -133 -637 -199 -124 -453 -698 -3 -539 -59 231
3042 231 -112 -463 368 340 -113 -172 -82 -112 -319 -383 437 -11 237 712 -39 -123 -168 250 101 -50 -49 -311 57
3065 57 -181 65 -398 -651 188 31 -516 342 569 370 86 443 -124 -196 126 -58 -338 391 551 712 591
3086 591 -730 268 51 -156 256 59 -164 512 -248 108 25 351 169 -389 -127 -574 99 527 -109 538
3106 538 -476 345 169 -492 -313 -97 605 624 -488 1 192 708 310 -76 416 -7 299 -9 -15 -375
3126 -375 -307 101 -171 -197 -239 62 -287 -124 220 -779 251 24 -212 -3 15 8 138 65 -81 -103 -23 61 187
3149 187 -232 -142 -137 315 -153 129 -224 -94 62 -209 227 -112 -190 -103 232 193 151 -297 553 30 -43 113 59
3172 59 356 -282 141 9 241 149 -217 140 -70 305 -118 -5 20 297 63 -79 -28 -57 -70 -472 218 -92
3194 -92 -78 445 78 101 416 126 -74 -87 443 -654 116 -50 68 -189 -745 -575 -580 -284 -41 -238 53 155
3216 155 340 -801 -195 -632 192 -203 -202 -100 -264 490 -519 261 138 -335 -256 412 264 685 313 -212
3236 -212 -212 -287 -251 360 114 89 -403 -22 85 407 -605 65 75 -17 -215 52 -90 -382 1 -119 -12 -638
3258 -638 -205 -623 -343 586 143 -290 502 -266 -58 165 0 592 228 188 20 -316 81 -77 198 -444
3278 -444 -212 -438 -61 -135 -70 -462 -158 34 -123 375 171 -218 271 314 -74 -153 19 105 212 -298 -148 185
3300 185 -476 -317 176 -181 218 174 -322 -207 -140 391 -313 -257 -393 -505 495 -296 -95 -110 -521 -111 -381
3321 -381 -509 471 -185 -535 135 256 86 229 -48 26 172 -83 -98 298 -830 760 60 -177 -518 -88
3341 -88 -189 -109 344 -305 -195 480 554 -353 407 -107 -294 -193 -122 137 287 -247 81 -45 -128 -3 -72 -19
3363 -19 -535 -71 -236 -364 272 -141 53 -210 -733 236 -393 -161 -353 61 177 -52 202 -191 -254 81 211
3384 211 -130 -328 -352 45 490 448 113 -177 21 173 -82 337 92 -59 -142 -244 395 -42 82 -81 657
3405 657 477 -280 374 189 220 -486 156 60 383 -28 171 -381 -236 333 -183 3 -235 -111 -280 -45 100
3426 100 -5 -336 -441 254 240 270 -94 -303 212 -63 -198 -6 -172 -88 -29 -114 227 -230 -174 -54 -92 701
3448 701 -200 264 212 101 -229 -230 -210 33 -314 -141 -341 153 73 -171 -92 -34 -156 -653 177 45 -103 -242
3470 -242 24 -520 266 348 538 80 -138 -415 -205 -248 -22 25 -417 361 -86 108 15 -489 -351 -314 -4 187
3492 187 -204 149 -247 156 -252 59 16 -174 34 424 -117 -200 52 -82 432 19 248 -387 -158 132 71
3513 71 -357 71 568 -38 -13 246 -210 -58 114 453 202 -554 206 202 276 -298 286 -115 -323 65 300 -180
3535 -180 69 446 -167 -223 -56 -42 330 80 109 -105 -15 331 198 145 -7 -292 -267 198 -18 -284 -75 341
3557 341 -42 152 163 -72 405 -22 -181 147 -13 -91 -97 153 -286 47 37 141 349 -412 358 -53 -139 51
3579 51 101 78 98 -501 32 -42 -81 16 -1 174 -158 -439 -123 -39 -11 -7 -328 68 -39 -300 887 -28 316 -349
3603 -349 -540 -315 149 99 -586 54 -37 -146 302 497 -473 -69 72 -327 7 75 -514 -441 12 -265 461
3624 461 -456 136 -105 -1150 -409 -277 -382 -519 -312 566 582 319 -319 -64 -67 -106 -559 439 439 -220 300 -264
3646 -264 261 268 -419 -507 -77 767 -374 420 413 -34 519 232 17 -12 149 1 12 -145 149 -162 492 -169
3668 -169 -504 -193 -689 -185 -212 -249 -17 475 24 166 71 -465 100 -204 162 -87 -176 229 37 62 110 303
3690 303 154 -288 131 111 566 -35 12 -60 368 365 285 469 -141 339 -140 227 169 -23 -70 -165 -111 207 -442
3713 -442 -312 469 174 -182 359 605 106 -403 167 -286 -523 54 198 -261 42 -369 -617 -126 -214 95
3733 95 -191 122 -27 191 -378 -558 606 -360 48 -125 -1288 -307 -135 -174 424 912 211 -780 723 276
3753 276 115 328 148 -619 -193 252 -152 -54 -414 -1048 -110 -70 707 -777 -243 256 246 -464 526 461 204
3774 204 156 -33 -2 476 -75 -432 -50 -183 145 329 -59 236 628 -210 -427 506 -107 -256 244 59 -224
3795 -224 -268 -407 256 -128 158 -193 281 213 24 -326 -216 60 -156 -333 -180 576 162 169 -33 12 -227 -32
3817 -32 -54 77 -98 -198 -277 435 -101 -117 286 368 -346 -134 -162 126 174 160 59 152 34 165 -542 98 376
3840 376 -346 445 155 -417 14 -210 -288 214 215 -409 498 369 -462 153 203 252 -178 -493 282 -142 128 77
3862 77 -412 -105 -200 -123 -449 37 137 625 -311 131 -24 -49 23 -492 212 -93 296 -63 -268 -375 -59 26
3884 26 -328 -25 -266 61 -271 -70 -3 292 -16 -170 -442 -52 -287 28 297 223 184 -493 128 322 -207
3905 -207 -205 377 -75 -248 -183 316 -189 17 63 44 512 65 65 -455 32 182 107 -61 150 -199 -156 99 230
3928 230 -141 -251 -35 -118 146 -208 -122 -110 702 -74 -146 178 -140 -318 -541 -59 21 135 -22 1 111 373
3950 373 -475 89 -222 339 -68 -255 -10 -324 -335 -68 -507 75 0 154 37 -152 -11 -84 -126 -130 -664 -432
3972 -432 -312 265 524 135 -177 -532 260 -127 175 -211 -108 -150 226 -41 260 182 -206 -153 523 -206 103
3993 103 -123 -53 426 265 -189 376 40 66 179 -224 408 332 276 -59 -128 207 329 106 -74 -96 3 250
4015 250 638 211 -49 -386 -320 337 451 62 10 273 208 171 268 321 12 152 -96 97 80 39 526 -111 187
4038 187 -242 -105 -118 65 461 256 19 320 299 427 36 -13 150 -71 143 128 269 230 22 -75 -222 204
4060 204 -492 -263 304 -428 258 127 239 35 -127 -787 -225 87 -179 -11 -86 -202 -76 322 159 310
4080 310 -332 -487 -6 -108 2 416 -300 -98 -128 87 -649 37 174 -214 130 46 -123 -302 -142 -130 7
4101 7 168 187 -237 392 -168 -483 -131 -17 -210 466 110 -178 -94 -341 80 -281 151 312 -24 -197 -131 -16
4123 -16 -464 -195 281 66 -328 -134 305 -513 546 -81 -166 170 20 346 -575 -51 -253 -186 431 -9 349
4144 349 -444 -6 -54 254 18 209 400 523 241 45 277 79 10 -278 289 525 -110 -257 -126 -343 4
4165 4 -53 -288 -331 282 416 -276 90 54 -324 99 150 62 56 41 209 -172 15 45 26 -38 320 89 205 113 -79
4190 -79 375 105 -110 638 136 -169 -120 -402 238 -239 -192 384 366 176 -39 -399 -33 295 195 -368 -56
4211 -56 122 -4 167 -434 184 94 -83 154 -207 -250 516 513 -167 -126 205 -191 -33 203 -436 64 -508 -74
4233 -74 17 -119 -184 -121 10 -286 -16 167 170 -119 -73 95 463 73 92 292 146 -72 -97 -136 -279 90 182 -120
4257 -120 116 272 47 -13 40 -126 -271 -334 -157 350 -74 89 -215 41 82 113 -629 84 90 160 -292 -25 35
4280 35 116 10 -266 313 313 -222 -209 25 -515 631 282 -424 -135 26 186 123 -167 370 -74 -15 -424 -377
4302 -377 368 307 611 -67 240 -51 103 43 -155 -530 31 76 159 -118 166 -249 73 -76 -362 -36 137
4323 137 -254 -360 712 491 20 -10 -177 76 -427 286 125 380 -46 -99 449 -362 107 -95 220 -149
4343 -149 72 -175 192 110 -147 -189 181 379 489 -382 180 -70 -32 -358 523 -39 114 -337 -656 -14 12
4364 12 -237 518 42 177 416 292 730 261 318 58 252 -299 391 -384 403 107 -360 -308 -66 64 87
4385 87 -658 -307 402 366 -49 -359 -61 -328 351 125 381 176 106 -373 -24 -505 -32 220 204 -565 183
4406 183 -159 8 37 -426 -191 -536 -225 -61 -347 -9 -241 65 340 -82 -450 -202 254 189 -175 -90 -51
4427 -51 260 -75 -187 66 35 -47 8 -106 13 191 -68 -43 152 -110 42 677 -144 225 -4 314 -117 55
4449 55 441 -568 230 -33 -196 -290 135 -125 -204 54 -2 -259 -145 183 -103 -262 127 -150 615 -498 -316
4470 -316 -77 -10 -154 -821 -267 -209 -13 -103 97 173 116 -459 141 -67 129 -579 -468 477 115 305 -18 -79
4492 -79 37 -263 -153 475 36 -325 -58 -72 181 -126 -303 -53 351 148 -130 314 76 -290 226 345 85
4513 85 316 80 173 -692 166 352 345 39 481 54 -321 -88 -452 49 15 146 -155 -111 -190 140 -134 -85 -196
4536 -196 135 72 94 298 -92 27 -26 -108 -174 107 169 -286 128 63 141 -37 -126 -167 -382 -391 -37 323 -43 56
4560 56 8 -266 129 211 255 -25 -218 -172 172 -152 452 -113 -245 503 509 71 103 -166 -194 -168 16 -180 -399
4583 -399 169 200 -52 -215 519 63 85 218 281 88 -84 -134 92 -448 -115 -314 -143 -154 -162 120 459 89
4605 89 30 -493 -22 -456 326 -82 26 -82 -446 -138 262 234 -556 163 -135 194 258 310 130 -70 356 345
4627 345 -470 -379 419 -57 4 273 -87 243 7 394 -35 350 57 -188 176 -9 -470 -134 417 -100 99
4648 99 16 321 -418 -92 -467 50 -173 161 146 -176 -143 112 -21 -105 -366 126 -103 15 322 107 115 -25
4670 -25 123 -146 -226 190 94 23 204 389 269 -418 -33 627 382 -37 95 96 46 -335 473 71 -496 338
4692 338 -10 49 -283 -158 -159 49 277 24 -6 -103 -74 146 54 -178 -165 -251 -105 239 273 -258 108 141 122 -184
4716 -184 -3 239 -348 228 -466 -374 161 -152 223 640 172 348 396 -75 702 315 33 -490 195 304 -166
4737 -166 -181 -288 98 -33 -770 497 -120 70 -381 129 -204 430 152 -67 -83 -165 77 60 -556 -148 -329
4758 -329 -21 194 45 -31 -180 -128 17 -59 300 -241 -449 246 -258 -384 396 522 76 -38 158 -15 126
4779 126 161 182 188 106 236 -238 43 255 -230 -229 -312 204 48 358 -322 201 24 -314 -260 -56 -350 50 205
4802 205 -293 -331 317 -128 72 -115 255 100 -33 -448 265 -221 371 218 442 -99 -394 -110 555 -122
4822 -122 263 -330 -91 -76 -362 -87 18 332 -35 193 -387 -90 256 -256 -140 -5 264 -178 99 -404
4842 -404 -364 -107 -267 346 76 -266 127 310 324 329 -188 207 560 17 65 -289 323 -86 -294 -59 173 -136
4864 -136 338 -190 -198 -372 -10 112 329 -284 -336 -346 108 -165 -67 -100 133 296 228 318 166 -504 -141 96 85
4887 85 13 -155 -6 -58 197 -106 -58 -160 284 176 74 -20 294 34 -318 261 227 -291 -319 -55 238 46
4909 46 -158 410 260 -236 426 214 389 176 101 153 -355 -460 81 -229 -115 -129 -112 -222 -55 -114 135 -302
4931 -302 656 19 -64 -204 -346 39 -73 -184 -256 -334 640 636 212 502 280 1038 40 627 -1439 355 620
4952 620 -736 66 -286 -51 -147 -93 79 -570 -52 -101 -53 -315 -19 -158 -315 -455 208 -156 169 -134 -100
4973 -100 308 -244 186 -232 -186 544 93 -585 6 -59 104 -44 482 -60 270 615 -581 54 -340 362
4993 362 156 229 24 -334 -363 -176 521 65 68 -106 -15 -104 -305 -26 -63 288 -450 54 166 414 -183 -98 -266
5016 -266 269 331 562 -118 137 -212 356 -270 4 -46 -407 -175 264 207 -226 -433 98 -141 -148 172 70 -25
5038 -25 -76 245 -325 -210 -356 148 346 127 253 -76 -283 -139 83 281 -29 205 38 -554 -317 -156 -829
5059 -829 28 18 -324 256 -50 -189 -77 51 94 -92 14 -114 31 41 11 -167 555 -243 -163 182 74 202
5081 202 -486 177 372 -237 -23 136 -132 -43 390 136 97 319 -348 478 -325 34 156 -99 -339 -340 211
5102 211 -200 -21 480 291 2 30 461 437 392 134 -280 -113 -110 77 -463 16 490 410 202 71 -32 -28 17
5125 17 27 75 48 410 -98 -210 285 299 -85 -463 -51 571 336 -133 -495 603 -214 -225 -193 -40 -230 -213
5147 -213 60 591 316 -94 11 534 -72 373 -279 -316 83 -91 -115 -197 243 189 218 106 71 -53 146 -291
5169 -291 163 -531 264 -321 117 -285 111 -52 344 -73 -12 -15 496 -213 152 14 305 -52 136 426 -272
5190 -272 141 -81 -55 -293 -86 204 -375 567 35 122 -136 -1 246 -315 215 -1 303 -282 -9 207 -201
5211 -201 198 -91 93 -135 -146 -95 26 95 159 -2 305 -160 159 639 -50 -46 -286 131 -247 -47 34 97 -36
5234 -36 -136 -98 500 -141 208 -60 -356 277 268 475 -309 -419 -561 -9 293 -440 -47 283 0 170 -54
5255 -54 -152 -327 -56 -157 -600 -301 250 104 297 284 559 325 31 42 349 -241 -166 -411 -268 192 -30 308
5277 308 13 -363 -173 54 379 618 29 294 93 -521 -72 -272 -75 5 -95 -98 -128 -232 -182 -243 -456 -201
5299 -201 156 -161 -201 397 -386 56 -143 -214 -260 -503 346 -365 -325 196 -238 143 205 -102 135 -301 574 317
5321 317 -212 -249 147 76 -33 -41 17 36 -208 -347 -158 109 -146 -106 259 116 39 -437 -181 -15 -10 -58 15 230
5345 230 -289 64 76 -207 121 -163 -20 155 -138 72 302 55 19 133 43 -425 -209 60 493 115 -210
5366 -210 -610 -97 -29 -333 246 -359 184 -111 -74 119 171 24 -178 211 -202 482 235 269 165 -26 -103 -119
5388 -119 306 -197 -417 180 77 6 -276 233 -465 -297 60 -244 225 -415 761 127 357 345 62 -144
5408 -144 -173 -332 78 500 85 -103 -146 -195 170 178 -88 -79 138 40 -219 360 358 80 225 -139 361 -87 -109 -389
5432 -389 -266 376 92 -32 -20 69 162 266 -147 -10 -367 446 -433 19 90 216 -89 -247 -501 194 -313
5453 -313 -291 -153 356 -427 -48 -262 -59 311 -386 -339 188 61 -108 -105 271 250 104 326 520 -289 -101 -206
5475 -206 164 -284 -192 38 67 -309 46 129 401 230 367 -233 -30 342 -260 322 278 130 -130 -22 -191
5496 -191 -282 -19 341 -291 156 -33 189 95 -134 485 10 -273 -19 149 -37 -101 41 -332 -103 -330 -151
5517 -151 321 -220 306 -23 -32 -301 -235 -370 -191 147 -34 47 194 -140 350 290 176 233 495 550 -396 -499
5539 -499 54 193 -48 -70 -199 -294 139 376 -225 -241 259 -67 161 142 -83 319 180 51 -85 296 -338
5560 -338 310 -106 58 -474 -76 132 -303 754 242 -369 -260 384 -225 192 188 301 -59 -445 1234 23
5580 23 182 -49 233 -182 -46 -585 -196 -186 152 -472 -54 -491 -478 -801 -1055 261 271 4 10 325 -548 -14
5602 -14 -557 -568 343 237 -18 88 -578 -278 291 -970 -93 528 -450 -169 -248 134 185 -389 -300 217 88
5623 88 -493 -184 299 185 -332 210 420 -217 92 15 -9 412 -389 380 296 -287 -565 -847 -388 278 61
5644 61 322 -229 89 157 92 -273 271 -6 -230 210 -42 36 240 73 -314 -125 365 300 248 -164 -38 -416
5666 -416 -29 -197 -134 -129 -61 476 345 219 -191 -81 77 405 -189 -60 -10 197 8 -28 459 256 77 -20
5688 -20 522 57 58 294 416 -242 -415 -435 -280 56 -88 215 60 105 -254 272 197 -129 25 -132 -53 -46 -151
5711 -151 2 -464 214 123 140 57 256 254 188 450 -449 -384 -233 73 333 7 542 665 210 76 -476 -62
5733 -62 -399 -161 279 89 493 201 -206 345 52 118 173 1 70 -187 -356 355 128 -308 39 112 -324 78
5755 78 272 -230 82 398 -87 153 -92 116 -225 -666 255 276 209 126 263 -2 30 -68 91 -197 -134 -443
5777 -443 -231 -83 109 -313 -257 196 -519 393 -315 -4 62 120 -532 -706 -1 -6 -38 -251 45 -295 -158 37
5799 37 448 51 -21 25 -28 -27 136 -263 348 179 -182 -103 255 363 -120 282 -503 -460 47 -52 -190 -15 161
5822 161 -190 333 -290 251 178 84 -117 192 215 346 157 132 103 76 -37 -104 215 -113 -105 -260 -31 412 40
5845 40 -183 180 411 634 -92 184 144 489 -323 -358 146 360 293 -224 334 -34 -21 -44 109 401 133 -1
5867 -1 -271 179 51 -348 -44 33 -137 120 -284 -305 -378 101 -83 -422 277 199 -22 -38 -303 -308 396 -604 -325
5890 -325 67 101 -120 364 -321 132 205 -147 -249 -243 -91 112 173 -140 36 213 -201 124 -124 -883 -271 -249
5912 -249 85 385 89 586 -154 342 -185 -170 39 204 -93 -93 413 -111 154 -5 -159 -442 -127 459 591
5933 591 129 72 196 -106 -341 498 -335 326 -271 -66 -266 91 226 -53 -54 124 -370 6 -136 23 318
5954 318 387 392 -201 10 -62 60 389 -208 51 203 151 -43 -112 39 69 178 24 99 -59 22 288 -347 -229
5977 -229 323 -150 -104 -137 -387 151 -221 147 -78 157 328 313 109 191 281 -143 -95 248 35 -22 -204 271
5999 271 62 -171 294 -128 -367 -128 180 -127 -213 -124 83 246 74 -528 532 -152 -83 106 -119 -117 6
6020 6 215 34 -98 175 221 505 174 -197 -231 -45 -220 -39 37 -396 -261 265 433 115 -259 -54 199 83
6042 83 -78 -259 64 -157 225 29 -71 30 -117 327 281 -78 -86 103 -138 138 340 -220 -85 -633 -315
6063 -315 -319 175 -376 270 -120 189 31 -98 595 220 -98 -346 -83 429 234 120 318 51 181 -361 311
6084 311 598 77 -108 142 -314 -93 1 -194 256 -611 10 157 276 -133 -315 236 113 366 410 -200 53
6105 53 -148 46 472 -159 -140 208 416 73 176 -85 5 -87 -92 -180 50 234 293 242 -211 94 -275 518 -107
6128 -107 -712 -211 -54 -217 -373 281 187 -131 -139 -406 186 153 -168 301 350 -105 8 -164 -219 81 -510 -269
6150 -269 537 164 74 -719 -544 -383 -106 -335 194 -400 -124 -372 -88 -281 97 540 -217 250 -404 297
6170 297 117 -344 -559 36 -25 769 428 -108 542 -110 476 341 266 627 -269 -304 193 -531 -573 -45 236
6191 236 -45 285 190 -65 140 219 120 29 157 -16 -420 -530 69 -34 -238 -228 143 -247 215 -106 -270 -282
6213 -282 -365 509 -381 405 -154 -20 161 -182 175 116 -137 -573 -368 515 -57 253 -210 -370 22 234 66
6234 66 99 29 -71 -37 45 200 -197 -128 313 209 524 -313 63 169 100 103 70 374 7 33 80 -158 29 325
6258 325 301 69 66 45 324 -143 -305 -67 -135 -135 -125 -216 141 305 -267 203 334 -108 156 -346 100 28 -80
6281 -80 -59 383 -2 190 95 226 444 52 -74 -186 -372 52 -491 -166 452 -283 -66 2 213 2 -428
6302 -428 -312 583 -277 265 -255 -343 -245 -95 -131 570 -490 -724 133 175 -855 -365 -220 -3 254 416 88
6323 88 165 36 -528 -59 124 187 240 -432 -228 34 -302 81 -390 642 -26 -225 9 214 225 -70 -202
6344 -202 280 -135 -59 92 388 117 -40 207 -1 54 -83 -72 -39 135 467 -459 -204 121 227 156 157 143 -340
6367 -340 235 317 -216 -45 64 -164 83 -65 -318 61 425 -448 305 -75 -249 -125 489 -64 133 109 -106
6388 -106 83 -277 35 30 -93 117 183 150 406 335 522 54 -24 -89 3 218 -94 27 -133 443 454 -366 -163
6411 -163 65 164 86 4 -70 -199 -274 -188 -279 -199 304 129 -111 -48 -222 64 -163 192 93 -138 227 -39 -304
6434 -304 -412 577 308 529 284 370 28 198 133 112 -463 -72 -421 -532 -522 -474 104 565 -225 -338 387 -416
6456 -416 -118 -462 105 159 -133 102 -31 283 -395 -49 -187 -157 -24 151 -28 69 501 -98 -329 -156 331
6477 331 124 363 221 -183 -30 -210 -124 236 -50 224 -321 22 -93 82 -367 -497 -432 30 188 -284 110
6498 110 497 92 366 -70 -441 180 235 551 444 -190 366 -123 125 -18 35 -161 -460 320 235 -378 -38
6519 -38 234 87 360 125 204 128 568 61 238 49 116 165 -63 -29 117 219 215 237 -238 286 41 -335 -148
6542 -148 207 143 -268 255 265 326 -508 -30 288 161 -403 -252 291 65 58 -208 375 13 -293 -138 35 283
6564 283 -221 49 69 333 -17 -301 489 -146 119 182 122 -73 116 149 -471 35 -298 -514 292 -160 287
6585 287 68 243 186 150 205 -239 199 98 -273 -51 -115 -266 236 476 -254 -479 -80 193 -48 220 -110
6606 -110 -16 -19 312 -117 -510 -279 -161 58 -502 417 85 -158 -524 341 -64 55 -90 137 -192 -55 -484
6627 -484 -678 338 321 495 -239 158 -227 88 60 -98 -233 64 270 55 -324 235 8 84 180 -81 214
6648 214 9 69 -45 -514 638 87 -206 341 79 205 166 166 -32 66 334 -382 171 219 -150 54 -49 -592
6670 -592 -285 -76 -649 -212 -78 -102 -274 96 -65 306 -116 384 -126 322 -15 -145 393 251 493 -200
6690 -200 441 -378 -423 -102 373 -88 267 -235 -253 -907 -259 826 375 -473 32 185 656 -243 184 77
6710 77 -514 -305 570 183 -522 -502 -272 -347 323 749 479 -79 -486 99 569 171 557 231 -145 -607 159
6731 159 -223 -829 37 -382 -531 367 226 -12 -183 -493 163 -245 66 -258 21 588 -306 -100 459 -216
6751 -216 -129 -393 349 491 -71 175 -725 205 578 -483 -269 -296 -519 112 1 -549 78 348 -556 -16
6771 -16 -444 -56 148 23 -309 -243 -2 237 266 778 392 -573 -908 190 -370 -863 26 595 253 392 69
6792 69 -21 30 -360 -23 191 -128 159 298 -515 547 359 -717 49 638 90 598 442 1087 -318 -192
6812 -192 578 571 189 -433 -500 15 -320 -281 -204 -230 242 216 255 355 471 332 60 160 406 216 -8 -468 -522
6835 -522 67 133 69 18 -501 206 -419 -119 33 -222 -165 20 262 -599 37 28 -161 -361 97 -603 -16 302
6857 302 -300 -66 190 78 -269 -129 53 208 -213 123 533 -47 -269 -10 81 -174 -417 -211 -417 -252
6877 -252 5 -64 48 15 -10 -132 35 205 -176 -9 -42 586 319 -102 -87 232 -401 279 -154 -76 -350 707
6899 707 -344 164 116 7 -666 -386 -38 216 -85 -482 -248 -264 342 223 -70 -165 34 -635 464 -304
6919 -304 -265 -39 103 111 181 198 95 136 296 127 -284 -482 -162 105 -311 -247 -273 75 -16 -177 118 64 196
6942 196 -155 243 119 -278 43 550 -231 -8 254 -32 267 466 179 -390 -157 -272 238 61 133 -125
6962 -125 119 -373 -691 105 27 36 -354 -272 -381 -148 -227 265 307 143 388 141 -211 -94 318 -68 365 262
6984 262 73 -239 -156 640 -180 -226 252 6 57 172 39 -422 201 158 -405 -399 191 298 -214 -84 -92 153 -45
7007 -45 356 -2 266 -90 -109 189 -283 -294 -188 399 117 80 360 56 50 -265 -182 -90 -321 299 268 -320 -99
7030 -99 -53 192 -282 -138 252 359 -218 -346 -239 -30 192 -110 -107 -55 -84 70 -181 -49 -145 181 77 95 -372
7053 -372 -108 6 -121 649 -257 -546 -209 97 219 110 -492 -322 -283 252 -235 274 -455 -370 459 -44 122
7074 122 412 240 64 341 -196 -315 -155 768 177 99 67 127 -7 -65 415 -109 -371 -380 -69 110 195 -285
7096 -285 -133 -331 472 -63 -26 -147 -344 -370 -318 62 167 348 -467 -245 115 81 -161 44 61 297 388 -131
7118 -131 442 133 -51 -18 -29 256 20 1 -43 -395 -153 287 353 -57 -222 59 68 230 -221 375 262 88
7140 88 -130 513 91 -72 11 160 -149 -191 294 694 379 -12 -552 -108 56 220 -6 -184 70 14 -89
7161 -89 -213 107 233 -485 -178 -13 -665 159 -149 -428 134 -192 -71 -16 911 -452 212 473 -431 486
7181 486 -106 -110 -221 -136 62 -66 54 79 577 78 -188 142 308 593 -214 23 311 329 508 -301 -160 -142
7203 -142 184 -125 -50 -170 -352 127 363 -189 -33 -5 10 -358 360 184 105 275 321 -547 549 475 301 324
7225 324 274 -80 216 43 -178 118 -511 61 -14 -15 -176 153 46 -92 268 -105 -37 -293 -55 -1 -41 -414
7247 -414 -489 171 141 74 290 476 -317 357 -138 184 70 -78 -175 -20 -16 -97 -557 303 -518 -9 -53 -32 -82
7270 -82 -123 -62 127 -87 -135 31 -400 -190 -91 -219 -14 452 104 -12 -288 120 -199 242 33 -157 -84 114
7292 114 115 353 246 -9 -285 -77 -210 385 54 355 -117 45 -164 -143 -54 -56 -471 -221 244 822 6 635
7314 635 536 -53 201 -65 407 -144 -139 -234 287 -464 174 330 -125 88 281 -376 339 113 -133 33 -215
7335 -215 74 65 -89 258 -13 -476 -210 -113 -552 -285 -87 251 -227 -276 -1 384 321 -7 624 53 21 198
7357 198 192 94 -82 -835 82 239 -378 -98 39 -181 -302 64 99 -94 -149 -112 -153 -55 39 358 228 -87 -12
7380 -12 379 -343 645 671 -284 -330 201 -175 216 -116 -81 -25 -86 655 51 83 420 188 -193 92 -133 5
7402 5 -145 -196 -378 356 307 27 -469 176 180 505 223 224 -588 375 -540 122 299 666 115 -130 801 138 -80
7425 -80 68 -77 -212 127 -309 233 225 86 -390 238 -247 129 -101 -257 11 -54 27 -105 495 97 -184 63
7447 63 18 -20 -323 -113 -135 42 -480 395 -260 -225 333 92 165 -359 568 -179 -248 -387 546 111 -116 89
7469 89 123 108 -153 -30 -373 -12 -195 -57 558 -548 -217 129 112 495 -19 116 -4 -70 105 -106 -634
7490 -634 10 -558 -31 -360 -61 -47 183 222 -69 -132 -189 -133 -232 -147 -79 -286 -6 -126 324 105 526 -2 -469
7513 -469 -325 -151 -483 -63 135 -33 248 -415 394 265 -184 243 1 -247 7 -298 287 72 191 191 205
7534 205 161 -14 222 -301 283 -249 404 136 164 -181 -402 118 15 104 78 323 -457 -82 -473 -332 829
7555 829 -133 -588 -206 104 7 141 306 562 -393 209 217 178 -304 614 270 -312 -61 -377 -419 153 -12 -374
7577 -374 173 198 25 35 231 -57 -253 -188 204 -229 -529 360 -455 -3 273 -305 115 352 -362 73 463
7598 463 15 -218 -155 -118 -303 -142 -293 -39 -478 151 258 -150 -54 -227 288 523 -232 101 32 228 130 -344
7620 -344 16 -724 143 287 -318 -240 207 -110 55 -181 279 -81 -90 126 -173 -221 -152 -188 -221 111 309 -488
7642 -488 195 361 171 359 74 -53 91 -15 -276 -199 172 99 -75 168 158 72 -51 244 -83 132 45 -204
7664 -204 -133 672 440 311 -14 -251 -246 140 -176 174 -231 267 210 -108 -261 -186 24 106 -41 -5 433 67
7686 67 464 21 -38 -82 47 -103 338 186 -132 -347 -194 -63 326 476 378 532 22 460 -296 235 -219
7707 -219 -12 168 -274 244 -524 -133 166 -183 -16 -219 75 62 621 201 -125 212 -8 -395 114 -172
7727 -172 272 -101 126 153 -14 154 -131 -22 55 403 -265 -318 -227 -228 -275 58 28 -12 103 -124 -80 110 -431
7750 -431 -198 144 -124 -125 -17 -227 -462 -443 -206 -230 12 101 -244 295 -166 -41 -82 -26 175 439 -528 -30
7772 -30 -182 103 161 58 -104 -385 196 496 -115 -51 305 129 325 -518 4 -367 -487 278 32 242 -573
7793 -573 -84 165 181 182 127 35 107 188 -125 182 -223 -145 224 -105 -112 -178 -266 212 -582 880 -83 -237 163 -162
7817 -162 -373 157 252 -194 166 76 -372 0 -378 217 -284 357 -428 77 -219 -105 388 397 -81 -203 16
7838 16 -33 225 109 97 207 65 320 516 33 162 -140 -307 172 -150 -374 344 174 -89 167 96 209
7859 209 -69 280 -116 -95 -203 -22 416 131 -332 -360 -258 220 -529 -15 -94 -95 -78 434 25 -299 114 -254
7881 -254 -113 -333 464 395 83 -70 351 -141 3 210 45 202 638 137 311 300 -257 -33 82 -86 37
7902 37 316 268 87 250 -44 -198 -243 168 -30 -239 -431 422 363 -135 -58 -179 -370 -44 472 -605 343
7923 343 -65 63 -236 339 38 56 -77 -369 -392 -184 -159 -289 124 -7 -23 -102 -65 305 -125 -246 -33 -71
7945 -71 -32 -152 -36 -45 81 -12 81 30 201 -292 -38 -92 -395 -267 106 356 -266 697 86 454 132 -358 -172
7968 -172 -152 99 -181 27 62 -89 226 -263 136 92 129 -577 -19 727 -168 176 186 61 -175 244 -216 326
7990 326 353 -523 -221 125 -220 4 -5 -151 434 49 -136 582 212 216 250 276 -175 146 374 -361 313 -218
8012 -218 -216 172 76 -247 -95 234 2 148 98 -60 211 25 -300 -134 21 -407 172 1 -160 65 -157
8033 -157 125 -290 74 233 -207 40 280 -514 217 471 -197 -356 -38 -175 -4 66 -110 -18 -97 251 -29
8054 -29 -139 188 224 -349 110 139 -218 179 161 -37 -492 -127 69 -125 260 215 140 186 414 383 -379 431 -255
8077 -255 227 55 -262 173 -617 150 53 250 191 -87 205 -47 172 150 165 80 443 -380 118 324 -89 169
8099 169 -296 267 128 385 587 197 -351 -260 233 279 -109 142 -81 302 77 296 -74 207 250 -352 -340
8120 -340 284 9 -469 -292 73 -77 125 198 -57 -200 -440 -242 -19 -45 345 200 209 52 -47 218 -66 15
8142 15 -86 -435 -185 -450 -61 105 -59 268 57 -98 145 -135 -287 101 135 -142 295 307 212 -62 -479
8163 -479 -482 -823 15 -187 170 520 -22 -263 155 -164 -308 -620 22 -30 -405 -47 -26 -99 361 74 -145 125
8185 125 -141 -664 -236 -53 189 -200
8191b00
##END NTUPLES=NMR FID
##END=
