##TITLE=1H_K-349/2
 CDCl3,40 sc, 
 30.9.2021
##JCAMPDX= 6.0         $$ Bruker NMR JCAMP-DX V2.0
##DATA TYPE= NMR FID
##DATA CLASS= NTUPLES
##ORIGIN= UXNMR, Bruker Analytische Messtechnik GmbH
##OWNER= root
$$ XWIN-NMR		Version 3.5
$$ Thu Sep 30 11:26:34 2021 Russian Standard Time (UT+4h)  she@DPX200
##.OBSERVE FREQUENCY= 200.1313468511
##.OBSERVE NUCLEUS= ^1H
##.DELAY= (6, 6)
##.ACQUISITION MODE= SIMULTANEOUS
##.ACQUISITION SCHEME= undefined
##.AVERAGES= 40
##.DIGITISER RES= 18
##SPECTROMETER/DATA SYSTEM= spect
##.PULSE SEQUENCE= zg30
##.SOLVENT NAME= CDCl3
##.SHIFT REFERENCE= (INTERNAL, CDCl3, 0, 15.7039)
##AUDIT TRAIL= $$ (NUMBER, WHEN, WHO, WHERE, WHAT)
$$ ##TITLE= Audit trail, XWIN-NMR		Version 3.5
$$ ##JCAMPDX= 5.01
$$ ##ORIGIN= Bruker BioSpin GmbH
$$ ##OWNER= she
$$ F:/spectra/data/she/nmr/H-F/1/audita.txt
$$ ##AUDIT TRAIL=  $$ (NUMBER, WHEN, WHO, WHERE, WHAT)
(   1,<2021-09-30 11:24:44.62 +0400>,<she>,<DPX200>,
      <continue with go, POWCHK disabled, PULCHK disabled
       configuration hash MD5:
       00 E9 B6 7A A2 85 ED C7 34 08 36 98 17 FE 4E 26
       data hash MD5: 16K
       2D 4D 26 39 95 E9 17 9F FC EB 96 BC 6F ED 84 5F>)
$$ ##END=
$$ 
$$ hash MD5
$$ 15 AA 4E 62 FB 75 39 0D 06 F8 42 39 43 3A D5 71
##$RELAX= 
##$RELAX= 
##$RELAX= 
##$RELAX= 
##$RELAX= 
##$RELAX= 
$$ Bruker specific parameters
$$ --------------------------
##$DU= <F:/spectra>
##$EXPNO= 1
##$NAME= <H-F>
##$PROCNO= 1
##$TYPE= <nmr>
##$USER= <she>
##$AMP= (0..31)
100 100 100 100 100 100 100 100 100 100 100 100 100 100 100 100 100 100 
100 100 100 100 100 100 100 100 100 100 100 100 100 100 
##$AQSEQ= 0
##$AQ_mod= 1
##$AUNM= <au_zg>
##$AUTOPOS= <>
##$BF1= 200.13
##$BF2= 200.13
##$BF3= 200.13
##$BF4= 200.13
##$BF5= 200.13
##$BF6= 200.13
##$BF7= 200.13
##$BF8= 200.13
##$BYTORDA= 1
##$CFDGTYP= 0
##$CFRGTYP= 5
##$CHEMSTR= <none>
##$CNST= (0..31)
1 1 145 1 1 1 1 1 1 1 1 1 1 1 1 1 1 1 1 1 1 1 1 1 1 1 1 1 1 1 1 1 
##$CPDPRG= <>
##$CPDPRG1= <>
##$CPDPRG2= <>
##$CPDPRG3= <>
##$CPDPRG4= <mlev>
##$CPDPRG5= <mlev>
##$CPDPRG6= <mlev>
##$CPDPRG7= <mlev>
##$CPDPRG8= <mlev>
##$CPDPRGB= <>
##$CPDPRGT= <>
##$D= (0..31)
0 1.2 0 0 0 0 0 0 0 0.06 0 0.03 0 0 0 0 0.0002 0 0 0 0 0 0 0 0 0 0 0 0 
0 0 0 
##$DATE= 1632986513
##$DBL= (0..7)
120 120 120 120 120 120 120 120 
##$DBP= (0..7)
150 150 150 150 150 150 150 150 
##$DBP07= 0
##$DBPNAM0= <>
##$DBPNAM1= <>
##$DBPNAM2= <>
##$DBPNAM3= <>
##$DBPNAM4= <>
##$DBPNAM5= <>
##$DBPNAM6= <>
##$DBPNAM7= <>
##$DBPOAL= (0..7)
0.5 0.5 0.5 0.5 0.5 0.5 0.5 0.5 
##$DBPOFFS= (0..7)
0 0 0 0 0 0 0 0 
##$DE= 6
##$DECBNUC= <off>
##$DECIM= 32
##$DECNUC= <off>
##$DECSTAT= 4
##$DIGMOD= 1
##$DIGTYP= 9
##$DL= (0..7)
0 120 120 120 120 120 120 120 
##$DP= (0..7)
150 150 150 150 150 150 150 150 
##$DP07= 0
##$DPNAME0= <>
##$DPNAME1= <>
##$DPNAME2= <>
##$DPNAME3= <>
##$DPNAME4= <>
##$DPNAME5= <>
##$DPNAME6= <>
##$DPNAME7= <>
##$DPOAL= (0..7)
0.5 0.5 0.5 0.5 0.5 0.5 0.5 0.5 
##$DPOFFS= (0..7)
0 0 0 0 0 0 0 0 
##$DQDMODE= 0
##$DR= 18
##$DS= 0
##$DSLIST= <SSSSSSSSSSSSSSS>
$$ [...]
##$SUBNAM2= <"">
##$SUBNAM3= <"">
##$SUBNAM4= <"">
##$SUBNAM5= <"">
##$SUBNAM6= <"">
##$SUBNAM7= <"">
##$SUBNAM8= <"">
##$SUBNAM9= <"">
##$SW= 18.0517286264689
##$SWIBOX= (0..15)
0 0 2 0 0 0 0 0 0 0 0 0 0 0 0 0 
##$SW_h= 3612.71676300578
##$TD= 16384
##$TD0= 1
##$TE= 0
##$TE2= 300
##$TE3= 300
##$TEG= 300
##$TL= (0..7)
0 120 120 120 120 120 120 120 
##$TP= (0..7)
150 150 150 150 150 150 150 150 
##$TP07= 0
##$TPNAME0= <>
##$TPNAME1= <>
##$TPNAME2= <>
##$TPNAME3= <>
##$TPNAME4= <>
##$TPNAME5= <>
##$TPNAME6= <>
##$TPNAME7= <>
##$TPOAL= (0..7)
0.5 0.5 0.5 0.5 0.5 0.5 0.5 0.5 
##$TPOFFS= (0..7)
0 0 0 0 0 0 0 0 
##$TUNHIN= 0
##$TUNHOUT= 0
##$TUNXOUT= 0
##$USERA1= <user>
##$USERA2= <user>
##$USERA3= <user>
##$USERA4= <user>
##$USERA5= <user>
##$V9= 5
##$VALIST= <valist>
##$VCLIST= <CCCCCCCCCCCCCCC>
##$VD= 0
##$VDLIST= <DDDDDDDDDDDDDDD>
##$VPLIST= <PPPPPPPPPPPPPPP>
##$VTLIST= <TTTTTTTTTTTTTTT>
##$WBST= 1024
##$WBSW= 4
##$XGAIN= (0..3)
0 0 0 0 
##$XL= 0
##$YL= 0
##$YMAX_a= 520401
##$YMIN_a= -234116
##$ZGOPTNS= <>
##$ZL1= 120
##$ZL2= 120
##$ZL3= 120
##$ZL4= 120
##$ABSF1= 10
##$ABSF2= 0
##$ABSG= 5
##$ABSL= 3
##$ALPHA= 0
##$AQORDER= 0
##$ASSFAC= 0
##$ASSFACI= 0
##$ASSFACX= 0
##$ASSWID= 0
##$AUNMP= <proc_1d>
##$AZFE= 0.1
##$AZFW= 0.1
##$BCFW= 1
##$BC_mod= 2
##$BYTORDP= 1
##$COROFFS= 0
##$CY= 11.3945322036743
##$DATMOD= 1
##$DC= 2
##$DFILT= <>
##$DTYPP= 0
##$F1P= 2.36226072786647
##$F2P= -0.459571619588291
##$FCOR= 0.5
##$FTSIZE= 0
##$FT_mod= 4
##$GAMMA= 1
##$GB= 0.15
##$INTBC= 1
##$INTSCL= 1
##$ISEN= 128
##$LB= 0.24
##$LEV0= 0
##$LPBIN= 0
##$MAXI= 10000
##$MC2= 0
##$MEAN= 0
##$ME_mod= 0
##$MI= 1.114404
##$NCOEF= 0
##$NC_proc= 0
##$NLEV= 6
##$NOISF1= 3.799351
##$NOISF2= 2.8
##$NSP= 1
##$NTH_PI= 0
##$NZP= 0
##$OFFSET= 15.70392
##$PC= 1
##$PHC0= -14430.29
##$PHC1= 2.600849
##$PH_mod= 1
##$PKNL= yes
##$PPARMOD= 0
##$PSCAL= 0
##$PSIGN= 0
##$REVERSE= no
##$SF= 200.130013532006
##$SI= 16384
##$SIGF1= 3
##$SIGF2= 2
##$SINO= 400
##$SIOLD= 16384
##$SREGLST= <1H.CDCl3>
##$SSB= 0
##$STSI= 0
##$STSR= 0
##$SW_p= 3612.71676300578
##$SYMM= 0
##$S_DEV= 0
##$TDeff= 0
##$TDoff= 0
##$TI= <>
##$TILT= no
##$TM1= 0
##$TM2= 0
##$TOPLEV= 0
##$USERP1= <user>
##$USERP2= <user>
##$USERP3= <user>
##$USERP4= <user>
##$USERP5= <user>
##$WDW= 1
##$XDIM= 8192
##$YMAX_p= 0
##$YMIN_p= 0
$$ End of Bruker specific parameters
$$ ---------------------------------
##NTUPLES= NMR FID
##VAR_NAME=  TIME,          FID/REAL,        FID/IMAG
##SYMBOL=    X,             R,               I
##VAR_TYPE=  INDEPENDENT,   DEPENDENT,       DEPENDENT
##VAR_FORM=  AFFN,          ASDF,            ASDF
##VAR_DIM=   8192,          8192,            8192
##UNITS=     SECONDS,       ARBITRARY UNITS, ARBITRARY UNITS
##FACTOR=    0.0002768,     1,               1
##FIRST=     0,             0,               0
##LAST=      2.2672688,     0,               0
##MIN=       0,             -234116,         0
##MAX=       2.2672688,     520401,          0
$$ Real data points
##PAGE= N=1
##DATA TABLE= (X++(R..R)), XYDATA
0 0 0 0 0 0 0 0 0 0 0 0 0 0 0 0 0 40 -40 40 -40 40 -60 80 -80 110 -120 131 -160 196 -202 241 -281 321 -362
33 -362 404 -468 522 -589 660 -737 823 -911 1016 -1127 1250 -1378 1527 -1684 1855 -2046
49 -2046 2252 -2485 2735 -3016 3324 -3678 4069 -4519 5032 -5631 6337 -7182 8227 -9536
63 -9536 11252 -13601 17025 -22540 32869 -59329 302812 520401 380198 469042 269274 168931
75 168931 41532 -65868 -154268 -201978 -234116 -203335 -207094 -157556 -163719 -147969 -92822 -93259
87 -93259 -100212 -45397 -33233 -4135 16736 42193 72037 54706 39451 43505 9264 10376 -653
100 -653 -23977 1838 11013 -1573 13182 13819 11502 -20700 -45200 -23986 -46197 -60553 -22133
113 -22133 -24124 -6765 26396 16191 32567 49886 32956 35584 44727 72685 85132 77754 117349
126 117349 122143 83009 78230 40115 -11792 -44422 -98547 -113286 -103677 -104611 -73433 -46032 -10770
139 -10770 26678 12425 17710 23301 -23073 -44310 -54634 -65842 -53748 -52833 -28377 7688 15382
152 15382 36678 38766 25629 33605 -544 -25809 -10065 -25504 -34778 -21237 -11574 6726 5996
165 5996 15626 40314 32827 40566 52275 44682 64759 59641 35764 45906 31531 5334 -6786
178 -6786 -23037 -21262 -31342 -41546 -14215 -10608 -10895 5052 -4295 -996 -1238 -25515 -20195 -17942
192 -17942 -21436 -12397 -11021 13706 25307 6033 18840 15420 -12105 -18058 -35795 -44670 -40009
205 -40009 -51991 -40625 -22672 -15434 -577 -4578 6003 20022 -1789 3789 20666 12339 22759
218 22759 31392 39261 56374 47019 44048 44437 24076 16369 -5209 -21960 -13478 -31498 -39480 -18053
232 -18053 -14903 -5818 2902 9633 30148 25456 23208 34709 22978 19891 10976 -10406 -5261 -19278
246 -19278 -43554 -40090 -44304 -46293 -43804 -43740 -19647 -15518 -19320 2151 3587 4477 11151 -2955 4050
261 4050 7927 -6175 1436 5401 8525 12656 4230 20217 27182 10338 19098 19744 11981 16853 4558
276 4558 4529 10205 -3591 -2767 -1511 -2384 5663 -5903 -161 16556 3654 7562 17542 12069 16264
291 16264 7991 4550 12047 -1882 -6823 -9413 -17841 -11984 -23555 -32042 -16170 -25449 -31737 -20928
305 -20928 -20566 -14363 -16381 -17855 -2432 -6051 -5602 4748 868 11608 14102 4316 20903 20437 9778
320 9778 12680 8076 9294 5188 -6325 5818 5441 -1078 11889 10975 16533 22432 8965 13321 15265
335 15265 3152 2302 -1912 1293 5463 -5125 5646 12315 -334 1134 -5777 -14747 -14224 -28670
349 -28670 -29790 -22569 -26459 -17574 -12707 -3733 10703 2070 3930 13992 1376 -2092 -4069 -11076
363 -11076 -6460 -12922 -12342 -46 -3148 2244 4841 4638 18803 13516 7769 21126 15726 10293 10217
378 10217 4555 6770 -1555 -10393 -2119 -5489 -2723 4126 279 13030 15179 3615 11580 8509
392 8509 -381 -2225 -7982 -612 1056 -4699 9447 12147 8414 11736 -241 -4800 -9449 -29284
406 -29284 -31828 -30223 -32090 -24791 -21480 -6318 6316 -327 8096 11665 1181 -200 -8668 -11063
420 -11063 -2739 -7196 -526 13677 19530 29244 28312 31445 38212 22234 14261 13077 -947 -5449
434 -5449 -13570 -20175 -15060 -22317 -23994 -16657 -17048 -8500 -7127 -5245 11511 11127 9399 18946 16018
449 16018 14420 11238 4436 10890 5706 789 6606 4085 6530 4825 -7458 -3439 -9739 -24733
463 -24733 -23907 -26460 -26266 -22282 -22953 -7997 -1532 -5101 2758 -751 -3991 -4073 -15024 -10271 -1328 -2685
479 -2685 10952 25010 38309 49625 46986 51039 49146 28625 17013 2352 -15137 -23299 -38053
492 -38053 -41287 -34567 -37140 -30928 -22577 -15909 -2955 -3383 3311 18327 14343 17334 23413 19651 22604
507 22604 16230 8630 11228 1070 -5323 -7366 -13552 -10065 -16034 -22366 -12963 -17032 -20622 -14944 -14833
522 -14833 -6945 -3977 -3028 10808 12963 13370 16445 10005 11584 6315 -7379 -3988 -4051 -8261 -409
537 -409 4395 14037 21242 17710 25657 23609 13661 9575 -2212 -8127 -9391 -20423 -16535 -9792 -10840
552 -10840 -4922 -2908 1600 5569 -4016 -2089 -309 -8611 -6164 -7060 -6478 1310 -2716 -1370 6330
567 6330 2676 3200 -295 -2165 1905 -7163 -8651 -1429 -6705 -5482 -3356 -3708 4970 3287 2522 10718
583 10718 9786 10839 9936 5557 10514 4538 -4713 26 -3364 -5126 -3179 -3748 3512 4514 1052 8108
599 8108 5043 1984 1019 -7350 -4442 -3351 -11072 -4716 -802 1673 6250 4994 9879 10109 974 1057
615 1057 -2350 -8784 -8820 -15965 -13392 -8196 -12633 -7998 -2392 -1819 1749 -690 1951 7465 946 2795
631 2795 6434 4530 8131 5257 4911 9046 2962 1033 2008 -1141 209 -4267 -5604 1765 -3567 -3534
647 -3534 2158 784 4426 4435 2433 9371 7079 3232 4228 681 577 -4163 -9918 -4375 -7867 -11833
663 -11833 -7453 -6997 -2602 -661 -2633 4710 5304 1277 3812 1559 1836 1383 -5276 -362 808 -4732
679 -4732 -1977 -1047 126 1532 -2967 1366 2449 -2448 726 -127 795 3321 -1973 -442 4730 -1244
695 -1244 -46 334 664 2967 -1631 1617 7117 2137 3814 4585 3566 7003 2463 1227 5206 -208
711 -208 -1496 -2578 -4717 -1516 -7838 -9511 -4018 -7989 -8709 -5587 -7465 -2690 -4095 -4490 2206 2389
727 2389 2324 3888 2410 7166 5100 -177 4562 1601 -2101 -696 -3566 -485 -355 -4077 2229 2897
743 2897 2611 4789 1959 5032 5151 -2089 1725 2441 -2139 -1130 -3137 838 2665 -2100 1705 3558
759 3558 841 2397 -1765 -703 2021 -5060 -4240 -681 -3623 -1540 -3018 -962 3190 -1553 -1210 2506
775 2506 -1037 -165 -1098 -2514 1658 -1797 -3296 506 -1526 -490 -1471 -2203 2395 -1510 -3153 44
791 44 -2561 -2303 -2852 -4881 1933 1076 -129 5812 6721 9103 8964 5885 10250 7410 743 3113 138
808 138 -1509 -1548 -4966 -302 -173 -4277 -1610 -3081 -4271 -4451 -10737 -8477 -7041 -11094 -6970 -3397
824 -3397 -528 4051 4252 9381 12908 8814 10093 7645 3679 3885 -3071 -3795 -1502 -6892 -6514 -3804
840 -3804 -4021 -708 -2842 -1380 3612 -897 -614 628 -1634 154 -3270 -4518 986 -1706 -524 2771
856 2771 3370 6922 5820 3736 9230 5770 2430 4360 733 1587 -702 -3608 525 -636 -3000 -1563
872 -1563 -3569 -2644 -4405 -9120 -6217 -6969 -9200 -5255 -4441 -979 2765 1146 5852 7671 3054 4452
888 4452 955 2088 1371 -3269 348 3131 1055 4533 5451 7013 9317 3777 3543 2343 -3408 -4084
904 -4084 -7891 -9991 -7567 -11696 -8977 -3596 -3688 -185 1908 3726 8809 6226 6315 9172 5529 5005
920 5005 3239 480 2905 -41 -2611 1626 -429 -1010 -1351 -3709 -1331 -4787 -8520 -4989 -6955 -7663
936 -7663 -5073 -5785 -1014 1004 -690 4404 4164 4906 4527 2077 4233 2450 -1624 1630 2179 895
952 895 3011 1664 4118 4936 871 1743 759 -2619 -2785 -6870 -4988 -2589 -5771 -2445 405 584 2631
969 2631 1695 2646 4631 28 467 1538 -1290 -434 -2418 -1260 1149 -1770 -829 1840 -325 930
985 930 -802 -1205 1083 -2953 -3262 -1021 -2597 35 -828 -1189 3375 2152 1843 3727 2006 2815 578
1002 578 -2994 -73 -3403 -5104 -2177 -2527 -152 739 -7 4374 3852 1681 4001 1670 2118 1539 -2102
1019 -2102 943 765 -2082 453 170 551 1560 -1792 889 225 -3808 -2176 -3252 -3540 -1642 -3785
1035 -3785 -1921 893 -1365 756 1031 1768 3273 298 308 2666 -672 -636 -364 -1163 1101 -1402 -724
1052 -724 2104 14 488 1254 571 2331 -281 -609 2554 -364 -1306 871 -1192 1775 853 -1850 2757
1069 2757 79 -1356 19 -1567 -39 -2071 -4164 -686 -978 -1885 186 -577 1941 2359 -392 2867
1085 2867 2099 1086 1503 125 1889 1215 -2538 201 -233 -2474 -1742 -2951 -2148 -1339 -4821 -2335 -1113
1102 -1113 -2621 117 -595 759 3946 663 2816 4817 2177 3481 2263 1847 3895 232 285 983
1118 983 -843 -345 -1612 -1558 672 -2171 -2608 -11 -1044 -1161 -1249 -1073 1393 -1609 -2563 1022 -874
1135 -874 -68 161 -726 2509 1529 -189 2478 1631 1126 985 -758 1529 -441 -3101 -491 -1886 -2124
1152 -2124 -1433 -2575 230 1062 -350 2624 2382 1522 2206 695 2018 1649 -2387 -772 -1753 -2752 -1185
1169 -1185 -3126 -854 787 -1281 919 2186 1566 3722 987 2051 3735 -43 931 1724 -279 533
1185 533 -1725 -1107 1199 -1446 -1750 -1135 -2654 -253 -2779 -3563 -422 -2561 -3247 -1056 -1793 19 -464
1202 -464 -320 2731 1721 993 3471 1454 2976 2823 1284 3273 2582 1508 1762 54 690 -1517 -3625
1219 -3625 -1752 -2945 -4453 -2417 -2834 -1237 -79 -872 2346 2713 1660 2346 1124 1507 1593 -2218 -196
1236 -196 329 -1879 -59 -481 187 2267 53 1762 2536 348 1289 -556 -722 -414 -3932 -3392 -1594
1253 -1594 -3045 -1192 -670 -483 2087 50 245 2637 -264 -54 -357 -809 288 -1919 -1993 760 558
1270 558 -10 1713 1738 4313 2004 2352 3547 2462 1299 1029 -552 1016 -716 -3021 -527 -1629
1286 -1629 -3700 -3169 -4347 -2687 -2493 -4107 -1101 -1021 -1140 1064 1030 3435 4427 2716 4373 3813 2402
1303 2402 2301 803 1318 891 -2186 -13 -446 -1353 -22 -2288 -1485 -466 -3053 -2206 -2109 -3467 -2887
1320 -2887 -3749 -2398 776 -1039 1325 3225 3840 5259 4904 4252 5282 2317 1861 1363 -1074 -1600 -2998
1337 -2998 -3809 -1849 -3174 -3313 -886 -1595 -681 -424 -1914 356 -862 -1700 -200 -716 315 -4 -504
1354 -504 1978 1391 690 2726 2142 2466 1714 169 1273 823 -1132 -318 -856 -1031 -348 -2438 -702 218
1372 218 -1848 -619 16 178 169 -789 1154 2075 185 1274 975 716 1063 -753 -1220 -408 -2291 -1648
1390 -1648 -1517 -1283 -910 -1157 107 2651 1278 1563 1824 1829 2345 691 -8 195 -1307 -1508 -1154 -2061 -1175
1409 -1175 -1355 -872 1179 -433 -378 511 -559 394 -302 -1680 217 -723 -1158 431 144 1492 1730 999
1427 999 2836 2033 1218 2113 626 756 -279 -1608 688 -694 -2176 -1246 -1834 -539 89 -1641 580
1444 580 1142 -455 495 -327 895 1756 -638 575 957 -878 -123 -327 -146 173 -1150 -958 237 -1242
1462 -1242 -369 -224 194 2254 -517 343 2290 387 604 -702 -245 608 -634 -1434 177 -1065 -831
1479 -831 -1390 -937 1057 -1174 -646 1075 -53 3 681 -430 862 1530 -432 1374 1336 1119 1149 530
1497 530 1486 1591 -580 638 -640 -724 -1019 -2030 -191 -944 -2458 -515 -863 -788 -741 -1182 199 976
1515 976 -671 176 967 -103 686 -242 1180 2145 113 790 1803 377 1332 142 538 1518 -1078
1532 -1078 -946 187 -1143 -840 -2109 -1899 -302 -1765 -1672 -154 -670 -138 268 -465 1947 303 264 1121
1550 1121 537 1571 295 -278 1564 101 -662 484 -348 350 324 -1329 752 -497 -441 -32 -662 -269
1568 -269 -451 -1216 463 -52 -1377 513 -301 332 320 -918 277 1029 -322 645 356 797 1165 -340
1586 -340 141 1896 -296 489 688 135 334 -919 -631 220 -1263 -864 -720 -611 739 -962 -320 454
1604 454 -865 -1120 -411 -923 337 -1246 -515 1411 -493 -170 630 498 1234 549 438 1507 789 764
1622 764 818 -175 981 -188 -1018 -6 -359 -224 -251 -1253 -280 -1254 -1689 -279 -1078 -687 -495 -1040 168
1641 168 408 -208 703 1664 426 1636 725 797 1344 -181 108 836 -85 714 -518 -174 1075 -662
1659 -662 -547 473 -916 -1075 -1470 -914 2 -1904 -825 -476 -1428 -766 -151 129 638 -190 -167 731 647
1678 647 1078 581 1351 2174 873 951 1715 1328 891 614 33 1002 -1340 -1773 -1456 -1754 -1618 -1725 -1970 -961
1698 -961 -1305 -1576 -61 38 1024 1077 -139 1823 1218 806 1676 1573 495 780 -370 729 322 -733
1716 -733 -195 -696 -1058 -953 -1935 -660 -484 -1889 -612 -670 -700 111 -520 744 1810 -361 17 565 54
1735 54 375 -226 975 1384 347 279 820 756 1938 985 283 1462 -419 -815 -145 -788 -576 -1178 -1153 -164
1755 -164 -735 -626 66 -1540 -152 -919 -580 267 -579 -345 353 253 714 6 -286 1023 931 490 1192
1774 1192 560 322 448 -812 454 244 -910 -225 -852 -238 9 -1084 11 -243 -328 88 -170 209
1792 209 -25 -538 736 747 -498 -67 253 102 1004 -462 -340 388 -320 -161 -200 -5 819 -826 551
1811 551 1202 -255 73 -111 -25 513 -506 -1048 -112 -803 -1082 -447 -580 498 -264 209 1123 66 254
1830 254 852 -5 1194 -38 -395 200 -518 79 82 134 480 -447 -988 872 162 -287 12 -469 554 670
1850 670 -625 150 -63 86 -301 -917 -174 385 -1308 -146 -53 -470 331 -604 299 848 -419 318 1578
1869 1578 -145 469 411 1371 1016 176 -169 783 -137 -85 -1084 -57 285 34 -168 -306 -1056 -317 -1078 -238
1889 -238 582 -530 -965 -6 -844 293 169 -371 955 593 182 1276 1084 1278 1285 -320 153 201 -468
1908 -468 594 -462 24 -121 -1253 422 -713 -1335 -518 -315 -495 -320 -563 6 243 -413 102 22 357
1927 357 690 113 859 900 143 -92 160 338 252 -450 607 730 -210 337 321 -71 -78 -720 -676 465 -662
1948 -662 -396 -550 -984 -117 -715 -651 607 1 266 363 514 719 1 55 816 361 333 234 -62 66 -39
1969 -39 -87 677 -243 -206 -354 -184 176 -350 -1241 60 295 -736 -396 -694 37 7 -627 554 318 399 449
1990 449 306 -131 635 -273 817 591 -485 146 203 784 309 -624 590 575 -650 491 133 -499 -3
2009 -3 -444 -1042 -447 -582 -930 -455 222 960 -612 -139 925 21 102 92 -87 990 144 95 1174 129
2029 129 606 819 323 444 215 154 708 -544 360 -78 -625 238 -350 -682 -409 -566 -655 -348 -753 -637
2049 -637 -138 -385 -452 14 -165 665 448 1063 977 199 977 934 591 108 -601 -409 603 -1057 -437 172
2069 172 -557 -442 -480 -624 628 -893 -333 195 -351 -552 47 79 726 -237 622 255 879 1086 -574 836
2089 836 917 257 154 421 -363 193 -536 176 821 220 -661 106 30 -253 -554 -393 15 -593 -474 -315 -328
2110 -328 249 -124 -249 -5 311 -200 449 1107 548 326 215 497 872 -159 858 -469 -170 -93 -787
2129 -787 22 -549 -1011 -131 -589 -797 -95 -845 215 284 -344 259 -330 136 497 -807 199 40 -332
2148 -332 -49 -146 421 -47 246 273 845 131 319 232 -46 809 -521 246 452 -502 -528 -191 -1014 -402 -463
2169 -463 -751 -84 -213 -252 415 -443 328 388 -105 570 436 373 121 218 883 384 254 671 296 -130 -243
2190 -243 -560 -53 256 -904 133 -729 -645 -118 59 293 892 -507 494 981 232 277 -213 11 530
2209 530 -157 131 655 51 153 115 429 90 135 90 236 281 90 204 1 652 -13 -315 413 -377 475
2230 475 -435 106 -474 -269 -595 -524 -62 367 161 -380 1118 336 686 613 27 336 605 60 650 -73
2250 -73 -497 -273 -332 -473 -345 -777 432 40 -395 -150 120 -87 -34 -28 47 909 -605 472 432 667 -40
2271 -40 -662 11 -325 -779 -116 -17 -329 324 -294 -255 212 170 345 330 -44 826 -48 418 309 -442 -480 129
2293 129 -151 -19 -184 -347 26 -467 -479 580 393 23 50 -227 425 38 654 472 504 120 516 16 524
2314 524 -379 -463 638 289 499 7 -432 194 -554 -1049 119 -565 -159 -269 -667 -403 -880 -1123 -322 48
2334 48 218 -2 486 891 634 -508 457 428 873 624 -259 33 681 -248 -489 196 78 -236 -681 -160
2354 -160 185 -726 -595 -1039 -63 59 -667 -559 194 349 -289 -149 37 898 339 387 629 364 -589 -296
2374 -296 318 471 -87 26 81 321 106 -24 -273 139 97 78 330 40 95 -405 -130 315 97 -539 104
2395 104 122 -18 412 -23 454 469 -174 863 -84 -86 695 -188 166 276 -378 466 527 -213 -159 -26 224 -111
2417 -111 -381 287 -324 -210 -416 -189 75 -198 -492 -394 458 -164 -192 -257 240 646 114 926 424 -472 147
2438 147 320 317 792 -482 149 -144 -173 218 267 -374 -278 -1170 -771 -238 -338 109 -47 -971 301 -188 -485
2459 -485 256 364 220 510 -52 584 212 -56 599 -2 13 17 -385 60 358 -316 135 -462 -367 -671 -559
2480 -559 -266 -629 -962 -39 8 223 173 158 92 258 -301 -233 -178 -101 443 515 281 55 -105 -408 345 314 374
2503 374 212 -572 232 -168 -79 321 366 43 -394 -219 -70 230 -332 -429 -96 142 -308 -461 232 -191 -405
2524 -405 -97 176 227 560 -153 113 251 -107 726 68 884 260 328 -407 261 -606 -20 -728 -422 -710 -1146
2545 -1146 -266 -152 -587 -476 -668 -244 302 -626 444 658 280 -9 23 460 330 365 595 136 396 344
2565 344 -51 168 135 187 -580 -520 -604 414 -76 -898 181 -414 -229 99 -143 462 -92 12 667 92 -165
2586 -165 389 -40 251 -71 -208 27 -179 278 -311 -119 -176 -54 -257 634 187 -270 449 -471 73 137 -351
2607 -351 4 17 -728 -107 -242 112 -416 256 202 -252 283 -156 242 54 -149 -547 507 479 -296 662 -251
2628 -251 383 135 -25 -657 653 -67 19 -316 -101 -65 -773 512 -286 -670 90 -430 -339 -174 -612 -516 -104
2649 -104 18 584 -438 -153 1117 386 325 697 590 -184 -212 -155 357 103 -228 29 -424 -566 -41 -474
2669 -474 -92 17 -475 -279 77 -210 895 -280 722 -58 366 608 -45 -18 -136 41 -530 -38 -272
2688 -272 -147 208 58 -32 391 521 642 -178 372 78 -272 -360 307 -99 119 -406 -926 -583 -355 -717 -153
2709 -153 198 9 390 -461 -214 -136 239 343 387 507 -102 290 -46 -171 62 280 -5 451 137 484 51
2730 51 -285 20 -303 -351 -195 -155 -306 38 -230 75 194 -182 158 191 -475 300 41 147 -256 -153 460
2751 460 647 214 351 355 -52 466 -693 -68 262 -556 272 -168 -60 -709 -351 -438 172 -399 -361 -421 -378 277
2773 277 -166 -422 -144 46 282 1117 290 243 226 -29 441 -556 488 322 -452 428 11 -217 18 -722
2793 -722 -510 -243 -408 -118 -36 244 484 -89 -52 139 -236 525 -340 -88 31 170 -86 537 -71 749 8
2814 8 -165 599 152 -400 -436 -337 -430 -356 -220 -98 683 -69 -631 113 -99 58 -480 158 -41 -629 349 -317
2836 -317 -191 -302 130 160 -13 449 175 109 -273 594 98 642 215 -340 690 328 -88 128 -1 -313
2856 -313 106 -272 -159 -427 -550 -70 -400 -836 44 0 -484 -104 -24 77 193 -201 687 -79 -147 514 86
2877 86 100 443 339 217 615 45 67 -598 76 -52 -76 304 -103 -683 100 -496 -525 -547 -372 -169 -178 -665 68
2900 68 195 -455 169 152 328 325 97 344 235 171 344 244 200 -36 -592 115 512 335 -69 -63 -450 -269 -307
2923 -307 -76 -589 -555 1 -301 -319 109 -313 416 -264 49 273 -662 -56 702 433 786 -93 -261 74 -261
2944 -261 -389 96 738 134 129 -752 247 -263 -258 -360 -106 40 -447 -262 -1 -680 -504 -223 23 99 53 -292
2966 -292 434 496 153 -206 -275 12 132 -247 -25 720 -709 77 -192 -41 304 -518 -386 472 -818 -513
2986 -513 -194 361 -481 94 -523 -727 336 -249 265 -566 477 97 186 76 565 -4 340 -52 327 120
3006 120 -472 -21 96 -522 425 31 -132 436 -739 161 -52 -253 15 -153 26 -26 -37 135 104 -622 -224
3027 -224 -221 -76 406 -434 415 108 -57 614 -341 -80 521 -128 102 -7 -528 253 -26 327 76 -2 -30
3048 -30 -85 -104 -100 56 -257 -368 -92 -380 13 -222 -160 43 163 81 276 -95 400 114 -270 381 -6 -68 554
3071 554 -773 -44 -345 -316 -124 -259 333 -124 -400 -238 -550 -60 423 -453 542 205 420 496 -9 -85 41
3092 41 13 579 -341 -145 46 325 425 -32 -443 -60 80 -136 222 10 -253 150 -218 79 299 -225 -564
3113 -564 -33 -470 -743 -481 -5 695 -339 -12 128 -529 -180 107 230 716 -959 131 -470 250 354
3132 354 215 313 295 -360 242 292 9 -334 5 -830 73 -597 -186 -435 -865 -370 -395 -403 -115 -60 -52 199 -28
3155 -28 299 912 106 614 480 -542 937 211 330 162 -51 -64 239 276 330 -472 -454 -169 21 -23 34 -889
3177 -889 91 -134 -158 870 7 -187 -483 -381 155 6 297 266 205 244 444 -192 -599 153 -85 318 -284
3198 -284 687 -33 -543 208 448 -197 -354 -249 -569 -96 50 133 -35 -40 115 -133 -593 557 29 -189 507
3219 507 304 792 268 159 439 37 357 -106 370 -514 -156 -133 171 -343 -736 219 40 -422 418 -360
3239 -360 204 473 -126 170 -180 173 414 -516 -359 -58 158 -164 -116 -47 205 29 649 191 -83 537 -75
3260 -75 261 96 -581 -388 514 141 -25 -445 -134 275 152 340 -370 -375 390 -358 -239 813 -311 244
3280 244 -7 -34 396 -31 -91 -74 717 105 151 -88 -264 -47 190 -377 510 -473 -378 19 -209 -58 -1064
3301 -1064 -180 -75 -122 503 267 -218 -22 233 -121 760 517 712 369 644 55 656 553 382 -242 91
3321 91 -293 -379 -276 280 688 346 92 -93 16 -36 64 -623 -200 -71 206 -447 118 -110 81 454 386
3342 386 361 -343 514 619 255 212 -369 54 476 -266 -409 -200 -240 -420 295 -150 -379 -431 -482 524 -829
3363 -829 111 -223 -491 -136 158 -164 -507 37 251 602 -323 -192 127 184 227 53 140 -180 74 142 154 -68
3385 -68 128 183 9 -211 -130 -385 -64 -284 -295 -200 232 16 -446 -597 332 -391 49 515 -310 146 -254 210
3407 210 472 422 -281 43 -209 147 138 659 606 -144 -172 119 457 -62 -201 -71 -75 -161 -537 245 -252 -268 -29
3430 -29 -408 68 108 187 174 68 113 -48 -675 410 -236 10 223 -23 -99 138 -181 -225 -531 210 31 84
3452 84 -469 303 -895 -14 297 -532 146 91 58 108 120 -644 43 -203 -38 -573 -280 300 -7 -226 455
3473 455 -181 217 -71 -359 425 116 -72 252 369 140 435 12 200 -199 -456 192 -340 257 250 321 -190
3494 -190 -304 -323 -91 83 -392 -166 -9 253 532 -218 79 235 -6 308 -335 979 417 -335 467 387
3514 387 -206 -284 -176 -263 387 -554 120 -52 6 13 26 173 -292 -203 72 -467 183 129 49 356 -93 -281 680
3537 680 526 16 -244 154 -40 89 91 660 339 101 298 -89 -220 23 -312 -527 504 -166 118 -436
3557 -436 -455 7 -49 132 102 102 198 121 32 645 110 170 282 81 584 -89 -221 102 341 -155 -63 -79 281 -233
3581 -233 -90 -393 52 75 -201 511 -728 541 -230 -52 122 301 251 403 48 135 -95 817 -194 -180
3601 -180 -449 126 540 -48 640 -138 224 -317 425 -163 -586 -371 -131 -518 -95 -564 -806 -38 645 -232
3621 -232 -368 0 497 147 162 -285 241 -203 -67 -330 27 429 -65 -180 -292 -359 379 -337 217 173 -137
3642 -137 -50 238 -167 -18 -747 -261 -28 121 -480 -206 -30 -399 -105 -181 228 -211 316 -247 595 -10 -272
3663 -272 14 616 4 559 -48 117 866 -592 -404 313 -744 122 9 -569 -534 20 -266 -818 -507 276
3683 276 -358 -143 -45 -142 -51 346 618 227 287 -976 -186 354 -38 122 582 5 513 -648 -70 -89 -481
3704 -481 -433 -84 24 -80 -23 278 -291 -175 -135 -462 -486 -376 -279 171 -547 -106 168 -211 89 399 154 34
3726 34 -246 -468 533 -165 68 -75 -707 -72 260 -229 -204 -488 473 -191 -533 -591 435 -258 -87 239
3746 239 7 375 -521 -321 -378 63 -334 719 91 -132 -190 -274 523 -13 85 213 117 -12 -269 145 -178
3767 -178 434 268 408 -168 -585 570 21 -668 -165 -431 -139 88 -517 57 -23 7 230 -164 10 -403
3787 -403 -110 -201 -179 -61 31 479 356 -120 -299 -314 53 181 402 -192 -603 -429 -600 -205 -173 363 -48 310
3809 310 371 398 -463 119 415 481 106 223 -155 -327 152 474 31 466 563 447 486 -29 410 693 -199 73
3831 73 481 -921 -281 -659 -275 623 364 -67 -195 -194 501 393 -268 392 -442 195 275 -219 -14 257 -215
3852 -215 -11 628 -132 97 -278 43 27 -300 -101 -54 -506 89 -677 -216 -128 21 -378 275 -901 -693 -162
3873 -162 -331 -185 314 -11 169 -521 -154 115 -302 -226 145 -307 -350 189 176 6 -85 8 -144 -28 275 -136
3895 -136 -77 236 -199 -146 -404 -133 231 -158 -247 -120 218 -487 426 474 424 -645 342 440 21 569 64 404
3917 404 63 352 223 407 522 308 -318 -21 -568 3 -175 -94 103 -128 540 -337 234 10 -255 -60
3937 -60 -545 326 454 -89 -257 683 -576 606 205 -337 434 90 139 285 -6 -254 213 135 -235 -60
3957 -60 110 318 279 -240 140 -485 -179 -440 -173 -128 -168 -570 -458 -634 -27 -33 -1 311 -340 -439 407 443 -289
3980 -289 -618 -158 -35 -211 -43 -303 138 263 -479 -220 328 -172 -163 -49 -445 -610 -185 126 160 -104 -757
4001 -757 -249 -89 60 30 -66 -104 409 -105 77 368 257 -53 -13 79 -32 -56 456 257 278 257 -535 95 -208
4024 -208 -301 100 310 -37 229 -20 -411 -488 -444 668 87 -440 756 -279 172 335 458 -8 32 161
4044 161 286 246 111 -119 199 -215 354 -366 1 30 -259 561 -156 -221 -1 44 96 419 -202 300 464 -104
4066 -104 -79 -252 7 188 76 279 184 280 365 -223 338 162 -145 222 91 238 789 394 24 118 -376 61
4088 61 -302 -294 25 -242 -461 302 -96 -359 -124 -364 -152 -71 -151 320 84 -49 -347 -205 139 189 -466 -136
4110 -136 -572 335 567 -159 41 6 -188 70 434 -129 -123 -229 -85 -772 -62 290 230 241 187 -84 -2 164
4132 164 -83 100 -345 27 -615 -324 221 718 -337 -314 -207 920 -88 -155 -440 81 149 -322 -362 -165
4152 -165 216 -284 245 158 69 -641 289 -133 -328 -19 14 818 134 -61 -75 116 -68 951 391 138 32
4173 32 124 362 121 342 265 -51 103 173 -151 77 -171 164 35 -330 -529 301 -138 113 -248 221 -134
4194 -134 -114 557 185 -88 387 -102 315 -18 105 67 217 138 -490 32 -67 -234 -13 50 -406 -332 -918 462
4216 462 -141 -66 -262 406 -480 -343 -472 -63 149 357 213 113 277 78 181 251 340 269 -542 -265 252
4237 252 15 100 -42 -243 -217 168 -704 129 73 153 314 -96 217 -88 -233 376 30 492 -447 322 -79
4258 -79 -243 -12 176 -9 30 -153 94 291 462 -225 -11 -575 368 52 -164 -197 -576 -735 -426 -140 60
4279 60 -430 293 396 -515 78 237 -68 191 -26 285 167 -30 -454 338 -602 -229 -124 139 190 486 623
4300 623 -373 131 79 147 -537 -462 -119 -72 -344 -170 73 -4 515 -189 -34 158 -510 100 -210 -196 176 8
4322 8 -288 37 -359 195 230 220 140 -307 -598 -127 -266 613 234 249 -256 -537 89 -215 86 -101 47 -287
4344 -287 -443 453 -446 349 -386 42 253 171 -160 301 132 -29 -133 333 71 521 61 12 478 36 -185
4365 -185 506 101 -218 -199 -92 -312 -4 -594 -136 169 -625 88 302 90 438 111 163 430 -213 645 285
4386 285 97 140 199 427 -622 -274 338 -125 200 534 -432 -428 -132 -322 211 -97 156 -264 140 -274 651
4407 651 -327 289 -62 -276 -297 69 -366 592 -98 -136 164 369 285 179 589 818 -629 -136 -199 -256 114
4428 114 -264 23 170 84 -152 -120 -212 -275 -501 -433 -194 -501 -419 -12 -364 518 49 -62 -120 110 -749 -139
4450 -139 31 139 171 -153 -38 132 18 76 157 213 -178 61 -420 411 -659 620 14 -206 -80 -262 572
4471 572 139 -627 -5 233 -22 -221 -288 149 123 -231 -469 658 -518 -350 132 -170 280 70 286 -205
4491 -205 352 666 -281 -142 679 -67 -329 52 -57 -104 416 -154 -236 -10 -308 -4 114 -237 -60 -215 340
4512 340 185 -200 -173 -1 331 -286 333 304 416 -272 -53 85 -67 -134 109 -471 -34 -25 288 215 70 96
4534 96 384 -9 -337 121 -313 -235 -642 29 240 319 -504 285 290 446 -342 149 17 413 67 6 -258 -290
4556 -290 -109 221 -429 111 -110 400 -538 23 -125 -367 396 45 -638 -338 282 -582 -204 268 -151 -301
4576 -301 -140 178 180 68 290 183 221 -426 135 73 -58 393 -273 -63 -227 -555 -414 337 -300 -213 -122 302
4598 302 489 -255 79 -103 393 383 727 334 180 -347 -139 162 -789 -121 88 -246 -200 237 -406 528 125
4619 125 -88 -225 -903 -68 -359 -364 -539 -887 197 -208 -41 303 -114 -34 -13 -47 -5 203 287 319 -521 -240
4641 -240 -81 71 231 495 -8 14 -110 -105 266 -582 111 257 -142 214 501 -448 17 -90 -261 -318 -71
4662 -71 -56 44 -412 -176 398 -3 252 -376 -40 -119 -11 547 -188 192 625 -213 335 457 -58 -117 -76 -225
4684 -225 253 76 -183 -195 258 -579 195 -484 -313 -207 -20 -153 25 325 329 -264 112 254 145 282 -12
4705 -12 101 67 -500 -2 -71 113 201 153 592 -551 -330 -448 -164 331 152 -305 274 177 117 483 137 -155
4727 -155 909 576 -61 32 219 -231 284 -163 -519 488 302 258 -647 -272 74 -424 12 272 -56 431
4747 431 -98 -86 445 -100 190 1 -681 -294 -32 156 144 -257 108 630 -224 77 103 -31 226 248 -174
4768 -174 -180 64 288 219 -258 -169 340 -90 142 -315 -272 -156 7 -454 161 59 -225 438 163 -132 -369 351
4790 351 -238 242 43 -71 -81 378 179 23 493 -247 107 725 475 345 678 -247 -423 -161 -45 -560
4810 -560 415 -6 -144 -200 339 -192 140 -234 -190 86 283 -262 183 137 131 224 249 342 399 -169 108 -22 658
4833 658 -65 134 654 -134 -561 -38 -190 -199 353 -14 142 -55 -291 226 126 142 131 -469 -80 -194 -552
4854 -552 -170 143 373 279 -87 391 146 -261 40 -183 21 389 -917 157 50 -46 -146 602 142 365
4874 365 -463 253 -109 -117 76 4 48 -103 -407 -383 -169 -88 -146 323 291 98 -16 165 46 -1 -259 351 346 -76
4898 -76 -192 276 345 -10 36 -322 -174 -345 -682 -475 -34 -459 147 -101 -203 164 -536 185 544 77 94
4919 94 350 270 -338 -17 347 -880 -209 -41 -450 -284 -142 345 31 194 -130 409 -294 16 42 438 107
4940 107 -96 -438 -162 -297 254 255 -211 -112 -130 -206 -387 24 -613 -37 -6 -6 -131 145 148 -60 0 312 104 540
4964 540 118 -211 -463 367 -209 -281 85 -25 358 198 -290 168 208 -525 31 -46 294 -256 280 -10 217
4985 217 424 27 782 142 575 121 -41 67 -72 70 -171 -69 -112 -288 -21 -361 280 100 493 -353
5005 -353 -360 -201 -206 -440 -93 -214 -391 101 -107 204 -257 -177 -73 -2 296 -243 -93 9 -349 -230 -832 400
5027 400 327 60 -306 244 -111 71 533 -384 74 -180 -327 -368 912 -270 -476 -613 -518 -11 -134 461
5047 461 -391 253 382 -173 -188 137 415 185 128 679 -42 381 590 -669 150 -274 -365 -100 89 -194 93
5068 93 68 -619 593 -145 417 178 2 -225 492 103 380 -329 687 134 47 -262 9 112 333 -122
5088 -122 85 -10 305 -152 -306 -335 36 -621 -559 -193 -354 266 10 147 -399 -161 407 -2 -328 -158 162
5109 162 232 -49 -125 -133 -119 -167 12 -488 400 296 62 -84 371 -566 -205 226 -311 152 308 -275 48 -26
5131 -26 183 -435 -685 -737 -39 259 25 199 13 -147 495 718 259 376 362 193 97 -361 -97 126 -183
5152 -183 -29 -44 -44 -169 -26 102 584 -48 67 -940 -227 -2 363 -32 -216 76 -34 -52 155 343 350 -232
5174 -232 -536 337 -298 230 607 -204 15 220 -153 -162 -206 -492 -32 -491 -262 -194 -340 -128 236 -461 6
5195 6 439 -205 13 -268 347 266 -444 56 195 126 54 807 260 236 112 -209 616 -26 -17 -315 -426 -217 -464
5218 -464 239 69 62 5 -198 274 306 223 -462 599 -367 80 288 -421 -167 -150 158 257 -595 271 17 -169
5240 -169 -78 506 -162 90 392 31 -187 -190 -427 -81 221 136 256 -371 -574 70 -253 77 1 -728 -152 96
5262 96 -103 -336 -201 489 -203 356 -143 -184 -149 -20 283 97 -256 133 312 -364 248 171 29 234 -681
5283 -681 -516 -295 431 -55 -303 -412 -53 -89 297 -90 -437 234 -235 -257 454 -347 -510 92 659 -51 206
5304 206 -28 -327 425 437 64 330 -424 46 -734 383 43 568 42 83 -74 397 68 -131 47 50 65
5325 65 -264 -213 375 -467 -56 -191 -396 429 159 104 -624 371 324 -120 78 -460 37 43 191 -171 176 429
5347 429 480 11 -108 200 -236 -324 -10 -143 -283 -168 190 -271 50 -25 -88 -174 -17 299 234 -57 488 -208
5369 -208 200 81 495 16 222 21 -128 -160 -465 -236 34 -213 12 -149 -170 -194 166 553 -137 -119 394
5390 394 -511 395 -33 674 -718 106 272 -228 -361 279 29 -211 473 -20 52 -403 -98 83 73 -219
5410 -219 -192 -118 553 -61 -266 57 -79 -209 -378 -113 -409 287 -146 -59 118 125 154 13 -438 -154 8 424
5432 424 -225 -362 -295 620 900 -677 -44 143 210 -623 -629 77 -324 214 115 -52 43 -131 -132 -116 76 -289 -635
5455 -635 107 170 402 8 231 -50 -85 -531 19 231 197 -246 -113 190 11 -314 -452 -332 -407 -209 38
5476 38 179 -187 -93 -590 698 -470 79 248 -269 -174 -249 58 -114 88 -409 9 179 237 -25 -86 21
5497 21 685 172 415 643 382 267 88 -162 -481 384 -251 7 -595 -25 110 72 65 -596 -266 -161 -54
5518 -54 -15 -128 -129 408 -2 -57 -204 -307 260 332 -51 415 22 577 -222 -631 270 -6 -44 -59 -143 -47 -444
5541 -444 34 -278 502 60 -156 -170 -186 333 205 -323 -177 -235 -260 -345 281 126 -545 -16 82 -72 -344 -195
5563 -195 -600 186 -41 169 -168 -61 -6 137 -96 118 -354 -731 214 -216 100 165 75 -233 9 69 -598
5584 -598 -170 507 -145 -480 258 -386 374 162 625 71 -69 -254 -488 -751 58 54 348 125 -92 -40 38
5605 38 -9 76 376 30 89 496 108 -374 128 -488 441 -145 43 -262 537 -146 159 219 320 -70 -105 -133
5627 -133 -1 9 156 -112 56 377 502 -111 290 299 23 272 237 205 156 -247 -265 -267 167 -312 -910 196 314
5650 314 8 7 -126 45 -222 188 -115 36 244 -190 478 -210 306 -204 -755 -78 171 -49 47 -19 133
5671 133 -433 -116 -532 51 -305 -421 -174 -78 -231 14 261 232 -5 351 -31 340 -484 316 -466 -416 -522
5692 -522 111 61 50 -24 280 225 49 160 -252 -466 262 43 185 -225 -304 -524 189 482 168 93 353 330
5714 330 461 210 -103 70 143 132 -24 523 66 -384 -67 358 -205 -413 -669 -250 -177 -69 115 223 -4
5735 -4 -17 112 -159 -132 317 523 -531 316 -11 -103 67 -250 77 342 -101 118 117 181 5 160 282 111
5757 111 -72 -65 -497 37 14 146 676 -54 307 -66 58 182 128 156 45 -38 597 -395 161 -93 -589 35
5779 35 293 -362 345 -488 -70 756 273 -96 571 550 -23 328 133 -253 -136 -266 -111 381 336 500 -452
5800 -452 -192 -70 -87 110 -278 155 253 -157 -188 140 -256 -218 628 -46 -582 11 187 470 -95 -252 228
5821 228 515 -553 -264 90 -47 -127 -279 49 -36 373 -166 703 -277 -134 321 -441 -131 -33 287 -340 -19
5842 -19 24 128 140 31 -488 -425 25 -143 652 -210 482 -257 40 246 -159 -102 66 440 -221 348 -146 -167
5864 -167 310 69 -55 194 -491 399 103 -156 47 324 -273 595 222 -398 -185 270 -148 -443 400 230
5884 230 -298 -469 312 286 115 -388 128 -231 64 -845 -304 -477 457 -169 -137 -104 -298 333 -199 -356 150
5905 150 373 -215 -185 -213 272 118 21 -459 -104 -200 -474 146 234 -442 496 -176 48 -44 139 216 -604 -34
5927 -34 -48 600 554 -194 -267 223 -180 -122 -107 -223 87 11 94 -220 210 36 218 -152 302 -330 -399 336 149
5950 149 -145 -246 260 57 308 -316 48 -192 179 -208 -312 -55 -356 454 -546 229 -33 16 -380 147
5970 147 -149 79 -343 -689 28 -52 -18 -154 -200 99 -124 -564 -155 24 -316 474 -433 -282 -186 320 -415
5991 -415 -270 61 343 219 -119 -468 -545 544 721 220 890 -79 340 567 382 373 67 -269 -83 -239 -297
6012 -297 341 -490 278 -51 -153 -118 -148 -402 -155 209 39 29 -82 9 400 -812 49 309 358 -137 41
6033 41 177 263 -118 -66 -202 262 -126 124 -273 48 231 -5 -86 -77 -38 -144 113 -293 -264 178 -483 -183 -69
6056 -69 -401 129 537 420 -208 -395 -329 102 -177 -272 -68 74 -37 518 20 351 -202 84 457 168 560
6077 560 575 -88 -45 59 -74 -304 30 -47 56 -50 408 125 94 -22 365 354 439 -61 -70 -666 -193 -142 -112
6100 -112 -441 -172 454 306 485 37 224 -206 263 4 -285 -331 198 242 27 223 39 158 78 -154 -30
6121 -30 24 92 26 107 412 -715 346 81 111 -406 28 426 295 101 450 -8 111 194 110 122 -331 -176
6143 -176 -374 -569 68 285 -97 437 362 -14 341 -616 -26 -432 -296 780 299 -614 -514 -212 211 712
6163 712 -61 230 -102 -372 0 -181 -113 -57 -318 -510 -106 -128 -807 -105 73 -50 230 -48 -336 -349 321
6184 321 231 -274 -278 -127 347 -387 -191 8 -87 56 -85 356 -64 325 -76 -65 165 -239 -185 324 336 -228
6206 -228 -232 -84 -80 -369 -355 -384 -423 151 291 716 7 270 -260 470 530 187 185 212 76 -341 -2 -568 59 -666
6230 -666 103 -41 260 411 39 -737 -420 -531 148 141 -217 -10 352 -405 119 195 90 240 -181 -4 -151
6251 -151 -588 -44 -47 -221 -456 535 -79 90 -285 -567 227 -155 -178 82 415 239 97 334 -17 279 -336
6272 -336 72 263 203 127 -132 297 52 -162 -172 -20 500 263 -187 118 -323 -212 -118 121 -216 292 270 163
6294 163 135 -106 -203 328 343 48 29 324 141 -260 489 262 90 -470 -182 725 387 -119 86 -290 -212 88
6316 88 -300 484 180 66 -269 78 24 -165 -359 -60 245 309 574 385 223 122 45 293 32 5 -19 309
6338 309 248 134 22 -694 86 393 29 -38 -318 151 373 -113 -283 -294 158 -169 367 -38 -205 480 -186
6359 -186 -82 516 -80 -272 -326 -347 -112 -114 284 379 -348 38 -201 245 -641 -242 160 42 39 420 -194 -328
6381 -328 81 -351 152 68 -548 -21 -105 -82 866 270 -726 314 -134 -202 72 -129 -699 49 -411 -6 -598
6402 -598 -37 4 64 407 -78 6 -299 -498 267 109 -110 -14 -220 -226 -94 -330 -146 -179 -63 344 39 300
6424 300 -204 -294 -28 314 -536 -15 -68 -268 -5 182 330 -456 20 78 -322 -247 -154 -233 -279 -253 244 148 232
6447 232 -437 28 -309 83 -170 337 -277 -70 485 -254 -590 458 86 -112 -160 414 -192 -176 515 -432
6467 -432 -367 -130 404 551 192 219 286 -298 -164 536 39 339 -413 -53 381 -184 -118 -90 -293 527 216 -62
6489 -62 287 140 -161 159 105 93 -14 -194 -173 -186 105 -302 25 461 -78 -130 -421 343 112 265 -229 -48
6511 -48 -274 130 -199 -311 -20 93 -97 -331 -415 847 130 69 -863 -204 -27 -620 -190 -440 -273 -18 48
6532 48 -35 -268 391 -558 -192 155 -499 473 87 -239 -270 -48 154 -229 -214 486 -137 -87 -893 14 183 317
6554 317 -228 704 -502 271 -220 339 423 -388 94 -238 -294 -663 465 -163 -186 -35 124 330 76 177
6574 177 278 -575 -248 -145 334 -324 310 67 252 -216 -105 -253 110 336 64 -724 -63 -239 -275 302
6594 302 -877 -69 65 128 -16 150 -258 284 -163 -46 -603 -384 314 28 150 398 -19 -60 -742 -17
6614 -17 124 48 -98 126 120 289 -50 -318 5 -49 -411 205 62 -389 -649 520 319 -79 -356 -142 1036
6635 1036 80 -225 -123 49 290 -366 129 508 340 -379 173 485 497 -230 -112 150 -148 516 -142 -61
6655 -61 324 -499 -500 147 -37 226 244 -369 328 -483 -35 -168 -114 -29 43 358 -175 -213 83 -68 112 -115 111
6678 111 -631 235 -7 -196 82 -143 314 517 305 -376 25 -46 -597 -155 -222 224 273 -55 361 -350 -401
6699 -401 161 477 899 -284 -189 -94 220 77 40 -18 -232 179 139 -401 16 18 -67 265 -687 129 -438 -372 -28
6722 -28 235 5 -344 314 225 361 202 -173 526 135 -11 80 505 171 562 -234 402 138 410 -157 -239
6743 -239 -356 183 -332 -433 -139 -562 462 -225 -424 -154 207 -14 -150 -177 -40 -332 300 -302 74 -604
6763 -604 388 275 -56 -278 -105 481 90 -85 -35 147 664 607 -436 -53 665 594 -12 -89 -152 136 228 -367
6785 -367 446 50 574 184 74 516 -351 111 27 -48 -275 3 -216 -296 332 -743 -197 10 -22 -84 232
6806 232 99 -268 107 -416 -260 -141 226 461 355 -144 205 212 92 -408 285 416 23 153 90 472 -269
6827 -269 406 709 -470 73 -67 266 177 -214 655 122 55 -44 90 -195 -24 199 -190 -91 163 -93 258
6848 258 -385 305 -162 188 -272 -160 55 361 -477 555 -222 -111 186 -486 -52 270 328 71 50 114 434
6869 434 108 -218 185 129 152 -331 339 425 -66 -284 238 107 -63 -185 277 -223 154 349 -32 484 -131
6890 -131 92 111 507 312 -102 -500 31 138 -350 -86 211 -543 -160 372 141 265 164 -138 -12 177
6910 177 508 236 275 -368 -239 -401 349 79 247 -48 -3 450 35 240 -105 142 46 271 168 -407 116
6931 116 360 69 -347 -61 37 607 356 -521 -283 250 24 219 -502 280 -155 244 308 -250 21 -401 -137
6952 -137 501 200 -42 82 116 -36 -155 -451 -286 391 -96 -265 -518 -223 220 65 259 -251 89 -91
6972 -91 110 538 346 -265 170 -78 -54 146 411 -95 339 127 508 -169 -357 -178 -176 229 -62 466 -94
6993 -94 -299 8 321 -382 -3 16 -360 357 182 -178 -95 375 -325 214 305 144 -119 -34 -184 -139 -156 -239 -393
7016 -393 324 31 160 -39 -554 -169 218 8 -305 -239 389 -145 -123 209 555 104 246 89 325 89 -43
7037 -43 74 148 -77 -216 -73 330 4 -52 20 -208 95 -379 373 70 705 -582 385 -117 -813 320 57
7058 57 227 -687 -476 56 495 -30 -13 -352 380 -98 133 -365 44 -201 -119 -298 -513 1 -20 6 142 247
7080 247 -302 181 -215 45 59 -165 92 134 -88 506 102 123 485 -72 -49 -224 -328 126 -292 344 61
7101 61 -100 -68 -7 -89 253 -248 231 398 -460 131 121 12 -434 -293 15 -108 -392 -64 143 -30 269 323
7123 323 -275 298 402 -307 455 -247 -321 392 -44 420 -89 -47 -130 -457 383 516 -332 319 -78 -980 -101
7144 -101 -381 104 45 -67 -62 505 146 -68 49 92 29 -676 407 -336 449 -99 29 -112 423 147 -276
7165 -276 -138 -23 160 -121 -87 105 82 212 728 116 48 -132 -183 646 222 -145 -79 -13 -352 -37 138 -641
7187 -641 -76 -626 55 461 150 141 -175 -343 412 -338 6 -2 -238 319 -342 51 220 28 -388 -216 -354
7208 -354 430 -30 15 6 439 -168 -444 -746 67 438 188 312 -63 138 -332 262 156 -391 334 -285 353
7229 353 173 -55 190 64 386 -251 311 -81 291 -509 71 -499 476 -296 -192 225 -132 -65 80 -295
7249 -295 181 -391 -9 -52 -1 -31 -106 29 465 -121 -182 -261 -301 115 406 -96 -356 -444 273 -116 -490 26 473
7272 473 -286 86 66 3 828 379 173 50 -253 43 57 230 -88 223 346 3 372 -542 9 -334 -107
7293 -107 -28 132 895 -84 234 163 331 36 338 -136 157 -205 -219 -134 -442 12 17 106 165 348 198 95 74
7316 74 -47 61 32 213 427 826 193 -188 -24 15 237 -251 72 -189 432 -151 74 260 124 -230 -43
7337 -43 -33 110 -270 -489 -96 -221 329 0 210 -611 -252 -1 198 -26 -51 64 108 -49 474 -84 -151 -75
7359 -75 -170 263 -535 -33 393 55 290 253 -458 -258 222 275 -219 -285 95 -123 -12 261 -63 265 48 -186
7381 -186 336 -227 -216 520 -280 -138 -340 -17 -132 -23 43 -205 -678 120 318 141 43 31 -498 53 560
7402 560 191 161 -351 -38 376 134 284 -650 -217 -83 217 15 114 865 -299 332 40 -26 -259 -279 -90
7423 -90 -219 335 -426 12 -303 245 -100 -86 -44 -210 118 305 -241 -132 -34 341 109 -585 247 170 163 -673
7445 -673 792 296 -226 551 474 -207 -181 -169 -133 432 -433 -172 -151 199 233 307 -306 -76 -633 75 92 -44
7467 -44 -356 146 193 -572 352 -669 -498 38 79 -141 -10 -623 -77 -20 496 -359 -227 488 191 298 -318
7488 -318 -32 251 -36 -254 -181 -423 -20 1 41 -197 -135 186 -369 -206 340 359 -761 67 -311 27 248
7509 248 -255 160 -331 156 -288 -5 -304 156 152 -132 535 -9 -339 346 -109 -79 152 173 85 0 -511 46
7531 46 -63 -143 358 -88 334 -168 -217 -31 224 -218 -74 187 150 364 -334 -322 439 176 455 467 495 -260
7553 -260 448 -39 -542 87 168 -76 249 108 -390 -403 453 -437 -265 -674 195 258 239 64 -101 344 -520
7574 -520 67 -551 -192 37 -176 70 315 375 -44 161 -97 -207 -418 -119 483 302 -185 234 -211 -104
7594 -104 259 -145 16 340 -456 -442 -235 -696 171 -275 163 57 -245 517 127 281 123 145 -208 -273 88
7615 88 -91 275 -320 -292 -571 434 -89 -72 -11 246 368 -237 -25 -331 -230 230 -116 -54 -206 352 698
7636 698 -3 -310 258 458 198 151 358 -512 134 329 322 -325 389 182 -642 -63 166 -445 -857 -185 -99
7657 -99 -395 348 282 2 -558 376 557 163 754 -339 137 -249 -40 612 69 16 -37 335 -106 -120 -565
7678 -565 323 36 -362 185 -522 -515 615 -360 -432 -64 434 -109 515 60 242 50 -282 -182 -287 88 -262
7699 -262 3 551 274 -488 47 -71 -575 -750 -559 319 -502 -108 27 -187 -181 572 -68 -115 189 341 -112
7720 -112 63 -195 16 -88 22 113 52 56 79 -538 -62 -178 73 -145 100 187 -588 14 12 -338 36 -214 94
7743 94 651 -155 588 -955 128 31 -12 -200 185 -15 39 188 -469 -268 -68 431 511 -83 111 3 -185
7764 -185 -598 191 -93 -578 259 80 454 -120 -618 -289 132 6 78 138 -198 -314 -77 69 397 213 -405
7785 -405 -26 -134 -1 -192 -625 430 -61 -438 -65 -33 -432 200 57 -168 113 -205 -191 181 354 -303
7805 -303 -263 303 -122 482 -7 -71 6 97 316 488 -388 605 -181 -116 -252 574 -163 138 -145 -379 -398 -258
7827 -258 88 -133 -13 -27 356 95 -90 60 234 74 258 64 40 -70 469 295 189 -652 356 -223
7847 -223 -50 -231 69 232 476 285 -76 -156 -142 -564 -272 -55 -262 216 -245 213 399 610 553 -111 215
7868 215 -110 346 -87 323 116 -24 -176 -233 219 959 38 -255 -174 24 -71 573 291 -318 -174 -15 -539
7889 -539 250 -293 68 -237 704 45 -144 331 -249 -18 243 -416 -140 18 -387 -192 185 455 -366 -194
7909 -194 -115 -408 491 297 97 -394 -41 -192 459 905 -139 26 512 175 -51 -311 107 -138 474 329
7929 329 91 -577 134 62 -56 -141 157 -297 53 238 30 -228 -509 152 -290 363 -98 -313 -103 227 250
7950 250 573 -445 24 -6 296 69 47 -395 -11 57 -184 -414 255 178 -142 69 123 189 290 -36 47 -370
7972 -370 -258 365 -282 -189 -237 442 -405 -359 34 251 98 -223 -342 519 -323 -215 -164 240 -171 412 -86
7993 -86 -30 -92 144 8 331 808 -389 -409 -97 11 -583 452 236 355 249 -87 -351 402 -203 370 -360
8014 -360 -147 -224 -572 413 -324 -182 230 -75 -190 122 213 -21 36 732 -388 -377 -388 -43 234 -72 -249
8035 -249 118 -551 112 -782 -609 -203 -148 270 -141 272 184 0 -731 315 212 519 438 -226 -50 118 -69
8056 -69 131 454 -344 223 -425 -380 3 403 -198 -328 -456 108 343 -158 398 -255 -275 248 472 384 -141
8077 -141 -255 -237 116 358 -60 -21 171 46 -83 503 -151 -203 201 337 -142 192 -114 26 190 -55 -496
8098 -496 -15 241 -427 -350 -661 -37 169 -158 47 41 103 368 -257 -151 65 240 63 -147 263 -221 26
8119 26 -1 -427 -10 94 -161 -119 249 162 -641 -476 500 134 6 567 -464 -86 -240 -111 -314 -411 172
8140 172 522 52 -224 -360 -415 218 510 -260 94 169 594 -327 65 308 286 303 -10 -87 -36 98 -688 -288
8162 -288 -329 -32 -508 231 -112 -51 32 -453 -95 377 -541 735 -3 104 -408 94 586 85 572 -213 74
8183 74 -252 -345 185 -67 -20 -343 -203 -200
8191b00
$$ Imaginary data points
##PAGE= N=2
##DATA TABLE= (X++(I..I)), XYDATA
0 0 0 0 0 0 0 0 0 0 0 0 0 0 0 0 0 0 0 0 19 -40 40 -40 40 -40 43 -80 80 -80 106 -120 123 -160 163 -200 222 -243
36 -243 281 -314 349 -390 433 -478 538 -589 656 -725 798 -881 971 -1071 1177 -1295 1431
53 1431 -1581 1744 -1928 2144 -2387 2668 -3004 3409 -3901 4527 -5337 6446 -8076 10667 -15536
68 -15536 27816 -130522 -160811 91591 187810 274595 295579 325599 273820 191051 130292 65312
80 65312 -25143 -41670 -98182 -129826 -92920 -115303 -150690 -120615 -132911 -132836 -119258 -103431 -53069
93 -53069 -32687 -16492 44923 56015 70632 86190 56163 67644 78174 49926 68699 86618
105 86618 93012 93884 81081 100652 81804 26931 29759 3160 -34619 -22726 -41005 -45358 -24333
118 -24333 -44839 -53645 -52793 -56511 -60365 -83346 -56209 -17697 -19883 24717 66802 67854 83983
131 83983 64343 33703 16125 -36555 -75903 -93122 -104520 -82551 -74753 -48229 10743 16668
143 16668 21935 42852 26828 12723 -11293 -30829 -20633 -27712 -14648 16361 26881 60836
155 60836 71369 58661 82247 69349 33452 29596 16001 5587 -5815 -17783 -2989 -12523
167 -12523 -21762 -7350 -15422 -4478 8834 -6507 15839 32594 19117 24108 18379 10052 -5224
180 -5224 -36256 -33475 -38110 -59583 -47256 -43864 -37060 -18479 -27882 -22890 -13020 -29672 -32283 -34543
194 -34543 -27758 -11142 -18792 5772 39230 36163 50596 60327 50064 50822 29148 14028 15956
207 15956 1928 621 -263 887 20836 7969 2226 19911 1853 -9036 -5488 -10748 -371
220 -371 1036 3361 25416 28365 32848 35668 21290 25673 6627 -24996 -21678 -35855 -54493 -56194
234 -56194 -60566 -48791 -45554 -47323 -22273 -14482 -8210 10206 9485 24909 34388 16502 22654 23552
248 23552 8376 2288 -10254 -7245 -8146 -23931 -8073 1438 -1831 13653 11894 16512 29594 16140
262 16140 16320 21504 12953 12598 4431 8809 20685 4113 7488 19412 9317 14007 10864 4230
276 4230 12522 -734 -8612 -3773 -12724 -14163 -24629 -32343 -18622 -31087 -36138 -20259 -23677 -20192
290 -20192 -13966 -13657 2110 808 -2040 9962 7237 12244 11104 712 13964 10664 -5036 5016
304 5016 3626 571 415 -6668 4897 4508 -5198 5543 2500 2927 9311 -566 10761 20445 8807
319 8807 15727 21083 19981 20264 7465 10616 9107 -10365 -7396 -8412 -13468 -5686 -13177 -8905 3807
334 3807 -5936 -6416 -5160 -9891 -8483 -20182 -16861 -3494 -12701 -6765 4422 2089 10721 3321 -4408
349 -4408 944 -12044 -18799 -18461 -21624 -11170 -13499 -11144 11455 12346 11712 22551 18810 20552 15629
364 15629 6181 13671 6797 54 3385 -1049 6866 6808 -2489 11465 13262 5911 13808 13079 14925
379 14925 12547 253 4092 -1046 -13400 -13213 -20991 -19326 -13591 -22203 -11855 -2544 -8980 -7751
393 -7751 -9246 -9663 -9187 -22095 -16079 -8628 -11040 2325 8459 14888 26459 18495 15877 18351 3508
408 3508 -4052 -13091 -15960 -9339 -15433 -8235 9368 7716 13334 15747 9765 12103 -596 -10430 -7181
423 -7181 -13281 -11532 -6784 -1860 16343 17237 17633 32736 29754 25773 24851 15111 14524 4751 -8601
438 -8601 -7945 -16360 -23767 -26775 -36298 -28079 -27600 -34835 -21650 -15482 -13349 -6789 -6083 2228 3637 -3984
454 -3984 3422 5646 6157 14129 11716 20975 29772 20453 21605 21719 11152 5041 -5306 -5730 -2798
469 -2798 -11548 -3790 4250 2815 8595 1595 -3998 -3237 -20053 -27722 -27070 -29305 -21374 -15971 -1705
484 -1705 21702 26468 37041 49726 44692 42541 31679 16321 11045 -6145 -20858 -25271 -33241
497 -33241 -33008 -37100 -40684 -27982 -28755 -29279 -15407 -11233 -2207 3649 5641 17038 19523 16665 22078
512 22078 19111 19531 17469 8896 14720 12559 1452 3130 -759 -4422 -6412 -14497 -8386 -6026 -9125
527 -9125 181 4638 10420 16394 8517 9745 10776 -3576 -7999 -12509 -16595 -13867 -17423 -8087 5101
542 5101 4804 13102 17261 14406 16227 5061 -1942 -941 -12056 -15707 -14811 -13206 -6528 -8794 -6303
557 -6303 3742 -1975 -2699 -768 -5850 -2002 -5412 -7857 1387 1457 2360 6959 6556 13456 9743 4651
573 4651 11956 7290 1453 3473 -1679 1006 -716 -6810 -289 -438 -968 4188 2574 8966 10526 3342
589 3342 8963 8342 -610 -1354 -6462 -7257 -6695 -12420 -6331 -2903 -3547 611 -1594 -111 2367 -8935
605 -8935 -9768 -7299 -12932 -11224 -9984 -4680 3214 1456 7763 14963 11671 12481 8549 3805 6589 -1939
621 -1939 -4920 -755 -4331 -2803 -3377 -2826 4229 -572 -2407 4510 757 2136 3049 1102 8827 6386
637 6386 3080 8665 6342 5550 2602 -2004 2318 -1944 -8893 -4150 -6727 -8945 -6601 -9359 -2693
652 -2693 -1958 -4945 794 3039 3868 5264 176 4429 3701 -4694 -2607 -3899 -7553 -6564 -10173 -5202
668 -5202 -1103 -4803 794 3989 3445 7642 3478 5180 9919 2247 2876 4700 2641 4655 703 2202
684 2202 5822 1338 1723 3136 251 2807 -1092 -1839 2821 -2197 -3562 -970 -2830 -1768 -5134 -7419
700 -7419 -779 -5723 -7713 -3045 -4696 -553 -1205 -3883 3623 2650 311 3553 2436 4637 3072 -1405
716 -1405 4047 1943 -2356 -116 -2618 -2041 -2692 -6721 -2177 -1952 -5151 -1284 -1758 2030 4676 394
732 394 5996 8832 3897 6869 5034 4273 3239 -2489 -657 433 -3253 -1012 -1139 -911 4052 -1063
748 -1063 975 5602 -598 -584 -2152 -3652 -1083 -5965 -5199 -840 -4156 -2053 -964 -1821 2836 -1337
764 -1337 -2956 1564 -1931 -2806 -2050 -3437 122 -2425 -3528 3231 606 841 2770 565 5764 3283
780 3283 -33 4276 3192 1873 2536 635 5210 3958 -1026 4257 3113 0 1106 -2530 -1880 -2492
796 -2492 -8503 -5506 -4597 -6024 -2888 -4478 1865 5197 842 5027 6609 3363 4150 566 1455 2703
812 2703 -1668 159 2806 632 2782 -407 46 1315 -6500 -7873 -7463 -11378 -10948 -11989 -9818 -2758
828 -2758 -3640 234 7070 6874 10964 10288 8781 12363 6746 2176 4622 970 719 -946 -3262 2276
844 2276 -590 -1826 2377 212 1139 261 -3707 -511 -3068 -7999 -5567 -6566 -5913 -5115 -6209 6
860 6 896 -1480 2782 3207 2556 4098 -186 2461 3789 -312 2420 3117 3384 4216 521 2304 3317
877 3317 -3190 -3487 -5019 -6703 -5700 -8336 -5070 -915 -1646 1058 3266 3742 5318 413 382 2521
893 2521 -1689 -2867 -710 -269 3018 3166 4648 10629 8682 7951 8333 4647 4829 -1114 -6360 -4551
909 -4551 -9199 -11781 -9948 -11342 -7574 -7970 -7559 -807 -428 -357 3281 1551 4235 3933 672 4361 3646
926 3646 1542 4170 2439 5295 5233 1690 5089 2636 -1479 -1000 -4412 -4233 -3821 -7550 -4236 -2071
942 -2071 -2693 631 331 2514 4141 377 1454 2554 -1030 -551 -1315 223 2914 1260 2717 5831
958 5831 3958 4524 2320 38 2186 -4609 -5137 -2966 -5366 -4669 -4604 -3901 219 -1795 -1263 1751 -92
975 -92 600 -104 -991 1337 -708 -2764 1021 143 298 1305 497 3770 1932 -998 3432 693 -778
992 -778 31 -3091 -715 190 -3102 1699 1727 1914 4172 2172 4863 3803 -863 1145 -1019 -3440 -3009
1009 -3009 -5357 -3059 -1315 -4381 -1067 1178 401 1753 -219 1099 2446 -2350 -285 708 -1251
1024 -1251 354 -1084 451 3589 593 641 2379 -758 984 -2246 -2816 735 -3433 -2837 -471 -1209
1040 -1209 254 -464 -306 3109 944 222 3308 742 1376 675 -1136 2546 359 -1590 584 197
1056 197 968 925 -1056 2284 637 -1354 663 -417 189 -446 -2396 1146 546 -1294 610 716 721 619
1074 619 -2720 -245 -988 -3924 -1939 -2813 -2871 -1299 -2818 -427 1278 -1275 1060 1641 2098 3285 496
1091 496 2407 4081 1474 2439 2296 1705 2992 -351 -784 893 -1544 -1771 -2121 -3305 -831 -3635 -3134
1108 -3134 651 -1424 -574 571 485 2490 1566 -267 3449 1217 1070 1491 172 1702 -139 -1588
1124 -1588 1211 -490 -1843 -599 -1701 321 -883 -2968 -328 -1245 -2081 -1030 -2414 -551 -980 -2836
1140 -2836 358 1235 -96 1968 749 2277 3463 653 1973 3019 -447 759 -992 -1127 658
1155 658 -3188 -1868 256 -151 392 -140 1620 3984 844 1253 2632 438 92 -1528 -1807 -1204 -3787
1172 -3787 -3958 -1768 -2702 -1447 -2001 -1360 1983 -85 -641 2450 1256 1664 1010 1203 2968 382 674
1189 674 2291 470 1288 973 -161 1893 233 -1964 -37 -1724 -2028 -1681 -3305 -886 -2111 -3049
1205 -3049 -648 -831 -610 620 -900 2366 2273 1170 3229 3010 1956 3871 1588 2748 2254 -1048
1221 -1048 376 -1024 -3002 -2045 -4723 -3555 -1847 -3654 -1298 51 337 1615 -150 628 2129 -1161
1237 -1161 -906 -954 -1528 -213 -1552 -603 1780 329 1857 2918 2206 3278 1551 685 2370 -289 -1261
1254 -1261 -563 -2046 -524 -1560 -2322 966 403 -315 2172 -7 1358 353 -1731 214 -1409 -2603
1270 -2603 -1710 -2228 -742 -136 -1481 1650 1605 823 2740 1838 2829 2884 698 2631 2532 307 750 -27
1288 -27 -367 -127 -3160 -2515 -3248 -4794 -3572 -4207 -3696 -1042 -3372 -793 1642 549 2103 2489 2950
1305 2950 4152 1911 1441 3424 984 1945 1919 1423 3124 1017 785 2063 -60 -746 -1746 -3590 -2267
1322 -2267 -4938 -6063 -3688 -4949 -3884 -1502 -944 1249 2275 2069 5526 4220 3547 3360 2136 2783
1338 2783 326 -1810 165 -795 -1903 -1237 -1522 -101 -294 -1676 -493 -525 -2130 -1097 -2240 -1036
1354 -1036 -114 -1993 -305 702 139 873 381 2768 3171 494 1591 1890 644 1251 9 -64 1166
1371 1166 -1577 -764 57 -1018 -901 -2386 -1527 -117 -2201 -1666 786 232 1032 476 708 2708 651
1388 651 -367 1424 -344 -948 -1446 -2452 -641 -2665 -2308 -191 -607 1177 1009 998 3386 1642 1204
1405 1204 1043 506 634 2 -1250 285 237 -1189 747 218 1070 627 -852 762 -222 -2407 -1129
1422 -1129 -1110 -1916 -1033 -2116 -45 166 -650 986 1307 1667 2067 576 1617 1967 313 56 -25 -800
1440 -800 -205 -1825 -663 49 -1196 -1181 -594 -441 139 -1182 -662 1207 -232 247 952 344 1535 74
1458 74 -25 1192 -424 -790 -185 -1014 -93 -465 -887 837 317 155 1332 636 1623 714 33 1873 550
1477 550 -311 -269 -1068 -104 -523 -1843 246 -308 -1239 -301 -767 227 -50 -1643 -342 264 -989 579
1495 579 -241 658 1490 -590 1426 1590 801 920 261 956 1872 -546 -153 230 -1386 -360 -1062 -842
1513 -842 -245 -1521 -818 338 -603 -177 -678 -307 911 -647 -141 609 -228 1114 458 647 2611 1002
1531 1002 291 1623 1028 483 496 -12 626 -199 -2064 -452 -1516 -1680 -1312 -2970 -652 -998 -1845 205
1549 205 254 -326 273 1 859 743 -416 1136 248 -312 550 -122 780 1072 -259 453 544 256 730 -527
1569 -527 355 116 -1364 -715 81 -541 -635 -428 -1141 36 -879 -1107 142 -760 -223 -1566 -315 1157
1587 1157 -184 -258 1150 109 1243 285 138 1356 456 -152 293 -540 170 -47 -1232 92 -24 -733
1605 -733 976 -1089 135 2 -1771 501 -462 -1334 -205 -1319 -886 -63 -882 897 519 -125 846
1622 846 290 1098 1443 -405 1460 1454 338 737 803 902 917 -836 656 34 -925 -547 -1337 -1058 -730 -2645
1642 -2645 -841 -312 -1181 -297 -109 122 913 -332 -33 1596 -633 467 -45 -162 901 598 415 1536
1660 1536 932 1524 591 462 1097 -513 -783 425 -904 -1138 -782 -2145 -293 -1146 -1927 -55 -1125
1677 -1125 -249 60 -922 696 485 -1019 826 436 601 1726 577 2285 2666 783 1682 1533 348
1694 348 -36 -707 70 -899 -2414 -1342 -861 -1871 -1231 -1574 -775 -78 -1127 109 118 -116 648 207 1005
1713 1005 1608 334 1202 1461 302 651 -44 574 882 -764 -1007 -752 -634 -571 -902 -677 437 -342 -689
1732 -689 732 -348 -300 -642 -622 790 -632 -851 279 -403 513 95 351 1319 255 926 1599 503
1750 503 513 74 -405 1518 -89 -643 221 19 -500 -66 -936 -635 -530 -1354 -455 -215 -646 -663 -1608 793
1770 793 285 -378 542 1120 253 1613 243 972 1500 67 746 472 171 533 -62 136 720 -394 -195
1789 -195 -523 117 306 -865 -385 582 -1129 -417 -67 -630 487 -492 -429 769 -130 -564 87 -241 379
1808 379 -78 -784 144 -451 238 986 17 912 270 -188 728 35 -266 -42 -397 -222 -391 -1321 -885 -539
1828 -539 -763 -170 -73 331 394 135 877 371 -19 174 -429 44 878 -611 141 326 -40 181 -281 248
1848 248 88 -417 543 600 -647 648 206 774 945 -958 165 573 -784 117 -526 -431 -669 -941 -898
1867 -898 12 -306 -515 -181 150 990 -75 377 1168 420 855 1016 271 645 2 -629 460 690 -152
1886 -152 -122 -230 152 -165 -1121 -620 -333 -943 -854 -841 -366 -384 -1170 -111 279 -166 153 -359 517 368 -6
1907 -6 419 1218 883 927 153 302 418 -81 413 -266 -103 -50 -939 -450 -67 -1047 -847 128 -913 80 -381
1928 -381 12 193 -464 -194 403 -461 321 335 419 801 188 574 727 305 401 220 238 1175 -34 -409 231
1949 231 -745 213 -588 -849 489 -667 -725 -257 -268 -537 -186 -730 177 -286 -490 674 721 1308 241 -66
1969 -66 1172 737 -343 658 -137 22 -35 -291 158 -449 -481 -264 -538 -251 80 -1092 -143 546 -1045
1988 -1045 -184 -369 -137 206 -584 362 401 -192 158 217 387 630 -117 112 1272 3 506 594 -51 877
2008 877 -188 361 421 -64 20 -23 -503 -664 -811 -932 69 -110 -849 -283 -530 -115 -168 -237 236 143 -578
2029 -578 115 -68 338 20 137 1111 615 298 712 -82 1050 710 75 -80 877 -276 190 -259 -491
2048 -491 -468 -1354 -171 -297 -956 -933 -857 -228 19 -701 -211 427 40 718 921 477 1507 411 1091 469
2068 469 -123 884 82 -113 18 -92 179 193 -599 388 -567 -1414 201 -623 -735 -31 -293 -18 -631 -659
2088 -659 748 292 152 723 -113 287 665 -146 163 630 -284 511 17 234 353 -40 439 104 -781 626
2108 626 -488 -850 -864 -663 170 -675 -1004 -163 -862 -549 224 -291 199 363 273 411 823 893 1101 111 399
2129 399 546 -475 -399 -88 -505 9 -324 -185 -165 -1039 -190 -171 133 -364 -250 -519 90 -602 -187 308 -321
2150 -321 -137 -726 -193 253 -612 -433 -17 154 302 22 230 1418 310 395 1065 179 -169 530 -271 581
2170 581 -332 -773 -311 -1196 -173 -625 -868 75 -533 -309 460 -258 -100 36 -466 1024 449 334 311 19
2190 19 439 1024 329 395 753 -440 -81 -444 -1091 21 -878 -300 -90 -14 -154 250 -113 256 360 3
2210 3 801 -470 -213 -435 98 523 -335 -30 420 -311 37 -192 -157 127 534 -317 410 767 -197 658 253
2231 253 584 78 -1226 590 -513 -667 -293 -1129 -244 -511 -821 271 -589 268 543 -339 885 486
2249 486 572 136 856 432 -367 -298 524 -102 -73 603 156 -13 -306 -205 -471 411 -618 206 379 -141 447
2270 447 585 95 488 -14 -677 -92 -207 92 -1145 -191 446 -205 250 -69 228 -40 27 -475 660 129
2290 129 321 851 123 -41 -19 -513 1193 91 -640 -43 -844 -448 -285 -700 89 265 -762 131 -395
2309 -395 -505 3 -654 897 379 -391 462 924 614 365 -252 751 824 -283 348 19 39 -119 -476 -100
2329 -100 368 -625 -219 -311 -632 -217 -825 -64 16 -874 -150 253 -17 -84 241 746 802 -567 825 771 677
2350 677 370 -27 538 285 280 126 -139 -769 63 -1025 -611 -5 -412 -1118 -222 -196 460 119 -667 118 531
2371 531 368 523 99 833 340 -226 290 -42 -369 -245 -481 262 -340 3 484 -238 -121 34 -199 258
2391 258 381 -852 199 95 8 -1 -839 162 78 -482 46 550 -597 104 -81 50 -2 -558 -325 -160
2411 -160 260 -283 451 36 319 48 34 -78 126 -225 260 -169 759 -481 -188 40 105 -460 -647 -629 124
2432 124 -756 -452 372 -631 -434 81 -493 676 961 450 568 152 34 -2 283 264 234 9 -117 -566
2452 -566 50 -371 -105 -262 76 -771 -97 -137 -400 -157 -778 -96 222 -316 239 563 707 206 -112 33
2472 33 1148 348 523 238 -561 836 -746 -405 711 -251 -294 396 -349 323 221 -935 184 -42 -23
2491 -23 -521 272 -69 -428 -460 12 -23 -376 436 -100 475 333 -37 -131 269 -134 693 24 33 -93 -20 155
2513 155 435 -679 -51 -141 67 -32 -455 -380 -182 -654 -132 -1069 -423 -51 -249 -197 -131 224 784 435 -234
2534 -234 -209 -421 613 378 516 591 532 -163 68 469 -95 347 -575 -318 -857 -574 -145 -657 -291 -202 -956
2555 -956 -491 -352 -207 424 248 250 745 57 564 679 453 390 268 88 -45 -273 -354 -454 -871 110 -467
2576 -467 10 -218 -366 -151 125 -648 -113 -181 -459 222 -166 -1115 -316 305 380 377 -118 488 157 236 -464 539
2598 539 -318 -573 -49 117 195 -181 -26 -290 -75 341 -200 442 345 115 -218 -187 277 -340 -552 -481 239
2619 239 -570 -90 -508 43 257 349 180 183 -277 -10 -148 292 234 14 -48 184 152 -127 -278 85 1008 -87
2641 -87 -40 -104 90 66 -69 -196 -137 -641 -955 -163 -183 -143 -115 -196 235 407 -167 560 455 392 -316 182 321
2664 321 587 -29 497 -371 -157 -320 -81 326 -489 -331 29 -263 -135 99 -211 213 -32 63 108 511 495
2685 495 174 -105 47 66 -216 221 -383 462 -141 6 424 268 -143 352 429 127 25 42 159 306 -84
2706 -84 78 80 13 179 -150 -436 757 -252 -419 19 182 148 -503 -474 -296 91 -97 -89 366 -43 -420 244
2728 244 702 315 22 483 266 550 292 280 -254 -245 -341 313 139 -457 -25 -681 -399 339 -331 -293 -447 -94
2750 -94 -107 -268 445 95 -351 -138 -248 146 573 203 905 681 69 895 263 115 223 -302 -325 -403 -184
2771 -184 -955 -29 -464 -275 -497 -336 481 -555 -191 -86 -56 564 -38 30 652 -34 236 427 261 219 510
2792 510 -36 113 -149 119 -4 -175 710 -722 -789 -120 7 -253 -97 5 302 -75 -176 236 279 -303
2812 -303 432 82 454 249 177 797 101 -175 -467 -108 548 -40 378 -14 671 240 129 -350 347 641
2832 641 -84 56 -258 -310 60 -217 -688 -4 -375 -276 229 -451 -158 276 -136 360 130 -158 507 -34 373
2853 373 9 120 801 -151 218 -134 -190 -259 257 101 271 -874 -767 -252 -93 -60 -56 -768 -116 -268 336
2874 336 -27 -262 -11 706 77 307 424 -457 131 911 201 527 262 -547 -118 -524 427 103 -75 20
2894 20 -299 -264 28 -472 -132 -11 -276 -625 -437 -304 250 -233 -199 -83 -480 -135 26 189 454 99 407
2915 407 33 -148 130 -9 53 191 16 0 331 169 528 -212 -479 -220 -175 -716 157 -693 -170 444 -735
2936 -735 362 -313 -61 -335 -432 140 436 -365 522 127 -154 34 -291 -187 -293 -206 146 -360 -351 -101 -530
2957 -530 129 -358 267 -516 -584 -118 -290 22 -129 -177 82 -62 405 463 284 2 385 764 588 323 274
2978 274 -160 280 -296 387 313 180 149 132 -216 54 -101 -373 -68 -303 -754 185 -208 -417 -139 1 -54
2999 -54 -832 -482 -215 -23 260 -174 -417 463 -174 -55 394 475 -191 -434 -77 74 719 -50 90 -633 -22
3020 -22 355 -104 -181 237 -627 103 -52 -258 8 -487 76 -32 -163 -408 211 66 127 -105 -309 51 -176
3041 -176 229 58 201 274 -9 68 192 -447 -687 -8 -228 -476 -310 266 -89 -505 -57 -27 148 -478 -118
3062 -118 -264 -3 -78 -651 362 -362 -207 145 55 143 197 -386 -15 -72 173 303 -412 360 199 -135 -26
3083 -26 -239 -78 882 -566 -344 -2 -454 78 -216 -108 -243 260 8 546 -289 391 124 92 27 -9 48
3104 48 460 134 -230 -107 -144 335 -197 -10 69 -142 171 301 -421 -808 -257 -288 -286 -643 92 588 -131 393
3126 393 -459 194 60 -189 -137 341 241 467 -137 141 258 784 466 291 321 185 450 42 682 388 -356
3147 -356 163 -495 -203 -375 -879 -628 189 -78 274 -123 -546 12 -40 150 -108 122 535 170 -178 397
3167 397 370 -32 200 -655 491 217 265 -56 -742 1 -89 -426 -254 -335 -271 573 -297 -283 121 30 221 -330
3189 -330 -283 390 -301 -574 554 32 687 511 120 307 -484 -217 555 -492 106 190 -352 -68 71 -550
3209 -550 -678 283 59 -477 -317 -102 11 -438 -134 -35 192 161 166 301 -60 402 772 481 -321 178 69
3230 69 -140 539 -98 1 105 352 443 24 -17 -67 -165 -476 -638 -355 -242 -538 -485 309 372 -393 173 -73 -451
3253 -451 -190 -118 510 18 -331 -64 -457 633 568 939 642 346 -101 366 722 687 -15 187 -20 -7 -340
3274 -340 -517 151 -245 -346 -629 -3 150 -377 423 -549 -30 24 -437 170 258 -305 488 708 638 210 54
3295 54 87 671 378 332 6 26 147 -170 -194 -139 -355 81 -160 -570 320 -388 -454 -73 -82 141 -561 69 497
3318 497 345 174 434 737 116 909 -35 40 -437 103 -102 -115 -162 -567 -294 415 -336 159 -852 -413 477
3339 477 -357 -641 -234 -300 -149 259 -306 -76 -130 -232 -167 110 -604 98 463 285 306 -267 495 428 360 -24
3361 -24 -240 -137 502 -460 280 -218 -1023 -141 -566 74 23 -443 46 -488 -60 -397 -152 -93 101 151 287
3382 287 223 435 -72 173 102 232 -231 -317 -249 26 242 225 17 181 -182 -34 -24 114 -396 17 -190 -255
3404 -255 346 -659 150 -241 -481 -94 -4 -121 408 266 857 364 -387 265 -220 552 -77 -18 784 361
3424 361 -613 416 119 638 -17 -305 -117 626 310 166 -194 -727 181 -565 265 431 -55 -442 412 -18
3444 -18 413 -113 -4 -16 168 738 460 -586 371 121 -187 60 685 12 6 -59 -468 -26 -86 -99 173 61
3466 61 49 -759 174 437 -670 87 -172 -115 -24 -7 -323 165 -82 -11 131 249 -149 52 141 59 242 -24
3488 -24 587 -261 830 -259 -361 -657 -380 -91 -147 -345 -370 105 -266 -318 -299 288 -620 -199 210 -604 -409
3509 -409 632 125 261 188 356 253 -299 235 -84 -471 123 -203 110 -271 -377 -687 468 -483 -520 94
3529 94 0 -179 -222 238 -165 83 -430 205 -273 347 39 -289 -9 542 36 -57 525 255 495 -117 440
3550 440 -188 -77 594 -93 230 491 -293 38 -78 -1211 -573 -10 -4 -136 39 611 -78 -381 -108 391
3570 391 182 366 -52 317 -129 -40 -12 -344 377 9 -111 255 411 -158 60 72 -56 -124 -177 208 514 -158
3592 -158 251 284 -549 76 8 8 2 -568 50 -14 -150 466 1 -240 169 4 -547 821 -494 210 32 -265
3614 -265 214 -182 223 -50 -366 -289 338 -1077 336 -156 -592 120 -520 23 263 125 -111 33 -456 -403
3634 -403 9 289 -266 48 664 -53 -71 5 -167 337 -209 -657 -111 -88 518 70 344 -129 364 -669 327
3655 327 -168 -332 92 385 -379 -263 332 -877 278 -117 618 -470 110 -40 -25 259 125 157 -162 763
3675 763 253 741 289 -865 679 27 -214 -20 -201 -111 -429 -29 -40 -479 -531 304 -191 -406 -123 345
3695 345 349 -212 306 533 366 190 39 -295 213 218 -19 -166 -540 601 -45 88 12 523 -173 28 -175
3716 -175 -21 -199 -164 -313 171 -5 267 -1 148 -190 -179 -341 390 153 388 137 -139 286 -115 231 155
3737 155 -180 -64 269 -485 189 -275 -289 92 179 -148 205 184 30 -362 285 94 -181 -43 -400 -62 -193
3758 -193 -354 18 621 -284 -53 245 -44 -16 61 -126 247 187 160 179 305 91 50 -439 -197 70 -139 396
3780 396 -62 447 26 -597 534 407 26 380 20 -309 -310 69 -200 83 339 -41 -2 295 703 133 -318
3801 -318 -111 -181 323 296 -151 -158 -317 -265 405 63 101 325 -376 134 -47 -262 -10 464 354 -131 -197 102
3823 102 276 -65 25 421 280 76 218 135 265 -328 -286 401 768 4 94 -273 -145 437 -157 -360 -63
3844 -63 -316 -598 230 16 -311 390 244 105 23 -857 68 115 -268 -362 360 86 758 187 498 -66 -593
3865 -593 355 -465 87 180 -706 -174 126 -491 -678 80 -488 -278 -192 19 35 -507 -323 315 -6 157 -184
3886 -184 -151 117 -94 72 -25 358 136 -254 126 -242 -82 77 74 30 623 -128 -392 157 137 -320 139 37
3908 37 362 -394 -177 -300 548 -128 104 -253 -412 93 -221 96 201 -156 349 17 -71 215 -64 -2 183
3929 183 -25 -379 15 203 233 -573 -980 169 -279 -308 -17 28 -3 -568 84 -84 156 -1187 28 -279
3949 -279 -214 -588 -378 333 -413 139 148 116 619 -114 11 280 -116 -519 422 127 -150 -59 -271 471 -169 274
3971 274 -80 413 -12 366 -431 -468 39 410 376 -330 -144 228 315 284 -344 -40 -171 398 184 421 -395
3992 -395 248 127 257 -143 6 -115 25 -225 -381 -278 -534 -470 -24 116 -322 -466 -276 29 -613 341
4012 341 -19 -510 -92 -300 -360 207 137 875 -90 -241 -154 -211 -66 8 -176 351 182 920 730 -366 -487
4033 -487 121 229 -94 252 -635 164 456 529 -175 124 -82 132 326 520 112 -344 348 76 -529 -23
4053 -23 618 45 22 336 -161 16 292 390 -223 -98 18 332 -289 -645 -218 -277 -528 202 4 -83 711 -134
4075 -134 313 7 233 381 453 -153 226 414 -83 232 -549 -591 233 -67 -52 30 -160 332 -65 -514 -121
4096 -121 93 -638 -92 -58 127 -218 120 210 13 202 -140 -99 234 -432 -129 327 376 448 109 621 418 427
4118 427 100 313 264 143 -106 -761 -277 284 -481 112 122 -41 -305 -227 161 -300 -456 127 -302 317 293
4139 293 138 -222 -154 302 -8 196 34 655 518 -425 -1 338 301 -221 -107 156 -196 -339 45 -57 227
4160 227 -138 -343 -97 -48 4 -146 -184 -545 442 254 442 -79 -292 -450 189 -257 465 39 136 579 -77
4181 -77 166 69 -583 -249 -287 -208 -414 290 -342 297 -536 27 -170 33 -546 -199 145 487 305 -383 -101
4202 -101 -26 897 -41 498 -127 -387 -50 81 178 143 -45 40 185 20 -1 43 70 -325 -4 -223 -349 -32
4224 -32 187 165 -2 -274 -474 -163 -42 102 170 -293 309 438 334 -75 -40 -50 477 254 -406 292 280 -280
4246 -280 102 -48 -249 73 -75 9 -130 -391 134 58 144 -322 -98 -185 -243 -364 79 90 -256 172 370 4
4268 4 530 -350 94 411 360 -112 318 239 7 -33 21 325 129 -73 -109 2 675 -21 -912 -357 66 -156
4290 -156 -316 124 266 -147 -679 456 -191 163 64 -42 704 522 641 -94 -35 184 643 -170 180 110 184
4311 184 252 474 336 -608 -477 -365 -150 22 588 -38 -413 -659 88 12 -224 -148 -104 20 -777 622 5
4332 5 -195 -195 -114 -77 275 -91 93 -543 665 -95 -181 182 47 -140 -469 148 -158 53 17 -313 -23 147
4354 147 229 -343 271 -276 194 121 435 84 -268 90 405 22 88 256 -393 155 220 -32 296 152 25
4375 25 316 361 158 -478 -797 -240 40 -117 -13 -7 276 182 -211 217 386 599 65 234 -19 -116 178 395
4397 395 1099 212 -12 55 -42 250 158 -121 -217 279 -189 240 76 -162 235 -153 141 -321 -482 -323 -321 222
4419 222 -315 -481 423 94 106 44 281 368 283 280 105 -128 -184 -349 -106 -318 -326 307 81 577 -531 48 155
4442 155 -534 -154 -449 49 119 -148 -332 137 -453 -355 -127 -321 -113 -453 264 136 -23 -51 482 297 -7
4463 -7 404 81 187 -9 363 161 -77 -170 199 -114 -169 -259 251 -578 92 61 355 -416 -173 691 -412 75
4485 75 250 243 252 -276 238 -95 -477 79 319 392 147 -194 -89 641 -453 -26 -354 46 -131 314 -286 -106
4507 -106 -602 24 -175 -38 -29 -615 154 110 113 478 -419 576 372 1 112 81 384 1 38 -82 7 390 -525
4530 -525 -116 78 36 238 -662 -135 89 102 -125 -411 -94 -15 -644 446 72 -40 8 -214 -173 -243 -184 734
4552 734 364 151 674 476 -32 528 -49 -59 355 32 252 -226 833 -158 -86 -606 172 5 306 95
4572 95 139 -44 -206 270 -356 -138 205 -18 276 96 -373 -114 201 -143 595 146 456 109 105 1 242
4593 242 -414 -175 -14 -307 -371 89 -67 225 -267 -251 369 -391 43 163 -456 196 -593 -50 68 -140 564
4614 564 270 69 60 85 -733 150 145 -158 153 -414 72 -340 -305 68 -217 -605 -182 -111 -33 -537 -82 24 76
4637 76 -260 216 -58 -273 -226 -358 292 339 125 -144 80 -143 -497 157 38 -850 -285 852 187 -294 -12
4658 -12 135 309 -247 -649 -513 -364 212 -117 -292 364 187 142 39 -641 -105 48 -458 43 443 -291 477
4679 477 525 52 184 -288 -213 -105 -149 301 -501 -220 -22 -314 366 328 152 -396 -41 -295 203 -410 -405 -105
4701 -105 -79 -640 308 -209 -180 302 -96 -80 -112 436 344 -697 76 -77 -257 -18 479 54 25 557 -322 -253
4723 -253 165 -121 -299 260 -10 40 -10 -334 28 308 -439 271 8 116 -384 655 259 324 224 -233 488
4744 488 -298 621 -156 274 -686 -418 -495 -804 235 -2 -96 -504 20 -294 -65 -281 116 9 -32 -34 171
4765 171 -48 -407 75 -92 -382 -213 681 -363 -494 -353 253 616 568 -592 -121 -464 38 -147 523 -31
4785 -31 -70 -137 471 -96 188 -541 -411 -181 -265 327 -364 -149 -449 -410 11 -386 544 585 -196 -327 733 579
4807 579 298 -330 182 61 -235 102 -195 -236 -308 -126 -464 -308 -163 -524 266 123 476 268 7 85 -8
4828 -8 -201 304 -448 -434 -185 531 -173 -355 490 181 49 -85 115 -76 -47 505 -73 33 585 392 241
4849 241 -447 -486 296 382 3 472 226 16 77 -493 -326 93 -12 364 -2 126 -67 -165 655 -18 453
4870 453 -106 -128 -699 -51 415 -34 233 -183 523 358 286 143 -59 636 -86 -445 132 64 -161 339 -473
4891 -473 57 290 -17 464 -96 -502 101 151 -266 -63 162 -163 -199 115 281 -121 -337 114 -122 656 -116
4912 -116 -268 757 -170 -100 -255 -470 -819 -591 90 -328 -270 400 43 -37 -86 26 172 -271 -108 72 169
4933 169 -243 -257 399 81 412 -117 410 84 -377 -457 315 64 33 190 -16 -81 -248 -105 -28 -170 -160 -440
4955 -440 7 -321 353 -143 -183 -99 97 -337 204 -237 -179 305 -350 394 -316 51 218 235 477 -607 481
4976 481 -304 -196 155 121 -25 -182 455 424 104 270 33 79 -503 121 -224 200 177 -206 344 148 103 -256
4998 -256 -198 -20 475 469 41 273 518 -206 88 70 -100 -25 -152 -343 -819 -385 -625 -482 159 -39 250 -349
5020 -349 -142 -209 -121 116 -52 100 643 328 -226 201 -483 -62 106 65 107 -139 -172 60 205 180 593 -81
5042 -81 473 490 420 200 -385 7 -101 858 -107 148 21 -304 -245 -90 -221 535 -156 -87 -397 472 90 84
5064 84 -149 47 98 -568 -171 -165 311 -364 -262 -224 121 -396 -341 18 154 -391 267 197 47 -219 505 -236
5086 -236 -386 424 -121 420 -81 366 916 277 159 -197 -70 -153 472 -106 -56 -229 184 116 358 159 380
5107 380 -354 -309 -392 -98 737 242 378 369 91 28 -609 -46 -154 -93 187 -96 -158 199 6 132 12 -271
5129 -271 483 222 413 -50 -330 -57 -225 205 -569 -59 -176 287 -134 246 -406 -25 -238 377 -641 121
5149 121 450 -396 -274 232 5 -49 -506 -64 202 349 -469 -211 355 165 -13 -769 -419 -206 91 -504
5169 -504 299 -177 -11 143 415 -282 -174 414 76 79 -364 53 91 231 22 -628 1164 0 -288 -507
5189 -507 -41 86 410 101 30 377 -136 -179 -487 -35 -243 -492 183 127 450 -85 -139 -277 373 -178 -65
5210 -65 302 139 -543 -226 356 -144 -228 288 -264 -858 -78 12 663 216 -220 -211 195 32 294 398 -444 -247
5232 -247 -288 -361 -177 128 -100 -720 -484 -275 300 -923 81 367 -136 -30 -222 392 223 -214 123 75
5252 75 296 -116 79 -324 451 522 -80 73 -476 -80 -515 -363 -115 -128 102 -240 161 -201 -128 -34 263 -776
5274 -776 252 -499 -481 -411 -1 25 -507 -124 50 68 189 450 -30 -238 269 -159 -260 554 77 -112 793
5295 793 196 312 -275 422 190 -252 -508 -177 -116 -256 387 -292 187 -325 -457 -617 -61 8 434 211 -109
5316 -109 -449 -273 -83 -316 -106 54 -386 -199 460 -28 322 -172 -308 272 -85 -46 -8 256 -331 312 -248
5337 -248 487 492 -49 186 -127 659 -4 -363 355 -25 52 38 -6 -21 46 24 -310 -224 266 -343 70 -387 -203
5360 -203 -283 -328 -348 -78 -174 -227 21 -412 -29 225 8 -142 -142 163 -65 417 -44 216 211 250 499 -77 321
5383 321 462 -248 -210 -662 245 44 -149 -28 -208 -5 24 -83 -513 336 -224 565 -630 537 273 191
5403 191 420 37 28 809 61 231 149 -170 -162 -175 390 -173 167 157 159 319 -267 -244 -287 63 -304 470 -26 626
5427 626 635 465 278 82 255 -250 -642 -140 212 -140 221 -104 541 248 -559 359 -267 331 349 -146 -191
5448 -191 -539 221 -48 135 198 349 305 -443 -422 265 -152 -228 -49 -105 480 146 -127 -238 287 527 319 168
5470 168 -318 146 -24 102 69 -297 -186 -426 112 110 136 211 79 16 32 563 -613 -313 -447 -16 67 -239
5492 -239 -325 83 152 128 -483 -363 -16 319 573 159 2 270 -166 277 224 20 49 111 -20 -199 188 12
5514 12 451 -370 -125 -152 6 -417 486 -105 -43 61 299 -182 56 726 -236 -490 -69 495 409 65 405
5535 405 40 212 -400 295 -85 168 -484 208 -438 105 338 420 258 268 227 29 -240 137 912 -396 0
5556 0 203 337 308 -917 -564 -355 -278 341 207 -504 301 236 -173 -54 -63 425 567 200 210 417 -689 -67
5578 -67 156 -591 -164 198 -531 347 -325 55 -517 324 183 151 -458 179 -465 145 -229 -338 -230 11 61
5599 61 93 -489 -158 456 -69 -156 246 136 16 108 379 -408 437 126 -165 -323 -21 -23 1139 293 607 373
5621 373 -209 4 284 -326 -37 60 -480 169 182 51 262 152 254 249 258 -274 230 -187 451 -197 -274 -50
5643 -50 -683 -215 -158 366 36 -350 -240 135 280 -413 25 250 -268 299 19 -247 290 -399 -346 -10 223
5664 223 -314 -487 442 12 -143 38 -961 76 -269 -407 269 -75 -321 29 -7 -97 429 86 7 203 -123
5685 -123 -710 -12 -283 -167 638 261 -127 -704 45 -64 198 -166 -44 -92 -165 549 -348 -210 -329 -34 -342
5706 -342 -651 74 -490 -146 231 -237 -88 239 -398 -689 -214 -102 -387 52 -406 192 -220 -619 12 172
5726 172 -83 83 393 -381 -805 669 99 -197 209 950 -68 -386 24 114 0 114 453 103 -149 47
5746 47 237 -44 13 -78 160 187 -198 -129 62 -77 -90 114 76 269 13 201 -76 -189 -237 -309 510 117 -137
5769 -137 -426 295 -442 31 -109 359 550 86 206 -160 -146 8 -745 30 -247 -657 -479 -74 274 -452
5789 -452 704 9 410 81 -93 -371 -339 439 -395 -159 -415 -167 -40 -212 -39 164 -224 326 -46 -183
5809 -183 516 -98 -340 -133 178 -24 -136 752 355 -230 -90 -45 -311 -447 65 -295 -622 -40 7 -376 255
5830 255 -187 -251 264 524 67 -211 -85 313 -77 -353 -545 -37 -96 156 89 91 685 202 632 -6 639 -17
5852 -17 62 691 -15 -395 -282 382 12 -278 -260 -252 -247 452 134 -374 -7 -182 -124 246 448 388 -142 -136 -235 -110
5876 -110 -66 140 158 143 255 582 209 318 143 123 379 168 -217 -212 144 -689 54 -134 242 -140 28 -386
5898 -386 -130 662 65 357 240 528 -437 -389 107 215 30 -482 -454 89 311 113 -360 316 -403 -126 -245
5919 -245 -144 -42 102 -12 -269 -178 286 162 -490 -100 -77 142 115 -86 -123 -111 -393 -195 37 209 -103 -84
5941 -84 74 -9 -321 -128 -136 192 174 -82 -558 151 -608 -324 -308 -652 308 168 -199 -46 671 -219 -110 -293
5963 -293 -34 326 -337 -334 242 85 -391 249 333 -39 191 -84 257 67 186 96 -23 -69 67 300 168 329
5985 329 229 -278 137 18 202 -392 -558 -221 -341 -292 -124 -172 69 129 -446 -147 6 -166 -159 -164 252 350 256
6008 256 492 361 -259 48 277 -351 -176 250 369 -123 -173 -936 197 -292 106 -252 -55 -67 -63 -57 286 442
6030 442 -718 49 697 -230 125 -198 -564 -344 -267 -259 178 -19 -255 154 185 74 -299 -36 124 -122 -75
6051 -75 304 -212 300 -256 -143 -230 -343 23 92 -123 -7 217 118 425 107 -6 -30 180 -99 361 -611 -110
6073 -110 -516 390 638 384 -133 -300 12 368 564 514 179 128 61 -702 11 204 -260 -399 -405 -710 419
6094 419 -190 -49 40 368 193 -196 492 -96 68 -58 109 204 -105 -198 489 81 317 72 -204 -83 -680
6115 -680 -117 157 -11 -183 239 -371 -171 187 -28 542 -384 -98 267 -312 265 170 220 201 -99 -192 605
6136 605 186 133 450 -683 2 -90 597 -53 372 -142 -305 -328 -131 20 -52 -881 669 -227 313 -364 -496
6157 -496 285 127 -105 -218 -78 4 260 266 318 493 332 -499 -41 -687 540 -194 496 -49 -280 -492 495
6178 495 595 -126 -469 -113 -195 -396 263 -375 746 206 279 126 149 -103 -434 -437 210 72 -121 419 -603
6199 -603 -9 -74 608 143 -61 156 -357 -205 292 -393 -36 52 398 55 321 76 -21 221 138 -72 83
6220 83 -341 -79 236 -716 -329 53 -279 289 -364 -366 371 66 255 -649 -173 -389 -452 -41 378 -326 -104
6241 -104 -237 107 129 -540 -339 367 -294 -15 6 -237 221 -269 -234 49 91 -20 -123 278 113 458 -232
6262 -232 -115 240 77 15 68 -837 -150 -307 819 -527 -95 -5 184 -298 470 88 64 248 -187 -172 417
6283 417 -136 169 -327 -230 -276 -482 119 56 -314 40 4 210 36 -685 -764 -340 961 -118 -380 306 567
6304 567 -382 146 -571 -21 -342 -219 400 -343 341 315 34 151 42 274 170 -48 347 -182 245 -662
6324 -662 63 486 523 -145 211 -78 -166 166 -260 -118 -224 -343 -137 277 -188 -23 166 -375 370 -248 -459
6345 -459 -82 -142 -5 179 -1 -397 -224 272 257 354 -75 -204 489 240 -29 9 159 -57 658 220 421
6366 421 -304 72 -139 1 452 -868 88 -72 404 367 13 -311 -97 -7 -307 -172 -254 56 -321 550 367
6387 367 -10 422 247 -177 68 -180 28 -27 547 91 -390 -490 522 -56 -54 144 224 -186 171 131 405
6408 405 -29 14 -197 364 -138 -139 466 -275 -297 105 -336 -186 -354 -675 -133 113 -15 -42 270 100 190 -187
6430 -187 -667 19 135 -357 107 -391 6 23 -355 116 32 30 -258 -359 148 278 -52 -305 685 -135 166
6451 166 -1 -20 362 -381 -867 -11 -305 -193 23 8 -189 -377 -72 408 67 -221 -341 -140 148 350 -54
6472 -54 -303 173 83 -202 100 -298 352 531 -185 267 -153 -215 36 -48 -240 229 -235 183 545 -83 247
6493 247 159 399 -82 139 -116 -16 -516 595 -227 94 66 -318 202 386 437 -94 101 250 230 490 -320
6514 -320 328 -184 316 -18 -411 682 143 -589 -86 -497 -574 -41 -269 -245 -153 -249 335 -261 48 -258 -347
6535 -347 -83 -499 133 -259 -129 -196 55 -266 -96 194 -579 18 -280 -13 -525 -372 -287 -194 236 -190 -153
6556 -153 -375 264 11 -60 -135 -89 148 518 -488 -180 -148 -134 27 -456 -253 80 -171 233 -402 -467 393 -394
6578 -394 309 80 -684 348 -137 758 303 -85 -331 536 -44 -320 -91 -764 -698 -82 -317 -543 -1 -52
6598 -52 -348 -39 -539 254 -146 -11 408 16 -262 -17 403 8 -380 138 -231 -272 271 -224 14 169 74
6619 74 -303 666 -258 -334 82 -442 -103 -47 96 -361 -262 444 -139 103 -409 -271 78 817 332 220 59
6640 59 -234 -47 -441 497 131 392 500 -290 499 72 115 -409 233 352 -366 318 -318 -450 94 318 -357
6661 -357 -130 -156 173 -46 -642 179 -394 -132 -78 91 -457 137 -93 -539 -410 -43 -261 -70 172 -271 -5
6682 -5 150 81 73 191 -238 -207 63 68 319 121 -155 -7 692 -32 373 44 160 -116 -234 97 -110 625 88
6705 88 386 -336 -347 152 300 -150 96 413 400 -437 -253 -182 218 -133 272 73 -38 -250 223 -57 175
6726 175 622 133 -130 -402 97 202 169 95 314 -206 -359 -236 186 531 719 -308 75 505 176 -190
6746 -190 -263 17 -722 -18 -133 378 -177 379 -279 249 29 -234 -239 298 245 -92 448 7 673 -81 -125 575
6768 575 103 27 -152 -524 177 -7 139 -202 -605 -502 327 287 -322 65 205 83 80 27 214 -111 -171 474
6790 474 513 -427 454 -38 -229 -218 142 -6 740 -136 -64 -94 -53 217 756 314 8 -712 -572 -229 -541 188
6812 188 385 164 -198 -13 -735 235 -185 -51 233 -604 69 4 240 -91 -88 -262 22 -591 492 -252 41
6833 41 -41 -82 105 206 -138 -148 385 -33 641 -390 124 12 144 -197 -230 355 672 -294 392 210 78
6854 78 122 -213 295 363 128 -4 -415 -40 96 53 393 -111 -272 -215 401 121 199 -81 145 484 -83 -384
6876 -384 -5 -374 -316 -63 661 143 168 -141 -278 198 334 -251 -159 330 -329 -271 -627 1 30 259 475 -183
6898 -183 281 104 335 -178 595 -273 311 80 25 229 -60 -28 208 -255 -343 182 -333 -94 87 -216 181
6919 181 -19 377 -80 282 -292 -187 -477 -128 361 52 -47 -215 -44 -136 -178 307 -297 69 -238 329 -575
6940 -575 -18 -592 471 -70 -160 24 -414 -200 -558 -506 -308 324 -100 -352 -328 342 -52 -162 -121 142 317
6961 317 -166 279 -125 -197 323 -164 -157 -907 634 13 269 -269 84 754 -206 -295 -405 -294 289 308 288 419
6983 419 159 727 -89 -43 342 -13 -377 177 -110 -116 -120 -229 -147 -337 87 -24 -164 -718 -28 -57 142 559
7005 559 -328 346 105 104 339 -221 -363 49 90 54 -264 69 -412 37 405 182 -282 -62 981 -90 293
7026 293 -5 -171 169 175 299 -289 -380 297 -642 -473 -443 1042 434 384 -423 177 -266 -283 -79 568 154 284
7048 284 193 -238 48 -274 418 355 385 192 91 164 -315 174 55 256 -151 -224 -354 44 1 130 144 245
7070 245 -519 -336 169 362 -135 -72 49 -395 -7 -195 -339 349 -48 -11 -65 136 418 76 545 62 426
7091 426 -103 -1 -394 72 358 63 603 116 -757 47 -309 -403 -653 175 -300 -171 -18 -163 -185 41 109
7112 109 92 174 -448 -89 217 -47 -66 205 206 -195 199 275 497 160 -70 832 -74 -483 108 -81 181 575
7134 575 -198 592 -24 111 120 288 304 -209 -67 163 -72 598 -132 -77 -458 57 -231 -69 184 -351 460
7155 460 -304 124 215 109 -312 -331 73 546 272 -234 -291 -58 -97 -198 79 315 -469 197 -182 48 -380
7176 -380 466 -306 -131 -43 -612 453 455 4 188 -239 -47 44 181 -202 -185 233 347 -713 -212 -76 342
7197 342 412 -370 472 35 190 135 715 -265 241 176 -155 71 124 235 192 323 52 -141 246 3 653 -93
7219 -93 333 -242 -241 -197 337 33 11 -260 70 -167 -246 -3 -41 560 -162 -135 117 -752 -12 -93 -278 46 -428
7242 -428 -162 -191 -71 137 178 -916 209 409 -532 -48 681 77 -397 -187 -67 63 222 70 -554 -51
7262 -51 176 -125 588 -44 -126 96 -385 5 183 -188 21 270 -43 440 -129 -92 174 -365 -168 -251 -63
7283 -63 352 -171 -164 435 -19 192 -208 -228 -37 346 -200 -178 -407 37 -64 -101 -176 364 83 -172 -473 -544 -93
7306 -93 -208 -759 467 541 16 -307 50 -191 -36 -334 -218 132 -105 191 -551 -653 -1264 100 166 -362
7326 -362 287 -60 -305 -481 -22 1 482 150 -323 158 367 255 405 -533 -339 -285 2 34 -135 318 -61
7347 -61 311 -288 -84 106 415 81 288 412 250 -255 -291 -64 9 -291 386 467 175 -251 194 -39 479
7368 479 -598 -55 -9 314 198 14 -223 53 -414 58 239 385 -10 -81 -513 -276 203 392 -164 180
7388 180 178 -191 220 138 65 -377 -66 -26 -222 -133 -382 -138 -140 -133 197 82 54 189 -252 2 282 -35 -154 192
7412 192 -584 -42 -474 -289 -30 30 158 942 -310 -489 533 -28 -67 -346 171 651 -413 -540 -181 399
7432 399 -374 541 -257 -111 -209 471 155 -260 -126 -269 174 -367 9 341 53 -167 465 -316 -454 -192
7452 -192 185 -542 -452 671 -40 200 -128 529 219 -203 -343 -21 -58 -762 -61 -335 115 166 187 -75 9
7473 9 346 132 -892 -271 305 -428 -161 150 433 -164 -292 288 353 294 -58 514 -226 13 -65 -625 -433
7494 -433 283 -296 -328 111 -454 -127 69 122 27 -325 -56 76 -189 -75 -242 -439 -372 39 266 -738 -102
7515 -102 10 547 -21 -42 -251 176 313 -531 -168 -161 213 205 -82 317 160 307 28 -439 -295 141 -47 -60
7537 -60 237 -97 -15 93 100 -96 54 -194 -42 86 37 297 427 195 -29 -154 123 284 474 678 -379
7558 -379 20 226 -336 -158 -314 18 535 51 -776 124 185 -303 -220 178 -258 189 -352 -210 -108 236 603
7579 603 52 -378 419 -175 278 372 183 -288 387 394 708 349 325 147 299 273 -302 -137 45 -111 655 12
7601 12 -149 16 110 212 -420 405 -69 337 221 34 82 -9 544 -224 -59 -599 74 614 437 144 -3
7622 -3 263 53 -220 339 135 125 -7 34 393 548 47 -288 -91 -304 -434 -73 -277 391 293 142 -167 -322
7644 -322 -636 -131 65 283 149 247 332 93 32 -377 361 -115 -232 -89 -482 244 384 -278 -184 27 245
7665 245 565 -234 119 332 269 1 -348 414 248 -49 -523 623 -227 354 -236 -292 10 12 -145 -537 -563
7686 -563 -38 -617 12 -178 -307 265 13 358 -268 -116 -23 -107 -127 188 521 -131 78 30 612 -126 -463
7707 -463 -148 -53 149 86 183 -160 -218 -88 138 130 -603 336 459 -179 191 -182 65 134 -55 -502 -108 -629
7729 -629 475 245 413 123 -562 -31 110 -111 197 -193 125 -634 -661 817 64 152 -276 -52 164 546
7749 546 -48 65 147 118 -51 -74 144 262 -772 90 454 245 139 -669 171 36 -72 -2 -215 384 -34
7770 -34 1 -331 275 -268 63 -545 -174 72 234 -197 -160 72 -150 500 -10 -101 -391 -261 165 459 -181
7791 -181 -48 -524 70 -145 89 -387 7 -569 197 252 -212 165 -41 81 -90 87 255 -363 -43 -29 32
7812 32 107 275 475 310 584 -158 -188 146 230 332 -112 143 -173 414 -139 -125 218 -246 -192 -153 -363 -235
7834 -235 -25 -57 328 -185 -62 32 154 -327 525 -186 -359 164 -61 -143 151 -596 232 482 -207 -624 -158
7855 -158 -149 -257 -205 168 -213 57 223 -209 -287 144 -168 104 -130 -817 257 44 297 261 -303 -249 -136 415
7877 415 -44 361 220 -213 105 -399 -87 -159 161 608 287 -116 513 -161 -357 431 -827 -149 102 -289
7897 -289 -54 -299 -216 -225 -581 -623 4 87 -127 -145 -542 -414 -917 -182 -408 17 212 -375 -316 8 275 168
7919 168 -72 -549 722 -198 -704 536 219 13 -188 -28 139 -85 160 -73 -115 19 37 177 225 391
7939 391 537 227 -32 -221 -281 601 15 204 168 -102 350 87 -250 -33 143 -472 -48 135 -207 -419 188
7960 188 -96 -218 129 -77 -411 -816 458 451 297 210 -349 -204 -33 270 -7 196 -66 -68 440 -550 -310
7981 -310 -618 -425 -40 229 33 -291 -13 -616 -68 9 -102 111 -498 222 392 -277 416 408 -255 43 23
8002 23 236 283 329 -38 725 -26 178 -249 -320 480 179 106 -45 -180 9 37 143 190 -531 93 171 412 -67
8025 -67 -397 179 299 31 511 420 207 61 167 -267 -319 69 -71 -333 -263 -117 205 -59 -340 -201 -210 -37
8047 -37 -32 -41 -103 -456 -147 600 9 -264 17 -16 -635 -48 504 -153 13 412 262 -828 393 -458 258 303
8069 303 -288 148 -350 -23 -45 270 357 -76 -125 -93 35 -923 -542 -118 301 418 134 156 -453 260 271 225
8091 225 170 150 114 214 172 -88 -487 -188 16 -585 -369 108 468 -546 -89 445 85 -100 -111 16 266
8112 266 -93 347 -121 -243 249 -89 -221 470 302 73 379 197 169 -115 474 1 -160 -235 245 -338 -132
8133 -132 -185 115 406 222 399 165 179 -166 278 146 602 91 -329 -129 180 335 -262 177 -414 -343 90
8154 90 -421 311 708 -157 -82 -200 247 175 -65 138 -343 41 -218 -271 -145 22 -224 224 -300 22 55 196
8176 196 -305 -203 99 -43 95 210 66 466 -564 559 -79 723 -101 346 259
8191B59
##END NTUPLES=NMR FID
##END=
