##TITLE=1H_K-349/2-1
 CDCl3,8 sc, 
 1.10.2021
##JCAMPDX= 6.0         $$ Bruker NMR JCAMP-DX V2.0
##DATA TYPE= NMR FID
##DATA CLASS= NTUPLES
##ORIGIN= UXNMR, Bruker Analytische Messtechnik GmbH
##OWNER= root
$$ XWIN-NMR		Version 3.5
$$ Fri Oct  1 12:34:16 2021 Russian Standard Time (UT+4h)  she@DPX200
##.OBSERVE FREQUENCY= 200.1313468511
##.OBSERVE NUCLEUS= ^1H
##.DELAY= (6, 6)
##.ACQUISITION MODE= SIMULTANEOUS
##.ACQUISITION SCHEME= undefined
##.AVERAGES= 8
##.DIGITISER RES= 18
##SPECTROMETER/DATA SYSTEM= spect
##.PULSE SEQUENCE= zg30
##.SOLVENT NAME= CDCl3
##.SHIFT REFERENCE= (INTERNAL, CDCl3, 0, 15.7039)
##AUDIT TRAIL= $$ (NUMBER, WHEN, WHO, WHERE, WHAT)
$$ ##TITLE= Audit trail, XWIN-NMR		Version 3.5
$$ ##JCAMPDX= 5.01
$$ ##ORIGIN= Bruker BioSpin GmbH
$$ ##OWNER= she
$$ F:/spectra/data/she/nmr/H-F/1/audita.txt
$$ ##AUDIT TRAIL=  $$ (NUMBER, WHEN, WHO, WHERE, WHAT)
(   1,<2021-10-01 12:32:53.25 +0400>,<she>,<DPX200>,
      <created by zg, POWCHK disabled, PULCHK disabled
       configuration hash MD5:
       00 E9 B6 7A A2 85 ED C7 34 08 36 98 17 FE 4E 26
       data hash MD5: 16K
       B9 46 74 B9 93 93 42 2F F6 04 45 CA 6F 4B 92 4F>)
$$ ##END=
$$ 
$$ hash MD5
$$ 66 59 02 6B ED B0 4D 01 4D 12 9D 7C C4 89 87 7B
##$RELAX= 
##$RELAX= 
##$RELAX= 
##$RELAX= 
##$RELAX= 
##$RELAX= 
$$ Bruker specific parameters
$$ --------------------------
##$DU= <F:/spectra>
##$EXPNO= 1
##$NAME= <H-F>
##$PROCNO= 1
##$TYPE= <nmr>
##$USER= <she>
##$AMP= (0..31)
100 100 100 100 100 100 100 100 100 100 100 100 100 100 100 100 100 100 
100 100 100 100 100 100 100 100 100 100 100 100 100 100 
##$AQSEQ= 0
##$AQ_mod= 1
##$AUNM= <au_zg>
##$AUTOPOS= <>
##$BF1= 200.13
##$BF2= 200.13
##$BF3= 200.13
##$BF4= 200.13
##$BF5= 200.13
##$BF6= 200.13
##$BF7= 200.13
##$BF8= 200.13
##$BYTORDA= 1
##$CFDGTYP= 0
##$CFRGTYP= 5
##$CHEMSTR= <none>
##$CNST= (0..31)
1 1 145 1 1 1 1 1 1 1 1 1 1 1 1 1 1 1 1 1 1 1 1 1 1 1 1 1 1 1 1 1 
##$CPDPRG= <>
##$CPDPRG1= <>
##$CPDPRG2= <>
##$CPDPRG3= <>
##$CPDPRG4= <mlev>
##$CPDPRG5= <mlev>
##$CPDPRG6= <mlev>
##$CPDPRG7= <mlev>
##$CPDPRG8= <mlev>
##$CPDPRGB= <>
##$CPDPRGT= <>
##$D= (0..31)
0 1.2 0 0 0 0 0 0 0 0.06 0 0.03 0 0 0 0 0.0002 0 0 0 0 0 0 0 0 0 0 0 0 
0 0 0 
##$DATE= 1633077172
##$DBL= (0..7)
120 120 120 120 120 120 120 120 
##$DBP= (0..7)
150 150 150 150 150 150 150 150 
##$DBP07= 0
##$DBPNAM0= <>
##$DBPNAM1= <>
##$DBPNAM2= <>
##$DBPNAM3= <>
##$DBPNAM4= <>
##$DBPNAM5= <>
##$DBPNAM6= <>
##$DBPNAM7= <>
##$DBPOAL= (0..7)
0.5 0.5 0.5 0.5 0.5 0.5 0.5 0.5 
##$DBPOFFS= (0..7)
0 0 0 0 0 0 0 0 
##$DE= 6
##$DECBNUC= <off>
##$DECIM= 32
##$DECNUC= <off>
##$DECSTAT= 4
##$DIGMOD= 1
##$DIGTYP= 9
##$DL= (0..7)
0 120 120 120 120 120 120 120 
##$DP= (0..7)
150 150 150 150 150 150 150 150 
##$DP07= 0
##$DPNAME0= <>
##$DPNAME1= <>
##$DPNAME2= <>
##$DPNAME3= <>
##$DPNAME4= <>
##$DPNAME5= <>
##$DPNAME6= <>
##$DPNAME7= <>
##$DPOAL= (0..7)
0.5 0.5 0.5 0.5 0.5 0.5 0.5 0.5 
##$DPOFFS= (0..7)
0 0 0 0 0 0 0 0 
##$DQDMODE= 0
##$DR= 18
##$DS= 0
##$DSLIST= <SSSSSSSSSSSSSSS>
$$ [...]
##$SUBNAM2= <"">
##$SUBNAM3= <"">
##$SUBNAM4= <"">
##$SUBNAM5= <"">
##$SUBNAM6= <"">
##$SUBNAM7= <"">
##$SUBNAM8= <"">
##$SUBNAM9= <"">
##$SW= 18.0517286264689
##$SWIBOX= (0..15)
0 0 2 0 0 0 0 0 0 0 0 0 0 0 0 0 
##$SW_h= 3612.71676300578
##$TD= 16384
##$TD0= 1
##$TE= 0
##$TE2= 300
##$TE3= 300
##$TEG= 300
##$TL= (0..7)
0 120 120 120 120 120 120 120 
##$TP= (0..7)
150 150 150 150 150 150 150 150 
##$TP07= 0
##$TPNAME0= <>
##$TPNAME1= <>
##$TPNAME2= <>
##$TPNAME3= <>
##$TPNAME4= <>
##$TPNAME5= <>
##$TPNAME6= <>
##$TPNAME7= <>
##$TPOAL= (0..7)
0.5 0.5 0.5 0.5 0.5 0.5 0.5 0.5 
##$TPOFFS= (0..7)
0 0 0 0 0 0 0 0 
##$TUNHIN= 0
##$TUNHOUT= 0
##$TUNXOUT= 0
##$USERA1= <user>
##$USERA2= <user>
##$USERA3= <user>
##$USERA4= <user>
##$USERA5= <user>
##$V9= 5
##$VALIST= <valist>
##$VCLIST= <CCCCCCCCCCCCCCC>
##$VD= 0
##$VDLIST= <DDDDDDDDDDDDDDD>
##$VPLIST= <PPPPPPPPPPPPPPP>
##$VTLIST= <TTTTTTTTTTTTTTT>
##$WBST= 1024
##$WBSW= 4
##$XGAIN= (0..3)
0 0 0 0 
##$XL= 0
##$YL= 0
##$YMAX_a= 170091
##$YMIN_a= -81594
##$ZGOPTNS= <>
##$ZL1= 120
##$ZL2= 120
##$ZL3= 120
##$ZL4= 120
##$ABSF1= 10
##$ABSF2= 0
##$ABSG= 5
##$ABSL= 3
##$ALPHA= 0
##$AQORDER= 0
##$ASSFAC= 0
##$ASSFACI= 0
##$ASSFACX= 0
##$ASSWID= 0
##$AUNMP= <proc_1d>
##$AZFE= 0.1
##$AZFW= 0.1
##$BCFW= 1
##$BC_mod= 2
##$BYTORDP= 1
##$COROFFS= 0
##$CY= 11.3945322036743
##$DATMOD= 1
##$DC= 2
##$DFILT= <>
##$DTYPP= 0
##$F1P= 2.36226072786647
##$F2P= -0.459571619588291
##$FCOR= 0.5
##$FTSIZE= 0
##$FT_mod= 4
##$GAMMA= 1
##$GB= 0.15
##$INTBC= 1
##$INTSCL= 1
##$ISEN= 128
##$LB= 0.24
##$LEV0= 0
##$LPBIN= 0
##$MAXI= 10000
##$MC2= 0
##$MEAN= 0
##$ME_mod= 0
##$MI= 1.114404
##$NCOEF= 0
##$NC_proc= 0
##$NLEV= 6
##$NOISF1= 3.799351
##$NOISF2= 2.8
##$NSP= 1
##$NTH_PI= 0
##$NZP= 0
##$OFFSET= 15.70392
##$PC= 1
##$PHC0= -14797.77
##$PHC1= 14.40082
##$PH_mod= 1
##$PKNL= yes
##$PPARMOD= 0
##$PSCAL= 0
##$PSIGN= 0
##$REVERSE= no
##$SF= 200.130013532006
##$SI= 16384
##$SIGF1= 3
##$SIGF2= 2
##$SINO= 400
##$SIOLD= 16384
##$SREGLST= <1H.CDCl3>
##$SSB= 0
##$STSI= 0
##$STSR= 0
##$SW_p= 3612.71676300578
##$SYMM= 0
##$S_DEV= 0
##$TDeff= 0
##$TDoff= 0
##$TI= <>
##$TILT= no
##$TM1= 0
##$TM2= 0
##$TOPLEV= 0
##$USERP1= <user>
##$USERP2= <user>
##$USERP3= <user>
##$USERP4= <user>
##$USERP5= <user>
##$WDW= 1
##$XDIM= 8192
##$YMAX_p= 0
##$YMIN_p= 0
$$ End of Bruker specific parameters
$$ ---------------------------------
##NTUPLES= NMR FID
##VAR_NAME=  TIME,          FID/REAL,        FID/IMAG
##SYMBOL=    X,             R,               I
##VAR_TYPE=  INDEPENDENT,   DEPENDENT,       DEPENDENT
##VAR_FORM=  AFFN,          ASDF,            ASDF
##VAR_DIM=   8192,          8192,            8192
##UNITS=     SECONDS,       ARBITRARY UNITS, ARBITRARY UNITS
##FACTOR=    0.0002768,     1,               1
##FIRST=     0,             0,               0
##LAST=      2.2672688,     0,               0
##MIN=       0,             -81594,          0
##MAX=       2.2672688,     170091,          0
$$ Real data points
##PAGE= N=1
##DATA TABLE= (X++(R..R)), XYDATA
$$ plain form
0 0 0 0 0 0 0 0 0 0 0 0 0 0 0 8 -8 8 -8 8 -16 16 -16 24 -25 32 -40 45 -51 61 -70 80 -89 104 -117 133 -149
35 -149 169 -189 213 -237 265 -294 326 -365 404 -446 493 -544 599 -659 729 -802 883 -974
53 -974 1074 -1187 1316 -1460 1625 -1818 2047 -2321 2657 -3082 3635 -4394 5505 -7286 10639
68 10639 -19221 95732 170091 111002 135688 79017 32767 -5179 -26029 -68099 -75702 -66813
80 -66813 -72037 -81594 -43202 -21525 -19221 -10737 7077 12338 8876 2614 12947 10747 7641 16220
94 16220 12182 -911 852 1439 -450 -10827 -10961 746 -2948 -6585 7321 12387 13182 17636 22723
109 22723 18749 4560 3078 1416 -18075 -17696 -4588 -11012 -11550 3116 8695 8185 13595 22895 17409
124 17409 4255 5971 -2152 -18553 -19392 -22076 -24600 -17713 -11729 -5192 -1838 3155 14750 15516 12539
$$ packed form
0@%%%%%%%%%%%%%Qj6J6j6J6k4L2l2M0m9N7p2Q5r6J12j31J50j69J93k21K50k82
35a49L18l58M02m50N02n59O20o91P69q50R39j037J143j258J388j531J685j857
53i74K048k261K503k776L085l443L865m368M978n739O717q029R899j2791J7925
68A0639k9860J14953P4359n9089K4686n6671m6250l7946k0850m2070p603Q889
80f6813n224r557L8392K1677K304Q484J7814N261l462o262J0333k200l106Q579
94A6220m038j3093J763N87j889j0377j34J1707l694l637J3906N066P95M454N087
109B2723l974j4189j482j662j9491L79J3108o424n38J4666N579n10N410R300n486
124A7409j3154J716q123j6401q39k684k524O887N984O537L354M993J1595P66k977
$$ plain form
139 12539 13176 8167 4739 -1543 -12509 -12465 -10694 -10344 -6323 -7878 -5830 1170 4332 7111 4474 7025
155 7025 17884 13902 8422 11459 9281 10506 11527 5218 1059 -1596 -1954 -6838 -15922 -12793 -8520
170 -8520 -10715 -7685 -7978 -8242 -1400 -1115 -2861 -1372 -1581 704 -1740 -5550 -3152 -4634 -1983 1023
186 1023 -2645 1510 5464 2458 3182 4371 6078 7475 4662 5457 4472 1832 5888 3356 -220 5136
202 5136 3822 215 191 -2200 -1994 -2993 -3664 -2243 -5443 -4579 -1955 -6243 -4383 -1231 -3232 -394 216
219 216 -365 1020 -1640 -844 -310 -2818 -2024 -4892 -5781 -2177 -3901 -3477 307 679 5113 6773 4572
236 4572 6530 6992 7392 5803 1080 3235 2992 -769 911 -1221 -2179 2739 1330 -1499 -2292 -1612 -569
253 -569 -4775 -6811 -3917 -6104 -5148 -2943 -5356 -2279 1237 382 991 578 2580 2615 -1361 -266 -284
$$ packed form
139A2539O37n009l428o282j0966M4J771L50M021j555K048P000L162K779k637K551
155G025J0859l982n480L037k178J225J021o309m159k655l58m884r084L129M273
170h520k195L030k93k64O842K85j746J489k09K285k444l810K398j482K651L006
186A023l668M155L954l006P24J189J707J397k813P95r85k640M056k532l576N356
202E136j314l607k4k391K06r99o71J421l200Q64K624m288J860L152k001K838O10
219B16n81J385k660P96N34k508P94k868q89L604j724M24L784L72M434J660k201
236D572J958M62M00j589m723K155k43l761J680k132r58M918j409k829p93O80J043
253e69m206k036K894k187R56K205k413L077L516q55O09m13K002L5l976J095j8
$$ plain form
270 -284 -1933 692 -1651 -3097 390 -57 397 432 -538 2814 2477 1199 3162 2552 4213 4553 1533
287 1533 3880 4139 2042 2996 661 -345 1337 -1003 -1900 -3333 -3535 -1557 -4812 -5171 -2155 -4256
303 -4256 -3651 -1262 -3063 -1403 -854 -1329 -1472 -3205 -550 -266 -4135 -856 478 -1090 1605 1325 1887
320 1887 4647 3982 4171 3384 2181 4377 1350 6 2283 1627 2430 2191 52 1488 1427 -412 -1003
337 -1003 -3514 -3290 -3067 -5585 -4068 -3692 -2710 1232 -470 -195 2698 755 -150 -1271 -3379 -2069 -3515
354 -3515 -3953 -3032 -3671 189 2147 733 4205 5693 4380 4478 3120 2776 2484 1254 1770 9 -283
371 -283 2697 731 -223 2320 822 632 -443 -2704 -1897 -2519 -2841 -2035 -3212 -485 432 -1959 -544
388 -544 -583 -1174 -447 -2470 -3113 -1241 -1690 -1049 -933 356 3497 2497 2266 2855 716 1592 941 -2438
$$ packed form
270b84j649K625k343j446L487m47M54L5r70L352l37j278J963o10J661L40l020
287A533K347K59k097R54k335j006J682k340q97j433k02J978l255l59L016k101
303d256O05K389j801J660N49m75j43j733K655K84l869L279J334j568K695k80N62
320A887K760o65J89p87j203K196l027j344K277o56Q03k39k139J436o1j839n91
337a003k511K24K23k518J517L76R82L942j702K75K893j943r05j121k108J310j446
354c515m38R21o39L860J958j414L472J488j313R8j358l44k92j230N16j761k92
371b83K980j966r54K543j498j90j075k261Q07o22l22Q06j177K727R17k391J415
388e44l9n91P27k023o43J872m49O41J16J289L141j000k31N89k139Q76o51l379
$$ plain form
406 -2438 -1186 -1134 -2062 -1817 -3023 -97 1370 1055 3379 3280 3647 5912 3547 2865 3912 2729 2270 105
424 105 -1595 -1626 -3384 -3592 -3138 -4677 -1593 -930 -3160 -1670 -902 -572 339 -1228 -725 -801 -2364 -1391
442 -1391 -3058 -2577 36 -947 -977 575 319 2330 2609 3095 5710 6032 6964 6221 4054 4779 3806 907
460 907 671 -1663 -3301 -3572 -5903 -5555 -3770 -2581 -625 -1205 -692 1254 -720 -1301 -1606 -3806 -2531
477 -2531 -3344 -5195 -3265 -1948 197 2610 3263 7086 7711 5987 6511 3736 2118 1873 -1901 -3717
493 -3717 -4053 -4853 -3969 -4231 -3157 255 -24 1681 2001 40 1881 2072 1203 2463 3046 3934 4177 2518
511 2518 3089 2408 986 868 -2463 -3953 -3186 -5541 -5393 -4121 -3491 -580 -27 -229 860 288 35 -915
529 -915 -3189 -1874 -2165 -3245 -982 -1024 1183 4516 4812 6115 6608 6036 5716 2602 1112 1447 -916
$$ packed form
406b438J252N2r28K45j206K926J467l15K324r9L67K265k365o82J047j183m59k165
424A05j700l1j758k08M54j539L084O63k230J490P68L30R11j567N03p6j563R73
442a391j667M81K613r83l0J552k56K011K79M86K615L22R32p43k167P25r73k899
460I07k36k334j638k71k331L48J785J189J956n80N13J946j974n81l05k200J275
477b531q13j851J930J317K145K413O53L823O25j724N24k775j618k45l774j816
493c717l36q00Q84k62J074L412k79J705L20j961J841J91q69J260N83Q88K43j659
511B518N71o81j422j18l331j490P67k355J48J272O30K911N53k02J089n72k53r50
529i15k274J315k91j080K263m2K207L333K96J303M93n72l20l114j490L35k363
$$ plain form
546 -916 -1211 -1375 -2485 -1128 -746 -1572 -721 -799 50 -1067 -3644 -2702 -2601 -2578 -740 -1196 29 2145 1005
565 1005 956 678 133 838 -1149 -1752 -1410 -2552 -1049 -823 -1244 1835 2213 1925 2458 1503 1972 2078 836
584 836 1057 958 771 1790 14 725 1912 766 489 -660 -1912 -1314 -3299 -3565 -2954 -3228 -952 -461
602 -461 -1018 1669 2248 2236 2921 1814 1617 1415 -599 -1632 -2390 -2189 -1685 -2994 -2511 -1033 -1829 -352
620 -352 -296 -1085 1388 1351 1011 1348 1160 2559 2573 1660 2848 2475 2042 2322 -47 -404 -81 -1519 -1708 -2496
640 -2496 -2302 -923 -1952 -1625 -750 -792 836 943 -662 748 547 143 224 -846 118 -45 -1267 -724
658 -724 -1581 -1037 -162 -1426 -765 425 -341 624 545 335 1871 1496 1526 1753 1256 2500 2175 686 1726
677 1726 1011 420 210 -1431 -733 -1055 -2107 -1752 -2493 -2190 -916 -2051 -1677 -820 -894 215 -192 -687 515
$$ packed form
546i16k95j64j110J357L82q26Q51p8Q49j117k577R42J01K3J838m56J225K116j140
565A005m9k78n45P05j987o03L42j142J503K26m21L079L78k88N33r55M69J06j242
584H36K21r9j87J019j776P11J187j146k77j149j252N98j985k66O11k74K276M91
602d61n57K687N79j2O85j107j97k02k014j033p58K01N04j309M83J478p96J477
620c52N6p89K473l7l40L37j88J399J4r13J188l73m33K80k369l57L23j438j89p88
640b496J94J379j029L27Q75m2J628J07j605J410k01m04Q1j070R64j63j222N43
658g24q57N44Q75j264O61J190p66R65p9k10J536l75L0K27m97J244l25j489J040
677A726p15n91k10j641O98l22j052L55p41L03J274j135L74Q57p4J109m07m95J202
$$ plain form
696 515 520 463 626 -65 1170 732 -162 686 194 329 859 -519 22 934 405 626 -186 368 1140 184 531
717 531 193 -521 953 103 -853 41 98 -216 -369 -1159 -108 -127 -781 40 -976 -83 1034 -530 -184
736 -184 570 -56 560 -712 -954 -381 -1105 -327 -165 -1288 509 31 -382 442 133 419 514 -479 64 531
756 531 394 1049 218 1266 1804 703 924 927 139 497 -281 -1315 -846 -1090 -1035 -1064 -1698 169 -6 -277
776 -277 369 -217 169 540 -877 -665 -575 -880 -427 -1138 -445 491 42 529 260 85 1218 263 -158 641
796 641 351 923 958 641 1430 1622 1088 1592 -55 608 649 -683 -722 -1115 -1261 -254 -1047 -762 144 -156
816 -156 380 -167 -1073 -218 -732 -1471 -1376 -1560 -578 -209 -688 330 876 1308 1422 733 1146 1689 682 740
836 740 414 -115 929 -80 -172 776 305 501 7 -331 -37 -512 -900 -432 -1203 -201 559 -177 162 321
$$ packed form
696E15Nn7J63o91J235m38q94Q48m92J35N30j378N41R12n29K21q12N54P72r56L47
717E31l38p14J474q50r56Q94N7l14j53p90J051j9o54Q21j016Q93J117j564L46
736a84P54o26O16j272k42N73p24P78J62j123J797m78m13Q24l09K86R5r93N43M67
756E31j37O55q31J048N38j101K21Lp88L58p78j034M69k44N5k9o34J867j75k71
776b77O46n86L86L71j417K12R0l05M53p11O93R36m49M87k69j75J133r55m21P99
796F41k90N72L5l17P89J92n34N04j647O63M1j332l9l93j46J007p93K85R06l00
816a56N36n47r06Q55n14p39R5j84R82L69m79J018N46M32J14o89M13N43j007N8
836G40l26n29J044j009r2R48m71J96m94l38K94m75l88M68p71J002P60p36L39J59
$$ plain form
856 321 594 856 24 313 440 -283 -272 -673 -1014 276 -41 130 746 326 1002 462 -458 125 -771 -992
876 -992 -762 -2238 -1349 -621 -641 -77 538 1060 1539 1012 1288 1544 1025 1224 777 -21 1058 393 145 680
896 680 107 909 647 -402 -205 -833 -850 -990 -2210 -1527 -1143 -1737 -915 -1329 -1404 -290 -356 -239 152 166 694
917 694 389 20 1317 1404 1755 1748 1368 1942 1962 1079 984 51 161 -122 -1762 -1500 -1436 -1432 -532 -569 -436 695
939 695 349 313 225 -103 514 -307 -936 -267 -1018 -239 -75 -421 791 1095 613 1108 303 288 552 -550 -687
960 -687 -546 -658 -217 -559 -850 -64 -92 131 395 -237 735 481 -1 336 109 835 1097 321 684 811 337
981 337 614 -250 -337 48 -589 -806 -550 -775 338 -276 -88 644 131 292 -146 -1208 -879 -950 -1191 -951
1001 -951 -1530 -438 203 -98 481 892 752 1169 498 124 818 202 62 215 -165 692 503 126 692 431
$$ packed form
856C21K73K62q32K89J27p23J1m01l41J290l17J71O16m20O76n40r20N83q96k21
876i92K30j476Q89P28k0N64O15N22M79n27K76K56n19J99m47p98J079o65k48N35
896F80n73Q02k62j049J97o28j7j40j220O83L84n94Q22m14p5J114o6J17L91J4N28
917F94l05l69J297Q7L51pl80N74K0q83r5r33J10k83j640K62O4MR00l7J33J131
939F95l46l6q8l28O17q21o29O69p51P79J64l46J212L04m82M95q05j5K64j102j37
960f87J41j12M41l42k91P86k8K23K64o32R72k54m82L37k27P26K62p76L63J27m74
981C37K77q64q7L85o37k17K56k25J113o14J88P32n13J61m38j062L29p1k41K40
1001i51n79J092O41l01N79M11j40M17o71l74O94o16j40J53l80Q57j89l77N66k61
$$ plain form
1021 431 766 679 -348 41 -183 -439 -609 -1094 -679 -307 -709 -484 -494 -845 -58 -713 -825 -204 -854 -260
1041 -260 -93 -443 583 437 817 1115 340 931 897 -111 311 134 -299 -68 -584 -588 -40 -209 306 210 86
1062 86 616 252 -70 177 -312 104 -235 -710 20 -420 -269 -64 -733 -22 141 -205 52 -475 -432 -65 -351
1083 -351 -339 509 341 566 274 -89 579 98 -239 -96 -429 85 137 -584 -244 -251 -168 400 -253 160 378 -240
1105 -240 322 84 184 777 76 222 525 98 861 319 -234 285 61 -383 -421 -886 -374 -181 -961 -705
1125 -705 -728 -534 11 -816 -524 -51 -247 321 145 4 1006 370 522 649 222 989 485 241 631 403
1145 403 565 281 -117 125 20 -243 64 -432 -310 197 -546 -466 -539 -555 -192 -372 -708 91 -174 35 275
1166 275 -409 159 8 30 237 40 497 440 -266 210 471 202 230 -43 -106 620 -30 96 63 -100 346 104
$$ packed form
1021D31L35q7j027L89k24k56j70m85M15L72m02K25j0l51P87o55j12O21o50N94
1041b60J67l50J026j46L80K98p75N91l4j008M22j77m33K31n16mN48j69N15r6j24
1062H6N30l64l22K47m89M16l39m75P30m40J51K05o69P11J63l46K57n27M3L67k86
1083c51J2Q48j68K25k92l63O68m81l37J43l33N14N2p21L40pQ3N68o53M13K18o18
1105b40N62k38J00N93p01J46L03m27P63n42n53N19k24m44l8m65N12J93p80K56
1125g05k3J94N45q27K92M73j96N68j76j41J002o36J52J27m27P67n04k44L90k28
1145D03J62k84l98K42j05k63L07m96J22N07p43Q0p3j6L63j80l36P99k65K09K40
1166B75o84N68j51K2K07j97M57n7p06M76K61k69K8k73o3P26o50J26l3j63M46k42
$$ plain form
1188 104 -323 236 178 55 -88 -584 -118 -47 -484 -267 -503 11 195 -438 -99 80 -274 585 -60 -212 469
1209 469 -166 -173 -48 -432 278 149 -166 125 35 153 -14 -479 41 60 -234 -133 -356 -149 386 -129 27
1230 27 514 447 647 364 74 490 -148 243 -28 -431 275 258 -110 164 -197 173 186 -678 -514 -137 -219 -97
1252 -97 -798 -674 -231 -591 -41 -38 -259 265 -27 -62 -98 -254 138 254 -57 488 647 657 676 698 705 857 407
1275 407 473 70 -40 170 -456 -590 -6 -596 -192 -471 -674 -148 -778 -801 -312 -575 -283 -243 -427 88 30
1296 30 211 833 238 537 972 179 341 51 -63 415 -281 -140 -42 -294 273 -107 -514 177 -38 -199 -93
1317 -93 -682 -284 140 -359 106 -32 205 717 177 491 633 72 304 136 -201 369 -270 -122 5 -85 295
1338 295 170 -429 15 -104 -266 -473 -630 -385 -56 -600 -347 -411 193 339 69 285 568 182 764 288
$$ packed form
1188A04m27N59n8j23j43m96M66P1m37K17k36N14J84o33L39J79l54Q59o45j52O81
1209D69o35pJ25l84P10j29l15K91r0J18j67m65N20J9k94J01k23K07N35n15J56
1230B7M87o7K00k83k90M16o38L91k71m03P06j7l68K74l61L70J3q64J64L77q2J22
1252i7p01J24M43l60N50Lk21N24k92l5l6j56L92J16l11N45J59J0J9K2PJ52m50
1275D07O6m03j10K10o26j34N84n90M04k79k03N26o30k3M89k63K92M0j84N15n8
1296C0J81O22n95K99M35p93J62k90j14M78o96J41R8k52N67l80m07O91k15j61J06
1317i3n89L98M24m99M65j38K37N12n40L14J42n61K32j68l37N70o39J48J27r0L80
1338B95j25n99M44j19j62k07j57K45L29n44K53o4O04J46k70K16K83l86N82m76
$$ plain form
1358 288 167 669 273 318 436 84 713 263 -47 174 -132 105 73 -766 -237 -265 -897 -228 -868 -565 -4
1379 -4 -243 -179 -116 -273 301 85 -666 198 17 77 239 -173 640 667 43 366 114 435 310 -289 76 -112
1401 -112 -196 65 -297 -152 121 -14 91 54 -318 388 -391 -155 -21 -353 -165 145 -594 -7 113 -278 208
1422 208 -313 57 535 169 -43 78 85 289 35 -361 381 -21 321 118 -348 395 -30 -275 -45 -616 -148
1443 -148 -20 -200 -55 181 131 378 -109 52 540 -237 35 -137 -29 176 -3 3 119 101 126 96 -104 250
1465 250 -255 -412 -224 -484 -234 -10 -447 -168 -354 -185 -26 -200 -131 177 -16 262 -116 -26 288 444 146
1486 146 422 443 660 402 135 332 340 9 407 -86 64 212 -291 -30 3 -488 119 -260 -508 -239 -310 -72
1508 -72 -311 -616 108 -193 -46 -178 -251 205 529 -26 350 128 202 400 15 249 301 -33 360 98 -5
$$ packed form
1358B88j21N02l96M5J18l52O29m50l10K21l06K37l2q39N29k8o32O69o40L03N61
1379dk39O4O3j57N74k16p51Q64j81O0J62m12Q13K7o24L23k52L21j25n99L65j88
1401a12q4K61l62J45K73j35J05l7l72P06p79K36J34l32J88L10p39N87J20l91M86
1422B08n21L70M78l66k12J21PK04k54l96P42m02L42k03m66P43m25k45K30n71M68
1443a48J28j80J45K36n0K47m87J61M88p77K72j72J08K05j79OJ16j8K5l0k00L54
1465B50n05j57J88k60K50K24m37K79j86J69J59j74O9L08j93K78l78R0L14J56k98
1486A46K76K1K17k58k67J97Ql31L98m93J50J48n03K61L3m91O07l79k48K69p1K38
1508g2k39l05P24l01J47j32p3M56L24n55L76k22P4J98l85K34N2l34L93k62j03
$$ plain form
1529 -5 541 -232 13 -75 -163 -71 25 -409 -335 -262 -234 -91 -362 -34 -105 -115 -196 -36 158 433 -73 -35 384 289 225
1554 225 -46 -114 548 164 -258 -32 -291 20 -193 -268 -192 -263 -140 114 -266 -325 156 104 8 188 78 556
1576 556 194 64 158 169 295 -49 -42 504 -64 274 44 -245 121 49 -370 259 -169 -119 291 -332 -213 -112
1598 -112 -39 -47 -595 -637 358 -156 61 -34 113 420 72 28 375 -14 103 119 -36 175 439 -132 190 -7
1620 -7 261 355 -54 -177 -346 -159 44 -353 -226 107 -151 -142 56 -657 -147 -114 -254 -17 -154 104 323 -371
1642 -371 45 299 117 148 98 214 209 -119 21 46 9 99 -151 -56 238 -124 175 178 -354 62 -316 -376 -53 -417
1666 -417 -120 -33 -461 -5 207 147 139 -135 -141 209 -175 -30 81 -164 119 14 -131 169 -84 223 90 -271
1688 -271 174 177 -352 98 -162 -218 -98 -383 -340 -69 -71 189 63 -44 364 223 364 150 -34 333 214 71
$$ packed form
1529eN46p73K45q8q8R2R6m34P4P3K8J43k71L28p1j0q1J60J94K75n06L8M19r5o4
1554B25k71o8O62l84m22K26k59L11k13p5P6p1J23K54l80n9M81n2r6J80j10M78
1576E56l62j30R4J1J26l44PN46n68L38k30k89L66p2m19O29m28N0M10o23J19J01
1598a12P3qn48m2R95n14K17r5J47L07l48m4L47l89J17J6j55K11K64n71L22j97
1620gK68R4m09j23j69J87K03l97J27L33k58RJ98p13N10L3j40K37j37K58K19o94
1642c71M16K54j82L1n0J16nl28J40K5l7R0k50R5K94l62K99Ln32M16l78o0L23l64
1666d17K97Q7m28M56K12o0qk74oL50l84J45J11k45K83j05j45L00k53L07j33l61
1688b71M45Ln29M50k60n6J20k85M3K71kK60j26j07M08j41J41k14j84L67j19j43
$$ plain form
1710 71 255 4 256 496 17 186 -162 51 53 -395 -286 -307 -192 -142 -284 -295 96 -323 -313 -32 -293 -111
1732 -111 215 -151 -106 131 19 316 270 465 460 274 554 180 437 188 -121 -97 29 -295 -145 -44 -101 163
1754 163 -266 172 -95 -473 -328 -209 -413 -24 -413 -67 90 127 298 292 51 310 139 130 558 186 -87 -311
1776 -311 -112 168 -93 74 11 155 -13 -165 -220 -176 -81 -116 -86 -105 -35 235 82 72 12 88 506 180 -3 296
1800 296 111 -103 211 -140 0 179 -13 189 147 -118 -200 -428 85 262 -438 -329 -373 -106 -61 -499 -323
1821 -323 -1 73 -49 -147 -146 21 115 198 142 12 408 322 283 132 54 207 256 127 74 -51 -55 190 -435 -138 -118
1846 -118 -174 -71 171 -259 -140 -331 -5 -10 -168 121 -396 -390 -143 68 79 425 42 295 331 -87 68 46 202
1869 202 382 -65 63 341 -58 -112 -112 -217 191 -6 -227 -149 -455 53 -38 -368 -47 -180 -140 101 -187 -192 325
$$ packed form
1710G1J84k51K52K40m79J69l48K13Km48J09k1J15N0j42j1L91m19J0K81k61J82
1732a11L26l66M5K37j12K97m6J95nj86K80l74K57k49l09K4J26l24J50J01n7K64
1754A63m29M38k67l78J45J19k04L89l89L46J57L7J71ok41K59j71rM28l72k73k24
1776c11J99K80k61J67o3J44j68j52n5M4R5l5L0j9P0K70j53j0o0P6M18l26j83K99
1800B96j85k14L14l51J40J79j92K02m2k65q2k28N13J77p00J09m4K67M5m38J76
1821c23L22P4j22r8JJ67R4Q3n6j30L96q6l9j51p8J53M9j29n3j25mK45o25K97K0
1846a18n6J03K42m30J19j91L26nj58K89n17OK47K11J1L46l83K53L6m18J55k2J56
1869B02J80m47J28K78l99n4%j05M08j97k21P8l06N08r1l30L21j33M0K41k88nN17
$$ plain form
1892 325 -80 -55 157 -4 254 -174 86 245 -33 204 51 -83 381 228 -2 -183 -68 170 -225 -234 -51
1913 -51 -298 10 321 -172 -161 313 -2 -57 -68 128 43 76 110 291 118 115 185 -235 -27 284 166 225 7 9
1937 9 71 -255 -3 1 -79 -99 -307 -357 -272 -109 -13 -212 -296 60 -13 -37 -129 -107 189 170 70 423 146 -19 214
1962 214 -70 304 189 -241 -83 -293 -70 69 -411 -188 -23 -347 11 -54 -141 -71 -177 -158 -56 -187 -68
1983 -68 300 -311 199 243 -134 281 -76 -24 274 52 427 -86 103 456 -217 -95 23 -26 74 50 -238 -32
2005 -32 -63 -103 -50 -276 50 -262 -202 25 -76 -13 -93 -178 116 85 50 139 -23 -149 186 -48 117 63 45 403
2029 403 30 -143 395 -123 -215 -183 -14 -44 -174 -62 -24 -91 -19 139 -50 -164 318 65 231 -78 -29 27 195
2052 195 265 357 -11 480 -125 -120 11 60 230 240 -171 29 13 -204 -186 -44 -126 -86 16 -285 -93 -206 -231 -84
$$ packed form
1892C25m05K5K12j61K58m28K60J59k78K37j53j34M64j53k30j81J15K38l95rJ83
1913e1k47L08L11m93J1M74l15n5j1J96q5L3L4J81j73lP0m20K08L11j18N9k18K
1937IO2l26K52Mq0k0k08n0Q5J63R6j99q4L56p3k4r2K2K96j9j00L53k77j65K33
1962B14k84L74j15m30J58k10K23J39m80K23J65l24L58o5q7P0j06J9J02j31J19
1983f8L68o11N10M4l77M15l57N2K98k22L75n13J89L53o73J22J18m9J00k4k88K06
2005c2l1m0N3k26L26l12O0K27j01O3q0q5K94l1l5Q9j62j26L35k34J65n4j8L58
2029D03l73j73N38n18r2L2J69l0j30J12L8o7P2J58j89j14M82k53J66l09M9N6J68
2052A95P0R2l68M91o05NJ31M9J70J0m11K00j6k17J8J42q2M0J02l01J92j13k5J47
$$ plain form
2076 -84 93 -66 33 104 228 -13 151 151 -81 45 87 199 331 66 101 264 214 -89 -77 -1 103 -305 -105
2099 -105 15 -44 -109 -72 26 97 -66 102 173 -230 -3 69 313 238 -108 46 92 264 -43 79 -242 296 75
2122 75 -153 236 -66 306 69 -39 -204 95 68 112 -107 -161 138 -247 -187 -300 120 171 199 20 127 75 99
2145 99 -100 -94 223 -243 -142 297 84 190 126 -268 167 47 -1 221 -146 -57 -86 -129 -228 -195 -110 -138 -142 -159 -70
2170 -70 -99 24 222 -80 157 -34 74 173 20 -117 137 210 316 102 139 84 30 -53 134 -122 -247 -272 -178
2193 -178 91 -129 -204 178 -281 -69 -45 -306 37 112 -216 -286 -203 287 126 -1 471 82 9 403 95 63
2215 63 225 -224 40 -399 -29 80 -274 -288 -112 -181 -186 3 -248 -100 -104 185 -79 -352 44 253 -61 62
2237 62 159 127 368 206 158 13 -25 61 -41 -162 52 150 -48 136 -68 125 226 -22 53 -126 -99 105 -185
$$ packed form
2076h4J77j59R9P1J24k41J64%k32J26M2J12J32k65L5J63n0l03J2P6J04m08K00
2099a05J20n9o5L7R8P1j63J68P1m03K27P2K44p5l46J54M6J72l07J22l21N38k21
2122G5k28L89l02L72k37j08j65K99k7M4k19n4K99l85O0j13M20N1K8j79J07n2K4
2145I9j99OL17m66J01M39k13J06o4l94M35j20m8K22l67Q9k9m3r9L3Q5k8mj7Q9
2170g0k9J23J98l02K37j91J08R9j53j37K54P3J06k14L7n5n4q3J87k56j25k5R4
2193a78K69k20p5L82m59K12K4k61L43P5l28p0Q3M90j61j27M72l89p3L94l08l2
2215F3J62m49K64m39L70J09l54j4J76o9nJ89k51J48mK89k64k73L96K09l14J23
2237F2R7l2K41j62m8j45l8Q6j02j21K14R8j98J84k04J93J01k48P5j79K7K04k90
$$ plain form
2260 -185 -59 50 23 116 9 32 -4 81 -382 71 60 398 32 107 40 -142 29 -136 242 296 112 7 -120
2283 -120 -419 -55 -78 182 86 60 -232 255 -288 -71 -45 -177 -29 79 -107 -1 -4 -19 278 137 246 -30
2305 -30 -57 154 140 108 126 114 157 177 7 -137 -217 -106 148 -15 -99 -147 110 144 -160 -129 -72 14 -102 -68 -391
2330 -391 -44 91 -116 60 -32 146 84 24 3 360 -10 -1 136 125 162 21 22 -19 -5 -127 74 -79 6 52 28
2355 28 -15 35 -312 48 -315 260 -98 -144 178 -298 -57 79 325 63 107 -49 241 -93 -32 107 -207 147
2377 147 252 -124 -140 50 -341 9 -194 -96 -56 -215 -191 -266 -170 211 -258 -202 162 157 2 -107 -237 134 72
2400 72 -9 133 -185 -76 58 -23 199 -20 136 49 -59 -36 -19 -224 -112 -197 36 151 -258 -211 -55 -241 112
2423 112 1 -32 208 -68 -135 250 22 26 83 116 400 -246 -205 470 -142 117 57 77 135 53 -50 151 10 146
$$ packed form
2260a85J26J09k7R3j07K3l6Q5m63M53j1L38l66P5o7j82J71j65L78N4j84j05j27
2283a20k99L64k3K60r6k6k92M87n43K17K6j32J48J08j86J06lj5K97j41J09k76
2305c0k7K11j4l2J8j2M3K0j70j44q0J11K54j63q4m8K57L4l04L1N7Q6j16L4l23
2330c91L47J35k07J76r2J78o2o0k1L57l70RJ37j1L7j41Jm1J4j22K01j53Q5M6k4
2355B8m3N0l47L60l63N75l58m6L22m76K41J36K46k62M4j56K90l34O1J39l14L54
2377A47J05l76j6J90l91L50k03R8M0j59K4p5R6L81m69N6L64nj55j09j30L71o2
2400G2q1J42l18J09J34q1K22k19J56q7j08K3J7k05J12q5K33J15m09M7J56j86L53
2423A12j11l3K40k76o7L85k28MN7L3K84o46M1O75o12K59o0K0N8q2j03K01j41J36
$$ plain form
2447 146 10 -323 -57 156 -400 -35 57 247 98 -71 116 -127 -6 250 -80 49 93 163 -55 335 -18
2468 -18 -3 34 -232 7 -112 126 -215 194 -76 97 -80 -53 -92 -218 -41 -60 -132 -35 -88 170 116 -25 218
2491 218 -140 82 231 -242 293 -34 132 -264 84 7 107 -51 55 -77 -350 40 -244 -219 -1 -247 -222
2512 -222 -67 -177 -22 -180 -518 -107 -130 114 40 -181 193 -11 -38 -42 178 26 43 -75 -67 198 242 8 -108
2535 -108 -194 -110 84 -105 -12 -35 164 -202 -276 98 19 -81 18 -212 78 -191 14 145 -10 -36 381 100 186
2558 186 301 216 152 89 33 330 -120 -112 59 -449 133 -20 76 87 126 -106 33 -404 -40 -44 -85 216 -244 -205
2582 -205 -22 -35 57 -155 34 208 149 59 327 55 213 26 -40 -81 248 -188 -70 -165 -93 -144 -16 -197 -255
2605 -255 -26 0 13 -43 16 -3 -227 -106 -45 206 249 121 -5 -8 200 226 -26 13 0 -62 65 233 217 62 30
$$ packed form
2447A46j36l33K66K13n56L65R2J90j49j69J87k43J21K56l30J29M4P0k18L90l53
2468a8J5L7k66K39j19K38l41M09k70J73j77K7l9j26J77j9p2R7n3K58n4j41K43
2491B18l58K22J49m73N35l27J66l96L48p7J00j58J06j32k73L90k84K5K18k46K5
2512b22J55j10J55j58l38M11k3K44p4k21L74k04k7mK20j52J7j18QK65M4k34j16
2535a08q6Q4J94j89R3k3J99l66p4L74p9j00R9k30K90k69K05J31j55k6M17k81Q6
2558A86J15q5o4o3n6K97m50QJ71n08N82j53R6J1L9k32J39m37L64mm1L01m60L9
2582b05J83j3R2k12J89J74n9r0K68k72J58j87o6m1L29m36J18r5P2n1J28j81n8
2605b55K29K6J3n6N9j9k24J21O1K51M3j28j26lK08K6k52L9j3o2J27J68j6j55l2
$$ plain form
2630 30 -198 10 50 122 -157 -290 -273 -47 -269 -7 -178 207 50 145 244 121 25 299 214 61 -23 195 309
2653 309 96 -203 316 -50 84 92 17 26 -418 -115 -31 145 107 193 -28 -88 -1 -36 3 -113 -88 148 -230 -112
2677 -112 179 10 98 -136 229 142 179 222 63 -76 168 -1 39 -6 -154 187 157 -69 12 -46 -191 -341 -122
2700 -122 -97 -114 23 48 -133 -221 -220 -117 86 74 -131 163 122 -5 124 37 40 243 -40 202 -23 149 194 244
2724 244 54 39 -81 -433 -290 -3 202 -68 120 -76 -144 55 134 -306 179 -169 54 -14 -163 123 25 162
2746 162 94 286 286 2 -42 105 -4 -59 -265 -46 -28 59 -214 -156 -239 -66 156 88 -44 0 118 -175 -31 62
2770 62 -76 -31 -11 117 83 11 177 -396 -11 36 22 161 15 111 171 -211 -123 8 -258 55 -89 -19 -171 -281
2794 -281 164 12 -324 264 -43 -19 275 173 -34 -26 148 -23 240 -198 -245 279 -117 -31 15 47 99 -46 108
$$ packed form
2630C0k28K08M0P2k79j33J7K26k22K62j71L85j57R5R9j23r6K74q5j53q4K18J14
2653C09k13k99N19l66J34Qp5Rm44L03Q4J76l8Q6k21o0Q7l5L9j16K5K36l78J18
2677a12K91j69Q8k34L65q7L7M3j59j39K44j69M0m5j48L41l0k26Q1n8j45j50K19
2700a22K5j7J37K5j81q8JJ03K03j2k05K94m1j27J29q7LK03k83K42k25J72M5N0
2724B44j90j5j20l52J43K87K05k70J88j96o8J99P9m40M85l48K23o8j49K86r8J37
2746A62o8J92%k84m4J47j09n5k06K19J8Q7k73N8q3J73K22o8j32M4J18k93J44R3
2770F2j38M5K0J28l4p2J66n73L85M7j4J39j46R6O0l82Q8J31k66L13j44P0j52j10
2794b81M45j52l36N88l07K4K94j02k07QJ74j71K63m38m7N24l96Q6M6L2N2j45J54
$$ plain form
2817 108 141 -8 -109 23 5 200 -34 -325 -290 -138 -104 -18 -291 39 -113 -74 -29 93 26 149 145 284 147
2840 147 -17 17 -89 93 80 -24 123 33 63 148 -66 15 -199 -188 -89 -3 21 69 -348 -70 -109 -98 -130 118 75
2865 75 92 -168 222 81 200 26 59 -20 -19 -132 70 188 -71 101 -107 -128 26 59 121 -147 21 -134 -231
2888 -231 -178 309 -150 -90 -222 10 -140 21 -221 129 90 103 135 -84 65 147 80 44 67 -127 192 -177 -232
2911 -232 77 96 -148 139 -389 52 -150 -106 -115 -35 -90 203 -64 154 -6 -230 -74 -106 -36 29 31 12 69 52 26
2936 26 200 -17 -20 -1 136 -121 156 7 295 107 -111 -50 -77 33 -175 118 10 -238 -95 26 -136 101
2958 101 155 80 -39 18 350 166 68 35 184 154 121 -18 123 89 -138 55 -160 2 -8 -272 -99 -47 -34 146
2982 146 -10 -45 80 -139 -56 -222 126 254 -48 73 44 -84 -289 233 114 31 -65 -40 -165 -35 -139 65
$$ packed form
2817A08L3j49j01J32j8J95k34k91L5J52L4Q6k73L30j52L9M5J22o7J23mJ39j37
2840A47j64L4j06J82j3j04J47r0L0Q5k14Q1k14J1R9Q6K4M8m17K78l9J1l2K48m3
2865G5J7k60L90j41J19j74L3p9Jj13K02J18k59J72k08k1J54L3O2k68J68j55r7
2888b31N3M87m59O0j32K32j50J61k42L50l9J3L2k19J49Q2o7l6K3j94L19l69n5
2911b32L09J9k44K87n28M41k02M4rQ0n5K93k67K18j60k24J56l2P0O5Kj9N7j7k6
2936B6J74k17lJ9J37k57K77j49K88j88k18O1k7J10k08K93j08k48J43J21j62K37
2958A01N4p5j19N7L32j84r8l3J49l0l3j39J41l4k27J93k15J62j0k64J73N2J3J80
2982A46j56l5J25k19Q3j66L48J28l02J21k9j28k05N22j19q3r6K5j25J30j04K04
$$ plain form
3004 65 12 0 -95 -100 -83 -200 -172 -6 -17 -386 -139 -158 -18 -46 -67 177 -127 73 245 -10 34 231 63 -4 84
3029 84 300 176 90 13 -61 15 -96 104 194 -93 -97 -33 47 -111 -11 86 -154 -113 103 -145 94 -386 10 -38
3053 -38 -191 -187 -73 -128 -66 -48 -17 -131 -31 212 155 97 -238 84 316 217 -209 157 -77 -291 112 -119 -296
3076 -296 -11 -359 -226 71 -240 65 -121 29 194 -21 42 -56 -41 26 187 -9 -113 -12 -136 -149 -49 218
3098 218 -215 -425 54 -105 -119 83 -162 -118 101 -64 118 77 -194 43 128 -159 178 32 -106 36 85 119
3120 119 -115 112 156 -259 97 90 57 -2 124 -48 -145 98 -132 -47 52 -16 -20 3 -28 -65 -76 -89 -106 -112 -57 -132 -159
3147 -159 -28 -284 -200 243 170 -2 261 78 7 83 59 -67 118 140 -48 -26 -127 228 217 103 213 -160 -74
3170 -74 20 24 -351 168 434 172 -70 -187 73 -85 100 211 43 -77 175 -90 210 -53 153 -36 -237
$$ packed form
3004F5n3j2r5nJ7j17K8J66j1l69K47j9J40k8k1K44l04K00J72k55M4J97j68o7Q8
3029H4K16j24q6p7p4P6j11K00R0k87mO4Q0j58J00R7k40M1K16k48K39m80L96m8
3053c8j53MJ14n5O2J8L1j14J00K43n7n8l35L22K32r9m26L66k34k14M03k31j77
3076b96K85l48J33K97l11L05j86J50J65k15O3r8J5O7J61j96j04J01j24j3J00K67
3098B18m33k10M79j59j4K02k45M4K19j65J82m1k71K37Q5k87L37j46j38J42M9L4
3120A19k34K27M4m15L56pl3n9J26j72r7K43k30Q5R9o8mK3l1l7j1j3j7oN5p5k7
3147a59J31k56Q4M43p3j72K63j83p1P6k4j26J85K2j88K2j01L55j1j14J10l73Q6
3170g4R4Ml75N19K66k62k42j17K60j58J85J11j68j20K52k65L00k63K06j89k01
$$ plain form
3191 -237 39 132 -94 -4 393 -134 114 -45 -123 171 -320 -83 -39 -133 -76 -225 70 67 132 57 -154 5 -63 -58
3215 -58 176 118 93 0 -168 -127 12 -144 161 196 -59 -183 -302 -173 44 -55 22 -39 -6 16 -124 -77 -148 -263
3239 -263 -92 94 -68 133 22 -75 -121 116 -25 251 220 -122 -165 -57 123 19 246 187 115 -71 178 113
3261 113 -30 -135 -179 -189 107 -21 1 -26 -40 -58 31 140 265 -6 -92 45 41 -107 49 106 77 -8 26 3 -63
3286 -63 -159 6 250 159 -83 -201 25 159 -180 -205 -104 52 -19 -103 4 -245 -4 151 196 -56 -145 216 120
3309 120 115 -40 146 129 33 186 74 216 -47 2 20 122 -89 -97 -285 -67 -72 -233 28 -18 -112 -249 -201 -15
3333 -15 75 -38 57 -134 67 -130 58 180 -18 -54 213 23 27 -119 97 -74 18 -141 381 -265 -77 136
3355 136 -201 217 86 -144 -7 165 -197 45 -21 -80 51 57 62 -4 -65 46 -254 120 -46 -55 177 -247 -135
$$ packed form
3191b37K76R3k26R0L97n27K48j59p8K94m91K37M4r4N7j49K95lO5p5k11J59o8N
3215e8K34n8k5r3j68M1J39j56L05L5k55j24j19J29K17r9P7o1L3K2j40M7p1j15
3239b63J71J86j62K01j11r7m6K37j41K76l1l42m3J08J80j04K27n9p2j86K49o5
3261A13j43j05m4j0K96j28K2k7j4j8Q9J09J25k71q6J37mj48J56N7k9q5L4k3o6
3286f3r6J65K44r1k42j18K26J34l39k5J01J56p1q4J07k49K41J55M5k52q9L61r6
3309A20nj55J86j7r6J53j12J42k63M9J8J02k11qj88K18nj61K61m6r4j37M8J86
3333a5R0j13R5j91K01j97J88J22j98l6K67j90Mj46K16j71R2j59N22o46J88K13
3355A36l37M18j31k30J37J72l62K42o6n9J31ONo6o1J11l00L74j66rK32m24J12
$$ plain form
3378 -135 257 32 -119 91 -153 -208 -270 -194 85 -249 213 70 -28 -162 17 -199 -78 53 -29 19 344 143
3400 143 -184 22 53 218 -22 77 297 -17 122 106 -12 -62 192 -132 -46 -162 59 164 -244 -9 189 -35
3422 -35 -372 -219 128 -10 -310 242 -106 61 -75 -7 -113 -199 310 -123 101 264 -70 38 -94 -86 44 79
3444 79 -145 119 -5 110 -111 55 102 3 45 -226 -41 1 185 -103 -157 -103 296 180 80 -51 -84 -9 119
3467 119 269 96 195 106 163 263 198 -139 252 116 -68 -89 -256 100 -137 0 -71 101 -103 -126 -270 -4
3489 -4 -80 -145 82 -80 178 -64 -94 -183 74 46 -238 125 134 131 -72 45 264 -43 119 -45 -129 64 4 -179
3513 -179 59 89 -51 -264 -67 -61 -63 -159 26 103 43 -258 -127 66 -218 -123 -145 83 -25 90 186 -103 189 -72
3537 -72 67 -17 -216 273 -98 52 36 -198 37 62 -74 -165 2 -54 203 -18 172 -95 -140 -52 -220 87 -45
$$ packed form
3378a35L92k25j51K10k44n5o2P6K79l34M62j43r8j34J79k16J21J31q2M8L25k01
3400A43l27K06L1J65k40R9K20l14J39j6j18n0K54l24Q6j16K21J05m08K35J98k24
3422c5l37J53L47j38l00N52l48J67j36O8j06q6N09m33K24J63l34J08j32QJ30L5
3444G9k24K64j24J15k21J66M7r9M2k71J85M2J84k88n4N4L99j16j00j31l3P5J28
3467A19J50j73R9q9N7J00o5l37L91j36j84k1j67L56k37J37p1J72k04k3j44K66
3489dp6o5K27j62K58k42l0q9K57k8k84L63Rlk03J17K19l07J62j64q4J93o0j83
3513a79K38L0j40k13J97Okr6J85P7o0l01J31J93k84R5k2K28j08J15R6k89K92k61
3537g2J39q4j99M89l71J50j6k34K35K5j36r1J67n6K57k21J90k67m5Q8j68L07j32
$$ plain form
3560 -45 -24 109 50 142 -70 117 108 -42 -135 -89 -9 -55 163 81 -42 48 -110 24 52 86 -135 46 -189 16 -141
3585 -141 273 110 125 80 -37 140 172 -321 135 -39 62 -126 -23 -33 61 97 36 315 -348 -21 -67 -21 183
3608 183 163 -324 50 51 -208 -20 -205 -4 -150 114 26 -12 273 1 -33 -82 55 152 72 228 0 37 190
3631 190 -21 -60 41 145 -19 -85 -152 -9 -116 118 -88 72 131 -23 186 -4 -199 -133 94 78 19 -65 196
3654 196 -263 112 171 316 186 -44 303 17 -6 -116 -247 -59 -226 -143 66 -73 -13 -113 -69 -24 33 -134
3676 -134 152 -295 -35 -181 -115 -189 -72 200 -76 -319 174 -107 103 49 -11 48 24 10 -76 -70 -63 187 -199 269
3700 269 59 -23 214 -95 70 4 82 -62 -166 -12 150 71 -79 0 -8 100 -140 -63 -125 114 -100 18 118
3723 118 111 -129 -58 -66 50 -194 -79 -45 14 -18 -44 68 -54 65 241 2 5 121 -452 38 251 -106 259 -19
$$ packed form
3560d5K1J33n9R2k12J87rj50r3M6Q0m6K18q2j23R0j58J34K8L4k21J81k35K05j57
3585a41M14j63J5m5j17J77L2m93M56j74J01j88J03j0R4L6o1K79o63L27m6M6K04
3608A83k0m87L74Jk59J88j85K01j46K64q8l8K85k72l4m9J37R7q0J56k28L7J53
3631A90k11l9J01J04j64o6o7J43j07K34k06J60N9j54K09j90j95O6K27j6n9q4K61
3654A96m59L75N9J45j30k30L47k86k3j10j31J88j67Q3K09j39O0j00M4M5N7j67
3676a34K86m47K60j46O6p4J17K72k76k43M93k81K10n4o0N9k4j4q6OPK50l86M68
3700B69k10q2K37l09J65o6P8j44j04J54J62p9j50P9qJ08k40P7o2K39k14J18J00
3723A18pk40P1qJ16k44J15L4N9l2k6J12j22J19J76k39LJ16n73M90K13l57L65k78
$$ plain form
3747 -19 -77 112 -74 244 -10 -63 153 -63 -91 -15 73 -160 -90 2 -59 -154 95 -112 -30 240 -89 106 172 -31
3771 -31 -246 -123 -120 77 205 180 -59 31 160 -65 -219 38 -103 149 204 294 -151 -60 181 -121 -5 118 117
3794 117 -140 -51 87 97 31 215 172 12 95 -390 -222 -110 -229 156 90 -22 96 -90 115 70 -75 114
3816 114 146 321 -222 -118 191 133 -62 -332 104 22 107 -192 -73 74 147 79 -82 112 -8 -99 -80 57 123
3839 123 -89 71 -207 164 89 110 -74 -150 51 233 -24 74 158 -219 25 -118 -142 43 -111 36 -16 24 142
3862 142 161 35 46 5 79 136 4 31 211 63 -33 178 -13 249 -134 172 -94 230 26 -10 -117 -229 153
3885 153 124 -39 -217 -2 96 138 75 -307 -230 -117 -327 -45 -410 116 -4 -150 -3 -65 90 17 101 125 267
3908 267 149 -104 -168 -31 171 74 175 23 11 -218 74 12 -7 -139 -143 94 181 318 14 -52 -105 111 -82
$$ packed form
3747a9n8J89j86L18k54n3K16k16k8P6Q8k33P0R2o1r5K49k07Q2K70l29J95O6k03
3771c1k15J23LJ97J28k5k39R0J29k25j54K57j41K52N5R0m45R1K41l02J16J23j
3794A17k57Q9J38J0o6J84m3j60Q3m85J68J12j19L85o6j12J18j86K05m5j45J89
3816A14L2J75n43J04L09n8j95k70M36q2Q5k99J19J47P3o8j61J94j20r1J9J37O6
3839A23k12J60k78L71p5K1j84p6K01J82k57R8Q4l77K44j43k4J85j54J47n2M0J18
3862A42J9j26J1m1P4N7j32K7J80j48r6K11j91K62l83L06k66L24k04l6j07j12L82
3885A53k9j63j78K15R8M2o3l82P7J13k10K82l65N26j20j46J47o2J55p3Q4K4J42
3908B67j18k53o4J37K02r7J01j52j2k29K92o2j9j32mK37Q7J37l04o6n3K16j93
$$ plain form
3931 -82 123 212 -72 -28 -123 52 21 -119 -42 7 9 110 99 252 -36 -80 295 -202 -255 201 66 -170 -241 131
3955 131 92 210 -99 31 -50 6 -87 -138 -128 196 -246 -109 -149 -144 145 104 -146 -29 -214 -25 71 -68 45 -124
3979 -124 -67 -154 -78 -129 -98 -100 93 43 -283 164 -166 -158 -6 0 -130 -65 -101 76 45 -144 -196 -111 -100 5 55 299
4005 299 0 -17 -137 244 94 -39 -333 18 -89 -117 -143 73 67 -207 85 -64 -76 -100 -231 179 42 9 57
4028 57 229 338 -82 145 -223 -252 7 58 246 94 170 -135 14 61 -119 43 -28 -284 -211 71 89 -33 6
4051 6 -209 -127 122 -253 141 -34 -41 3 -22 73 276 44 -151 -36 -37 -63 79 105 76 -48 203 -36 16 80 -136
4076 -136 -94 68 -229 -99 125 -38 -63 247 127 91 -87 -127 10 170 52 66 86 367 34 -53 59 -5 223
4099 223 -61 -31 60 383 136 -61 129 -26 179 -1 -14 143 -10 -22 -131 232 -152 -385 42 0 -8 -108
$$ packed form
3931h2K05Q9k84M4r5J75l1j40P7M9KJ01j1J53k88m4L75m97n3M56j35k36p1L72
3955A31l9J18l09J30q1N6r3n1J0L24m42J37m0NK89m1k50J17j85J89R6j39J13j69
3979a24N7q7P6n1L1kJ93n0l26M47l30QJ52Oj30O5l6J77l1j89n2Q5J1J05N0K44
4005B99k99j7j20L81j50j33k94L51j07k8k6K16ok74K92j49j2k4j31M10j37l3M8
4028E7J72J09m20K27l68k9K59N1J88j52P6l05J49M7j80J62p1k56P3K82J8j22L9
4051Fk15Q2K49l75L94j75pM4k5R5K03k32j95J15jk6J42K6k9j24K51k39N2O4k16
4076a36M2J62k97J30K24j63k5L10j20l6j78m0J37J60j18J4K0K81l33q7J12o4K28
4099B23k84L0R1L23k47j97J90j55K05j80j3J57j53j2j09L63l84k33M27m2qj00
$$ plain form
4121 -108 178 74 134 235 -2 -39 338 1 -3 -100 135 -23 -129 121 -112 0 13 -250 52 -27 -146 -38
4143 -38 -89 50 65 -446 -7 -9 102 -35 0 8 -6 -226 176 -54 -193 262 128 -27 43 -26 -62 -78 84 123 -54
4168 -54 -107 224 -154 199 172 151 21 -122 -67 -72 -93 -200 182 -118 -19 -220 22 -253 -74 238 -49 -135 -51 -47
4192 -47 89 163 -72 189 190 -82 -134 -86 -289 -103 -79 -256 -14 -5 -16 -315 -56 84 -100 34 25 -70 84 -118
4216 -118 -147 -34 -95 146 175 -125 251 -310 104 254 -221 197 -110 -151 145 -139 -239 11 50 -156 220 -49
4238 -49 7 36 75 -244 135 2 -265 -431 -13 29 25 -96 -22 -88 89 204 32 118 -27 -137 -59 232 50 221
4262 221 3 -13 159 101 153 -122 -72 140 139 -172 134 -279 72 -5 -256 123 -64 -143 15 -87 -109 120 -37
4285 -37 100 -220 -95 169 8 122 153 -100 284 50 184 -264 32 -31 130 -144 61 53 -274 257 -90 17
$$ packed form
4121a08K86j04O0J01k37l7L77l37mr7K35j58j06K50k33J12J3k63L02p9j19J08
4143c8n1J39J5n11M39kJ11j37L5Qj4k20M02k30j39M55j34j55P0o9l6j6J62L9j77
4168e4n3L31l78L53k7k1j30j43N5nk1j07L82l00R9k01K42k75J79L12k87q6Q4M
4192d7J36P4k35K61Jk72n2M8k03J86K4j77K42Rj1k99K59J40j84J34rr5J54k02
4216a18k9J13o1K41K9l00L76n61M14J50m75M18l07m1K96k84j00K50L9k06L76k69
4238d9N6K9L9l19L79j33k67j66M18M2mj21P4o6J77J15j72Q6j45j10P8K91j82J71
4262B21k18j6J72n8N2k75N0K12jl11L06m13L51p7k51L79j87p9J58j02k2K29j57
4285c7J37l20J25K64j61J14L1k53L84k34J34m48K96o3J61k74K05ql27N31l47J07
$$ plain form
4307 17 -167 -31 44 -101 -119 -155 131 263 147 231 101 17 -161 -199 159 121 94 37 -128 -141 144 141 -25 74 15
4332 15 115 40 -102 20 -86 118 -18 110 -31 -354 -136 -125 -288 -363 114 -67 -165 162 68 98 -5 -113
4354 -113 133 236 -126 -201 117 107 -134 -172 -132 135 243 -157 -100 -137 20 -43 -146 -33 96 -7 -19 -86 -44
4377 -44 -82 71 -147 150 307 -144 131 76 150 -349 161 -129 -20 -118 -64 -17 -22 101 -123 -20 57 -180 -245 -196
4401 -196 69 42 42 64 -36 42 214 76 -10 -174 17 48 -58 107 212 27 9 -120 -21 41 164 84 -170 1
4425 1 -57 -313 -211 63 261 -212 -107 -126 -181 -93 -99 -54 29 -36 117 132 111 -12 88 15 137 191 124 -197 51
4450 51 135 69 235 -202 45 175 0 -269 44 -31 141 11 124 129 -122 43 -82 -101 248 -181 -27 143
4472 143 85 77 -30 28 256 135 14 -71 -121 155 -230 23 -273 -291 -99 -58 50 40 162 -255 249 112 -40
$$ packed form
4307A7j84J36P5j45j8l6K86J32j16Q4j30q4j78l8L58l8k7n7j65j3K85lj66R9n9
4332A5J00p5j42J22j06K04j36J28j41l23K18J1j63p5M77j81r8L27r4L0j03j08
4354a13K46J03l62p5L18j0k41l8M0K67J08m00N7l7J57o3j03J13J29j03j2o7M2
4377d4l8J53k18K97J57m51K75n5P4m99N10k90J09r8N4M7nJ23k24J03P7k37o5M9
4401a96K65k7%K2j00P8J72j38q6j64J91L1j06J65J05j85j8j29R9O2J23q0k54J71
4425An8k56J02K74J98m73J05j9n5Q8oM5Q3o5J53J5k1j23J00p3J22N4o7l21K48
4450E1Q4o6J66m37K47J30j75k69L13p5J72j30J13Nk51J65j25j9L49m29J54J70
4472A43n8qj07N8K28j21j21q5n0K76l85K53k96j8J92M1J08j0J22m17N04j37j52
$$ plain form
4495 -40 160 -97 -290 156 -143 -245 6 -281 -119 -109 283 38 111 32 -70 -5 132 -148 77 80 338 -141
4517 -141 -152 144 194 88 30 101 -337 40 -98 -174 -175 -109 -98 18 135 -121 227 -112 -154 -114 86 171 267 -62
4541 -62 238 -34 -53 -1 203 238 80 -31 87 -65 -56 -92 -61 -17 124 -20 -153 -390 -52 15 -104 -135 15 -113
4565 -113 -126 -129 74 270 -183 -1 18 152 -63 14 330 39 257 61 246 -23 -312 111 -136 -71 -73 160 155
4588 155 205 -50 -176 -102 93 -133 126 41 44 125 72 7 64 128 -8 163 -27 6 23 -195 -26 13 220 230 -34
4613 -34 -197 154 6 78 89 -26 -17 -47 106 -157 47 -135 321 77 135 -160 36 77 220 72 199 39 238
4636 238 30 -13 -136 69 -419 27 -78 -235 -111 -50 -292 -23 -250 192 -149 -353 20 -96 -47 -88 -136 114
4658 114 48 -117 407 64 201 12 281 170 -61 60 -17 81 69 -252 -44 -38 154 217 -3 19 -261 95 -78
$$ packed form
4495d0K00k57j93M46k99j02K51k87J62J0L92k45P3p9j02O5J37k80K25LK58m79
4517a41j1K96N0j06n8P1m38L77j38p6jO6J1J16J17k56L48l39m2M0K00Q5R6l29
4541f2L00k72j9N2K04L5j58j11J18j52Rl6L1M4J41j44j33k37L38O7j19l1J50j28
4565a13j3lK03J96m53J82J9J34k15P7L16k91K18j96J85k69k89M23k47O5kK33n
4588A55N0k55j26P4J95k26K59q5LQ1n3o5N7O4j36J71j90L3J7k18J69L9K07J0k64
4613c4j63L51j48P2J1j15Rl0J53k63K04j82M56k44N8k95J96M1J43j48J27j60J99
4636B38k08m3j23K05m88M46j05j57J24O1k42K69k27M42l41k04L73j16M9m1m8K50
4658A14o6j65N24l43J37j89K69j11k31J21p7R8j2l21K08OJ92O3k20K2k80L56j73
$$ plain form
4681 -78 -87 116 -48 -190 -101 -188 -249 -89 3 4 215 -54 264 335 276 37 95 253 -84 278 80 -129 -33 -45 14
4706 14 348 97 163 -111 32 63 -85 98 132 24 -126 -35 -177 -144 -100 86 127 403 -109 133 -30 -120 -22
4729 -22 70 -109 -71 208 -174 33 37 -222 33 -8 -70 18 -264 26 -72 -8 -3 -18 81 -47 -80 60 7 105 -71 140
4755 140 1 43 199 130 35 181 194 -165 108 174 192 -19 275 -41 152 121 31 12 29 72 -179 -111 148 25
4779 25 -59 86 -100 214 40 57 339 -34 63 203 165 -18 -90 107 -55 -10 208 33 -145 145 152 -40 -174
4802 -174 -82 -13 302 -52 -41 90 -61 -298 -95 114 -114 2 94 63 44 246 -109 237 -41 123 102 29 73
4825 73 37 -35 1 46 18 -31 96 -75 258 -128 29 -18 -154 -11 90 36 69 26 -47 -119 -73 4 188 69 -8
4850 -8 21 238 -12 -106 41 -286 63 261 -80 48 -65 -157 72 67 48 -18 243 94 -247 -66 -304 -179 208
$$ packed form
4681g8rK03j64j42Q9q7o1J60R2JK11k69L18P1n9k39N8J58l37L62j98k09R6j2N9
4706A4L34k51O6k74J43L1j48J83L4j08j50R1j42L3M4J86M1K76n12K42j63r0R8
4729b2R2j79L8K79l82K07Mk59K55m1o2Q8k82K90r8O4Nj5R9j28l3J40n3R8j76K11
4755A40j39M2J56o9r5J46J3l59K73O6J8k11K94l16J93l1r0j9J7M3k51O8K59j23
4779B5q4J45j86L14j74J7K82l73R7J40l8j83p2J97j62M5K18j75j78K90Pj92j34
4802a74R2O9L15l54J1J31j51k37K03K09k28J16R2l1j9K02l55L46k78J64k1p3M4
4825G3l6p2L6M5k8m9J27j71L33l86J57m7j36J43J01n4L3m3p3p2M6P7J84j19p7
4850hK9K17k50r4J47l27L49J98l41J28j13r2K29nj9o6K61j49l41J81k38J25L87
$$ plain form
4873 208 -120 -147 -68 251 25 52 78 85 83 45 -201 52 -2 183 -135 -23 57 214 139 14 32 -93 52 -150
4897 -150 -281 -6 -47 265 -134 18 175 165 166 -136 36 -23 -96 150 -11 -5 -220 -38 -162 -115 -8 -248 155
4920 155 -44 155 45 6 41 -39 61 1 73 -251 12 -176 -41 -153 -204 173 18 129 -62 -297 -80 171
4942 171 -51 242 294 97 -110 -149 72 -2 156 197 39 80 167 18 202 37 -54 -156 -156 46 -54 -37 19 -67
4966 -67 136 -44 69 -106 212 42 307 107 -122 -113 57 -227 -151 77 -77 97 -75 116 -20 6 262 179
4988 179 108 147 -22 152 147 -144 -42 -46 37 37 -145 -51 -84 219 -144 -170 72 161 8 -75 -77 -190 -201 254 -113 -2
5014 -2 174 12 45 141 27 9 75 -220 -142 91 -97 22 -177 104 85 106 -11 -76 104 91 -176 53 70 -82
5038 -82 -117 -38 -33 55 -333 -85 -78 39 62 94 -123 -23 65 51 -106 -55 303 -198 259 -31 144 -26 -127 -34 -6
$$ packed form
4873B08l28k7P9L19k26K7K6Pkl8k46K53n4J85l18J12Q0J57p5j25J8j25J45k02
4897a50j31K75m1L12l99J52J57j0Jl02J72n9p3K46j61Ok15J82j24M7J07k40M03
4920A55j99J99j10l9L5q0J00o0P2l24K63j88J35j12n1L77j55J11j91k35K17K51
4942A71k22K93N2j97k07l9K21p4J58M1j58M1Q7j49J84j65r1j02%K02j00J7N6q6
4966f7K03j80J13j75L18j70K65k00k29RJ70k84P6K28j54J74j72J91j36K6K56q3
4988A79p1L9j69J74nk91J02mQ3%j82R4l3L03l63k6K42Q9j53q3kj13j1M55l67J11
5014bJ76j62L3R6j14j8O6k95P8K33j88J19j99K81j9K1j17o5J80j3k67K29J7j52
5038h2l5P9NQ8l88K48PJ17K3L2k17J00Q8j4j57N1L58n01M57k90J75j70j01R3K8
$$ plain form
5063 -6 -56 11 46 -215 354 56 -24 -99 4 222 -150 279 -36 -19 171 149 -115 156 -2 147 166 -23 -164
5086 -164 -74 259 -313 -38 -160 -135 15 -87 -202 -4 -34 -177 320 79 -142 -12 93 -61 205 -9 40
5107 40 144 -33 230 151 49 -33 19 165 59 6 46 -96 -261 -41 8 -157 -91 -56 333 -40 140 -1 87
5130 87 40 131 231 215 60 -180 -78 157 37 120 137 -259 206 -20 495 -268 -9 -71 -158 -4 -296 174 -164
5153 -164 -12 48 10 79 121 -14 1 -162 77 144 76 -89 241 -127 137 167 -172 -26 -245 59 12 -365 15
5176 15 -115 -114 -65 6 -153 -135 -65 197 98 54 73 -2 -44 33 220 72 73 -9 -4 -86 -224 -89 -129 7 -100 107 -50
5203 -50 18 209 170 -17 26 60 183 -284 -65 -234 -320 -75 -119 159 -107 32 71 177 27 -142 -121 247 26
5226 26 -7 56 -194 -57 -131 238 219 97 135 98 -21 -16 138 -297 140 137 -237 -74 -155 147 -103 -25 107 -116
$$ packed form
5063fn0O7L5k61N69k98q0p5J03K18l72M29l15J7J90k2k64K71j58J49J9j89j41
5086a64R0L33n72K75j22K5J50j02j15J98l0j43M97k41k21J30J05j54K66k14M9
5107D0J04j77K63p9j02q2N2J46j06n3M0j42j65K20M9j65O6L5L89l73J80j41Q8
5130H7m7R1J00j6j55k40J02K35j20Q3J7l96M65k26N15p63K59o2q7J54k92M70l38
5153a64J52O0l8O9M2j35J5j63K39O7o8j65L30l68K64L0l39J46k19L04m7l77L80
5176A5j30JM9P1j59J8P0K62r9m4J9p5m2P7J87j48Jq2Nq2j38J35m0J36j07K07j57
5203e0O8J91l9j87M3L4J23m67K19j69q6K45m4K78k66J39L9J06j50j69K1L68k21
5226B6l3O3k50J37p4L69j9j22L8l7j19NJ54m35M37ll74J63q1L02k50P8J32k23
$$ plain form
5250 -116 -308 63 -43 101 28 238 41 -81 41 -9 -242 -66 183 -61 259 -22 188 150 229 -8 62 -88
5272 -88 30 -96 154 229 95 -41 141 -138 -40 -66 -96 130 72 44 -79 -189 11 -149 -105 -61 122 -78 -6
5295 -6 6 -119 81 96 -78 -8 31 303 9 -200 80 -279 52 -189 -280 -9 -169 -82 -179 26 28 -71 -1 -50 75
5320 75 60 189 12 44 286 -151 114 -27 -14 -36 204 23 28 91 184 1 -258 -14 -80 90 191 -98 294
5343 294 -164 65 11 187 -93 58 -154 -26 -212 -160 -27 -156 55 -56 95 0 99 -66 101 180 -72 141
5365 141 118 135 15 261 -54 -86 -219 -136 -112 -203 22 72 -132 -115 33 -211 -88 -108 159 242 -79 -94 -81 93
5389 93 -91 150 -107 51 -17 42 281 10 -31 -176 -117 -183 138 -12 39 -187 168 -59 -217 -170 -52 11 -248
5412 -248 -71 -21 0 -16 -32 -88 -22 166 112 140 78 -19 305 10 114 40 -37 -72 -136 -101 105 -300 17 109 -22
$$ packed form
5250a16j92L71j06J44p3K10j97j22J22n0k33J76K49k44L20k81K10l8P9k37P0j50
5272h8J18j26K50P5j34j36J82k79R8k6l0K26n8k8j23j10K00j60M4M4J83k00P2
5295fJ2j25K00J5j74P0L9K72k94k09K80l59L31k41r1K71j60Q7r7K05Kr9P0m9J25
5320G5j5J29j77L2K42m37K65j41J3k2K40j81NO3R3j83k59K44o6J70J01k89L92
5343B94m58K29n4J76k80J51k12J28j86N2J33j29K11j11J51r5R9j65J67P9k52K13
5365A41k3J7j20K46l15l2j33Q3K4r1K25N0k04J7J48k44J23k0K67Q3l21j5J3J74
5389I3j84K41k57J58o8N9K39k71m1j45N9o6L21j50N1k26L55k27j58M7J18O3k59
5412b48J77N0K1j6j6n6O6J88n4K8o2r7L24k95J04p4p7l5o4L5K06m05L17R2j31
$$ plain form
5437 -22 84 62 -65 -179 -81 84 -306 18 -103 -147 -259 19 23 122 29 -161 93 51 -27 6 -49 -192 -281 77
5461 77 -46 -142 -51 69 -264 -224 210 -66 -189 -355 92 -118 -201 -119 -106 21 -126 133 28 155 -258 -230 -206
5484 -206 13 137 20 29 -83 57 -57 -16 18 -300 259 -114 60 180 -89 216 -199 -91 43 -207 73
5505 73 -58 -56 -60 -37 -55 153 12 -21 193 -132 -57 82 245 9 70 99 52 129 -31 -52 -77 81 173 -99 128
5530 128 -279 -218 166 -35 -104 134 109 117 -230 66 -52 163 62 179 145 160 -254 -14 102 -241 -176 142 108
5553 108 117 104 -113 -42 -120 155 163 -93 193 -194 -269 -137 -67 42 -273 79 -45 165 -280 55 82 -60 -53 80
5577 80 -26 71 36 61 -180 100 107 -134 -130 -50 -5 83 -84 -198 -29 -96 12 -151 30 176 46 -96 -77 64
5601 64 -114 23 67 332 238 132 -119 -77 -80 -55 -156 8 107 -338 156 144 32 450 -178 145 169 -87 -205
$$ packed form
5437b2J06k2j27j14R8J65l90L24j21m4j12K78MR9r3j90K54m2p8L3n5j43q9L58
5461G7j23r6R1J20l33M0M34k76j23j66M47k10q3Q2J3J27j47K59j05J27m13K8K4
5484b06K19J24j17Rj12J40j14M1L4l18N59l73J74J20k69L05m15J08J34k50K80
5505G3j31KmK3j8K08j41l3K14l25P5J39J63k36O1K9m7P7j60k1k5J58R2k72K27
5530A28m07O1L84k01o9K38k5Ql47K96j18K15j01J17l4J5m14K40J16l43O5L18l4
5553A08Rj3k17P1p8K75Qk56K86l87p5J32P0J09l15L52j24K10m45L35K7j42PJ33
5577H0j06R7l5K5k41K80Pk41MQ0M5Q8j67j14J69o7J08j63J81J46j30j42J9J41
5601F4j78J37M4K65r4j06k51M2lK5j01J64R9m45M94j2j12M18o28L23K4k56j18
$$ plain form
5624 -205 -59 -256 126 36 -126 -14 42 14 -50 4 -34 183 -109 51 195 -88 226 30 -93 -39 -100 -111 -75
5647 -75 -156 -84 64 -188 11 40 -43 193 -65 -238 -138 128 77 -89 171 28 117 149 -218 -131 -117 -248 81
5670 81 107 -128 -162 -149 -70 -70 -91 16 228 -277 76 -31 -76 201 -71 74 3 -20 23 6 36 -146 -261 -288 -38
5695 -38 -210 -128 -77 25 81 55 155 -127 24 68 -13 348 -183 -109 175 -87 11 81 262 217 92 45 -197 -102
5719 -102 -25 -17 300 -284 27 -105 -206 184 -129 -177 28 71 179 163 -7 83 52 17 -174 77 75 -18 -89 -21 121
5744 121 -70 -108 113 44 166 157 -171 98 -86 -259 150 193 -140 -288 -13 -68 50 -122 260 325 122 -41
5766 -41 262 136 142 231 -170 51 82 7 154 -34 -200 -103 55 -281 150 179 -76 -6 -124 -121 -73 -259 -118 45
5790 45 -102 364 156 -88 -198 -78 -2 123 149 -51 -161 -143 204 -365 205 230 38 73 29 -55 -18 -17 80 65
$$ packed form
5624b05J46j97L82r0j62J12N6k8o4N4l8K17k92J60J44k83L14j96j23N4o1j1L6
5647g5q1P2J48k52J99K9q3K36k58j73J00K66n1j66K60j43Q9L2l67Q7J4j31L29
5670H1K6k35l4J3P9%k1J07K12n05L53j07m5K77k72J45p1k3M3j7L0j82j15k7K50
5695c8j72Q2N1J02N6k6J00k82J51M4q1L61n31P4K84k62R8P0J81m5j25m7k42R5
5719a02P7QL17n84L11j32j01L90l13m8K05M3J08j6j70R0l1l5j91K51kr3p1O8J42
5744A21j91l8K21o9J22rl28K69j84j73M09M3l33j48K75n5J18j72L82O5k03j63
5766d1L03j26OQ9m01K21L1p5J47j88j66R7J58l36M31K9k55P0j18LM8j86J41J63
5790D5j47M66k08k44j10J20P6J25K6k00j10J8L47n69N70K5j92L5m4q4L7JR7j5
$$ plain form
5814 65 9 -97 -39 35 -3 -233 158 7 45 71 286 115 192 49 163 82 -10 -170 155 26 -111 77 83 84 -72
5839 -72 1 235 96 162 -252 3 2 -275 -133 -230 91 -84 -86 135 13 117 -37 -120 -15 75 -62 -173 151
5862 151 269 133 -159 -85 -55 -175 40 -157 34 113 171 67 124 114 -23 -137 175 77 150 -129 33 215 97
5885 97 162 -248 31 282 -162 97 44 21 36 155 -4 -70 -119 95 -93 -128 -76 -127 -18 -23 192 88 -5 -261
5909 -261 -95 -257 48 68 79 54 -202 357 -47 30 184 -123 31 302 97 -39 178 53 205 -156 -47
5930 -47 -7 -16 217 222 -169 -14 -122 69 -92 172 84 275 -35 -190 -52 -132 150 -119 9 -179 98 33 -87
5953 -87 -311 105 -20 56 -17 -16 66 33 -69 216 26 77 105 372 160 22 49 84 77 -94 116 247 -38 209
5977 209 153 -171 -134 48 83 -83 0 107 230 38 175 -39 176 -147 -157 22 -16 -135 159 -193 -302 84
$$ packed form
5814F5n6j06N8P4l8k30L91j51L8K6K15j71P7j43J14q1r2j60L25j29j37J88OJj56
5839g2P3K34j39O6m14K55jk77J42r7L21j75kK21j22J04j54q3J05R0j37j11L24
5862A51J18j36k92P4L0j20K15j97J91P9N8j04N7j0j37j14L12r8P3k79J62J82j18
5885I7O5m10K79K51m44K59n3k3J5J19j59o6m9K14j88l5N2n1J09nK15j04r3k56
5909b61J66j62L05K0J1k5k56N59m04P7J54l07J54K71k05j36K17j25J52l61J09
5930d7M0rK33Nl91J55j08J91j61K64q8J91l10j55J38q0K82k69J28j88K77o5j20
5953h7k24M16j25P6p3JQ2l3j02K85j90N1K8K67k12j38K7L5pj71K10J31k85K47
5977B09n6l24L7J82L5j66Q3J07J23j92J37k14K15l23j0J79l8j19K94l52j09L86
$$ plain form
5999 84 -8 56 138 -36 -144 24 128 35 79 -196 214 60 275 112 114 -420 -132 43 -18 -337 6 54 125 81
6023 81 -72 131 -108 79 44 163 -16 63 -172 -174 123 20 -13 -103 -201 -56 -27 67 -46 -54 -179 31 7 92 -76
6048 -76 -41 -107 77 131 14 -62 -215 14 112 15 12 -199 -230 235 -201 -122 214 -45 -105 -113 -116 -7 52 126 294 103
6074 103 -128 -21 -244 37 -146 -28 60 34 209 -27 26 -58 -7 160 222 5 67 136 54 -59 -17 -20 347 8
6098 8 73 97 90 17 -237 52 182 -130 -123 -29 51 -182 120 55 136 -116 105 -84 57 -115 -129 -79 9 188 65
6123 65 52 24 -279 0 -178 28 4 -90 9 -224 69 21 137 -257 -82 -187 -30 203 209 33 97 -24 -60 -246
6147 -246 142 85 79 96 -114 -19 116 156 262 -144 58 173 114 -88 186 145 -56 34 -23 108 108 -136 -53 -154
6171 -154 -108 -267 -79 69 -75 -25 -367 0 106 241 118 0 -32 149 -174 172 -8 -97 134 -77 134
$$ packed form
5999H4r2O4Q2j74j08J68J04r3M4k75M10j54K15j63Kn34K88J75o1l19L43M8P1m4
6023H1j53K03k39J87l5J19j79P9k35kK97j03l3r0r8J45K9R4j13qj25K10k4Q5j68
6048g6L5o6J84N4j17p6j53K29R8r7lk11l1M65m36P9L36k59o0qlJ09N9P4J68j91
6074A03k31J07k23K81j83J18Q8k6J75k36N3q4N1J67O2k17O2O9q2j13M2lL67l39
6098HO5K4pp3k54K89J30l12PR4Q0k33L02o5Q1k52K21j89J41j72j4N0Q8J79j23
6123F5j3k8l03K79j78K06k4r4R9k33K93m8J16l94J75j05J57K33Oj76O4j21l6j86
6147b46L88n7oJ7k10R5J35M0J06m06K02J15n9k02K74m1k01R0n7J31%k44Q3j01
6171a54M6j59J88J48j44N0l42L67J06J35j23j18l2J81l23L46j80q9K31k11K11
$$ plain form
6192 134 43 59 -3 -13 -154 -247 195 20 -162 86 183 62 -155 60 -170 189 169 -33 -143 32 176 -155
6214 -155 -188 -345 -99 154 -23 -52 3 89 226 -165 133 -165 50 86 85 -175 23 39 -69 -145 257 86 53
6237 53 -162 64 238 -256 -37 -188 18 -177 94 -182 119 -250 52 -93 -144 -362 -160 158 -91 115 99
6258 99 -262 -127 -89 -129 112 40 232 -40 264 32 -43 -270 -1 -30 130 315 21 -133 82 -94 -232 30
6280 30 -119 73 -47 60 58 -41 79 -127 -41 299 14 6 -94 -70 -14 -145 172 53 16 128 -69 141 -102
6303 -102 94 -82 -19 47 227 -231 35 259 75 139 -57 -69 152 -194 62 -58 47 -78 50 -200 78
6324 78 -116 -84 3 69 145 -8 50 64 -60 -15 -44 9 -94 112 128 91 -102 -83 -113 244 75 -142 -105 -20 -20 -166
6350 -166 35 -94 84 29 -169 -30 -13 -37 149 74 145 80 -65 -124 370 40 -16 152 -50 -53 -45 67 -40 -12
$$ packed form
6192A34r1J6o2j0j41r3M42j75j82K48R7j21k17K15k30L59k0k02j10J75J44l31
6214a55l3j57K46K53j77k9N5Q6J37l91K98k98K15L6jk60J98J6j08p6M02j71l3
6237E3k15K26J74m94K19j51K06j95K71k76L01l69L02j45n1k18K02L18k49K06j6
6258I9l61J35L8m0K41p2J92k72L04k32p5k27K69k9J60J85k94j54K15j76j38K62
6280C0j49J92j20J07kr9J20k06Q6L40k85qj00K4N6j31L17j19l7J12j97K10k43
6303a02J96j76O3O6J80m58K66K24j84O4j96j2K21l46K56j20J05j25J28k50K78
6324G8j94L2Q7O6P6j53N8J4j24M5k9N3j03K06J6l7j93J9l0L57j69k17L7Q5%j46
6350a66K01j29J78n5j98J39J7k4J86p5P1o5j45n9M94l30n6J68k02lQJ12j07K8
$$ plain form
6374 -12 21 88 -134 30 -71 -112 166 -74 17 18 109 129 127 -63 -145 177 101 323 -144 58 34 244 -267 -192 402
6399 402 -184 139 -155 182 -29 -246 -73 -63 -34 132 170 -32 194 -129 -235 60 108 -47 98 63 -147 -56
6421 -56 -258 -100 221 -75 -70 -38 29 -211 58 -259 201 77 163 165 49 70 -110 -45 -217 -153 -179 10 1 276 129
6446 129 37 -178 95 160 165 -130 104 -121 -1 101 12 -72 129 -145 60 108 82 -221 195 247 187 76 120 186
6470 186 -229 186 41 135 49 9 59 -165 -43 183 -143 -90 -223 80 7 193 18 116 -160 -144 -115 -165 -76 136
6494 136 -286 393 -29 -152 152 -35 52 32 85 132 -244 64 -68 -62 15 -267 2 -124 97 -4 -12 -213 148
6517 148 -165 83 76 48 -231 31 107 46 50 -95 156 -74 -150 218 48 -170 132 -13 133 45 -308 -79 42
6540 42 -119 74 20 -8 108 -60 83 57 -4 -14 90 -297 28 184 -82 236 103 117 -226 -177 93 111 48
$$ packed form
6374a2L3O7k22J64j01m1K78k40R1JR1K0kj90q2L22p6K22m67K02k4K10n11P5N94
6399D02n86L23k94L37k11k17J73J0K9J66L8k02K26l23j06K95M8j55J45l5k10R1
6421e6k02J58L21k96NL2O7k40K69l17M60j24Q6Kj16K1j80O5j72O4k6J89rK75j47
6446A29r2k15K73O5Nk95K34k25J20J02q9q4K01k74K05M8k6l03M16N2o0j11M4O6
6470A86m15M15j45R4q6m0N0k24J22K26l26N3j33L03p3J86j75R8k76J6K9n0Q9K12
6494A36m22O79m22j23L04j87Q7k0N3M7l76L08j32OP7k82K69j26K21j01qk01L61
6517A48l13K48pk8k79K62P6o1Mj45K51k30p6L68j70k18L02j45J46q8l53K29J21
6540D2j61J93n4k8J16j68J43k6o1j0J04l87L25J56k66L18j33J4l43M9K70J8o3
$$ plain form
6563 48 191 -157 -240 -250 57 -42 -66 -74 -5 177 -150 188 -117 -36 45 -112 127 105 -133 215 -223 -102 -142 4
6587 4 115 -203 50 -21 69 222 61 44 -157 104 65 -34 80 168 115 -201 -172 -135 61 -117 -248 -36 -257 -84
6611 -84 -290 -121 -73 -260 -199 95 299 94 54 86 38 40 71 -110 -30 71 246 65 98 108 -203 6 240 8
6635 8 -71 381 276 168 196 -160 80 161 125 94 121 -159 -37 56 -33 108 -33 -19 -59 -158 -121 -165 139 -24 -237
6660 -237 -177 140 89 19 -2 116 76 -93 108 -11 213 76 64 115 444 212 289 -107 216 -11 128 143 -29
6683 -29 110 31 231 130 -96 133 44 36 34 116 -11 -199 6 129 162 177 54 -110 -1 -134 351 -70 -116 29
6707 29 -118 -227 -9 -141 109 -33 -164 120 -147 -27 -171 47 77 67 17 1 217 72 266 -44 101 5
6729 5 -49 71 62 141 67 128 -123 -35 -21 192 48 169 86 -310 -25 -102 -129 -84 -84 -39 -267 -33 -306 11 19 -28 89
$$ packed form
6563D8J43l48q3j0L07r9k4qO9J82l27L38l05Q1Q1j57K39k2k38L48m38J21m0J46
6587DJ11l18K53p1R0J53j61j7k01K61l9r9J14Q8n3l16K9L7J96j78j31K12k21J73
6611h4k06J69M8j87O1K94K04k05m0L2m8KL1j81Q0J01J75j81L3J0l11K09K34k32
6635Hp9M52j05j08K8l56K40Q1l6l1K7k80J22R3q9J41j41J4m0r9L7m4L04j63k13
6660b37O0L17n1p0k1J18m0j69K01j19K24j37j2N1L29k32P7l96L23k27J39J5j72
6683b9J39p9K00j01k26K29q9qkQ2j27j88K05J23L3J5j23j64J09j33M85m21m6J45
6707B9j47j09K18j32K50j42j31K84k67J20j44K18L0j0n0j6K16j45J94l10J45r6
6729En4J20rP9p4O1k51Q8J4K13j44J21q3l96K85p7k7M5%M5k28K34k73L17Qm7J17
$$ plain form
6756 89 -99 28 -97 -66 -51 -104 79 290 -242 19 27 61 70 -143 -98 34 -59 90 -166 67 71 109 7 268 164
6781 164 -16 5 119 127 -64 145 63 -147 -31 343 164 -153 116 -253 -57 215 -68 -4 -146 93 110 -93
6803 -93 -161 135 -28 143 29 -430 301 90 -103 -22 41 -223 57 -74 -309 -14 0 94 52 -135 181 -210
6825 -210 75 -92 76 -63 403 -166 41 -243 -106 -69 -144 -118 -92 -162 113 -144 112 13 -51 -60 99 -164 -41
6848 -41 231 -209 -47 -126 75 -185 81 82 222 -212 87 19 -2 54 8 35 -175 -230 -49 -33 -161 28 201 126
6872 126 20 -241 -214 -14 54 17 -118 -49 215 62 -82 -61 -223 44 -165 -96 -101 154 70 -207 41 310 -82
6895 -82 -128 33 176 2 -79 141 -11 -202 38 52 -67 82 -252 -20 78 150 8 -224 256 83 247 -10
6917 -10 68 -24 -61 -146 53 25 -222 -83 -8 -47 85 -112 -57 142 -73 36 -172 12 -54 -27 -17 53 5 48 44 -79
$$ packed form
6756H9j88J27j25L1J5n3J83K11n32K61QL4Rk13M5J32r3J49k56K33ML8j02K61j04
6781A64j80K1J14Qj91K09q2k10J16L74j79l17K69l69J96K72k83O4j42K39J7k03
6803i3o8K96j63J71j14m59P31k11j93Q1O3k64K80j31k35K95J4R4m2j87L16l91
6825b10K85j67J68j39M66n69K07k84J37L7p5K6K6p0K75k57K56r9o4rJ59k63J23
6848d1K72m40J62p9K01k60K66JJ40m34K99o8k1N6m6K7k10n5J81J6j28J89J73p5
6872A26j06k61K7K00O8l7j35O9K64j53j44K1j62K67k09O9nK55q4k77K48K69l92
6895h2m6J61J43j74q1K20j52j91K40J4j19J49l34K32R8P2j42k32M80j73J64k57
6917a0P8r2l7q5J99k8k47J39P5l9J32j97N5J99k15J09k08J84o6K7J0P0m8M3mj23
$$ plain form
6943 -79 38 271 -6 154 -17 -124 198 -246 -152 131 34 33 181 99 -237 -82 -187 -25 185 -113 -311 -129
6965 -129 7 164 15 4 -68 56 40 32 83 116 126 -133 106 -137 17 -70 212 145 174 -143 -206 -211 -273 -147 -116
6990 -116 35 168 -22 59 -119 19 -19 -2 -93 -103 106 0 10 -93 -307 -111 105 -72 -41 187 64 -4 -265
7013 -265 161 -98 37 -56 24 167 -133 -79 68 -34 -52 -174 92 30 -20 39 114 105 64 123 -55 89 140 -146
7037 -146 -46 44 124 -26 -3 77 241 -40 2 99 -29 146 -91 57 -268 81 -390 180 -6 150 52 -127
7059 -127 -17 21 -179 38 -24 180 -80 -72 83 56 -53 -41 -34 -5 55 262 354 92 224 -185 -87 -91 -222 -97 -235
7084 -235 -28 -36 -66 92 -100 87 181 186 3 -17 -75 -130 -157 96 -171 -90 -26 122 94 33 30 -120 -61 46 -138 55
7110 55 -32 207 -48 -42 53 62 80 162 -140 14 -147 -99 -67 -57 -191 92 -178 216 -17 182 -178 11 -35 47 169
$$ packed form
6943g9J17K33k77J60j71j07L22m44R4K83r7jJ48q2l36J55j05J62K10k98j98J82
6965a29J36J57j49j1p2J24j6qN1L3J0k59K39k43J54q7K82o7K9l17o3no2J26L1
6990a16J51J33j90Q1j78J38l8J7r1j0K09j06J0j03k14J96K16j77L1K28j23o8k61
7013b65M26k59J35r3Q0J43l00N4J47j02j8j22K66o2n0N9P5rm1N9j78J44N1k86
7037a46J00R0Q0j50K3Q0J64k81M2R7j28J75k37J48l25L49m71N70j86J56r8j79
7059a27J10L8k00K17o2K04k60QJ55k7j09J2PK9O0K07R2k62J32m09R8mj31J25j38
7084b35K07ql0J58j92J87R4Nj83k0n8n5k7K53k67Q1O4J48k8o1lj50N9J07j84J93
7110E5q7K39k55OR5RJ8Q2l02J54j61M8L2J0j34K83k70L94k33J99l60J89m6Q2J22
$$ plain form
7135 169 -102 -239 172 298 67 7 -38 92 -69 85 142 -165 -102 -17 61 -260 221 194 -81 -168 29 31 200
7158 200 -120 13 -102 49 4 -80 28 -10 -114 35 120 1 78 -153 -47 -88 -101 222 53 -57 -50 -54 151 206
7182 206 -73 -58 32 171 -16 -73 -94 -20 197 27 27 27 74 17 -209 228 97 226 93 -52 -256 16 -88 103
7206 103 51 -208 -47 83 77 -170 -172 -15 180 43 -112 -144 232 -117 29 156 -69 133 209 -146 55 -456
7228 -456 -170 -108 -86 -227 -66 57 126 133 -25 -213 -55 -25 -132 -36 87 -179 -18 151 306 -28 23 -185 521
7251 521 283 -300 -82 3 -59 -75 -71 -238 54 -43 -99 75 -52 -133 -110 -27 107 63 -13 55 99 35 7 164 57
7276 57 88 240 -167 -142 18 -35 120 227 -196 -130 -11 127 200 -92 141 13 -54 180 -167 -81 -163 66 216
7299 216 122 -338 9 73 -210 175 -167 86 95 108 130 15 37 125 37 117 -212 -69 -41 -5 -134 7 -63 34 -12
$$ packed form
7135A69k71j37M11J26k31o0m5J30j61J54N7l07O3Q5P8l21M81k7k75q7J97KJ69
7158B00l20J33j15J51m5q4J08l8j04J49Q5j19P7k31J06m1j3L23j69j10PmK05N5
7182B06k79J5R0J39j87n7k1P4K17j70%%M7n7k26M37j31J29j33j45k04K72j04J91
7206A03n2k59J61J30ok47kJ57J95j37j55l2L76l49J46J27k25K02P6l55K01n11
7228d56K86O2K2j41J61J23O9Pj58j88J58L0j07R6J23k66J61J69J55l34N1k08P06
7251E21k38n83K18Q5o2j6Mj67K92r7n6J74j27q1K3Q3J34m4p6O8M4o4k8J57j07
7276E7L1J52m07K5J60n3J55J07m23O6J19J38P3k92K33j28o7K34l47Q6q2K29J50
7299B16r4m60L47O4k83L85l42K53RJ3K2j15K2Q8q8Q0l29J43K8L6j29J41p0R7m6
$$ plain form
7324 -12 -147 -264 198 249 147 180 47 51 -63 -203 344 -8 133 68 -40 18 -97 276 213 -5 78 173 29
7347 29 -112 -98 -217 46 -87 -75 -114 113 98 -151 24 198 -22 73 -10 242 -124 -322 128 79 196 134 73
7370 73 82 19 -22 -32 204 285 2 -237 1 -191 -38 -72 -58 -121 -12 110 -22 34 -134 -34 -176 54 68 152
7394 152 -11 -84 22 78 92 24 104 150 -263 -256 21 19 244 -9 45 -33 0 175 69 -143 -62 71 -33 175 276
7419 276 -90 48 -119 -187 -150 64 142 8 263 101 -167 -99 14 -31 271 20 33 10 -334 -132 53 -101
7441 -101 -60 -191 -153 312 78 177 -17 -119 -304 -155 -103 41 -104 44 -89 -1 2 20 -42 -16 18 91 132 -168
7465 -168 136 227 47 8 53 -249 -282 136 162 -77 -91 34 -201 46 -42 118 -90 -80 -77 66 -22 218 -340 -193
7489 -193 63 -201 125 -98 37 52 338 87 -13 39 49 8 -164 -396 -43 -72 82 -277 33 -95 195 63
$$ packed form
7324a2j35j17M62N1j02L3j33Mj14j40N47l52J41o5j08N8j15L73o3k18Q3R5j44
7347B9j41J4j19K63j33J2l9K27j5k49J75J74k20R5q3K52l66j98M50m9J17o2o1
7370G3Ro3m1j0K36Q1k83k39K38j92J53l4J4o3J09J22j32N6j68J00j42K30J4Q4
7394A52j63p3J06N6J4o8Q0M6m13PK77kK25k53N4p8L3J75j06k12Q1J33j04K08J01
7419B76l66J38j67o8L7K14P8j34K55j62k68O8J13m5L02k51J3k3l44K02J85j54
7441a01M1j31L8M65k34R9j94j02j85J49N2J44j45J48j33Q8LJ8o2K6L4P3M1l00
7465a68L04R1j80l9M5l02l3M18K6k39j4J25k35K47q8J60k08J0LJ43q8K40n58J47
7489a93K56k64L26k23J35J5K86k51j00N2J0m1j72k32L53k9J54l59L10j28K90j32
$$ plain form
7511 63 -134 -5 -26 63 53 -75 -70 -45 10 92 36 -51 -126 -120 261 153 30 43 -55 -97 289 26 162 59 119 13
7537 13 -106 -1 129 -199 -4 -57 2 115 236 156 -64 177 -51 -13 -80 -48 -63 144 63 172 27 17 44 -9
7561 -9 -240 144 48 225 63 48 -33 24 -117 -7 -11 135 -25 -30 47 243 59 143 65 -40 165 -96 277 -25
7585 -25 -154 156 73 198 158 -371 160 -47 -13 -7 -11 -163 -231 34 277 185 158 -30 122 -228 20 -91 -62 -14
7609 -14 -78 -210 104 -18 -81 220 -129 118 -126 -243 217 -27 -60 -148 -105 75 182 -105 -16 63 34 -51 251
7632 251 171 112 -171 -330 -11 157 135 -52 -57 -131 162 127 295 -159 88 -64 -194 -146 -139 16 -26 100 -43 -142
7656 -142 -4 291 20 -121 -68 82 88 155 -30 -104 39 257 61 15 238 105 -63 -248 136 -178 -10 245
7678 245 112 -55 -36 117 -90 326 189 -54 160 -151 25 -244 342 -83 146 25 219 -78 -115 -48 -60
$$ packed form
7511F3j97J29k1Q9j0j28NK5N5Q2n6q7p5OL81j08j23J3r8m2L86k63J36j03O0j06
7537A3j19J05J30l28J95n3N9J13J21q0k20K41k28L8o7L2j5K07q1J09j45j0K7n3
7561ik31L84r6J77j62j5q1N7j41J10mJ46j60nP7J96j84Q4p8j05K05k61L73l02
7585b5j29L10q3J25m0n29N31k07L4Omj52o8K65K43r2k7j88J52l50K48j11K9M8
7609a4o4j32L14j22o3L01l49K47k44j17M60k44l3q8M3J80J07k87Q9P9k9q5L02
7632B51q0n9k83j59L19J68k2j87np4K93l5J68m54K47j52j30M8PJ55m2J26j43r9
7656a42J38K95k71j41N3J50OO7j85p4J43K18j96m6K23j33j68j85L84l14J68K55
7678B45j33j67J9J53k07M16j37k43K14l11J76k69N86m25K29j21J94k97l7O7j2
$$ plain form
7699 -60 -154 -205 127 189 -192 -174 65 -107 -55 -10 -205 394 140 265 62 141 -30 49 -86 4 25 93 28 47 -72
7724 -72 -82 -218 110 42 -61 96 -13 332 -147 -120 -266 -238 -128 41 168 198 52 -146 -121 -197 -147 178 18
7747 18 -22 -82 -82 -19 177 -49 64 35 -279 195 30 69 78 -87 197 -81 0 -36 29 -201 -301 -13 35 -102 112
7772 112 55 84 117 -248 100 70 116 58 335 188 91 -34 86 26 208 -163 58 165 -199 -10 -118 -143 64
7795 64 -142 -130 -194 -164 -233 -22 103 204 104 63 187 -233 -208 61 -152 -5 71 22 -41 -62 16 -229 201 -51
7819 -51 144 180 181 -238 -115 -18 -244 5 62 -114 186 -86 -10 -6 2 43 46 121 183 50 -174 111 119 9 3 -10 -6 -146
7847 -146 71 -307 -163 -308 -79 -24 -126 -10 -45 35 27 -296 -298 139 165 -246 -53 117 20 47 -82 9 -108 -195
7871 -195 -65 294 -74 286 -193 -31 322 163 -165 -124 -76 -123 75 -220 22 47 -348 -220 15 -138 -198 -53
$$ packed form
7699f0r4n1L32O2l81J8K39j72N2M5j95N99k54J25k03P9j71P9j35R0K1O8o5J9j19
7724g2j0j36L28o8j03J57j09L45m79K7j46K8J10J69J27L0j46j98K5p6N0L25j60
7747A8m0o0%O3J96k26J13k9l14M74j65L9Rj65K84k78Q1l6O5k30j00K88M8j37K14
7772A12n7K9L3l65L48l0M6n8K77j47r7j25J20o0J82l71K21J07l64J89j08k5K07
7795F4k06J2o4L0o9K11J25J01j00m1J24m20K5K69k13J47P6m9o3k1P8k45M30k52
7819e1J95L6Jm19J23R7k26K49N7j76L00k72P6MQM1LP5O2j33k24K85Qj10oj3Mj40
7847a46K17l78J44j45K29N5j02J16l5Q0ql23kM37K6m11J93J70r7K7j29R1j17q7
7871a95J30L59l68L60m79J62L53j59l28M1M8m7J98k95K42K5l95J28K35j53o0J45
$$ plain form
7893 -53 205 148 96 -110 -7 217 34 41 -47 -90 41 56 7 -159 187 238 21 -84 196 -48 172 -25 213
7916 213 69 -97 193 34 -101 -126 266 -38 -272 117 -122 -180 -152 -139 64 50 -31 -31 -202 -82 85 -102 8
7939 8 -76 -95 -72 -12 -97 209 141 -127 66 -173 49 48 -48 -77 50 215 -99 -92 -103 15 111 -255 239 -92 228
7964 228 -52 126 -186 -21 -81 -103 -48 -230 32 -210 235 -102 -26 28 29 -37 42 -207 -116 74 18 -201 -42 72
7988 72 -99 31 -159 179 -9 68 291 -92 10 196 111 125 67 261 37 -144 -212 -166 19 263 -297 -16
8010 -16 -162 88 -45 -46 -110 -141 35 -130 192 -87 -208 3 70 -2 -2 65 150 -210 -49 103 61 78 -160 0
8034 0 18 -28 -23 51 -55 52 81 -258 -185 66 -220 -104 -27 132 22 -157 -194 -50 62 16 160 -36 58 -109
8058 -109 -99 -32 157 -36 -218 1 -37 -67 64 194 33 -39 -13 137 -3 195 -79 90 -140 -44 -92 28 51
$$ packed form
7893e3K58n7n2k06J03K24j83Pq8m3J31J5m9j66L46N1k17j05K80k44K20j97K38
7916B13j44j66K90j59j35k5L92l04k34L89k39n8K8J3K03j4q1%j71J20J67j87J10
7939Hq4j9K3O0q5L06o8k68J93k39K22jr6k9J27J65l14Pj1J18R6l66M94l31L20
7964B28k80J78l12J65o0k2N5j82K62k42M45l37P6N4Jo6P9k49R1J90n6k19J59J14
7988G2j71J30j90L38j88P7K23l83J02J86q5J4n8J94k24j81o8M6J85K44n60K81
8010a6j46K50j33jo4l1J76j65L22k79j21K11O7p2%O7Q5l60J61J52m2J7k38J60
8034@J8m6NP4j06J07K9l39P3K51k86J16P7J59j10j79l7J44J12m6J44j96R4j67
8058a09J0O7J89j93j82K19l8l0J31J30j61p2K6J50j40J98k74J69k30R6m8J20K3
$$ plain form
8081 51 63 -100 -118 325 -31 -79 73 113 182 137 215 -40 21 -267 -204 -150 117 14 -57 -207 -142 -58 35 103 -109
8106 -109 -161 77 29 -178 -77 -17 44 -156 -152 -38 -104 -160 -26 -158 -92 -118 -106 -27 42 63 -181 205 22 127 157
8131 157 159 90 -153 63 174 17 131 -30 -100 182 -123 180 68 -75 -25 -62 -179 -12 -144 23 136 -251
8153 -251 150 -30 78 -13 -127 14 41 -133 -104 -22 275 173 48 100 -147 220 -116 -40 -20 159 12 7 35
8176 35 219 -21 118 -54 -21 -7 -261 10 -68 146 -138 -5 389 223 116
$$ packed form
8081E1J2j63j8M43l56m8J52M0O9m5P8k55O1k88O3N4K67j03p1j50O5Q4R3O8k12
8106a09n2K38m8k07J01O0O1k00MJ14o6n6J34j32O6k6J2P9O9K1k44L86j83J05L0
8131A57Ko9k43K16J11j57J14j61p0K82l05L03j12j43N0l7j17J67j32J67J13l87
8153b51M01j80J08r1j14J41K7j74K9Q2K97j02j25N2k47L67l36P6K0J79j47nK8
8176C5J84k40J39j72L3J4k54K71p8K14k84J33L94j66j07
8191A16
$$ Imaginary data points
##PAGE= N=2
##DATA TABLE= (X++(I..I)), XYDATA
$$ plain form
0 0 0 0 0 0 0 0 0 0 0 0 0 0 0 0 0 0 8 -8 8 -8 8 -10 16 -16 18 -24 24 -32 34 -40 48 -53 59 -67 75 -85 96 -107
38 -107 120 -133 149 -167 183 -201 223 -247 274 -301 333 -367 403 -445 490 -541 599 -663 736
57 736 -819 918 -1033 1172 -1344 1560 -1844 2236 -2810 3742 -5503 10025 -48123 -75441 26875
72 26875 59358 70188 87150 101920 78526 61895 49725 17327 -30429 -33835 -37902 -62769 -64230
85 -64230 -40959 -27456 -20541 -16258 409 4785 -339 9846 12638 4723 13053 20023 19675 12208
99 12208 10317 20266 14550 -256 3458 1267 -9817 -8681 -1477 3234 3566 10510 21416 8914
113 8914 776 8697 -6949 -23537 -20437 -23748 -31564 -29319 -16719 -8800 -7372 9710 21862 14929
127 14929 14851 12091 -1094 -6684 -11213 -17352 -18352 -16806 -7134 -161 963 12778 21282 24385 27181
$$ packed form
0@%%%%%%%%%%%%%%%%Qj6J6j6J6j8K6l2L4m2M8n6O6p4Q8j01J12j26J42j60J81k03
38a07K27k53K82l16L50l84M24m70N21n75O34p00P70q48R35j031J140j262J399
57G36j555J737j951K205k516K904l404M080n046O552r245J5528n8148k7318J02316
72B6875L2483J0830J6962J4770k3394j6631j2170l2398m7756l406m067k4867j461
85f4230K3271J3503O915M283J6667M376n124J0185K792p915Q330O970l48p467
99A2208j891R949n716j4806L714k191j1084J136P204M711L32O944J0906j2502
113H914q138P921j5646j6588L100l311p816K245J2600P919J428J7082J2152o933
127A4929p8k760j3185n590m529o139j000J546R672O973J124J1815Q504L103K796
$$ plain form
142 27181 18992 15610 14551 6126 2124 -2463 -5831 -1930 -4123 -8400 -12446 -13878 -6510 -8268 -14918
157 -14918 -9396 -5862 -5108 -199 -824 413 6453 9103 6821 -1427 -3068 620 -6953 -8647 -6556
172 -6556 -8305 -2142 -135 -2965 248 3124 6120 6848 3302 5255 5173 3674 4747 1405 2478 7537
188 7537 3754 1274 2213 751 1123 -1247 -873 1518 -918 1204 512 -4921 -268 1058 -3572 -2664
204 -2664 -2720 -3573 -4266 -5738 -3819 -4174 -3917 -22 -3901 -5214 -2344 -5246 -4402 -1297 -1646 1722 2599
221 2599 3751 7221 6530 7981 8000 5323 7527 3468 -1568 -440 -2513 -1972 -193 -2620 -251 2240
237 2240 2262 2846 -93 1743 4188 -1022 -1948 -2257 -5533 -1907 -2481 -5067 -2942 -1365 343 -2101 -5073
254 -5073 -1092 -2598 -4537 -1722 -4358 -4038 32 -1629 -1315 987 3327 5802 3705 5104 7647 5720
$$ packed form
142B7181q189l382j059q425m002m587l368L901k193m277m046j432P368j758o650
157a4918N522L534P54M909o25J237O040K650k282q248j641L688p573j694K091
172f556j749O163K007k830L213K876K996P28l546J953q2j499J073l342J073N059
188G537l783k480R39j462L72k370L74K391k436K122o92n433M653J326m630R08
204b664n6q53o93j472J919l55K57L895l879j313K870k902Q44L105l49L368Q77
221B599J152L470o91J451J9k677K204m059n036J128k073N41J779k427K369K491
237B240K2N84k939J836K445n210r26l09l276L626n74k586K125J577J708k444k972
254e073L981j506j939K815k636L20M070j661L14K302K340K475k097J399K543j927
$$ plain form
270 5720 6861 6263 3205 5674 4647 1489 1122 -826 -132 -236 -3798 -2328 -2427 -2948 -1750 -4528 -3386
287 -3386 -895 -3334 -2474 -2149 -3081 -137 -1159 -1991 -838 -1090 1219 -480 -2518 585 -576 -2427
303 -2427 280 -1109 -127 2266 1526 2966 3097 4132 5136 1413 2256 4387 403 347 503 -1166 786
320 786 677 542 1510 992 2905 1089 -2153 15 -1071 -2616 -1325 -3117 -1704 259 -943 -433 -626
337 -626 -521 797 -2529 -3663 -3221 -4682 -2593 -3199 -3234 1257 2150 2416 4244 3887 5216 4853 2813 2779
355 2779 496 158 315 -3087 -1881 1773 501 1751 2602 2462 3580 1655 1415 732 -924 1005 -1261
372 -1261 -3889 -1151 -1612 -2267 -1035 -1949 -961 -954 -3133 -3197 -4282 -3250 -1108 -3241 -1751 122 -579 1395
390 1395 980 572 2791 1924 1126 690 -406 1866 1554 1169 4441 4370 5085 6316 3236 3632 4164 1852
$$ packed form
270E720J141n98l058K469j027l158l67j948O94j04l562J470r9n21J198k778J142
287c386K491k439Q60L25r32K944j022q32J153k52K309j699k038L103j161j851
303b427K707j389R82K393p40J440J31J035J004l723Q43K131l984n6J56j669J952
320G86j09j35R68n18J913j816l242K168j086j545J291j792J413J963j202N10j93
337f26J05J318l326j134M42j461K089o06l5M491Q93K66J828l57J329l63k040l4
355B779k283l38J57l402J206L654j272J250Q51j40J118j925k40o83j656J929k266
372a261k628K738m61o55J232r14R88Pk179o4j085J032K142k133J490J873p01J974
390A395m15m08K219q67p98m36j096K272l12l85L272p1P15J231l080L96N32k312
$$ plain form
408 1852 1066 -1480 -2436 -2652 -5517 -5389 -4665 -5323 -2526 -2798 -3909 -742 -292 84 961 612 2604 1762
426 1762 107 92 -1856 -1404 270 -2012 -990 1005 124 1297 807 1632 3811 2992 3489 2810 1004
443 1004 2352 909 -1545 32 -1019 -1608 -1870 -3951 -2790 -2175 -1604 318 -219 2032 4207 2071
459 2071 3042 3823 2317 2671 206 -2011 -2190 -3845 -4241 -4566 -4463 -1423 -1156 -818 935 512 1487 1510
477 1510 -965 -1130 -1674 -3077 -3673 -4979 -2634 649 1362 4487 6654 6993 9311 8163 6102 6383 4083
494 4083 2157 -438 -3068 -3111 -4300 -5141 -3766 -4789 -3589 -2554 -4945 -4745 -3899 -4020 -2411 -2426 -1052
511 -1052 1336 1285 3100 3231 2985 5033 3251 757 377 -1298 -1304 -968 -1735 484 1833 2874 3431 1822
529 1822 2728 3135 -199 -636 -2409 -3880 -3265 -4170 -3450 -1190 255 2476 2448 2227 4276 2825 1528
$$ packed form
408A852p86k546r56k16k865J28P24o58K797k72j111L167M50L76Q77l49J992q42
426A762j655j5j948M52J674k282J022J995q81J173m90Q25K179q19M97o79j806
443A004J348j443k454J577j051n89k62k081J161O15N71J922n37K251K175k136
459B071R71P81j506L54k465k217j79j655l96l25J03L040K67L38J753m23R75K3
477A510k475j65n44j403n96j306K345L283P13L125K167L39K318j148k061K81k300
494D083j926k595k630m3j189q41J375j023J200J035k391K00Q46j21J609j5J374
511a052K388n1J815J31k46K048j782k494l80j675oL36p67K219J349J041N57j609
529A822R06M07l334m37j773j471O15r05P20K260J445K221k8k21K049j451j297
$$ plain form
546 1528 1322 -659 -559 -810 -2928 -2385 -1771 -1056 -99 -1408 -787 -190 -2399 -1971 -2717 -2901 -623 -893
564 -893 -686 1263 1659 3321 3040 2207 3492 2248 1266 805 -1344 -709 -293 -1232 -2 410 661 1375
582 1375 0 -123 348 -474 151 -1003 -1813 263 -638 -777 292 169 1256 618 -1355 -1377 -2495 -3017
600 -3017 -3335 -4978 -3146 -1866 -2398 -746 330 1320 3637 3619 3926 4241 3195 3505 1692 685 1559
617 1559 397 -336 -76 -1366 -582 -403 -2080 -1320 -1146 -1249 -712 -2030 -903 4 -402 1125 488 684
635 684 1981 678 -169 -280 -648 -57 -1545 -2670 -1566 -2260 -1856 -1176 -1887 77 1126 718 1018 1003
653 1003 1610 2522 1675 1846 1694 1174 1521 526 -522 994 46 -474 -635 -1570 -435 -1147 -1922 -943 -1140
672 -1140 -299 -151 -1267 240 518 293 1153 458 617 1511 166 -90 -262 -760 277 -1190 -1682 -592
$$ packed form
546A528k06j981J00k51k118N43O14P15R57j309O21N97k209M28p46j84K278k70
564h93K07J949L96J662k81q33J285j244r82m61k149O35M16r39J230M12K51P14
582A375j375j23M71q22O25j154q10K076r01j39J069j23J087o38j973k2j118n22
600c017l18j643J832J280n32J652J076R90K317j8L07L15j046L10j813j007Q74
617A559j162p33K60j290P84J79j677P60J74j03N37j318J127R07m06J527o37J96
635F84J297j303q47j11l68N91j488j125J104o94M04O80p11J964J049m08L00j5
653A003O07R12q47J71j52n20L47r95j048J516r48n20j61r35J135p12p75R79j97
672a140Q41J48j116J507K78k25Q60o95J59Q94j345k56j72m98J037j467m92J090
$$ plain form
690 -592 -1434 -1032 -417 -1101 -132 497 -91 204 406 1328 1604 804 1415 1726 1088 1525 705 161 1080 288
710 288 209 45 -343 528 -332 -1051 -371 -919 -307 -205 -1612 -242 -300 -1143 -705 -1043 -750 -509 -1303 -892
730 -892 -962 -1154 358 -363 -414 1172 641 1579 1234 500 1853 1271 828 1054 23 928 908 -423 310 583
750 583 49 991 -60 -646 -183 -732 -797 -1270 -1440 -243 -908 -868 198 -311 406 534 -302 358 149 17
770 17 -396 -1476 -676 -322 -1049 -379 155 235 1151 711 682 1556 909 1238 405 -103 740 -75 -179 174 -183
791 -183 436 713 -568 393 173 -477 -246 -1401 -457 29 -656 -43 -185 36 1083 221 -139 535 -422
810 -422 -460 -1034 -1429 -361 -631 -381 281 -443 769 921 -78 555 175 -77 63 -1049 -904 -262 -416 125
830 125 74 428 1528 992 975 1551 909 1149 978 -236 500 419 186 393 -332 467 358 -585 -491 -1113 -1640
$$ packed form
690e92q42M02O15o84R69O29n88K95K02R22K76q00O11L11o38M37q20n44R19p92
710B88p9j64l88Q71q60p19O80n48O12J02j407J370n8q43M38l38K93K41p94M11
730h92p0j92J512p21n1J586n31R38l45p34J353n82m43K26j031R05k0j331P33K73
750E83n34R42j051n86M63n49o5m73j70J197o65M0J066n09P17J28q36O60k09j32
770A7m13j080Q00L54p27O70N34Q0R16m40k9Q74o47L29q33n08Q43q15j04L53l57
791a83O19K77j281R61k20o50K31j155R44M86o85O13j42K21J047q62l60O74r57
810d22l8n74l95J068k70K50O62p24J212J52r99O33l80k52J40j112J45O42j54N41
830A25n1L54J100n36j7N76o42K40j71j214P36q1k33K07p25P99j09r43R4o22n27
$$ plain form
851 -1640 -995 -2014 -1632 -1249 -947 -514 -786 -718 461 264 456 585 -543 411 412 -489 504 463 966 1611
871 1611 983 1742 1834 1430 1745 693 145 495 -1050 -1541 -1322 -1777 -894 -1353 -1143 -153 -554 -3 -115 -923
891 -923 274 83 -745 -15 -466 -219 621 -234 299 1054 990 1281 335 269 838 31 81 31 -910 -185 -540
912 -540 -1096 -743 -548 -163 -313 -1154 25 -42 -503 281 -245 743 1519 944 1559 1729 2069 1992 837 388
932 388 503 -581 -1017 -1600 -2348 -1221 -1447 -1617 -579 -947 -96 140 -570 -3 -150 -418 -533 -1055 -830
951 -830 37 -264 303 638 840 1960 1166 888 1257 1063 1159 283 -185 396 83 -516 -150 -572 -152 254
971 254 -728 -399 -992 -1002 -359 -1052 -778 36 -334 127 315 -235 619 347 -159 -194 -649 -337 -432 -1106 -85
992 -85 204 286 1115 604 842 1229 540 327 -34 -316 54 -937 -1085 -338 -828 247 259 129 1026 709 207
$$ packed form
851a640O45j019L82L83L02M33k72O8J179j97J92J29j128R54Jr01R93m1N03O45
871A611o28P59R2m04L15j052n48L50j545m91K19m55Q83m59K10R90m01N51j12q08
891i23J197j91q28P30m51K47Q40q55N33P55o4K91r46o6N69q07N0n0r41P25l55
912e40n56L53J95L85j50q41J179o7m61P84n26R88P76n75O15J70L40p7j155m49
932C88J15j084m36n83p48J127k26j70J038l68Q51K36p10N67j47k68j15n22K25
951h30Q67l01N67L35K02J120p94k78L69j94R6q76m68N81l13n99L66m22M20M06
971B54r82L29n93j0O43o93K74Q14l70M61J88n50Q54k72n06l5m55L12r5o74J021
992h5K89Q2Q29n11K38L87o89k13l61k82L70r91j48P47m90J075J2j30Q97l17n02
$$ plain form
1013 207 133 -295 25 -228 -797 -327 -677 45 523 -323 75 556 89 232 -110 -638 420 -695 -453 -215
1033 -215 -399 268 37 -747 186 -170 -93 -184 -820 -157 8 -621 157 124 605 1447 349 949 1087 873 775
1054 775 59 -205 220 -323 -467 -313 -772 -53 -53 -895 271 -161 62 365 -749 -253 -17 -583 -334 -464
1074 -464 -464 515 -314 -168 252 -203 334 -87 -360 482 162 -6 218 201 712 448 93 929 240 383 924
1095 924 -169 -251 389 -25 245 -514 -595 64 -761 -608 -468 -1093 -226 -394 -985 -337 -470 -83 124 -376
1115 -376 558 742 346 431 108 511 986 -58 339 662 195 405 -181 -255 -81 -157 -83 -326 -360 235 -303
1136 -303 -349 114 -85 50 111 -324 276 116 47 196 -129 111 572 -111 142 380 -326 498 -239 -510 -123
1157 -123 -416 -300 -387 -954 -40 -138 -319 -115 -329 -88 350 -465 167 108 -75 339 -163 347 628 -271 277
$$ packed form
1013B07p4m28L20k53n69M70l50P22M78q46L98M81m67J43l42n28J058j115K42K38
1033b15j84O67k31p84R33l56P7r1o36O63J65o29P78l3M81Q42j098O00J38k14r8
1054G75p16k64M25n43j44J54m59P19%q42J166m32K23L03j114M96K36n66K49j30
1074d64%R79q29J46M20m55N37m21k73Q42l20j68K24j7N11k64l55Q36o89J43N41
1095I24j093q2O40m14K70p59q1O59q25J53J40o25Q67j68n91O48j33L87K07n00
1115c76R34J84l96Q5l23M03M75j044L97L23m67K10n86p4J74p6P4k43l4N95n38
1136c03m6M63j99J35O1m35O00j60o9J49l25K40M61o83K53K38p06Q24p37k71L87
1157a23k93J16q7n67R14r8j81K04k14K41M38q15O32n9j83M14n02N10K81q99N48
$$ plain form
1178 277 208 -17 736 153 -164 220 -94 60 78 -329 97 121 -281 58 -313 272 -76 -615 -84 -339 -426
1199 -426 26 -543 -764 -153 -474 85 -22 -243 582 376 19 207 245 305 641 -215 382 423 510 783 53
1220 53 207 442 -138 -11 -158 -495 68 -322 -413 -294 -198 140 -134 -427 96 -228 -275 -78 -585 -300 100
1241 100 -513 -258 -164 -104 376 -75 158 461 171 371 126 -127 623 89 92 184 -70 224 -13 -183 200 -231
1263 -231 -209 40 -692 -98 159 -578 -67 25 -126 509 86 180 557 519 800 179 -239 416 -147 -210 -14 -484
1285 -484 113 191 -438 -197 -473 -121 -284 -917 -552 -158 -694 -304 -674 36 622 135 575 476 108 776 826
1306 826 213 666 227 204 422 -176 314 230 -354 138 231 -174 185 -653 -434 -598 -994 -532 -825 -571 61
1327 61 -97 -220 105 -159 219 237 -163 104 -44 104 392 -109 546 656 650 535 198 350 533 181 -184
$$ packed form
1178B77o9k25P53n83l17L84l14J54J8m07M26K4m02L39l71N85l48n39N31k55q7
1199d26M52n69k21O11l21N59j07k21Q25k06l57J88L8O0L36q56N97M1Q7K73p30
1220E3J54K35n80J27j47l37N63l90r1J19R6L38k74k93N23l24m7J97n07K85M00
1241A00o13K55R4O0M80m51K33L03k90K00k45k53P50n34LR2k54K94k37j70L83m31
1263b31K2K49p32N94K57p37N11R2j51O35m23R4L77l8K81o21m18O55n63o3J96m70
1285d84N97P8o29K41k76L52j63o33L65L94n36L90l70P10N86m87M40r9l68O68N0
1306H26o13M53m39k3K18n98M90q4n84M92R3m05L59q38K19j64l96M62k93K54O32
1327F1j58j23L25k64L78J8m00K67j48J48K88n01O55J10oj15l37J52J83l52l65
$$ plain form
1348 -184 -230 -103 170 -424 -659 -370 -577 -342 -84 -506 121 160 -119 49 -351 80 126 -273 293 121 46
1369 46 703 -60 59 211 165 -110 -211 -395 -38 -128 -549 -116 -357 47 22 -378 25 -35 -212 -80 -327 33
1391 33 257 -221 322 476 389 737 162 72 684 6 118 -90 -293 175 -191 -293 -294 -436 -118 106 -336 -101
1413 -101 87 -99 -74 -637 -551 -18 -393 -214 -252 -86 305 -215 -39 387 111 330 219 95 465 111 117 538
1435 538 298 636 525 151 122 15 34 -42 -257 -337 -129 -406 -126 -339 -468 85 -127 -466 -91 -442 -10
1456 -10 74 -469 88 -1 219 122 -240 86 363 182 386 69 395 599 40 -3 36 -230 285 -75 -200 307
1478 307 34 -95 -73 -482 268 -130 -377 226 -123 -74 63 -453 237 388 115 -87 122 -236 546 -45 74
1499 74 138 -254 152 143 -74 46 -151 -231 -296 -545 162 -44 -350 -129 -195 -136 -9 -434 -191 214 -48 263 -58
$$ packed form
1348a84m6J27K73n94k35K89k07K35K58m22O27L9k79J68m00M31M6l99N66j72p5
1369D6O57p63J19J52m6k75j01j84L57r0m21M33k41M04k5m00M03o0j77J32k47L60
1391C3K24m78N43J54q7L48n75r0O12o78J12k08k03M68l66j02jj42L18K24m42K35
1413a01J88j86K5n63Q6N33l75J79l8J66L91n20J76M26k76K19j11j24L70l54OM21
1435E38k40L38j11l74k9j07J9p6k15q0K08k77K80k13j29N53k12l39L75l51M32
1456a0Q4n43N57q9K20r7l62L26K77j81K04l17L26K04n59m3L9k66N15l60j25N07
1478C07k73j29K2m09P50l98k47O03l49M9J37n16O90J51k73k02K09l58P82n91J19
1499G4O4l92M06rk17J20j97q0o5k49P07k06l06K21o6N9J27m25K43M05k62L11l21
$$ plain form
1522 -58 88 266 93 -89 -158 -232 447 459 -273 138 -42 239 112 -362 94 64 -247 52 -526 -76 19 -528
1544 -528 -487 -199 -272 183 -197 -437 -22 45 62 181 69 591 276 144 652 472 411 711 92 336 378 -4
1566 -4 42 -231 -102 198 -302 -259 12 -388 4 -232 -379 239 -91 8 46 -269 209 200 136 137 -176 244 347 28
1590 28 1 -31 3 254 -211 -137 508 -77 177 44 -373 252 -184 -159 87 -99 200 102 -300 149 -135 -151 237
1613 237 -241 -250 185 39 60 -37 91 533 -105 -152 334 43 65 75 -93 254 83 -59 197 -40 -108 -27 -97
1636 -97 -8 -207 -152 81 -187 -56 167 40 90 34 46 804 294 -61 314 -89 331 156 -188 57 354 -1
1658 -1 20 -195 -172 -159 99 98 -130 -105 -150 -393 -76 -283 -415 -308 -379 -387 179 -152 -81 28 -17 192 208 59 -78
1683 -78 241 67 303 87 183 516 -18 408 229 -57 265 144 -56 -117 -189 -165 -267 -458 90 149 -313 -73
$$ packed form
1522e8J46J78j73j82o9p4O79J2p32M11j80K81j27m74M56l0l11K99n78M50R5n47
1544e28M1K88p3M55l80k40M15O7J7J19j12N22l15j32N08j80o1L00o19K44M2l82
1566dM6k73J29L00n00M3K71m00L92k36j47O18l30R9L8l15M78ro4Jl13M20J03l19
1590B8k7l2L4K51m65P4O45n85K54j33m17O25m36K5K46j86K99r8m02M49k84j6L88
1613B37m78rM35j46K1r7J28M42o38m7M86k91K2J0j68L47j71j42K56k37o8Q1p0
1636i7Q9j99N5K33k68J31K23j27N0n6J2P58n10l55L75m03M20j75l44K45K97l55
1658aK1k15K3J3K58jk28K5m5k43L17k07j32J07p1qN66l31P1J09m5K09J6j49j37
1683g8L19j74K36k16R6L33n34M26j79k86L22j21k00o1p2K4j02j91N48N9m62K40
$$ plain form
1705 -73 -296 -90 150 -172 -85 -287 148 -77 -92 -25 337 -82 411 91 -70 227 60 -122 41 -145 91
1726 91 40 -30 113 249 -52 -225 -200 -180 -65 -379 -177 -367 -177 342 -5 341 9 54 387 -18 80 549
1748 549 -15 149 82 -109 156 101 -115 30 -53 117 18 -602 -174 -420 -298 -71 -295 -194 -190 -116 -208 263 -23
1771 -23 87 -10 39 243 62 200 149 -85 5 259 -173 33 223 246 231 -302 16 -44 -164 -389 -566 -329 -128
1794 -128 -302 -182 -9 -270 114 -130 -332 74 -57 140 -69 -192 126 93 209 172 106 164 365 128 218 -40
1816 -40 120 -84 7 -272 -64 -210 42 -189 -235 -31 -168 -108 -248 -155 -47 -229 -423 42 -146 196 48 -44
1838 -44 44 411 59 227 184 -167 147 169 -209 -114 -225 115 -62 6 282 142 -30 -240 0 -26 -86 -108 -69
1861 -69 -201 -147 202 -190 60 215 112 -59 62 191 106 156 -98 176 48 232 153 -126 183 49 -128 78
$$ packed form
1705g3k23K06K40l22Q7k02M35k25j5O7L62m19M93l20j61K97j67j82J63j86K36
1726I1n1p0J43J36l01j73K5K0J15l14K02j90J90N19l47L46l32M5L33m05R8M69
1748E49n64J64o7j91K65n5k16J45q3J70r9o20M28k46J22K27k24J01MP4r2M71k86
1771b3J10r7M9K04j81J38n1k34R0K54m32K06J90K3j5n33L18o0j20k25j77K37K01
1794a28j74J20J73k61L84k44k02M06j31J97k09j23L18l3J16l7o6N8K01k37R0k58
1816d0J60k04R1k79K08j46K52k31m6K04j37O0j40R3J08j82j94M65j88L42j48r2
1838d4Q8L67l52J68m3l51L14K2l78R5j11L40j77O8K76j40j72k10K40k6o0k2L9
1861f9j32N4L49l92K50J55j03j71J21J29q5N0k54K74j28J84p9k79L09j34j77K06
$$ plain form
1883 78 -240 -458 -175 -316 -198 -33 -63 128 -155 -310 -105 -110 57 135 -227 146 -168 37 28 -22 269 403 91
1906 91 169 68 -127 401 -20 -81 81 58 146 9 -200 317 -226 -143 27 -320 -211 -227 149 -4 -370 -70
1928 -70 166 -356 66 -334 -4 134 -21 82 197 -119 -22 296 41 232 61 -151 109 21 133 234 -217
1949 -217 86 -92 131 -204 -226 -35 -176 -162 -66 29 -56 147 -241 146 265 25 147 314 -278 397 90 -16
1971 -16 278 -191 303 179 -133 -78 76 -176 8 -196 -29 -52 -185 -84 -98 0 -51 -29 12 194 -165 -44 73
1994 73 -26 78 397 -110 -70 -27 -234 217 95 61 -25 -293 13 -237 -185 109 -155 -84 79 -99 99 -83 -208
2017 -208 -108 -184 119 -139 -372 120 177 -34 97 -54 389 392 48 200 316 56 551 -24 -152 558 -192
2038 -192 36 -43 -146 -93 -384 -39 -221 -345 -220 221 -281 159 -131 -227 -53 -9 69 -12 122 143 -233 -144 386
$$ packed form
1883G8l18k18K83j41J18J65l0J91k83j55K05nJ67P8l62L73l14K05rn0K91J34l12
1906I1P8j01j95N28m21o1J62k3Q8j37k09N17n43Q3J70l47J09j6L76j53l66L00
1928g0K36n22M22m00L30J38j55J03J15l16R7L18k55J91j71k12K60q8J12J01m51
1949b17L03j78K23l35k2J91j41J4R6R5q5K03l88L87J19k40J22J67n92O75l07j06
1971a6K94m69M94j24l12N5J54k52J84k04J67k3j33J01j4R8n1K2M1J82l59J21J17
1994G3r9J04L19n07M0M3k07M51j22l4q6k68L06k50N2K94k64P1J63j78J98j82j25
2017b08J00p6L03k58k33M92N7k11J31j51M43Ll44J52J16k60M95n75j28P10p50
2038a92K28p9j03N3k91L45j82j24J25M41n02M40k90r6J74M4P8q1J34K1l76Q9N30
$$ plain form
2061 386 -80 90 -28 187 61 -49 -56 129 -251 -90 139 -231 -21 -301 -165 434 -102 -230 147 -238 -46
2082 -46 13 -206 -375 -201 -38 315 -238 -1 194 93 101 92 35 260 -66 -19 117 88 111 210 -158 329 -69 -299
2106 -299 135 -178 -276 54 12 -134 -138 -57 58 177 -135 1 -15 90 133 209 328 -248 -184 341 73 106 -12
2129 -12 -34 11 30 53 250 16 -66 93 -152 129 -100 -303 -236 -306 -86 -117 -310 -6 -312 50 71 60 186 90
2153 90 -169 227 370 133 484 182 81 276 20 156 107 -64 71 37 -54 -210 -2 -309 -100 -131 108 -162
2175 -162 -89 -71 -243 -140 199 -304 -72 187 -499 167 -10 31 158 81 12 39 143 42 19 -129 154 -46
2197 -46 189 353 -238 36 -146 -155 134 -131 -319 -283 -266 -293 -44 -132 110 -56 234 443 134 64 -213 -329 257
2220 257 -17 -26 107 -8 19 6 -190 70 -77 -24 -20 -110 62 170 -261 3 -151 -78 -79 -148 -132 125 92 117 -72
$$ packed form
2061C86m66J70j18K15j26j10pJ85l80J61K29l70K10k80J36N99n36j28L77l85J92
2082d6N9k19j69J74J63L53n53K37J95j01Qrn7K25l26M7J36k9K3R9l68M87l98k30
2106b99M34l13r8L30m2j46mQ1J15J19l12J36j6J05M3P6J19n76O4N25k68L3j18
2129a2k2M5J9K3J97k34q2J59k45K81k29k03O7p0K20l1j93L04l06L62K1j1J26r6
2153I0k59L96J43k37L51l02j01J95k56J36m9j71J35l4r1j56K08l07K09l1K39k70
2175a62P3J8j72J03L39n03K32K59o86O66j77M1J27p7o9K7J04j01k3j48K83k00
2197d6K35J64n91K74j82rK89k65j88L6J7k7K49q8K42j66K90K09l09p0k77j16N86
2220B57k74rJ33j15K7j3j96K60j47N3Mr0J72J08m31K64j54P3jo9J6K57l3K5j89
$$ plain form
2245 -72 -107 -6 138 69 48 203 284 371 -63 -141 -31 -264 -13 -33 -96 246 -100 -312 283 -191 -105 -156 -251 -17
2269 -17 -377 65 -47 -277 35 104 92 284 -237 77 360 -99 12 124 58 194 -44 -88 228 5 285 6
2291 6 -96 170 -30 21 -383 -170 -154 30 -377 119 -54 -242 93 -208 230 178 432 -13 -56 98 101 -29 68
2314 68 104 -49 34 -143 41 -103 139 112 149 -89 41 79 -62 -65 -266 -346 34 -301 88 111 -113 76 -185
2337 -185 -63 -310 -45 294 -4 66 163 444 -94 211 -8 129 255 -82 48 59 3 180 -44 -24 198 6
2359 6 -381 -28 -9 40 -221 -296 -105 -267 -212 28 -18 15 316 -4 -156 62 3 145 -2 5 204 253 170 -98
2383 -98 87 -105 108 -89 -135 -178 -121 -195 -221 -90 -270 -219 -59 -184 35 -50 -335 218 338 -11 262 -89 327
2406 327 8 -129 132 255 30 151 170 30 245 22 -136 191 25 -5 2 -266 110 -66 -133 91 -53 -187
$$ packed form
2245g2l5J01J44o9k1J55Q1Q7m34p8J10k33K51k0o3L42l46k12N95m74Q6n1r5K34
2269a7l60M42j12k30L12O9j2J92n21L14K83m59J11J12o6J36k38m4L16k23K80k79
2291Fj02K66k00N1m04K13J6J84m07M96j73j88L35l01M38n2K54m45m3J54Lj30R7
2314F8L6j53Q3j77J84j44K42k7L7k38J30L8j41lk01q0L80l35L89K3k24J89k61
2337a85J22k47K65L39k98P0R7K81n38L05k19J37J26l37J30J1n6J77k24K0K22j92
2359Fl87L53J9M9k61p5J91j62N5K40m6L3L01l20j52K18n9J42j47PJ99M9q3k68
2383i8J85j92K13j97m6m3N7p4k6J31j80N1J60j25K19q5k85N53J20l49K73l51M16
2406C27l19j37K61J23k25J21J9j40K15k23j58L27j66l0Pk68L76j76o7K24j44j34
$$ plain form
2428 -187 10 -101 -90 -131 -53 -13 -47 93 45 4 265 159 -21 1 -32 61 104 77 105 11 19 -122 -255 -110 -3
2453 -3 -106 -43 -255 -213 64 85 22 -24 -82 -137 70 -7 -34 -131 155 183 -102 219 207 61 247 -121 124 34 -72
2478 -72 73 107 -80 187 -159 -275 -3 41 -423 -46 -144 -62 -60 86 -177 -211 114 5 -150 94 -63 -323 -73
2501 -73 107 30 300 -50 90 -15 -68 235 -42 -144 12 -97 -142 -325 -266 -162 -62 157 34 -244 -23 -203
2523 -203 -70 63 11 -48 458 148 -40 69 150 204 -246 -146 90 20 58 233 61 257 -124 -188 249 -262
2545 -262 -190 142 -271 -89 -155 6 22 -371 -257 21 -58 -271 139 -359 158 151 169 304 -13 29 136 -36 81
2568 81 49 -14 129 -200 88 -155 -173 41 -34 -35 -10 -47 -47 33 -50 -86 -102 -434 -26 -111 -88 172 2 104 55 -178
2594 -178 -58 -64 -142 199 -12 168 156 308 -2 195 -151 -48 -57 -234 -88 80 -171 281 -128 -8 -84 -221
$$ packed form
2428a87J97j11J1m1P8M0l4J40m8m1K61j06j80K2l3R3M3k7K8r4Qj41j33J45J07
2453cj03O3k12M2K77K1o3m6n8n5K07p7k7r7K86K8k85L21j2j46J86l68K45r0j06
2478g2J45L4j87K67l46j16K72M4m64L77r8Q2KJ46k63l4L25j09j55K44j57k60K50
2501g3J80p7K70l50J40j05n3L03k77j02J56j09m5j83N9J04J00K19j23k78K21j80
2523b03J33J33n2n9N06l10j88J09Q1N4m50J00K36p0L8J75j72J96l81o4M37n11
2545b62P2L32m13J82o6J61J6l93J14K78p9k13M10m98N17pJ8J35l17M2J07j72J17
2568H1l2o3J43l29K88k43j8K14p5jK5l7%Q0q3l6j6l32M08q5K3K60j70J02m9k33
2594a78J20op8L41k11J80j2J52l10J97l46J03rj77J46J68k51M52m09J20p6j37
$$ plain form
2616 -221 176 -83 118 156 -90 112 383 -158 89 -103 118 233 -7 -139 156 108 -33 117 -66 -63 -62 -215
2638 -215 -193 11 100 -135 -139 187 207 -34 -254 -13 -57 49 -49 -57 -43 3 37 -41 170 78 -108 188 299 -290 122
2663 122 -9 206 94 195 -27 -118 -1 177 -68 -52 114 -256 -48 -119 -131 155 216 -138 51 -117 162 203
2685 203 49 202 279 -57 -17 -175 138 138 -13 -16 179 -24 210 -7 -196 -149 233 -77 10 -177 74 -24 -6
2708 -6 -27 -8 131 51 -146 -85 -169 -29 -57 -275 18 173 -239 -68 -46 153 -89 152 347 -119 -228 15 86
2731 86 -297 -86 -153 -156 25 -157 -176 -15 -324 -55 -280 -162 -151 20 -73 245 102 238 -224 -119 238 65
2753 65 -133 181 176 416 179 -97 101 77 72 -210 104 86 168 -216 -160 -157 -83 -359 -40 53 -18 39 145 -270 -21
2778 -21 99 103 -142 187 -229 76 63 6 290 3 224 164 93 102 -23 116 85 -34 105 -149 -177 -235 24 -354
$$ packed form
2616b21L97k59K01L8k46K02K71n41K47j92K21J15k40j32K95m8j41J50j83LJj53
2638b15K2K04Q9k35mL26K0k41k20K41m4J06r8qJ4M6L4p8K11r2j86K96J11n89M12
2663A22j31K15j12J01k22r1J17J78k45J6J66l70K08p1j2K86O1l54J89j68K79M1
2685B03j54J53P7l36M0j58L13%j51lJ95k03K34k17j89M7L82l10Q7j87K51r8J8
2708fk1J9J39q0j97O1q4J40k8k18K93J55m12J71K2J99k42K41J95m66j09K43P1
2731H6l83K11o7lJ81j82j9J61l09K69k25J18J1J71r3L18j43J36m62J05L57j73
2753F5j98L14nK40k37k76J98k4nk82L14j8Q2l84N6LP4k76L19R3p1N7J06m15K49
2778b1J20Mk45L29m16L05j3n7K84k87K21o0p1Rj25J39l1j19J39k54k8n8K59l78
$$ plain form
2802 -354 -367 33 -289 239 -27 -414 193 -97 157 110 152 79 285 -17 158 0 89 40 -4 31 -26 6 190
2825 190 101 50 94 -290 -109 -242 -121 143 196 -18 308 -247 72 180 -100 -39 114 -154 -67 103 -150 -21
2847 -21 183 306 87 71 -79 -9 102 125 93 111 9 -245 55 -41 -407 8 -256 -38 344 -357 224 169 -133
2870 -133 -36 -26 -124 39 -42 214 -16 -67 155 121 108 38 86 68 -47 -388 -59 122 -222 21 -186 -153 -2 -224
2894 -224 193 31 -188 21 98 -166 -25 -112 123 -179 -92 140 -53 178 86 -312 244 403 36 -68 -214
2915 -214 -164 91 10 -22 162 11 192 -419 -118 -56 -63 -37 -152 -186 96 104 16 27 -47 19 7 220 -109 45 -102
2940 -102 312 -41 131 39 -55 47 176 -165 -289 -89 98 197 -147 69 111 -89 52 66 -19 -215 -51 77
2962 77 30 -56 -272 143 -53 84 34 -230 19 -1 -52 115 105 -50 -191 -162 212 -132 99 -53 -15 -31 167
$$ packed form
2802c54j3M00l22N28k66l87O07k90K54m7M2p3K06l02J75j58Q9m9m4L5n7L2J84
2825A90q9n1M4l84J81j33J21K64N3k14L26n55L19J08k80O1J53k68Q7J70k53J29
2847b1K04J23k19j6j50P0J11K3l2J8j02k54L00r6l66M15k64K18L82p01N81n5l02
2870a33R7J0r8J63q1K56k30n1K22l4j3p0M8j8j15l41L29J81l44K43k07L3J51k22
2894b24M17j62k19K09P7k64J41q7K35l02Q7K32j93K31r2l98N56J59l67j04j46
2915b14N0K55q1l2J84j51J81o11L01O2pK6j15l4K82Qq8J1p4O6j2K13l29J54j47
2940a02M14l53J72r2r4J02J29l41j24K00J87R9l44K16M2k00J41J4q5j96J64J28
2962G7m7q6k16M15j96J37n0k64K49k0n1J67j0j55j41K9L74l44K31j52L8j6J98
$$ plain form
2985 167 173 17 -267 -149 72 -271 -157 -8 -114 -105 -74 207 -50 194 -129 -156 36 -56 24 231 -163 155 84
3008 84 -52 85 127 9 -160 -265 -168 -4 -36 81 -93 -257 -51 161 -228 86 -189 -141 163 160 57 -54
3030 -54 181 108 -28 -56 141 288 -66 131 -34 -1 149 -259 332 1 -64 140 142 107 100 -183 -152 -107 25 -64
3054 -64 -103 -150 45 -127 -84 1 -92 161 52 21 252 168 -17 32 308 -326 -213 83 -119 -274 19 198 -46
3077 -46 317 -88 -110 -91 80 -328 -76 -176 -51 -121 -71 -49 266 51 -31 31 123 -156 -2 356 110 -158 216
3100 216 -19 76 163 -41 98 141 -91 34 69 -81 168 -123 39 -225 -76 43 20 -179 -122 -148 -75 118 50
3123 50 -173 44 118 -41 -109 -95 59 171 100 20 22 -78 108 69 -96 7 19 -16 16 -111 -101 41 -180 -5
3147 -5 224 -21 -53 -12 -81 99 26 267 -352 196 109 28 153 -150 -277 64 128 42 58 55 133 0 -316 -124 74
$$ packed form
2985A67Oj56k84J18K21l43J14J49j06RL1K81k57K44l23k7J92r2Q0K07l94L18p1
3008H4j36J37M2j18j69j05R7J64l2J17j74j64K06K12l89L14k75M8L04lj03j11
3030e4K35p3j36k8J97J47l54J97j65L3J50m08N91l31o5K04Kl5pk83L1M5J32q9
3054f4l9m7J95j72M3Q5r3K53j09l1K31q4j85M9K76o34J13K96k02j55K93J79k44
3077d6L63m05k2J9J71m08K52j00J25p0N0K2L15k15q2O2R2k79J54L58k46k68L74
3100B16k35R5Q7k04J39M3k32J25L5j50K49k91J62k64J49J19k3j99N7k6P3J93o8
3123E0k23K17P4j59o8J4J54J12p1q0Kj00J86l9j65J03J2l5L2j27J0J42k21J75
3147eK29k45l2M1o9J80p3K41o19N48q7q1J25l03j27L41O4q6J6lP8j33l16J92J98
$$ plain form
3172 74 67 -85 -182 -92 -53 -166 -243 -129 68 -78 112 -30 -141 -87 -38 -253 231 23 -20 143 281 -46 -31 136
3196 136 227 37 -85 68 -197 182 43 -276 169 -55 -88 151 -13 -198 68 79 -58 -2 -50 -147 155 -138
3218 -138 -167 64 -135 -64 246 -37 204 58 149 -12 -294 204 134 12 -76 63 228 -258 -180 179 13 84
3240 84 41 -74 -108 217 -100 93 55 170 -92 -63 -163 64 -41 -56 -6 -124 132 164 -46 137 -26 76 -95
3263 -95 70 -18 -334 30 49 -133 167 -187 -32 -231 -13 -78 -280 118 -13 75 7 183 -157 137 4 56
3285 56 300 170 -193 178 -85 49 344 55 146 234 -132 -213 -93 138 325 178 -295 56 -71 3 -171 -196
3307 -196 48 -76 89 26 -112 -127 174 -70 86 -110 -74 -147 89 -175 55 211 186 192 58 -111 -121 103 -45
3330 -45 -122 -127 -132 -119 5 -228 33 -39 -135 -112 163 -247 -23 -106 167 -39 -179 40 -72 -36 6 -39 115 151 -56
$$ packed form
3172G4pj52r7R0L9j13p7J14J97j46J90j42j11N4M9k15M84k08m3J63J38l27J5J67
3196A36R1j90j22J53k65L79j39l19M45k24l3K39j64j85K66J1j37N6m8r7L02k93
3218a38k9K31j99P1L10k83K41j46R1j61k82M98p0j22q8J39J65m86P8L59j66P1
3240H4m3j15l4L25l17J93l8J15k62K9j00K27j05j5N0j18K56L2k10J83j63J02j71
3263i5J65q8l16L64J9j82L00l54J55j99K18o5k02L98j31Q8o8J76l40K94j33N2
3285E6K44j30l63L71k63J34K95k89R1Q8l66q1J20K31J87j47m73L51j27P4j74k5
3307a96K44j24J65o3j38j5L01k44J56j96L6p3K36k64K30J56k5Oj34j69j0K24j48
3330d5p7nnJ3J24k33K61p2r6K3K75m10K24q3K73k06j40K19j12L6M2m5J54L6k07
$$ plain form
3355 -56 2 26 -3 -64 95 -173 166 -57 84 -107 -21 -18 -211 72 -5 169 124 183 -85 -4 74 -99 154 -53
3379 -53 -33 -74 40 33 -31 -101 223 114 68 300 192 26 21 -281 24 72 -151 146 -197 -192 -315 -2 -81 166 -4
3404 -4 -46 -208 88 17 -17 -75 30 123 91 -268 41 78 -16 52 272 268 -182 118 93 129 151 229 -313 -199 -52 113
3430 113 -30 157 -34 113 150 -58 -185 50 -121 30 -127 -264 66 -78 72 172 -316 197 -47 164
3450 164 13 31 183 -193 -197 -98 -26 206 219 -277 96 149 -76 18 218 4 -111 138 -37 16 119 -15 -147
3473 -147 -53 245 -109 -115 282 48 62 144 -23 84 -102 55 237 -64 -187 65 -32 -207 -45 -34 -277 54
3495 54 190 -29 272 -90 -62 -274 -1 14 -108 -210 -96 16 -44 12 151 239 -37 35 56 -145 164 -178 -283
3518 -283 54 -108 -128 -183 81 210 16 -67 163 -190 -356 -135 47 -20 334 78 -104 -26 159 -114 226 -69
$$ packed form
3355e6N8K4k9o1J59k68L39k23J41j91Q6Lj93K83p7J74m5N9k68Q1P8j73K53k07
3379e3K0m1J14po4p0L24j09m6K32j08j66nl02L05M8k23K97l43Nj23L13p9K47j70
3404dm2j62K96p1l4n8J05R3l2l59L09L7r4O8K20mm50L00k5L6K2P8n42J14J47J65
3430A13j43J87j91J47L7k08j27K35j71J51j57j37L30j44J50J00m88N13k44K11
3450A64j51J8J52l76mR9P2K32J3m96L73N3k25R4K00k14j15K49j75N3J03j34j32
3473a47R4K98l54oL97k34J4Q2j67J07j86J57J82l01j23K52r7j75J62J1k43L31
3495E4J36k19L01l62K8k12K73J5j22j02J14J12o0N6J39Q8k76P2K1k01L09l42j05
3518b83L37j62k0n5K64J29j94q3K30l53j66K21J82o7L54k56j82P8J85k73L40k95
$$ plain form
3540 -69 -92 -72 -10 45 54 297 -100 62 26 -32 121 -28 6 64 28 -202 -349 136 -119 117 -16 4 -252 242
3564 242 -180 54 225 70 -104 149 82 322 -24 -258 261 -93 42 -188 -6 -107 94 -53 -103 -185 -54
3585 -54 -4 -78 -147 137 159 -24 90 159 -15 -30 -21 -226 -62 -105 96 195 261 60 295 76 -51 -271 120 -32
3609 -32 91 19 -193 -130 35 208 -36 -92 -27 78 205 -24 175 -102 89 -7 187 282 116 -40 -182 -129 -105
3632 -105 243 -62 199 46 106 -122 -156 162 106 -309 -148 91 200 281 -221 -2 157 170 156 -245 -109 -175
3654 -175 4 -29 -303 62 159 97 187 -176 12 156 212 -6 -29 -4 104 -78 209 -107 13 -214 -121 -15 193
3677 193 -48 -68 76 54 -162 -95 -61 36 249 217 -86 390 -31 -178 199 -27 -160 -374 416 136 -74 -254
3699 -254 80 11 -151 -50 -258 -39 72 135 -9 -37 -22 128 -172 114 -249 -60 179 -246 -256 170 11 110
$$ packed form
3540f9k3K0O2N5RK43l97J62l6n8J53j49L4N8l6k30j47M85k55K36j33K0k56M94
3564B42m22K34J71j55j74K53o7K40l46k34N19l54J35k30J82j01K01j47n0q2J31
3585e4N0p4o9K84K2j83J14O9j74j5Rk05J64m3K01R9O6k01K35k19j27k20L91j52
3609c2J23p2k12O3J65J73k44n6O5J05J27k29J99k77J91r6J94R5j66j56j42N3K4
3632a05L48l05K61j53O0k28l4L18n6m15J61K39J09Q1n02K19J59J3j4m01J36o6
3654a75J79l3k74L65R7o2R0l63J88J44N6k18k3K5J08j82K87l16J20k27R3J06K08
3677A93k41k0J44k2k16O7L4R7K13l2l03M76m21j47L77k26j33k14P90k80k10j80
3699b54L34o9j62J01k08K19J11O3j44k8J5J50l00K86l63J89K39m25j0M26j59R9
$$ plain form
3721 110 -147 90 210 109 -89 -14 111 178 250 -288 153 -372 138 -14 -32 233 2 -201 12 -189 -247 170
3743 170 -104 -30 -136 110 -46 -20 135 -252 -3 -221 89 -236 111 14 5 -13 -16 -89 -126 65 2 69 -100 -140
3767 -140 175 98 -129 124 99 113 -105 -177 -121 -5 195 29 15 -16 141 -67 -204 -22 148 -79 7 218 -122
3790 -122 -104 -139 120 122 -38 238 108 -142 193 200 72 -37 152 -101 -54 -233 -104 178 -338 70 -220 -158 24
3813 24 132 238 101 -138 11 -24 68 47 148 281 125 -6 401 96 -74 138 -335 -16 -70 -68 127 71 -173
3836 -173 164 171 -168 -130 20 63 126 -129 6 -134 -120 -60 -222 124 -87 76 56 152 206 72 40 -188 175 86
3860 86 92 -98 -37 -133 65 -21 164 154 -67 102 -2 236 -120 -279 34 45 94 77 -150 -76 -82 153 141 -164 -47
3885 -47 231 -87 51 -33 -40 -191 110 -233 129 14 -192 225 -73 146 -11 76 -74 -220 282 -156 142 -53
$$ packed form
3721A10k57K37J20j01j98P5J25O7P2n38M41n25N10j52j8K65k31k03K13k01n8M17
3743A70k74P4j06K46j56K6J55l87K49k18L10l25L47r7rj8lp3l7J91o3O7j69m0
3767a40L15p7k27K53k5J4k18p2N6J16K00j66j4l1J57k08j37J82J70k27Q6K11l40
3790a22J8l5K59Kj60K76j30k50L35Pj28j09J89k53M7j79J29K82n16M08k90O2J82
3813B4J08J06j37k39J49l5R2k1J01J33j56j31M07l05j70K12m73L19n4KJ95n6k44
3836a73L37Pl39L8J50M3O3k55J35j40J4O0j62L46k11J63k0R6N4j34l2k28L63q9
3860H6Oj90O1r6J98q6J85j0k21J69j04K38l56j59L13J1M9j7k27P4oK35j2l05J17
3885d7K78l18J38q4pj51L01l43L62j15k06M17k98K19j57Q7j50j46N02m38K98j95
$$ plain form
3907 -53 -111 102 150 -73 -91 125 253 1 -99 21 -45 -59 302 215 -106 -77 -41 -122 -76 -269 115 -48 -3 -145
3931 -145 13 -247 126 -47 -397 177 -79 -20 -111 -92 -80 314 99 94 -116 106 37 -117 32 -92 10 -87 10
3954 10 119 -98 -118 18 33 -184 -70 -22 194 -62 -32 -200 113 -140 92 -61 222 -25 145 -31 92 33
3976 33 135 137 52 -130 -1 -225 61 -1 -147 355 -183 -78 -197 270 -149 -40 -10 -13 86 -43 40 112 -91 186
4000 186 -193 -201 -133 -129 51 3 95 11 194 213 59 -156 141 100 -217 7 -80 -39 -120 -39 136 -319 36 -29 -399
4025 -399 -67 -169 210 -7 90 -87 22 -124 39 -19 -115 -9 7 242 -14 -169 84 141 113 -88 20 -105
4047 -105 -77 216 295 62 -22 147 -178 -125 -88 -170 220 333 -41 126 -199 -47 156 8 197 8 -82 -85 -173
4070 -173 183 195 42 -61 100 65 109 -33 50 92 -63 -127 162 103 -115 -58 -213 -73 -250 -32 63 -149 394
$$ packed form
3907e3n8K13M8k23j8K16J28k52j00J20o6j4L61q7l21K9L6q1M6j93L84j63M5j42
3931a45J58k60L73j73l50N74k56N9r1J9J2L94k15nk10K22o9j54J49j24J02r7R7
3954A0J09k17k0J36J5k17J14M8K16k56L0j68L13k53K32j53K83k47J70j76J23n9
3976C3J02Kq5j82J29k24K86o2j46N02n38J05j19M67m19J09L0lR9j29Q3P2k03K77
4000A86l79qO8MJ80m8R2q4J83J9j54k15K97m1l17K24q7M1q1Q1J75m55L55o5l70
4025c99L32j02L79k17R7j77J09j46J63n8r6J06J6K35k56j55K53N7k8k01J08j25
4047a05K8K93P9k33q4J69l25N3L7q2L90J13l74J67l25J52K03j48J89j89r0lq8
4070a73L56J2j53j03J61l5M4j42Q3M2j55o4K89n9k18N7j55J40j77K18R5k12N43
$$ [...]
8191I
##END NTUPLES=NMR FID
##END=
