##TITLE=1H_K-349/1_2
 DMSO+CCl4, 8 sc, 
 24.6.2019
##JCAMPDX= 6.0         $$ Bruker NMR JCAMP-DX V2.0
##DATA TYPE= NMR FID
##DATA CLASS= NTUPLES
##ORIGIN= UXNMR, Bruker Analytische Messtechnik GmbH
##OWNER= root
$$ XWIN-NMR		Version 3.5
$$ Mon Jun 24 15:45:41 2019 Russian Standard Time (UT+4h)  she@DPX200
##.OBSERVE FREQUENCY= 200.13155
##.OBSERVE NUCLEUS= ^1H
##.DELAY= (6, 6)
##.ACQUISITION MODE= SIMULTANEOUS
##.ACQUISITION SCHEME= undefined
##.AVERAGES= 8
##.DIGITISER RES= 18
##SPECTROMETER/DATA SYSTEM= spect
##.PULSE SEQUENCE= zg30
##.SOLVENT NAME= DMSO
##.SHIFT REFERENCE= (INTERNAL, DMSO, 0, 15.7039)
##AUDIT TRAIL= $$ (NUMBER, WHEN, WHO, WHERE, WHAT)
$$ ##TITLE= Audit trail, XWIN-NMR		Version 3.5
$$ ##JCAMPDX= 5.01
$$ ##ORIGIN= Bruker BioSpin GmbH
$$ ##OWNER= she
$$ F:/spectra/data/she/nmr/H-F/1/audita.txt
$$ ##AUDIT TRAIL=  $$ (NUMBER, WHEN, WHO, WHERE, WHAT)
(   1,<2019-06-24 15:43:52.15 +0400>,<she>,<DPX200>,
      <created by zg, POWCHK disabled, PULCHK disabled
       configuration hash MD5:
       00 E9 B6 7A A2 85 ED C7 34 08 36 98 17 FE 4E 26
       data hash MD5: 16K
       A7 7C EB 45 B2 C1 4D 06 61 19 B6 9E 9C 20 F2 FA>)
$$ ##END=
$$ 
$$ hash MD5
$$ A7 85 E0 B5 FC 08 98 14 DF 13 E1 57 17 D1 2A 6D
##$RELAX= 
##$RELAX= 
##$RELAX= 
##$RELAX= 
##$RELAX= 
##$RELAX= 
$$ Bruker specific parameters
$$ --------------------------
##$DU= <F:/spectra>
##$EXPNO= 1
##$NAME= <H-F>
##$PROCNO= 1
##$TYPE= <nmr>
##$USER= <she>
##$AMP= (0..31)
100 100 100 100 100 100 100 100 100 100 100 100 100 100 100 100 100 100 
100 100 100 100 100 100 100 100 100 100 100 100 100 100 
##$AQSEQ= 0
##$AQ_mod= 1
##$AUNM= <au_zg>
##$AUTOPOS= <>
##$BF1= 200.13
##$BF2= 200.13
##$BF3= 200.13
##$BF4= 200.13
##$BF5= 200.13
##$BF6= 200.13
##$BF7= 200.13
##$BF8= 200.13
##$BYTORDA= 1
##$CFDGTYP= 0
##$CFRGTYP= 5
##$CHEMSTR= <none>
##$CNST= (0..31)
1 1 145 1 1 1 1 1 1 1 1 1 1 1 1 1 1 1 1 1 1 1 1 1 1 1 1 1 1 1 1 1 
##$CPDPRG= <>
##$CPDPRG1= <>
##$CPDPRG2= <>
##$CPDPRG3= <>
##$CPDPRG4= <mlev>
##$CPDPRG5= <mlev>
##$CPDPRG6= <mlev>
##$CPDPRG7= <mlev>
##$CPDPRG8= <mlev>
##$CPDPRGB= <>
##$CPDPRGT= <>
##$D= (0..31)
0 1.2 0 0 0 0 0 0 0 0 0 0.03 0 0 0 0 0 0 0 0 0 0 0 0 0 0 0 0 0 0 0 0 
##$DATE= 1561376631
##$DBL= (0..7)
120 120 120 120 120 120 120 120 
##$DBP= (0..7)
150 150 150 150 150 150 150 150 
##$DBP07= 0
##$DBPNAM0= <>
##$DBPNAM1= <>
##$DBPNAM2= <>
##$DBPNAM3= <>
##$DBPNAM4= <>
##$DBPNAM5= <>
##$DBPNAM6= <>
##$DBPNAM7= <>
##$DBPOAL= (0..7)
0.5 0.5 0.5 0.5 0.5 0.5 0.5 0.5 
##$DBPOFFS= (0..7)
0 0 0 0 0 0 0 0 
##$DE= 6
##$DECBNUC= <off>
##$DECIM= 24
##$DECNUC= <off>
##$DECSTAT= 4
##$DIGMOD= 1
##$DIGTYP= 9
##$DL= (0..7)
0 120 120 120 120 120 120 120 
##$DP= (0..7)
150 150 150 150 150 150 150 150 
##$DP07= 0
##$DPNAME0= <>
##$DPNAME1= <>
##$DPNAME2= <>
##$DPNAME3= <>
##$DPNAME4= <>
##$DPNAME5= <>
##$DPNAME6= <>
##$DPNAME7= <>
##$DPOAL= (0..7)
0.5 0.5 0.5 0.5 0.5 0.5 0.5 0.5 
##$DPOFFS= (0..7)
0 0 0 0 0 0 0 0 
##$DQDMODE= 0
##$DR= 18
##$DS= 0
##$DSLIST= <SSSSSSSSSSSSSSS>
##$DSPFIRM= 0
$$ [...]
##$SUBNAM2= <"">
##$SUBNAM3= <"">
##$SUBNAM4= <"">
##$SUBNAM5= <"">
##$SUBNAM6= <"">
##$SUBNAM7= <"">
##$SUBNAM8= <"">
##$SUBNAM9= <"">
##$SW= 24.9336996594482
##$SWIBOX= (0..15)
0 0 2 0 0 0 0 0 0 0 0 0 0 0 0 0 
##$SW_h= 4990.01996007984
##$TD= 16384
##$TD0= 1
##$TE= 0
##$TE2= 300
##$TE3= 300
##$TEG= 300
##$TL= (0..7)
0 120 120 120 120 120 120 120 
##$TP= (0..7)
150 150 150 150 150 150 150 150 
##$TP07= 0
##$TPNAME0= <>
##$TPNAME1= <>
##$TPNAME2= <>
##$TPNAME3= <>
##$TPNAME4= <>
##$TPNAME5= <>
##$TPNAME6= <>
##$TPNAME7= <>
##$TPOAL= (0..7)
0.5 0.5 0.5 0.5 0.5 0.5 0.5 0.5 
##$TPOFFS= (0..7)
0 0 0 0 0 0 0 0 
##$TUNHIN= 0
##$TUNHOUT= 0
##$TUNXOUT= 0
##$USERA1= <user>
##$USERA2= <user>
##$USERA3= <user>
##$USERA4= <user>
##$USERA5= <user>
##$V9= 5
##$VALIST= <valist>
##$VCLIST= <CCCCCCCCCCCCCCC>
##$VD= 0
##$VDLIST= <DDDDDDDDDDDDDDD>
##$VPLIST= <PPPPPPPPPPPPPPP>
##$VTLIST= <TTTTTTTTTTTTTTT>
##$WBST= 1024
##$WBSW= 4
##$XGAIN= (0..3)
0 0 0 0 
##$XL= 0
##$YL= 0
##$YMAX_a= 122571
##$YMIN_a= -108367
##$ZGOPTNS= <>
##$ZL1= 120
##$ZL2= 120
##$ZL3= 120
##$ZL4= 120
##$ABSF1= 10
##$ABSF2= 0
##$ABSG= 5
##$ABSL= 3
##$ALPHA= 0
##$AQORDER= 0
##$ASSFAC= 0
##$ASSFACI= 0
##$ASSFACX= 0
##$ASSWID= 0
##$AUNMP= <proc_1d>
##$AZFE= 0.1
##$AZFW= 0.1
##$BCFW= 1
##$BC_mod= 2
##$BYTORDP= 1
##$COROFFS= 0
##$CY= 11.3945322036743
##$DATMOD= 1
##$DC= 2
##$DFILT= <>
##$DTYPP= 0
##$F1P= 18.9103706918063
##$F2P= -1.10871071338519
##$FCOR= 0.5
##$FTSIZE= 0
##$FT_mod= 4
##$GAMMA= 1
##$GB= 0.15
##$INTBC= 1
##$INTSCL= 1
##$ISEN= 128
##$LB= 0.24
##$LEV0= 0
##$LPBIN= 0
##$MAXI= 10000
##$MC2= 0
##$MEAN= 0
##$ME_mod= 0
##$MI= 1.114404
##$NCOEF= 0
##$NC_proc= 0
##$NLEV= 6
##$NOISF1= 3.799351
##$NOISF2= 2.8
##$NSP= 1
##$NTH_PI= 0
##$NZP= 0
##$OFFSET= 15.70392
##$PC= 1
##$PHC0= -8503.496
##$PHC1= 19.80097
##$PH_mod= 1
##$PKNL= yes
##$PPARMOD= 0
##$PSCAL= 0
##$PSIGN= 0
##$REVERSE= no
##$SF= 200.130013532006
##$SI= 16384
##$SIGF1= 3
##$SIGF2= 2
##$SINO= 400
##$SIOLD= 16384
##$SREGLST= <1H.CDCl3>
##$SSB= 0
##$STSI= 0
##$STSR= 0
##$SW_p= 3612.71676300578
##$SYMM= 0
##$S_DEV= 0
##$TDeff= 0
##$TDoff= 0
##$TI= <>
##$TILT= no
##$TM1= 0
##$TM2= 0
##$TOPLEV= 0
##$USERP1= <user>
##$USERP2= <user>
##$USERP3= <user>
##$USERP4= <user>
##$USERP5= <user>
##$WDW= 1
##$XDIM= 8192
##$YMAX_p= 0
##$YMIN_p= 0
$$ End of Bruker specific parameters
$$ ---------------------------------
##NTUPLES= NMR FID
##VAR_NAME=  TIME,          FID/REAL,        FID/IMAG
##SYMBOL=    X,             R,               I
##VAR_TYPE=  INDEPENDENT,   DEPENDENT,       DEPENDENT
##VAR_FORM=  AFFN,          ASDF,            ASDF
##VAR_DIM=   8192,          8192,            8192
##UNITS=     SECONDS,       ARBITRARY UNITS, ARBITRARY UNITS
##FACTOR=    0.0002004,     1,               1
##FIRST=     0,             0,               0
##LAST=      1.6414764,     0,               0
##MIN=       0,             -108367,         0
##MAX=       1.6414764,     122571,          0
$$ Real data points
##PAGE= N=1
##DATA TABLE= (X++(R..R)), XYDATA
$$ [...]
1967C62o38n05l24M52Q39k6k69l81J00K37N04O74l50q83p16J093J050n25j183
1986d89m20Q95R07m11r53q93P38J147K30j230q37L68N09K90m87p64K43J59O20
2005c78k3o08j55o51J115K57L90o39p30N66J150L40n44j186J15J197R74m67j579
2024h56K40P72P62L00j335n04M02R80K33p62l94o3J49L78K43o56o57K05L14O44
2044C95J42j133n51N47J016j7q14o88O55O60O87r00p80J30J008O10o94j014M51
2063b90K63O32Q2n28j98j3L45M55k29j49q26p9Q40O29o72j130j49J014P47n10
2083B34j107q13J170J185m14j149l65O44P82q4k88m72K08M00K27k81K51m53J12
2102b13M25J32L3l70k38J62Q15N08o65r85K74J005N33m28j336Q6N07J085n90j046
$$ y = [362, -276, -781, -1105, -653, 186, 160, -109, -490, -390, -153, 351, 1025, 675, -208, -924, 169, 1219, 694, -489, -909, -14, 893, 482, -471, -1364, -626, 521, 751, -479, -1316, -948, -439, -149, -636, -1400, -1157, -998, -378, -401, -1009, -1164, -1815, -700, -443, -53, -692, -1422, -856, 294, 634, 90, -1096, -981, 216, 1190, 723, -856, -616, 156, 918, 1218, -117, -621, -219, 761, 994, 232, -162, -225, -76, 302, 545, -111, -768, -563, -249, 395, 537, -596, -1147, -600, 416, 399, -415, -1103, -448, 212, 899, -1, -781, -651, 357, 967, 273, -741, -290, -27, 605, 687, 159, -39, -52, 293, 748, 519, 370, -456, -535, 305, 934, 262, -868, -1017, -3, 744, 234, -873, -1686, -516, 669, 255, -894, -1259, -615, 167, 83, -205, -677, -469, -69, 158, -123, 128, -325, -213, 212, 344, 377, 7, -231, -69, 746, 1254, 589, -396, -122, 883, 1416, 988, -348, -262, 245, 1330, 740, -306]
2122c06n35P19R77l28q59k27K81J93L54k61j75n33L27j8L53J57m45m50K43O36
2142A03P81o49r88J70J174O16j142r32L68R48Q82n65j099k95O51J179p68n56m15
2161e37N51O92j84n97O9j19K11l16L23L6n42l55M33K95L10o68m35k4J046L72n42
2182A9j050L44J175L95j009m63j07J371J40m28n47n03J026K37K17r36j5J50J48
2201A64K53j43m05j77J05J03L69l52m31o21M69Q00jn76q46K50J192R9l87r51j42
2222a228J117L61q2p60l64O10P61r7k59m45L9M74P55n58l86l12N54L11K90m01
2242C80o52o0N67N19l69m47j50L50O59l33l53l76k65O99j4M0n18l43L69P09m2
2263C70m87l57L7M11P56m95p55MO47P79m06q12k69O82P20j69o15k21k9L42M17
$$ y = [-306, -841, -122, 855, 527, -332, -559, -278, -85, 269, 8, -167, -700, -373, -391, -38, 119, -326, -776, -533, 103, 884, 235, -753, -583, 591, 1207, 65, -867, -499, 449, 1331, 766, -333, -628, 23, 1202, 434, -122, -537, 14, 706, 522, -75, -6, -125, 86, -230, 93, 129, -413, -768, -335, -40, 270, -398, -833, -857, 189, 561, 19, -1031, -687, 488, 883, -126, -589, -696, 675, 815, 387, -160, -663, 363, 600, 817, -119, -134, 16, 164, 417, 274, -131, -308, -203, -100, 269, -83, -514, -1135, -666, 134, 133, -443, -1289, -1039, 153, 252, -135, -1086, -1228, -111, 250, 168, -592, -956, -346, 415, 318, 59, -386, -347, 127, 882, 324, -62, -374, 180, 491, 781, 380, -272, -332, 235, 754, 385, -62, -212, 138, 797, 464, 111, -265, -530, 169, 155, 195, -323, -666, -297, 412, 370, -117, -474, -437, -26, 730, 235, -520, -516, 131, 910, 504, -308, -577, 105, 825, 656, 41, -180, -209, 133, 550]
2284E50l52j7m55K4K69r3K29k32m42J62K04N55n91n63n76J195N70o22p64K38J86
2305e25R44k48j223p6N80J029j29r67l04Q76L32M4o99k23L14M56k05j56n8N9p4
2326b53k53O28j38J14p81l16Q09N29j28j216j43Q91L99j73j124k65J036Q46k56
2345B06j148o02P18R62K5r46j87N29Q71r4q08mK55M83m34k00L81P8j63m21O00
2366A01N71n44Pn58N09Q51j60j008k49O30J073m55j075m20P45R06K08j030l98
2385b96K50P38K55j126K03P6L12k17n3l26O49k82j12L2K4M7m64j5J77O18j41m17
2407f8o43P28P41p6p32o30P88M68K22r55n20O18M56K74p71p30L16N51M11n83k50
2428c85J21K10n7j44j8k48Q6N2Q1J83m27k05q2O08M09l43l76m21N66M69l10k62
$$ y = [550, 198, 181, -274, -250, 19, -74, 155, -77, -519, -357, -153, 402, -189, -752, -1328, -133, 437, -185, -949, -711, -525, 419, 171, -1052, -1128, -548, 481, 352, -615, -919, -43, 289, 333, -366, -589, -275, 181, -24, -180, -238, -179, -253, -506, 122, -16, 98, -683, -999, -190, 339, 211, -1005, -1148, -257, 142, -31, -1155, -1420, -384, 462, 206, -942, -1544, -826, 136, 161, -785, -972, -443, 428, 334, -474, -478, -223, 260, -174, -374, 7, 85, -78, -499, 101, 672, 128, 135, -423, 86, 937, 777, -231, -480, 150, 1223, 768, -307, -727, 18, 924, 1132, 102, -296, -46, 692, 947, -179, 24, 100, 412, 195, 142, -184, 465, 183, 71, 103, 127, 174, -290, -305, -128, 490, 349, -68, -711, 17, 758, 682, -50, -680, 108, 576, 798, -157, -677, -59, 397, 671, -100, -830, -514, 37, 448, -135, -385, -264, -54, -111, -255, -273, -521, -435, -383, -302, -119, -546, -751, -833, -225, 184, -159, -535, -956, -390, 79, -231, -493]
2450d93n33K71O95M82m37q93R5Q32M90o39o61RO64M30l12j138M00M64J52j27k86
2471e35j21J04q6j96K54L64j73m87J22L14L80m62j51j40O95M38k68o63O0M72O24
2492E45l22l11n72J036L55m2o96m24P12L37J07o46J42o8P47m26l86l8L05R6k18
2513B33j15R6K38r9n23J42N33J35n28q13P42N66M29r95l33O31P00O6p87p89P49
2534B78Q05J01j179j57O13O36j4p30l31N77K88k68n75J29L52K50p90K5N05p4m45
2555dl56q3O73K83q35n99O14Q61p8p00p99R52N32J03q56o10P29O79oo14q88Q91
2577a11M32L56j139l02R35K84j42l83o5K49J72n23J20M6K59l64l41k1O50Q6o99
2598e01q05M69J173j19o74r34Q51O61L54j020l01J5J001Q7o84n15O09P04r2m24
$$ y = [-493, -1026, -755, -60, 422, -15, -908, -813, 19, 509, -130, -791, -782, -118, 312, 0, -1138, -738, -274, -122, -249, -535, -656, -552, -638, -834, -580, -216, -389, -876, -754, -440, -60, -522, -673, -813, -118, 320, 52, -611, -551, -79, 545, 223, -88, -660, 376, 731, 689, -7, -431, 281, 618, 725, 79, 221, 153, 900, 474, 88, 50, 355, 451, 233, 118, 214, 452, 353, -170, -28, 505, 640, 112, -701, 41, 607, 1036, 41, -292, 339, 1039, 1105, 318, -471, 278, 1083, 1184, 5, -152, 461, 1097, 1083, 353, 22, 599, 887, 619, 44, 173, 525, 775, -15, 10, 515, 441, -4, -360, -443, 230, 513, -322, -921, -307, 554, 476, -224, -1023, -71, 461, 564, -292, -902, -173, 506, 500, -114, -1002, -111, 321, 677, -462, -764, 171, 455, 313, -70, -135, 114, 286, -237, -117, -71, 188, -176, -517, -538, 112, 198, -501, -1306, -837, 336, 217, -457, -1391, -540, 121, 475, -545, -846, -831, 170, 257, -427, -942, -333, 371, 279, -145]
2618a45j37KP61k98m48J16K32K70m66L75j36M05l16m17M6O89K37n89m40JQ43k01
2640C84k92p07K06P87K68n13q41j43R99N39m35r19M73L16M27l55m14o6J47L04
2660A65k9k69L36J7J86l51J84l35N03o27l9N04N78n12o41l58R39K50j96p62j61
2681f18M20L03K29q53j33Q44QJ31p08j17K74P72o89m11N9L74M78l32j16l70N11
2702E6R9j21k41K59K46k83l15K33M51J02n28m79M04O96m50m60k58M72P55k79l70
2723a1p70L72N35L31q55l13P09K34p5o48j8M34K63K9p15J58L63K92m75M8M80j10
2745B58m2l16kK40M70n12n50M53M28M59r52o83L86R94L3n95j090O37Q81j00o58
2766b61o39M88Q68k23m94k84K61L95n2m44J36L01K9n24L53K5M46k37l37L06J52
$$ y = [-145, -282, -280, 481, 183, -265, -149, 83, 353, -113, 262, 126, 531, 215, -202, -156, 533, 770, 181, -259, -258, 585, 384, 92, -615, -409, 378, 646, 133, -708, -851, 148, 687, 252, -667, -194, 122, 549, 194, -220, -286, -139, 165, 136, -133, 203, 220, 406, 55, 239, -96, 407, -220, -259, 245, 823, 311, -330, -688, 251, 501, 305, -457, -618, -198, 105, 334, -519, -652, 192, 200, 331, -377, -494, -220, 552, -137, -548, -489, -115, 363, 31, -85, -455, 56, 155, 34, -207, 52, 298, 15, -300, -67, 384, 486, -42, -521, -117, 579, 129, -331, -589, -117, 638, 359, -11, -781, -409, 126, 457, -398, -711, -2, 232, 157, -491, -509, -75, 188, 217, -498, -340, 23, 315, -160, -112, 368, 258, 216, -100, -102, 138, 608, 96, -454, -1, 427, 886, -66, -749, -363, 631, 664, 69, -1021, -384, 497, 397, -261, -900, -412, 456, 233, -261, -545, -284, 111, 59, -385, -249, 52, 81, -443, -90, -65, 381, 144, -193, 113, 265]
2787B65M80p54k19K6O93M92p87m92MN92L02k61p42j61J222q7m36l87K34P78k99
2808D63o39M7J20K38j63J20k60O8L60n68k88L24N72m11j74j20L64P76n11p88J56
2829c14M63L04j05n69J36L26O47m20q10l0P04M23l36n04M3M65J01r5o66L46N2
2850A61M08m98j87K89OM2j86J5J22P7n21J88M0L31K59n26j40R0R17m46n16l01
2872c76N00M28k79j21n32Q25M8j30m89q7K53L88J26o06rJ62K26m04K50o4M1n8
2894I2Q2l39M50j0m34J34l72L82O0l22m73M09O58Rm78k73K76J72O35o06o69L07
2916c10M50K91n97j04q6L70M13q77K18j58K17J04J91n14N28o7j76j93O7K02n7
2937h8j79j49J37N38o31l98j9P60j02j41l15K8N89J20n66j50j1N60o1k24m28L90
$$ y = [265, 745, -9, -228, -202, 491, 983, 196, -296, -292, 300, 602, 341, -401, -562, 660, 573, 137, -250, -16, 762, 463, -176, -129, -9, 229, 66, 186, -74, -6, 354, -214, -502, -178, 394, -17, -191, -311, 53, 829, 318, -470, -314, 149, 453, 348, -221, -85, 241, 888, 468, -342, -372, 332, 755, 419, -85, -42, 423, 524, 429, -237, 109, 161, 569, 71, -116, 173, 179, 221, 35, 50, 172, 249, -272, -84, -44, 287, 546, 20, -120, -30, 887, 441, -75, -376, 124, 552, 273, 152, -380, 445, 493, 363, -126, -213, 40, 428, 554, -52, -61, 101, 327, -77, 173, 109, 150, 92, 174, -165, 285, 275, -159, -25, -397, -15, 45, -277, -750, -341, 317, 326, -152, -425, -149, 23, 658, 52, -617, -310, 140, 431, -166, -270, -356, 14, 427, -450, -232, -390, -173, -69, 122, -392, 136, 69, -107, -300, -233, -31, -88, -267, -416, -279, 259, -372, -770, -789, -29, -131, -272, -587, -559, 30, 150, -416, -566, -577, -17, -78, -302, -730, -340]
2959c40M2L07l46k94P53o6Q2k85K42j84k0K57m39O2N46j63p25M81Q4L76j97q12
2981f39J65N49K96n95m96LQ67K62m41k57l26P38M19l57j40l85O00j07r1n6m0L0
3003aJ96j22k11M14L9k38j96K05K68r5l06K94N7R5J7q96N07nM29N6p25p8M16L87
3027E07k85j23n77L04K54J74n78P5L72M62m74j82r6K11J4K4j79J42J57K23m37
3048a2J70J01j44j91J32L8j2J16k73j05L89K58k35n7p17M22K95j18l77m94O85
3069a29K70o5k77k62L87j37J03j41k03OQK72j52Q5p0K38k67k46M79J69J07o88
3091e13L30L29j75j93k5J56N69m38j72j74P0K34k0L5m48K87J30J11l52K1k68M90
3113a6K03k94j78L14r5L3L70p21K45o2l03L56K65K9K24o28k67O85j72J45r3k44
$$ y = [-340, -298, 9, -337, -631, 122, 56, 138, -147, 95, -89, -109, 148, -291, -229, 317, 154, -571, -90, -6, 370, 173, -639, -474, 75, 371, -224, -720, -717, 150, 412, -29, -286, -612, 126, 545, 188, 48, -337, 263, 156, 65, 9, -31, -1, 195, 73, -138, 276, 315, 77, -119, 86, 354, 259, -47, 247, 304, 399, 416, -480, 27, 22, 451, 507, -218, -296, 120, 507, 222, 99, -478, -174, 80, 254, -324, -249, 123, 585, 111, -71, -167, 44, 58, 82, -97, 45, 202, 425, -12, 158, 259, 115, -76, 56, 94, 82, 198, -75, -180, 209, 467, 232, 175, -542, -120, 175, 57, -320, -814, -129, 141, 76, -201, -463, -76, -213, -110, -251, -454, -448, -440, -168, -320, -235, -305, -67, -334, -580, -101, 68, 175, -513, -183, 146, -29, -222, -247, -91, 478, 40, -132, -306, -236, -2, -22, 13, -435, -148, -18, 93, -259, -238, -506, -16, 187, -107, -285, 29, -66, -33, 337, -384, -139, -201, -504, -148, 117, 146, 370, -258, -525, 160, -12, 133, 40, -204]
3135b04L12L67m61k07r5M69M34o93j33K82J37L05m40O3n66O01J04l22j04l9J87
3156cQ8l75K37L7K05q9j38J71L2m0l49L44j08K38r7j60n2J04l8M2j90k20L67K48
3180B54j05l4p5RK80j62m41K27pO6r4K7r2k82L77M3j92J16jJ03K9m56N16k44l91
3205e29QN24L21k89m2m38M51k04K96j64j62L77k2J40m11j42M79m0K6n06K65M0
3227b2R4j74j60O9K70l3L33n03K78j57n5K18k8j68K10k65k56M19j51M51m50M9
3249c1N2L19j23q1q1k62O47p17N0K10j06K72J43j49m75L55qK47k82j9j2K76L09
3272E34l75j08k3r8J70K62j15m3k56k89L43j8K9J06J13k91N67n64n0m4L52J3J0
3295B25M0l17N8o8M37J11o40K86j66J96N5k04P3p3J08L7J37m6k53o9K12Q0N8m73
$$ y = [-204, 108, 475, 14, -193, -288, 181, 615, -78, -211, 71, 208, 513, 73, 136, -430, 171, 275, -47, -151, -190, -3, 85, -290, -53, -16, 189, 100, -38, 133, 165, 125, -224, 120, 12, 250, 153, -7, -59, 45, 7, 49, -141, -361, 6, 254, 149, 115, 40, 49, 329, 167, -274, -47, -54, 12, -82, -55, -147, -429, -52, -9, -201, -85, -86, 17, 46, -410, 106, -138, -529, -521, 3, 324, 35, -7, -445, 6, -198, 98, -66, -228, 149, 127, 267, -144, -286, 193, 153, 179, -327, -62, -22, 72, -102, -262, -193, 77, 44, 377, -126, 152, -5, -60, 158, 130, -38, 172, -93, -349, 70, -81, 370, -80, -31, 21, 340, 217, 136, 55, -207, 440, -277, -227, -17, -123, 149, 292, 143, -332, 23, 15, 262, -20, -39, -51, 225, 534, 159, 51, 28, -70, 100, 362, 247, 204, -52, -341, 2, -16, 13, 119, 232, -59, 508, -56, -106, -150, 202, 215, 225, 265, -52, 6, -62, 375, 486, -154, 132, -34, 162, 217, 13, 86, 13, 121, 158, 295, 249, -4, -73, 139, 219, 277, -196]
3319a96K43O0l9O7l2P7j10J92j10N0n13J76R9M54m90j84L97j07j3P3k36L25l67
3342a84J89K93j13k13J02L15J33n98J88j81l81O21j26K8j10M7o3J78k26K6M0l57
3364c92M28J22J54k18k99J97K20j45pl31lN05n1l09N6on4J01j53L61k99m1K98
3387A34l0M8j9k94J42O4j0n8r9q3J68Q3J07l19K2pK64q9l6j2k28P9K92k59L1o5
3413a74P3N0j78R3J57J38n2j29r7M0J9Q3l67L60k38O6k25N28j73k29M56m02M67
3436B66O4m96OJ68K3K13j63m1J42M7j76J48r6ln09Q50m14P9j81j32K86j66P0J16
3460A01k70k49J26j20K07L61j07R8k13P3k00M2n4K40j8J19j84J87k0q3O4J52k55
3483cL2L07j74J0k09j30L37j70J48k34j6K5J00Q1k9J02j52LK8K39m81P3p9J77
$$ y = [-196, 47, 107, 68, 135, 103, 180, 70, 262, 152, 202, -311, -135, -36, 418, -72, -256, 141, 34, 21, 94, -142, 183, -184, 5, 298, 185, -28, 74, 389, 522, -76, 112, -69, -450, 171, 45, 73, -37, 10, -53, 125, -101, -75, -35, -392, 36, 158, 312, 94, -205, -8, 212, 67, 60, -271, -274, 231, 180, -129, -73, -79, -133, -32, -185, 176, -123, -164, 134, 104, 152, 133, -161, -19, 45, 35, -23, -122, -205, -37, 46, 153, -166, -144, -151, 113, 24, -12, -24, -252, -173, 119, -140, -109, -174, -101, -51, -229, -136, 21, 159, 107, -22, -119, -79, -60, 23, -344, 16, -222, -156, -381, 147, -26, -255, 201, -201, 266, 330, -166, -160, 8, 31, 244, 81, 40, 182, 229, 53, 201, 105, 102, -407, 443, 29, 108, -73, -205, 81, -85, -15, 101, -169, -418, -292, -412, -205, 156, 49, 147, -66, 7, -193, -151, -205, 35, 17, 136, -48, 139, 119, 36, 100, 252, -3, 29, 336, 162, 172, -37, -167, 170, 0, 148, -86, -102, -77, 23, 104, 75, 177, 25, 28, 56, 295, -186, -113, -192, -15]
3507a5l3K55p7k96K08J30k42J29K88m62P1J08j10K14j55L53n3q8k69J06N4m8K43
3530C11m71K08K8L4J13l13p6J39K09k66K41m3k33O0K19j4M0J0j48Jk75J81J55
3553A10k07k8J41L1K15j88Q8j76oM34m57J97qM6O3k43K2K21k36J19j46M9J31m36
3577b64L80K2j50j17M90l11Q8Q3j54K65J7l02K2J54l34J69k05Q2L34j52r6Q5J00
3600B06j63J16k07K28j94J64q9j3k5J68mj31O2p1j3K50k23J22J52n09R7O7L0Q
3624B8K9j91Q3M9j03O5p2j61K19L38m34J04K4p5JJ62j06J9j38J58K09j81K45m38
3648a66M76m62L50j11k51j05K17L74j64q7l7L27l06N8J1k75k15M31kl66j21K75
3670a49J45o4r2J14n5JJ66r1k09J43K61m82K80l6nJ86k51N0J07k91L4J98P6j6
$$ y = [-15, -48, 207, 130, -166, 42, 172, -70, 59, 347, -115, -44, 64, -46, 168, 13, 366, 313, 225, -44, 62, 116, 68, 311, -160, 48, 76, 110, 223, -90, -166, -27, 182, -84, 157, 114, -119, -59, 160, 146, 186, 196, 48, 49, -226, -45, 110, -97, -125, 16, 47, 262, 74, 162, -14, -20, 414, -43, 154, 146, 192, 255, 12, 34, 255, 19, 138, -8, 41, 172, -264, 116, 138, -12, -129, 361, 50, 138, 221, 67, 332, 349, 47, 69, 223, -111, 58, -147, -65, 269, 117, 21, 106, 206, 43, 159, -48, 180, -14, 150, 61, 48, 23, 191, 187, 56, 118, 47, 34, 284, 61, 183, 335, -174, -77, -10, 20, 28, 57, -134, -51, -2, -105, -40, -112, -273, -54, 284, -150, -46, -22, -97, -96, 66, -40, -21, -159, -1, 208, 27, 272, -166, 310, -152, 198, 87, -164, -269, -52, 322, 158, 71, 34, 361, 55, 113, 124, -151, -366, 65, 63, -303, -424, -149, -4, -68, -160, -46, -101, -100, 66, -25, -234, -91, 170, -312, -32, -68, -73, 113, -138, -88, 19, -272, -238, -40, 36, 20]
3694B0j60k2P1K53k96RJ06l69K00J25M16l09l3m2J2r6m8K98m67K98O0qL5j28R9
3719B4j65K18j85J00k09K20J97j55J24l30r4J54L78j76l43L75k49P5K14j33K5
3740F5K7k17M66l30Q3J57l28k9Q1K61k09j27R0j1o4K18l92K56Q6n3J34m61M55
3763A58k40j4K26J3J11j86K86l88J97k33J50K27k78nM1n9J28o4k14M99m49M18
3785C24l10J81j71k39J29J37m0K43m84K95J23j44j36J99k14K32MK7l14O8K37k32
3807h5J51R1k67J59M7J0K05p6l48R7o1j81J04N7J25l5j25J14K37k41J06j60K44
3830A68j71j03Q0r4K96k08M1k06K46m56K31m1J74k16l5M92l74J98%k54J12N0J00
3853C0n0j35mJ46k30jP7J18j52L26R9k65q7N58m27q8J43j57m2J36O0j79J19j86
$$ y = [20, -140, -162, -91, 162, -134, -125, -19, -388, -188, -63, 353, 44, 11, -31, -19, -115, -163, 135, -332, -34, 26, 18, 53, -75, 24, -141, 77, -108, -8, -217, 3, 200, 45, 169, -161, -255, -101, 277, 101, -242, 133, -116, -41, 173, 40, 65, 92, -125, 341, 11, 94, 251, -77, -106, -25, 236, 27, -100, -10, -21, -85, 133, -259, -3, 83, 30, 164, -297, 158, -82, -96, 130, 143, 254, 68, 354, -34, 163, -70, 80, 307, 29, 24, 65, 6, 134, 70, -144, 355, -94, 324, 14, 195, 24, -215, -86, 51, 11, 254, -230, 65, 188, 44, -92, 107, -107, 125, 129, 156, -158, -90, 147, -85, 66, 157, -110, 49, 96, 106, 311, 235, -113, -16, -77, -258, -154, -97, 28, -7, -132, -18, 219, -22, 84, -76, 168, -3, -106, -26, -120, 176, -32, 9, -197, 49, -407, -176, -217, -43, -259, -294, 198, -176, 22, 22, -232, -120, -70, 30, -20, -155, -159, -13, -243, -244, -167, -49, -201, 125, 224, -41, -128, 430, 3, -85, 58, -99, -141, -5, 55, -124, -5, -191]
3877a91J72k93L52q4K21k46pj14J75K71p9k45pl2p3J61k30K55l9L55l44o5K6K43
3901A82k2j07j90J99L33j65l59K01j8k4k28J85L24l06j49M46k02l2m99K56L61
3922A86M2n01J97n1J73k6n6L18k14l2l4R8j33o1J41k97K28L21o24L18J01O5k0
3945A39j66q1NR2J50k48J61m5nJ26N1M0n03K90j07J14l2J60m97K37pr2K26j45
3969a37K76r7n7NLJ38j38r5J57j61j96J89O1K49k63k93M89j85K12k64k93M06m65
3992d59O64j92n7J6j97J07J5M8J19j46j81K11J16l9l58J69M1J21Q3o3k31L65L
4015A55k89n3j08J58r0J23K26l27K12O6NJ09o99M06p7K45J33j43o9l5QJ6J33o7
4039C8r0m4k5J64J79m09J22L8m6j26o8J06r2N04l15j13J99o0q8J07J33k90K78
$$ y = [-191, -19, -312, 40, -44, 177, -69, -76, -190, -15, 256, 177, -68, -75, -107, -180, -19, -249, 6, -33, 322, -22, -87, -61, 182, 160, 53, -137, 62, 395, 230, -129, 72, 54, 30, -198, -13, 311, 5, -144, 302, 100, 68, -431, -175, 186, 228, -273, -76, -127, 46, 20, -36, 282, 68, 36, 2, 100, -33, -94, 47, -250, -22, 299, -325, -7, 94, 159, 139, -27, -108, -103, -11, 139, -109, 52, 7, 2, 128, 179, 219, -284, 6, -101, 13, -19, 141, -356, -119, -126, -218, 8, -137, 139, 42, -15, -10, -7, 131, -7, -102, 55, -106, -302, -113, -52, 197, -66, -359, 130, -55, 157, -107, -400, 6, -459, 205, 13, -44, -28, -225, -118, -103, -55, 64, -82, -263, -52, 64, 25, -333, -164, -123, -2, 81, 18, -213, 152, 155, -134, -187, -295, -137, -227, -104, 122, -205, 7, 73, 78, 187, -512, -106, -183, 62, 195, 52, -17, -52, -44, -28, 105, 38, -52, -96, -121, 43, 222, -187, -65, -27, -73, -199, -267, -161, -253, 251, -64, -177, 22, -38, -126, -19, 114, -176, 102]
4062A02l37L29l1kN9J73l52o2j2lJ36O1n8L8R7K9k50J00P2r7k3J8K73j25j41j26
4088a32j46M27k80M93j97j69J63j96J15p7m4k8L09n36K83jR1r6J82j91J84l18
4110a64J88%j4L4j81j26K65J15j3j53J70P6m72L59j89J41Pk70N2L54j0l12J46
4133CK4q2nJ83l54K87j75L0K99l93K84o4n7q3K35j89J03o1q2J19k35K7m8K85J60
4158B11k35j81R5J12l60K33J34k5j08Q7J53j26j31k1J93J38k52n9L42j39l6L6
4180F1L89n94K32k79J97o2Qk33j00M39k06K12k02j08K2j0J67j24j23M80k46r9
4202a79J23N1K17n4l45K99J6r0r0L4J23l0k2K00m75N37n61J48m6K19j14L8j53
4225a54m4K14l1q7o6J69k52K14J42j20l6J66k26j72L46mj65O70m41j98j04L9K17
$$ y = [102, -235, 94, 63, 61, 120, 293, -59, -121, -133, -136, 0, 61, 3, 41, 138, 167, -83, 17, 89, -8, -31, -13, 260, 135, -6, -132, -278, 149, -131, 362, 165, -4, 159, -37, 78, 1, -43, -71, 238, -298, -15, -16, 75, -21, 161, -30, 154, -164, 24, 24, 10, 44, -137, -263, 2, 117, 104, -49, 121, 197, -275, 84, -105, 36, 43, -227, -175, 179, 169, -143, 3, 27, -55, -60, 123, -231, 56, -119, -89, 210, -183, 101, 37, -20, -103, 132, -57, 46, -15, -97, 22, -213, -186, -234, 51, 211, -24, -205, -110, 2, -358, -125, 9, -16, -124, -37, 116, -10, -141, -162, 31, 169, -83, -142, 200, 61, 25, 61, 450, -144, 88, -191, 6, -56, -48, -281, -381, 58, -148, 64, -138, -246, -224, -234, -67, -191, -314, 166, -80, -179, -56, -5, 212, 158, -187, 112, 128, 38, -52, -18, 105, 75, 53, 253, -222, 315, -246, -98, -144, 75, -39, -1, -154, -198, 16, -15, -102, -168, 1, -251, -37, 105, -15, -51, 115, -111, -283, 63, 59, -106, 564, 123, -75, -179, -140, 77]
4248G7M58n41j03j49M42j63J35j47R3J05l25J21j69J89j83j45K54K54n02L05j13
4269a07K62k41k68M34M0L5m87K57P6j19l48L64M3N4R0j69K1K2O4j99J0J96K22
4292B52k04k64K43L1P2Q7k18J20j16L5k56K77J17m96J89o9N07l14J55l83Q1K39
4314H5J29J21k94J13j06J03l5KJ4J80k85j95L38l42L9K70p0J51j0m49J32o2J19
4337e2R1k69K70k9Lj87L85k35q4J53J38J60k74j02J38j64j22L47j55N8r7J34n0
4360E7J1m8k12L7K56L09m59j07k8Q8N2N8jOJ28k92K37Lj20M1r5K51R8l66R0O3
4386E7j44Q7l32L39k3J49M3J3k39J92l52L10k90K72L7k23k77K90M0k34K71m29
4408d43M85k08n8J15j9K10l00j8N3J04N5r1o4N94p77M23l74L24K8k44J26oJ86
$$ y = [77, 535, -6, -109, -258, 184, 21, 156, 9, 102, 207, -118, 3, -166, 23, -160, -305, -51, 203, -299, 6, -107, 155, -86, -354, 80, 120, 155, -332, -75, 1, -118, -466, -102, -59, -5, 85, -84, -63, -41, 23, -176, -166, 30, 252, 48, -216, 27, 58, 130, 217, -1, 119, 3, 38, -218, 59, 176, -320, -131, -200, 307, -7, 148, -235, -154, 85, 214, 335, 41, 154, 48, 151, 116, 118, 132, 312, 27, -168, 170, -172, -133, 137, 67, 218, 208, -241, -109, -171, -52, 39, -230, 40, 11, 14, -173, 212, -23, -107, 46, 184, 344, 70, -32, 106, -58, -180, 167, 12, 70, -27, 107, 57, 68, 20, -192, -155, 101, 410, -49, -156, -184, -96, -44, 14, 13, 19, 147, -145, 92, 95, -25, 16, -79, 172, 270, -96, -6, 57, -87, 0, -332, 7, -16, 133, 176, 189, -50, 142, -210, 100, -190, 82, 119, -104, -381, -91, -51, -285, -14, -443, 42, -166, -224, -109, -128, 82, -218, -236, -183, -79, -24, -115, -179, 415, -362, 61, -313, 11, 39, -205, -79, -85, 101]
4431A01k0j20J6K51p5j46J05K1k40L0L17j89k21r4n1L84l02J11k4K48n1r8K21
4454A74j98m9L9j50J0J77N7j05J04j45l3M58l61P9%K14l15l69M86P6m0k08K37
4477A38J37M4k26p1O0j64R7k62J24j85P4J45J83l4o7k14J39K8J51J28k01l2L06
4500B98q9n65L49m8L9J2l23M10r3L7k99J19K62K25m38K21J27j12Q8k52P7j34L16
4523B27j58p7j1j3K83j99K13K39l47q3l04K82m4K79m19L10k44Q0l5p0J19P3L7
4546A38m88N99k01j03J3R3J94k89K94Ok90K81J4j79o7j78J51K68J20m43M19l60
4568hR5M2k23M0N6p9q9J57L8J72j35j02j13rL64l31j71L75k16J23P0r4P2m63K33
4593a96K23l24L62Q2n79O95k93R%Q5K27l15L56o56M75j33N9r8K20p6M5j08j05
$$ y = [101, 81, -39, -23, 228, 153, 7, 112, 133, -107, -77, 240, 51, -170, -264, -315, 69, -233, -122, -146, 102, 51, -47, 174, -24, -73, -34, -184, -174, 3, 60, -45, 59, -86, -119, 339, -22, 57, 57, 271, -44, -413, 73, 149, 109, -99, 138, 275, 319, 93, 22, 82, -82, 15, -247, -123, -308, -234, -89, 94, 60, -7, -221, -82, -54, 97, 225, 24, -8, 298, 209, -356, -7, -55, -16, -4, -327, 83, -10, 27, -272, -153, 109, 334, -104, 117, 244, 132, 220, -32, 45, -89, 227, 69, -8, -19, -32, 251, 52, 265, 504, 157, 74, -230, 52, 8, 287, -132, 178, -66, 14, -21, -91, 28, 101, 138, -350, 249, 48, -55, -42, 51, 245, -44, 250, 256, -34, 247, 261, 82, 15, -163, -12, 256, 376, -67, 352, -8, 87, 129, -94, -54, 2, -77, -166, -9, 29, 201, 66, -36, -149, -158, 206, -125, -296, 79, -137, -14, 56, -38, 34, -429, -196, 27, -297, 65, 147, -432, 263, -30, -21, -21, 64, 291, -24, 332, -324, 151, 18, 77, -21, 199, 123, 168, 60, -45]
4616d5j1K59mk08K9J89k79r5N4K55j38o1J62r1m3O4l33K38j22L68n1j02K9Q1j67
4641b2j54K49k71K30O1k39L17j06r5j21K78m3k95K85k28K73o6%J54m13J16L7Q5
4664C2m0L61j89m29L77k70l7J61N1q2J74k03L9K66l49N2K35j14k52J07J91j49
4686f8P8J31k66M93l96L07j67r1j26K94n1k41K15j24J96n46J56K29j33J09J57
4707A56l93J55K42l10K29o2L38m13N1j16K63J28j73l9K1m2j00k0J1l7j13N02m69
4730a91L73l55K66j98J10p8j55L85n5n1j01k84L52j87L32l80j0K83j66j21J22
4751a09M60l43J25P2l64K71l0J62k11l22K36J95n9kj6q8o7k6K35j17l1J77l6k8
4775H4o3Pk1J41l25K58m21J57L13L7q5o5j75j08J51K78k01J96k76J25j78M57l39
$$ y = [-45, -56, 203, 199, -9, 20, 209, -70, -165, -111, 144, 6, -55, 107, 16, -27, 37, -296, -58, -180, 188, 137, 35, 64, 145, -22, -176, 73, -198, 32, 93, -146, 171, 65, -30, -151, 127, 84, -211, 74, -154, 119, 53, 53, 207, -206, -90, -53, 32, -8, 353, 164, -265, 112, -158, -195, -34, 17, -65, 109, -94, -55, 211, -138, -86, 149, 35, -217, -110, 81, -68, 10, 141, -125, 368, -28, 279, 112, 21, -105, 189, 138, -103, 112, -12, 184, -362, -206, 23, -110, -1, 156, -237, -82, 160, -150, 79, 17, 355, -58, -7, -123, 140, 268, 95, 56, 77, 35, -65, -85, -74, -111, -224, 278, -191, 182, -173, 93, -105, 5, -73, -228, 157, 102, 51, -50, -334, 18, -169, 163, -217, -227, 56, -110, -231, -109, 351, 8, 133, 205, -159, 112, 82, 244, 33, -289, -53, 142, 83, 81, 65, -23, -90, -116, 119, 2, -29, 148, 112, 84, 21, 28, 7, 148, -177, 81, -340, -183, 130, 167, 82, 17, -158, -266, -115, 163, -38, 158, -118, 7, -171, 286, -53]
4798e3J9j98L16k85L14J02j21M9j24o8j4J46j1J5L3j50L37j98j5k7K55o63K11
4821a30J85K45l56K24k05KK08k89K15n5j94K61k11m8R5j09K9K38j18k44P23m17
4843D9n6M3p3Mk3pl1K34p9j92J37j39MK64k16O6j99J2J29N6J27m8op4L8Q9Q7k26
4871c0N5J55O4n94L90j22J35j30J59J26k78J98j02k9j40J27j13KJ34j21Q6J29
4893A01q8O6j70j23K04J61R1P7l15R7pj88k3J50l90M46k17K06K18k72pl12M30
4916A35k16J40Lk10j34K7J50J96m8L6j19J2K7l62O31j69m1j68K27j89r7K18J19
4939A68q2r4L60m46j11L59l53K05K55l09j04L00j41J33o2m0k00N37j20q2J38k38
4961G3oJ62p2%j38j49L4P6K11O8k57j20J67k32N20K3l51n3K70k79O3k29N9K91
$$ y = [-53, -34, -232, 84, -201, 113, 215, 94, 143, 19, -49, -63, 83, 72, 87, 120, -30, 307, 109, 94, 67, 322, -341, -130, 55, 300, -56, 168, -37, -35, 173, -116, 99, 44, -150, 111, -100, -148, -53, -162, -133, 105, -13, -257, 466, 49, -7, 36, -37, -33, -56, -63, -94, 140, 61, -131, 6, -133, -129, 135, -81, -15, -214, -202, -73, -17, 110, 62, 56, -18, 20, 109, 196, -30, 25, 180, 244, -350, 40, -82, 53, -77, 82, 208, -70, 128, 26, -3, -143, -16, -129, -127, 7, -114, -28, 101, 13, 79, -91, -214, -10, 151, 242, 319, 4, 101, 94, -94, -117, 33, -357, 89, -128, 78, 296, 24, 17, -295, 135, -81, 59, 62, -148, -282, -255, -105, 91, 43, 79, -40, -28, -1, -363, 268, 99, 58, -110, 117, -72, -169, 49, 168, 86, -8, 352, -94, -205, 154, -199, 6, 261, -48, -152, 148, 7, 140, 78, 38, -162, 375, 255, 173, 311, 73, 67, 229, 157, 157, 19, -130, -96, -20, 191, 259, 2, -118, 49, -183, 337, 360, 9, -44, 226, -53, 10, -219, -160, 131]
4985A31l56K26k06Q9K85k6R6k06o9n6J70j10r6o3J85L1l0j12K08l4k94L52m88
5008c73L09n3K06p1l37K52J48m51L92k01J05J33k08Q4K06k12j62P5J13J43r6K40
5030B42l22j3P9K91l0k27j75k9k7J05j6j14K39J72l90J95J69O4j05j99K57M2J24
5053C32k68j52M11l88nJ69J0Jj09J04l29J61j27J63j41J41n1J43j10J41j99K96
5075A93k97Q4O3p0n1J30j41r6K38n3l09J36m2K55O9J09k76l39J41L34j13J25j36
5098d6k0L0R7l32M02J7n02N04k09J11P3r1p1K33rN3j43k52p0K42O7j2n4J7n0J61
5124A46m53J77l8L32j90O4pj12K03n9j0l69l9O8M96j52k25L33m33j1K19j9O2n0
5148f7j30J12J74j09Q7O3l8q7k23L20k65L34l86P1L00k08j00L12J03m18J16K36
$$ y = [131, -225, 1, -205, -116, 169, 143, 239, 33, -36, -92, 78, -32, -128, -191, -6, 25, -5, -117, 91, 57, -237, 115, -373, -64, -117, 89, 18, -319, -67, 81, -370, 22, -179, -74, 59, -149, -65, 141, -71, -233, -158, -45, 98, 2, 242, -80, -93, -14, 277, 247, 20, -155, -184, -211, -106, -122, -236, 3, 175, -215, -20, 149, 213, 108, -91, 166, 208, 332, 64, -88, 323, -65, -70, 99, 109, 110, 1, 105, -224, -63, -190, -27, -168, -27, -78, 65, -45, 96, -103, 193, -104, -20, 43, -27, -78, 52, -89, -185, 53, 0, -309, -173, -215, 40, 109, 218, -58, -397, -256, 78, -35, 90, -46, -66, -36, 61, -271, 131, 148, -354, 150, -59, 52, 125, 34, -37, 196, 187, 240, 97, -155, -225, 17, 84, 72, 18, 35, -15, 146, -307, -130, -168, 164, -26, 38, 31, -81, 122, 63, 53, -316, -355, -287, 209, 57, -168, 165, -268, -279, -60, -79, -17, -67, -197, -85, 89, -20, 67, 130, 92, 5, -218, 102, -163, 171, -215, -144, 156, -52, -152, 160, 263, -155, -39, 197]
5170A97k95QL09l8o6l55N81o15K59J1n5M17m77N6p2K84l27R2l1L20l94K31j39
5193i9o1M87k85J14j8k12q7J22K9k05M60k57j46O1p5O6J69l5M62o58m3K13j79
5216a77L41l25J91m1k88K95n6J93M4k25K24l50L14j95r6K19k05J33J33k2k23J00
5238a6Mk10J66P4K36q3l08K18j22R6j03n5j28K47o1r9L05k86O2J05J22m03n8L94
5262I7o3q2K9L8j20K22j78m1P2nJ38j82K40K5j43o1j97nJ52K81k69L19l20K37
5286A84j81M5k53J00J53p5j58N5K84k20j10j05J86RK9J5J30n10N40j89k2J01q7
5309g9L68m58J43k9J34k01K80k95M22k17M3k69K83k58L88K0n61J20L06K57l05
5330I2l4Q6k05K60J6r3j82Q4J83k10R9l20J27K10k08K1k7L20k79l1K22j90K05
$$ y = [197, -98, -90, 219, 181, 115, -240, 341, -274, -15, -4, -59, 358, -119, -63, -135, 149, -178, -86, -117, 203, -191, 40, -99, -160, 327, 42, 156, 138, -74, -161, -39, -10, -215, 245, -12, -158, -97, -172, -106, 63, 28, 490, -168, -211, 2, -177, 164, -161, 30, -11, -299, -4, -60, 133, 177, -48, 176, -174, 140, -55, -151, 68, -137, -4, 129, 107, -116, -16, -12, -222, -56, 18, 254, 171, -137, 81, -41, 55, -48, -103, -231, 16, -45, -144, 161, -125, -63, 42, 164, -239, -297, 97, 34, -48, -19, 19, -101, 121, -57, -98, -26, -31, 107, -75, 165, 190, 47, -14, -211, -216, -64, 217, -52, 267, -53, 184, 3, 48, -205, -105, 48, -27, -185, -130, 154, -66, -176, -281, -95, -86, -57, -42, 88, -422, 118, -71, -93, 8, -79, 289, -169, -26, -55, 79, -122, 158, -137, 285, 68, 111, -158, 125, -133, 255, 275, -286, -166, 140, 397, 92, 58, 144, -61, 199, 215, 122, -60, 24, 207, -3, 96, -224, -97, 113, -95, -74, -101, 219, -60, -91, 131, -59, 146]
5353A46p6j72L20k45Q8K17k37M1q0p7J89J60j42N2m5o8j94J11L80m84k0Q5L12
5376B61j52k35l9J31k22L82k24k21M63KJ50j32j05J3L1j72K67J16l41pR7k5m4
5399fK17k92J55O9q4q2J07m3j52O6PL75n13J80m7J67K05l17J74j09K97l46Qk0
5423A6J30jp0k35j33M22k81q4J60K65l08J10q6M37k70R8k38M2k79L6J91j7M7Q
5447d0n7J60L2o8J09J1k95M90l88MK9j80K74l42N00k24j4l2j13K54J29j71j86
5470a18J73Pr7o2K06k59J31L2J00k76o1K67r8j42N30n17R6K66k90K4J01q2L0j23
5494a62k14N02o0K91n19K44l3j68M59m98Q6j30O6j02K06j81L01j60q1P0M0K03
5516A60qk26m7R3K24m59Q3J23M9j36k9p1K77j68k1PK5L60r6m8k13L2p0K40j48
$$ y = [146, 70, -102, 218, -27, 61, 278, 41, 82, 2, -75, 114, 274, 132, 184, 139, 71, -123, -12, 368, -116, -136, -51, 261, 109, -126, -165, -34, -256, 126, -98, -319, 144, 146, 296, 164, 59, 72, 103, -69, 198, 314, -27, -34, 63, 38, -6, 211, -81, 74, 143, 59, -23, 84, 41, -111, -45, -38, 337, -176, 4, -43, 124, 329, 12, 186, 77, 374, 28, 36, 16, 146, 145, 75, -160, -293, 129, -152, -236, -76, 189, -119, -9, -95, 342, 72, 170, -68, -26, -305, -269, -78, -95, -48, -40, -97, 63, 95, 27, 136, 147, -148, 342, -46, -42, -13, -193, 81, -261, 239, 15, 1, -31, -144, 110, 239, 68, -118, 55, 62, -35, -97, 109, -150, -19, 13, 113, -163, -224, 43, -55, -197, 333, -184, -88, 178, -112, -88, 13, -69, -39, -162, -376, 126, 66, 357, -162, 82, 49, -119, 340, -158, -72, -202, -136, -238, -32, -213, 88, -72, -153, -83, -43, 160, 152, -74, -121, -28, 196, -263, -180, -57, -8, -144, -173, -244, 33, -135, -156, -149, -124, 236, 140, 92, -121, -89, -159, 81, -67]
5541f7n8K78k45j38J18lK67r8j88L41k04Pk20J89l6j70K95O7j24m11L19J66rk42
5565a66K0M15j83J41j36q3k34N36j40k96J90J95j79m18J83L78l08j9kq1K75j20
5587c2K5K11l7R8j70J5J11k35n10O33J34k71N3RJ68k24N61n81m7L58k30K0n0J16
5611A25K6k07J3P7k91P19m50l4J68J2j18k14K33k59J84r8k35M83j94j5K48m18
5633b45J17K38l93K32l2J87j97j24K84P5k06L30q4l0k56J10J47K7j27j3n6m9L
5656f2J17K39k35q7J32k77L25k49k40R3J12M0rm9K73j60L38l66j20P5J38j0j59
5679a41j25K48l03PL49J33j12k69L5K73l15K32k12K18J69j85r5m2J38m3K91j61
5701I0n9j18L9j67N74m67K40k45J31J91l04M2J28q8Q5Q5j67j54l7M39k78j37R2
$$ y = [-67, -125, 153, -92, -230, -112, -115, 152, 54, -134, 207, 3, 10, -210, -21, -57, -227, 68, 135, 11, -400, -81, 85, 76, -166, -146, 269, 86, 227, 91, 8, -226, 310, 170, -126, 64, 259, 80, -338, -155, 223, -85, -104, -106, -187, 88, -32, -7, 204, 167, 265, 95, 110, 221, -14, -524, 109, 243, -28, 25, 34, 202, -22, 539, -42, -89, 269, 39, 59, 9, 125, 151, -56, -43, 34, -257, 462, 12, -22, 146, 158, 40, -174, 59, -200, -16, -114, -349, 134, -60, -75, 173, -245, -128, 110, -283, -51, -83, 104, -93, -217, 67, 142, -64, 266, 182, 152, -104, 6, 153, 180, 53, 40, -16, -65, -62, 55, 294, 59, -28, 104, -173, 152, -97, -337, -244, -132, -92, -101, -150, 123, -37, 301, -65, -185, -110, 28, 18, -141, -266, -18, -321, -314, 35, 168, 56, -213, -178, 95, -220, 12, -200, 18, 187, 2, -93, -135, 3, -40, 251, 90, 31, -87, -48, -215, 359, -108, 132, -113, 18, 209, -95, -53, 75, -13, 72, 157, -10, -164, -201, 238, -40, -177, -85]
5724h5N8o7L47j33j08K44l82M48L3p53L03j8J36J43j38J62L1L3R5m62l2J4L09
5747A78l87L88j96k13M4J31J65q0N2r6j38M15o4j91Mj60j01M79q1o9j54M7l7j9
5771h3L8K12k82R3j57L05m37M12qj07r6q9M67k90J23k34K29o2l6j9K59l2k98j51
5795b43m9J58n8K02j97J77K13m37J31l1o8J6L28o5O7j39J27J0l23K10qR9j40J74
5819A54j59j37P6K85j69J02j12k79L00j37p9L96j76J37j98L4Q6k31m5K66k88L18
5841A44l92K40j05KJ87K83k75j06J37k70L64j12K04k49L0k35J68Kj11K6l8k16
5863c22K32Q8J23j18n1J73k45K09j80Q7K15l65Q6J81j95q4L7L24j92L8J9j15K07
5886A52j09p6J29j43k34J44L30j71m9j35L44j35k96L76j06j58J22p1J4K57j85
$$ y = [-85, -27, -94, 253, 120, 12, 256, -126, 322, 355, -398, -95, -113, 23, 166, 28, 190, 221, 254, 349, -113, -145, -131, 178, -209, 179, -17, -230, -186, -55, 110, 30, 82, -14, -152, 263, 199, 8, 12, -148, -249, 230, 149, 80, -74, -27, -64, -83, -45, 167, -115, -22, -179, 126, -311, 101, 93, -14, -110, -199, 268, -22, 101, -133, 96, 34, -2, -21, 238, 206, -92, -243, -292, -134, -192, 10, -187, -10, 203, -234, -103, -134, -202, -186, 142, 77, 144, 5, 132, 142, -181, 29, 21, 120, -20, 154, -5, -142, -66, 219, 50, 152, 40, -239, 61, -76, -155, 241, 65, 202, 4, 38, 124, -107, -152, 114, -174, 144, -248, -8, -113, -111, 76, 359, 84, -22, 115, -155, 209, 97, 301, 52, 82, -153, 15, 17, -94, -68, -106, -322, -90, -2, 121, 3, -48, 125, -120, 89, -91, -4, 211, -154, -68, 113, -82, -166, -129, 195, 3, 41, 60, -55, 152, 43, -33, 96, -47, -281, -137, 193, 22, -27, -162, 182, 47, -249, 127, 21, -137, -15, -86, -72, 185, 0]
5907@j19r9K04R1o9l9J92k0k86J85k38J82K34j04q7j98N82m28k1j6K47l05J32
5930B0J75k58q6J30o2J61j56M2l49L67L6Q7o1o0J24j47K03p4k2j21J31R6R5k32
5954C9jj5j35j15L89j62J5q8K91k49Q3L8l9K02k78O7l8l7O7k11P2l5K7L5P8O0
5980F0k41RJ52J27JJ2O9j67J22q7p6j36J4J56k7k00R4K47k06K4j68J86L5J64j29
6005C5j76O1RO0R4j2k43l1J47R6n6j36M10q1j24Q0j23j29MK30K1j8j25M0k1O8
6031H0R7J0q7Q6k18K78j65r7j93J25J26l10J96O3J33j18j88R5J7qR7j55K96L8
6055A98Mj14j60J06j01L14l67L0J05J09k17j02K00J66j98j5J85l65J47K47k98
6076a26l8k29M95j86K13k29J67N5N2j36J28k69j88M78n8MP0k02l1p0r7L46N7k63
$$ y = [0, -119, -218, -14, 77, 8, -31, 161, 141, -145, 40, -198, -16, 218, 114, 27, -171, 411, -17, -38, -54, 193, -112, 20, 195, -63, -149, -19, -81, 80, -76, -34, -383, -16, 20, 107, 46, -14, 110, -37, 166, 92, 70, -51, 80, 176, 271, 39, 38, 23, -112, -227, 162, 0, 15, -73, 218, -31, 52, 90, 51, 253, -25, 42, 4, -33, 34, -177, -105, -140, -113, -78, 0, 60, -181, -172, -20, 107, 108, 120, 189, 22, 144, 57, -19, -155, -141, 15, -12, -212, -118, 129, -77, -53, -221, -35, 0, 164, 35, -141, -80, -71, -11, 83, 71, -172, -203, -56, 40, -16, -152, 258, 177, 53, 133, 10, -119, -115, 115, 136, 118, -7, 33, 12, 80, 177, 187, 100, 186, -32, 246, 81, -16, -209, -84, 42, -268, -72, -9, 124, 6, -182, -87, -70, -78, 19, -136, 160, 198, 202, 88, -72, 34, -67, 247, -120, -90, 15, 124, -93, -195, 5, 171, -27, -42, 143, -222, -75, 172, -126, -164, -393, 102, -84, 129, -100, 67, 122, 174, 38, 166, -103, -291, 187, 129, 133, 203, 1, -30, -100, -197, 149, 206, -57]
6100e7o2j20M36m33M05k32J37j58q1K35j26J37j28J55j66m4J76j5rj90J82J87
6122B29k96Q9j53K96k51J72j74L75k39J29j20J11j13k4j22J05J5q5L39j98N2n8
6144G9Q6l1l2n47N12L09m33K4j12K28l19M8K5P1p2J57L98n40N21n92K41j1L9J00
6168A49l22M97l4q2j24k8k49J75P6j81K28j97J53m0J47j08j17J70J0J55j63l6
6190G9q1n1J66J27l25P5l6M06k68k34M42k79k11M00k52m7l65K57K06J3J1P9k56
6213a44J79m2N6J22k39J91j84k6lJ18K53l87J74q4K62l59o3J03J42M7P9p0j42
6236a7N7N5K28n0k92j96Q1K88j68r0J98J2k41k36M83j73J9J85r4l19P09j62o09
6259c32M02K18m1k55jj8L37j89K37j99r2P6j18L9N8J8j70j00J85k12M12j42J12
$$ y = [-57, -119, -239, 197, -236, 169, -63, 74, -84, -165, 70, -56, 81, -47, 108, -58, -102, 74, 59, 50, -140, 42, 229, -67, 22, -131, 165, -86, 86, -88, 287, 48, 177, 57, 168, 55, 31, -91, 14, 29, -56, 283, 85, 137, 79, 165, 134, 102, -445, 67, 376, -57, -33, -145, 83, -236, -188, -163, -92, -164, -7, 391, -149, 372, -220, 21, 10, 49, 149, -173, 324, 290, 208, 84, 56, -193, -18, 58, -123, 105, -92, 61, 21, 168, 60, -57, 113, 123, 278, 115, 79, -2, -53, 113, 240, -85, -10, -46, 360, 92, -142, 300, 21, -190, 210, -42, -89, -454, -197, 9, 22, 33, 112, -144, 35, -7, 49, 171, -68, 123, -61, -87, -90, 28, 281, -106, 68, -16, 246, -113, -176, -73, 69, 116, 195, 125, -17, 40, 95, 323, 273, -19, -215, -134, 154, -14, -104, 94, 106, -135, -371, 112, -61, -42, 143, 49, -270, 439, 277, -332, 70, 288, 247, -8, -9, -27, 310, 121, 358, 159, 67, 143, 25, 64, 122, 140, -30, -130, 55, -157, 255, 113, 225]
6282B25l95K62P8k91j40J79j45L57k11J97l7k18R3j72J83pP1j04K61j00j94L44
6304B36r5r6R0J83n41m2L63k54K70k06J64J18q4m6k77P6K59r0L10l65k64M09k11
6327i3K26j48j42K03l08N19k20m3J40j60J22j02J76j55k11K31L6k20M0K88O4j68
6349G5L0j02q0K43l4j14k52J74J22J44m81L65P0n4j57R1J80K2l10J28k65L36L0
6372A61k69M42m48J49k15P6N7R6j00k47M34n5J12k60j66J80J72r9K86K2k84j6
6394B8q2J80j30J50L1o6l73L22J64j62j58J5J78l85L64j19K40N1l1j89N1j31K00
6417A48J33m58J58Rk06N02l16rJ93j62m2k38N90M4k15Kj49j76J68J28jj1K03k08
6441H7k05K03m69M44j24J98k60N02k32j6j07J81Pk09r1k03M01m0j57M6O7k32J27
$$ y = [225, -170, 92, 170, -121, -261, -82, -227, 130, -81, 116, 79, -139, -46, -218, -35, -42, 29, -75, 186, 86, -108, 236, 141, 45, 135, 318, -223, -265, 98, -156, 114, -92, 72, 190, 106, 60, -217, -141, 118, 28, 338, -27, -291, 118, -93, 133, -15, -157, 46, -262, 257, 37, -6, 134, -26, 96, -6, 170, 15, -196, 35, 71, -149, -109, 179, 243, 75, 105, 3, -77, 166, 132, 18, -234, -60, 62, 206, -275, 90, 160, 106, -51, 40, 220, 242, -68, 60, -205, 131, 161, -108, 334, -114, 35, -180, -104, -47, 49, -51, -298, 136, 81, 193, -67, -233, -53, 119, 20, 306, 328, 44, 28, -54, 126, -4, 146, 177, 111, -262, 60, 224, 62, -96, -81, 97, -288, 76, -43, 197, 248, 217, 28, 79, -52, 148, 281, -177, -19, -10, -216, 286, -30, -39, 154, -8, -50, -288, 302, 346, 131, 133, -16, -192, -24, 104, 103, 92, 295, 87, -118, 85, -384, 60, -64, 134, -126, 376, 144, 128, 21, 202, 209, 0, -91, -294, 107, 67, -90, -44, 23, -209, -82]
6464h2J07j9j10J04l28O6J04J88j89Q3Q8k77K07o9J14R8j29l60K17K91Q3o1k42
6487a16J71Om5J1J2m51M89J88j23R0l23n2j43L91k92M72l85j3J0K88m37M45p3
6510A20k52J06k31J91L67n2J56p35K85j00L90k41J53r4j33J42k11J52j33O9j7
6531f8K07j56K66n30K92l02K26M9L0J09j65J14N5l64L75j56j5K41o5k27o9N3L75
6554B75l08k18K53J00J79j86J64m83L02L8J81k45k0qj00KJ67kJ02N0j74n3J15
6577A31k27P7q1J66o2k27J13L71m10N0K39L0j86k16kJ19J96n1Q5j30K39l01N8
6600a9k6j81L21q0K23o1j39j43J40J55j63O5j22oJ50j9k50Q7k8l0J05j49M1j4
6624a43n4K39R7l97K7K21K8J10m21M66k52K66nj70j57J18J26J49l92j0K31K21
$$ y = [-82, 25, 6, -104, 0, -328, -262, -158, 30, -159, -76, 12, -265, -58, -127, -13, 85, -44, -404, -187, 104, 187, 126, -116, 55, 61, 16, 27, 39, -412, 77, 265, 142, 232, -91, -143, -286, 105, -187, 285, -100, -113, -103, 185, -252, 193, 120, -132, -26, -257, -66, 301, 249, 405, -330, -45, -145, 245, 4, 157, 63, -70, 72, -139, 13, -120, -51, -68, 139, -17, 249, -281, 11, -291, -65, -16, 14, 123, -42, 72, 127, -237, 138, -18, -33, 208, 143, -84, -153, -100, 275, -33, -251, 2, 102, 281, 95, 259, -224, 78, 116, 297, 52, 32, 24, -76, -74, 93, 91, 193, 243, 69, 16, 131, -96, -19, -100, 66, 4, -223, -110, 261, -149, -99, 140, 170, -16, -232, -234, -115, 81, 30, 115, -15, 224, -77, -19, -45, -226, 95, 15, 238, 177, 38, -105, 35, 190, 27, 92, -30, -36, 114, 95, -155, -68, -96, -126, -21, -170, -129, -143, -197, 42, 139, -258, -231, -10, 18, 128, -293, 173, -79, 187, 182, 12, -145, -27, 99, 248, -144, -154, 77, 298]
6646B98m28M32n64L02j18J44k10J46m9l69J99J34J20J38q4m6J47n25M80k34p0
6667a57L35k90K35j16j19K51k29K86j78j69J18J5K3k05K97O5l59L19J12k02K48
6688B80n42L1L15J28l1j74N9j13N0p2J33k30N78n95M29o8k82K63m38J95Q4P5k23
6711a48K42k37J22K96l68J05j73L95k63K17j02q1P4k46k8L18l7l61K28J85K8j76
6733a0l42K43K05j78oJ52j90J95p7l68N34J76m04K26l07mK19k74P3L63l20K14
6755A20k94J24J64k81K63j32K27n4k97K63m4k1J4q3j0L42k31j96P8j37O25l51
6777H9J3m7N0k03R1k11kM8K48m5j40J42J48j78r2R3J1o8P6l00J86K73l43M05l70
6802a26K54Q1j71R8l03l3J34j64K26L9K56k32n6K32l86J46N7k64J55j43K59j14
$$ y = [298, -130, 302, -262, 40, -78, 66, -144, 2, -47, -416, -217, -83, 37, 175, 91, 45, 192, -333, 147, -87, -157, 178, -112, 123, 7, -112, 139, -90, 196, 18, -151, -33, -18, 5, -200, 97, 162, -197, 122, 234, 32, 280, -262, -231, 84, 212, 181, 7, 66, -47, 3, -69, 64, -166, 412, -183, 246, 178, -104, 159, -279, -84, 0, 75, -148, 94, -143, -21, 275, -93, 12, -161, 234, -29, 188, 86, 5, 79, -167, -195, 123, 86, -275, -47, 138, 166, -10, -352, -109, 96, -82, -88, 64, -126, 69, -8, -376, 158, 334, -70, 156, -151, -155, 64, -210, -137, 226, -94, 120, -174, -50, 114, -167, 96, -36, 191, 137, -160, 103, 59, 38, 52, -31, -41, 301, 70, -126, -48, -185, 440, 89, 102, 55, 105, -98, -7, -218, -220, -172, 76, 31, -109, 33, 181, 3, -89, 4, 15, -53, 23, -277, -91, 182, -161, 244, -126, 128, 209, 38, 136, -167, -200, -66, -230, -4, 35, 291, 59, 3, 235, -151, -5, 52, -212, -57, -200, 59, -55]
6824e5j56L61j74Q9J35j74J46L20l65k04L03k26n8L7k68n1M62j10L3J12j97k35
6846b75M6M70j54j14J8j05K88j36J1j74J63L27l33n3j79K84k72N2K82k54J63j6
6868C9k88K5L98j20n0J60k83J99o4J85k57J18K29l78MO2q4J32k47M51k87q7J80
6891C7j5j94K40l53J15j37L92p1J57j59M4N3K2L8j20k18J92O6m13M33m42K00L77
6914B44l18L1J02j93J40L12o33L30j49j47L28k03J29Q0o7l38J17K80m6K49j40
6935A08L0M7k71J50q0L33k40j03L56k77j82N4K51j53Nj12K50j15K8L2j91nK09
6958A24j45j1Q8O0k52K76l24M2L68l57K77j86j95Q7Q5l6J68P9m34M25m6k7P6m02
6982b60L68K99m88K9L20n26L57j61rR5n0roLK02j52J84K0K1j12J24n56O20n20
$$ y = [-55, -211, 150, -24, 65, 200, 26, 172, 492, 127, -77, 226, 0, -58, -21, -289, -340, 122, 12, 45, 157, -40, -275, -229, 241, 87, -27, -9, -114, 174, 38, 49, -125, 38, 365, 32, -21, -200, 84, -188, -136, 146, -108, 55, 39, -249, -224, 174, 54, 4, 164, -119, 80, 16, 201, -56, 62, 291, -87, -83, -21, -105, 27, -220, 231, -56, -143, 37, 22, -172, 68, -285, -170, -307, 85, 14, 171, 12, 56, 109, 131, 169, 49, -169, 23, 89, -324, 109, -333, -133, 244, -74, -43, 59, -134, 6, 318, -315, 15, -134, -281, 47, -156, -27, 53, -14, -352, -235, 45, -1, 248, 108, 138, 185, -86, 64, -16, 317, 77, -26, 330, 53, -129, -75, 176, 23, 28, -84, 166, 51, 79, 111, -80, -85, 124, -21, -32, 56, 116, -136, 140, -184, -142, 226, -131, 146, -40, -235, -148, -63, -99, 69, 148, -286, 139, 93, 66, 142, -260, 108, 407, -81, -52, 268, -258, 99, -62, -71, 24, -26, -35, -41, -38, 164, 12, 196, 216, 237, 125, 249, -307, 313, -207]
7006b07K08K0p7J96k34P1k31M09Rk10p0j9QpJ10j24N6K15k98K57l2K4J48l07J54
7031F9j66J18lJ79j18q9K38p7k21k9J10rJ02k9k42j56J76L50m4L4qk49M09o06
7055b61M10j66K02j99m7K22l07J56j73N7J84J7M9m6O2nk91K18l4L01l90k55j36
7078d32N87m21L18J07l41L46p23L71K01k16J60J03k51K67m57N36j95n1K66k89
7098a14J68J2j27JL60l81K85j13k83K84r0j0M0n3K6L46l84l5n3J10j46K82j27
7121bN9r1J48R2j96J9K5k02k7J62M6r1q8L52j33L2k84J01J89k77L47p6j34Q7j13
7146e5P6j66M88k29k35J25q2L17p09M04J52k04Q7l1K16k91P4N0j11K54J28j78
7168H0j27PJ31o5k07J52l4J8N8j7m0q2J30n3k17K13J64l67%N73k55j36J69J87
$$ y = [-207, 1, 21, -56, 140, -94, -23, -254, 155, 164, -46, -116, -135, -127, -134, -24, -148, -92, 123, -175, 82, 50, 74, 222, -85, 69, -97, 21, 18, 197, 79, -10, 228, 151, -70, -99, 11, 2, 104, 75, -167, -323, -147, 203, 159, 193, 185, -64, 345, -261, 149, -17, 185, -14, -61, 161, -146, 10, -163, -106, 78, 95, 144, 98, 160, 155, -136, 82, 48, 349, -41, -296, -432, 155, -266, 52, 159, -182, 164, -559, -188, 13, -203, -43, 60, -191, 76, -381, 155, -40, -91, 175, -114, 54, 66, -61, -60, 300, -81, 204, 91, -192, 92, 2, -8, 32, -21, 5, 351, -33, -68, -121, -11, -157, 125, -2, 57, -34, 114, 206, 10, 29, 54, -148, -175, -13, 33, -58, -146, 206, 73, 105, -179, -78, 111, -166, 181, 105, -29, 58, -55, 21, -145, 343, 114, -121, 4, -78, 239, -470, -66, 86, -118, -31, -62, 154, -137, -63, -13, -124, 130, 258, 80, -47, -40, 91, 26, -181, -29, -63, -45, 13, -4, -44, -126, 4, -49, -266, -53, 111, -256, -256, 317, 62, -74, 95, 282]
7192B82k55j92K22K17l17M3k36L91O2l8l16K32p3l26R7R2J67r9k14J62K26nk93
7215a71L77j60K3K8k39L31l2k02K8M4j65L34q7j22M3n5m7J0J71k27L8n9K24p2
7239A3l5J84l18pK27j46j48N19l95Q9J65j06J12p5J43j52j54J36k20K20K79J09
7261D40k81j7J00k48J70m41N47k48mj05j76M59k63K5J58l41K66J20m62L54j13
7282f0J39j38K01k41L24j98Q8L70m98L8k24O1j25O20l85J11k21l7K40q0J75k80
7304a20L75l90J28J38Q0k42k30L08k67K53n5O9L19l17j12J09o8R5j51K2j04K31
7326G1J13l34J62j89L02k47j92L73l6l52K21L16q2J0j90k49N00j57P1n9J27K14
7348C93l88J46n7Kj91L36l06K39j64k34L99k66K18Q9K0o5p7L45l89l7o5o5L0J43
$$ y = [282, 27, -165, 57, 274, -43, 0, -236, 155, 217, 179, -137, 95, 22, -304, -207, -115, 52, -47, -261, -99, 127, 122, -171, 206, 46, 69, 97, -142, 189, 157, -45, -17, 27, -138, 196, 109, -13, 30, -25, -72, -62, 109, -118, -80, -139, 85, 13, -22, 162, -156, -163, 64, -82, -230, 289, -106, -17, 148, 42, 154, 79, 222, 70, -84, 52, -168, 52, 331, 440, 159, 142, 242, -6, 164, -277, 270, 22, 18, -87, -263, 196, -67, -42, 116, -225, 41, 161, -301, 53, -60, 79, -59, 142, -99, 225, 27, 115, 485, -13, 25, -199, -138, -263, 357, -28, 83, -138, -175, 65, -15, 160, -120, 255, -135, -7, 131, 211, -31, -261, 47, -220, 33, -22, 47, 366, 49, -63, 46, -22, 73, -78, -56, -160, 71, 184, -150, 12, -177, 125, -122, -314, 59, 23, -329, -108, 208, 126, 136, -54, -303, 197, 40, 111, 52, 179, 393, 5, 151, 94, 96, -95, 241, -65, 174, 10, -224, 175, -91, 127, 216, 236, 171, 94, 439, 50, 13, -52, -117, -87, 56]
7372E6j64J3k30K99M3J2j41R2J70o7j63P2l4j49l1M03k98J68J34k29j19J36p5
7395a02L2P5j62J96L7r8J13l59M70J72n30J19R3J79j02n4o0n9J51j43R7j50J20
7418C5k24K27N0k98L51K23l35m3m6K15l01J30K46k46L08l58r9L9M31m86J64n4
7440g1K4k20L24J9l38L22J24k05k77K37j43K52l23J9J16p0K37p7J48j12J40j94
7462f8m2j18J76J79l37R0k24L74n2J28j45K70l71K69l68L66r7k44o4M6M09j66
7484A1Q7K6k11pK89k43j74M61m27P3O5R1j34J61m13L58o0j00L15p8L0k62K81j67
7508b8j88J90L3j13O3L90n11J63n0j12j63L94k12L2J35j52K40l51J62q2J32J33
7530A05K00n11K36O5N9j35j95K76l61K83N3J62k64K35l62K23k85N07n47J36L12
$$ y = [56, -108, -95, -325, -26, 17, 29, -112, -20, 150, 83, -80, -8, -42, -191, -222, 181, -117, 51, 185, -44, -163, -27, -102, -70, 5, -157, 39, 76, -22, 91, -268, 202, 374, -156, -37, 56, 235, 133, 79, 19, -40, 111, -32, 65, -85, 35, -189, 38, 88, -210, 141, 364, 29, -14, -60, 155, -146, -16, 230, -16, 292, -66, -165, -126, 305, -181, -17, -71, -47, -267, 57, 76, -262, 60, 184, -21, -298, -61, -204, 48, -275, -256, -140, -210, 27, -50, 98, -14, 126, -68, -110, -228, -52, 127, -210, -120, -344, 30, -22, 106, -39, 231, -140, 129, -239, 127, 30, -214, -278, -232, 177, 11, 98, 124, -87, -94, 195, -48, -222, 239, -188, -115, -50, 41, -93, 68, -345, 13, -47, -147, 168, 90, 120, -142, 139, -28, -216, -26, 7, -106, -43, 347, -164, -1, -51, -163, -326, 68, -144, -112, 23, -129, 111, -240, -78, -160, -28, 105, 305, -206, 30, 95, 154, 19, -176, 100, -261, 22, 75, 237, -27, 208, -154, 69, -216, 291, -256, -120, 192]
7551A92m4k95J89j77K66J7N8q8j82K22k68J78k5J90k76o6J93q0p6K00j69J44j74
7574g1q6N7j82O67l43j88J13P7l21K6K70q3n2J47j14k29K26L77m41J39m1O6j42
7597a28J65j43K8J21L8K48n19K27n7k58L40Q3k23L25mq3l76P8K86j00Pk64L16
7620A07j35OJ48KJ30j04j99j09J97r1O9k1R8K4k66J39j01K65p9j34k11M83m31
7643b13M24l18J02j44LJ11j7j71M0J13J29j54Q3O8j90r7j05M62l27L55k22K48
7665A80j21L0K04k2l15j17K22k08L14o5l36L60q2J88l53N4rl6J91J13l11n6K28
7688E3l44K01K07J03q2l81J62N4L78l60j51P2L70j60O3k30M6J59m2k76M06l65
7710a17L0K60j90j27K77k5K4j80j17R1p2J19N6j58m2O9L34k99J01L1J47m56J91
$$ y = [192, 148, -147, 42, -135, 131, 148, 206, 118, -64, 158, -110, 68, 43, 233, -43, -109, 84, 4, -72, 128, -41, 103, -71, -157, -100, -282, 385, 42, -146, -33, 44, -277, -251, 19, -64, -116, 31, -83, -312, -86, 291, -150, -11, -52, 14, -128, 37, -106, -78, 43, 81, 329, -190, 37, -20, -278, 62, 145, -78, 247, 243, 160, -216, -138, 148, 48, 55, -209, 107, -28, -22, 126, 128, 258, 154, -45, -154, 43, -48, 21, 0, 98, 122, -144, -5, -106, 159, 80, -54, -265, 218, -213, 211, -107, -5, -149, -146, -35, -52, -223, -183, -70, 59, -95, -12, 56, -134, -231, -336, 126, -201, 154, -68, 180, 59, 89, 293, 271, -44, -161, 61, -147, 167, 102, -234, 126, 44, 232, -121, -67, -76, -112, 79, 192, -119, -175, 53, -291, -90, 117, 220, 138, -243, -81, -27, 351, -9, -160, -88, 282, 122, 185, -45, 1, 160, 118, -158, 248, -117, -87, 173, -17, -144, 133, 108, 132, -48, -165, -74, -146, -27, 29, -129, -171, -102, 232, -67, 34, 65, 212, -244, -53]
7733e3K2k43L35k24J96K6j84L43q2JM38n20l87M40j38pK60q3K16j27l46J07j25
7756a35lk99N77k27j60K76l13K21J54j2J08l83j4J64L2k3k02K23K19n22K45o8
7778a42K43K5L5j46k39J87K22k48J69j34q5J09j70O4J03k46J34L07n0j44Q5k02
7800a23J92J25j23M51n03R7mk76M93l77k9M3K7k7R5N1p9j01k34J44L53q7o8j30
7824i0j15P0Q0k42J93K62k05n0J21o4M8q8L60J8n44n0K28K09L8k64K06j75rJ68
7848A05l66L2l6O46n73L2N9L3K97r9j2K6K8j14K1k7K35l84N2o4K86M3l95K54j71
7873i2P5J23k22m2O5P8q0L75p0j50k77L73j26J00r4n5k01K85J45q6n41K80L71
7896B34k56k02L81k4j29K69l93q6K15O5m5j4k5r4J24O9k88L37k18k31N61j29j06
$$ y = [-53, -31, -274, 61, -163, 33, 59, -125, 218, 136, 137, 575, 55, -332, 108, -30, -37, 223, 140, 356, 229, -117, -10, -135, -138, -437, 140, -87, -247, 29, -284, -63, 91, 79, 187, -196, -210, -46, -14, -37, -239, -16, 203, -319, -74, -142, 101, 126, 161, 15, -224, -37, 185, -63, 106, -28, -113, -4, -174, -110, -7, -253, -119, 188, 138, -6, 79, -123, 69, 194, 71, 522, 19, 116, 112, -164, 329, -48, -77, -34, -7, -34, 61, 112, 33, -68, -302, -158, 195, 108, 40, -90, -205, -135, -55, -297, -104, 158, -47, -97, 24, -40, 8, -80, 280, 298, -246, -296, -68, 141, 179, -85, 121, -54, -63, 105, -261, -229, -265, 381, -192, -160, -101, -68, 229, 130, 118, 144, 172, 58, 79, 52, 287, -97, -45, -109, 177, 220, -175, 79, -92, -17, 106, -116, -158, -93, -15, -95, 280, 210, 60, -217, 156, 30, 130, 36, -19, -220, 65, 210, 124, -417, -137, 234, -22, -224, 157, 133, 4, 273, -120, -206, 9, 74, 29, 15, -10, -104, 20, 89, -199, 138, -80, -311, 250, 121, 15]
7919A5k67K27j5J8M2k2J68j11L9n2k41J06J26LK94k89K60k75J56m5k81j2j16K47
7943b5R8n3J2k39J89R5l46n1J62o8J31K22j47P3k33J99j98M81l78o2M0l6K30l76
7967b80O06j85l2o5J07P0j16k6J4Q4j25J06O1p2QJK1j49p3M2K7m6J90l54L07j97
7993g6j77N44m37J70l55L70O2l55Q7J57J57M77m87J99m51J89Nk11j43L49J04j84
8015fJ85l8p5k53J69j02K54J82l39j0J39j60o2j26L0L02K06k24j71K32k87K50
8037I6K19m49K4J63Q3J38k92J06p5J97m14K79k91J0K01J28P9j74j08J82l29J92
8059c5J61l52L57q7k6J34m03Q4oJ96J25k49j14J25o3p6K61o5P7j04L76j80k20
8082h4M2O6k1J70j11O1j68o5L62q5k83K1J62P5j85L19k43l36N36n61M48j50r5
$$ y = [15, -252, -25, -40, -22, 20, -2, 166, 55, 94, 42, -199, -93, 33, 36, 330, 41, 301, 26, 182, 137, -144, -156, -272, -25, 73, 20, 32, -207, -18, 77, -269, -320, -158, -226, -95, 127, -20, 53, -180, 19, -179, 302, -76, -138, -98, -134, 96, -280, 326, 141, 109, 44, 151, 221, 105, 79, 93, 177, 52, 158, 219, 147, 155, 156, 177, 28, -45, -3, 24, -22, 168, -186, 121, -76, -253, 291, -146, 24, -331, 39, 101, -254, -167, -10, 147, 624, 137, 336, -115, 74, 79, -132, -275, 74, 178, -6, 179, 141, 66, -187, -18, -120, 134, 316, -23, -33, 106, -54, -116, -242, -212, 90, 296, 72, -99, 133, -154, 96, 315, -134, -110, 53, 136, 274, -18, 88, 13, 210, -204, 75, -216, -206, -5, 123, 202, 28, -80, 102, -227, -35, 126, -226, 131, 44, 18, 152, -251, -167, -173, 23, 148, -101, -215, -90, -153, -229, 32, -33, 44, -60, 316, 136, -84, -42, 24, 3, 173, 62, 123, -45, -110, 252, 167, -116, -95, 67, 142, -43, 276, 33, -303, 233, -328, 120, -30, -125]
8105a25K35n6j46M8J17o2j11K77Jn01J76J81J10r8J81q8k11J82r8q1K71o5m04
8128b67M15k91K55Q2l05L82k35j43k7j37L65k47o6L68k20K38j35qJ76j8j43L8
8150G7j96J54j38N7K99l15n4J21j96M74k09P4J7k97J92k42K75n5j06K64J8l36
8172a22m1M19k75kJ28J22j83N0R9m70L62J59l88K53n2j07O8pR5
$$ y = [-125, 110, 54, -92, -44, 73, 11, -100, 177, 178, -323, -147, 34, 144, 46, 227, 139, -72, 110, 12, -69, 202, 137, -267, 148, -143, 112, 194, -111, 271, 36, -107, -134, -271, 94, -153, -219, 149, -71, 167, 32, 24, 200, 182, 39, 77, -119, 35, -103, -46, 253, -62, -116, 5, -191, 283, 74, 148, 165, -132, 60, -182, 93, 38, -68, 196, 214, -122, -163, 256, -19, -21, 107, 229, 46, 96, 195, -275, 87, 246, -142, 111, 59, -48, 20, 13, 108]
8191A08
$$ Imaginary data points
##PAGE= N=2
##DATA TABLE= (X++(I..I)), XYDATA
0@%%%%%%%%%%oJ4j6J6j6J6k3L1l2L8m6N3o1P0q2R2j04J19j35J54j74J95k18K45
34A30k75L07l41L79m20M64n15N71o31O99p77Q62r57J064j188J334j502J703j950
53a043K258k659L204l986N220p469J2892n1042o5742O6130N9029K230o2449l3197
67g6624K7067N9019J3524l7075l7129J3760L8616J6131j8761j6045J381O504K610
80g022J2992J3806j2705l4734n362M3018L7814k5601n8491j0856N5639M8069k2664
93C3903o1758j9721M6826N2939n848n4230l1984K9664N3376J0097m2533l6603
105b5872J4038M1823J4586k3479k4987o14J3516J1261L504m200j6764j8028N902
118i314L0176J5106k9222m2086J617M5096K7089k8465m8877o713M0171L4476j2679
$$ y = [0, 0, 0, 0, 0, 0, 0, 0, 0, 0, 0, -6, 8, -8, 8, -8, 8, -15, 16, -16, 22, -24, 29, -32, 38, -44, 48, -56, 63, -72, 82, -92, 103, -115, 130, -145, 162, -179, 200, -220, 244, -271, 300, -331, 368, -409, 453, -504, 560, -628, 706, -796, 907, -1043, 1215, -1444, 1760, -2226, 2994, -4475, 8417, -42625, -108367, -42237, 16792, 19022, -43427, -76624, -49557, 9462, 22986, -14089, -51218, -37458, 1158, 17289, -1472, -17517, -16136, -9632, -7022, 5970, 19776, 7071, -27663, -33025, 9993, 47807, 22206, -36285, -47141, 8498, 56567, 33903, -27855, -47576, -750, 52189, 46341, -7889, -39873, -10209, 43167, 53264, 10731, -25872, -11834, 29989, 44575, 21096, -3891, -4505, 9011, 20272, 23776, 19576, 2812, -15216, -9314, 20862, 35968, 6746, -35340, -33723, 11373, 38462, 9997, -38880, -45593, -5422, 29054, 16375]
131A6375m2880k1497K4971M1603P624l5379l2995J0963M0685J8750k1850k9727
143b3357k301K2669K1238J108j6572j9243k239K1837K5558m522l2964k0555K0165
156i178L6074M042l1774k7653R561L0978J5059j6300k7646r774J7818K6806M606
169B2619k4822k6653M729L1769J9732j6725l3113q603K4844K8825r71k8869k4225
182c1463Q518L3540J7904k1259l6617m947L3588K6950j4690l6609r799K3907K2697
195A1720m503j9573j1994L207J1321J2399K877j3932j8301R75K4778K0336j0664
208H646k9577j0023K5257L2324J238l2433k4237J6934M1464J4968l1733l6530
220b3702Q966M3749K1037k8128l6633K919L4634J6968j8389k3860j442J3640P038
$$ y = [16375, -26505, -48002, -23031, 18572, 26196, -9183, -42178, -31215, 9470, 28220, 6370, -23357, -25658, -2989, 18249, 19357, 2785, -16458, -18697, 3140, 28698, 24176, -8788, -29343, -9178, 26896, 30938, -836, -28489, -18928, 12050, 27109, 10809, -16837, -26611, -8793, 18013, 22619, -2203, -28856, -24127, 7642, 27374, 10649, -22464, -31067, -6223, 22602, 21631, -7238, -31463, -22945, 10595, 28499, 7240, -29377, -34324, -736, 26214, 11524, -25085, -34884, -10977, 11720, 7217, -12356, -24350, -21143, -9822, 2577, 5454, -8478, -26779, -25804, -1026, 19310, 8646, -20931, -30954, -5697, 26627, 27865, -4568, -28805, -11871, 29593, 44561, 12828, -23702, -14736, 29013, 50050, 21922, -14711, -11792, 22842, 39810, 21421, -2439, -3881, 9759, 16797]
233A6797j676m380o877j0470k031J3963J4074r063k6099j1806K0497K7871k384
246A8416l3322k3147J8249L9277Q636l6066l4381J4823M5553J5306l5231l5120
258c7007J1861L9564J2839k5613k4068O564K0387O419p549p453j868j669Q46Q903
272B156Q114p408j8900n693J7682K1578m748k8646j6967J9393L4009K497l3682
285a0615k6955J7784M1089R630l4391l1111J5055L8872J0198k7020k3436Q916
297a1984K3990P732j1252j1109j279M640N009N833L45r422j1999J128J6161J1361
311A9154j0431k2484p505J8235K2595l811k9702j7743J7919L1329K684l1072k3635
324c4467J5298L1711N978k4143k0075P968K1998Q719r813j3677k653P133J1823
$$ y = [16797, 15121, 10741, 3864, -6606, -8637, 5326, 19400, 10337, -15762, -27568, -7071, 20800, 18416, -14906, -38053, -19804, 19473, 28109, -7957, -42338, -27515, 18038, 33344, -1887, -37007, -25146, 14418, 27257, 1644, -22424, -15860, 4527, 10946, 3397, -4056, -5924, -7593, -6747, 2156, 10270, 2862, -16038, -21731, -4049, 17529, 12781, -15865, -32832, -13439, 20570, 23067, -10615, -37570, -19786, 21303, 30933, -3458, -34569, -19514, 19358, 29556, 2536, -20900, -11984, 12006, 19738, 8486, -2623, -3902, 738, 5747, 11580, 11925, 2503, -9496, -8368, 7793, 19154, 8723, -13761, -21266, -3031, 19564, 15753, -13949, -31692, -13773, 17556, 20240, -10832, -34467, -19169, 12542, 18520, -5623, -25698, -17730, 4268, 12987, 3174, -10503, -13156, -6023, 5800]
337E800N863n990j2526m977J1011J5697J183j4835j3888M621J8350J0915j0552
350A0672k0591o069J7150K0164l445k4427j3908J4077K2520J888k0225j5457O091
363a1560J6746P953p843j3828o544P313J4494O645j1717j7412q69J8413J5624
376A7415p717k0286p504J5102J7862j77j6212j3036O033J7200Q585r517j6036
389h288l349J2858J3013j818j3468r386M167J1249O833m427j2550q867O447J5946
403H360O776j5036k0253J427K3247J3798j4660k4567k038K1685J6641r303k1209
416a5132n452J4063J5647o91j4084r271M904J2495N838n189q593k564M574O780
430C325N417j491r604p984N439J6576P302j5980j9790M177K4954J1992j8787k5211
$$ y = [5800, 11663, 5673, -6853, -11830, -819, 14878, 16061, 1226, -12662, -8041, 10309, 21224, 10672, -9919, -15988, 1162, 21326, 17881, -6546, -20454, -6377, 16143, 18031, -2194, -17651, -11560, 5186, 13139, 5296, -8532, -15076, -7763, 6731, 13376, 1659, -15753, -16622, 1791, 17415, 9698, -10588, -18092, -2990, 14872, 14695, -1517, -14553, -8520, 8680, 17265, 7748, -8288, -11637, 1221, 14234, 12416, -1052, -10438, -6271, 4978, 11811, 7384, -5166, -14033, -7586, 8360, 15136, 100, -20153, -18726, 4521, 18319, 3659, -20908, -22946, -1261, 15380, 6077, -15132, -20584, -6521, 9126, 8435, -5649, -14920, -10016, 2479, 8317, 3128, -5465, -8029, -3455, 3325, 8742, 7251, -2353, -10337, -4898, 11678, 18980, 3000, -16790, -12613, 12341, 24333, 5546, -19665]
444a9665K780K5688J3564j5436k3420j103J9473J3532q182j6952n109J0287J1057
457F514k68q724n787J398M984M031K138k141o272n680N297J3910M986j4976j6020
472a6610O131K3465Q498j9869k2103O561K5469R902j8440k1421K411K0938R994
485A4926j1219j7489k326J2407J0118l629j1040m802M175N910J807o06l196m553
499i517k015O186J0805J011j3105j0968R456K0265L907j8834j5469R791K3359
512A4872N683j8412j6447O223J9586O988j1877j4749K4J2082Q424l926j1122n307
526g958M366P207J693l612o587m110K077P041N366m397j2282m642J0947J4749
540I858k724j7476q705J2596J8128n2j6690j0363Q918J6431L417j0114j0363J993
$$ y = [-19665, -16885, 8803, 22367, 6931, -16489, -17592, 1881, 15413, 7231, -9721, -14830, -4543, 6514, 6246, -2478, -8265, -6867, -1883, 2148, 4286, 2145, -4127, -9807, -4510, 9400, 14386, -590, -16610, -10479, 12986, 21484, 1615, -20488, -13927, 11542, 21444, 3004, -18417, -16006, 4932, 14926, 3707, -13782, -16108, -3701, 6417, 2788, -8252, -13054, -8879, -2969, -1162, -1768, -4964, -9517, -11532, -5346, 5459, 6470, -6635, -17603, -8147, 12118, 16025, -2809, -18278, -8487, 14872, 20555, 2143, -14304, -8081, 11505, 18493, 6616, -8133, -8109, 3973, 12397, 8471, -2651, -7958, -3592, 3615, 5308, 1696, -4891, -9001, -6924, 117, 5483, 1086, -11196, -15838, -4891, 9858, 7134, -10342, -19047, -6451, 11677, 11625, -5065, -15428, -6510, 9921, 13338, 3224, -7139, -5146]
554e146J0907P814l008r225m440M510R216L334m729q563k713O325R144J660q883
569F203j0572J945J2911Q416q097j5577k323J4466J1392n824j4666m289J0224
582D209J0888j415q886o024K549P826N050j709p428n333L644R265M707o280j0433
597F30j769R181R812k210j2190q651O956J3545L047j3231j2662L920J4853N629
611A6860j0820j2811Q78J0726N866m907q185k100K581M975K532j197n898m978
625f478K414Q977M560o958j1079m0J1181R500n279j3948m776J0656J3284j615
639A0399j4539r013Q169J4498R67j2811r431N222J0512J907o824o556L06L824
653c370K063Q29j003n048m433K459P957L282q148j0002J292J2166P571p684j3673
$$ y = [-5146, 5761, 13575, 10567, 1342, -3098, 1412, 10628, 13962, 9233, 670, -2043, 4282, 13426, 15086, 6203, -4369, -2424, 10487, 18903, 10806, -4771, -7094, 7372, 18764, 12940, -1726, -6015, 4209, 15097, 13682, 4796, -1228, 1321, 9147, 14197, 12488, 5060, -273, 3371, 12636, 17343, 11063, 630, -1139, 8042, 17854, 15644, 3454, -5197, 1759, 15304, 18351, 5120, -7542, -3622, 11231, 16860, 6040, -6771, -5893, 4833, 10699, 5792, -2393, -4493, -1912, 3063, 5595, 4398, -1500, -6478, -4064, 4913, 9473, 2515, -8564, -8604, 2577, 12077, 6798, -7150, -11926, -1270, 12014, 10399, -4140, -13153, -4984, 9514, 10481, -2330, -11761, -6539, 3973, 5880, -944, -7500, -7194, -3370, -1307, -478, -1481, -6529, -10962, -8503, -546, 2736, -5412, -15414, -14122, -1956, 5615, -2069, -15742]
668a5742j673J2833J1422m671j4441n138J1485J3088k000j2853n873Q559J0270
681E266O33p588m273L090M922J826L14r45l391k621L883P605K055r112p657M068
697a925J1978M355r588j1393J382J2663Q152q272j3363j455J1872R245m898j2248
711c495l437Q351Q672j602p750l153L014M470J935p33k098l504o07M794O516p40
727A0633r026m976O843J1017K24j0323q363N258J1649L475r133j0514J611J0868
741I243O137o310j0900q35P962O128l031p173k570K823L736J688j142l518l772
756a534K78O448N230m218r070k410R364Q394l272j1274m372P630R704j83j0733
771a8o877N156Q826J913p451p793Q62O999L732l945n965k008J908L418J444j806
$$ y = [-15742, -17415, -4582, 6840, 2169, -12272, -17410, -5925, 7163, 5163, -7690, -13563, -5004, 5266, 5899, -1689, -5962, -2872, 2050, 3876, 4190, 3245, -146, -2767, 1116, 8721, 10776, 1664, -5993, -1925, 10053, 14408, 4820, -6573, -5191, 7472, 15624, 7352, -6011, -7466, 4406, 13651, 8753, -3495, -6932, 1419, 10091, 8489, 739, -2414, 600, 5070, 7005, 6272, 4174, 670, 63, 4857, 11373, 10633, 1607, -3369, 3474, 14491, 14715, 4392, -3971, 1287, 12936, 16411, 7278, -3236, -1625, 9243, 15380, 9070, -1830, -2665, 5297, 11425, 8394, 1221, -1349, 1474, 5210, 6898, 5756, 2238, -1534, -1256, 5192, 10422, 6204, -2866, -5276, 4088, 12482, 9210, -2064, -6436, 1194, 10898, 10715, -18, -6895, -1739, 7087, 9000, 1549, -6244, -5382, 1617, 5349, 1404, -4561, -6569, -4661, -1243, 201, -1605]
787a605m377m188J885P069L134o574q577P27J0604O357o307j0175r96J0281P934
802E192l567r606k474P002P987J98p042m124L094O126K467k803m130j273K608
817c45L441J972j693m849l199L418O684J643q157p381L015J0406L278r391q970
832a0128K128J0055M848o979q707P4P316N275k963o259k457L709M956P29l009
847a412k998q23K157L417K225k564m907j592M719O646n98q107n683N843R864M88
863F675r717p103N110R863J623q241o886K761P509L074m330n066o65L264M062
878A933q2k838k649o3K271L490J301l291m925k7O344N006l208q065k591P380P729
895G715j879r672m405O751Q946j282q482m463M237O095J164m788m615N42L246
$$ y = [-1605, -5982, -10170, -8285, -1216, 1918, -4656, -13233, -12506, -1902, 4455, -1852, -12027, -13023, -2742, 5192, 1625, -7981, -10455, -3453, 4534, 4732, -2310, -6434, -3340, 2786, 5253, 2450, -1680, -2953, -345, 3096, 5068, 3375, -1474, -4673, -1255, 5429, 7072, -1085, -8466, -5451, 4955, 8233, -1158, -10128, -8000, 2055, 6903, -76, -8783, -8709, -1393, 3882, 919, -5340, -7797, -4088, 868, 1597, -1412, -4410, -5233, -3076, 341, 2566, 2, -4905, -6497, -1778, 4868, 4270, -3837, -9520, -3677, 6187, 6675, -3042, -10145, -5035, 4828, 6451, -1790, -8676, -5915, 1594, 4668, 338, -4728, -5393, -2129, 1933, 1851, -987, -3636, -3699, -1428, 2062, 3363, 72, -4853, -4880, 1464, 6470, 3262, -4803, -7394, -14, 7715, 5836, -3836, -8241, -1490, 7456, 6174, -2308, -6771, -2534, 3561, 4725, -63, -4678, -4136, -890]
910h90K858p48k699k918JK316L337K31m820l929J351O660L100m806p467LQ539
927A19N962m088r471j087Q256O992l169p913j611N698N263m79m042k302J315K644
943B087K023l7k666k416j52L820L264j048n387l196L381O080J119o519o242K338
959c551Q323K463o018p898J094Q268L697m628o777q1N613L359j772l650j237J563
975a232K149J928j07k393l099J187M158L155k495n277j571M899N643r48p255m015
991e273M146P612M62p260n563L152P291J587o122n268J732M946J693k265l380
1006b510n72J367J686J845p56k411k097P91M721K250l047n174J73O148M385l077
1022C722o421k012N988O412j676p111l491M793O138m74n771l692K650M572L26
$$ y = [-890, 1968, 1220, -1479, -4397, -4396, -2080, 1257, 1488, -3332, -7261, -5910, 750, 3850, -956, -8423, -8420, 119, 6081, 1993, -7478, -8565, -309, 6683, 3514, -4399, -6010, -312, 4951, 4472, 430, -1872, -557, 2087, 4110, 4073, 1407, -1009, -1161, 2659, 5923, 4875, -512, -3708, -327, 5753, 6872, 353, -5889, -3551, 4772, 7235, 1217, -6681, -5587, 2681, 6378, 1750, -5027, -5108, 505, 3864, 2092, -1558, -2795, -1232, 917, 2845, 2738, 345, -2754, -1567, 2591, 5746, 3251, -2026, -3597, 1302, 6945, 5997, -1258, -5273, -1127, 6485, 6947, -313, -5876, -2724, 4567, 6154, 32, -5236, -3504, 1442, 3135, 870, -2510, -3082, -1715, -29, 1816, 1060, -1351, -3448, -2657, 2064, 4314, 1267, -3907, -3734, 2414, 6799, 3722, -2699, -4711, 1277, 7689, 6013, -1098, -4589, 204, 6342, 5868, 97, -3595, -945, 3627, 3953]
1037C953k527k750n5J243J557Q10m63l049k562K453M428Q25m703m717K167N955
1053B565L093m790n889O11O451M462l852o410j020N745M512j832n609j863L335
1068d91L846o37k307j908P3P29J999J054j359l371j885K887M414k96n761l191
1084f204L131O057Q12n829m699K339O273K449m601n403J009N411L156k832m670
1099c601k13L509K537q06k317j026L46R85J920J084k121l336m32L851L532j608
1115B304n482k237M492N290j320o267k971L674N921k30n207l653K172N106J175
1130B767l813l486O60K824J784j077j825j391L62J203J568N16k148l485N98M445
1146d98K521l192n399L3N180M208k800n868j028M766M627j264m976k089L181M483
$$ y = [3953, 1426, -1324, -1379, -136, 1421, 2231, 1768, -1281, -3843, -1390, 3038, 3863, -840, -5557, -3390, 2565, 5658, 868, -5021, -4410, 2041, 6503, 2651, -3759, -4779, 966, 5478, 3646, -1963, -3826, -491, 3355, 2718, 411, -1497, -1424, -695, 1304, 2358, 999, -2372, -4257, -1370, 3044, 2748, -3013, -6204, -3073, 2984, 3796, -2033, -6732, -4393, 1880, 4329, -272, -5675, -4666, 745, 3901, 1069, -3601, -3814, -305, 2232, 1426, -891, -1917, -1571, -586, 1334, 2418, 297, -3039, -3471, 380, 3912, 2304, -3178, -5415, -923, 4367, 3047, -3220, -6191, -2517, 3404, 3174, -2033, -5686, -3514, 1592, 2767, -1046, -4532, -3872, -1048, 736, -341, -2166, -3557, -3195, -1992, -424, 92, -2056, -5541, -4943, -498, 2023, -1169, -6568, -6535, -1355, 2853, 53, -5815, -6843, -2077, 2550, 1286, -3690, -5779, -2598, 1885]
1162A885K66l231k483J508L031R36q46j901r44Q48J231J937lk992k627J742M096
1179B453J603m564m180J479N321K198m260n201L57N405K551l016m264p48L465
1194a401L178j039k702j465J277K553R53j220j513j045J221K034J682q78l177
1209a542j749K951L654K36m603l571K984N253P5m876l767J959M581J247m075l313
1225d556N77L144J554j032k730q00J279J747R96r47j475p12R39K636J342j619
1241C43l146j84L797L641j424m879j657L973M625j224n164k266L106M077l24m471
1257a177k695J793K446O90k227j623o09Q56Q63N08p20j972j052J613K101O74k144
1274b675l033Q57M376K650k896m042O3M794M149k375m938m25M346L688j996l521
$$ y = [1885, 2151, -1080, -3563, -2055, 976, 1912, 1066, -835, -1779, -931, 300, 2237, 2234, -758, -3385, -1643, 2453, 4056, -508, -4688, -3209, 2112, 4310, 50, -5151, -4794, 611, 3162, 146, -4118, -4866, -1401, 1777, 738, -1964, -3429, -2152, 401, 1354, 134, -1379, -2424, -1203, 831, 2513, 1635, -1542, -3291, -340, 3314, 3550, -1053, -4624, -1640, 3613, 3688, -1188, -4955, -2996, 1585, 2832, -1243, -4556, -3979, -835, 719, -313, -3043, -3843, -2564, -817, 179, -768, -2243, -2955, -2016, 620, 1962, 343, -2803, -2987, 810, 4451, 3027, -1852, -3509, 464, 5089, 3865, -1299, -3565, -459, 3618, 3294, -1177, -3872, -2079, 367, 1057, -1170, -2793, -3402, -2546, -1683, -1175, -1895, -3867, -4919, -3306, -1205, -531, -2675, -5708, -4851, -475, 2175, -721, -4763, -4700, 94, 4243, 1868, -3070, -3495, 851, 4539, 2543, -978]
1290i78p02K093K367j72j942j289K21P96M16O87j112j835p21J642K229l37l088
1307a725k658J653M347R31l551l940J499M856K517l332m125Q37M719K063j906
1322B185l071j94L369J581n34j145j001M06P46J403J07j238j898j09K070J915
1338D592r85l231j848J776L809n80l681l060K024M358M99l692l549J439M213J189
1354C273k860k368L01K809J725j334j183k59Q05O09J188J7j326j354K78K406J177
1371C904j086l496m87L052K204j225l948j957L073L124n29m571j909K167L043
1386A359p7k709k319J280J871O35q31j141o14Q2J427J465j19k137r84J416K595
1403A199P37k073k427R29L140J857k426l050J77L130K696k321l010n53K249K515
$$ y = [-978, -1680, 413, 2780, 2608, 666, -623, -402, 394, 810, 1497, 385, -1450, -2171, -529, 1700, 1363, -1725, -4383, -2730, 1617, 2548, -1003, -4943, -3444, 1412, 3929, 597, -3528, -2691, 2028, 4091, 2185, -886, -1080, 2289, 3870, 3336, 2191, 1190, 1596, 2342, 3745, 3852, 2614, 716, 607, 2677, 4592, 3607, 376, -1472, 304, 4113, 3533, -148, -3208, -1184, 3174, 3673, -19, -3568, -2129, 2084, 3273, 413, -1955, -1654, 1155, 2880, 1546, 363, 104, 909, 1518, 2706, 2723, 1397, 43, 321, 2727, 3904, 2818, -678, -1165, 1887, 4091, 2866, -1082, -3039, 34, 3158, 2629, -1942, -3851, -1684, 1359, 1282, -1427, -3746, -2466, -595, 40, -791, -1932, -2546, -2464, -1037, 428, 309, -1828, -2812, -1396, 1199, 1936, -137, -2564, -1635, 1505, 3362, 936, -2114, -1937, 1193, 3889, 1568, -1442, -1995, 254, 2769]
1419B769q58k614j119J005J552J75r82j001o29K88J365R27k90k458j357K044K645
1436A462K2k969k187K007L453O40l123k247J117L334J426k334k681M86K961J187
1452B554j213j518l55J075J262J03m61p94p44M72J044J436j316k426k65K468K489
1469C811q49l906j083K566L064n28l821j637K026L419n29k805j557J287K284O41
1485B383j122j850L29J074N62L18n02q64m87L63J598Q83j268k336j04K825J852
1502C654k262k971k63L036K367j635l251j014K523K198r63k405j167J664J604
1517A115K08k015r04K87J023P90l67n06p60k63J063J642k78j421j517O56K659
1534A412J699k376k756L61L645J511k084k944M20K824J723j624k401o66J802J943
$$ y = [2769, 1911, -703, -1822, -817, 735, 910, -72, -1073, -1702, -1414, -49, 878, 588, -1870, -3227, -1183, 1462, 1484, -1485, -3672, -1665, 1788, 2428, -695, -2942, -1825, 1509, 2935, 601, -2080, -1594, 1367, 2554, 1341, -177, -532, 543, 1805, 1908, 1447, 653, -91, 381, 1425, 2861, 1545, -881, -1146, 1322, 3811, 2962, -944, -2027, 539, 3603, 3075, -746, -2383, -357, 3062, 2533, -272, -1829, -542, 1742, 2383, 1261, -589, -260, 814, 1376, 1694, 1192, 328, -159, 204, 1802, 2685, 1417, -919, -1023, 1802, 3654, 1392, -1579, -1842, 1194, 3561, 1926, -1325, -2339, 184, 2382, 1419, -986, -2153, -489, 1115, 1323, -692, -1596, -1309, -286, 504, 137, -369, -1129, -1392, -329, 1313, 1035, -386, -1903, -1247, 1412, 3111, 735, -2021, -1660, 1985, 3496, 1412, -1532, -1112, 1712, 3435, 1811, -590, -1256, 546, 2489]
1550B489o49j788n94M09P62K32j89p77p34j77Q42J420k88k146j410J806K093K92
1568A593k545k142J501L029Q31k237k183O55K647R36j281k093L82J385J230m16
1584A292j402m83P58N63P61k59p66j145J98J192J318j116k410k97J789K204q65
1601A332k869j282K233K432l91k813j102J230K170L52j663j306P24J265Q05o24
1617D93r19j98N04N19J099m92j249r24J118J834L72j454j757J13K127J642j246
1634A582k579o81K434K217j568k383o72J743J657l24k026o76R45Q42K59k81q66
1651c77l27K84J111N21m25j494o20J201J501M38j924j524J193K055P10j758k151
1668a586N63K728Q05j500k085L79J766J087j004j439l93J174P18K10p50q49N6
$$ y = [2489, 1840, 52, -542, -133, 629, 861, 672, -105, -839, -1016, -174, 1246, 958, -1188, -2598, -792, 1301, 1593, -952, -3094, -1593, 1436, 2267, 30, -2153, -1498, 1149, 2085, 804, -1289, -907, 478, 1708, 1292, -110, -593, 165, 728, 1489, 1230, 464, -681, -483, 709, 2027, 911, -1499, -1796, -7, 2197, 1332, -1537, -2819, -586, 1846, 1455, -1358, -2460, -1230, 940, 1292, -371, -1677, -953, 312, 1117, 493, -426, -624, -120, 399, 1498, 1006, -243, -1167, -49, 1785, 2157, 703, -1054, -941, 1186, 2828, 1582, -997, -1678, 756, 2973, 1405, -978, -1650, 93, 1750, 1426, -600, -1276, -331, 511, 770, 489, -377, -704, -420, 691, 1212, 787, -707, -1327, -126, 1375, 1813, -111, -1635, -442, 1613, 2323, 565, -1586, -1023, 1705, 2510, 1010, -1075, -696, 1070, 2157, 1153, -286, -679, 495, 1213, 1423, 673, -176, -120]
1685a20J68Q85N79o80j305m24J380J131k65j953q76J189K346j61k202j589J095
1702h02K626L24j926j592P41J886O86j021j539J87J257J72K03m94l26k16l5J089
1720A220O8q31j282J09J459J172q74k133m77J845J281o13k088q70J291J756l10
1737G23j814j083O13J974J3j294o80J92P85K37L50l53m61l96J001O14L80j049
1755b48p93L87J933Q85j531j500L60J654J488j492j752Q3J957J060j007k224l4
1772g74J191J105k96j197p15L99N84J77K67o81q91K22O04J205o15j164o28Q42
1790c65J606O7j461j096J014J515R00j254j779N26K051N82q15j679k6J206P67
1807A759l29j016l15K68N82K26r1r70k50l36P91J151r84j164l84J200J094k67
$$ y = [-120, 48, 933, 1512, 832, -473, -897, 483, 1614, 1349, -604, -1480, -291, 2055, 1894, -308, -1897, -802, 1824, 2148, 222, -1370, -629, 1257, 1943, 922, -617, -430, 827, 999, 1202, 708, 382, 166, 131, 1220, 1288, 457, -825, -716, 743, 1915, 1041, -1092, -1569, 276, 1557, 944, -1144, -2014, -723, 1033, 723, -1091, -2174, -1561, 413, 426, -868, -1548, -1356, -571, -334, 16, -337, -798, -1194, -193, 421, 801, -248, -1041, -654, 1279, 2164, 633, -867, -507, 1147, 2635, 1143, -609, -526, 1431, 2491, 1484, -740, -774, 417, 1522, 1226, 29, -686, -287, 297, 474, 741, 60, -831, -609, -5, 1200, 585, -579, -1207, -365, 1241, 1308, -153, -1249, -235, 1280, 2180, 926, -853, -327, 1724, 2306, 1491, -188, -214, 992, 1759, 1430, 414, 99, 367, 949, 1175, 1084, 114, -136, -472, 319, 1470, 486, -678, -1062, 138, 1232, 965]
1825I65j864n00O38J997q7j477j085J042J587N72j393j147O59J232N27n81q28
1842B57k0L26K76K34k12r80m63N47Q96K86j050j264k18J495R72j286j598n02J392
1861i12J376q89j705n16J010J355k18j029n62O94P51K95k46r38L08N45N97J39
1879E5o85j0n21M41J310J96q59j285L49J744P47j640j288J68J903M81r98j362
1897a254l20J113R64m92j059m60L34R69J26n14n51K20J95O01j76O9n37l41P01
1916d12R66m9j160p37O83J645M71j502j316P35J586O88j436j281M41J298P41j127
1934B34o61m53P98N64n1n74k91l11N32K77J91n51l13l95R84Q30m40j526l07J205
1954b58J026J38j576q52R55J657k9j302r05O51J466O1q76p35L00O26K99j69l69
$$ y = [965, -899, -1399, -761, 1236, 1149, -328, -1413, -371, 1216, 1788, 395, -752, -93, 1139, 1666, 1085, 257, 237, 563, 839, 1073, 861, -119, -582, -35, 861, 1147, 97, -1167, -1385, 110, 1082, -204, -1802, -2304, -912, 464, -425, -2130, -2646, -1636, -281, -499, -1528, -2090, -1396, -645, -350, -596, -1534, -1226, -681, -84, 55, -630, -640, -1161, -720, 590, 786, -73, -1358, -1009, 735, 1482, -158, -1446, -1278, 625, 1106, 108, -1254, -1574, -461, 503, 11, -1048, -1508, -1174, -205, -79, -593, -1144, -924, -729, -128, -304, -235, -772, -1113, -412, 554, 505, -655, -1392, -709, 936, 1407, -95, -1411, -676, 910, 1598, 162, -1119, -678, 620, 1361, 234, -427, -880, -82, 482, 431, -143, -434, -745, -213, 64, 255, -296, -609, -1004, -20, 810, 370, -1156, -1463, -258, 768, 906, -670, -1522, -567, 1090, 1061, -241, -1146, -495, 971, 1032, 156, -579, -279, 347, 646, 477, 108]
1973A08l39O7K80N43n6p89q57J76J087N10j190r73k8J431N34o52j566L5J428Q83
1993F32l24j695L95J3J182l13p61j76J77P26J81n07j16pj84Q42L66l35m84o39
2013a027N03J199K56j220n76oJ452O95j003j315K90R89N21l12j442K14O85Q18
2031G21o11n87l13K12K91O74m04o13j74R6Q41K76o01n30j31R19P01j57q84m81
2051g55L79J464j98p28r08M73J499R3r37q63L39N44O62m66m38k06P8N88mk47p43
2072c74L7M79N85Ko45p17q8J049M37n58o21o76J121Q88m09r06p02J040R88J6j060
2093a14l01K31O43K53m38k41j46L48Q7L47Q4p33n34L08J115J77r71j179L60J495
2113G91N9q64r63J9J432J67q09q76L79M67P78m09j230M22M21M88k34j88m25L62
$$ y = [108, -231, -164, 116, 659, 603, -186, -1043, -867, 220, 730, -460, -1433, -1461, -30, 504, -148, -1714, -1679, -251, 632, 308, -1387, -992, -979, 203, -110, -871, -1047, -870, -144, 37, -470, -586, -593, -777, 65, 431, 96, -388, -1027, -524, 675, 931, -289, -865, -871, 581, 1276, 273, -1042, -752, 237, 758, 446, -996, -782, -97, 721, 110, -477, -790, -578, -287, 387, -17, -630, -804, -708, 133, 409, -192, -722, -853, 66, 767, 610, -274, -755, -376, 1088, 890, 162, -746, -273, 1226, 1319, 382, -481, -142, 402, 1064, 598, 160, -46, 32, 620, 616, 369, -374, -337, 142, 727, 729, 84, -633, -721, 328, 765, 207, -414, -1090, 31, 919, 510, -396, -1098, -58, 930, 946, -114, -415, -184, 459, 712, 274, 33, -113, 235, 322, 669, 753, 20, -514, -206, 909, 1086, 115, -1064, -704, 791, 850, -14, -977, -958, 474, 641, -168, -1044, -665, -198, 580, 171, -1059, -637, -216, 272, 38, -150, -575, -213]
2133b13K41K06P9j58m56r0M56N99J89p26q26K19R38N83j194j151J015O42Q21j155
2153A9r21K85Q17M87p09r65J41P36N23m90m40k35M32L80k19J7N6n82j20O26M49
2174B87j97n85l93N37P94j0n14q94O14J124K60j045n03K42N66P88p58p75o0O02
2194H0J95j25q21J45J08M63j82j77l28l96M80K02M78l47o78J10N32L35j20o30
2214f76k94L58O06K09q72n44L23J220K40o24n39J53O85K86m47m17j77L85M83L38
2234F96n30l34k68O23J88M6r40p7M99M83o0o79j55N9K22N24j20p55k66M94L67
2255A7l9l03o0l01N11K51O7k55n57J83Q51o4m4p61N7Q00J37j85p23M14K69P69
2277A034n40l87p39P85L02K08o75k31M15m5P3k28J44R8l02qJ28N51q06k76K09
$$ y = [-213, 28, 234, 313, 155, -301, -391, 65, 664, 853, 127, -699, -480, 458, 1041, -153, -1304, -289, 353, 1174, 19, -902, -617, 200, 687, -22, -987, -846, -110, 413, -77, -517, -752, -320, 60, -159, -142, -86, -668, -788, -162, 287, 90, -495, -888, -351, 443, 433, -81, -975, -361, 763, 1023, -22, -525, -283, 283, 1071, 313, -462, -522, 80, 275, 150, -671, -526, -418, 45, -137, -314, -642, -1038, -558, -356, 122, -225, -903, -793, -261, 74, -46, -676, -970, -612, -6, 203, -669, -1213, -890, 330, 570, -54, -593, -440, 245, 531, 84, -333, -510, -125, 358, 696, 166, -168, -436, 187, 375, 421, -519, -596, -97, 386, 326, -353, -508, -449, -227, 297, 177, -578, -844, -350, 17, -22, -325, -385, -686, -175, 76, 143, -112, -669, -486, 365, 301, 257, -504, -447, 353, 490, 305, -418, -4, 265, 1034, 494, 107, -632, 153, 455, 663, -12, -243, 172, 127, 200, -28, 116, 214, -88, -96, 32, 583, -223, -499, -290]
2298b90M24Q14j302l68K70Q93L66n13o21j64J010K49l28q18J85P63K19j62o04
2317B3k0K23N47k64l56l33M73j76k26J22K12k78o41n0L94N50k24r17j05J044N13
2338E11r61r60n8J300N98n22j023L38N43R43n14j276J80Q63N99l51k49l32L99
2357B8R2M2l2K17j20l60J67J67K80m06o79J84R04J37q31m26m98J308M97o78q55
2378h62k46Q40J115m22j393L9J061K44K7n30j82L52L77l30O7k32M55j50J19j29
2398B20L73n2o29J60O44M09n35n17j96R07K04k67o37k35O87N96l43j024l2O71
2418D04M63J90r26m22P64N25j37o66k33N95J65J62m7k71m3K50Q3k24L65n8k71
2439F68j50M33K76l24k76j18P2O12n2j313K71K37P12j52p66m11L92N27K09q53
$$ y = [-290, 134, 948, -354, -722, -452, 441, 807, 294, -327, -491, 519, 768, 440, -378, -193, 570, 789, 627, 23, 3, 226, 773, 509, 153, -180, 293, 117, -109, 13, 225, -53, -694, -744, -350, 200, -24, -941, -1046, -2, 511, -450, -1410, -1468, -168, 430, -92, -1115, -777, -234, 709, 195, -1081, -901, -38, 561, 210, -39, -371, 28, 120, 162, 130, 347, 227, -133, 34, 201, 481, 75, -604, -420, 484, 621, -210, -636, -1134, 174, 671, -7, -862, -1108, -268, 847, 425, -968, -929, 132, 376, 403, -127, -309, 43, 420, 90, 157, -75, 380, 230, 349, 220, 593, 541, -88, 72, 716, 1125, 590, 73, -123, 784, 988, 721, 84, -151, 536, 1132, 789, -235, -267, 404, 867, 1057, 131, -291, 473, 998, 861, 195, -38, 557, 722, 884, 837, 566, 523, 773, 856, 632, 997, 939, 668, 518, 951, 1227, 903, 627, 509, 581, 1193, 1141, -172, 99, 336, 1048, 896, 130, -281, 111, 638, 847, -6]
2459fp74L86O12L15p20n02Q7O68K06k38l43k36L49Q6K40m27K64on6J31J64K25
2481D25l66n00L92M02q6J15r00J14O33N09o70p96M32K27P02o26m89j86O95N42
2501E69o76o80Q6M35N50k79o19J20m2M58j22j90K4M48l91j9M9M88j89l76j38O97
2523B03L66k35r31J4Q27O62m66j013j4R04P30o07q14O5N72O50k08j106K40P22
2543E61K43m95o88M03J53K54l32k22N17k4k25l13M25L72n8o74k71R98P8m6r61
2564c05j99J028K74J17j083k64J064O56n13j028J14O03L47m2q28k51O98O30j030
2583a2l41M42J50j02r7n58M23L64q50J2L66M40r0p74n0J98P98j58q51n37Q97R84
2605F54k81p90l76M06R80k85l86k40J96L63J47p68j22K80N36j35l49n4P7k8j91
$$ y = [-6, -780, -394, 218, 533, -187, -689, -602, 66, 272, 34, -309, -545, -196, -110, 130, -297, -33, -39, -95, 36, 200, 425, 59, -441, -49, 353, 267, 382, -518, -404, 229, 738, 68, -728, -296, -69, 633, 7, -482, -668, 27, 569, -107, -787, -701, -266, 284, 5, -614, -494, -536, -78, -200, -390, -366, 82, -309, -328, -279, 209, 20, -356, -494, 203, 569, 334, -597, -583, 244, 906, 440, -573, -587, 317, 1047, 440, -374, -309, 263, 913, 705, -401, -161, 561, 804, 309, -379, 24, 177, 431, 99, -123, 394, 370, 145, -168, 257, 629, 571, -103, -374, 624, 702, 656, -305, -504, 524, 798, 915, -168, -432, 632, 1288, 775, -253, -139, 464, 811, 769, -59, -310, 388, 1018, -12, -353, 89, 239, 137, 40, -518, -95, 269, -581, -569, -203, 237, 147, -627, -677, -479, 319, 161, -690, -1227, -330, 654, 373, -417, -793, -387, 593, 308, -78, -318, -122, 241, 388, -380, -502, -222, 314, 179, -170, -224, -147, -175, -366]
2626c66K4J72L38k84o87M14L05K11k99q09O03K05K07q49o0K64P27K74q06m21K35
2647f02Q89K62n14p67J77P37n9r0q24O03M42k5j9j91j04J12K69m93J87J87K0m41
2669b44j4M2N65l39m83o1O63O27o70o84o8Q19N07q00l97K33K60O04m19o61K16
2690c04N41M22n74l47O4L91L74m27K40l00K18J26j47n17K86N05n53k41N72l2j4
2711B83l64l59N54L94n06k70l96M04J036l12j076j98Q25N19m21o21J7K76N10j21
2731A74n55q6O59J67n3p42K83O4K89r0l63P09l67M0K5k36O37p2n03k23K40M46
2753D43rp70m10R13K18L86r93o93N82M82L69j026n72R20Q03k54q35j19N41K47
2773B23k45o5j76L5K52k95j70L84N38n18j13J63K00M38p28l22J40O23J37p69j19
$$ y = [-366, -342, -170, 168, -116, -803, -389, -84, 127, -172, -981, -378, -173, 34, -815, -875, -611, 116, 390, -416, -837, -602, 287, 549, 35, -732, -555, 182, 123, 33, -791, -188, 254, 229, 210, 19, -85, 27, 296, -197, -10, 177, 197, -244, -258, -216, 349, 10, -473, -534, 129, 756, 86, -598, -666, 153, 660, -140, -537, -304, -44, 560, 141, -520, -304, 237, 659, 85, -262, -198, 193, 567, 140, 380, 80, 298, 424, 277, -240, 46, 551, -2, -243, 329, 297, 283, -81, -440, 114, 508, 2, -268, -664, -260, 776, 464, -612, -810, 15, 534, 113, -508, -491, -215, 295, 174, -381, -467, 192, 359, 306, -436, -153, -89, 200, 110, -253, 456, 89, 129, 154, -82, 555, 483, -20, -243, -3, 443, 434, -336, -746, 167, 385, 771, -222, -915, -333, 149, 518, -508, -1080, -160, 643, 389, -446, -565, -24, 223, -22, -87, -263, -228, 24, -271, -441, -57, 481, -37, -150, 13, 213, 651, -77, -399, -259, 364, 501, -268, -387]
2794c87K44N90K6o49n70N52R95l14o84m87M79j4M24n36m30M17K53j70J44m7j12
2815b76M45m28J61jM28l99l88K29L91L00k71o07M01L89J73q10k60J45P37J28q46
2836c59nk31J091m2l80o29K95K28k17J07k81q8K10k5j36o8M42L7j93k03K83K95
2858A31L39p75k10O51J69k90j01m24M66O02l56p12J04M49N30m26k23k34O43J8
2878C51k39p29L99M74L34m36m13KM05Q7n59K7J47L59j57p5p6P9J41J00l84J82
2900A9L95j81j57m40K53O47r6m64n48P89K46K1m31l69K21O52l45q78K03P53L28
2921F18j83o45O7K48J03k76k1J7j33K34k47j24J69q4J88k21J48K43j23l70k65
2942f57N41K06L5m71l05J96P66q0k92o72L98L54Q8m18j28pP13j62n31K59N7J4
$$ y = [-387, -143, 447, 473, -176, -746, -194, 801, 487, -197, -684, -205, -219, 205, -331, -761, -344, -91, -261, -117, -164, -276, 169, -259, -98, -99, 329, -70, -458, -229, 162, 462, 191, -416, -15, 374, 547, -263, -523, -378, 359, 487, -359, -364, -595, 496, 454, 74, -555, -260, -32, -249, -142, -423, -511, -301, -326, -462, -530, -88, -51, -244, -447, -164, 131, 470, -305, -515, 136, 305, 15, -86, -510, -44, 558, 202, -510, -406, 43, 573, 147, -76, -310, 333, 351, 112, -617, -218, 256, 590, 154, -259, -257, 148, 235, -324, -297, -150, 209, 52, -23, -99, -20, 121, 221, -163, 19, 414, 233, 76, -364, -111, 536, 440, -24, -572, 217, 463, 484, 53, -316, -95, 557, 212, -666, -463, 290, 618, 435, -210, -143, 105, 208, -68, -89, -72, -205, 29, -218, -342, -173, -257, -69, -290, -142, 101, -22, -392, -657, -116, 90, 125, -346, -651, -455, 311, 231, -61, -733, -335, 19, 107, -311, -439, -446, 267, 105, -426, -167, -110, -96]
2964i6k66r7j54P28k35k65n2L6K12O3k31k75M78R8o61j9L14K87P5k25k34J38K38
2987a43L69l51k96j80P08J30m45k02K00J65N6j45k38L1K27L62o47N48l12P3q7
3008a77k35J56L89m56K2k31K15N38k22k10k43N62J86k17m74mN07J74j67n78r5
3029e60N52O70o72k59J14J20K21m9J25o42N86j98J1o3L22l84L86m51L46N1k36
3050a0J35n0k44M72k25n18J75k7M11k81kr2K93K22l75J93m70R7K50o4m0j49J88
3073a11M38k97l40j40K89K99k22J48j05LK25o8M4j57O7j84L41j72K84j01m11K
3095a68j82P29K2p50j52J99J20J71k24k64K32M63j19j10m15j13L48PL0k65L00
3116a41J61l03O9j84J91k10P69m08J43k23Q3j90L31l4K01j74j64J68J15K10l42
$$ y = [-96, -362, -459, -613, 115, -120, -385, -437, -401, -189, -126, -357, -632, -154, -56, -717, -736, -422, -135, -60, -285, -519, -381, -143, 226, -125, -421, -601, 107, 237, -208, -410, -210, -45, 11, -134, -372, -341, -114, 248, -399, 149, -163, -90, -177, -412, -256, 133, -323, -301, -532, -317, 221, -1, -211, -454, 108, 294, 77, -397, -401, 106, 280, 113, -465, -560, -8, 662, -10, -269, -155, -35, 186, 137, 262, -380, 206, 8, 19, -44, 278, -106, 280, -171, 175, 226, -10, 125, 75, -169, 303, 78, -440, -265, -292, 119, -162, -164, -256, 37, 259, -116, 77, -393, -296, -46, -110, -150, -299, -111, 327, 30, -310, -450, -161, 138, -84, 64, -41, -38, 187, 119, 163, 6, 73, -111, 230, 58, 342, 241, -170, -168, -350, 379, 401, -349, -501, -302, -182, -11, -235, -499, -267, 196, 77, -33, -448, -561, -213, -206, -176, -441, -141, 20, -283, -214, -398, -207, -417, 352, -56, 87, -136, -53, -243, 88, 54, 255, 81, -83, 85, 200, 410, 68]
3137F8k39j01L60L15n11k64n9O98K11o84j84K24M39l69O7m2r8L86k94np7K08O3
3160A12r3J06J03j5J41n52K49O96l32j09l64J3L51K82j78o27K88K61l2k88N7j16
3182d7M36j14N8rj62J97j41j24j43N2R5K28m29L81l55L59m21J9M5J57q7P8j63
3205i0J99J82nk96k32M73Q9J80o89K44kL32k90n81M97M40k63k00O1q1K06j45k12
3228a83m1J04l54O00J78p12L02L5J20o82N25Q9j37K56k09J27pJ19K4k62L00J09
3250C01j98j10j8l9J94J19l21J21l9O1p1j54k54N96J44k37q9J30%j14r8K52J17
3273B93p47N84k14K36q8n6J64j77K7j50J67j86j78M93k60K30p6r6k06M62J08l37
3295gk9J14J21j2M9n47L56rJ61j05n5l10K70j13K11N1k23n9J18%J8j05K17l13
$$ y = [68, -171, -272, 88, 403, -108, -372, -431, 267, 478, -206, -390, -166, 273, -96, -29, -71, -169, 217, -77, -82, -159, 49, 112, 19, 125, 228, 213, 354, -198, 51, 747, 415, 306, -58, -45, 306, 588, 410, -217, 71, 332, 300, 12, 69, -47, 389, 275, 333, 324, 162, 359, 218, 94, -49, 3, 98, 326, -103, 278, -77, 282, -139, -120, -75, 82, -5, 73, -90, 109, 291, 286, -10, -242, 231, 320, 500, -189, 55, 53, 385, 95, -486, 11, 451, 188, -12, 49, -32, 174, 29, -183, -224, -120, -474, 126, 304, -408, -106, -71, 49, -633, -108, -19, -156, 100, -109, 18, 11, 130, 154, -108, 192, 301, 103, -7, -25, -64, 130, 249, -72, 49, 10, 71, 0, -154, -408, 188, 332, 95, 6, 136, 136, 22, -76, 176, 293, -454, 130, -84, 152, 64, 8, 172, -5, 22, -128, 39, -147, -325, 168, -92, 138, 62, -34, -240, 222, 330, -7, -36, 78, 199, 187, 236, -311, 45, 36, 197, 92, 37, -273, -3, -116, 95, 146, -77, -136, -18, -18, 0, -105, 112, -201]
3319b01K95K62l44J69J29m48M62J65l62J3j59K10N5j71k07j32K52J22J31J30m33
3340f2J73L33l23O3l03J50O3j15M09o55L04l24M49Kj64K14l91M20k99P6j56k87
3362d23M25jq1k17J75N4j29J40P6k62J48J64j26J31j68l0J87PJ51M1j43m9M1J61
3386B72Q0j74j94J61j31J23J62k43J42j23O1k82P9K74k84J15Lq8m51K50K77K12
3408B41j58m1k59J98j31K88J80l64J09m9K17k52r7q8J13N67m18j2J76j53R7J60
3430C24K00n41OM50l61J84k79K31l02K04K14k1j98l15K93J50l23j42j6J31K74
3451A63J81j58k90J46j15L90m6j52l7l83N90j47j05r0K0J20M00l98K0k63K35m5
3473C6n7K05j63J13j52j60M48J00k6j78M5r0J01l57L65l2m42L93m20L16K92o99
$$ y = [-201, 94, 356, 12, 181, 310, -138, 324, 489, 127, 140, -19, 191, 246, 75, -132, -264, -12, 110, 241, 371, -62, 111, 444, 121, 184, -119, 31, 94, -21, 388, -267, 37, -287, 162, 164, 0, 214, -177, 243, -56, 20, -136, -423, 2, 1, -80, -297, -122, -68, -197, -57, 19, -243, -95, 69, -57, 74, -94, -124, 63, 70, 221, 262, 119, 70, 111, 272, 352, 178, -16, 145, 14, 137, 299, 56, 198, 75, 136, -146, -67, 207, -77, 38, 41, -47, -498, -248, 29, 241, 83, 42, -217, -19, -150, 138, 318, -46, 63, 14, 231, -21, -118, -206, -93, 474, 56, 44, 220, 67, 164, 324, 524, -17, -11, 439, 78, 262, -17, 214, -88, 116, 330, 309, 111, -204, 89, 239, -84, -226, -242, -111, 163, 344, 186, -104, 42, -73, 317, 271, 119, 82, -301, 289, 142, 37, -53, -33, 87, 487, 89, 109, -154, 81, 36, -21, 184, 21, 134, -18, -178, 270, 370, 344, 166, 211, 121, 222, -135, 230, 198, -244, 149, -271, 45, 337, -362]
3495c62Q15l38q4N1k45O6K46n8L4L9q2R3J31l28K19q4l58M21k28J6JL17q8M0j84
3520E0l11K60K71J41k88k34J28j17M92n55J38J92L1j29j95%R8K22Q8j78RP1j87
3543cK25l34K93J08r2N3p6J15k45j96J14J72K94o13K49O2l6k3n6J33o3j57k16
3566b92L75K43l87l7P1M46n11KJ47J00p0k82N6K11k07j19K91o5j85J43k56K40
3588h6K01j05j06k0K72J29m67J00J44R0n0P9j39R8n41O51p7l19K66oj85K6M6J19
3612A20m44K31j5p5j18NK52k05L97m25J10N1Q2j47M08l41J19j98M49m23N8K4N5
3635c0o0J34k28m9M59m38K61J53k10K1J75q2J64o9j27q9O2k21P5l3r7M82k71R4
3659G6n6j76j1J98j78J77M07o95J50J51l45J75K20j89O9j08M64n65L74rR4J04
$$ y = [-362, 453, 115, 31, 82, -163, -97, 149, 91, 125, 164, 82, 175, 306, -22, 197, 113, -245, 176, -52, -36, -35, 282, 194, 234, 50, -261, -1, 270, 411, 123, -111, 17, -100, 392, -163, -25, 167, 198, 69, -126, -126, -28, 194, 282, 104, 113, 184, -3, 222, -112, 181, 289, 197, 250, 174, 289, 44, -152, -38, 134, 428, -185, 64, 126, 90, 67, 11, 144, 81, -76, -292, 83, 326, -61, -98, -27, 419, -92, -90, 57, 157, 87, -195, -139, 72, -135, -254, 37, -28, -213, -70, -326, -86, 115, 10, -96, -116, 156, 285, -182, -82, 62, 152, 102, 181, 42, 140, -401, 250, 173, -146, 120, 114, -71, -45, 1, 120, -324, -93, -108, -183, -301, -296, -44, -249, 148, -277, -167, -116, -34, -181, 227, -114, 5, -193, 256, -167, -109, -85, -30, -90, 44, -184, -233, 226, -212, 49, 202, -8, 13, 188, 106, 270, 201, 74, -15, 47, -174, -99, -132, -229, 253, -18, 76, 20, -156, -167, 31, -147, 30, 437, -258, -108, 43, -302, -127, 93, -96, -27, -135, 329, -236, 138, 129, 223, 327]
3681C27m36J25J2j05k47J29L97k27J53m38L80m3m7k78J35J51K85j96k26K14j68
3702a03j2L38m50j60N7J11M28n14K10N4n1P7j80J66j28J44j58K29o1j13K15k8
3724G1l65K01k8P9L5k67M17m24K63k31K49Oj18r8J20J58q2j37L87j75n1J40o7
3747H3j57N3k83J95r6L37L7l30J19Q0J7j09J39M9j60N06o00K81j54K39m24L59
3769A81J35j25J04j4l89J68L85l20k27J79p3P8J0l28M27j7m03K9M52j84k93J48
3791g7j05J39K15j33lj70k19K05K0j16R6J31j19J15L02j27l0j12P8L9O2k68J53
3814G6k13J77j76L87j42j18j9j04J16j10K07l22O6L04l7j38K2O6o7j75K56j05
3836d9q1K13k64L3K92j70j13j22N7K96j74m3J51j64n4J64j48R3j25K57j53J52
$$ y = [327, -109, 16, 28, -77, -324, -195, 202, -25, 128, -310, 70, 27, -20, -298, -163, -12, 273, 77, -149, 65, -103, -115, 223, -227, -387, -330, -219, 209, -305, -95, -41, -92, -15, -195, -29, -157, -13, -171, 58, -3, -116, 99, 71, -294, -93, -121, -42, -7, -274, 143, -281, -18, -249, 0, 6, -112, -210, -90, 68, -14, -151, 236, 61, 10, 150, 83, -74, -21, -304, -109, -205, 132, 169, -161, -42, 38, 55, -54, 85, 134, -26, 480, -120, 161, 7, 246, -178, 181, 316, 191, 295, 281, -108, 60, 445, 125, -102, 77, 4, 82, 92, -236, 191, 174, -229, -200, 252, 68, -225, -77, -182, -43, 172, 39, 36, -134, -353, -148, -128, -244, -148, -17, -136, -21, 281, 154, 124, 12, 90, 129, 191, -77, 76, -137, 40, -136, 251, 109, -9, -28, -132, -16, -126, 81, -241, -175, 129, 92, -46, -24, 42, -25, -200, 56, -49, -130, 83, -181, -148, 144, -26, -139, -261, -204, 92, -82, -125, 26, -138, -192, -28, -176, -83, -208, 49, -104, 48]
3858D8J7k7k05M72n06J18k30M60J45k98l78K11J18O6n0M8o1K77l06k2K33K0j50
3881@K9J6l2Q8m4k1j41M2k14K24l13M61j87L23m07K75j75J81J86r3n21N51m29
3904b01NM64m20J61n5j0j12k0K43J8L7j43k9j96j13K71l25M20o8m3J81r0j66J79
3928a2k79K5M07k49mN3k31O8L76n1l57J91Rj74L03j54J12j56J72p3j68L14j02
3951B0n32M83K45j46M7l79K22j21J41r6J09k91L01J62r1j83M4N1k10K05l21L55
3973A5k70M49k88L88j69j05K7j90P5l24L60M8j04J64J08l77K08l97O6N61l30K21
3995A36l96L16K5m61K24K33j54j33J86J33j08m87M69K7j01M9O8j37L96j97q0j29
4017a21k97P09k55n4M9R3l53L16J6p8p8M5Q9L4l9J3j30K86l80K39l15M25l95J68
$$ y = [48, 65, 38, -167, 305, -201, -83, -313, 147, 292, -6, -384, -173, -55, 11, -39, 9, -52, 225, -81, -103, 130, 150, 0, 29, 45, 13, 101, 57, 36, -105, -63, -277, -53, -366, 95, -92, 231, -176, 99, -76, 105, 291, 198, -323, 228, -201, -196, 268, -152, 9, -46, -56, -168, -188, 55, 73, 110, -33, -62, -258, -371, -100, -425, -5, -73, -116, 65, -25, -191, -12, -291, -266, 141, -108, -112, -59, -290, -222, 154, 103, -254, -63, -54, -228, 75, -79, 33, -123, 49, -24, -192, 122, 20, -512, -29, 216, 70, 117, -262, -40, -161, -20, -116, -7, -298, 3, 165, 74, -109, -65, -14, -224, -19, -340, 15, -255, 194, -94, 294, 125, 20, 47, -143, -68, -392, -32, 16, -88, 76, 184, -193, 15, -382, -316, 245, -85, 136, -260, 56, 81, -380, -156, 77, -77, -210, -24, 109, 1, -486, -17, 10, -91, -42, 26, -111, 285, 88, 8, -121, -418, 291, 36, -18, 31, 124, -229, 87, 103, 25, -53, -8, 81, 115, 76, 89, -41, 245, -135, 104, -211, 214, -181, -13]
4041a3M8m6j40j35R6K42P0k43J08k89K23K89j80q1j73K02Pk80J2K60j53J41J00
4064F5l26K54J59j95L0MJ02j56j70j5J92k13J86L50p47L22K30m97K21P9n9j77
4086c61J91l1J30K9P4j61K95n52N21q5o8L1j00K53R7r6Q6o22J53m7L46j48j70
4109b35L92l30L06m47J13L76k53J3J05J48j05K43n14K6J23M0l6j7j81J81K2k8
4131e8k21J41N4J49j82k09m4K13J41J26j44k19K41n1l0j88J75R2j69J37j35K79
4153I8q4r3NJ08J23k41m4n9o0J21k28K88o7J50o9K55k30Q9j34J17l70L27J15r1
4177B6o9M2k0l01K61K11j55K34r1l4j16L6j60pL53j93j57K14K70m40q1L46o6J21
4201B24k81J4mk4K10j52O5r1k0M2KJQ9J02j96J75j70k68K22k21M14Jj00j2k8j59
$$ y = [-13, 35, -11, -151, -286, -190, 52, 122, -121, -13, -302, -79, 210, 30, -51, -224, -22, -15, -295, -283, -23, -176, -35, 65, -261, -7, 152, -43, -13, -9, 93, -63, -233, -248, -56, -269, -83, 267, -480, -158, 72, -425, -204, -125, -184, -361, -170, -201, -71, -42, 32, -129, 166, -386, 135, 50, -18, 13, -87, 166, 263, 167, 253, -369, -216, -263, 83, -65, -235, 157, -173, 133, -314, -201, 175, -78, -65, 40, 188, 83, 326, -188, -162, -39, 1, -35, -52, -233, -52, -30, -58, -279, -138, -84, 65, -117, -326, -370, -157, -16, 110, -34, -253, -12, -63, -93, -281, -106, -14, -183, -46, -181, 98, 14, -79, -74, 34, 157, -84, -128, -187, -247, -126, -354, -66, -133, 17, -52, 203, -27, 62, -72, 45, -325, 2, 117, 26, -43, -1, -21, -322, -61, 150, -5, 229, 138, 104, -12, 24, -136, -143, 210, 17, -140, 74, 344, -96, -177, 169, 103, 224, -57, -43, -47, -71, 139, -13, 52, -39, -59, -17, -15, -14, 75, 177, -19, 156, -14, -282, -60, -281, 133, 134, 34, 22, -6, -165]
4227a65R2J39J82l86L31j34J11l65L36l34J56L42m01J64Qj15K61j76J74k38J0
4248hK27l59K55K9nl86L65j3q8K0L0J00J1j67L2K07n08L07kJ49k53K91l08K08
4272A34j63L9J0M66m80L05k15n0rJ40Q5m43L08o3N1K39l69o6L16l6k25J4k20K03
4296b9L45o30J86k27M24k28p8M09k07K46K9j12o9j4K56p1k46J05m0J0o8O9P5J89
4320C24n10K20J50N5l10m4L21l5N5j53jM9m89J68K8M18j26O3k33j45K63k43K17
4343D2J1joj37%R5J11n03J12P9J79k44M40l16N8J88l65M67n64L61j60q1L08L5
4367A09K74k68j51K02qK9k22o5J05j57P4J19k27M24n2j24l7q9j09o1Q0Q3L3K30
4391A92j10L7j57j11M77o16R0J44J67k07m5o1L8L1J49m0J73qr0K0l7J07j44k44
$$ y = [-165, -73, 66, 248, -138, 193, 59, 170, -195, 141, -193, -37, 305, -96, 68, 76, -39, 222, 46, 220, -18, -8, 219, -140, 115, 144, 139, -247, 118, 105, 17, 37, 67, 167, 178, 11, 43, 250, -258, 49, 47, 196, -57, 234, -74, 134, -29, 10, 20, 486, 6, 311, 96, 46, 37, 177, 262, -181, 127, 64, 115, 354, -15, -81, 235, 199, -26, -12, -232, -29, 316, -314, -128, -355, 69, -159, -237, 172, -35, 211, 240, 128, 59, 45, 301, 230, -16, 89, 49, 59, -9, 60, 135, 324, -186, 34, 184, 239, -71, -115, 206, 171, 226, 73, 72, 121, -368, -200, -172, 246, 120, 183, -50, -195, 68, -175, 42, 53, 52, 46, -91, -91, 4, 115, -388, -276, -197, -18, -262, 178, -138, -80, 108, -257, 210, -354, 7, -153, -234, 74, 109, 383, 115, -36, 166, 158, 187, -35, -100, 5, -152, -78, 41, -186, 238, 186, 62, 25, -64, -173, -234, -154, -71, -38, 192, 82, 119, -38, -149, 328, -288, -198, -54, 113, -94, -139, -200, -162, -131, 18, -22, 151, 143, 53, 73, 36, 143, -1, -245]
4415b45N03k16q9L51m8j97k5K70k26q2L06k32k90Q3J41j74J79j62K53K81j62k81
4437f2Q2N3J4j02k12K9L68r3M4m27N58N8j67l5K16j31k19k00L52k22R4l31L36
4460CL27%m12J77j54j99K17J37j96K84n23L45J13j22OKK8j63M02j70K6J7l14J70
4484Al4K64k08K76l32M6j8Q3J02K6n26J16M67k22J6O6k04J93J52r9l06J8P8j4
4508e9L5r3j3Q6j09O4K18k86K11j5j66n0L35l9j83L35k30j79j4L88j77k50J98
4531GJ18j63M2Q3J69j39n6L71l79K00k7k46J41%%O4k10p1M6n6K66k82L45k62r4
4556a33J40K36j94j54K00J24j0NN8j08l08j25K20K49l27L40l08R7K01j68j57O7
4578e5L5J30j42J52K7k1m26L78N1k52R6j33q7m8L65j86J76K32l73k11l9J66J67
$$ y = [-245, 258, 42, -47, 304, 256, 59, 34, 304, 78, -4, 302, 70, -220, -137, 4, -170, 9, -153, 100, 381, 219, -62, 20, 73, 87, -15, -227, -198, 170, 77, 121, -306, 252, 310, 143, 108, 324, 193, -26, -226, 126, -96, -2, -333, 3, 330, 330, -82, 95, -59, -258, -41, 96, -100, 184, -339, 6, 119, -3, 3, 5, 33, -130, 272, 102, 128, 145, -169, 1, -33, 231, 23, 299, -33, 13, -5, 78, 180, 206, -320, -204, 263, 41, 57, 123, -81, 112, 264, 165, -141, -123, -45, -59, -24, -117, -130, -44, -153, -89, 129, -157, 54, 39, -127, -177, 158, 119, -64, 271, 41, -138, -152, 236, 59, -191, 7, 125, -38, 4, 87, 256, 117, 61, 432, 53, 253, 226, -20, 121, 121, 121, 185, -25, -96, -50, -106, 160, -122, 223, -39, -133, 7, 243, 49, -105, 95, 219, 209, 214, 272, 164, -144, -269, -49, 200, -127, 213, -95, 2, 203, 35, -122, -55, -20, 110, -32, 120, 147, 126, -300, 78, 129, -123, -27, -160, -247, -295, 70, -116, 60, 292, -81, -292, -331, -165, 2]
4601Bj92M25q8K14l05k35Q2K10m12K20J90J7j17R6r1J1l8L45O0m11R2r5J86Q9
4625B55j42l5k1K18k49J9k31J90R1j44j09L15l38R5K01l4J65K1j77k15J16J33
4647A24R8l85K16k70K68%k47M51l94R1J83l86J09K77k80J39l0k17M66j94j3n2
4669d6N8r2M1P1j5k47K34k14L39jl46P6l72L89K2M2k40K83N6o7k01Q3J20K08l01
4694a20j86L65n0j32J21kj16J63J79k61R9Q8l16K61Jj38l15N13l47R0K27o7O1
4717A18l4k47J7k1K99J61k99j38k7L08j07j84k14L60M5k24N2K01j17J30p5l6K62
4740B30Mq2k00R8l2O4K74m55K09j66M18n05J64j44j3j50K04o0J80O9l04K02L9
4763D4K8k89K89j61m3L10j72j97J86K56Kk82l4J59j49J12l7j04K60K39k39j78
$$ y = [2, -190, 235, 147, 361, 56, -179, -97, 113, -299, -79, 111, 128, 11, 107, 16, 27, -11, 334, 394, -17, 75, -20, 166, 255, 113, 78, 57, 275, 26, 45, -186, 4, 95, -49, -158, 157, -181, -86, 115, 81, 246, 267, 90, -125, -9, 124, 222, -163, 53, -217, 51, 51, -196, 255, -139, -48, 135, -251, -142, 135, -145, -6, -36, -253, 213, 19, 6, -46, 12, -80, -39, 32, 17, -230, 4, -210, 129, 128, -218, -142, -514, -125, -103, -61, -301, -18, 38, -29, -230, -147, -27, 181, -120, -306, 59, 9, -123, -2, -4, -120, 43, 222, -39, 60, 148, -168, 93, 94, -44, -359, 154, -193, -103, 124, 57, 118, 84, -163, -146, -167, 132, 293, -6, -144, -171, 137, 30, -154, -368, -8, 37, -187, -135, 66, -51, 79, 4, -32, 230, 234, 152, -48, 50, 18, 82, 356, -99, 110, -56, 362, -143, 21, -123, -136, -286, -82, -142, 38, 107, -197, 5, 44, 72, -217, 72, -89, -132, 178, 6, -191, -5, 251, 253, -29, -63, 96, -53, 59, 22, -82, 178, 417, 178, 0]
4785@r4k21K49J56R7n6l96K12K52P5n00L99m10J86j10N8R4J48J33o0l96K94j56
4808d6K07j09j66P7L3J36k16J68k92L75k35o7K32Q9j25qm0k2J75l14q6K31j07
4831a10J68q6j61O02j33l92K33l76L95k27R2J51j42J94k84J50j1K37l16J58k57
4852a15J74k30J95J40o3j08J35k72J57j01j09N28m77R2j92J67L48m81K43K08m7
4873A92J01j21l64q5M05j4l66K30j50N3L82m61N51k70%j52Q2k00rM85o26L63n2
4896b6l5j9k5J84j99R3K03j20L1k92M24l91L11j01j33O0o8K42j01j23l0l28K24
4919b19q6L38O9p6m2j08l3K80k25N89k37m8J5k53L12l19j88M33m79J18L04l08
4941a63J93j49K09N1k36O8L6J03j96R8l2k72K96k14J58J60j08K96l15j72KM78
$$ y = [0, -94, -315, -66, 90, 187, 131, -265, -53, 199, 274, -226, 173, -237, -51, -161, -103, -9, 139, 272, 212, -184, 110, -46, 161, 52, -114, -37, -4, 132, -84, 84, -208, 167, -68, -135, 97, 186, 61, 53, 13, -9, 166, -148, -234, -3, -110, 58, -28, -189, 413, 280, -112, 121, -255, 140, -87, 5, 156, 14, 208, -76, 74, 63, 300, -16, 142, -115, 59, -171, 24, 164, 101, -7, 128, -144, 13, -88, -197, 331, -146, -54, -246, -79, 269, -212, 31, 239, 192, 293, 172, -192, -277, 128, 114, -252, -22, -172, -119, 263, -198, 353, 83, 83, -69, 13, -187, -196, 289, -337, 26, -26, -61, -80, -105, 79, -120, -27, 176, 56, 87, -205, 219, -172, 139, 38, -95, -35, -103, 139, 38, -85, -115, -443, -219, -305, 33, 102, 26, -16, -124, -157, 123, -102, 487, 250, 202, 217, -36, 276, -43, -231, 202, -277, -159, 145, -163, 30, -119, 90, 141, -95, -27, 9, 112, -84, 14, -18, -290, 6, -208, -50, 110, 2, 298, -17, -189, -187, 291]
4963B91k54l0q5k48K64O8L17l85J50j85P1M7O8j33N1k1M1j94K63j74J7J13J88
4986B40m75J55J67j90oL44k61O2j11L6ql06K57j39J92P8L0o7L6M5j82L43j53J2
5010I9k83L8J25J24j81K07k91K75J4l8n0J91k74J79j74%N1J51k62K06j00j05J45
5033D7k00J71ql62QJ40K8J61K93n38L78k75L01j91O3l95L53O4O6n3k7J64l00K45
5057A33m16K78P7K02n06N45o65L26M9m7J39k77JK89j43r3M9J18N3n84K26L74R
5080A37J10l30K33k68L53k94j06J62M09q5o48L11j94L37Q4m2k8rQ2k88J90Q7l12
5103a09L29p9k54q9M7P8M6l2r5K87q1O5j02J86r7j06o2j67K10P5n1k1L8J93k3
5128A86j36l15K23J84j79J10k18J74o8j24J63j09K4N2K14j32k74J25O0J98n9k30
$$ y = [291, 37, 7, -78, -326, -62, 6, 323, -62, 88, -97, -26, 21, 89, -44, 7, -14, 27, -167, 96, -78, -61, 52, 240, -235, -80, 87, -103, -109, 235, -26, 36, -75, -39, -47, -353, -96, -235, -43, 35, 65, -2, 34, 79, -103, 240, 87, 99, -184, -146, -21, 103, -78, 129, -162, 113, 127, 89, 39, 230, -44, 135, -39, -39, 12, 163, -99, 107, 7, -98, 47, -153, 18, 10, -352, -344, -204, -176, -15, 278, -260, 118, -157, 144, -47, 16, -379, -26, 38, 104, 51, 24, 188, -112, 133, -283, -5, 72, 274, -232, 313, -352, -26, 23, -24, 115, -162, -161, 128, -15, -108, -59, 59, 112, -472, -246, 128, 137, 247, -83, 150, -118, 235, -59, -165, -3, 406, 321, -327, -16, -210, 127, 211, 169, 141, 132, 214, -74, 116, 203, -109, 220, 141, -113, -202, -155, -77, -31, -63, -158, 129, 48, 113, 11, 197, 100, -6, -68, -235, -25, 50, -1, -22, 16, 209, 186, 50, -265, -42, 142, -37, 73, -145, 29, -39, -163, 0, -109, -85, -33, 181, 49, -225, -100, -40, 158, 99, -131]
5150a31l9K02J81j28mJ02j76j13M24m62J27k17K82P5j29j50R3k88M06J39l27q
5172a41K57k08J13O4k29L10j02J51j96j31j71K97m9P6k90K88p0J67j19q6n0j8
5194a37K9J16P9j93n8O6K29j41j51l9M76k20o7O9k40M37l13J56R5l1n2P2n5N8
5218A85r4Q6k31j82L72o3N0l89K29R8nmj78K0J90L2j61N45m47J69m74L69j6k38
5242a37J59M3o5L0K5j46R8k58N82l57k48rK98L6M8j70L3J42j08n6O9rRL18k08
5267A19m72L31k7LQ2Mj73P4N0K89j93lJ13L1p2l23J33J95j50M6j31o2L0L3%k35
5293c08J37J09J25p9r5j27K04J31j05M6N8q6n2k59K95j34R4J43l54L94K2k39P1
5316iJ73l59K54n8l04kL44m06M08j24K40k56K30m44R0J63K39l65M0L40k56K18
$$ y = [-131, -170, 32, 213, 85, 81, 183, 7, -106, 318, -144, -17, -234, 48, 123, -6, -156, -63, -351, 55, 194, -133, -141, 116, -92, 21, 85, -144, 166, 64, 215, 19, -112, -283, 14, -35, 41, -249, 39, -31, 136, 17, -69, -119, -137, -108, 8, 87, -106, -164, -98, 131, -10, -161, -200, 276, 56, -11, 58, -182, 255, -58, 98, 193, 162, 110, 182, 127, 185, 91, 177, -54, -236, 136, 73, 123, -266, -37, 61, 56, 52, -126, -106, 84, 116, -45, 500, 53, 222, -252, 117, 101, -137, 22, 65, 0, 30, 55, -91, 7, -251, 331, -26, -274, -283, 15, 51, 99, -71, -38, 104, -4, -60, 9, 0, 9, 327, 119, -353, -22, -49, -46, 36, 40, -133, -59, -9, 280, 87, 84, 197, 228, 156, -167, -34, 161, 11, 57, -74, -136, -106, -73, -73, -308, -171, -62, 63, -16, -111, -238, -34, 97, -8, 38, 96, 10, -42, -301, -6, -140, -46, 97, -257, 137, 159, -80, -9, 164, -195, 59, 1, -303, -305, 39, -367, 41, -83, 157, -99, 131, -313, -223, -60, 179, -186, -146, 194, -62, 156]
5338A56m61J54Q3K41L9l76K43k02J23k96M91k6j75J69j89qJ22L6q3k22j50M75
5360A44k91L01o8k51K46k03J08j38Q6K52p2J95l74K2l00J93q2P7J76L39l63J4
5382A1j03o6L42Qk79K51k29j84N01j22N0q4j78K85m54L10L85o36K77q0j4R2l9
5405D4K4L1j54M60k85l4l79K53r6J45k03o8M3j60L08j6L95j54N2l25L9j08L97
5428B09l66j30M32l32J05L8j49K85j62n2J70m00J94R3J54J6K45l14j62J51o0j39
5450a74J50K4k17L43j48j52L19o00K90Q9j19Q0k23M35k74L31k09L9J7j16K30l53
5472b38L19j96J07L9j07K54k86LJ55P8k27J55j16L47l64m8R8L49m88PpK00p7J89
$$ y = [156, -305, -151, -68, 173, 212, -164, 79, -123, 0, -296, 195, 169, -6, 163, -26, -34, 88, 124, 41, -181, -331, 144, -147, 154, 86, -165, 81, -122, -14, -152, -66, 186, 114, 309, -65, -43, -343, -150, -232, -155, 21, 360, -3, 11, -92, -158, 184, 192, -87, 164, -65, -249, 252, 130, 180, 96, -82, 203, -251, 59, 444, -192, 85, 5, -9, 83, 44, 68, 99, -55, 405, 120, 86, -293, -40, -136, 9, -194, -262, -219, -379, -71, -87, 308, 154, 206, -119, -80, -188, 209, -157, -287, 145, -187, -82, -44, -193, 92, -70, -122, 48, -352, -158, -65, 89, 105, 350, 36, -126, 25, -35, -174, -24, 0, -217, 126, -22, -174, 145, -455, -165, -76, -195, -115, -338, 97, -177, 154, -55, -16, 1, -115, 115, -238, 81, -115, -8, 31, -76, 178, -108, -105, 50, 128, -99, 56, -60, 287, -77, -125, -27, 322, -166, -159, -166, 34, -43, 146]
$$ [...]
8191A95
##END NTUPLES=NMR FID
##END=
