##TITLE=1H_K-349/1-1
 DMSO-d6, 8 sc, 
 25.6.2019
##JCAMPDX= 6.0         $$ Bruker NMR JCAMP-DX V2.0
##DATA TYPE= NMR FID
##DATA CLASS= NTUPLES
##ORIGIN= UXNMR, Bruker Analytische Messtechnik GmbH
##OWNER= root
$$ XWIN-NMR		Version 3.5
$$ Tue Jun 25 14:51:25 2019 Russian Standard Time (UT+4h)  she@DPX200
##.OBSERVE FREQUENCY= 200.13155
##.OBSERVE NUCLEUS= ^1H
##.DELAY= (6, 6)
##.ACQUISITION MODE= SIMULTANEOUS
##.ACQUISITION SCHEME= undefined
##.AVERAGES= 8
##.DIGITISER RES= 18
##SPECTROMETER/DATA SYSTEM= spect
##.PULSE SEQUENCE= zg30
##.SOLVENT NAME= DMSO
##.SHIFT REFERENCE= (INTERNAL, DMSO, 0, 15.7039)
##AUDIT TRAIL= $$ (NUMBER, WHEN, WHO, WHERE, WHAT)
$$ ##TITLE= Audit trail, XWIN-NMR		Version 3.5
$$ ##JCAMPDX= 5.01
$$ ##ORIGIN= Bruker BioSpin GmbH
$$ ##OWNER= she
$$ F:/spectra/data/she/nmr/H-F/1/audita.txt
$$ ##AUDIT TRAIL=  $$ (NUMBER, WHEN, WHO, WHERE, WHAT)
(   1,<2019-06-25 14:50:25.20 +0400>,<she>,<DPX200>,
      <created by zg, POWCHK disabled, PULCHK disabled
       configuration hash MD5:
       00 E9 B6 7A A2 85 ED C7 34 08 36 98 17 FE 4E 26
       data hash MD5: 16K
       FF CB FF FB 57 0C 55 E7 C8 A7 86 1E B3 22 66 FF>)
$$ ##END=
$$ 
$$ hash MD5
$$ D2 F3 D9 6A 28 1E 3B 4B 60 12 9A 19 C6 E2 ED 2E
##$RELAX= 
##$RELAX= 
##$RELAX= 
##$RELAX= 
##$RELAX= 
##$RELAX= 
$$ Bruker specific parameters
$$ --------------------------
##$DU= <F:/spectra>
##$EXPNO= 1
##$NAME= <H-F>
##$PROCNO= 1
##$TYPE= <nmr>
##$USER= <she>
##$AMP= (0..31)
100 100 100 100 100 100 100 100 100 100 100 100 100 100 100 100 100 100 
100 100 100 100 100 100 100 100 100 100 100 100 100 100 
##$AQSEQ= 0
##$AQ_mod= 1
##$AUNM= <au_zg>
##$AUTOPOS= <>
##$BF1= 200.13
##$BF2= 200.13
##$BF3= 200.13
##$BF4= 200.13
##$BF5= 200.13
##$BF6= 200.13
##$BF7= 200.13
##$BF8= 200.13
##$BYTORDA= 1
##$CFDGTYP= 0
##$CFRGTYP= 5
##$CHEMSTR= <none>
##$CNST= (0..31)
1 1 145 1 1 1 1 1 1 1 1 1 1 1 1 1 1 1 1 1 1 1 1 1 1 1 1 1 1 1 1 1 
##$CPDPRG= <>
##$CPDPRG1= <>
##$CPDPRG2= <>
##$CPDPRG3= <>
##$CPDPRG4= <mlev>
##$CPDPRG5= <mlev>
##$CPDPRG6= <mlev>
##$CPDPRG7= <mlev>
##$CPDPRG8= <mlev>
##$CPDPRGB= <>
##$CPDPRGT= <>
##$D= (0..31)
0 1.2 0 0 0 0 0 0 0 0 0 0.03 0 0 0 0 0 0 0 0 0 0 0 0 0 0 0 0 0 0 0 0 
##$DATE= 1561459824
##$DBL= (0..7)
120 120 120 120 120 120 120 120 
##$DBP= (0..7)
150 150 150 150 150 150 150 150 
##$DBP07= 0
##$DBPNAM0= <>
##$DBPNAM1= <>
##$DBPNAM2= <>
##$DBPNAM3= <>
##$DBPNAM4= <>
##$DBPNAM5= <>
##$DBPNAM6= <>
##$DBPNAM7= <>
##$DBPOAL= (0..7)
0.5 0.5 0.5 0.5 0.5 0.5 0.5 0.5 
##$DBPOFFS= (0..7)
0 0 0 0 0 0 0 0 
##$DE= 6
##$DECBNUC= <off>
##$DECIM= 24
##$DECNUC= <off>
##$DECSTAT= 4
##$DIGMOD= 1
##$DIGTYP= 9
##$DL= (0..7)
0 120 120 120 120 120 120 120 
##$DP= (0..7)
150 150 150 150 150 150 150 150 
##$DP07= 0
##$DPNAME0= <>
##$DPNAME1= <>
##$DPNAME2= <>
##$DPNAME3= <>
##$DPNAME4= <>
##$DPNAME5= <>
##$DPNAME6= <>
##$DPNAME7= <>
##$DPOAL= (0..7)
0.5 0.5 0.5 0.5 0.5 0.5 0.5 0.5 
##$DPOFFS= (0..7)
0 0 0 0 0 0 0 0 
##$DQDMODE= 0
##$DR= 18
##$DS= 0
##$DSLIST= <SSSSSSSSSSSSSSS>
##$DSPFIRM= 0
$$ [...]
##$SUBNAM2= <"">
##$SUBNAM3= <"">
##$SUBNAM4= <"">
##$SUBNAM5= <"">
##$SUBNAM6= <"">
##$SUBNAM7= <"">
##$SUBNAM8= <"">
##$SUBNAM9= <"">
##$SW= 24.9336996594482
##$SWIBOX= (0..15)
0 0 2 0 0 0 0 0 0 0 0 0 0 0 0 0 
##$SW_h= 4990.01996007984
##$TD= 16384
##$TD0= 1
##$TE= 0
##$TE2= 300
##$TE3= 300
##$TEG= 300
##$TL= (0..7)
0 120 120 120 120 120 120 120 
##$TP= (0..7)
150 150 150 150 150 150 150 150 
##$TP07= 0
##$TPNAME0= <>
##$TPNAME1= <>
##$TPNAME2= <>
##$TPNAME3= <>
##$TPNAME4= <>
##$TPNAME5= <>
##$TPNAME6= <>
##$TPNAME7= <>
##$TPOAL= (0..7)
0.5 0.5 0.5 0.5 0.5 0.5 0.5 0.5 
##$TPOFFS= (0..7)
0 0 0 0 0 0 0 0 
##$TUNHIN= 0
##$TUNHOUT= 0
##$TUNXOUT= 0
##$USERA1= <user>
##$USERA2= <user>
##$USERA3= <user>
##$USERA4= <user>
##$USERA5= <user>
##$V9= 5
##$VALIST= <valist>
##$VCLIST= <CCCCCCCCCCCCCCC>
##$VD= 0
##$VDLIST= <DDDDDDDDDDDDDDD>
##$VPLIST= <PPPPPPPPPPPPPPP>
##$VTLIST= <TTTTTTTTTTTTTTT>
##$WBST= 1024
##$WBSW= 4
##$XGAIN= (0..3)
0 0 0 0 
##$XL= 0
##$YL= 0
##$YMAX_a= 200855
##$YMIN_a= -187160
##$ZGOPTNS= <>
##$ZL1= 120
##$ZL2= 120
##$ZL3= 120
##$ZL4= 120
##$ABSF1= 10
##$ABSF2= 0
##$ABSG= 5
##$ABSL= 3
##$ALPHA= 0
##$AQORDER= 0
##$ASSFAC= 0
##$ASSFACI= 0
##$ASSFACX= 0
##$ASSWID= 0
##$AUNMP= <proc_1d>
##$AZFE= 0.1
##$AZFW= 0.1
##$BCFW= 1
##$BC_mod= 2
##$BYTORDP= 1
##$COROFFS= 0
##$CY= 11.3945322036743
##$DATMOD= 1
##$DC= 2
##$DFILT= <>
##$DTYPP= 0
##$F1P= 18.9103706918063
##$F2P= -1.10871071338519
##$FCOR= 0.5
##$FTSIZE= 0
##$FT_mod= 4
##$GAMMA= 1
##$GB= 0.15
##$INTBC= 1
##$INTSCL= 1
##$ISEN= 128
##$LB= 0.24
##$LEV0= 0
##$LPBIN= 0
##$MAXI= 10000
##$MC2= 0
##$MEAN= 0
##$ME_mod= 0
##$MI= 1.114404
##$NCOEF= 0
##$NC_proc= 0
##$NLEV= 6
##$NOISF1= 3.799351
##$NOISF2= 2.8
##$NSP= 1
##$NTH_PI= 0
##$NZP= 0
##$OFFSET= 15.70392
##$PC= 1
##$PHC0= -8503.659
##$PHC1= 19.00097
##$PH_mod= 1
##$PKNL= yes
##$PPARMOD= 0
##$PSCAL= 0
##$PSIGN= 0
##$REVERSE= no
##$SF= 200.130013532006
##$SI= 16384
##$SIGF1= 3
##$SIGF2= 2
##$SINO= 400
##$SIOLD= 16384
##$SREGLST= <1H.CDCl3>
##$SSB= 0
##$STSI= 0
##$STSR= 0
##$SW_p= 3612.71676300578
##$SYMM= 0
##$S_DEV= 0
##$TDeff= 0
##$TDoff= 0
##$TI= <>
##$TILT= no
##$TM1= 0
##$TM2= 0
##$TOPLEV= 0
##$USERP1= <user>
##$USERP2= <user>
##$USERP3= <user>
##$USERP4= <user>
##$USERP5= <user>
##$WDW= 1
##$XDIM= 8192
##$YMAX_p= 0
##$YMIN_p= 0
$$ End of Bruker specific parameters
$$ ---------------------------------
##NTUPLES= NMR FID
##VAR_NAME=  TIME,          FID/REAL,        FID/IMAG
##SYMBOL=    X,             R,               I
##VAR_TYPE=  INDEPENDENT,   DEPENDENT,       DEPENDENT
##VAR_FORM=  AFFN,          ASDF,            ASDF
##VAR_DIM=   8192,          8192,            8192
##UNITS=     SECONDS,       ARBITRARY UNITS, ARBITRARY UNITS
##FACTOR=    0.0002004,     1,               1
##FIRST=     0,             0,               0
##LAST=      1.6414764,     0,               0
##MIN=       0,             -187160,         0
##MAX=       1.6414764,     200855,          0
$$ Real data points
##PAGE= N=1
##DATA TABLE= (X++(R..R)), XYDATA
0@%%%%%%%qJ6j6J6k4L2l3M1n4O3p4R0j06J23j45J69j94K23k57K95l34L79m31M87
$$ 0 0 0 0 0 0 0 0 -8 8 -8 8 -16 16 -17 24 -30 33 -41 49 -57 66 -79 90 -104 119 -138 157 -177 202 -229 258
31B58n48O16o89P69q59R55j061J178j306J447j601J772j963K175k410K675k977
$$ 258 -290 326 -363 406 -453 502 -559 619 -687 760 -841 931 -1032 1143 -1267 1408 -1569
48a569L321l718M185m739N410o247P322q760J0799j3941J9473l2105J15182J8776
$$ -1569 1752 -1966 2219 -2520 2890 -3357 3965 -4795 6004 -7937 11536 -20569 94613 113389
62A13389j43549Q8694J23077J9244j35273o6367O4841R5844l4081r2132k2358
$$ 113389 -30160 58534 181611 200855 65582 -785 64056 159900 125819 33687 11329
73A1329P2478K5835o3215o1885M0263O8711j7742r7104l4439P8890Q1851m3859
$$ 11329 83807 109642 46427 -15458 24805 93516 75774 -21330 -55769 23121 104972 61113
85F1113j14603k8183J02259Q7967m8982j17571j9224J00558P5693n0497r2138
$$ 61113 -53490 -81673 20586 108553 59571 -58000 -77224 23334 99027 48530 -43608
96d3608m25P8915L4909m8965m5878K6934M5026j3707m7621R8N1216K0853m9115
$$ -43608 -44033 34882 69791 20826 -25052 1882 46908 33201 -14420 -14322 36894 57747 8632
109H632n2426K2490P0255J9686o3713o4562K1985Q0723L1389o2511p1822J3194
$$ 8632 -43794 -21304 48951 68637 4924 -59638 -37653 43070 74459 11948 -59874 -46680
121d6680P7461L4553n0847o1570Q955N5374K0614l5175l1765J1637K4690n165
$$ -46680 30781 65334 14487 -47083 -38128 17246 37860 2685 -29080 -17443 7247 2082
133B082k2804o47K2688M090k9570k5533J7945M1826O119m7748m4198K1432O5784
$$ 2082 -20722 -21369 1319 5409 -24161 -49694 -31749 10077 16196 -31552 -75750 -54318 11466
146A1466K1924n9160o4821K0396Q1210L0980o1552o6256K1796P4409K1406n2954
$$ 11466 33390 -25770 -90591 -70195 11015 41995 -19557 -85813 -64017 10392 31798 -21156
158b1156m3761K6133M8459k542m0317r444L6856K0070l3642l6627K3829N6792
$$ -21156 -64917 -38784 9675 7133 -33184 -42628 -5772 14298 -19344 -55971 -32142 24650
170B4650L138o5247m3480M9107Q0497m238q9951m9282O6619R1844j2261r6526
$$ 24650 27788 -37459 -80939 -31832 48665 44427 -45524 -94806 -28187 63657 51396 -45130
182d5130l8216P3122P6561k6802p8928q668O8963L6034m5404m5926L0172N7098
$$ -45130 -83346 -10224 66337 39535 -39393 -48061 20902 56936 11532 -34394 -4222 52876
194E2876r863o4101j5883O4267M9853m5719q1727J909Q8269M7995o5779r1514
$$ 52876 43013 -21088 -36971 27296 77149 31430 -50297 -48388 39881 87876 22097 -69417
206f9417J1974R7169M1872p3439q1673K4646Q7112J9465o9524m8249M1405N7670
$$ -69417 -57443 39726 81598 8159 -73514 -48868 38244 57709 -11815 -60064 -18659 39011
218C9011j5541n7398k632N6969K2457n0083m4613L6079O6849l592p2669l6887
$$ 39011 23470 -33928 -36560 20409 42866 -7217 -51830 -15751 51098 47506 -25163 -62050
230f2050N4779P0135j4429p9112l4080N6420O4875j6609p1237k5619M9691M7786
$$ -62050 -7271 62864 48435 -30677 -64757 -8337 56538 39929 -31308 -56927 -7236 40550
242D0550k1461n0770m673L9959J7098k9908k2991K4123L0168j4759l8371P63M5094
$$ 40550 19089 -31681 -36354 3605 20703 -9205 -32196 -8073 22095 7336 -31035 -30272 14822
255A4822K4646l2878m4329R414N1619K6283l3675m5473K694M6876K9950k4364
$$ 14822 39468 6590 -37739 -28325 23294 49577 15902 -29571 -26877 19999 49949 25585
267B5585m3471n235L6249K6783j6632l2251l703K3202J2490j4733j4685P335J2479
$$ 25585 -17886 -23121 13128 39911 23279 -8972 -12675 10527 23017 8284 -6401 934 13413
280A3413p846j8116J665K2097Q519k2423k6261P141L3623J5639k6963l7892J970
$$ 13413 5567 -12549 -10884 11213 19732 -2691 -28952 -21811 11812 27451 488 -37404 -35434
293c5434M1717K7196k6413m6142l110M4553L0344k5601m2626J275L9265J8524
$$ -35434 6283 33479 7066 -39076 -42186 2367 32711 7110 -35516 -34241 5024 23548
305B3548k6444k5013J4671K7840m830k7481k046L1151J6582k7346l1244J5070
$$ 23548 -2896 -27909 -13238 14602 9772 -17709 -19755 11396 27978 632 -30612 -15542
317a5542M6268J1607m3135l8496K4099N6866R941n1917m0953K8809N7233L791
$$ -15542 30726 42333 -802 -39298 -15199 41667 51608 -309 -41262 -12453 44780 48571
329D8571n2894l1087L3861M3145j2132m4921o779L8598J8361l3375l0844K2594
$$ 48571 -4323 -35410 -1549 41596 29464 -15457 -22236 16362 34723 1348 -29496 -6902
341f902M1180q420n0413j6203M4959M1299k6154n8543p020N4799L8441l2804n6660
$$ -6902 34278 25858 -24555 -40758 4201 45500 19346 -39197 -46217 8582 47023 14219 -42441
354d2441m14N4252K9350l4743m4807J0360M5526J0785l6331k2337K6411L1017
$$ -42441 -42855 11397 40747 6004 -38803 -28443 17083 27868 -8463 -30800 -4389 26628
366B6628j4943l5925L118M1500J4726l7123l2917K3602M7687K259m6662k7918
$$ 26628 11685 -24240 -21122 20378 35104 -2019 -34936 -11334 36353 38612 -8050 -35968
378c5968L0449M4433l743m2721k1277K6497L3529n786l2612j2152K1201J8714
$$ -35968 -5519 38914 35171 -7550 -28827 -2330 31199 25413 -7199 -19351 1850 20564
390B0564j1004k1087J830J8705K278k0624j0444J7878J8556j1751k8187k571K7789
$$ 20564 9560 -11527 -9697 9008 11286 -9338 -19782 -1904 16652 4901 -23286 -25857 1932
403A932J8303j8102k8820n63K7122J7024j3296k3638l608J8961J5483n160j6283
$$ 1932 20235 2133 -26687 -27250 -128 16896 3600 -20038 -23646 -4685 10798 5638 -10645
416a0645n787J0552J1235j304r492k425O217L740m604l325N999O791n265j1118
$$ -10645 -16432 -5880 5355 4051 -5441 -7866 -1649 2091 -2513 -5838 161 6952 1687 -9431
430i431J10J4202R891r331j7111j737J7365J5403p460k1201p320J6791K0622l777
$$ -9431 -9321 4881 14772 5441 -11670 -13407 3958 19361 11901 -9300 -16620 171 20793 17016
444A7016k3401j0887J6271K0363m849k1766n900J6595J1770j1826j4496O418J6082
$$ 17016 -6385 -17272 -1001 19362 14513 -7253 -13153 3442 15212 3386 -11110 -4692 11390
457A1390k248j9954n010J9694J5772j4947k5754J792K9550J5047k1669k8500N679
$$ 11390 9142 -10812 -15822 3872 19644 4697 -21057 -19265 10285 25332 3663 -24837 -19158
470a9158L2603J4073k3854k6340R021L0305P531k4578j7447J5488K3084o250k4380
$$ -19158 13445 27518 3664 -22676 -13655 16650 24181 -397 -17844 -2356 20728 14478 -9902
483i902k100K3557J1301k1931k1126J4409K9702j784l2470j5245K5432K9487r818
$$ -9902 -12002 11555 22856 925 -20201 -5792 23910 22126 -10344 -25589 -157 29330 19512
496A9512l4451q998K8745K4379j2917k8688k451K6137J5377j5431j9527O545K1479
$$ 19512 -14939 -23937 4808 29187 16270 -12418 -14869 11268 26645 11214 -8313 -1768 19711
509A9711K692j9365q997J6916J6846j1580k3782J872K6204J0322k2570k3566R944
$$ 19711 22403 3038 -5959 10957 27803 16223 -7559 -5687 20517 30839 8269 -15297 -5353
522e353K7647L595k5598j7688J3113K1834j139j9800r276J2214J2448m705j1918
$$ -5353 22294 25889 291 -17397 -4284 17550 16411 -3389 -12665 -451 11997 7292 -4626
535d626p31J1078L491q380o472P680J0618k742j3363l396J2739J1344p710j5898
$$ -4626 -5357 5721 9212 832 -5640 2040 12658 9916 -3447 -6843 5896 17240 9530 -6368
549f368j971J3822Q658q697j3739j035R362M157n268p007j495J974J032o6p74
$$ -6368 -8339 5483 14141 5444 -8295 -9330 32 4189 -1079 -8086 -9581 -7607 -6575 -6641 -7415
564g415j741k393p8K400K335q16j269j41N29J688K077L593L83l088j854M330P219
$$ -7415 -9156 -11549 -11627 -9227 -6892 -7708 -8977 -9118 -8589 -6901 -4824 -1231 -848 -3936 -5790 -1460 5759
581E759J464o187m998L719R364L760p329q689J958J0378M650p998r981K618R748
$$ 5759 7223 1036 -3962 -243 9121 12881 5552 -3137 -1179 9199 13849 5851 -4130 -1512 8236
596H236J989r292n959N682P356n085r363J503J0506J796j2229p930R518J2920
$$ 8236 10225 933 -5026 656 8012 2927 -6436 -4933 5573 7369 -4860 -12790 -3272 9648
610I648m091j6476n449J3463J2690o967j6952k632J4707R582q514j3813J357J3335
$$ 9648 5557 -10919 -16368 -2905 9785 2818 -14134 -16766 -2059 7523 -991 -14804 -13447 -112
624a12N200j0454q360P636J2344k339j2964j300J5370R679j0614j3458O661J9790
$$ -112 5088 -5366 -13726 -6090 6254 3915 -9049 -10349 5021 14700 4086 -9372 -2711 17079
638A7079M778j6617j0807J2074J8261q13j7219n756J3454J1982o376j3454n92
$$ 17079 21857 5240 -5567 6507 24768 23955 6736 980 14434 26416 20040 6586 5994
651E994J1497M484j0177q883N150R785k761j3093m699J0466Q629q522j4404r8
$$ 5994 17491 21975 11798 2915 8065 17850 15089 1996 -2703 7763 16392 7870 -6534 -6632
665f632J3972N988j1515j2296M543J3340J872j1649o995P573Q476l420q851N25
$$ -6632 7340 13328 1813 -10483 -5940 7400 9272 -2377 -9372 -1799 6677 3257 -5594 -5069
679e069P320J903p233m444N059O003l482q103j974O906M851n212p662l13O816
$$ -5069 2251 4154 -3079 -7523 -2464 3539 57 -8046 -10020 -3114 1737 -3475 -11137 -11450 -4634
694d634L349m515n778J064N489K041l498j828L711L346j523j712K830M501j232
$$ -4634 -1285 -5800 -11578 -10514 -5025 -2984 -6482 -8310 -4599 -1253 -2776 -4488 -1658 2843 1611
709A611l556J221N616L291l669l835K345N265J68l580j706K268J758k492j716
$$ 1611 -1945 -724 4892 8183 4514 679 3024 8289 8457 4877 3171 5439 7197 4705 2989
724B989J458J190j988m044P20L781Q15m616l990K314N657P85n603l148L623N986
$$ 2989 4447 5637 3649 -395 325 4106 4921 305 -3685 -1371 4286 5071 -532 -3680 -57 5929
740E929j95n532j873N831L966l142m630L135O373k18o949j405O830N263n371q369
$$ 5929 5734 202 -1671 4160 8126 4984 354 3489 9862 9644 2695 1290 8120 13383 8012 -357
756c57J848Q450L206q760o794M752Q125j193q611l555N889M968l388p352M34O716
$$ -357 1491 9941 13147 4387 -2407 2345 10470 9277 666 -2889 3000 7968 4580 -2772 -2338 4378
772D378J680o651m931M128O877j715r106k743P999O378n559r912R40R480L222
$$ 4378 6058 -593 -5524 -1396 5481 3766 -5340 -8083 -84 6294 735 -9177 -8237 1243 4465
787D465p926p092M601Q078p10q066k028O996M822m310n681L108P334J469o266
$$ 4465 -3461 -10553 -5952 2126 1416 -6650 -8678 -1682 3140 -1170 -6851 -3743 3591 5060 -1206
802a206l150N908O992j341o492j409P186N892l211o894P13P240K850n678m491
$$ -1206 -4356 1552 8544 7203 711 -698 6488 12380 9169 2275 2988 10228 13078 7400 2909
817B909L054N410j563o550j528N267K921n771n262J975O207r91p572l007N489
$$ 2909 5963 11373 9810 3260 1732 6999 9920 4149 -1113 862 7069 6078 -1494 -4501 988
832I88M568l368o568J67N231K440l961m002K540L884j21m144m31L956K571l323
$$ 988 5556 2188 -4380 -4213 1018 3458 -503 -4505 -1965 1919 1798 -2346 -2777 1179 3750 427
848D27l168J721N150O33n190k434L722N305j884n542m59N444K865l907m272K141
$$ 427 -2741 -1020 4130 4763 -427 -2861 861 6166 4282 -1260 -1719 3725 6590 2683 -1589 552
864E52N262n64m709l97M699K214l687l617K969M711J67n516j952M191M254k186
$$ 552 5814 5250 541 144 4843 7057 3370 -247 2722 7433 7600 2084 132 4323 8577 6391
880F391n229o20M488K313l534l616J046L484K25m583k250L564K361l037n072J192
$$ 6391 1162 542 5030 7343 3809 193 1239 4723 4948 365 -1885 1679 4040 1003 -4069 -2877
896b877M587J114n439l788L028N773r84o872j465N166L573l148m802J462N005
$$ -2877 1710 2824 -2615 -6403 -3375 2398 1414 -5458 -6923 -1757 1816 -1332 -6134 -4672 333
911C33M91l823k301L721L630k395m304M84N243K022m448l783K478N015N41m949
$$ 333 824 -2999 -5300 -1579 2051 -344 -4648 -4164 1079 3101 -1347 -5130 -2652 2363 2904 -2045
927b045l149L605M680j158n659q13M936K520l749m065K272M810j077n559o42M889
$$ -2045 -5194 -1589 3091 1933 -3726 -4539 397 2917 -832 -4897 -2625 2185 1108 -4451 -5093 -204
943b04K827m236m670K122N706L03n392l036M006M494j492m650n72L977K578k649
$$ -204 2623 -1613 -6283 -4161 1545 1848 -3544 -6580 -2574 1920 428 -4222 -4794 -817 1761 -888
959h88k736J151L617Kl353j099L390L214j935m798R01N345J792m431m320L086
$$ -888 -3624 -2473 1144 1146 -2207 -3306 84 3298 1363 -3435 -2534 2811 4603 172 -4148 -1062
975a062M987l03n053j873M271L004k892l496O21M124J27l935j563L567K653k686
$$ -1062 3925 3622 -1431 -3304 967 3971 1079 -2417 -1796 2328 2455 -1480 -3043 524 3177 491
991D91l797J80M941J574m139l683J926M621P7m171k805K844L889j825l890k88
$$ 491 -3306 -3126 1815 3389 -750 -4433 -2507 2114 2191 -1980 -4785 -1941 1948 123 -3767 -4055
1007d055L401J134k854k859K561L565r85m598j37M522K876l534m699K255N499
$$ -4055 -654 480 -2374 -5233 -2672 893 -92 -4690 -4827 -305 2571 -963 -5662 -3407 2092
1022B092Q67l941k472K736M444q75l224p59L399K245k281k182J312L072q03l556
$$ 2092 2959 -982 -3454 -718 3726 2851 -373 -1132 2267 4512 2231 49 1361 4433 3630 74
1038G4j089L145L155l007m447J72M048J855m085m278J783M466L23m511k299L316
$$ 74 -1015 2130 5285 2278 -2169 -1997 2051 3906 -179 -4457 -2674 1792 2115 -2396 -4695 -1379
1054a379K868k595l178J379L685j35l719j335L860K975j940m496P08M359K367
$$ -1379 1489 -1106 -4284 -2905 780 645 -3074 -4409 -549 2426 486 -4010 -3302 1057 3424
1069C424l630l478J861M078M00l328k090K032K761q02k913l18K951J441l084k035
$$ 3424 -206 -3684 -1823 2255 2655 -673 -2763 -731 2030 1228 -1685 -2003 948 2389 -695 -2730
1085b730K372L372r03m293o79M151K558l086m211Q66M896O81l753k887K229K934
$$ -2730 -358 3014 2111 -2182 -2861 1290 3848 762 -3449 -2583 2313 2994 -759 -3646 -1417 1517
1101A517j154l003p36K605K49j973k084J096K706r35l371p99K898K498j675l669
$$ 1517 363 -2640 -3376 -771 -522 -2495 -4579 -3483 -777 -1712 -5083 -5882 -2984 -486 -2161 -5830
1117e830P8L798K498k608l402J748L790R97k781j140K397K583j681k240J077L442
$$ -5830 -5752 -1954 544 -2064 -5466 -3718 72 1069 -1712 -2852 -455 2128 447 -1793 -716 2726
1133B726j9l540j608L271K765k198m329r2L442J805l049l149O56K837L41k698
$$ 2726 2707 -833 -2441 830 3595 1397 -2932 -3024 418 2223 -826 -3975 -3319 -482 -141 -2839
1149b839j865J400K207r47k414N97K275M62k649j265K426K733n65l792o44L821
$$ -2839 -4704 -3304 -1097 -2044 -4458 -3861 -1586 -1124 -3773 -5038 -2612 121 -444 -4236 -4880 -1059
1165a059K745k352l847J094L506O08k822k171J905K181j093k563M14K476J65k358
$$ -1059 1686 -666 -4513 -3419 87 695 -2127 -4298 -2393 -212 -1305 -3868 -3454 -978 -813 -3171
1181c171j400K212K762j397k752n44L937K375k045k959O65L923J927k318k547
$$ -3171 -4571 -2359 403 -994 -3746 -4290 -353 2022 -23 -2982 -2317 1606 3533 1215 -1332
1196a332J709L365J23k473r26K474J555k448k247J527K805m23m086j857L516K400
$$ -1332 377 3742 3865 1392 466 2940 4495 2047 -200 1327 4132 3709 -377 -2234 1282 3682
1212C682k131m249l60L058J774k734l107N26L131L79k616j012J624K112j367k218
$$ 3682 1551 -2698 -3058 0 1774 -960 -4067 -3541 -410 -31 -2647 -3659 -2035 77 -1290 -3508
1228c508O97K501J041k558k218K373L219o50m023j189L295L232k064m031K06L719
$$ -3508 -2811 -310 731 -1827 -4045 -1672 1547 897 -3126 -4315 -1020 2212 148 -3883 -3677 42
1244D2J234k915j818J163K781n68k590j8K131J623k286k204K282K420J7k755j680
$$ 42 1276 -1639 -3457 -2294 487 -81 -2671 -2689 -558 1065 -1221 -3425 -1143 1277 1294 -1461 -3141
1261c141K771K670p11l300o68K517K115j667k443J92K123L99k076r85J561J332
$$ -3141 -370 2300 1589 -1711 -2379 138 2253 586 -1857 -1665 458 857 -1219 -2204 -643 689
1277F89j622j735O80K704J18k623j642K615K087n09k396l17K528J829j099j138
$$ 689 -933 -2668 -1988 716 834 -1789 -3431 -816 1271 762 -1634 -1951 577 2406 1307 169
1293A69O43J795K08q64l09R42R38q68j080N81J625m48j826j481J502J645p40k961
$$ 169 812 2607 2815 1951 1642 2584 3522 2654 1574 2155 3780 3332 1506 25 1527 3172 2432 -529
1311e29p12J944J435j575k325M99J815K73j390q72J423J622j379j477J388K052
$$ -529 -1241 703 2138 563 -1762 -1263 552 825 -565 -1437 -14 1608 229 -1248 140 2192
1327B192j43k002q91K442K461p19l001k82K538J951j454k545L11K402Q84k443
$$ 2192 2049 47 -844 1598 4059 3340 339 57 2595 4546 3092 547 858 3260 4144 1701
1343A701j622J306J422o40k458J12K340N23k491k441J879K822m40l357j315K309
$$ 1701 79 1385 2807 2167 -291 -179 2161 2684 193 -2248 -369 2453 2013 -1344 -2659 -350
1359c50L121j707l637j25K997J239k322k678J096K454j58k834o89K233J138j897
$$ -350 2771 1064 -2573 -2698 299 1538 -784 -3462 -2366 88 -70 -2904 -3593 -1360 -222 -2119
1375b119k521R80K630K52k878j960J876K872m02k833j162K561K517j252k206M6
$$ -2119 -4640 -3660 -1030 -778 -3656 -5616 -3740 -868 -1270 -4103 -5265 -2704 -187 -1439 -3645 -3599
1391c599K709J363j399j444J732K304n84j984J85K420J439j704j658R38K839M65
$$ -3599 -890 473 -926 -2370 -638 1666 1082 -902 -717 1703 3142 1438 -220 718 3557 4022
1407D022k580j503J460K387j85k177r79J573J203q59j688J77J307J08j549o93
$$ 4022 1442 -61 1399 3786 3601 1424 445 2018 3221 2362 674 851 2158 2266 717 24
1423B4J069J339j403j583J60J774P43k164j761J123J685J55k274p25J316R35n87
$$ 24 1093 2432 1029 -554 -394 1380 2123 -41 -1802 -679 1006 1161 -1113 -1838 -522 413 -174
1440a74j454J24R74M8r14l27J383M08q32j188J013J585K8j760n34J332J948j45
$$ -174 -1628 -1504 -530 -482 -1396 -1723 -340 68 -764 -1952 -939 646 674 -1086 -1620 -288 1660 1515
1458A515j649n59K083J198j033j378M07J876m10j388j48J337R18j586j657L99
$$ 1515 -134 -693 1390 2588 1555 177 584 2460 2050 662 514 1851 2769 1183 -474 -75
1474g5K432n3k811j297J443K161r44k517p51K050O84j002k184O77J856j96j934
$$ -75 2357 2304 -507 -1804 -361 1800 856 -1661 -2412 -362 322 -680 -2864 -2187 -331 -527 -2461
1491b461m61J329J410j452j631K05K270R37k007j771J541K305L7k101j498J944
$$ -2461 -2922 -1593 -183 -1635 -3266 -3061 -791 146 -1861 -3632 -2091 214 251 -1850 -3348 -1404
1507a404K499r90k261K01K079J383j654j393J131J799l98k178k9J892J234j401
$$ -1404 1095 105 -2156 -1955 124 1507 -147 -1540 -409 1390 992 -1186 -1215 677 1911 510
1523E10j844J05K576O80j789k095J201K172j05k292j350J528J826l38k517k66
$$ 510 -1334 -1229 1347 2027 238 -1857 -656 1516 1411 -881 -2231 -703 1123 785 -1732 -1998
1539a998K024M66j713j168J177J614l50k251j13K397J098j848j898R19K270K60
$$ -1998 26 492 -1221 -2389 -1212 402 52 -2199 -2312 85 1183 -665 -2563 -1644 626 886
1555H86k066p69J262J525m07j204l48J561O20j099p99J073J538l04j269n88J629
$$ 886 -1180 -1949 -687 838 431 -773 -1121 440 1060 -39 -838 235 1773 1469 200 -388 1241
1572A241J115j340r45J80J806L95j665q72O89J370k18r91q78J247N09r04r19Q56
$$ 1241 2356 1016 71 251 2057 2452 787 -85 604 1974 1756 765 -113 1134 1643 739 -180 676
1590F76N66o56j351L2J019N59j272j206O71J086J20j098q50O48J205p8j049l09
$$ 676 1242 586 -765 -733 286 845 -427 -1633 -962 124 244 -854 -1704 -1056 149 71 -978 -1287
1608a287Q79P11p41m49N06Q84L4j092m28J520J166j231j107K25K019M45j848j129
$$ -1287 -408 303 -438 -887 -381 503 537 -555 -983 537 1703 472 -635 -410 1609 2054 206 -923
1626i23J173R46J06j766m68J376O41j152j012M97J353r0j572o83J157J388q07
$$ -923 250 1196 1302 -464 -932 444 1085 -67 -1079 -582 771 681 -891 -1574 -417 971 164
1643A64j738L60J337P97j187j358O43J598o6j132j188R13J259l96j481k28J504
$$ 164 -1574 -1214 123 920 -267 -1625 -982 616 550 -582 -1770 -857 402 6 -1475 -1703 -199
1660a99L35j375q58Q52J251l88j605J59J185J219j160j688L83J629N76j093j014
$$ -199 136 -1239 -2097 -1245 6 -382 -1987 -1828 -643 576 -584 -2272 -1889 -260 316 -777 -1791
1677a791R27J584j93j626l26J241O65p58j214O71J135j17j465p76J399J059j129
$$ -1791 -864 720 527 -1099 -1425 -184 481 -277 -1491 -820 315 198 -1267 -2043 -644 415 -714
1694g14j837K2J352L82q50j442L68J611j30j004o95J083Q52o09j111L91J204J71
$$ -714 -2551 -2529 -1177 -795 -1645 -3087 -2719 -1108 -1238 -2242 -2937 -1854 -1002 -1611 -2722 -2331 -1127 -956
1712i56r30n42J454O45r5q50j66J003R85n15j085N46J307J09q11p34Q93O83l10
$$ -956 -1886 -2428 -974 -329 -424 -1274 -1440 -437 548 33 -1052 -506 801 910 99 -635 258 941 631
1731F31p11j53R93j3k46j237O53J495j12j334l30Q74J084o44j398L00J225K21
$$ 631 -80 -233 760 747 501 -736 -83 1412 1300 -34 -364 510 1594 950 -448 -148 1077 1298
1749A298q89p16L50J106n93j369pP44J56q84p50N25M21j30j229p22J255J026q92
$$ 1298 409 -307 43 1149 556 -813 -820 -76 80 -804 -1554 -1029 -608 -738 -1967 -2689 -1434 -408 -1300
1768a300j207N12R27O18r85j080Q77J416k47q17J35R51N99q79l46N94J029J89
$$ -1300 -2507 -1995 -1068 -450 -1435 -2515 -1638 -222 -469 -1286 -1151 -200 399 -480 -826 -232 797 986
1786I86j177l08R65Q87n94j119K7P34L85q46r52M12N78nq48o88M10R80n73j265
$$ 986 -191 -499 466 1353 759 -360 -333 401 786 -60 -1012 -600 -22 -27 -875 -1563 -1153 -173 -746 -2011
1806b011L86M73N27o62q81P47O81j58j011l89J244L57m73p98L57O45nm37p46Q47
$$ -2011 -1625 -1152 -625 -1287 -2168 -1421 -740 -898 -1909 -2298 -1054 -697 -1170 -1968 -1611 -966 -971 -1408 -2154 -1307
1826a307N14m14q12J9R32K52p43n32R1J479J66j349m91J116Q57l28q22K21R11
$$ -1307 -793 -1207 -2019 -2000 -1068 -816 -1559 -2091 -2000 -521 -355 -1704 -2195 -1079 -222 -550 -1372 -1151 -240
1845b40N30o31p35N70J386O4j146p8J069J73m35j148M29Q13L63j220n27N98R27
$$ -240 290 -341 -1076 -506 880 944 -202 -280 789 962 527 -621 -192 621 984 -236 -763 -165 762
1864G62k28j239l68R17R65q18q41J76J017m86k56l43O58R94p97n56R4J224J83
$$ 762 534 -705 -1073 -156 809 -9 -850 -674 343 -143 -399 -742 -84 910 113 -443 -349 875 1058
1883A058n67o98N76O54K70j257k00P18O58o45o02K4O37M0q64m93L33Q11m89r90
$$ 1058 491 -207 369 1023 1293 36 -164 554 1212 567 -35 -11 626 666 -198 -691 -358 453 -36 -1026
1903a026oQ60j01n17o59N29Q80k24r17j72M53N26%j134M85N88R9r07o67M29O86
$$ -1026 -1032 -172 -273 -790 -1449 -920 -40 -264 -1181 -1353 -900 -374 -374 -1508 -1023 -435 -336 -1243 -1910 -1481 -795
1924g95l9r60k00O97M58r03n11J50J158N2j111l20N48Q43k23p37M98L37O33L7
$$ -795 -834 -1794 -1994 -1297 -839 -1742 -2253 -2103 -945 -893 -2004 -2324 -1776 -933 -1156 -1893 -1395 -1058 -425 -388
1944c88j023M74R86j76n49k77Q25N20j54r17O2R96R6o55q84O85R70m47r97n25
$$ -388 -1411 -937 49 -127 -676 -953 -128 392 238 -679 -617 379 475 -180 -1064 -379 591 144 -853 -1378
1964a378Q64K53k89o19M8M09L09q16j39L70Q55m34j046J9J130K63n00o27M04R01
$$ -1378 -514 -261 -550 -1169 -1121 -712 -403 -1219 -1358 -988 -133 -567 -1613 -1594 -464 -201 -701 -1328 -924 -23
1984b3K10o21m02N41O33J00p78q9R62o1o5n08R3R80k61m37l4J74O41j46p59J46
$$ -23 187 -434 -836 -295 338 438 -340 -429 533 472 407 -101 -8 972 711 274 240 414 1055 909 150 296
2006B96M59O59o89m24J31N52L01n58j51J69M20j06o47K83M0k37M15m95J57J60
$$ 296 755 1414 725 301 432 984 1285 727 576 745 1165 1059 412 695 735 498 913 418 575 735
2026G35n55K3k44K12J39m18j83j19L57J33q86L09O45k15k41l62N29K41j73j92
$$ 735 180 203 -41 171 310 -108 -291 -410 -53 80 -806 -497 148 -67 -308 -670 -141 100 -73 -265
2046b65k31Q44r8k30k72J24N42L84q25o68P74O41m04p82K43P81k3n75o42M68O51
$$ -265 -496 348 250 20 -252 -128 414 798 -27 -695 79 720 316 -466 -223 558 535 -40 -682 -214 437
2067D37j18j220N10M65M09o01q55O8R80O1r16m25P59N14J1j112J45N46O75q33
$$ 437 319 -901 -391 74 483 -118 -973 -905 75 136 -780 -1205 -446 68 79 -1033 -888 -342 333 -500
2087e00p09K2R79M79j019k74K73J114k10j091j35J002P62n92j070K14R05M19m84
$$ -500 -1209 -1187 -208 271 -748 -1022 -749 365 155 -936 -1071 -69 693 101 -969 -755 150 569 85
2106H5r43P04O54L35q60m65P58P89l98q57l5P84L77p48o49J34J090P1r14m50N12
$$ 85 -858 -154 500 835 -25 -490 268 1057 659 -198 -233 551 928 180 -469 -335 755 826 -88 -538 -26
2127b6Q80l53j004l56P89M49k44j292J53J343p3n53o18k7J118k84o13n03P87M08
$$ -26 854 501 -503 -859 -70 379 135 -1157 -1004 339 266 -287 -905 -932 186 -98 -711 -1214 -427 -19
2147a9k90l87j34P33L76m89o47P61K40J69l71j59J33K87J89k04k22K81O48q7k94
$$ -19 -309 -696 -830 -97 279 -210 -857 -96 144 313 -58 -217 -84 203 392 188 -34 247 895 808 514
2168E14j9j83L01K24j94l84K42L60j8n34k90M58L54m44m76m32Q78L13n71k3r77
$$ 514 495 312 613 837 643 259 501 861 843 309 19 477 831 387 -89 -521 357 670 99 76 -901
2189i01J265r3n09q2m70J085M99p81p61R0Q77O62j210n66O99Q73J99j515J50N75
$$ -901 364 271 -238 -320 -790 295 794 13 -748 -658 219 881 -329 -895 -196 677 876 -639 -489 86
2209H6R08l97j180NJ103M57o94j010K10J736Q0j389o83M86J282k52j139m50J028
$$ 86 994 597 -583 -578 525 982 288 -722 -512 1224 1304 -85 -768 -282 1000 748 -391 -841 187
2228A87J071q09j348M44J042M79j065j501O67J905m10j386p04J010J208k54j699
$$ 187 1258 449 -899 -455 587 1066 1 -1500 -833 1072 662 -724 -1428 -418 790 536 -1163
2245a163p53J690P30p71j454K26J559O31j227j256Q13J633r5j746n69J152J516
$$ -1163 -1916 -226 504 -267 -1721 -1495 64 695 -532 -1788 -975 658 563 -1183 -1752 -600 916
2262I16o34j332j53J481P51n39j576Q75J316L22r01j255J047J252m16j417n43
$$ 916 282 -1050 -1203 278 1029 490 -1086 -211 1105 1427 526 -729 318 1570 1154 -263 -806
2279h06J300R64l75j211n65J172Q93q46j273K89J171M24j019q47K15J278M31j421
$$ -806 494 1458 1083 -128 -693 479 1372 526 -747 -458 713 1137 118 -729 -514 764 1195 -226
2297b26n49N60R90j32r06n16N47J293l01j606J61J147Q46p94j155J28J116L97
$$ -226 -775 -215 775 643 -263 -779 -232 1061 760 -846 -685 462 1308 514 -641 -513 603 1000
2315A000o42j211O00J035O57j302n89O50J401n08r16j33N17J509j029j180j60
$$ 1000 358 -853 -253 782 1439 137 -452 198 1599 1091 175 42 559 2068 1039 -141 -301
2332c01J247Q51r01j148L46J085N66j074j263M62J410J97j415r64L57J636m57
$$ -301 946 1797 896 -252 94 1179 1745 671 -592 -130 1280 1477 62 -902 -545 1091 634
2349F34j308p06J061R68o65j214p44J524R07q07j820O46J464O11j664j232Q37
$$ 634 -674 -1380 -319 649 -16 -1230 -1974 -450 457 -350 -2170 -1524 -60 551 -1113 -2345 -1508
2366a508J675P7j701p38J166J482n54j935k39K219Q67j182j638L94J604P35j623
$$ -1508 167 244 -1457 -2195 -1029 453 -101 -2036 -2275 -56 811 -371 -2009 -1615 -11 724 -899
2383h99j305R92J741o4j859o26J458J576q79j378p29J905J139j020j802M00J652
$$ -899 -2204 -1212 529 465 -1394 -2020 -562 1014 135 -1243 -1972 -67 1072 52 -1750 -1350 302
2400C02P85j140j660M97K143J87j672j091J017J905n76j843o37J576J733j158
$$ 302 1087 -53 -1713 -1216 927 1114 -558 -1649 -632 1273 697 -1146 -1783 -207 1526 368
2416C68j739J18J856O59j459q80J05K133J44j500j216J499J824m19j841o96J915
$$ 368 -1371 -1253 603 1262 -197 -1077 -972 1161 1305 -195 -1411 88 1912 1493 -348 -1044 871
2433H71R26n90j526m4J697J007j233j821Q49J615K26j708r76P68J583K04k226
$$ 871 1797 1207 -319 -363 1334 2341 1108 -713 136 1751 1977 269 -707 61 1644 1848 -378
2450c78n47J323J207n65k068n3J465J165r27j651j22J631J044j541j423P63J535
$$ -378 -925 398 1605 1040 -1028 -1081 384 1549 622 -1029 -1151 480 1524 -17 -1440 -677 858
2467H58K88j451j471J148K060p24j638q74J168J964r96j563k73J641J125j146
$$ 858 1146 -305 -1776 -628 1432 708 -930 -1804 -636 1328 332 -1231 -1504 137 1262 116
2483A16j873M07J857N49j400j200P16J725K78j969j204J363J489j03k154l84J454
$$ 116 -1757 -1350 507 1056 -344 -1544 -828 897 1175 -794 -1998 -635 854 751 -1403 -1787 -333
2500c33J743j048k138q8K023J043j576j690L73K408m8j492j802J206J828P7k235
$$ -333 1410 362 -1776 -1864 159 1202 -374 -2064 -1691 717 669 -823 -2625 -1419 409 486 -1749
2517a749n66J547J709o18k148m22J638J486j227j713M6K401J087k037j711P47
$$ -1749 -2315 -768 941 323 -1825 -2247 -609 877 -350 -2063 -2017 384 1471 -566 -2277 -1530
2533a530K609K00k025j092J683J794o75k239J96J643J552j325j931k15K433J076
$$ -1530 1079 1279 -746 -1838 -155 1639 964 -1275 -1079 564 2116 791 -1140 -1355 1078 2154
2549B154j915j551M60K554L25k305j132J254K268m59k666o40K246J541j135k392
$$ 2154 239 -1312 -852 1702 2027 -278 -1410 -156 2112 1653 -1013 -1653 593 2134 999 -1393
2565a393n0K512O02j520j870O85J891N03j523j444P15K206k04j981j137J712K024
$$ -1393 -1443 1069 1671 151 -1719 -1034 857 1360 -163 -1607 -892 1314 1110 -871 -2008 -296 1728
2582A728r27k265k86K076J389j170k147J84K235N98j439j819P23K299L47k030
$$ 1728 801 -1464 -1750 326 1715 545 -1602 -1418 817 1415 -24 -1843 -1120 1179 1526 -504
2598e04j513J574K015k26k308o48J876J648j228j608n02K407P80j778j407Q0K297
$$ -504 -2017 -443 1572 1346 -962 -1610 266 1914 686 -922 -1424 983 1763 -15 -1422 -1342 955
2615I55L85j982j543J397J934j98k180r17J696J720p53k038l62J610J576j291
$$ 955 1340 -642 -2185 -788 1146 948 -1232 -2149 -453 1267 514 -1524 -1886 -276 1300 9
2631Ik291N56J957P78j311j997O22K255N18j775j509J648J699N4k259j006K010
$$ 9 -2282 -1726 231 1009 -302 -2299 -1677 578 1096 -679 -2188 -540 1159 1213 -1046 -2052 -42
2648d2J294n37k197P8J737J305j311k099N51K468P29k104j817J188K402k29j965
$$ -42 1252 715 -1482 -1404 333 1638 327 -1772 -1221 1247 1976 -128 -1945 -757 1645 1416 -549
2665e49j287J686J917m96k339q52K410J422j488k012L36K334P93j920j733O19
$$ -549 -1836 -150 1767 1271 -1068 -1920 490 1912 424 -1588 -1252 1082 1875 -45 -1778 -1159
2681a159K362J87k132j364J645K267r36j968n37J785J651r17k341JK387J301j954
$$ -1159 1203 1390 -742 -2106 -461 1806 870 -1098 -1635 150 1801 884 -1457 -1456 931 2232 278
2698B78k027R03K155L61j763j509J323K050q9k315q79J792K129j319j970l49J814
$$ 278 -1749 -846 1309 1670 -93 -1602 -279 1771 1682 -633 -1512 280 2409 1090 -880 -1229 585
2715E85J303r85k180L70J959J219k222j420O31K044O2j713j356J172K005k23k371
$$ 585 1888 903 -1277 -907 1052 2271 49 -1371 -740 1304 1366 -347 -1703 -531 1474 1251 -1120
2732a120k92J786J541j363k232L01K030Q76j303j877N46K214L56k039j220J463
$$ -1120 -1412 374 1915 552 -1680 -1379 651 1527 224 -1653 -1107 1107 1463 -576 -1796 -333
2748c33J615j19k004r59J913J772j046j988l32K214J100j355j722K09K298N40
$$ -333 1282 1163 -841 -1800 113 1885 839 -1149 -1481 733 1833 478 -1244 -1035 1263 1803
2764A803j292j967Q42J858K31j739j141J175J761k68j958q95J702J722r51k042
$$ 1803 511 -1456 -614 1244 1475 -264 -1405 -230 1531 1263 -695 -1590 112 1834 883 -1159
2780a159k1J734J454j520k057L68K468K46k067j079J117J543M26k071j048J454
$$ -1159 -1180 554 2008 488 -1569 -1201 1267 1513 -554 -1633 -516 1027 1453 -618 -1666 -212
2796b12J769q71k030RJ638J219j147j969N77K131O39j639j481Q26J782K66k081
$$ -212 1557 686 -1344 -1335 303 1522 375 -1594 -1017 1114 1753 114 -1367 -541 1241 1507 -574
2813e74r45J379J710l63k182n51J827J515j211j646j27K030J039j456j759M9K181
$$ -574 -1519 -140 1570 1207 -975 -1526 301 1816 605 -1041 -1168 862 1901 445 -1314 -1265 916
2830I16Q48k004j361J033J990j41k181r94J741J566p17k038Q4J551R94j181j497
$$ 916 1764 -240 -1601 -568 1422 1281 -900 -1894 -153 1413 696 -1342 -1258 293 1287 106 -1391
2847a391J36J873Q70j915j255J214J723M4j825r08J232J310k27j519m83J305J645
$$ -1391 -1255 618 1488 -427 -1682 -468 1255 1299 -526 -1434 -202 1108 881 -638 -1121 184 1829
2864A829j050j557p5J872N31j214j406P75J666K58j582q61J121J160J27j833p58
$$ 1829 779 -778 -853 1019 1550 336 -1070 -295 1371 1629 47 -814 307 1467 1594 -239 -997
2881i97J440J311o98j734m7J320J167j067j749O13J528M52j195j335N79J595K8
$$ -997 443 1754 1056 -678 -725 595 1762 695 -1054 -441 1087 1539 344 -991 -412 1183 1211
2898A211j982l38J294J204n05j838o6J226J265j039j607N74J318N84r87j320N55
$$ 1211 -771 -1109 185 1389 884 -954 -1020 206 1471 432 -1175 -601 717 1301 314 -1006 -451
2915d51J383M59j226j445J143J225K2j265q25J390J066m06k052j90J696J331j243
$$ -451 932 1391 165 -1280 -137 1088 1110 -155 -980 410 1476 1070 -982 -1172 524 1855 612
2932F12j432N1J303Q93j396j153N91J742j60j384q97R36J224r3j631n22J318J127
$$ 612 -820 -769 534 1427 31 -1122 -531 1211 1051 -333 -1230 -294 930 837 -794 -1316 2 1129
2950A129m83j689J67J211M52o67j467M39J760Rj108q68O72J335Q8j415j013J432
$$ 1129 646 -1043 -876 335 787 120 -1347 -908 852 861 -247 -1115 -443 892 980 -435 -1448 -16
2968a6R85k42j492p03J576R19j149o74K54J421L15r90j380R01J373Qj116r27J049
$$ -16 969 727 -765 -1468 108 1027 -122 -796 -542 879 1194 204 -1176 -275 1098 1106 -10 -937 112
2987A12J203j36j640J3R46Q06o71j285J54J175O03q66j028K96Q60N27j294o18
$$ 112 1315 1179 -461 -448 498 1304 633 -652 -498 677 1280 414 -614 -318 542 1069 -225 -843
3005h43P85J162j6j409l64P27J059m23j057l23R97J064r22j011j55J489L29j107
$$ -843 -58 1104 1088 -321 -685 42 1101 678 -379 -702 295 1359 437 -574 -729 760 1089 -18
3023a8o11M67J081J06j149o09Q94J164p90r89O5Q12O59o65r85L26P76N91n93j202
$$ -18 -629 -162 919 1025 -124 -733 161 1325 535 -454 -389 423 1082 417 -568 -242 534 1125 532 -670
3043f70L56R46K34p60q31P31O06l23r59k15Q26Q23l34j124O5P47M99k92j090K33
$$ -670 -314 632 866 106 -725 6 612 289 -670 -885 -59 764 430 -694 -629 118 617 325 -765 -532
3063e32R42J08o54m76l3J020K2n41p87R53Q16j71j031m44R83P96o09q88k52Q70
$$ -532 410 518 -136 -612 -645 375 397 -144 -931 22 838 667 -364 -808 175 971 362 -526 -778 92
3083I2Q03m03q15J47P27K57j061k91M53J095l60q80k82M56R50k55n99l79J055
$$ 92 895 492 -323 -176 551 808 -253 -544 -91 1004 644 -236 -518 -62 888 633 34 -345 710
3102G10N68j008m32o5O10L16p18k96J77Q67N4j074n15P31P01j70p41m03Q84M52
$$ 710 1278 270 -162 -227 383 699 -19 -315 -138 729 783 -291 -806 -75 626 456 -285 -688 196 648
3122F48k30r61j75J367J30m67o37L0Q83K47q31l29M81O74j29r09j93O32N43k86
$$ 648 418 -543 -718 649 779 312 -325 -295 588 835 4 -325 156 830 701 -208 -401 231 774 488
3142D88l52l49R08K84n64p36p7P86M46o11q24L27Q16j02m26l40M82L97l30m74
$$ 488 136 -213 695 979 415 -321 -398 388 834 223 -601 -274 542 440 14 -326 156 553 223 -251
3162b51l81N76J078j080m77j22P19N73r20n16J31M72L85o44m71O04M83%o44p0
$$ -251 -632 -56 1022 -58 -535 -657 62 635 -285 -801 -670 -198 187 -457 -928 -324 159 159 -485 -555
3182e55K00N71J02q08L5L56P06l61p55j02Q33K04r75Q2p6Q25l6l84l38N33N04
$$ -555 -355 216 318 -490 -455 -99 607 246 -509 -611 222 426 -549 -467 -543 282 246 -138 -476 57 561
3203E61k85m92k73N37J83j07m99K6O70L04p50n51L42O97k47k38m14N6N55L6o00
$$ 561 276 -216 -489 48 231 124 -375 -349 321 625 -125 -676 -334 363 116 -122 -536 -480 75 111 -489
3224d89k85O77L27n7o57l90O12L75j58K3l53N17L21q46j11L85K92J03l90k8L23
$$ -489 -774 -97 230 173 -484 -874 -262 113 -45 -22 -375 142 463 -383 -494 -109 183 286 -104 -132 191
3245A91N06p03k32P3OM99k40k48j01P30L2m25k12K49M69k62l20l56L65M20K15
$$ 191 697 -6 -238 -165 -159 340 100 -148 -249 481 513 88 -124 125 594 332 12 -344 21 441 656
3266F56j145N1P52j08n2o80ON87K56l52l92oN78J75o55o8mM91j46l27k4J39K41
$$ 656 -489 -438 314 206 154 -526 -520 67 323 -29 -421 -427 151 326 -329 -397 -401 90 -56 -383 -407 -268 -27
3289b7K3k19k18J54M73k07m68J26K53L9J69m58J91L30K28l27m21K86K12k96j37
$$ -27 -4 -223 -441 -287 186 -21 -489 -363 -110 -71 98 -360 -169 161 389 62 -359 -73 139 -157 -294
3310b94j10K08L60j01l24K8L34J28l29Kj53K23M73n28J10L9P5l78p5J4Q8J35q1
$$ -294 -404 -196 164 63 -261 -233 101 229 -100 -98 -251 -28 445 -83 27 66 141 -237 -312 -298 -210 -75 -156
3333a56J00m53L63m7j54o3J63K88j53P4K2j26K25K18m21p7R4K71k03J83k64K98
$$ -156 -56 -509 -146 -193 -347 -410 -247 41 -112 -38 -16 -142 83 301 -120 -197 -103 168 -35 148 -116 182
3355A82rJ23j6k10K50J22k38q7j35K8J95k21j35J16J32j38K60j83Q9L14l30Q7
$$ 182 173 296 280 70 320 442 204 117 -18 10 205 -16 -151 -35 97 -41 219 36 125 439 109 196
3377A96k31K53J96o13J64p5K66K46n54p9J23L60m5l40R8K84q6J03l4j46J87k7
$$ 196 -35 218 414 -199 -35 -110 156 402 -152 -231 -108 252 207 -133 -35 249 163 266 232 86 273 246
3399B46k85J24P6J19j74L21m02Q9K15K10n2o19M76J26R1l03k46K32M09n48K07
$$ 246 -39 85 161 280 106 427 25 114 329 539 487 -132 344 470 561 258 12 244 653 105 312
3420C12Nk43J56K9O0l94L13p5J00k71K37Q2k64J28o4l0RQ6j69j11K68pr2l04L87
$$ 312 317 74 230 259 319 -75 238 163 263 -8 229 311 47 175 111 81 90 176 7 -104 164 157 65 -239 148
3445A48J95k79O2l1l63L10j1r8j40J85K67j8m76L89J77j35qN0j55K48l3m65K13
$$ 148 343 64 126 95 -268 42 31 -67 -207 -22 245 227 -249 140 317 182 174 224 69 317 284 -181 32
3468C2O9K29j45j34K2J62j60k9l03K40N5O5j83J35q4n0K86l58K32l01J20J03j69
$$ 32 101 330 185 51 73 235 75 46 -257 -17 38 103 -80 55 -29 -79 207 -151 81 -220 -100 3 -166
3491a66J43k28J91J11jO2l11K7K3N2m05O06l84K86j00M2KK07j01k99K57j7o1J33
$$ -166 -23 -251 -60 51 50 112 -199 -172 -149 -97 -502 104 -280 6 -94 -52 -50 157 56 -243 14 -3 -64 69
3515F9r4J47J48j55k11K87k47J25J71J08m76J56q6J72J11j11L23m27L21l55J76
$$ 69 -25 122 270 115 -96 191 -56 69 240 348 -128 28 -58 114 225 114 437 10 331 -24 152
3536A52k63K78j19K23k07J77k57K22n2r8R2K16m59Q7K82J46n31k00L26l7K27q9
$$ 152 -111 167 48 271 64 241 -16 206 154 56 148 364 -95 -8 274 420 -111 -311 15 -22 205 116
3558A16k23K58p1j16L4J49R7k27M19l94P8K8k7l58M06k1R3K64j67k35l2K60j75
$$ 116 -107 151 80 -36 -2 147 244 17 436 42 120 148 121 -237 169 148 241 505 338 103 71 331 156
3581A56m1rJ05j12j52K13%j07L18m9o1L2n79M89j71J57l29L6K58k78K15j04j36
$$ 156 115 106 211 99 -53 160 160 53 371 322 261 293 -286 203 32 189 -140 -104 154 -124 91 -13 -149
3604a49J33N1k43o4L33l4k87L84r4L2j29k80L53j13n2K79j24K46j43R5k23j8J25
$$ -149 -16 35 -208 -272 61 27 -260 124 30 62 -67 -347 6 -107 -159 120 -4 242 99 194 -29 -47 78
3627G8K34j71j63M6O4k28K56J38k75l5J32J33L7l81q6J54o8K03k40j54L8J88J18
$$ 78 312 141 -22 24 88 -140 116 254 -21 -56 76 209 246 -135 -221 -67 -135 68 -172 -326 -288 -100 18
3650A8k0j29J85j65J64K93j85j33J60K0l43K37k92K34l81L54j06M4J85J22o9l28
$$ 18 -2 -131 54 -111 53 346 161 28 188 208 -135 102 -190 44 -337 17 -89 -45 140 262 193 -135
3672a35K69k60K28j30N37m13P8O3J41j70q7Q1J4J27l21K80k31J57J33k65o8J64
$$ -135 134 -126 102 -28 509 96 174 237 378 208 121 202 216 343 22 302 71 228 361 96 28 192
3694A92L16p9n77L32j74J4k0l2l7j78M42l00J30k16J28p7K38Q0l53L09l43L50
$$ 192 508 429 -148 184 10 24 4 -28 -65 -243 199 -101 29 -187 -59 -136 102 182 -171 138 -205 145
3716A45q4Mj86p9K18N2j49j27N0Q6Q2N4n6K69n75L07j15L46j52l25K47l0O4j23
$$ 145 61 65 -121 -200 18 70 -79 -206 -156 -70 12 66 10 279 -296 11 -104 242 90 -235 12 -18 46 -77
3740g7K14n0o9j5k19N15n57M80O1q6m53P4N4j22J38J0p2J17k32L69k73j01o1L16
$$ -77 137 87 18 3 -216 299 -258 222 283 197 -256 -182 -128 -250 -112 -102 -174 -57 -289 80 -193 -294 -355 -39
3764c9j17L78l09k26K8K88j44J2J14j24M40m44j55M31k66n54O23j72J85K47q7
$$ -39 -156 222 -87 -313 -285 3 -141 -129 -15 -139 301 -143 -298 133 -133 -687 -64 -236 -51 196 109
3785A09J81l45N9l37N19o8j85Q5K03j1j18m23K54J61k7J28O6j8l43k0K42m8n1
$$ 109 290 -55 4 -333 186 118 -67 18 221 210 92 -331 -77 84 57 185 251 233 -110 -130 112 64 13
3808A3J2j66J7M03m13oK29J47j93j51J89l57M56k32K92l93J41p3J75Kj49P5j26
$$ 13 25 -141 -124 279 -134 -140 89 236 43 -108 81 -276 180 -52 240 -153 -12 -85 90 92 -57 18 -108
3831a08M26m87K79R8j60r9J88o1l40N52m27J45J2O0k03L68j10M5o7j41J73k02
$$ -108 318 -169 110 208 48 -51 137 76 -264 288 -139 6 18 78 -125 243 133 178 111 -30 143 -59
3853e9p8J76K51k47J50k57R2p6L8o5j16J88M0j16K50o8j98n7R3J88k66n9j77O18
$$ -59 -137 39 290 43 193 -64 28 -48 -10 -75 -191 -3 37 -79 171 103 -95 -152 -59 129 -137 -196 -373 245
3877B45n75J52P5K98j68k61p0M33k85M56l29M08m04l2K57j16j54j80M16j64L65
$$ 245 -330 -178 -103 195 27 -234 -304 129 -156 300 -29 379 -25 -57 200 84 -70 -250 166 2 367
3898C67n41L05j54L48k21j17J77k65J83K36l30L69l16L7j30P7k01M4R1K35l3j56
$$ 367 -174 131 -23 325 104 -13 164 -101 82 318 -12 357 41 78 -52 25 -176 -132 -41 194 161 5
3920EO3Q7j53k93K58M1l32N40j48k0m4k39L12J12l69L11j72J83j77k06L90j41
$$ 5 68 155 2 -291 -33 8 -324 216 68 48 4 -235 77 189 -180 131 -41 142 -35 -241 149 8
3942HJ53r5Nl26N23r5K14l80Q8k17L36k72k9J10j96O3M2M50m90J90j07N2K48j98
$$ 8 161 66 71 -255 268 173 387 7 95 -122 214 -58 -87 23 -173 -110 -68 382 -108 82 -25 27 275 77
3966G7J6K1J62l14J63k14J72L4j83L68n25M51m26J76m0K6k18K14r0l4o5p5j28
$$ 77 93 114 276 -38 125 -89 83 117 -66 302 -223 228 -198 -22 -62 -36 -254 -40 -130 -164 -229 -304 -432
3989d32L17j50J84k36L66M2j09k44J17K68k33N25k78j90J80q1P5k37J59j03K2
$$ -432 -115 -265 -81 -317 49 91 -18 -262 -145 123 -110 415 137 -53 127 46 121 -116 43 -60 -38
4010c8K20j31j8K4J18L0k27j14J35L22r2j38j25K21j56P0l67R0K76L34n24K42
$$ -38 182 51 33 57 175 205 -22 -136 -1 321 229 91 -34 187 31 101 -266 -176 100 434 -90 152
4032A52l4K61j27m32K9N7r8J47K03l8k89p9K00r1q1M18r0n30N33k91lp9K54K52
$$ 152 118 379 252 -180 -151 -94 -192 -45 158 120 -169 -248 -48 -139 -220 198 108 -422 111 -180 -183 -262 -8 244
4056B44l72o2l7K98mJ06l51J37J42P1k53J76r1L26n53Q1L96m91L06J39k79n1L95
$$ 244 -128 -190 -227 71 67 173 -178 -41 101 172 -81 95 4 330 -223 -142 254 -237 69 208 -71 -122 273
4079B73m12J54J50K0l09n5K79j49K9P2o7p5J54j56R1O08p73J18OL30l83J35j45
$$ 273 -139 15 165 185 -124 -179 100 -49 -20 52 -15 -90 64 -92 -1 607 -166 -48 -42 288 -95 40 -105
4102a05K4M95l72j49J52K71l11K65k63p6p9K38k64M59k6M2m56M42l50L11j75%
$$ -105 -81 414 42 -107 45 316 5 270 7 -69 -148 90 -174 285 259 301 -155 287 -63 248 73 73
4124G3K5L9l24K95m6n1J89j5P0k51j60K24K28k77L59o15J65K35P5k75L22l31K39
$$ 73 98 137 -187 108 62 11 200 185 255 4 -156 68 296 19 378 -237 -72 163 238 -37 285 -46 193
4147A93J0k20J86n2l65K21j35K93k06J5J92M6l74N27q2k21J03L1j29n6J51J59
$$ 193 203 -17 169 117 -248 -27 -162 131 -75 -60 132 178 -196 331 249 28 131 162 33 -23 128 287
4169B87j21J2J48l15Q0n5O1J0Q0k78oK35m5o9K25n64L42J72j11j44j17K61ql45
$$ 287 166 178 326 11 91 36 97 107 187 -91 -97 138 93 24 249 -315 27 199 88 -56 -173 88 80 -265
4193b65M63k57M5j62k6J61n7J84j42r6J97o3M52m98j76K31PN8L8k10j83L26p6
$$ -265 198 -59 -14 -176 -202 -41 -98 86 -56 -152 45 -18 434 -64 -240 -9 -2 56 94 -116 -299 27 -49
4216d9K11pr0n77J65Q0K15J94j24l22J56m4J55L4o3o5L9m9J48K5k12K74p5M7j24
$$ -49 162 155 65 -512 -347 -267 -52 142 18 -304 -148 -192 -37 -3 -66 -131 -92 -141 7 32 -180 94 19 66 -58
4241e8k45K81J03k96J74J94P1l02P6n5J19k20N4M17k18k28O3J23N2j42n8L88k18
$$ -58 -303 -22 81 -215 -41 153 224 -78 -2 -57 62 -158 -104 313 95 -133 -70 53 105 -37 -95 293 75
4264G5m01M95r7K00k95l6n7K73k37J59lN8q8P8L3k29J79j20k29M0R9O7j00N7q3
$$ 75 -326 169 72 272 -23 -59 -116 157 -80 79 76 134 46 124 157 -72 107 -13 -242 -202 -103 -36 -136 -79 -162
4289a62M58o79L79j02J87j3k18K27j5l55K17J92m38N93j48k96P9P1n0K29j62m29
$$ -162 296 -383 -4 -106 81 68 -150 77 62 -293 -76 116 -322 271 123 -173 -94 -23 -73 156 -6 -435
4311d35M82J03j88j86J07J93l92R2R4k8J52r2l08M11l4n0J50j06O7r1J37k20K19
$$ -435 47 150 -38 -224 -117 76 -316 -224 -130 -158 -6 -98 -406 5 -29 -79 71 -35 32 -59 78 -142 77
4334G7j4l1K03j6l51O9J62k1o2k09K50K95m97P8M55j87j01K61k02j79J01P4j66
$$ 77 63 32 235 219 -132 -63 99 78 16 -193 57 352 -145 -67 388 201 100 361 159 -20 81 155 -11
4357a1k49O4K89J67k28p6J51Q9k75l97M94J32l7O7n5l53K57k27Q6J70p6q5L35
$$ -11 -260 -196 93 260 32 -44 107 196 -79 -476 18 150 113 180 125 -228 29 -198 -112 58 -18 -103 232
4380B32k78K03k60J6J29J20r6q8j64J63NR6n2R2l6k0KK69l21J8l6R9j98J12L60
$$ 232 -46 157 -103 -87 42 162 66 -22 -186 -23 -18 78 26 118 82 62 64 333 12 30 -6 93 -105 7 367
4405C67o6m63l3L13m27Q2M4K44j60K81j31k5k6L54k90J09k42J01N6N0j34L20j74
$$ 367 301 -162 -195 118 -309 -227 -183 61 -99 182 51 26 0 354 64 173 -69 32 88 138 4 324 150
4428A50q3O5l40J86O0M9j1O0p4k6j95n3j16M67nq0J33m0k73J6jJ62k5J3j20r9
$$ 150 67 132 -208 -22 38 87 76 136 62 36 -159 -212 -328 139 134 54 187 147 -126 -110 -111 51 26 39 -81 -180
4454a80K82K38l66o6M3L00l28k1M0M3l5o4P2L74k93j21lPJ05p7m4J17l6L20m28
$$ -180 102 340 -26 -92 -49 251 -77 -98 -58 -15 -50 -114 -42 332 39 -82 -85 -78 27 -50 -94 23 -13 307 -121
4479a21K5o7J68p6j39K19j47j7L45J13j42r4r5o0j78K77k1o4J23k85L13R5m17
$$ -121 -96 -163 5 -71 -210 9 -138 -155 190 303 161 67 -28 -88 -266 11 -10 -74 49 -236 77 172 -245
4502b45K91q5j4J79K26l00n21O94k01j0l49J97J59l44J5L63l39K91J26k04j2O4
$$ -245 46 -39 -53 126 352 52 -469 225 24 14 -335 -138 21 -323 -308 55 -284 7 133 -71 -83 -19
4524a9n0o0q3M66k53k69M05j8L9k99J27L1L2m7q1K44k36M15l56p8J66Nj67R9r3
$$ -19 -69 -129 -212 254 1 -268 137 119 158 -141 -14 17 49 2 -79 165 -71 344 -12 -90 76 81 -86 13 -80
4549h0j61O25n61M0N9R9k03J1L22L2j75n4q3L49j45j90J99j74J27o3K54k41P0
$$ -80 -241 384 -177 -137 -78 21 -182 -171 151 183 8 -46 -129 220 75 -115 84 -90 37 -26 228 -13 57
4572E7j06mJj40M24j94k38K1J16J51M8m84M62J44O0l18o7j1J83l76K42J02k22
$$ 57 -49 -53 -52 -192 232 38 -200 -179 -63 88 136 -348 114 258 318 0 -67 -78 105 -271 -29 73 -149
4595a49K79k3k33O4J82k00L94o34J34J94P1K86m44K6j02J33K76l08j39Q3J69j92
$$ -149 130 107 -126 -62 120 -80 314 -320 -186 8 79 365 -79 -53 -155 -22 254 -54 -193 -110 59 -133
4617a33K39l90K43R2j54K93k10k75N62l08j26J38n7j02O0K40j29N6Lr0m3j8o1
$$ -133 106 -284 -41 51 -103 190 -20 -295 267 -41 -167 -29 -86 -188 -128 112 -17 39 42 -48 -91 -109 -170
4640a70J35l4k70K55j08O8M1q0j48J91L0K81l85J69l2J28o6j00q6K02J58l59J14
$$ -170 -35 -69 -339 -84 -192 -124 -83 -163 -311 -120 -90 191 -194 -25 -57 71 5 -95 -181 21 179 -180 -66
4663f6K59j42n5p2m02N71j4K8K5j61j49K26l63L63Nk56L4L06l17j39K93K3j89
$$ -66 193 51 -4 -76 -478 93 79 107 132 -29 -178 48 -315 48 53 -203 -169 137 -180 -319 -26 -3 -192
4686a92L3ll6L37l32j00J27N4K76l16Q0L73o04L37P8n3P1Jj73K07j11l82M69r8
$$ -192 -159 -162 -198 139 -193 -293 -166 -112 164 -152 -72 301 -303 34 112 59 130 131 -42 165 54 -328 141 43
4710D3j07K47l47L14j79J74o8o7J28K12k07r7R9n28K60M18n29M30j96R7l20Q4
$$ 43 -64 183 -164 150 -29 145 77 10 138 350 143 46 145 -383 -123 295 -234 196 0 97 -223 -139
4732a39J21k18L68j65K5k23K58k5k29J62l1J31j04j97P6L15m36M28k9j46O0J06
$$ -139 -18 -236 132 -33 -8 -231 27 2 -227 -65 -96 35 -69 -266 -190 125 -311 117 88 -58 2 108
4754A08M0k47J21r8K21k86N9K05l46J86O8N0L7M5j21K19l39K52m59L7J78J27Q6
$$ 108 148 -99 22 -76 145 -141 -82 123 -223 -37 31 81 118 163 42 261 -78 174 -285 -248 -70 57 143
4777A43k76N6K78k88J91j86K8P7p4j35J42j67K52j03M06q2k57k17L65k29j04N46
$$ 143 -133 -77 201 -87 104 -82 -54 23 -51 -186 -44 -211 41 -62 344 262 5 -212 153 -76 -180 366
4799C66k25k79L75l66N64n01q4L68l63K0M8k05N8K47K26n12J50k16N02k75K63
$$ 366 141 -138 237 -129 435 -66 -150 218 -145 -125 -77 -282 -224 23 249 -263 -113 -329 173 -102 161
4820A61l82J34K48l18o1L94n5q1J81j02k49j12K96p9Q9K90j8l13j84K61J67l23
$$ 161 -221 -87 161 -157 -218 176 121 40 221 119 -130 -242 54 -25 64 354 336 23 -161 100 267 -56
4842e6j5K9L53j89j24j33J3Q9r0J72m1j66K74R4k71j29J19K46l4k49k13O11l52
$$ -56 -71 -42 311 122 -2 -135 -122 -33 -123 49 8 -158 116 210 -61 -190 -71 175 141 -108 -321 290 -62
4865f2k81K04K9L50j04k25O3J97k81K44q9L2n0Q5L8j36N6n1J00j48j9j55M5K23
$$ -62 -343 -139 -110 240 136 -89 -26 171 -110 134 45 77 27 112 150 14 70 19 119 -29 -48 -203 -158 65
4889F5l2N0k72K76J01l29J0L66j87l3R8q5n7j24J31J47j57j09K29k57j66J14K56
$$ 65 33 83 -189 87 188 -141 -131 235 48 15 113 28 -29 -153 -22 125 -32 -141 88 -169 -335 -221 35
4912C5J1NK9K23p2L5n28K14j35K51l3l1J03Q7j71K22j86M8Q5l69K30j31K88q7
$$ 35 46 51 80 303 231 266 -262 -48 -183 68 35 4 107 194 23 245 59 107 192 -177 53 -78 210 123
4936A23J2k18J51N9l19N62k90l1O0J07k5k39L65k02j09rM2O5J7m98K82k5mN8K28
$$ 123 135 -83 68 127 -192 370 80 49 109 216 191 -48 317 115 6 -3 39 104 121 -377 -95 -120 -124 -66 162
4961A62l77K95p5N9J55l07R6J51l90K44L4R0J62m25k25j8J78L38Q5k19l4m1R9
$$ 162 -215 80 5 64 219 -88 8 159 -231 13 47 137 299 -126 -351 -369 -191 147 232 13 -21 -62 37
4984C7k2j68J6J33j07J83l88R0K14J98l17k52L87j39L11j35J17l4K35m38L22m05
$$ 37 15 -153 -137 -4 -111 72 -316 -226 -12 186 -131 -383 4 -135 176 41 158 124 359 -79 243 -162
5006a62K12R8j39p4J59J26k10m57J00L15J21K05j92m07M10k10m8K63r8L3m72M95
$$ -162 50 148 9 -65 94 220 10 -447 -347 -32 89 294 102 -305 105 -105 -153 110 12 45 -427 68
5028F8J64k97K33k87j8M1M2J21n0O1k02j4K74R8k06j82J49J1R2k58J85q8q4j43
$$ 68 232 -65 168 -119 -137 -96 -54 67 17 78 -124 -138 136 234 28 -154 -5 6 98 -160 25 -63 -147 -290
5052b90K14K11o3K9j78n2j16L51Ll4j25J03m2M3J24l59K90k31J61J69l32N1K06
$$ -290 -76 135 72 101 -77 -129 -245 106 109 75 -50 53 11 54 178 -181 109 -122 39 208 -124 -73 133
5075A33l4m9m3o8K04j77k26J62J39p8J18L8L0k69K28k69P2O8L01l76K20j3J14
$$ 133 99 50 7 -61 143 -34 -260 -98 41 -37 81 119 149 -120 108 -161 -89 -21 280 -96 124 111 225
5098B25k32J23m0l00K78m2j67l7K29J93l16j33j57L54K18l75K27O8k81J32J51
$$ 225 -7 116 76 -224 54 12 -155 -192 37 230 -86 -219 -376 -22 196 -179 48 116 -165 -33 118
5119A18k75K88Q0j42J00l8l37K51N4Q2l79K19l85K99N8J61l6k80j83L18K7k00
$$ 118 -157 131 211 69 169 131 -206 45 99 181 -198 21 -364 -65 -7 154 118 -162 -345 -27 0 -200
5141b00L69k65j32K6K04L68n58J02K14j40j02R0p3J73l7J03k10n5L45k07K9m8
$$ -200 169 -96 -228 -202 2 370 -188 -86 128 -12 -114 -24 -97 76 39 142 -68 -123 222 15 44 -4
5163dQ7Q0J06l82L46j51J8l82K00J03L5N4l32J56J40j9K1j10l74L24n0M25k44
$$ -4 83 163 269 -113 233 82 100 -282 -82 21 56 110 -222 -66 74 55 76 -34 -408 -84 -134 291 47
5186D7j08J63K2k72J49k23K59j34J39m6k07R3J57k7o5K29j75J07k4m25L32J64
$$ 47 -61 102 124 -148 1 -222 37 -97 42 -4 -211 -118 39 12 -53 176 1 108 84 -341 -9 155
5208A55J51l68O1j72L32k85M2J87j38P3K8j83Q2M7j41J63q0N5J21K25m41j91J55
$$ 155 306 -62 -1 -173 159 -126 -84 103 -35 38 66 -117 -35 12 -129 34 -46 9 130 355 -86 -277 -122
5231a22Q8Lj70Q4K11J83o2l29K30k34J37P5l16L49j91L31k83j31J55K27j46j47
$$ -122 -34 -31 -201 -117 94 277 215 -114 116 -118 19 94 -222 127 -64 267 -16 -147 8 235 89 -58
5253e8J42j2k87L91l17J47K14j48k83J90r3M57j86l23J27J43r1j8n0j48n5R0J43
$$ -58 84 72 -215 176 -141 6 220 72 -211 -21 -114 343 157 -166 -39 104 13 -5 -55 -203 -258 -168 -25
5276b5m61K17L13J71l5k92J65j27n1K14m65J55o9L56k41k0L75k98o7J67M8J6M
$$ -25 -486 -269 44 215 180 -112 53 -74 -125 89 -376 -221 -290 66 -175 -195 180 -118 -185 -18 30 46 50
5299E0R0j19k42M09j51J12o9l38L82j14k32K67j82K21o9n1K50q0l43L35k59j0
$$ 50 140 21 -221 188 37 149 80 -258 124 10 -222 45 -137 84 15 -36 214 134 -209 126 -133 -143
5321a43J51k0Q6k63K51J35n5n6j50J93j50M76l25q1Lr7L83n52l7L81j83J87j11
$$ -143 8 -12 74 -189 62 197 142 86 -64 129 -21 455 130 49 52 -45 338 -214 -251 130 -53 134 23
5344B3oM4J05k90J0P0J40J78k13m10M67j58k8N1K8j17K91pm58K54R9J39l65J8
$$ 23 17 61 166 -124 -114 -44 96 274 61 -349 118 -40 -68 -17 11 -106 185 178 -280 -26 73 212 -153 -135
5368a35L41nP7l47N4m3J94M1o2J10l97L31N8l15m5L56K10m39q1N7M2L97l62p0
$$ -135 206 201 278 -69 -15 -58 136 177 115 225 -172 159 217 -98 -143 213 423 -16 -97 -40 2 399 37 -33
5392c3l74K11L28o2k13J10K49j29k0l85K61k00J51n5L04k23J0K86k05j18J89j14
$$ -33 -407 -196 132 70 -143 -33 216 87 67 -318 -57 -257 -106 -161 143 -80 -70 216 11 -107 82 -32
5414c2P5j40j64M68P7K8l75j14J83L2m2J1o0J82j6j7k33j30K44j26L11k61K94
$$ -32 43 -97 -261 207 284 312 -63 -177 6 38 -4 7 -53 129 113 96 -137 -267 -23 -149 162 -99 195
5437A95k72J34O7l58K74k1j2J63k3K31k76J62k13R6k23k47L3N79l10J06l13L48
$$ 195 -77 57 124 -234 40 19 7 170 147 378 102 264 51 147 -76 -323 -290 289 -21 85 -228 120
5459A20m38K29J02l86N51l39M04k64o0J18j53K43j39KQ9j02J81k9l6P4J31l01
$$ 120 -318 -89 13 -373 178 -161 243 -21 -81 37 -116 127 -12 -10 79 -23 158 129 93 167 298 -3
5481cM3M1O6J70l31m96N15J97Q9j95k0m4J25k53K36j72J5l9J29j44j03J6L55j74
$$ -3 40 81 147 317 -14 -510 5 202 291 96 76 32 157 -96 140 -32 -17 -56 73 -71 -174 -158 197 23
5505B3j63k12J14M13m3l45K82J36j64k31O4R4J94M5lk33j37L31j70n6j03J44K41
$$ 23 -140 -352 -238 175 132 -213 69 205 41 -190 -126 -32 162 207 204 -29 -166 165 -5 -61 -164 -20 221
5528B21l20J60J64l58L38m85J15L11k27K67l21k07M79l2k14J65j89j24N38k33
$$ 221 -99 61 225 -133 205 -280 -165 146 -81 186 -135 -342 137 105 -109 56 -133 -257 281 48
5548D8N6k42L27m6m0J72l02L52l33P5l14K54o9l6k5P2j72J39l8p3K6K66j33K69
$$ 48 104 -138 189 143 103 275 -27 325 -8 67 -247 7 -62 -98 -123 -51 -223 -84 -122 -195 -169 97 -36 233
5572B33k69K07j26R2m0j20k5J05O8m6j17J4j56J7J65L3K0j5j65rJJ42OJ65j59
$$ 233 -36 171 45 137 97 -23 -48 57 125 79 -38 -24 -180 -163 2 35 55 40 -125 -134 -133 9 15 180 21
5597B1L7k10K18p2k4N8j4M71o14R5l02N95j33n9l8l7K1oO6l41L18J68p8l15K82
$$ 21 58 -152 66 -6 -30 28 14 485 -129 -34 -336 259 126 67 29 -8 13 7 73 -268 50 218 140 -175 107
5622A07l2o8l0k03M90N0k92J99l59L3O0Q6J50k47K05M6k33j91L40k37M3n1J97
$$ 107 75 7 -23 -226 264 314 22 221 -138 -105 -45 41 191 -56 149 195 -38 -229 111 -126 -83 -134 63
5645F3q4j04K16j1K61l48L84j53m22L47j24j40M01m57K54j57J05j00k36L30K55
$$ 63 -21 -125 91 80 341 -7 377 224 -198 149 25 -115 286 -171 83 -74 31 -69 -305 25 280
5666B80l18J08l73O18k08j32J41o8l6M4J03Q5k54J67J58l18j48M10n32N41r0j19
$$ 280 -38 70 -303 315 107 -25 116 48 12 56 159 244 -10 157 315 -3 -151 259 -273 268 178 59
5688E9k13J39L29l07k8j57P1K48J13m42K64l23J5M18k19O5J03j24m2o4K12j53
$$ 59 -154 -15 314 7 -21 -178 -107 141 254 -188 76 -247 -232 186 -33 32 135 11 -31 -95 117 -36
5710c6j35j52N03l3k11l2j8M4k04J02J63O3J5j00k2K69m7l51J49J53m1J33P8k18
$$ -36 -171 -323 180 147 -64 -96 -114 -70 -274 -172 -9 54 69 -31 -53 216 169 -182 -33 120 79 212 290 72
5734G2j65J77j49K25M5K21l47l0M2l57M48L0r2r1J40p7N4K64m78J34q8j40J34
$$ 72 -93 84 -65 160 205 426 79 49 91 -266 182 212 120 29 169 92 146 410 -68 66 -22 -162 -28
5757b8K16l00K34J29l57j06k8L80J05k17j29K97l2l34L74m27J5K99Q7l64O1JK65
$$ -28 188 -112 122 251 -106 -212 -240 140 245 28 -101 196 164 -170 204 -223 -208 91 178 -186 -125 -124 141
5780A41j09R7j38k00K14q9L42k46m5K71J67n83k3L18k40J39l4j83o3K13%K60k93
$$ 141 32 129 -9 -209 5 -84 258 12 -33 238 405 -178 -201 117 -123 16 -18 -201 -264 -51 -51 209 -84
5803h4LJ6Q1m07J77K32J97n3N3r7m4Rj00J39L02n05M0l8l36N72l42O6L37k49K70
$$ -84 -81 -65 16 -391 -214 18 215 162 215 118 74 83 -17 122 424 -81 -41 -79 -415 157 -185 -119 218 -31 239
5828B39j64k98K94j42J88k13J11q7K20l0k33k6k9J01k2P7k63N8J58j92M80l6j31
$$ 239 75 -223 71 -71 117 -96 15 -72 148 118 -115 -141 -170 -69 -91 -14 -277 -219 -61 -253 227 191 60
5851F0P7J6l71K05O1l6j9K0M7j26R8P1j60L12j95K21%k40p8P1j64J68o8J10M3
$$ 60 137 153 -218 -13 48 12 -7 13 60 -66 32 103 -57 255 60 281 281 41 -37 34 -130 38 -30 80 123
5876A23j27k2j19J13p3J85l66P35n74J36mr5P5l25M50l53J22J30m7J41m4j56J0
$$ 123 -4 -26 -145 -32 -105 80 -286 449 -125 11 7 -88 -13 -338 112 -241 -119 11 -36 105 61 -95 -85
5899h5K97j41Jj05m8K06J27L9n93K13L44n77K64J83m16L92r3k39K55L01k47l4
$$ -85 212 71 72 -33 -81 125 252 291 -302 -89 255 -322 -58 125 -291 101 8 -231 24 325 78 44
5921D4j53q0L8J7K68j66j65J89Q2j98L96Om29M71n93J64J19K77k01l02J42QK68
$$ 44 -109 -189 -151 -134 134 -32 -197 -8 74 -124 272 278 -151 320 -273 -109 10 287 86 -216 -74 -66 202
5944B02p8k24J08j43J20Q6l77K49J55M2m92M14j53K77k36k95K3M66q1Q6k55n1
$$ 202 124 -100 8 -135 -15 71 -306 -57 98 140 -352 62 -91 186 -50 -345 -322 144 63 149 -106 -157
5966a57K67j48J66n5m07L06l2r1R6J76j17k43J43l7R5J10k10K06J43k46j88K97
$$ -157 110 -38 128 73 -334 -28 -60 -151 -55 121 4 -239 -96 -133 -38 72 -138 68 211 -35 -223 74
5988G4K3j23j0N3l5k15L09jP4m7j25Ql9k18J82j00L81n2l8Rj72J42L8J69l50O4
$$ 74 97 -26 -36 17 -18 -233 76 75 149 102 -23 -15 -54 -272 -90 -190 191 139 101 110 -62 80 118 287 -63 1
6014AN3j60k2K95m43M27j49k0K68k21j46J56j62J34R0J25j2m79J86J28P9m83L01
$$ 1 54 -106 -128 167 -276 151 2 -18 250 29 -117 39 -123 11 101 226 214 -265 -79 49 128 -355 -54
6037e4R9K35N2m15J46K7l38L20m51K12M60l38N5R2n6j30r2K92j32P2j71J93k65
$$ -54 45 280 332 -83 63 90 -248 72 -379 -167 293 -45 10 102 46 -84 -176 116 -16 56 -115 78 -187
6060a87J85J74k51O1K47m20L02j40p2Q7O7P7j71Q6j08n2O3k2J39j56R1lK5J8j03
$$ -187 -2 172 -79 -18 229 -191 111 -29 -101 -14 53 130 -41 45 -63 -115 -52 -74 65 -91 0 -3 22 40 -63
6085f3QPR1k07k96N18P2J13j06k45K60j88l96K99J43J2p4R6R5q9M9j35K21k48
$$ -63 -55 -48 43 -164 -460 58 130 243 137 -108 152 -36 -432 -133 10 22 -52 44 139 50 99 -36 185 -63
6109f3L06O6m81J59J02L1j67j2J69j24r7R1k10M39m78J09J12N9k32K08j07K40
$$ -63 243 309 -172 -13 89 120 -47 -59 110 -14 -111 -20 -230 209 -269 -160 -48 11 -221 -13 -120 120
6131A20j25j74J01K72m12L58n4M9r0PJm2j2JJ4j80K31J49j21nk00J30r6J63k00
$$ 120 -5 -179 -78 194 -218 140 86 135 45 52 53 11 -1 0 14 -166 65 214 93 88 -112 18 -78 85 -115
6156a15J22K04n11K11P7J9J50k69K35q9k11J37jJ8j80L82k00l18L15L9j08M53
$$ -115 7 211 -300 -89 -12 7 157 -112 123 34 -177 -40 -41 -23 -203 179 -21 -339 -24 15 -93 360
6178C60n00L64l76K94n0N5j70ro7Q8J51j42k16L78rl72L31j25p3l5K28j73J87
$$ 360 -140 224 -152 142 92 147 -23 -32 -99 -11 140 -2 -218 160 151 -221 110 -15 -88 -123 105 -68 119
6201A19k8k82K02K18l37K2r3L27o7r7j15K82l25R8K23k52M72l72K82o16L71j59
$$ 119 91 -191 11 229 -108 -86 -179 148 81 -16 -131 151 -174 -76 147 -105 367 -5 277 -339 32 -127
6223a27J48j60K1J54J38j1j02N4K1k15l3M9K6J66k41M51l10L1K86m86K27j00J51
$$ -127 21 -139 -118 36 174 163 61 115 136 -79 -112 -63 -37 129 -112 339 29 60 346 -140 87 -13 138
6246A38k57K39j54J57k9j82k68J14K51j68M3m9J4J44mJ68l96L94k92J74m7j4J06
$$ 138 -119 120 -34 123 94 -88 -356 -242 9 -159 -116 -165 -151 -7 -11 157 -239 155 -137 37 -10 -24 82
6269H2p5O6p2j14J17L83j12l10J2n8J75k9k26J60Q1Q0q5o0k29K2J76q3K55J1j67
$$ 82 7 73 1 -113 4 387 275 -35 -23 -81 94 65 -161 -1 80 160 75 15 -214 -192 -16 -99 156 167 0
6294@kj16R4J53m51K34K37l58K23k46P1K2J71J48k68J3J32j37l1L06J6j40n4l1
$$ 0 -2 -118 -24 129 -322 -88 149 -209 14 -232 -161 -139 32 180 -88 -75 57 -80 -111 195 211 71 17 -14
6318a4J4J03n0K58m38K66J03k09l9J16q9r3K41l5r4L7j84J87j95l0p2K53J65m35
$$ -14 0 103 53 311 -127 139 242 33 -6 110 21 -72 169 134 40 77 -107 80 -115 -145 -217 36 201 -234
6342b34K63K40j62j68Q1K2q8p6J85j44J81R6J7j99R2O1k73k0J56R5k93J32o7k43
$$ -234 29 269 107 -61 20 42 -46 -122 63 -81 100 196 213 14 106 167 -106 -126 30 125 -168 -36 -103 -346
6366c46K61J1Q1j33J59K2m7K28m08L02j83k24L23j96K45j53K87l51K19j14J0r1
$$ -346 -85 -74 7 -126 33 55 8 236 -172 130 -53 -277 46 -150 95 -58 229 -122 97 -17 -7 -98
6388i8jJ93K97l39m6M1q3K14p3j19L7J66m71L28k88K39j29J11K9k70J00L75L5
$$ -98 -99 94 391 52 6 47 -36 178 105 -14 23 189 -282 46 -242 -3 -132 -21 8 -262 -162 213 248
6411B48m05L23q9j74K73k13J8l01L35r1J6J21k5o9K88k63L8J55j98L3J12l6l6
$$ 248 -157 166 77 -97 176 -37 -19 -320 15 -76 -60 61 36 -33 255 -8 30 185 -13 20 132 96 60
6434F0N3oJ30n00K52j74N10m97O5K56k15o3M81m63J00K43j56j28P7K05j94N1m1
$$ 60 113 107 237 -263 -11 -185 325 -172 -107 149 -66 -129 352 -111 -11 232 76 -52 25 230 36 87 46
6457D6j57J85j19N1L31l58l5L9j83L0J69p5K7J30k20K08j5j28J22J14j99k04R
$$ 46 -111 74 -45 6 337 -21 -56 -17 -200 -170 -1 -76 -49 81 -139 69 54 -74 48 162 -37 -241 -232
6480b32N36o76L70K96n03J54j07M70o27J38M14Q6n5k16r2J50J70k59R8j49j65
$$ -232 304 -372 -2 294 -209 -55 -162 308 -319 -181 233 319 264 48 -44 106 276 17 115 -34 -199
6501a99r0o8L19K08l90L00o7j54K4J16J58j84J36k12j5j22J31J54j41j3J31j8
$$ -199 -289 -357 -38 170 -220 80 13 -141 -117 -1 157 -27 109 -103 -118 -240 -109 45 -96 -109 22 4
6523DMN0L07p6n10%L61J1k50k9j05K43J86j69q2J99j32l0k6M4Q1j50n7K52k14
$$ 4 8 58 365 289 -221 -221 140 151 -99 -128 -233 10 196 27 -55 144 12 -18 -44 0 81 -69 -126 126 -88
6548h8Q7K4l16J88N4Q0J54j80K2lN0Oj32PJ50l30N22k69JL9K48j21J00m24L74
$$ -88 -1 23 -293 -105 -51 29 183 3 25 22 72 78 -54 -47 103 -227 295 26 27 66 314 193 293 -131 243
6573B43k30l4J4P4j00M67n37Q0J7J39j97K1R3J68j23N1j00j38N03m49j35J55k76
$$ 243 13 -21 -7 67 -33 434 -103 -23 -6 133 -64 -43 50 218 95 146 46 -92 411 -38 -173 -18 -294
6596b94K67M3PJ22p7m55P5L07K35l09J11J47k5j9L3n21K66K88j71p0K94l41K07
$$ -294 -27 16 23 145 68 -387 -312 -5 230 -79 32 179 154 135 168 -353 -87 201 30 -40 254 -87 120
6619A20j01QJ81k87L62j21n4M0l84L58j52L96o25M82m80Q0L7J75m4K55j24p4j28
$$ 120 19 27 208 -79 283 162 108 148 -236 122 -30 366 -259 223 -257 -177 -140 35 -9 246 122 48 -80
6642h0r1J54j20K31k37j16N47j48k91L43j77j94K07j85K52p6j90M22K5l42n1L5
$$ -80 -171 -17 -137 94 -143 -259 288 140 -151 192 15 -179 28 -157 95 19 -171 251 276 -66 -117 -82
6664h2M46l10N6l17L17l84J90J39k50K24j5j6j08K39m3k37J08R4k84O02n42K92
$$ -82 364 54 110 -207 110 -274 -84 55 -195 29 14 -2 -110 129 86 -151 -43 51 -233 369 -173 119
6686A19j09m93M09K2J50J44k9m07L9K57Q5j77k42K97J58k16O3m3K7j92J01N5L6
$$ 119 10 -483 -74 -52 98 242 213 -194 -155 102 187 10 -232 65 223 7 70 27 54 -138 -37 18 54
6709E4k40K03J16p8O1k09rJ77l39MK88k3j5J9L6j87L23J86m03j0J79J96m56M15
$$ 54 -186 17 133 55 116 -93 -102 75 -264 -260 28 5 -10 9 45 -142 181 367 -36 -46 133 329 -127 288
6733B88n26M02J63k66k61K03m09M33o9J18l6j27q5L63l5l46L34k28J83j17K17
$$ 288 -238 164 327 61 -200 3 -406 27 -42 76 40 -87 -172 191 156 -190 144 -84 99 -18 199
6754A99l47J10K08k43Q6J36m14M31m61L97k2k39L93j82K09k95r7K51j63l7p6K68
$$ 199 -148 -38 170 -73 13 149 -265 166 -295 102 80 -159 234 52 261 -34 -131 120 -43 -80 -156 112
6776A12M0k83M16m1j01l2k08K96j53j96lmK94l1l01L11p5k51K56k5L9J07p2j14
$$ 112 152 -131 285 244 143 111 -97 199 46 -150 -153 -157 137 106 -195 116 41 -210 46 21 60 167 95 -19
6800a9K88k96k1m4q9K6O7l8Nk41M25J01j61m0r4L46J61m51J06Km3p5L1J1r7m8
$$ -19 269 -27 -48 -92 -181 -155 -88 -126 -121 -362 63 164 3 -37 -131 215 376 -75 31 33 -10 -85 -54 -43 -140 -188
6826a88L74j17j69J50K07k14R9J1j05o1K9K53m73K56j1J65j30j45k1M7Q7k36J89
$$ -188 186 69 -100 50 257 43 142 153 48 -13 16 269 -204 52 41 206 76 -69 -90 -43 44 -192 -3
6849cl11M43q0j34j95K46L24k85k87L80o5r6K64k30J54j67l9J36l33K82j8l8l7
$$ -3 -314 129 49 -85 -280 -34 290 5 -282 98 33 -63 201 -29 125 -42 -81 55 -278 4 -14 -52 -89
6872h9M28o48M28M0q6r5k0K0Pk46J7K05L04j89k68K51k10L17k10M9k36M40k26
$$ -89 339 -309 119 159 73 -22 -42 -22 -15 -261 -244 -39 265 76 -192 59 -151 166 -44 5 -231 209 -17
6895a7J51k23M65l87L34l63N68n26O4O0k10J44q1J33k44K05J81j07m11M30m89
$$ -17 134 -89 376 -11 323 -40 528 2 66 126 -84 60 -21 112 -132 73 254 147 -264 166 -323
6916c23K10r6o8J84J88P6j26l68K97K3j2J24L1m1m2j26OJ48r1J78Jj96N4mr1r1
$$ -323 -113 -209 -277 -93 95 171 45 -323 -26 -3 -15 109 140 99 57 -69 -63 85 -6 172 173 -23 31 27 -64 -155
6942a55L12r7M5j72p8J90K1K5J86l35K4nj28K87J70o92L02J91J9o3r2J41j26J45
$$ -155 157 60 105 -67 -145 45 66 91 277 -58 -34 -39 -167 120 290 -402 -100 91 110 47 -45 96 -30 115
6966A15O4l33L23M2l89M6J05K39j75O4j76J99j59O6K31P8k61pn4O7k1Q0j41l78
$$ 115 179 -154 169 211 -178 -132 -27 212 37 101 -75 124 -35 31 262 340 79 72 18 85 64 144 3 -375
6990c75N11k40J95OKJ65k65J13n2L6L8j73J13k18J8L07n5K2k70N6O7m5p0K23q1
$$ -375 136 -104 91 97 99 264 -1 112 60 96 134 -39 74 -144 -126 181 126 148 -122 -66 1 -44 -114 109 28
7015B8j87K96j81L62k56j45L29k59j6j9J27j65o0J17o0J24k09L04k26k8J05J04
$$ 28 -159 137 -44 318 62 -83 246 -13 -29 -48 79 -86 -146 -29 -89 35 -174 130 -96 -124 -19 85
7037H5N1j94J65r7J03k47J89O8j27O4pM2l1m39L64m3qj17N9N6P6J18k99M21p9
$$ 85 136 -58 107 10 113 -134 55 123 -4 60 53 95 64 -375 -11 -54 -62 -179 -120 -64 12 130 -169 252 173
7062A73k31lj7O9orLK07j51p8j14J24j35J44K36k37j3p6j8K04r3N5n3J89J44l11
$$ 173 -58 -61 -78 -9 -15 -24 -21 186 35 -43 -157 -33 -168 -24 212 -25 -38 -114 -132 72 -21 34 -19 170 314 3
7088Cm3K69l05J29k34K78j80j38M03kl43K45K1l4j91N17l69k09K88K2m43K98K47
$$ 3 -40 229 -76 53 -181 97 -83 -221 182 180 -163 82 103 69 -122 395 26 -183 105 127 -316 -18 229
7111B29p5N2j36L78l11J82m05k03J69Q8L7J95k36j45j30M36j49j09M4L18j34p9
$$ 229 154 206 70 448 137 319 -86 -289 -120 -32 5 200 -36 -181 -311 125 -24 -133 -89 229 95 16
7133A6K41m4l63O2K34l13N0J69j19P1k21p5L59K43l14j06R0J04J44ok53k93L12
$$ 16 257 213 -150 -88 146 -167 -117 52 -67 4 -217 -292 67 310 -4 -110 -20 84 228 222 -31 -324 -12
7156a2L6O8l42M2J96k02M2O0j02J35L29M9o72N07m07N29N4j66j70q1K77l48L86
$$ -12 24 92 -250 -208 -12 -214 -172 -112 -214 -79 250 299 -373 134 -273 256 310 144 -26 -107 170 -178 208
7179B08k30R6m3o3L27m72M8J56J55k97J25p8j77L12j29J37J01j99K8K48l5k38
$$ 208 -22 74 31 -32 295 -177 -129 27 182 -115 10 -68 -245 67 -62 75 176 -23 5 253 218 -20
7201b0J59q0l23L68q0j06J81k22NJ39Q9O6j3N0k11J16J7k08Q0J45k9l30J33J28
$$ -20 139 59 -264 104 24 -82 99 -123 -118 21 110 176 163 213 2 118 135 -73 7 152 123 -207 -74 54
7225E4k56J77j69K59J28l5j99j08M3P0j70L19Q6m15L45m68N53n2k07K87l11M6
$$ 54 -202 -25 -194 65 193 158 -41 -149 -106 -36 -206 113 199 -216 129 -339 214 162 -45 242 -69 -23
7247b3K04l19J26k48J79N8J17k48r0J47J88J19l36J55N6p7R0N0j16l29O3K06J40
$$ -23 181 -138 -12 -260 -81 -23 94 -154 -244 -97 91 210 -126 29 85 8 98 148 32 -297 -234 -28 112
7270A12k90M48l27l5j39l4J09J41m34K73J01K28j57j07K33k29P6K0j63J99l35
$$ 112 -178 270 -57 -92 -231 -265 -156 -15 -449 -176 -75 153 -4 -111 122 -107 -31 -11 -174 25 -310
7291c10L16K68l04M25l29o8j1Q3r6K10j74K40j79l9J36k14J8P4j89J28m1j64M91
$$ -310 6 274 -30 395 66 -2 -13 70 -26 184 10 250 71 32 168 -46 -28 46 -143 -15 -56 -220 271
7314B71m19N3L72l76q4K04km6M8k16R5J3R5j66J26p1M6K11j37k7qJ14n6J20j02
$$ 271 -148 -95 277 -99 -183 21 19 -27 21 -195 -100 -87 8 -158 -32 -103 -57 154 17 -10 -18 96 40 160 58
7339E8L5k12J57L83l20j33P1P5J08j50l76K25j2J18J24j24j47k02J94L8J88L9
$$ 58 93 -119 38 421 101 -32 39 114 222 72 -304 -79 -91 27 151 27 -120 -322 -128 -90 98 137
7361A37k68K01J92k79m5j43K99P2k87J46j90L31P6k26L3J12Jk69J32r5J95r1k94
$$ 137 -131 70 262 -17 -62 -205 94 166 -121 25 -165 166 242 16 49 161 162 -107 25 -70 125 34 -260
7384b60J77K15k96Q0J6K76j2j89L2J72ol22J43J24J69n41J98p1pp3J46k94L85
$$ -260 -83 132 -164 -84 -68 208 196 7 39 211 205 -117 26 150 319 -222 -24 -95 -102 -175 -29 -323 62
7407F2K0m05K02N4k77N32J35m04j53L47k89L37M8l47J27K04j68n1M29o38j2M75
$$ 62 82 -323 -121 -67 -344 188 323 -81 -234 113 -176 161 209 -138 -11 193 25 -26 403 -235 -247 228
7429B28k53Q7%k10K53J52l42J23K03m70L54r4J42k72L18j99j45L04q2j68M23l41
$$ 228 -25 62 62 -148 105 257 -85 38 241 -229 125 31 173 -99 219 20 -125 179 97 -71 352 11
7451A1M7j54J58K11j87P5J9o6l79J57L47m14J96m1j87M7j9K48k03O3K76k00K72
$$ 11 58 -96 62 273 86 161 180 114 -265 -108 239 -175 21 -20 -207 -160 -179 69 -134 -71 205 5 277
7474B77k72j97J61l9m8L20l21J90k42OK61k72J35p7J82j23Q9l5lj54J32J32k37
$$ 277 5 -192 -31 -70 -118 202 -119 71 -171 -165 96 -176 -41 -118 64 -59 30 -5 -8 -162 -30 102 -135
7497a35M8L52l28j51K18j26j87K49n4J59l70K68l9o1K10K69m85L13K80l05k76
$$ -135 -87 265 -63 -214 4 -122 -309 -60 -114 45 -325 -57 -96 -157 53 322 -163 150 430 125 -151
7518a51q0J86n7Q2l2nN3K14j42m17L25K7j9k12K30K33p2k81j44K55j39K31k25
$$ -151 -231 -45 -102 -20 -52 -57 -4 210 68 -349 -24 3 -16 -228 2 235 163 -118 -262 -7 -146 85 -140
7541a40K49p8l33K16J58k91M09n14L80M47o45L73n34K81K30l54R0K5k06L56l31
$$ -140 109 31 -302 -86 72 -219 190 -324 56 503 -142 231 -303 -22 208 -146 -56 -31 -237 119 -212
7562b12J87J21l76M52j45M1j43m1J67j9J00M4l77N27m36K48j62O8R8k32K87K7
$$ -212 -25 96 -280 172 27 68 -75 -116 51 32 132 176 -201 326 -110 138 -24 44 142 -90 197 224
7584B24j33R1j34k6j70J16K08J32k50J57p0k27O7J54n29K88q3L50l79K44j11j23
$$ 224 91 182 48 22 -148 -32 176 308 58 215 145 -82 -15 139 -390 -102 -185 165 -214 30 -81 -204
7606b04M26N0j88k04J31N7P9j44M1k42O6N32m71K60j07l21L27Q9k76K6J61j78
$$ -204 222 272 84 -120 11 68 147 3 44 -198 -132 400 -71 189 82 -239 88 177 -99 -73 88 -90
7628i0N4P6N1k62K20o1mm2M0J1Q1K9j88lk10M72q5j26j0r9K98j68K20k78K0p0
$$ -90 -36 40 91 -171 49 -12 -16 -58 -18 -7 74 103 -85 -88 -298 174 89 -37 -47 -146 152 -16 204 -74 -54 -124
7654a24K3L3l1J32J57J04r6o7k52J24j9R7M8K7l19J45J38k1K10m88K46j02K08
$$ -124 -101 -68 -99 33 190 294 198 131 -121 3 -16 81 129 156 -163 -18 120 99 309 -179 67 -35 173
7677A73n0k15LJ62j05m2K02k20J43j87j74L69j06j60K08l0M3K13l93K28j85q5
$$ 173 123 -92 -89 73 -32 -74 128 -92 51 -136 -310 59 -47 -207 1 -29 14 227 -166 62 -123 -208
7699b08Q9K7J08Pj97J18j1J30k73K61j57j25L55m48L72K85m44J21k55M29k59K04
$$ -208 -119 -92 16 23 -174 -56 -67 63 -210 51 -106 -231 124 -324 48 333 -111 10 -245 184 -75 129
7721A29l1k69L04j54j7Kj08%J86j24k24J0L66j61K0L48k4k79n6K15j00q4J38k1
$$ 129 98 -171 133 -21 -38 -36 -144 -144 42 -82 -306 -296 70 -91 -71 277 253 -26 -82 133 33 -51 87 66
7745F6m1K64m03j0J90j55J0q2J18L08k06j97K59J8r5j89l3M7M52k69L5l53K08
$$ 66 25 289 -114 -124 66 -89 -79 -161 -43 265 59 -138 121 139 44 -145 -178 -131 321 52 87 -266 -58
7768e8K00m03J74J67j32QL52k79J89j3k66j8k14K35Q8k05J57N3j05j90L17pk19
$$ -58 142 -261 -87 80 -52 -44 308 29 218 205 -61 -79 -293 -58 30 -175 -18 35 -70 -260 57 50 -169
7791a69L78j89k0N6k12K97Qq9k2J33j34m63K78J03L54j16j79j09P3M46o93K39
$$ -169 209 20 0 56 -156 141 149 60 38 171 37 -426 -148 -45 309 193 14 -95 -22 424 -269 -30
7813c0r3J38j1J34k84M3k50M44q5KK6K33n00K37k5O5R9n79L57o7J26J5k1J71k3
$$ -30 -123 15 4 138 -146 -103 -353 91 6 8 34 267 -233 4 -21 44 143 -436 -79 -146 -20 -5 -26 145 122
7838A22Oj05L92k12j32j21Nl67M44j30k46K29J53K5j22J66J8j69L1K85n13J85
$$ 122 128 23 415 203 71 -50 -45 -412 32 -98 -344 -115 38 63 -59 107 125 -44 -13 272 -241 -56
7860e6l8O7M0R3k43K85k10J23K42j71J10k00j17o4K98p8j77K08j28k04J94J1k28
$$ -56 -94 -27 13 106 -137 148 -62 61 303 132 242 42 -75 -139 159 81 -96 112 -16 -220 -26 -15 -243
7883b43M04p7j87M02j82M9l34N18k74k23N0M77l40j51J3p7K17RK60R0m70N8K7
$$ -243 161 84 -103 299 117 166 -168 350 76 -147 -97 380 40 -111 -98 -175 42 51 311 401 -69 -11 16
7906A6j71P6K38l94M20Pk51J19J20O4j49J89k68N5j29q4K78K15l56L6k67K62r3
$$ 16 -155 -79 159 -235 185 192 -59 60 180 244 95 284 16 71 -58 -142 136 351 -5 31 -236 26 -67
7929f7M6L0k5J56rj40Q1j06k57K09K04j41K2j36J70J93k39j5q3J56K56m52K70
$$ -67 -21 9 -16 140 131 -9 72 -34 -291 -82 122 -19 3 -133 37 230 -9 -24 -107 49 305 -147 123
7952A23m7j58K77j59q1KK37L6j88m4n9n9m3j12J96PJ15k3k55L15q6K12j68K32
$$ 123 76 -82 195 36 -45 -43 194 230 42 -2 -61 -120 -163 -275 -79 -72 43 20 -235 80 -6 206 38 270
7976B70m0j30l21J7K18k02J28K26k50m7L33j52m26L11J35j36j64K14r8N13l97
$$ 270 230 100 -221 -204 14 -188 -60 166 -84 -131 202 50 -376 -65 70 -66 -230 -16 -114 399 2
7997BK94m28K16n4K0m8J76j26j35J89j92Kj26M47k44J00j34J79J94k46j04K04
$$ 2 296 -132 84 30 50 2 178 52 -83 106 -86 -84 -210 237 -7 93 -41 138 332 86 -18 186
8019A86j7j32m77L80o8Kj02R9n9J9kK63J02m15Q9J62l90K99R5P8j70j37K89l41
$$ 186 169 37 -440 -60 -128 -126 -228 -129 -188 -169 -171 92 194 -221 -132 30 -360 -61 34 112 -58 -195 94 -247
8043b47L88J89n45L9L2J97N4k24j1q5L11j5q4m3P8n3j6o9K37k25J97j20L6R9j6
$$ -247 141 330 -215 -176 -144 53 107 -117 -128 -213 98 83 -1 -44 34 -19 -35 -104 133 -92 105 -15 21 120 104
8068A04k74J51p9P6L1m8k53R6K48m26K50K17j31j5j24J5k46O97p2k67m0J18j34
$$ 104 -170 -19 -98 -22 9 -39 -292 -196 52 -374 -124 93 -38 -53 -177 -162 -408 289 217 -50 -90 28 -106
8091a06K42q1J28k07j32QK67r3J40j93L37m19J04J79l11L58k22NM52j70j87j47
$$ -106 136 55 183 -24 -156 -148 119 26 166 -27 310 -109 -5 174 -137 221 -1 4 456 286 99 -48
8113d8j70L65k93j34M82l10J21j64M45l32l70M00J45J85k26R9O4k95j14K43j55
$$ -48 -218 147 -146 -280 202 -108 13 -151 294 -38 -408 -8 137 322 96 195 259 -36 -150 93 -62
8134f2P5k98PJ56J82N6l05L35L6k26j28J08J62J79m15P9p2J44R5J08j42J40l96
$$ -62 13 -285 -278 -122 60 116 -189 146 182 -44 -172 -64 98 277 -138 -59 -131 13 108 216 74 214 -182
8157a82k5J91l20p5K34J33j25K30R5l37K12K16p8j63j37J55J50j65L9J06l12K53
$$ -182 -207 -16 -336 -411 -177 -44 -169 61 156 -181 31 247 169 6 -131 24 174 9 48 154 -158 95
8179I5k08l0j01O3M28l03O1J64k50N3J42j30
$$ 95 -113 -143 -244 -181 247 -56 5 169 -81 -28 114 -16
8191a6
$$ Imaginary data points
##PAGE= N=2
##DATA TABLE= (X++(I..I)), XYDATA
0@%%%%%%%%%Qj6J6j6J8k6L2l6M4n2O0p2Q4r6J12j28J46j66J90k19K44k73L10l48
$$ 0 0 0 0 0 0 0 0 0 0 8 -8 8 -8 10 -16 16 -20 24 -28 32 -40 44 -52 60 -68 78 -88 102 -117 127 -146 164 -184
33a84L88m33M82n35N97o63P33q12R00r96J102j221J355j504J674j871K098k364
$$ -184 204 -229 253 -282 315 -348 385 -427 473 -523 579 -642 713 -791 883 -988 1110 -1254
51a254K683l075L567m202N068o322Q304j1936K0753q1030j19716J24651J11976
$$ -1254 1429 -1646 1921 -2281 2787 -3535 4769 -7167 13586 -67444 -187160 -62509 49467
64D9467j8001j26984l4843R0649R2275l6935q6745n710Q4293L5898n8693n3279
$$ 49467 31466 -95518 -130361 -39712 52563 15628 -71117 -76827 7466 43364 -15329 -68608
76f8608N0420P4166k2659r3898j2492R9465O8472p3595j09885J5531J24116N5688
$$ -68608 -18188 55978 33319 -60579 -73071 26394 94866 21271 -88614 -73083 51033 106721
88A06721q7773j03219K6434J12494M2787p3372p6147K4139Q0671K3371n1387m0574
$$ 106721 18948 -84271 -57837 54657 97444 24072 -52075 -27936 52735 76106 24719 -15855
100a5855K8132M5889q180m2612j527M7133J8043m9482m6198L2450P0882L15q1320
$$ -15855 12277 58166 49986 7374 5847 52980 71023 21541 -24657 7793 78675 78990 -2330
113b330n2259N0420Q1271n063q6065n2295M4706P2185J821o5287m5024K4977N1488
$$ -2330 -54589 -4169 77102 72039 -14026 -66321 -21615 50570 52391 -12896 -57920 -32943 18545
126A8545R680l7892l1417J2578K9911J858k3006p293K1140J0199k5323k3078K3743
$$ 18545 28225 -9667 -41084 -28506 1405 3263 -19743 -27036 -5896 4303 -21020 -44098 -20355
139b0355M2746n235n6184k9723M5411O2026r137p2175l8946M7891P0602j237p0311
$$ -20355 22391 17156 -39028 -68751 -23340 38686 29549 -42626 -81572 -33681 36921 35684 -34627
152c4627m4484L8109O6748O675n8053l8602L2806N1088l730m5772j1988M0089
$$ -34627 -79111 -41002 25746 32421 -25632 -64234 -31428 19660 15930 -29842 -41830 -1741
164a741K2821l4827l5110L0463N4627j0756p1352k5151O8590O6320l7716r3568
$$ -1741 21080 -13747 -48857 -18394 36233 25477 -45875 -71026 -2436 63884 26168 -67400
176f7400j6431Q6270O6783m6460r3238r306Q2900N5099m5405p3979M341P0132
$$ -67400 -83831 2439 69222 22762 -70476 -79782 3118 58217 12812 -61167 -56826 13306
188A3306K9863m9182m3493L2710N6007j1213o0552o864O9439M1166n6417p3698
$$ 13306 43169 -6013 -49506 -16796 39211 27998 -32554 -39418 30021 71187 14770 -58928
200e8928K7118R6812K4675q8511p4379M7682J00157P786r3627o0509N1405P9872
$$ -58928 -31810 65002 89677 1166 -73213 -25531 74626 82412 -11215 -71724 -20319 59553
212E9553p020p7165l4251M7996M8208k4976n5046N21N0703J4684m9060l6346L8538
$$ 59553 52533 -24632 -58883 -10887 37321 12345 -42701 -42180 8523 23207 -25853 -62199 -23661
225b3661N9562j4743p2906k2059O9841O4180l5233q3244q496Q0125N5308m2330
$$ -23661 35901 21158 -51748 -73807 -3966 60214 24981 -58263 -66759 13366 68674 26344
237B6344p1250K467O6237L4558l6594m4333J0727M1740R508k9183j6170K2054
$$ 26344 -44906 -42439 23798 58356 21762 -22571 -11844 29896 39404 10221 -5949 16105
249A6105K2468j5297l0286M709L7985J4551l6092l8607J6832N2366J4299m7774
$$ 16105 38573 23276 -7010 -2301 35684 50235 14143 -24464 -7632 44734 59033 11259
261A1259m4273J9911N5088J3757m4268l9887J4718M2002J1107k9245k7060O090
$$ 11259 -33014 -13103 41985 55742 11474 -28413 -13695 28307 39414 10169 -16891 -10801
273a0801K2409O430j4815j2941M023R220m207j2365k56J5417N677k0216k2091
$$ -10801 11608 18038 3223 -9718 -5695 3525 -682 -13047 -13303 2114 7791 -12425 -34516
286c4516J1194L4224Q334l5688l3201J8690M7323J1571m0995l7110J7952M8647
$$ -34516 -23322 10902 19236 -16452 -49653 -30963 16360 27931 -13064 -50174 -32222 16425
298A6425J3273l5745l2828J4408L8391R839k7149k1010J6135K5387l471k4992
$$ 16425 29698 -6047 -38875 -24467 13924 23763 -3386 -24396 -8261 17126 13655 -11337
310a1337k576K7488J3173k7486k7126J9828M3839Q76n0676k9362L9015N3830j0798
$$ -11337 -13913 13575 26748 -738 -27864 -8036 35803 36679 -13997 -43359 -4344 49486 38688
323C8688o1490k4717M6687M9864j7571n6412j4397M3681L3838k2891m0927J781
$$ 38688 -22802 -47519 -832 49032 31461 -24951 -39348 4333 38171 15280 -25647 -23866
335b3866L7293J1592l1598k3504K3722L4214j2469m5041p293M7501L2845l5111
$$ -23866 13427 25019 -6579 -30083 -6361 27853 15384 -29657 -36950 10551 43396 8285
347H285n5048P550O3193K6953m9214n2553J9260O2001J4616m9888l6685K7080
$$ 8285 -46763 -39213 23980 50933 1719 -50834 -31574 30427 45043 -4845 -41530 -14450
359a4450M5741k937m0061j3338L0714K3246k0063k9493R634L5340M311l5997k3476
$$ -14450 31291 28354 -11707 -25045 5669 28915 8852 -20641 -11007 24333 28644 -7353 -30829
372c0829K7341M1019p844m7735j9747L8404M1043j5067m9246j2733L9183L1832
$$ -30829 -3488 37531 29687 -18048 -37795 609 41652 26585 -22661 -35394 3789 35621
384C5621j8967l7695j968L0226J4466j9257j8835R619J7934l671j8560k486J9238
$$ 35621 16654 -21041 -23009 7217 21683 2426 -16409 -6790 11144 7473 -11087 -13573 5665
397E665J0252j6043j9791N440K5680J0411k0369k3907O034K8848J3332j9613k4576
$$ 5665 15917 -126 -19917 -14477 11203 21614 1245 -22662 -16628 12220 25552 5939 -18637
410a8637M276K5833J2760j4375j8620K539J6982P593q085q233J982O148O43l467
$$ -18637 -14361 11472 24232 9857 -8763 -6224 10758 18351 10266 2033 4015 10163 10806 7339
424G339K8L562J084n324o385J956R299M302j0213j5042K30J7210J1284j3691k3533
$$ 7339 7367 10929 12013 6689 304 2260 11559 15861 5648 -9394 -9164 8046 19330 5639 -17894
439a7894j806K3256J5180j5145k4658j659K2031J3432j2868j9334P54J6898P314
$$ -17894 -19700 3556 18736 3591 -21067 -22726 -695 12737 -131 -19465 -18711 -1813 5501
452E501j1338j0777O499J3287k446j5001k096J7638J1729j5187k1587O285K9799
$$ 5501 -5837 -16614 -10115 3172 726 -14275 -16371 1267 12996 -2191 -23778 -17493 12306
465A2306J0179k6839k5203J5019L5648N119l2093k1174K0856L1055k825k8615
$$ 12306 22485 -4354 -29557 -14538 21110 26229 -5864 -27038 -6182 24873 22048 -6567
477f567r823K2255J8678j1814k0779L934K2022M660k1257j3400J6306K3416p560
$$ -6567 -16390 5865 24543 12729 -8050 -4116 17906 22566 1309 -12091 4215 27631 20071
490B0071l0071q924K7199K3597j6600l5003l152L2758J9734k2256l1106M620L1175
$$ 20071 -10000 -18924 8275 31872 15272 -19731 -22883 9875 29609 7353 -23753 -19133 12042
503A2042R541k3714j8248J3565K2219l385k0842k689K0580J1622j5028j7334J0031
$$ 12042 21583 -2131 -20379 -6814 15405 12020 -8822 -11511 9069 20691 5663 -11671 -1640
516a640K4544K991k2383j4946J6114K5397j528k5451j3062J7615K1508n185k3399
$$ -1640 22904 25895 3512 -11434 4680 30077 28549 3098 -9964 7651 29159 23974 575
529E75p854J6373J3639j0142j6216J299J2893J171j2220o338J0399Q602q106j3241
$$ 575 -7279 9094 22733 12591 -3625 -2326 10567 11738 -482 -6820 3579 12181 4075 -9166
543i166K279J4930N459j1511j1396M832J4455M792q931r865K217J1072N553n651
$$ -9166 -6887 8043 13502 1991 -9405 -4573 9882 14674 5743 -4122 -1905 9167 14720 9069
557I069p234l4N781L529k168l232o27L21L43k30Q94L01k464k696P10K755O72j448
$$ 9069 1835 1801 7582 11111 8943 5711 5084 5405 5748 5518 6412 6713 4249 1553 2263 5018 5690 4242
575D242j954j316K59K261L616N7n603m922M184R569J183j0254q208O191J1720
$$ 4242 2288 972 1231 3492 7108 7165 1562 -3360 824 10393 11576 1322 -6886 -695 11025
590A1025k53j2383p116O690Q614k629j0451l378N875L798o632o966J892P224j220
$$ 11025 10772 -1611 -8727 -2037 6577 3948 -6503 -9881 -4006 -208 -6840 -13806 -11914 -4690 -5910
605e910j0787n117Q541R726n536j5400k793J5148J1149r894j7149J607J8260Q228
$$ -5910 -16697 -21814 -13273 -3547 -9083 -24483 -27276 -12128 -979 -10873 -28022 -26415 -8155 73
619G3j3157j3362O610J5662J741j3566n724J1616J0227o808j1562L501J4258L865
$$ 73 -13084 -26446 -19836 -4174 -2433 -15999 -21723 -10107 120 -6688 -18250 -14749 -491 3374
633C374j2238r392R808J5968k74j6040p134J4122J5880l998j6599l335J5849J2328
$$ 3374 -8864 -18256 -8448 7520 7246 -8794 -15928 -1806 14074 10076 -6523 -9858 5991 18319
647A8319q279j4108K425J5134M145j2293q057R164J0587n485j3523p84J2730M751
$$ 18319 10040 -4068 -1643 13491 17636 5343 -2714 6450 17037 11552 -1971 -2755 9975 14726
661A4726j1949j2747N078J3417O31j4655q447P373J0840j677j1944m606Q307P796
$$ 14726 2777 -9970 -4892 8525 9156 -5499 -13946 -6573 4267 2590 -9354 -13960 -5653 2143
675B143l645q044N18Q422L188n823l840O277P746k579q196R55R628M726o553p634
$$ 2143 -1502 -9546 -9028 -606 2582 -3241 -7081 -804 6942 4363 -3833 -2878 6750 11476 4923 -2711
691b711L524Q824J512p735m453L979M767j389m981j082K692K70k742j202K396
$$ -2711 813 9637 11149 3414 -1039 2940 7707 6318 1337 255 2947 3217 475 -727 1669
706A669R01k321k830J169M192R45l477k231K362M408R24l032j487K458L032n73
$$ 1669 2570 249 -2581 -1412 2780 3725 248 -1983 379 4787 5711 2679 1192 3650 6682 6109
722F109j888P38K489k65l337J78M157J266n051m261L791N814j904p487k503N768
$$ 6109 4221 4959 7448 7183 3846 4024 8181 9447 4396 135 3926 9740 7836 349 -2154 3614
738C614M582l704o609P45N652J815m936l540L829M846k258n222L88O375K748n034
$$ 3614 8196 4492 -2117 -1372 4280 6095 1159 -2381 1448 6294 4036 -1186 -798 5577 8325 3291
754C291n797L295Q242J228p602m986N414Q276j204r110k624P961N848n094p691
$$ 3291 -2506 789 9031 10259 2657 -2329 3085 11361 10157 1047 -1577 6384 12232 7138 -553
769e53K688Q159N33p301l634O780O934m153q305J291R037L975p481o710M228Q679
$$ -553 2135 10294 10827 3526 -108 6672 13606 9453 1148 2439 11476 15451 7970 1260 5488 14167
785A4167J213q303m637N153P140k365p638k096O000L757n551o319J627O832o32
$$ 14167 15380 7077 2440 7593 14733 12368 4730 2634 8634 12391 6840 521 2148 8980 8348
800H348p974l950N824N638m398q521o93Q059L060o661o925L243P443K90p003l102
$$ 8348 374 -3576 2248 7886 3488 -5033 -5726 2333 5393 -1268 -8193 -4950 2493 2783 -4220 -7322
816g322M772M665k729n487N22N507J071m699l338L134N106j446o492j609N680
$$ -7322 -2550 2115 -614 -6101 -5579 -72 999 -3700 -7038 -3904 1202 -244 -6736 -8345 -2665
831b665M625l458o293P47N932K881m965l734L577N365j165m719K48N465K772m349
$$ -2665 1960 -1498 -7791 -7044 -1112 1769 -3196 -6930 -3353 2012 847 -3872 -3624 1841 4613 264
847B64k873M040N248j254n101r30O156L444l406n391J739N157O98m336l108K273
$$ 264 -2609 1431 6679 5425 324 -606 5550 8994 5588 197 1936 7093 7791 3455 347 2620
863B620K802j144m411r82L152J255l878l890J836M655j011n908k226M767L966
$$ 2620 5422 4278 -133 -1115 2037 3292 -586 -4476 -2640 2015 1004 -4904 -7130 -2363 1603
878A603l062o105N18O108J768m628l544K990M835r27m270k00N057J863l927k224
$$ 1603 -1459 -7564 -7046 -938 830 -3798 -7342 -4352 483 -444 -4714 -4914 143 2006 -1921 -4145
894d145K669N100n38n166j205M729M023k149m942l67N275L155l548l995J249M817
$$ -4145 -1476 3624 3086 -2080 -3285 1444 5467 3318 -1624 -1991 3284 6439 2891 -1104 145 4962
910D962P64m600k087L461L526k634m684N88N150R55n549l550L694N068j745o271
$$ 4962 5726 1126 -961 2500 6026 3392 -1292 -704 4446 5401 -148 -3698 -4 5064 3319 -2952
926b952j442N027L437l803n058Q96M612Q61m004k960K908L648j850l957O1M346
$$ -2952 -4394 633 4070 267 -4791 -3895 717 1578 -2426 -5386 -2478 1170 -680 -4637 -4576 -230
942b30J567l621l456K637N141J84n305k301M461M657j795n876K41N496K188l432
$$ -230 1337 -2284 -5740 -3103 2038 2222 -3083 -5384 -923 3734 1939 -3937 -3696 1800 3988 556
958E56l657L059L944q76m583j01M369K233m329l797K983M678o48n000k273L625
$$ 556 -3101 -42 3902 3026 -1557 -1658 2711 4944 615 -3182 -199 4479 3831 -1169 -3442 183
974A83L919j956m913r47L938K123l003l169N49L662j23l654j819L286L151l121
$$ 183 4102 2146 -2767 -3714 224 2347 -656 -3825 -3276 386 263 -3391 -5210 -1924 1227 -1894
990a894l898P43N066J488m866l089L621N079r36m838j184M575L474k044m134J693
$$ -1894 -5792 -5049 17 1505 -3361 -6450 -2829 2250 1314 -3524 -4708 -133 3341 1297 -2837 -1144
1006a144L899Q71l337j341K801K675j836l426M52L523J686l892l424K168M734
$$ -1144 2755 3626 289 -1052 1749 4424 2588 -838 -386 3137 4823 931 -2493 -325 4409
1021D409l23m809k563L268L653j267m543p63L769J992k931k834J738L583p80m178
$$ 4409 4086 -723 -3286 -18 3635 2368 -2175 -2938 831 2823 -108 -2942 -1204 2379 1599 -2579
1037b579m58M311K389m091l843K065M747K18m380k874L083M052j245m100p23L046
$$ -2579 -3037 1274 3663 -428 -4271 -2206 2541 2759 -1621 -4495 -1412 2640 1395 -2705 -3428 -382
1053c82K388k336k710J210K832J0l033p60L284K746k386l993J718M627J455l983
$$ -382 2006 -330 -3040 -1830 1002 1012 -2021 -2781 503 3249 863 -3130 -1412 3215 4670 687
1069F87l382L070M883p09m304j822L909K642k097l386R38K953j40l077j360K797
$$ 687 -2695 375 5258 4549 245 -1577 2332 4974 2877 -509 429 3382 3242 165 -1195 1602
1085A602K056k226l646Q48M076P16l597l031J813M303L38l665k208K329L746o48
$$ 1602 3658 1432 -2214 -1366 2710 3426 -171 -3202 -1389 2914 3252 -413 -2621 -292 3454 2806
1101B806l270k59L262J314k294j736J946K802r03l800j12M110J433k762l873J206
$$ 2806 -464 -723 2539 3853 1559 -177 1769 4571 3668 -132 -244 3866 5299 2537 -1336 -130
1117a30M558N7l079k929K518K584k50k985j094K490J697j758j734J105J957j19
$$ -130 4428 4485 1406 -1523 995 3579 3329 344 -750 1740 3437 1679 -55 1050 3007 2888
1133B888k516n92K732J772k195l238P4M134J097l656l590J724L192k29l616j834
$$ 2888 372 -220 2512 4284 2089 -1149 -1075 3059 4156 500 -3090 -1366 1826 1597 -2019 -3853
1149c853K286K168k351k851J097K580m25k703p53L158K179k107l033J009M478
$$ -3853 -1567 601 -1750 -4601 -3504 -924 -1349 -4052 -4805 -1647 532 -1575 -4608 -3599 879
1164H79J222k285k126K190L682O43k596j156K606K368l86k485K83K425N24k262
$$ 879 2101 -184 -2310 -120 3562 4205 1609 453 3059 5427 5041 2556 2839 5264 5788 3526
1180C526j333J896K179j871l760l73L439J143l483l514J304L269r1l277k222J740
$$ 3526 2193 4089 6268 4397 637 264 3703 4846 1363 -2151 -847 2422 2331 -946 -3168 -1428
1196a428K567j071k784Q4K250O16k030j581K163K197r15k853j33L225K162k322
$$ -1428 1139 68 -2716 -2632 -382 234 -1796 -3377 -1214 983 68 -2785 -2918 307 2469 147
1212A47k981P72L402J556k772l089J719L389O84l118j264K816J856j539k030J182
$$ 147 -2834 -2062 1340 2896 124 -2965 -1246 2143 2827 -291 -1555 1261 3117 1578 -452 730
1228G30L270K91l318o70L229L271j885l604J86M106J788k278l755J324L130R72
$$ 730 4000 4291 973 303 3532 6803 4918 1314 1500 5606 7394 5116 1361 2685 5815 6787
1244F787l431j894J561J767o66k742l92J691R67k830k316J716K283j022l398j106
$$ 6787 3356 1462 3023 4790 4124 1382 990 2681 3648 818 -1498 218 2501 1479 -1919 -3025
1260c025L134K170j884l454L09L094J149j859k167J097K570m60j748n69J838Q27
$$ -3025 109 2279 395 -3059 -2750 344 1493 -366 -2533 -1436 1134 674 -1074 -1643 195 1022
1276A022j474j252J175J165l4k043j162J918J809r50k763j46K285J429j431k140
$$ 1022 -452 -1704 -529 636 602 -1441 -2603 -685 1124 174 -2589 -2735 -450 979 -452 -2592
1292b592Q58J815N87j925k17J556J149j150j031J362J707k49k034m99K564J588
$$ -2592 -1734 81 668 -1257 -1474 82 1231 81 -950 412 2119 1870 -164 -663 1901 3489
1308C489j580k500M83K095R23j817k082Q11J636q4j779n11J277Q81j564j230J249
$$ 3489 1909 -591 -108 1987 2910 1093 -989 -178 1458 1374 -405 -916 361 1242 -322 -1552 -303
1325c03J572r6j991p28K652K095r14k789N5L609J868j948k807J428L261L34k576
$$ -303 1269 1173 -818 -1546 1106 3201 2287 -502 -447 3162 5030 3082 275 1703 4964 5298 2722
1342B722j012K307J631j521k066M74K414n41k237j388J496K527j560l489q47K934
$$ 2722 1710 4017 5648 4127 2061 2535 4949 4408 2171 783 2279 4806 3246 -243 -1090 1844
1358A844J636k205k992L64K693R78k997j845J444K103m06k540m51K502J441k001
$$ 1844 3480 1275 -1717 -1353 1340 2318 -679 -2524 -1080 1023 617 -1923 -2374 128 1569 -432
1374d32k200J578K768j1l136r85K187K678j295l372J61K736J798k130k350P43
$$ -432 -2632 -1054 1714 1703 -1433 -2418 -231 2447 1152 -2220 -2059 677 2475 345 -2005 -1262
1390a262K256J112k209j112J420J582q82j523M55J784Q93k170j306J433K097P6
$$ -1262 994 2106 -103 -1215 205 1787 905 -618 -163 1621 2514 344 -962 471 2568 2644
1406B644k816j016J947K043o44k795n73K016J139j872j241K50J525o05j126n61
$$ 2644 -172 -1188 759 2802 2158 -637 -1210 806 1945 73 -1168 -918 607 2 -1124 -1685
1422a685J298O64j232r78P15J736J87j969q47J536J909k37j867l38J677J427p22
$$ -1685 -387 277 -955 -1933 -1218 518 705 -1264 -2111 -575 1334 1097 -770 -1108 569 1996 1274
1439A274j153N88J051P62j694j06J485O42j452o99J115J571j61k302m44J811J087
$$ 1274 121 709 1760 2522 828 722 2207 2849 1397 698 1813 3384 3223 921 477 2288 3375
1456C375m84k195j95K066N21j372p08J065J031q76j194J79J373J75j212r62Q56
$$ 3375 2891 696 501 2567 3088 1716 1008 2073 3104 2228 1034 1213 2586 2761 1549 587 1443
1473A443J738m86k239o93K052J630j261k290K9J877R52j591j498J003J306J6j928
$$ 1443 3181 2695 456 -237 1815 3445 2184 -106 -77 1800 2752 1161 -337 666 1972 1988 60
1490F0l96J810Q73j342j786R17K313k21k330j160J769K206p90k383n42K163J508
$$ 60 -336 1474 2347 1005 -781 136 2449 2228 -102 -1262 507 2713 1923 -460 -1002 1161 2669
1507B669j291k374N55K021K58j560j439J279J307m85k201J31J704P05j436k210
$$ 2669 1378 -996 -441 1580 1838 278 -1161 118 1425 940 -1261 -1130 574 1279 -157 -2367
1523b367R92K411J68k859j434J916K218q36k442m28K214J292j883j207M74J952
$$ -2367 -1375 1036 1204 -1655 -3089 -1173 1045 209 -2233 -2661 -447 845 -1038 -2245 -1771 181
1539A81l45j444l02J331J214q88j809L43K049P21j573j500J192K218J21j942j270
$$ 181 -164 -1608 -1910 -579 635 -253 -2062 -1719 330 1051 -522 -2022 -830 1388 1509 -433 -1703
1556a703J982J265p71j642j3J485M54j391j010J164R75q37j326j02J569J59q95
$$ -1703 279 1544 773 -869 -882 603 1057 -334 -1344 -180 795 -42 -1368 -1470 99 258 -637
1573f37j621Q37J361j06j884j62N41J168r3j508L19O97N23r36l61L65J205o14
$$ -637 -2258 -1421 -60 -166 -2050 -2212 -1671 -503 -596 -2104 -1785 -1088 -565 -1501 -1862 -1497 -292 -906
1591i06r33J66J346L22r68q60Q79J227L6j169p32R58J440n41j381K28J096M74
$$ -906 -1839 -1673 -327 -5 -973 -1833 -954 273 309 -860 -1592 -634 806 265 -1116 -888 208 682
1609F82j081m75P19J086o00j086L99J195L98j012o09L78J622O3j952o99J275R90
$$ 682 -399 -874 -155 931 331 -755 -356 839 1237 225 -384 -6 1616 1679 -273 -972 303 1293
1627A293l97j533k85J202Q15j438q84L39J094O3j700K0P50Q93r68j471L92K036
$$ 1293 896 -637 -922 280 1095 -343 -1227 -888 206 269 -1431 -1411 -661 232 -736 -2207 -1815 221
1645B21L24j650r61J091J908k41j657n11J783J334j062j181M39J994L3j341o40
$$ 221 545 -1105 -2066 -975 933 692 -965 -1476 307 1641 579 -602 -163 1831 1864 523 -117
1662a17J142R32l66j651L0J425O73j528j141M17J231N51k175n06P84J255m85j902
$$ -117 1025 1957 1591 -60 -30 1395 2068 540 -601 -184 1047 1598 -577 -1083 -299 956 471 -1431
1680a431j04J570K81j367q35P82J300n27j395j11J496N01q48j217M64J539M1j263
$$ -1431 -1535 35 316 -1051 -1886 -1104 196 -331 -1726 -1837 -341 160 -688 -1905 -1441 98 139 -1124
1698a124n07L34J106k97q29l32O21Q16m04q92J77J554k01j047l32P16Q70j93j295
$$ -1124 -1631 -1297 -191 -488 -1317 -1649 -1028 -212 -616 -1508 -1331 223 22 -1025 -1357 -641 229 36 -1259
1717a259K93J820L47j250j084Q32J368K2j051o03N59R89m82r94n0R10j55r32n34
$$ -1259 -966 854 1201 -49 -1133 -301 1067 1089 38 -565 -6 983 501 -493 -543 367 212 -720 -1254
1736a254O81P46o10j218m23J434J93q21j265M97J246K29j037p93J275O11j55j041
$$ -1254 -573 173 -437 -1655 -2078 -644 -451 -1272 -2537 -2040 -794 -565 -1602 -2395 -1120 -509 -664 -1705
1754a705L13J413L63r07n03Q51R60J8j216Q1J535N52p15j483O05J233J57r76n62
$$ -1705 -1392 21 384 -523 -1026 -175 785 803 -413 -332 1203 1755 1040 -443 162 1395 1552 576 14
1773A4M93J345n15r29j42J195K56q11n38P00M90j30q75j12R73J093r14j425K56
$$ 14 507 1852 1337 408 266 1461 1717 906 368 1068 1558 1428 553 441 1414 2507 1593 168 424
1792D24J289M57j310q58M33J076l90j158l40P26N11r52r39J78P88m30o16n47N87
$$ 424 1713 2170 860 2 435 1511 1121 -37 -377 349 860 -92 -1031 -853 -65 -495 -1111 -1658 -1071
1811a071O16n72n47j15Q54P37m96j196O35J224P1q45j23M89R24n06n97j40J070
$$ -1071 -455 -1027 -1574 -1689 -835 -98 -594 -1790 -1155 69 140 -705 -828 -339 585 79 -518 -658 412
1830D12K99r67j123R00J026l56j288j40M29Q62p79j035P26Q24k42q41p02P21Q90
$$ 412 711 -256 -1379 -479 547 191 -1097 -1237 -808 54 -725 -1760 -1034 -210 -452 -1293 -1995 -1274 -384
1849c84m67p97l9J143L34n95m01K50R41j47j180N7J027Q59m49j005k4J082L96
$$ -384 -851 -1648 -1687 -544 -210 -805 -1206 -956 -15 -162 -1342 -1285 -258 601 152 -853 -877 205 601
1868F01p52p34O18Q38l75m91l35O47N55n06m70K64R89P8p90l47P56P70m61o91
$$ 601 -151 -885 -267 571 196 -295 -630 17 572 66 -404 -140 849 927 137 -210 546 1316 855 164
1888A64J44N41N77n87o24K75N59Q2o93j16J66R12p68q03J88N00J09n90o56P26
$$ 164 308 849 1426 839 215 490 1049 1131 438 322 488 1400 632 -171 17 517 626 36 -620 106
1908A06P06l05r26j68P87P46j028k59L18R80o9o11k39N82P84j25q18K74R13N74
$$ 106 812 507 -419 -587 200 946 -82 -341 -23 957 888 277 38 620 1404 1279 461 735 1648 2222
1928B222o60o34J56R86j21q58l58O77P47q72q42O0J040J00p90q05L41O20q5r86
$$ 2222 1562 928 1084 2070 1949 1091 733 1410 2157 1285 443 503 1543 1643 853 48 389 1009 924 -62
1948f2k58M52N19n18j030N28Q40k33r83m89N40Q30m11j027m38R26N73o25r18K58
$$ -62 -320 132 651 133 -897 -369 471 238 -745 -1234 -694 136 -275 -1302 -1740 -814 -241 -866 -1784 -1526
1968a526N66L92j169J06P82M62l51n42NN60Q13q58n74O40Q57m0q52k18J061R11
$$ -1526 -960 -568 -1737 -1631 -849 -387 -738 -1280 -1275 -715 98 -760 -1334 -694 163 123 -729 -947 114 1025
1988A025o67k19k87J037K23n65l92N15K39K53p08J48K53O7j86k79J35R0K32n96
$$ 1025 358 139 -148 889 1112 547 155 670 909 1162 454 602 855 922 736 457 592 682 914 318
2008C18l38O2L97J50n57j18J59O6j20o50M19J99K28l75l77L62L81j56l38o1P13
$$ 318 -20 42 439 589 32 -86 73 139 19 -631 -212 -13 215 -160 -537 -175 206 50 -288 -349 364
2029C64N8k50l57K98M66l0l82O8M61J25j62n98N95P4l3k71K5R03l15n38j52K01
$$ 364 422 172 -185 113 579 549 167 235 696 821 659 61 656 730 697 426 451 1354 1039 501 349 550
2051E50N97j80m49k23L19P98p51n24K1Q40q8m98l46J77N28m97o50k25J073j65
$$ 550 1147 967 518 295 614 1412 661 137 158 998 910 412 66 243 771 274 -376 -601 472 307
2071C07o29m30L48P80j33q83n61Q49J007q17j173L23J002M21p12o37M90P55K78
$$ 307 -322 -752 -404 376 243 -640 -1201 -352 655 -162 -1335 -1012 -10 411 -301 -938 -448 307 585
2090E85j203rL34R43l77p64k90J394L90j043q46N51J236L69j718l49R32N48k55
$$ 585 -618 -627 -293 650 273 -491 -781 613 1003 -40 -886 -335 901 1270 -448 -797 135 683 428
2109D28j005J00M89P08o39j078M82O38L57r83j009Q65N81K24j228m29P34J263
$$ 428 -577 -477 12 720 81 -997 -515 123 480 -503 -1512 -647 -66 158 -1070 -1499 -765 498
2127D98p81p54j75J018M39n63j085O65O80j36m80m99P54Q08l89k34m70N68K85
$$ 498 -283 -1037 -1212 -194 245 -318 -1403 -738 -58 -194 -674 -1173 -419 389 0 -234 -704 -136 149
2146A49j81k41l08P32J40l18n98M89K87L49o49m11O91M35j97o24l18N70M88l64
$$ 149 -32 -273 -581 151 291 -27 -625 -136 151 500 -149 -560 131 566 369 -255 -573 -3 485 121
2166A21l48k31J83K04J05j50j52P6O8K04m32k84N91m0J20n74J3J85K98k52n49
$$ 121 -227 -458 -275 -71 34 -116 -268 -192 -124 80 -352 -636 -45 -85 35 -539 -526 -341 -43 -295 -844
2187h44p2Q67M13l62r62L65P66N8m38n84O41O33j26r06L0N94Q59o69k64j84Q19
$$ -844 -916 -49 364 2 -960 -595 171 229 -209 -793 -152 481 355 -551 -521 73 932 263 -1 -185 634
2208F34N09o91r74O09O71M60p16r24O08Q12l7j152o81R12R68m70j302K6J002O40
$$ 634 1143 452 -522 87 758 1218 502 -422 186 998 961 -191 -872 40 1008 538 -764 -738 264 904
2228I04r67j344M25J426N12j418j058Q64J155j24j212o38J451P91p72r38j35J246
$$ 904 -63 -1407 -982 444 956 -462 -1520 -656 499 375 -837 -1475 -24 767 -5 -943 -1078 168
2246A68J036r24j564L65J993l8j328j069J187J367o56j455k67J424Q20p20j644
$$ 168 1204 280 -1284 -919 1074 1036 -292 -1361 -174 1193 537 -918 -1185 239 1059 339 -1305
2263a305J93J384O07j097j310P68J264L04j846o85J356J068m08j659l73J009J148
$$ -1305 -1112 272 879 -218 -1528 -760 504 808 -1038 -1723 -367 701 293 -1366 -1739 -730 418
2280D18o65j445K07J242N66j333q53K00P71O08j189n95O60J230J02j509n03J105
$$ 418 -247 -1692 -1485 -243 323 -1010 -1863 -1663 -892 -284 -1473 -2068 -1408 -178 -76 -1585 -2088 -983
2298i83J134k87j406M6J071Q32m02j396N28J157O15r53r56N35J180O79j517n06
$$ -983 151 -136 -1542 -1496 -425 407 5 -1391 -863 294 909 -44 -1000 -465 715 1394 -123 -629
2316f29P31R62p8j406o4P94J031n47j228J4J162N16p27j270J06J479L82q88j391
$$ -629 102 1064 986 -420 -484 310 1341 794 -434 -420 742 1258 531 -739 -633 846 1228 340 -1051
2335a051N21J184P15j658p19M32J729J06j750n95J027J451n53j769l14J590Q47
$$ -1051 -530 654 1369 -289 -1008 -576 1153 1259 -491 -1086 -59 1392 839 -930 -1244 346 1193
2352A193q33j427K52J772M05j652j000O46J788Mj668j128J527J387m99j640m22
$$ 1193 360 -1067 -815 957 1362 -290 -1290 -644 1144 1148 -520 -1648 -121 1266 767 -873 -1295
2369a295J527J285r47j689j2K332L84j383j851J091J804L02j985j095J286J540
$$ -1295 232 1517 570 -1119 -1131 1201 1585 202 -1649 -558 1246 1548 -437 -1532 -246 1294
2385A294o12k180n00J734J421j200j955K47J687O98j511j709P70J909J0j829j234
$$ 1294 682 -1498 -1998 -264 1157 -43 -1998 -1751 -64 634 -877 -2586 -1816 93 103 -1726 -2960
2402b960J621J667n68j893l51J711J218j027j679K16J970R31j545j821R86J686
$$ -2960 -1339 328 -240 -2133 -2484 -773 445 -582 -2261 -2045 -75 856 -689 -2510 -1524 162
2418A62O55j780j392J021K233m25j935r31J834J685j036j947Q9J708Q52r73j861
$$ 162 817 -963 -2355 -1334 899 474 -1461 -2392 -558 1127 91 -1856 -1767 -59 793 -180 -2041
2435b041Q08J758N57j702r95P96J939k13j520j195J674J393o33j431m32J555J399
$$ -2041 -1233 525 1082 -620 -1615 -819 1120 907 -613 -1808 -134 1259 626 -805 -1237 318 1717
2452A717j074j771K40J331J164j283j528J090J328K73j646r82J028J645j75j285
$$ 1717 643 -1128 -888 443 1607 324 -1204 -114 1214 1487 -159 -1141 -113 1532 1357 72
2468G2r11J175J586p55j774j40J635J204r35j683K17J367J020j287j855N37K302
$$ 72 -839 336 1922 1167 -607 -747 888 2092 1157 -526 -309 1058 2078 791 -1064 -527 1775
2485A775Q0j935j484J520J804m94k175p11J715J530p62k194k12J732P54r92j900
$$ 1775 1855 -80 -1564 -44 1760 1266 -909 -1620 95 1625 863 -1331 -1543 189 943 -49 -1949
2502a949O83J805K90j650j599J355J816K56k148j046J533K055p92k111m67J739
$$ -1949 -1266 539 829 -821 -2420 -1065 751 1007 -1141 -2187 -654 1401 609 -1502 -1969 -230
$$ [...]
8191C4
##END NTUPLES=NMR FID
##END=
