##TITLE=1H_K-338/1
 CDCl3
 8 sc, 
 15.02.2022
##JCAMPDX= 6.0         $$ Bruker NMR JCAMP-DX V2.0
##DATA TYPE= NMR FID
##DATA CLASS= NTUPLES
##ORIGIN= UXNMR, Bruker Analytische Messtechnik GmbH
##OWNER= root
$$ XWIN-NMR		Version 3.5
$$ Tue Feb 15 10:30:13 2022 Russian Standard Time (UT+4h)  she@DPX200
##.OBSERVE FREQUENCY= 200.131346
##.OBSERVE NUCLEUS= ^1H
##.DELAY= (6, 6)
##.ACQUISITION MODE= SIMULTANEOUS
##.ACQUISITION SCHEME= undefined
##.AVERAGES= 24
##.DIGITISER RES= 18
##SPECTROMETER/DATA SYSTEM= spect
##.PULSE SEQUENCE= zg30
##.SOLVENT NAME= CDCl3
##.SHIFT REFERENCE= (INTERNAL, CDCl3, 0, 15.7039)
##AUDIT TRAIL= $$ (NUMBER, WHEN, WHO, WHERE, WHAT)
$$ ##TITLE= Audit trail, XWIN-NMR		Version 3.5
$$ ##JCAMPDX= 5.01
$$ ##ORIGIN= Bruker BioSpin GmbH
$$ ##OWNER= she
$$ F:/spectra/data/she/nmr/H-F/1/audita.txt
$$ ##AUDIT TRAIL=  $$ (NUMBER, WHEN, WHO, WHERE, WHAT)
(   1,<2022-02-15 10:28:19.12 +0400>,<she>,<DPX200>,
      <created by zg, POWCHK disabled, PULCHK disabled
       configuration hash MD5:
       00 E9 B6 7A A2 85 ED C7 34 08 36 98 17 FE 4E 26
       data hash MD5: 16K
       BF 5E 5E E4 78 DC 62 40 18 15 2C AC 5D 38 71 39>)
$$ ##END=
$$ 
$$ hash MD5
$$ A6 5B 9E 1D 98 5F 10 EA A8 90 D0 C4 4E FC 26 70
##$RELAX= 
##$RELAX= 
##$RELAX= 
##$RELAX= 
##$RELAX= 
##$RELAX= 
$$ Bruker specific parameters
$$ --------------------------
##$DU= <F:/spectra>
##$EXPNO= 1
##$NAME= <H-F>
##$PROCNO= 1
##$TYPE= <nmr>
##$USER= <she>
##$AMP= (0..31)
100 100 100 100 100 100 100 100 100 100 100 100 100 100 100 100 100 100 
100 100 100 100 100 100 100 100 100 100 100 100 100 100 
##$AQSEQ= 0
##$AQ_mod= 1
##$AUNM= <au_zg>
##$AUTOPOS= <>
##$BF1= 200.13
##$BF2= 200.13
##$BF3= 200.13
##$BF4= 200.13
##$BF5= 200.13
##$BF6= 200.13
##$BF7= 200.13
##$BF8= 200.13
##$BYTORDA= 1
##$CFDGTYP= 0
##$CFRGTYP= 5
##$CHEMSTR= <none>
##$CNST= (0..31)
1 1 145 1 1 1 1 1 1 1 1 1 1 1 1 1 1 1 1 1 1 1 1 1 1 1 1 1 1 1 1 1 
##$CPDPRG= <>
##$CPDPRG1= <>
##$CPDPRG2= <>
##$CPDPRG3= <>
##$CPDPRG4= <mlev>
##$CPDPRG5= <mlev>
##$CPDPRG6= <mlev>
##$CPDPRG7= <mlev>
##$CPDPRG8= <mlev>
##$CPDPRGB= <>
##$CPDPRGT= <>
##$D= (0..31)
0 1.2 0 0 0 0 0 0 0 0.06 0 0.03 0 0 0 0 0.0002 0 0 0 0 0 0 0 0 0 0 0 0 
0 0 0 
##$DATE= 1644906498
##$DBL= (0..7)
120 120 120 120 120 120 120 120 
##$DBP= (0..7)
150 150 150 150 150 150 150 150 
##$DBP07= 0
##$DBPNAM0= <>
##$DBPNAM1= <>
##$DBPNAM2= <>
##$DBPNAM3= <>
##$DBPNAM4= <>
##$DBPNAM5= <>
##$DBPNAM6= <>
##$DBPNAM7= <>
##$DBPOAL= (0..7)
0.5 0.5 0.5 0.5 0.5 0.5 0.5 0.5 
##$DBPOFFS= (0..7)
0 0 0 0 0 0 0 0 
##$DE= 6
##$DECBNUC= <off>
##$DECIM= 32
##$DECNUC= <off>
##$DECSTAT= 4
##$DIGMOD= 1
##$DIGTYP= 9
##$DL= (0..7)
0 120 120 120 120 120 120 120 
##$DP= (0..7)
150 150 150 150 150 150 150 150 
##$DP07= 0
##$DPNAME0= <>
##$DPNAME1= <>
##$DPNAME2= <>
##$DPNAME3= <>
##$DPNAME4= <>
##$DPNAME5= <>
##$DPNAME6= <>
##$DPNAME7= <>
##$DPOAL= (0..7)
0.5 0.5 0.5 0.5 0.5 0.5 0.5 0.5 
##$DPOFFS= (0..7)
0 0 0 0 0 0 0 0 
##$DQDMODE= 0
##$DR= 18
##$DS= 0
##$DSLIST= <SSSSSSSSSSSSSSS>
$$ [...]
##$SUBNAM2= <"">
##$SUBNAM3= <"">
##$SUBNAM4= <"">
##$SUBNAM5= <"">
##$SUBNAM6= <"">
##$SUBNAM7= <"">
##$SUBNAM8= <"">
##$SUBNAM9= <"">
##$SW= 18.0517287032376
##$SWIBOX= (0..15)
0 0 2 0 0 0 0 0 0 0 0 0 0 0 0 0 
##$SW_h= 3612.71676300578
##$TD= 16384
##$TD0= 1
##$TE= 0
##$TE2= 300
##$TE3= 300
##$TEG= 300
##$TL= (0..7)
0 120 120 120 120 120 120 120 
##$TP= (0..7)
150 150 150 150 150 150 150 150 
##$TP07= 0
##$TPNAME0= <>
##$TPNAME1= <>
##$TPNAME2= <>
##$TPNAME3= <>
##$TPNAME4= <>
##$TPNAME5= <>
##$TPNAME6= <>
##$TPNAME7= <>
##$TPOAL= (0..7)
0.5 0.5 0.5 0.5 0.5 0.5 0.5 0.5 
##$TPOFFS= (0..7)
0 0 0 0 0 0 0 0 
##$TUNHIN= 0
##$TUNHOUT= 0
##$TUNXOUT= 0
##$USERA1= <user>
##$USERA2= <user>
##$USERA3= <user>
##$USERA4= <user>
##$USERA5= <user>
##$V9= 5
##$VALIST= <valist>
##$VCLIST= <CCCCCCCCCCCCCCC>
##$VD= 0
##$VDLIST= <DDDDDDDDDDDDDDD>
##$VPLIST= <PPPPPPPPPPPPPPP>
##$VTLIST= <TTTTTTTTTTTTTTT>
##$WBST= 1024
##$WBSW= 4
##$XGAIN= (0..3)
0 0 0 0 
##$XL= 0
##$YL= 0
##$YMAX_a= 1110817
##$YMIN_a= -413477
##$ZGOPTNS= <>
##$ZL1= 120
##$ZL2= 120
##$ZL3= 120
##$ZL4= 120
##$ABSF1= 10
##$ABSF2= 0
##$ABSG= 5
##$ABSL= 3
##$ALPHA= 0
##$AQORDER= 0
##$ASSFAC= 0
##$ASSFACI= 0
##$ASSFACX= 0
##$ASSWID= 0
##$AUNMP= <proc_1d>
##$AZFE= 0.1
##$AZFW= 0.1
##$BCFW= 1
##$BC_mod= 2
##$BYTORDP= 1
##$COROFFS= 0
##$CY= 11.3945322036743
##$DATMOD= 1
##$DC= 2
##$DFILT= <>
##$DTYPP= 0
##$F1P= 2.36226072786647
##$F2P= -0.459571619588291
##$FCOR= 0.5
##$FTSIZE= 0
##$FT_mod= 4
##$GAMMA= 1
##$GB= 0.15
##$INTBC= 1
##$INTSCL= 1
##$ISEN= 128
##$LB= 0.24
##$LEV0= 0
##$LPBIN= 0
##$MAXI= 10000
##$MC2= 0
##$MEAN= 0
##$ME_mod= 0
##$MI= 1.114404
##$NCOEF= 0
##$NC_proc= 0
##$NLEV= 6
##$NOISF1= 3.799351
##$NOISF2= 2.8
##$NSP= 1
##$NTH_PI= 0
##$NZP= 0
##$OFFSET= 15.70392
##$PC= 1
##$PHC0= -16226.93
##$PHC1= 6.600782
##$PH_mod= 1
##$PKNL= yes
##$PPARMOD= 0
##$PSCAL= 0
##$PSIGN= 0
##$REVERSE= no
##$SF= 200.130013532006
##$SI= 16384
##$SIGF1= 3
##$SIGF2= 2
##$SINO= 400
##$SIOLD= 16384
##$SREGLST= <1H.CDCl3>
##$SSB= 0
##$STSI= 0
##$STSR= 0
##$SW_p= 3612.71676300578
##$SYMM= 0
##$S_DEV= 0
##$TDeff= 0
##$TDoff= 0
##$TI= <>
##$TILT= no
##$TM1= 0
##$TM2= 0
##$TOPLEV= 0
##$USERP1= <user>
##$USERP2= <user>
##$USERP3= <user>
##$USERP4= <user>
##$USERP5= <user>
##$WDW= 1
##$XDIM= 8192
##$YMAX_p= 0
##$YMIN_p= 0
$$ End of Bruker specific parameters
$$ ---------------------------------
##NTUPLES= NMR FID
##VAR_NAME=  TIME,          FID/REAL,        FID/IMAG
##SYMBOL=    X,             R,               I
##VAR_TYPE=  INDEPENDENT,   DEPENDENT,       DEPENDENT
##VAR_FORM=  AFFN,          ASDF,            ASDF
##VAR_DIM=   8192,          8192,            8192
##UNITS=     SECONDS,       ARBITRARY UNITS, ARBITRARY UNITS
##FACTOR=    0.0002768,     1,               1
##FIRST=     0,             0,               0
##LAST=      2.2672688,     0,               0
##MIN=       0,             -413477,         0
##MAX=       2.2672688,     1110817,         0
$$ Real data points
##PAGE= N=1
##DATA TABLE= (X++(R..R)), XYDATA
0 0 0 0 0 0 0 0 0 0 0 0 -24 24 -24 24 -48 48 -63 72 -96 120 -131 168 -192 216 -264 310 -359 408 -474 539
30 539 -622 700 -796 908 -1023 1151 -1293 1450 -1619 1809 -2007 2237 -2481 2745 -3034 3351
46 3351 -3701 4080 -4497 4954 -5461 6016 -6630 7316 -8085 8951 -9935 11069 -12387
59 -12387 13943 -15809 18104 -20994 24776 -29959 37521 -49691 72507 -130651 622635 1110817
71 1110817 599382 813893 473272 188848 113044 82240 -139553 -74398 -102607 -253480 -254832
82 -254832 -104689 -253097 -314655 -135351 -29478 -90653 18712 144609 128687 51602 56370
93 56370 3369 -62414 -38958 -24343 -93499 -34698 56925 3086 -76007 -30157 13369 -8102
105 -8102 -26085 -7834 21912 85261 83411 -2804 8575 85291 35475 -30621 -6 41240
117 41240 46869 25195 -9157 4838 42643 -562 -85760 -70443 -18383 -50690 -59775 7297
129 7297 34998 29084 20696 -18478 -23527 16130 1295 -52718 -23832 47619 8874 -67095 -31646
142 -31646 5528 -49309 -84664 -67498 -49215 -18713 4080 -21820 -30961 27054 26668 -62417 -55905
155 -55905 21097 -3064 -38044 6405 26314 19480 38294 24877 -11546 16428 50745 1214
167 1214 -20109 50606 65605 12892 15740 43791 45031 31520 6862 -2746 23028 27200 -21877
180 -21877 -46398 3305 20743 -43291 -67887 -30399 -23390 -49744 -60366 -32405 9554 17430
192 17430 1770 7893 48120 64414 24269 5770 29170 24503 7772 8827 9170 23259 35822
205 35822 8912 -14425 9750 33045 1522 -21990 9032 23427 6058 -1466 -8148 1247 16184
218 16184 -17428 -47021 -6799 28588 -5778 -32416 14295 42124 5430 -9034 10884 18675
230 18675 19786 2919 -19478 -2605 19567 -4226 -33880 -11976 13919 -14176 -31835 -5948
242 -5948 3690 -732 -1701 -19888 -21071 893 -8486 -37214 -20986 19858 8281 -22435 323
255 323 27119 14608 -1278 -11338 -1979 24758 18773 -5114 11311 41014 20143 -24528 -16699
268 -16699 10088 -3419 -19079 -12935 -2842 14459 12307 -13638 -15034 5650 -2419 -31601 -27511
281 -27511 4220 6795 -8305 -6528 -3624 2918 2307 -22114 -23528 8721 11097 -17091 -13685 20723
295 20723 20367 -9107 -7169 10303 11319 4494 -7706 -3749 24746 23674 -9703 -13364 14517 15660
309 15660 -12071 -11998 9328 8286 1814 -2494 -8926 7716 19605 -6104 -19158 5173 19579
322 19579 227 -11995 5125 9324 -4126 -11877 -13877 -183 13507 -7150 -21825 3552 15372
335 15372 -10187 -22462 60 10164 -9353 -13769 800 10047 13042 -1897 -14528 4033 14503
348 14503 -5239 -13759 9561 24897 10787 35 8261 12599 14804 6188 -12282 -1957 18007
361 18007 2590 -17785 -5434 12421 -192 -21236 -14594 -1049 1784 -3300 -12415 -3746 14880
374 14880 1617 -18156 -1442 16003 858 -16302 -5254 9317 3203 -3876 -3142 2109 12953
387 12953 5872 -9021 4999 22735 12683 -6320 -3947 8433 4437 -8581 -13748 -11876 -456
400 -456 -964 -19408 -13133 13256 9176 -12626 -10166 8809 10509 -2895 -2138 9089 17162 13931
414 13931 -1783 -1678 18095 11613 -10730 -7635 7447 3894 -10122 -9699 -1865 -2146 -7397 -15607
428 -15607 -17098 1449 6407 -9965 -8444 9546 10089 -3398 -6945 2795 7503 1097 -9504 -11095
442 -11095 5435 12888 -7754 -12937 8413 10992 -4515 -5187 10917 18783 10672 4067 4869 10470
456 10470 12443 -5445 -15171 1073 4370 -11192 -10580 3155 7003 -1255 -7604 -6851 -757 6230
470 6230 -623 -9591 4987 17323 1811 -6665 5137 11170 2578 -6842 -5056 3318 5756 -2507
484 -2507 -14153 -5157 6079 -11520 -24578 -7413 4278 -5115 -9658 -670 8476 8724 4046 -1137
498 -1137 2705 12066 2017 -12120 1288 12833 2141 -6818 -3264 1744 2965 1240 486 6222
512 6222 19667 17377 1055 5793 19721 8212 -10273 -10844 -4530 -6537 -15513 -17124 -11317 -4842
526 -4842 -8821 -20430 -14437 2729 -1438 -13110 -4515 6891 3828 -3568 -2674 3694 6221 4202
540 4202 -2106 414 15475 16769 2512 5521 16478 12819 2337 -868 4719 9512 5886 -4005
554 -4005 -7147 3522 5783 -10247 -12407 3798 4411 -5986 -6478 2383 6728 729 -8011 -8168 -1608
569 -1608 663 -8335 -8798 5775 6200 -4519 -4036 3590 5710 568 -5180 -4158 1653 3348 -3434
584 -3434 -8740 942 6156 -7021 -11681 -1279 5623 2536 -4162 -1163 8152 9845 2083 -2392 7348
599 7348 15157 4270 -3512 5583 11344 4555 -3150 -2390 2857 1101 -6527 -9074 -3374 161 -7670
614 -7670 -14258 -6603 -1714 -4845 -5686 -3447 2480 4707 -2054 -5241 487 4342 -4349 -13400 -6261
629 -6261 3061 -1875 -6649 -2836 3750 6109 -498 -2701 6966 15786 9524 222 5542 13790 6069
644 6069 -4339 -1016 1865 -748 -5105 -7795 -3425 2008 -1961 -8551 -5734 3277 1758 -5128 -1130
659 -1130 4164 2792 -571 -3201 -103 4985 2491 -3656 -1580 6844 5130 -4391 -2938 5659 3380
674 3380 -4400 -5979 -1030 4158 58 -6423 -2877 5066 3798 -4374 -3644 6903 5636 -1480 -1452 1675
690 1675 5294 3732 -1693 -1541 3855 4745 -938 -1622 7008 8355 642 -704 2094 4630 2974 -3083
706 -3083 -4329 2904 2493 -6270 -7995 -578 1535 -7391 -9920 -2743 -79 -2029 -4758 -3321 2723
721 2723 2532 -4213 -4171 3410 6357 -534 -3787 2372 4359 800 -942 -1318 2306 4338 -1267 -4909
737 -4909 1731 5025 -274 -5755 -1196 4458 229 -2067 -65 3584 4467 -1806 -6354 308 4319
752 4319 -1018 -5714 -402 5588 638 -3275 343 2510 1414 -2196 -5236 274 4999 527 -3817
767 -3817 -963 2372 -1248 -6628 -3968 68 -42 -1596 -4479 -731 4652 1308 -4812 -1384 4254
782 4254 2232 -2874 96 6528 5594 1507 -1662 814 5507 2537 -3763 696 5924 3900 -2333
797 -2333 -1040 3913 1905 -2793 -3901 -2331 827 647 -4556 -2473 2054 -912 -5946 -5005 328 1560
813 1560 -2084 -2166 463 2485 2205 -2345 -2317 4000 2685 -2390 -1197 4906 5588 279 -1817 1562 2674
830 2674 315 -2103 -1708 3712 3838 -2740 -2647 2021 2989 -2434 -4424 -1051 993 -110 -947 -904 2445
847 2445 4263 -1258 -2524 1482 3228 436 -2111 1187 3449 1109 -1282 -1555 1807 2764 -2484 -4659
863 -4659 247 1668 -2598 -3860 -772 2179 -1264 -4529 -1690 1315 1782 -1520 -3831 1345 4270
878 4270 231 -1541 1605 3676 2097 -1034 260 3080 3822 1576 -1986 391 4107 268 -2712
893 -2712 -398 2382 596 -2846 -2096 584 783 -2054 -3927 -1879 1021 -1122 -4282 -358 3030 -65
909 -65 -2378 -1224 1985 1516 -1489 -2032 -259 2032 745 -3285 -68 3951 1159 -2028 -1521 1078
925 1078 1924 -139 -1466 -218 1812 677 -3584 -2843 1904 377 -3465 -2450 1001 2785 657 -678
941 -678 1682 3475 1783 -762 -848 4415 2675 -1893 -1095 1159 1079 -1228 -1998 -236 582 -985 -2410
958 -2410 -2045 990 1057 -3245 -4306 -168 30 -2152 -3707 -1270 926 186 -1876 -1313 2294 3055 -522
975 -522 -1647 2968 3948 994 123 2367 3934 1724 -270 434 2318 2501 -360 -1603 1860 2604 -1013
992 -1013 -1581 -137 27 -903 -2919 -2522 -48 755 -844 -2412 -209 2376 -766 -2346 241 1286
1008 1286 567 -1834 -951 1012 1181 -955 -2178 148 1750 -591 -2600 868 2308 952 -897 -448
1024 -448 1164 1817 30 -813 822 1819 -205 -2453 39 1909 -32 -1826 -1255 269 1091 34
1040 34 -819 896 2483 1073 -1867 -218 2801 1007 -1077 -656 337 423 -1045 -2566 -1354 -138 -2495
1057 -2495 -4071 -2621 403 -447 -2978 -1054 919 1157 150 273 1979 3221 1068 -724 333 2262
1073 2262 2445 -197 -281 1657 998 18 -557 41 1934 547 -1388 -735 1178 1295 -1854 -1820 289 309
1091 309 -1114 -1629 -560 1009 407 -1730 -1388 504 937 -643 -1147 1299 1179 -1121 -510 776 944
1108 944 278 -1036 -344 1174 1922 -140 -1052 1001 1805 -1274 -1826 244 864 402 -1045 -2059 912
1125 912 1193 -528 -1059 1016 2022 -500 -842 793 2079 1109 160 -726 760 733 -760 -937 461
1142 461 833 -594 -2046 -260 459 -279 -1629 -951 225 563 -1286 -1416 135 754 -354 -1710 -34
1159 -34 1867 502 -739 -39 888 1460 -340 -798 1187 1812 307 -955 -43 1840 852 -562 -122
1176 -122 850 670 -391 -1021 586 1045 -346 -1254 -946 689 -89 -878 -431 510 66 -268 -1291 30
1194 30 1345 220 -1209 -268 1040 565 -666 -133 929 695 -871 -662 131 1201 203 -1763 -1006
1211 -1006 423 345 -1580 -1201 580 494 -580 -160 -128 1281 1094 -473 -58 1344 1294 -346 -382 1181
1229 1181 868 -686 -567 663 716 641 -1168 -686 466 291 -1203 -896 566 607 -724 -1307 -436 193
1247 193 -359 -783 -773 144 403 -760 -1123 917 963 -263 -987 476 1394 539 286 70 771 822 -442
1266 -442 -751 810 834 -121 -1019 341 1008 69 -432 -475 321 105 -936 -1417 181 786 -693 -1003 -84
1285 -84 685 -423 -969 -182 468 543 -351 -578 423 1369 126 -943 151 361 -140 -1145 -222 325 32
1304 32 -569 -1133 -24 1174 31 -1261 78 633 174 -147 -292 892 570 -160 -356 576 1823 1052
1322 1052 -310 143 1370 480 -325 -660 269 651 -595 -1249 -292 839 54 -919 -1005 379 -136 -919
1340 -919 -209 44 391 -404 -672 294 702 413 -1326 -220 712 356 -564 270 1215 951 -108 -385 102
1359 102 596 966 -45 101 546 964 -633 -514 562 733 -681 -929 -178 466 351 -629 -596 99 916
1378 916 -523 -712 436 404 -51 -450 43 373 -367 -811 -57 804 178 -1258 -799 484 538 -617 -624 89
1398 89 459 105 -505 -389 464 336 -657 -793 47 1035 -89 -254 427 323 189 279 206 507 1069 252 -174
1419 -174 162 1216 301 -401 376 -94 -278 -151 -540 239 129 -1014 -1269 -321 423 -525 -841 164 439
1438 439 -242 -542 -267 586 218 -215 -592 290 927 1 -418 -257 814 80 -361 119 210 367 563 -47
1458 -47 268 526 117 245 505 935 -76 -665 -291 -69 -83 -522 -591 -76 356 -427 -419 306 1142 74 -767
1479 -767 85 789 104 146 -600 91 769 -178 -895 -501 308 362 -982 -643 459 172 -64 -245 -75 270
1499 270 414 -334 78 689 -47 -336 65 677 101 119 -309 99 -211 294 -202 111 662 525 186 132 590
1520 590 186 -441 -361 -153 -467 -54 -558 -445 -237 -182 -391 -991 -465 386 -501 -380 403 533 235 104 140
1541 140 898 474 176 191 175 894 104 -413 274 185 -431 -119 264 593 222 -283 -258 56 289 -27 -70 267
1563 267 556 232 -33 -127 515 701 -433 -341 322 293 274 -613 -119 246 -159 -189 91 -100 89 -499 -26
1584 -26 -152 218 -156 -784 -286 11 -377 -926 -445 192 341 -407 -195 173 227 207 -293 90 809 406 -315
1605 -315 216 835 903 122 -454 331 158 4 -523 56 413 153 -80 -370 169 157 -280 -337 -86 -3 -425
1626 -425 -646 26 636 143 -351 -642 -106 333 -165 -63 311 295 114 -196 -2 454 195 57 -119 10
1646 10 326 312 -210 464 160 -145 -354 136 139 447 -146 -219 442 -22 -33 -423 286 35 18 -247 194 -174
1668 -174 217 -219 -54 -63 244 -338 -78 263 317 -13 -664 -351 -237 106 -267 -507 8 -14 -261 -590 -75
1689 -75 138 51 50 -97 468 661 143 -25 270 186 -61 77 183 227 298 -169 -201 82 -294 274 -461 -49 199
1712 199 -435 -353 -109 800 129 -452 -407 -88 -181 -170 -723 5 149 170 -186 83 281 -91 -143 -451 313 272
1734 272 257 85 58 38 101 -257 -136 165 359 -278 -279 -202 -73 -203 -124 -118 -18 -366 -222 179 239 176 -352 128
1758 128 -84 340 181 106 -140 395 478 -100 -186 -84 322 -360 -52 50 343 -220 -550 70 -87 299 -225
1779 -225 -123 162 -20 -202 -228 -223 -42 -338 -195 112 168 508 -3 149 400 403 -268 -406 195 -198 -142 70
1801 70 -41 -15 272 -638 248 -165 496 -257 -401 -41 21 -127 -246 -165 -66 133 -243 115 191 158 117 -344 224
1824 224 326 -8 -167 190 467 -317 103 -70 30 -201 -175 -142 133 292 -2 30 119 485 367 -65 95
1845 95 56 303 40 -204 -185 381 426 -149 -205 400 94 44 476 69 136 -156 -269 -39 -125 -295 128 -66 86
1868 86 -124 -218 -290 221 -153 -359 -173 -341 238 164 -224 -139 372 222 193 261 -31 -364 557 -50 98 87 -40
1891 -40 -192 14 646 181 -385 239 459 -38 -4 -206 -291 450 -206 583 -529 164 -743 -486 -187 11 53
1912 53 -195 -65 -195 456 297 -152 1 468 430 605 86 -264 101 -650 -120 130 177 -61 -312 -535 -73
1933 -73 -235 -423 -237 -88 919 181 -287 211 -227 300 -295 15 532 -232 111 422 231 -7 135 -490
1953 -490 -2 301 90 240 -268 248 307 -6 -214 -490 486 -272 -79 -636 112 -285 -372 -16 384 -65 69
1974 69 483 -216 -218 52 -236 99 -333 66 137 304 -102 156 -6 -250 10 151 131 -105 -62 257 656 -413
1996 -413 254 -442 273 -32 147 -209 -420 -7 -203 311 104 223 -295 -582 194 151 233 516 -130 -206 264
2017 264 -56 140 -71 147 107 -182 88 -89 176 -120 -225 -34 -10 56 81 -152 169 -322 218 35 8 74
2039 74 -41 305 -301 80 -220 -94 45 -119 -109 -171 345 49 134 -108 -50 332 79 49 -112 -400 -95 -147
2061 -147 352 133 -169 -293 -366 -341 25 131 -153 59 -148 189 272 -389 174 592 406 -332 36 301 -488
2082 -488 -135 -93 164 -87 -178 -41 417 -237 -467 -15 183 -19 -268 -101 -47 45 -88 -194 -228 173 -275 286
2104 286 294 338 332 -687 -52 282 267 94 -159 -183 357 7 218 -264 148 -255 -247 -494 52 215 282 360 3
2127 3 -328 479 832 -505 30 73 284 -169 -589 303 -143 194 160 -351 205 -95 81 -141 -96 -76 90 232
2149 232 166 138 92 -179 120 -176 337 -14 97 -247 -12 -10 -139 -75 134 -235 332 275 -4 70 -459 -357 419
2172 419 199 239 -214 3 -372 -23 156 -108 -57 70 -84 -679 -94 -185 172 -111 -307 156 -39 -46 89 196
2194 196 -230 357 16 146 70 -212 185 -28 145 -121 -303 210 58 -166 -31 -227 118 62 -149 215 370
2215 370 151 -238 255 425 112 262 -348 242 365 95 289 198 121 95 276 28 70 473 -407 14 -175
2236 -175 -215 335 -404 -227 205 -247 40 -7 -22 218 -280 -335 -248 336 -428 -258 437 -141 79 -207 125 139
2258 139 -294 90 127 -264 -190 -139 567 184 229 -210 39 -128 -177 -29 67 -441 57 20 -340 478 -214 89
2280 89 -122 80 67 90 69 -219 -188 511 202 86 296 -40 -383 298 -140 -118 181 -99 -319 -73 82 33
2302 33 105 125 197 439 -35 -124 49 21 298 -336 -174 242 -237 -170 48 -170 -294 43 509 189 -251 -203 216
2325 216 -258 -29 -126 109 391 63 -30 2 -43 -98 -191 -197 249 -16 -69 -239 -36 -248 55 120 -221 137 -244
2348 -244 -98 10 550 -77 -183 202 -198 311 -22 -48 194 -14 63 122 169 -221 -176 -124 148 428 -244 500
2370 500 11 -203 -334 -219 -318 -24 176 -82 577 211 214 287 -33 -72 -531 -124 85 113 -203 -401 37 -80
2392 -80 -48 188 -37 129 111 -132 -299 119 379 -311 41 -49 -199 -156 -176 17 392 394 77 -4 3 -35 570 -76
2416 -76 -347 -190 223 408 -52 -239 -220 98 -374 15 -250 103 32 140 -159 224 -264 -146 233 -200 -121
2437 -121 8 74 -132 155 122 31 100 17 236 166 40 -186 42 443 -102 -211 -102 -57 -134 159 116 120 -40 49
2461 49 569 -146 -214 339 52 -257 400 -285 -102 -131 -28 147 171 -229 -178 -34 211 94 -97 238 -172 514
2483 514 -53 -24 -103 33 -81 131 456 -113 -132 104 88 10 2 -137 -277 255 206 132 199 -330 67 1 313 352
2507 352 23 -175 104 507 240 111 -121 -164 93 90 -165 111 -281 -228 195 130 190 -247 60 -2 17 -49 -33
2530 -33 -12 -10 -230 161 -267 -283 92 28 -203 -80 -93 1 -149 227 197 -204 108 146 -298 -424 -111 1 378
2553 378 145 -530 148 -191 -362 -247 231 166 173 -357 25 200 -401 317 -279 42 -82 215 0 12 508
2574 508 127 86 84 -116 5 105 167 292 180 -208 383 -139 35 -407 104 -88 -120 141 -218 -10 -427 -50
2596 -50 -208 -274 -87 -48 180 -27 -148 -115 27 184 -382 160 57 -430 -175 -158 237 -186 250 -374 -124 -47
2618 -47 -459 50 44 -1 -458 -153 134 -275 130 103 276 -261 -97 -180 -99 15 11 -59 131 -498 4 -115 4
2641 4 -4 -304 316 378 -183 -493 -19 16 -294 -180 64 -306 1 -337 -519 88 -229 62 -62 -191 92 433
2663 433 32 -160 -58 -54 124 -129 385 -365 -130 188 330 14 566 -268 -308 -552 -152 222 51 388 -168
2684 -168 -81 -171 218 -361 104 46 368 -3 290 -264 37 290 -332 -9 -10 -75 -52 416 -156 -155 151 415 -67
2707 -67 -120 69 -175 -477 -91 170 212 593 -94 -31 -247 118 344 426 -108 -266 7 138 -291 52 -306 -343
2729 -343 -336 155 242 140 149 107 -23 187 -238 348 -407 -338 -360 205 -517 -112 233 -152 288 -376 217 -63 -132
2752 -132 84 -159 138 -82 88 7 166 -178 94 -35 118 8 30 -551 -334 -81 -164 -229 -587 -324 -185
2773 -185 168 76 265 173 71 816 409 -488 -64 19 -404 447 -174 191 -29 172 242 0 -30 249 -132 304
2795 304 -187 -31 -169 -412 158 -313 257 40 94 -260 150 -159 211 133 11 -52 -77 -63 -506 85 62 -142
2817 -142 92 -376 46 151 -75 232 -362 77 -347 61 180 128 -209 -276 184 -172 585 270 -19 -289 -54
2838 -54 34 437 -37 206 103 -603 -25 -269 80 198 -151 25 -20 -259 300 -128 14 238 -115 -97 186
2859 186 38 -416 -26 22 -416 155 -234 121 -60 171 -48 -188 -232 -327 -54 469 -181 -34 -51 -454 -127
2880 -127 309 -130 -489 -151 222 57 216 187 191 -156 231 79 259 215 -77 -254 -166 394 42 -5 267 -192
2902 -192 -48 -122 -254 59 42 -324 -252 -379 -206 -302 -18 -9 283 539 84 20 41 -25 178 405 157 188 -354
2925 -354 294 -155 208 120 -272 -198 16 167 478 174 -252 -80 -444 22 16 -172 -73 -1 -174 129 200 147 238
2948 238 -334 277 -136 -89 264 21 -59 179 -596 -229 -81 207 -166 -571 -314 -597 -448 -178 -393 451 -169
2969 -169 33 162 104 88 -3 117 35 11 -30 195 -423 307 130 326 -350 -266 144 335 -70 110 -26 -64 224
2992 224 -541 159 -86 -315 -57 -250 210 186 34 684 106 -428 -210 83 -3 -416 -96 -291 -14 409 -62
3013 -62 -183 -265 41 95 -279 82 -191 117 26 -54 -446 -119 46 -21 203 247 -33 283 -63 -15 39 -62 -305
3036 -305 267 230 -368 -81 171 -309 -312 260 -16 -290 51 -339 25 53 189 -199 -201 79 228 -102 20 -9
3058 -9 -263 181 -537 -120 234 161 -61 69 -42 70 300 128 -241 -168 -253 -38 110 122 -223 -346 -120 157
3080 157 -131 47 132 52 -61 112 -170 -125 -338 -69 28 52 258 -13 368 13 -415 -135 429 -16 308 -396
3102 -396 167 -144 88 109 -108 -346 -457 68 414 -110 -56 731 -104 -384 341 246 278 105 -11 -77 -167 -104
3124 -104 436 83 422 381 -354 540 -220 -309 88 535 145 92 -270 -305 -215 -102 -53 99 -47 -423 -33 315
3146 315 149 298 -75 130 -34 -358 317 566 96 222 -115 -9 -51 -108 -51 0 163 285 55 43 -112 -198
3168 -198 -34 -190 -113 -84 -472 -30 -188 414 246 -216 131 285 -14 -189 -96 48 64 -275 -195 -86 -196 -117
3190 -117 -107 -122 -335 -52 119 383 -365 21 190 180 -164 89 262 103 324 87 -94 411 126 -250 276
3211 276 -264 52 -59 217 -36 -144 -113 -33 360 225 16 77 -67 116 -415 -376 -11 341 -13 -102 104 -156
3233 -156 -11 -53 -239 -190 29 -189 53 15 324 6 39 -210 34 -127 53 118 -389 -154 -201 -68 -4 -255
3255 -255 -317 332 -515 52 -143 217 179 -224 -444 19 78 7 20 106 52 -34 -22 387 107 281 68 -278 -242
3278 -242 382 -16 104 101 -133 -215 -232 52 82 206 292 211 223 -3 -218 9 -15 -6 -267 -280 -449 220 -147 -207
3302 -207 97 -34 277 396 619 25 373 433 121 70 -171 -73 329 535 369 -102 -155 53 -294 -47 183
3323 183 17 124 -78 -122 -340 -148 -1 -220 -264 130 -168 262 -439 445 -201 171 101 304 -99 -168 287
3344 287 93 -195 410 129 34 187 -172 22 -46 66 -365 59 331 -58 -29 -177 -73 -343 -41 374 -143
3365 -143 62 78 200 -91 427 -142 68 23 105 -182 400 -53 -148 -26 -220 205 -467 85 -354 -215 -16
3386 -16 -270 269 -4 105 -133 -174 -67 -427 -420 -192 12 263 -64 -415 -56 347 524 184 -388 -234 78
3407 78 2 -13 143 216 -39 -347 116 -34 232 -213 251 104 55 293 396 -88 94 168 -49 14 -73 72 371
3430 371 27 -74 -363 -207 266 -16 -311 10 66 -224 283 24 102 244 307 -107 102 321 156 24 494
3451 494 -153 9 290 215 -126 -207 284 211 -634 -209 -109 -199 347 68 -282 77 -149 33 372 -190 186
3472 186 78 273 -99 -312 -35 -175 -23 469 5 -54 -27 54 -90 18 -215 277 -88 228 120 -49 164
3493 164 -270 264 -498 -514 -33 -355 -107 220 -254 342 122 -465 266 191 -36 189 -85 -314 157 -286 -255
3514 -255 138 242 286 376 188 -318 300 428 262 221 20 -202 -218 -40 -523 -105 -344 -584 169 86 -222 -192
3536 -192 -32 -162 -28 -75 248 -64 -18 167 -9 -96 5 -174 -40 359 349 185 129 44 176 233 -245 36
3558 36 -364 -113 122 -136 476 432 -382 -17 11 7 26 -286 0 158 130 -79 155 -92 -282 114 560 -245
3580 -245 173 -360 241 345 -311 -30 -82 226 -73 87 -349 306 -402 -99 58 43 20 -259 -183 -439 578
3601 578 134 109 -213 -235 -5 80 244 63 353 10 210 38 -7 -61 -56 16 -2 60 -153 243 -236 -288 51 62
3625 62 -70 248 -284 -265 -471 207 96 -109 366 -137 -585 -299 465 -338 -170 -164 -362 263 216 -205 -111 -299
3647 -299 51 -167 626 -383 159 -99 -85 409 366 -263 228 -272 304 -401 -151 579 6 -59 -160 -385 -204
3668 -204 -394 -412 -278 243 250 -119 45 145 -160 -83 249 162 124 74 68 -417 53 -161 76 274 3 -31 55 255
3692 255 209 -207 168 -296 110 345 -226 363 223 312 -369 -215 439 148 175 -64 -77 203 -465 -182 -25
3713 -25 -659 138 -236 -458 78 -286 547 -374 67 -166 378 26 -2 -132 578 16 262 -48 -75 549 -357
3734 -357 127 -267 -305 76 -15 191 432 6 -123 -379 -6 87 390 120 -307 31 27 338 -90 357 -365 55
3756 55 288 144 -305 -74 209 -38 71 -136 12 231 -425 237 369 203 -182 -142 356 -408 -28 -413 232
3777 232 -434 -98 183 155 103 -134 -284 -127 -432 -278 -277 -26 129 -170 82 -201 -40 -254 -31 3 138 267
3799 267 -58 -270 62 -123 -433 -72 -49 645 73 233 -73 64 -107 68 56 153 200 24 25 397 -83 173
3821 173 -5 -66 165 -368 383 36 -27 -303 382 52 -12 343 48 -152 162 -24 -362 -256 194 -79 -172
3842 -172 -64 153 -48 343 29 119 63 23 393 658 -337 -17 -53 -253 -76 -156 -179 -43 -453 23 220 -188
3864 -188 76 -230 -26 389 480 142 -145 173 378 176 22 -10 -142 272 247 87 94 -61 265 -264 80 218
3886 218 75 -209 401 -74 29 -235 -71 -67 155 17 177 396 -312 415 150 -170 -250 233 164 -268 -54
3907 -54 224 -149 -43 352 31 349 -114 -145 -289 117 201 48 19 97 275 70 362 -109 -238 230 -196 -104
3929 -104 -181 -7 188 164 38 -64 -177 -320 188 115 271 275 -261 -78 -410 590 -128 66 -341 394 -117
3950 -117 -24 -168 240 45 -197 240 -67 346 -72 -2 93 -326 -146 -173 92 82 488 70 426 49 108 -153
3972 -153 115 -36 -159 -171 -441 40 110 -120 -218 196 26 259 -87 285 -276 -251 -45 110 391 -288 96
3993 96 119 255 100 -148 352 -322 322 -128 216 184 -62 -126 -32 251 261 -449 -89 -139 -216 301 -217 88 -98
4016 -98 -438 -72 160 102 104 106 85 357 6 -379 128 -486 29 -322 -80 -205 -312 -270 -194 191 407 -1 156
4039 156 98 -126 246 98 410 -199 -69 -58 -127 310 569 52 -179 -160 -207 37 -276 63 -411 39 -374 -174
4061 -174 -188 144 164 27 47 -173 -315 77 -36 91 367 266 -179 49 39 -97 371 21 -165 104 61 -54
4083 -54 214 14 80 -227 88 -85 -162 -264 -170 77 116 -485 -383 113 181 -436 -120 -256 -211 95 48 -365 -414
4106 -414 412 151 -241 -145 -35 291 28 -65 -392 2 -129 -323 -195 -239 -367 320 85 118 -172 -371 11
4127 11 63 -100 -268 169 76 -20 -170 -362 63 -150 193 262 22 -113 -257 36 -307 64 -202 -179 -71 -313
4149 -313 78 330 -115 46 329 -263 8 98 -199 142 -112 18 -61 -238 31 -22 216 -681 186 356 -339
4170 -339 72 -195 410 -24 -116 -135 342 178 -190 0 -68 -208 259 96 307 230 270 514 -78 -678 31 34
4192 34 -228 123 55 288 174 34 410 301 -73 332 -515 -122 -61 165 -289 485 82 -182 -89 115 -72
4213 -72 197 397 44 -142 -367 75 -103 -185 -121 204 133 167 -226 -313 211 -123 423 -12 52 -115 -330 176
4235 176 154 -109 -184 -315 -450 -101 -368 120 160 -54 79 364 164 -25 192 86 136 92 235 374 -227 187
4257 187 -351 -39 77 295 354 -49 -404 -20 -217 45 -97 -2 381 -122 9 267 -8 71 -558 161 -82
4278 -82 -228 593 68 584 85 106 -168 236 97 267 74 68 16 0 -321 -119 -17 9 -63 99 -206 29 -199
4301 -199 -277 154 -43 -404 -42 132 26 -225 -4 -55 -316 -184 -345 10 -237 -275 83 -98 371 123 194
4322 194 -44 -77 111 154 74 -169 60 -152 -263 235 -138 205 63 126 223 -86 130 42 139 -53 -221 163
4344 163 -81 63 131 115 137 67 -238 230 106 -57 29 150 32 -88 55 11 114 211 568 252 196 -284 30
4367 30 147 421 -213 -88 -216 315 -117 13 460 -407 447 -645 123 322 -274 226 244 357 -203 -295 -73
4388 -73 -158 108 163 -61 159 -258 261 17 328 149 42 -281 -363 -75 115 -141 237 76 75 129 80 308 184
4411 184 371 -5 202 26 -156 -4 140 185 168 -39 -30 -297 156 -115 205 -41 12 82 138 270 -147 74
4433 74 -30 -14 54 106 -224 55 281 -516 56 -326 106 86 347 240 228 -39 193 376 303 -277 1 28 116
4456 116 48 3 23 -62 18 179 -162 105 -90 366 -164 -184 285 100 -46 242 197 217 -198 -281 13 -320 -225
4479 -225 231 82 -132 -57 -139 159 -64 -204 -179 -124 95 231 -207 267 -306 36 -3 -151 -305 95 214 -132
4501 -132 44 81 -14 -163 -145 -61 104 -72 -297 -316 -46 -351 -156 -243 129 49 -229 56 46 159 82 -128 -109
4524 -109 -261 65 252 -7 411 -213 182 259 -99 -113 -243 68 61 179 -352 193 -242 0 -37 -4 -173 138
4546 138 358 195 196 -12 -248 -162 -67 139 294 -90 258 246 122 -465 -398 23 107 -96 218 -156 -242 -402 -75
4569 -75 35 178 180 5 -247 71 -370 695 350 -63 -134 88 -16 284 336 173 -32 -303 68 -189 -184 -235
4591 -235 -153 -239 -130 185 507 -488 -233 178 -30 262 2 -229 117 153 -403 -329 -117 171 -143 -123 -22 -510
4613 -510 -44 347 390 -180 -190 88 -215 -260 124 237 226 -242 233 469 -149 -33 123 22 -399 67 308
4634 308 151 -278 127 -270 308 198 -137 -593 119 74 -210 -207 358 260 -31 -172 373 -273 157 -124 -101 -31
4656 -31 -197 -70 312 -307 -164 0 -105 -129 -95 -214 -231 -298 -788 589 88 -136 -319 80 20 -274 -210 -264
4678 -264 94 -178 -113 -27 49 54 -152 120 707 -129 -213 -42 -565 466 -388 175 -480 -193 81 164 -190 129
4700 129 162 236 -639 -70 -38 -35 -70 -127 -123 -115 122 265 -332 -17 -112 164 -288 267 43 -246 95 -217 -195 -95
4724 -95 197 -545 -34 -5 312 218 655 288 119 220 699 389 -150 74 263 55 -4 208 181 445 -289 150
4746 150 -65 433 605 82 379 357 388 -215 -83 -448 181 145 -51 -293 382 41 467 -150 -348 -14 -13 574
4768 574 -206 -27 62 -50 64 -129 157 204 -148 -104 -159 215 15 -19 -134 -123 -273 -109 -118 -142 -148 180 43 52
4792 52 103 126 18 -427 -96 -255 31 8 -353 209 188 -441 41 -216 454 291 -376 345 148 160 -76 -54
4814 -54 6 -399 147 21 -134 -303 522 12 147 -449 321 327 -222 161 -360 62 23 126 -278 -102 299 -29
4836 -29 -333 -86 -144 -106 360 137 -270 -78 -122 30 75 34 -207 123 323 -356 142 -1 79 495 -47 -231
4858 -231 -44 258 237 -188 112 -175 -295 239 180 373 -241 -50 387 -25 -199 135 147 40 -61 -18 148
4879 148 -93 50 -318 -85 -190 -203 334 -214 52 -84 -339 -424 -155 -419 298 -95 -194 -54 -373 -80 -184
4900 -184 89 -329 196 -219 182 -24 -321 134 -176 -233 -84 -375 -175 -91 300 147 -63 -91 229 227 -227 281
4922 281 -215 12 44 -269 53 -194 112 -191 -125 16 -24 -567 -165 127 83 -28 249 222 79 16 117 211
4944 211 201 268 -36 144 164 202 277 -522 634 -168 238 94 -345 70 -227 -176 -447 -6 179 -134 95 -111
4966 -111 203 347 139 -233 154 144 183 100 -21 -57 -516 127 -3 -61 -191 -124 156 115 295 -47 202 222 -194
4989 -194 -166 615 136 -248 -75 -110 -79 -294 14 266 -96 72 7 203 192 148 178 -41 90 -5 -117 -348 15
5012 15 270 304 103 187 -302 145 -119 -97 -24 -186 366 -32 -29 163 -85 -338 127 48 266 262 300 -19 245 -142
5036 -142 102 51 336 335 152 299 221 8 -81 204 -183 -36 -329 272 326 93 -68 -67 -121 -258 82 123 288
5059 288 243 192 485 -460 -560 -100 -1 -235 -70 -157 218 -150 -199 -85 -13 312 -333 -71 294 156 -98 87
5081 87 177 -281 264 -143 -156 -158 -400 -90 -131 -22 -166 132 334 229 161 538 -94 -216 -1 -343 11 -351
5103 -351 64 390 -81 -326 -12 88 -161 -105 100 45 68 -144 -173 330 -286 -115 65 -47 -41 121 -211 -525
5125 -525 202 48 -217 -173 84 -96 16 -262 147 22 85 -189 -207 44 -315 -56 -169 -339 197 425 -113
5146 -113 281 17 118 -359 166 255 -75 145 -87 -348 88 68 -563 105 171 -150 203 -7 373 218 209 571
5168 571 333 238 55 62 217 -461 -65 218 633 -56 -382 46 -321 46 -47 263 -379 -249 194 266 184 -83
5190 -83 165 -276 102 -419 -3 529 -271 -50 59 32 -93 110 233 706 -177 318 -15 -5 425 -184 -6
5211 -6 -395 38 -179 323 117 -188 -148 -372 26 -413 220 -192 102 -174 -147 17 7 -155 -571 -88 -356 19
5233 19 -165 -52 17 -195 169 27 -47 -50 177 130 -139 -106 253 -94 7 126 -360 -141 -21 -1 367 -119 -68
5256 -68 -46 218 -9 -50 -5 94 330 -501 -148 -92 -28 -93 119 -256 314 314 -94 53 59 49 -79 148 137 -448 -270
5281 -270 -104 47 -140 19 97 122 -129 265 -50 98 9 113 25 -17 134 16 -585 433 34 357 187
5302 187 170 -578 -307 119 351 -187 -401 -36 -53 -28 211 173 165 356 -57 -352 -145 9 94 295 -114 156
5324 156 -248 -332 -261 -7 -320 67 -192 173 -293 25 24 22 152 433 202 197 -132 -8 -75 -240 -105 -280 -158
5347 -158 146 -548 81 -192 -98 10 -180 346 -103 354 -44 -227 -451 25 255 -100 -325 137 -34 269
5367 269 -5 58 59 -71 222 550 239 -20 202 -176 -103 64 40 102 -84 -70 363 -22 -76 114 -150 147 76
5390 76 293 212 -106 223 155 -552 -116 25 146 112 -212 -104 -65 122 123 -130 -151 141 177 -582 211 120 -38
5413 -38 236 -159 -135 28 -88 224 -236 232 238 -10 269 -422 -290 -77 -32 172 113 172 -82 295 20 228
5435 228 -341 -213 167 202 136 -11 25 -88 -88 -65 412 26 -550 12 -154 -2 155 47 371 0 50 -143
5457 -143 172 -220 -256 -181 -399 -444 -23 374 -110 269 -392 183 482 388 91 19 -122 -223 157 514 428 -131
5479 -131 250 -142 408 69 57 -101 221 198 154 78 -261 -76 -32 132 -98 -505 26 348 -196 -18 -181 11
5501 11 257 62 -222 20 84 -62 -97 187 -137 -140 -148 -334 -55 131 -16 212 393 254 250 -53 -27 429 127
5524 127 -130 422 -74 382 -98 -63 -126 -153 -149 -122 -2 -928 178 207 -238 -102 70 -262 0 128 80 -69
5546 -69 87 38 88 -233 126 -513 -174 -162 -132 18 -24 -251 -23 202 -63 181 95 293 140 -199 -24 -380
5568 -380 -98 -58 271 153 -530 53 -123 -565 71 127 -130 235 -123 -120 101 30 215 -178 31 46 -77 -33
5590 -33 -41 -177 286 -224 -172 -262 39 156 -353 -39 272 -236 272 -118 153 244 -81 77 85 209 336 51 -120
5613 -120 -158 153 102 -92 -195 -81 259 251 169 -400 -98 -179 346 174 56 -208 33 138 59 -190 -86 -37 -143
5636 -143 178 -198 125 188 -60 -33 69 72 33 142 -383 -191 174 209 -96 187 -91 236 -271 134 63 148 -145
5659 -145 -160 157 114 29 270 -627 101 348 111 277 -135 -202 -578 198 -111 16 10 178 43 -34 456 -102
5681 -102 547 199 -32 -194 321 314 5 -206 -41 -221 329 74 248 -268 148 353 132 -53 449 75 -77
5702 -77 -146 -396 270 -246 -37 389 -72 449 21 -86 269 111 442 -501 -195 -299 5 349 -259 238 194
5723 194 -108 -199 194 29 186 -43 224 144 -114 -25 -149 -45 -294 277 -277 -277 -118 -218 207 399 -584 -43
5745 -43 194 -2 30 167 140 -408 -97 -13 -117 -20 -63 -218 -357 -211 -153 -61 -32 16 287 -104 -16 -84 -81 68 312
5770 312 -125 -80 -271 -248 -65 61 286 -32 136 -69 -274 284 -261 -312 -125 1 -144 92 171 -63 291
5791 291 372 190 -102 42 -89 -324 106 -95 -205 137 -186 471 248 -38 -43 40 -302 158 -238 -83 354
5812 354 184 321 -89 11 -161 413 -54 101 323 -83 241 23 32 124 -93 184 -295 -169 203 -218 -168
5833 -168 332 -327 -503 205 -37 197 -38 572 -22 -94 373 -135 184 -59 -50 -561 -173 -280 -479 83 -339
5854 -339 -7 -473 -313 -63 -15 -52 209 -264 164 251 216 397 23 -12 196 -188 231 192 355 218 14 -28
5876 -28 -307 -270 -59 -169 -173 125 335 34 54 138 131 217 -103 307 -180 -222 -162 -130 38 310 68 -206 359 -208
5900 -208 -101 -33 -86 -91 79 -132 -496 -179 -103 301 47 254 80 23 128 12 -15 -82 -50 -219 306 -349 297
5923 297 -139 4 -252 27 138 -5 -185 -170 -221 -284 439 281 191 39 358 -126 -120 258 217 -243 -159 -218 154
5946 154 -37 -269 -249 -169 175 250 -14 4 -163 17 19 90 114 11 -351 262 104 -77 -45 173 -33 -206 72
5969 72 51 -26 138 -32 -34 -216 170 -73 -24 -10 55 -97 -88 205 -510 35 -278 -130 52 -244 -135 -108 53 430
5993 430 -468 163 71 -16 -151 178 399 320 211 -126 -421 -54 86 -165 -113 164 275 238 217 -344 -260 120
6015 120 -4 106 -112 221 29 174 -35 284 -79 -116 30 -16 91 313 364 -54 337 228 86 169 -50
6036 -50 21 -265 -36 -111 -129 96 442 31 180 395 416 240 -516 53 -251 18 -263 -91 -45 -378 34 -340
6058 -340 127 -27 537 105 -258 35 -105 -172 151 3 57 199 99 247 113 4 5 -179 -86 -124 173 -158
6080 -158 151 -143 -92 592 -48 221 481 -242 -95 -261 29 -133 266 -242 27 -124 -120 -49 -261 523 -28
6101 -28 -83 47 -213 -435 38 -134 -29 -149 -104 78 -231 21 153 -220 34 12 -54 296 108 223 186 301
6123 301 242 53 17 36 84 -565 247 -47 -220 -188 341 -53 -253 -221 -253 227 41 -136 212 -60 106 257
6145 257 39 128 200 117 155 -178 -79 69 154 213 -70 441 -215 101 76 166 142 175 150 -279 94 -37 31 116 240
6170 240 157 -50 97 -374 19 266 436 573 369 130 -177 -293 83 104 -96 365 60 -30 -19 -154 147
6191 147 -364 -89 131 196 0 307 -6 -281 345 -278 5 144 124 -108 -31 380 69 290 111 -96 -197
6212 -197 -44 336 56 421 -250 -55 165 113 -507 -209 308 -285 -189 18 -393 37 -192 -472 -62 -51 102
6233 102 53 -355 314 33 408 -357 152 41 -99 -361 250 -21 -199 314 -657 -170 -140 108 70 358 206
6254 206 -114 69 226 299 194 453 -367 44 175 -134 -400 163 110 -233 66 60 -7 211 57 -79 -414 -23
6276 -23 494 203 210 -230 43 77 -157 333 -93 -16 -38 186 498 75 121 -121 315 27 -384 -176 227 361
6298 361 50 62 280 -101 15 -143 -146 -92 -96 -188 219 -11 -193 49 488 -90 240 617 460 -77 542 -118
6320 -118 29 134 110 37 343 -145 132 -195 7 -87 105 -109 -334 -18 -604 5 159 -128 231 567 -2
6341 -2 2 -152 394 -145 -264 -88 -82 166 90 -231 -190 231 -26 -25 43 153 -174 -343 539 -436 -76 -176 341 152
6365 152 326 -18 -145 -177 362 -200 -20 61 -149 23 -112 198 -97 -237 123 155 411 277 -316 273 279 184
6387 184 -86 -238 -248 -132 3 -13 -544 74 -126 -120 -84 -38 -329 282 -255 436 69 92 186 409 -34 -21 95
6410 95 218 16 -301 -591 564 -367 405 -178 23 448 -20 -324 263 -409 -147 198 213 122 -40 3 197
6431 197 65 185 -115 61 76 56 -71 -21 367 -693 329 496 -207 -35 -105 280 380 -155 254 -332 18
6452 18 512 -161 -6 296 30 15 237 528 -150 307 -58 -308 -94 160 78 84 -158 392 -35 97 191 473
6474 473 282 -3 -69 -27 211 322 278 253 -85 -361 -214 -4 -282 314 12 386 339 -143 179 -121 300 22
6496 22 -90 -343 301 55 -301 -64 2 -16 301 257 -129 -144 342 83 122 92 121 30 154 -54 -455 302 -170
6519 -170 150 -29 124 -25 93 -262 -15 -135 109 -164 47 187 -433 535 67 52 407 197 -43 -355
6539 -355 72 -141 -593 228 -7 130 35 -174 319 42 -90 -91 112 -273 188 -409 3 -352 150 -71 -551
6560 -551 -142 270 -447 -30 -142 -201 332 70 -83 23 98 305 -135 442 295 294 -84 -407 140 -349 269
6581 269 141 -244 -23 55 -8 336 -9 94 -80 140 -67 -137 -215 -178 -65 -32 -438 135 -56 -104 63 3 63
6604 63 -30 -335 -186 36 42 192 63 -192 -117 -206 162 -33 -299 -114 465 -22 221 -132 -254 -273 7 90 269
6627 269 389 153 -121 -120 -7 -291 -260 82 -116 324 392 521 -41 -11 -212 94 271 -272 210 -132 -48 30
6649 30 273 507 -40 -151 323 -245 235 -205 337 211 -522 16 205 184 118 -74 173 182 -215 35 -259 -54
6671 -54 -125 -286 224 -399 -44 -30 -100 -106 -363 284 -218 122 11 -219 61 -72 369 -280 -191 64 170 -70
6693 -70 5 415 -399 78 54 101 -55 -328 -159 -18 5 -112 -113 -70 -16 50 -93 252 198 201 247 11 230 -161 -457
6718 -457 -40 11 -478 185 -654 -2 186 196 359 -158 -253 -200 -534 269 270 169 30 -226 -67 -101 -78 -263 125
6741 125 -141 664 387 -123 147 8 88 124 20 -617 -46 173 160 146 -250 -50 143 79 177 232 -210 -298 327
6764 327 198 158 -528 -141 -288 60 244 119 -307 287 -65 -500 -60 -93 -126 -366 127 -3 229 324 367 -222
6786 -222 167 65 20 58 -56 44 -26 397 -195 331 -252 511 210 358 16 -385 -279 -162 87 -268 -224
6807 -224 196 -36 91 -214 -246 27 329 -376 -275 -130 -114 50 -433 202 0 165 225 -254 145 -230 -28
6828 -28 -225 -19 252 -322 122 320 195 -135 -64 -51 60 -208 616 139 126 611 -376 -376 116 66 91 30 466
6851 466 83 -480 299 76 -144 462 -117 22 404 -265 141 -242 -208 -132 165 53 168 -195 137 -205 516
6872 516 185 349 43 -19 59 71 62 46 140 -273 -276 -132 -515 -45 -468 396 -465 -112 -125 -82 175 -47 -2 -463
6896 -463 105 541 17 -72 175 -185 85 243 -100 -375 -142 -18 122 -239 286 -160 172 -218 479 7
6916 7 243 215 -152 310 -221 220 9 384 27 -24 112 344 -182 74 342 672 357 2 -260 147 310
6937 310 128 364 28 232 30 248 -12 84 93 -219 189 81 -706 317 315 637 -128 45 -132 80 -181
6958 -181 276 62 -76 -99 -182 327 -128 -276 -122 -89 108 134 -177 38 -99 27 81 93 34 -151 -111 -208 -119
6981 -119 76 164 104 23 36 231 81 -111 299 63 -164 -424 244 -286 -270 140 357 223 -55 -63 -132 155 -42
7004 -42 -126 28 -156 105 -253 -298 200 134 238 49 -43 153 48 -130 -7 265 -67 -111 -63 -217 -230 -168 -19
7027 -19 -56 -270 593 -156 -299 146 -46 -151 8 123 24 193 -161 -44 413 96 -133 -113 133 168 45 -273
7049 -273 -79 194 49 25 82 -153 -175 143 -65 93 364 -209 87 71 26 -283 58 -7 -104 -20 245 -197 -50
7072 -50 -220 55 42 -123 141 108 288 -66 -8 -225 0 275 -157 96 -415 369 180 -106 -186 -171 18 68
7094 68 -23 81 473 260 361 -99 -48 -300 -189 56 -26 -27 -155 149 53 379 288 144 514 83 -459 508 177
7117 177 -165 56 40 531 -24 74 -26 -43 -515 -238 -45 -191 118 49 -154 -351 80 142 -28 -357 26 595
7139 595 -182 120 -1 -91 -16 -400 -229 203 -217 -183 259 65 -23 -163 -81 -273 356 -113 -23 -341 -15 -207
7161 -207 111 -11 -217 72 117 -25 -114 -388 -58 211 150 91 -144 127 -473 2 366 -114 -157 24 -342 136
7183 136 462 30 -457 -741 59 -457 -30 -202 7 -27 283 298 64 198 188 -71 236 325 143 -378 374
7204 374 484 -6 -165 203 67 163 -453 -106 -105 291 -179 -432 44 -285 131 -415 374 97 -7 -79 -212
7225 -212 -497 122 -195 -88 -292 163 -85 132 -69 253 -262 97 148 110 -13 -147 -78 263 450 203 -6
7246 -6 -138 -512 -285 -422 532 -387 -178 -306 88 -428 -21 200 -183 -260 55 41 -208 369 -99 -24 120 -35
7268 -35 141 -125 -22 22 123 -319 -163 -161 -388 -200 -49 -33 495 71 -31 212 100 205 266 92 326 -62
7290 -62 174 -30 -70 -304 -171 232 -125 -2 262 103 -166 81 -61 61 -214 14 28 -246 76 206 -439
7311 -439 138 -106 -183 509 63 -517 118 -243 195 372 -125 17 66 -208 255 68 169 226 245 312 250 368
7333 368 205 -266 -76 149 210 -156 214 -262 -156 15 198 302 -47 -78 260 -73 -40 136 312 28 55
7354 55 9 -163 -192 163 0 -273 338 -13 -114 167 202 -30 -115 -214 -165 380 213 265 -212 244 90 -312 67
7377 67 -99 -103 130 -299 336 106 307 -204 -49 362 -366 -44 66 68 -76 137 232 -80 375 -110 -127 -167 -74
7400 -74 138 -10 -292 -217 318 -144 121 -506 -134 115 189 -51 165 -317 432 260 -142 -154 123 -115 -42 -214
7422 -214 9 287 -112 161 405 77 -209 -84 -210 31 -230 4 486 -109 125 -371 -2 -300 661 28
7442 28 472 138 -481 86 381 -411 -254 72 23 -262 -546 33 247 478 -97 148 110 -454 110 37 -187
7463 -187 -368 -194 -200 480 152 122 96 -66 111 248 -43 106 165 -142 -145 -110 -26 490 -89 98 241 167 -14
7486 -14 -249 108 221 308 11 -456 14 250 220 -325 95 -110 74 -31 316 -56 153 -112 -192 64 -344
7507 -344 206 -78 -283 -323 -418 -152 -49 -153 148 41 -72 47 144 -91 -295 -48 271 146 -44 -101 -3 -65
7529 -65 87 -125 20 -58 -96 -180 80 -149 85 -93 -569 -450 11 293 16 -17 199 -217 -27 121 -174 229
7551 229 331 -107 -393 382 176 -99 -236 -3 -71 -239 -81 -116 101 401 -114 -270 -17 -14 127 214 92 289
7573 289 284 -111 376 55 379 241 -393 45 467 59 -501 -377 65 -326 -85 -410 192 -193 445 -18 -101
7594 -101 -41 93 -148 333 -112 209 245 -207 -180 84 -19 -186 562 -208 7 -192 68 418 -200 -227 68
7615 68 135 -401 162 -129 -239 141 303 294 -50 40 -342 258 -408 116 109 -151 142 302 84 -64 -50 60 -190
7638 -190 -6 -216 139 -57 304 273 -305 -328 -290 102 90 112 -88 -9 342 254 -196 -376 254 271 215 -266 134
7661 134 -197 19 -208 -238 -31 77 151 130 212 647 449 -454 12 70 121 146 -9 -156 112 293 76 -106
7683 -106 263 401 158 637 164 299 -161 -392 -98 -371 36 -202 0 30 -224 180 -251 -251 -9 136 -276
7704 -276 21 -238 -224 -172 463 -366 45 184 95 -44 -7 92 -12 -236 -536 -302 -84 -343 298 -68 138 299
7726 299 234 -346 70 -66 -188 -211 -297 -105 383 316 -74 -40 -7 -26 -161 -102 -161 389 251 -8 31 250 171 -317
7750 -317 -31 -55 -85 325 -259 166 -172 224 142 -148 68 29 -341 219 278 -314 25 -266 -197 161 66 45 65
7773 65 -293 -141 265 109 -78 403 173 -145 -304 127 175 3 -5 -118 340 -50 -133 -198 79 254 -465 -139
7795 -139 4 154 220 -222 173 370 -156 -18 146 176 -97 -120 89 -90 397 -85 -149 38 -47 253 -185 84
7817 84 91 172 320 -11 -188 367 -210 91 -204 355 -19 35 35 -207 -203 32 314 -641 -265 249 233 -20 130
7840 130 36 30 -31 261 163 46 -42 105 -21 -130 37 -93 343 -257 -283 94 -97 -16 -126 8 -175 -99 4
7863 4 161 329 34 -211 -513 -32 91 -59 -30 -451 197 238 -29 44 -415 145 38 721 -37 -114 -380 -14
7885 -14 198 -2 -247 -288 15 -158 -83 107 -206 166 -183 35 540 -123 -224 -131 261 -215 49 -197 96
7906 96 138 85 -391 142 -162 -58 152 -167 400 361 -7 -98 -423 117 539 220 -330 631 -12 -215 157 584
7928 584 -376 -227 -382 -221 -71 -65 -774 -110 95 -208 56 57 -144 -140 -134 200 -199 60 -232 -400 -72 -307 -179
7951 -179 44 -250 -387 -275 -159 -119 -94 -169 -315 -196 -93 -211 -247 232 -1 -207 136 33 182 340 187
7972 187 254 63 305 37 -132 -58 126 51 -221 242 -157 -300 197 -486 -33 -3 -198 -154 225 90 55 -121
7994 -121 133 -257 285 -75 16 -22 -21 441 -471 276 -426 135 208 66 211 161 -154 -75 487 206 451 43
8016 43 132 -176 -56 117 -289 -24 129 66 -484 322 -71 110 139 301 140 254 -2 137 -30 -379 -258
8037 -258 -347 -68 -32 255 -61 -477 -69 -249 289 61 122 -33 -304 9 50 -54 281 448 256 209 -385 -297
8059 -297 -80 -60 182 -97 189 -446 81 137 246 278 27 -21 -40 -151 131 2 67 -126 162 -152 279 272 -297
8082 -297 213 -82 -109 -145 -216 -19 121 -19 -250 233 384 -153 -155 367 -64 -45 135 248 70 -713 323 425
8104 425 -258 -43 261 157 -236 82 136 204 -37 -349 -190 353 7 246 -93 -165 250 -391 -117 5 -221
8125 -221 338 238 -43 -9 332 222 -4 -109 -127 -273 -180 -209 232 -490 229 -193 -422 -117 391 158 -174
8146 -174 167 -90 265 -402 -509 147 -215 -103 201 537 -119 -111 278 51 -566 -90 348 89 -150 -70 165
8167 165 -393 209 -230 7 119 54 -276 -28 432 98 -26 157 -147 -215 -47 204 -261 -40 439 361 -36
8188 -36 -147 292 11
8191A1
$$ Imaginary data points
##PAGE= N=2
##DATA TABLE= (X++(I..I)), XYDATA
0 0 0 0 0 0 0 0 0 0 0 0 0 0 0 -24 24 -24 24 -24 31 -48 48 -69 72 -91 96 -120 144 -159 183 -213 240 -274 309
33 309 -349 395 -445 497 -561 625 -695 774 -860 952 -1057 1168 -1292 1420 -1570 1729 -1906
50 -1906 2100 -2313 2554 -2812 3114 -3447 3829 -4271 4784 -5394 6124 -7027 8176 -9688
64 -9688 11776 -14857 19871 -29429 54128 -255728 -413477 290537 462464 383853 523353
75 523353 594377 321127 265801 295535 165677 136266 277637 130014 -89928 -55945 -40755
86 -40755 -212227 -238375 -129131 -68964 -33579 43263 53742 36886 91417 93434 -36455 -42559
98 -42559 65211 27396 -65143 -7812 58605 8294 -52238 -42861 -29074 -28124 -41560 -66854 -8660
111 -8660 84509 37604 -24335 36483 62362 4488 -20633 -203 45309 87381 67890 14690
123 14690 23406 45961 -19756 -79449 -47219 -30399 -36215 -11136 -14911 -10737 52041 56451 -17566
136 -17566 -30881 34164 34108 -22985 17194 88316 54882 5072 5816 936 -5068 -11014 -37628 -30379
150 -30379 39584 54829 -23334 -21339 56802 8754 -79476 -42586 -899 -25722 -29057 -19033
162 -19033 -26693 -6395 14549 -32727 -59501 1833 16484 -42273 -34434 11526 12567 5539 2202
175 2202 184 20965 34294 7684 -11921 29424 57260 9642 -15337 22448 29420 -4736 -27438
188 -27438 -25418 -14874 -30887 -63590 -60267 -14900 13516 -10972 -18405 28581 42011 11645 2891
201 2891 10208 22587 29794 6643 -5166 29581 50648 10030 -22258 8378 23237 -6823 -12514
214 -12514 2543 11510 20360 -2327 -29395 -3348 16963 -24003 -54773 -16563 10463 -22764
226 -22764 -31652 1604 8937 2064 -2930 -13521 2442 28425 13876 -11276 9203 36664 9777
239 9777 -17771 5947 21611 10180 8026 1802 5729 31333 21172 -17315 -12684 17110 -1342
252 -1342 -41177 -17011 23819 10615 -10482 -10351 -2991 8643 -5332 -30906 -12616 21515 10483
265 10483 -18967 -531 30565 7303 -24535 -19509 -12068 -6860 -2955 -12704 -4538 20903 14445
278 14445 -14402 -15553 6913 4020 -16643 -12212 1006 9640 14276 -3311 -8585 17807 16932 -17464
292 -17464 -18523 16940 21773 -7188 -5981 18635 16533 1929 -8151 -5537 17072 16203 -15187
305 -15187 -12827 20454 21576 -9928 -13276 10123 5864 -11604 -10973 -8678 1923 10881 -11599 -24608
319 -24608 -1038 11276 -9823 -19856 1383 10523 -3625 -6648 -1893 4620 11477 -6257 -20051
332 -20051 5049 21636 -520 -12498 9149 18351 -5366 -15559 421 8487 8310 -125 -6605
345 -6605 11930 22823 -1004 -16672 1725 12657 -5399 -15945 1278 13665 11236 5273 -6348
358 -6348 74 17672 2826 -17777 -1790 18553 4268 -17106 -10276 3079 -3401 -14877 -21018
371 -21018 -14720 1420 -6887 -22621 -5441 12830 -2472 -19025 -5890 10831 2866 -6075 -1619
384 -1619 2909 7683 3169 -10537 713 20386 10897 -3500 5645 24024 22421 8924 6396 9685
398 9685 12390 7084 -12778 -11912 10825 4765 -20752 -17678 1660 -27 -18688 -20090 -7569 -2622
412 -2622 -6017 -13707 -8830 12454 10543 -10750 -5370 13447 9672 -4710 -1828 9345 8196 -42
426 -42 -5028 -6037 4167 6089 -12876 -13994 5441 7626 -4097 -3922 9328 14677 6023 -2423 -778
441 -778 10425 15038 -5060 -13756 7624 10816 -8858 -12477 2099 6762 -4639 -9980 -508 11362
455 11362 15123 3676 -4871 9114 10696 -10323 -14310 -614 1130 -8131 -11887 -6136 -801 360
469 360 -6706 -16568 -5460 7301 -5829 -11875 5986 15647 7182 -742 3810 12808 13418 6753 1631
484 1631 10918 22819 8227 -7445 6787 14084 -4021 -14889 -7634 212 -1948 -5369 -4974 398
498 398 8484 793 -13976 -3084 9933 -2408 -12646 -4979 513 -2995 -10179 -14006 -11582 -4262
512 -4262 -4603 -14118 -2475 19960 15820 2259 8266 18713 14139 3364 -318 5710 7697 1047
526 1047 -8853 -7156 5891 -683 -17220 -10834 1436 -2074 -8938 -5686 1852 1895 -4674 -10215 -9170
541 -9170 1462 3249 -9500 -5705 9649 8488 -939 -493 6980 10379 5542 -1931 -1447 8940 11863
556 11863 -3825 -8269 5387 3059 -11467 -11086 160 5035 -128 -5325 -1980 4310 3909 -5907
570 -5907 -9304 2478 3577 -7435 -4600 6982 8923 3472 -845 2686 8450 8694 3113 -796 7808
585 7808 12196 -668 -6808 3289 6757 -1786 -9576 -6491 1828 1689 -6364 -8935 151 7378 -3399
600 -3399 -10684 2002 9640 2803 -1935 1341 7664 6588 -642 -889 4886 7587 259 -6523 -279
615 -279 2903 -4258 -8470 -6703 -2313 -19 -3806 -4111 5232 9801 2598 -5827 -223 7005 -713 -8576
631 -8576 -3516 1371 553 -7247 -9990 -1490 3818 -2299 -8688 491 12447 7919 -846 5463 10185
646 10185 5244 365 -1850 1252 4557 -866 -8346 -6846 879 -2376 -11178 -7617 -450 -2528 -5934
661 -5934 -5694 -2680 2172 -975 -7520 -4880 4234 3827 -4222 -1393 9389 7088 -1541 -701 4781 7988
677 7988 2886 -3289 89 6527 4357 -4404 -3819 5805 4418 -4417 -3679 2442 3969 1802 -3338 -3007
693 -3007 2101 985 -5546 -6382 1145 2741 -4587 -5087 1912 4248 3094 -1510 -1877 4954 4984 -1796
709 -1796 -2111 5564 6797 -2586 -6215 1279 2793 -1876 -4763 -3278 1963 2078 -4420 -4352 2894 4938
725 4938 -1526 -4501 2653 5924 1137 -188 1167 3423 4987 -453 -2505 3766 6980 974 -4745
740 -4745 -338 3662 -1598 -5068 -1910 1058 1613 -2267 -5500 588 4128 -3207 -8362 -3560 2062
755 2062 -2293 -6195 -893 2702 797 -2676 -4150 293 4086 351 -3172 1262 6383 3636 -1222
770 -1222 1566 4892 1977 -1681 -2857 -158 4456 1265 -4300 -402 3951 1199 -5064 -3083 3128
785 3128 1861 -2859 -3075 56 3896 1562 -4723 -2098 3035 386 -4304 -1592 4538 2788 -2088
800 -2088 -1937 4 1616 502 -4367 -2303 3232 1459 -3303 -2849 2007 1158 -3644 -4409 -684 1068
816 1068 729 -1560 -1014 3574 2680 -3769 -2493 4026 4675 -452 -1582 4067 5132 2234 -48 60
832 60 3736 2892 -2861 -2396 4446 4624 -478 -2810 258 1077 -2414 -4270 -3650 -1179 220 -3871 -5203
849 -5203 234 1568 -2343 -4623 -1060 975 -765 -2384 337 3159 3930 -176 -2052 3517 4640
864 4640 -612 -1880 2411 4208 1054 -1593 762 3033 1305 -2037 -3689 606 3772 -997 -2716
879 -2716 723 2618 -187 -2167 -571 1890 1600 -915 -2384 -90 3971 586 -3226 394 2409
894 2409 484 -2430 -1311 2518 1652 -1350 -2483 -659 1982 -580 -4072 -621 2360 -390 -3185
909 -3185 -648 2799 1821 -1125 -1088 1167 2641 1361 -2082 265 4049 1612 -2049 -250 2861 3079
925 3079 175 -769 1296 2812 1614 -1287 -1048 2981 1248 -4059 -3528 -453 -734 -3666 -4318 -1769
941 -1769 -476 -1167 -2644 -1877 2001 896 -3338 -1540 2403 2250 -178 -970 769 2233 258 -688
957 -688 292 2535 2942 -1052 -1601 2735 2857 -709 -1924 274 1821 -480 -2661 -952 418 1405 -2040
974 -2040 -3691 158 1522 -2129 -2674 275 1687 28 -1476 54 1916 1785 -858 -1774 888 2408
990 2408 -870 -1102 2048 1941 199 -1435 -1032 608 114 -1634 -2706 -383 1522 -954 -2140 801
1006 801 1701 75 -972 -541 2357 2603 -293 -1005 961 1765 23 -1958 913 2856 -92 -1559
1022 -1559 28 1666 1936 -537 -600 553 1803 585 -1991 -182 2104 -58 -1710 -1174 115 362
1038 362 -1521 -2199 -463 853 -239 -2348 -645 2828 1078 -1608 -490 1889 2150 195 -35 2018
1054 2018 2347 572 -1109 -613 1410 83 -2656 -1941 -141 4 -1625 -1341 -25 1593 -153 -1820
1070 -1820 64 1683 1524 -866 17 1941 1331 -666 -770 553 1254 211 -1480 -1237 1601 711 -1625
1087 -1625 -1556 687 764 -1201 -1465 431 310 -523 -2503 -1483 838 249 -1476 -1076 1097 770 -972
1104 -972 -522 1013 1771 469 -986 -799 1593 1804 -571 -401 1599 1990 319 -710 1324 1822 277
1121 277 -436 -908 764 1107 -1644 -1776 -137 684 -1580 -2500 245 467 -649 -909 -1253 598 1015 -309
1139 -309 -908 1139 978 -605 -1049 692 1992 85 -965 -374 681 539 -658 -1299 670 1180 -278
1156 -278 -1311 15 1606 747 -1234 -156 854 1015 -74 -1083 599 1814 92 -1345 -4 1589
1172 1589 891 -730 -75 1167 339 -95 -412 437 735 -468 -1394 -442 700 340 -1390 -864 43 -234
1190 -234 -962 -833 319 875 -634 -1706 -541 921 822 -1054 -453 1290 1363 -576 170 1230 1672 1200
1208 1200 -688 93 2128 1251 -532 -808 976 489 -795 -941 -58 283 22 -1034 -680 1119 328
1225 328 -1218 -535 499 1169 -667 -1207 381 1004 -134 -587 -275 539 357 -952 -442 1089 953 -830
1243 -830 -1494 359 678 122 -506 -431 214 243 -958 -893 538 603 -467 -1128 234 1166 417 -35 -113 431
1263 431 1128 1 -645 895 1149 -391 -506 305 954 11 -269 -295 396 290 -719 -968 550 856 -959
1282 -959 -1376 -426 639 -226 -1370 -343 245 -264 -747 -779 415 1197 -276 -712 598 1012 658 -338
1300 -338 352 1236 277 133 53 365 1311 19 -1181 219 550 -170 -749 -813 458 247 -921 -773 -26
1319 -26 189 -159 -1363 -39 1014 -253 -649 529 607 581 -180 -573 129 291 359 -480 -1001 510 -321
1338 -321 -574 -20 209 -285 -695 -567 320 328 -205 -476 -361 723 94 -608 -408 733 135 -188 -408 500
1358 500 896 -42 -403 -193 731 927 -576 -228 1005 675 -622 -625 254 392 77 -982 -559 501 -313
1377 -313 -712 -1107 138 -776 -1007 -868 -535 265 37 -7 -21 798 417 360 229 799 969 133 175 493 614
1398 614 494 -658 241 586 18 -753 -755 568 615 -265 -833 -140 234 -569 -696 -356 85 468 -432 -219
1418 -219 116 586 -269 -847 202 628 145 -389 230 518 368 -541 -631 14 508 -321 -743 -416 323 -544
1438 -544 -676 -309 285 15 -827 -315 283 742 422 -162 -96 683 -117 -481 24 855 799 135 -586 -189 698
1459 698 -6 -133 135 707 714 -685 186 608 44 -386 -824 -493 -166 -447 -587 -214 534 174 -813 -392
1479 -392 444 112 61 230 194 767 469 -90 187 540 428 -777 288 196 602 -312 -260 210 50 182 -240
1500 -240 148 227 50 -218 -652 495 144 -299 -364 476 322 -313 -570 -100 474 200 -422 -251 596 669 414
1521 414 -211 220 667 159 -107 -140 451 127 -497 -757 -112 -233 -487 -667 -256 -20 -407 -531 201 569
1541 569 331 156 -305 -44 533 206 -57 91 602 299 -82 -261 324 142 -229 -739 68 596 202 -362
1561 -362 -38 -101 -211 -526 -22 40 258 -267 -638 -33 154 -229 -545 -428 -115 -362 -413 43 35 -158 253 14
1583 14 204 649 1 -207 -74 399 -51 -81 -142 321 -76 91 -176 485 517 446 25 21 113 107 -511 -597 465
1606 465 505 -380 46 -357 -215 -112 -24 -63 302 16 -272 -383 -147 -17 -152 -51 -30 -42 -236 -499 -230 545
1628 545 -160 -709 -482 70 134 -251 -259 -171 142 104 -276 -42 263 333 -175 -12 676 320 38 -180 -139 315
1650 315 89 -73 9 -94 386 -660 -13 354 -345 -137 -273 -66 37 -224 -143 -405 141 530 -196 -162 837
1671 837 409 -129 213 257 815 161 244 211 -72 414 139 -143 33 78 -420 -284 147 131 -237 -165 -532 295
1693 295 -191 -33 -88 215 232 -278 -454 371 477 221 -145 -35 129 -317 -285 -216 274 -260 -110 -149 102 24
1715 24 203 -199 -466 165 215 -231 -65 -428 -119 138 -359 -79 265 -58 -51 -93 70 471 -472 571 375
1736 375 467 202 155 -36 166 260 90 218 -14 580 -638 -104 18 -586 64 -490 -259 -126 15 -566 -43
1757 -43 37 66 96 138 -80 -84 103 115 17 -232 103 -158 39 334 439 -345 151 -11 14 161 -102 82 78 -348
1781 -348 -237 -189 234 -87 33 55 137 242 -174 -263 -38 215 552 131 -120 440 -126 -342 -46 -41 405 72
1803 72 -84 -234 108 -647 -260 -373 198 -161 -222 -472 -248 10 -69 128 -515 -23 87 199 107 26 466 -39
1825 -39 -61 186 -146 -231 -34 500 434 -250 -75 164 -351 145 50 -89 -11 -69 -91 -215 315 -67 -75 -10 236 -69
1849 -69 258 -146 -81 -10 238 189 -22 -328 65 -105 -174 -201 220 222 246 67 435 329 126 -79 -16 -125 -235
1872 -235 -233 98 -33 -265 226 -305 -131 -85 -35 -119 539 229 150 -234 45 61 171 243 -136 -282 -71 75 180
1895 180 -26 -119 145 -91 -87 -71 426 -74 -68 -43 183 495 -13 -249 -233 368 -310 -298 -98 366 -51 -167 -115
1918 -115 558 61 -284 -305 165 141 225 339 -51 185 27 243 -315 -67 316 -460 -436 -235 -152 -409 -737 319
1940 319 38 -250 196 -93 -175 269 -16 -45 122 477 149 -255 5 263 155 -347 39 -371 -128 -250 -61
1961 -61 -303 79 436 -129 297 110 -286 22 182 -176 -191 -233 -71 61 188 -69 -251 -27 332 531 -176
1982 -176 37 133 364 108 71 119 191 -220 166 125 -63 248 -69 -215 -266 -55 38 -598 -149 305 -119 -211 354
2005 354 2 -64 -348 -507 31 93 270 48 55 399 227 65 338 -144 -262 -371 236 152 -317 -155 -173 -70
2027 -70 284 69 -37 214 -305 49 -157 -144 237 -211 -349 176 -154 116 -15 82 -118 260 -290 -58 132
2048 132 -24 -61 52 -320 -211 246 -63 59 6 402 120 -222 -245 289 -17 38 -321 251 -282 -83 120
2069 120 72 -321 -65 -429 -251 108 38 521 -317 150 -17 148 -340 82 17 278 285 -480 -150 336 156 77
2091 77 60 -140 -97 -294 -16 -183 121 -551 136 189 -182 289 191 -248 101 346 -320 448 296 -77 -250 153
2113 153 259 -222 115 -151 0 62 236 404 -185 -148 32 -94 64 -88 -160 120 -40 -386 -11 149 -211
2134 -211 -137 -298 174 -95 16 210 -105 -410 42 85 17 188 186 219 127 11 -406 -7 -129 71 -71 118
2156 118 -169 239 311 -269 135 401 -59 459 -349 194 392 304 -61 -134 -232 72 -315 182 267 246 289 -409
2178 -409 6 210 330 343 115 -341 -73 -54 -221 172 105 178 77 -129 -62 -371 14 -419 -196 192 67 -235
2200 -235 -89 -60 104 256 -142 211 52 57 317 -101 406 -336 -250 100 157 149 -501 10 134 -110 -277 -6
2222 -6 39 479 -144 74 73 493 -19 11 209 36 372 245 -56 209 118 280 11 431 28 317 -184 -387
2244 -387 -86 335 61 -217 -190 36 -417 -113 -41 -12 -289 -308 -146 150 -89 30 -248 -443 405 -233 -239 321
2266 321 -17 -317 -129 152 274 -100 -525 -525 101 -153 -48 -233 -117 160 -58 38 347 144 -139 173 -171
2287 -171 807 -65 -97 99 -71 192 387 134 -92 -389 -265 -63 -119 -132 -73 185 144 120 -129 49 186 61
2309 61 -50 216 -295 -89 -319 -446 -95 -286 -82 -426 199 280 41 77 7 -19 -276 -7 -154 264 365 73
2331 73 -42 -72 378 -39 -254 45 411 236 -21 -209 -209 152 -139 102 -321 -397 -1 -411 44 -225 329 87
2353 87 41 -287 327 -172 -181 -73 -58 106 -279 284 -221 -244 -40 284 44 1 118 -184 -421 -33 176 -85
2375 -85 272 -149 61 109 250 -210 -118 175 437 -362 121 -98 172 96 38 305 102 -137 -210 -123 583 -124
2397 -124 27 -97 243 266 6 195 420 139 72 128 -34 -302 83 -156 -158 162 -148 6 -198 -314 296 -60
2419 -60 -330 239 -52 -109 -353 76 99 355 -104 -13 -22 -221 139 59 -214 -385 -155 -102 475 -69 50 -103 187
2442 187 -23 139 138 -119 -50 -93 -24 168 195 -57 546 -332 112 -32 434 223 -563 165 -199 104 -159 432
2464 432 -237 -445 -300 112 77 -357 44 -410 7 -10 88 -83 -77 182 290 -422 199 563 -55 -72 -234 -108
2486 -108 167 350 -69 -27 57 92 311 402 293 114 91 -101 23 656 -125 262 -428 -152 199 -397 144 121
2508 121 21 -39 279 -558 -110 -307 -113 -354 -119 -112 -127 -257 313 -201 183 -75 417 140 28 -70 -291 -245
2530 -245 -195 -128 -240 -255 -17 201 -569 237 -119 -189 90 -40 197 -243 110 -188 -450 -240 271 214 106 -142
2552 -142 138 -105 -330 391 -409 -227 -43 34 237 47 201 -31 78 150 155 -223 -16 185 270 -254 270 -209
2574 -209 -217 -61 -464 41 183 -185 -31 400 5 -264 125 218 -346 -59 -206 19 -280 -114 -48 -56 -75 -235
2596 -235 -174 -81 374 -184 505 -111 380 277 46 -75 -275 -21 -331 -70 119 38 242 -340 83 -166 173
2617 173 -116 67 32 81 709 -85 212 -41 -37 25 -18 311 -268 -469 258 -274 235 -89 285 -48 -16 103
2639 103 106 -55 43 -331 -326 -103 -167 111 -410 262 199 -10 408 -89 233 -317 46 -507 471 227 -22 205
2661 205 207 -250 -209 207 -77 112 -174 -469 95 247 -310 -53 -96 -15 183 40 -114 41 -176 133 -268 176
2683 176 -638 79 -79 -519 299 -236 46 33 79 -24 -367 143 190 -204 -122 -90 -81 268 156 -24 74 110 -76
2706 -76 37 -195 -69 -170 -245 0 344 -147 76 149 -173 183 160 241 -192 44 172 -147 157 -240 71 25
2728 25 -47 -510 -225 68 -426 -215 130 -271 159 417 -373 557 -273 -132 -373 287 -218 268 397 -137 -191
2749 -191 -54 40 -5 77 -5 19 22 270 -151 -6 -122 17 333 -112 183 -263 -105 -315 1 -14 60 10 -76 298
2773 298 -134 -262 -411 -257 -52 61 -189 -150 7 395 522 -139 -30 435 -2 -46 -108 215 110 288 -19
2794 -19 -355 -108 66 -101 -64 108 -76 234 126 247 -183 -213 391 43 -41 -155 -265 -64 -368 153 36
2815 36 -222 -147 243 114 -29 101 523 251 -275 182 174 291 -565 -111 136 -228 -97 22 276 298 -55 77
2837 77 84 229 -81 277 -112 -269 -14 29 -502 -248 2 -229 37 567 -208 -629 -53 -207 -262 170 -19 -8
2859 -8 -78 200 248 -171 261 109 -162 -489 130 -32 501 -243 280 -285 41 121 -266 -253 99 356 -530 168
2881 168 -114 -92 52 -175 -185 -322 113 -120 -333 333 45 26 -268 296 -209 328 -42 -8 -102 164 229 -148
2903 -148 -512 160 31 -224 -326 -52 115 -179 483 135 -121 -212 67 -714 -229 367 414 -10 -55 35 87 -182
2925 -182 -324 -24 -7 -224 82 43 225 -219 -119 -242 221 474 440 291 219 -250 -383 -165 80 54 -21 344
2947 344 -225 -282 -222 5 122 215 35 231 -103 -13 256 -14 155 145 -100 -175 -319 -297 -182 89 184 -72 38
2970 38 344 265 299 134 -81 130 197 -118 381 62 170 165 47 135 -358 80 115 117 186 285 -114 -49 -2 -456 -129
2995 -129 -24 49 -589 -51 -143 -243 171 -81 57 -155 -177 190 235 305 -142 -216 154 134 -148 60 -181 -17
3017 -17 210 98 91 55 -94 -101 98 263 -79 -252 293 -201 64 367 117 -60 -80 192 218 16 -204 188 -15
3040 -15 216 -129 23 360 138 -121 -175 132 2 75 26 250 -76 -124 -380 79 212 -305 125 427 161 -123
3062 -123 346 241 -311 -195 20 -106 -176 333 127 301 -39 -336 404 282 99 116 -230 -329 -161 -288 -117
3083 -117 -12 -227 124 262 294 23 186 22 58 76 55 -193 430 456 84 -91 66 100 183 258 -17 252 120
3106 120 -397 389 -19 184 223 141 -432 79 -299 -94 -261 377 164 132 310 46 -198 -333 -76 15 517
3127 517 327 -37 140 -407 194 137 366 335 -243 -12 497 -92 -202 377 31 99 -290 74 180 339 144
3148 144 -114 -13 -164 168 -237 86 117 -191 -167 -497 -33 186 -242 112 7 -94 -307 158 -150 76 285
3169 285 -192 17 -356 -83 -323 -174 368 157 -78 -18 -140 463 -242 142 -121 148 330 -172 -26 -114 138
3190 138 -221 -211 397 -53 -209 -42 11 -196 17 214 -215 -85 -96 0 -252 143 -95 177 128 -117 250 93
3212 93 -78 219 94 186 -1 -98 209 -45 193 -164 407 -139 46 120 -148 318 204 388 253 89 26 429
3234 429 29 -466 201 -199 -150 167 -132 -169 -130 -20 -164 -187 31 146 92 -232 218 77 -344 119 -260 19
3256 19 -231 263 -293 1 -169 34 213 -87 -190 179 22 -283 -215 -305 23 -43 297 -205 372 412 57 -465
3278 -465 611 -141 425 -493 -419 317 249 31 82 225 42 155 -145 -98 -423 -97 -315 21 -87 -95 -222 162
3300 162 204 -110 257 23 52 -420 -269 -67 -117 -94 356 -35 185 -14 167 -123 -182 143 -373 218 -31 45
3322 45 357 -354 330 -27 552 109 152 -176 -184 -224 182 1 -377 42 123 -277 216 -174 262 94 156 190 -231
3345 -231 -32 -77 -33 -25 -189 -138 15 -152 112 255 179 449 35 -294 -84 132 322 -120 454 -212 -212 260 5
3368 5 120 457 -312 305 -159 -1 205 384 136 -350 158 94 139 37 328 311 -27 59 108 126 358 -88 225
3391 225 60 189 291 -172 -31 -76 -213 49 -145 216 -354 92 -478 -60 83 -179 -192 74 -21 325 574
3412 574 365 -50 -20 113 213 -124 167 194 601 -208 -46 -31 -94 14 198 139 333 -26 24 -117 121 163
3434 163 57 -656 -100 286 -14 217 123 20 -130 -113 -203 253 -33 9 -540 126 76 74 -336 -466 106 104 -230
3457 -230 -122 -18 189 -267 231 -12 -146 124 112 -96 29 -7 382 -173 130 3 -227 217 124 -67 257
3478 257 58 -121 -90 26 174 165 183 -163 -282 -502 392 -214 43 201 542 -86 19 -306 -231 -181 -82 -451
3500 -451 88 -137 -209 316 355 -5 -357 167 35 17 -557 449 -299 16 75 -21 -115 -178 -610 -243 -65 -77
3522 -77 388 -591 -69 223 105 260 -128 229 -60 92 244 226 -193 -135 -313 259 66 100 -20 -94 184 134
3544 134 -414 54 87 -345 140 33 -32 -127 -74 -346 42 -198 -215 204 65 -119 131 52 4 106 168 -3 -144
3567 -144 212 -336 195 -2 235 -92 -20 -203 -41 -182 -234 78 -7 -209 40 257 -16 -194 148 10 -110
3588 -110 -221 -63 108 -15 -159 -340 231 -268 190 -197 133 -475 -166 -38 -232 242 -128 -34 -79 -231 161
3609 161 -26 -183 -44 121 203 193 -161 83 -75 282 433 289 -307 157 -327 -1 -96 -11 -105 24 -7 -16 -240
3632 -240 -362 -42 191 -121 -301 278 174 -120 -78 69 421 -293 -55 101 7 102 261 -271 336 -216 38
3653 38 202 -340 327 -290 -300 -119 366 -99 -172 -158 78 161 -161 -742 311 -164 -114 166 -294 63 151 -64
3675 -64 -9 -133 172 -69 -108 -71 196 179 -282 157 -357 -41 -139 -117 99 16 -122 107 303 -274 -17 -73 -67 47
3699 47 -136 -382 202 -87 40 253 86 -304 1 -342 338 144 62 -278 28 -80 419 -175 -153 -57 -359
3720 -359 170 -316 -473 -152 71 -175 -210 219 654 115 468 -20 -100 45 -263 -519 205 -467 13 88 -233
3741 -233 420 -34 -108 -170 269 300 196 315 -114 348 -264 208 -25 404 72 -94 150 -100 -7 -55 -317 -485
3763 -485 264 -428 533 -122 290 -166 296 198 -452 75 -135 -170 12 121 -700 -191 -368 71 -17 206 222
3784 222 10 -234 -211 -276 338 229 161 -254 -232 176 -42 450 -121 -159 -27 446 -18 -89 -68 324 478 89
3806 89 -58 364 190 -165 55 -55 180 326 -113 151 -165 54 251 38 -60 -196 -438 -171 200 -417 124
3827 124 309 334 -21 -175 -92 -545 264 43 -141 142 -121 141 -154 -88 496 -46 -56 177 328 -35 220
3848 220 -269 -268 -344 60 76 39 -4 57 -78 196 269 9 325 -77 257 361 -14 -70 -53 371 0 182 -298
3871 -298 141 -61 -164 -43 9 -279 -262 -119 -23 -61 -191 218 111 -115 481 -255 -411 161 13 110 69 584
3893 584 141 -161 -277 -221 186 225 -378 -245 144 198 301 -140 1 136 -11 19 707 -31 53 -168 241 146
3915 146 -24 -3 575 -163 -204 25 136 70 175 -392 -5 -62 -238 12 137 -201 330 72 362 -177 -27
3936 -27 -69 -22 -434 -47 255 502 362 -124 -232 212 94 406 73 95 45 55 98 236 -531 107 96 -214 -207
3959 -207 27 -493 -346 112 272 -86 -143 -109 -254 -188 -27 200 -85 121 289 -386 115 -67 -292 -281 -311 40
3981 40 -17 -40 -238 87 76 -231 -144 4 185 -164 24 -31 87 343 -278 -27 -176 25 100 -36 -100 235 7
4004 7 202 133 96 24 134 9 -77 566 -331 -82 -285 272 138 -115 -162 93 132 146 1 -54 53 343 -262
4027 -262 365 -525 151 56 237 30 -522 -74 167 -309 15 -294 -140 218 67 144 -101 163 -171 -56 -108
4048 -108 152 187 345 -103 -176 -293 334 -379 83 -166 328 -345 245 -206 252 131 -22 95 -266 -95 328
4069 328 2 86 -25 52 -406 -22 112 26 -41 292 118 -150 -459 -88 -17 -138 180 -308 -105 558 21 145
4091 145 -4 -160 123 144 56 109 -203 -211 144 -220 38 32 -492 -79 -3 -222 -449 -255 -179 155 -245 188 -209
4114 -209 -88 -401 103 55 -9 -189 206 -284 -242 -623 -40 134 -156 460 -344 11 -405 24 682 -77 122
4135 122 -126 -50 -192 21 83 -293 150 -192 -170 -410 41 -216 -11 -225 -33 3 300 429 378 -125 134 127
4157 127 334 202 -99 -64 14 -19 -372 -75 281 -23 211 336 -24 117 360 174 -9 -42 263 -97 -242
4178 -242 325 -75 27 -107 174 159 371 394 0 94 -90 665 197 387 -362 143 80 247 244 -122 258 169
4200 169 101 -238 284 -17 -207 -342 79 49 -272 -253 -138 -62 12 91 -294 210 -85 -258 312 -147 -200 116
4222 116 469 -309 9 -614 -322 119 -61 168 12 -225 -133 196 340 -68 228 51 0 -73 100 -286 -289 399
4244 399 -131 55 -239 338 250 -38 -172 -202 -226 190 -5 305 -25 -107 12 51 42 6 -124 36 66 -464 286
4267 286 12 -90 -302 -56 20 -102 171 -95 204 136 -29 85 199 64 -61 -67 -29 311 352 22 -28 -216
4289 -216 215 -115 362 247 -311 -272 -132 256 133 299 214 -82 -156 -79 441 107 -306 16 241 -46 -107 100
4311 100 -163 -356 -316 -198 43 212 90 -276 -79 -93 328 -271 12 228 8 -681 69 -232 334 -266 220
4332 220 -86 -247 -190 242 207 227 -147 -145 96 -8 -25 -209 161 3 -159 181 231 -588 221 313 134 -156 26
4355 26 -497 222 335 23 -471 5 -400 305 2 514 -199 -4 -250 36 206 -518 -165 75 -73 -473
4375 -473 -352 308 -16 -424 -34 51 403 275 -60 -833 -13 -64 218 -80 -91 665 148 -61 200 80 18
4396 18 40 -58 -281 5 268 -334 -164 316 143 187 647 54 88 -197 -104 203 338 406 164 123 184 -106 383
4419 383 223 -194 -7 304 234 423 -13 -17 69 172 -101 -82 176 -80 60 -420 249 34 244 -195 324 -197
4441 -197 116 128 -489 121 -106 -244 269 29 11 171 -418 -105 264 -310 519 -92 -126 -263 -152 187 -152
4462 -152 123 43 281 -491 -10 102 -22 188 191 371 195 -333 148 -24 15 -6 -82 -325 78 -89 14 48
4484 48 243 -276 -381 19 39 -1 -31 125 23 -58 -51 21 150 -168 -71 106 204 -152 -7 -32 -435 188 40 -28
4508 -28 -384 43 193 -79 62 -97 -169 -40 -23 -45 -56 171 -421 -432 -212 -26 92 26 3 -249 142 43 -31
4531 -31 -62 223 173 160 -559 184 147 -301 178 -385 114 -9 168 223 -59 -154 -32 -24 -107 -45 167 -124 -154 2
4555 2 110 -100 -104 61 188 -260 250 521 -311 -15 -186 74 0 135 -294 164 96 57 -118 417 -49 142
4577 142 217 -152 18 161 -44 370 119 -24 -311 141 -188 -374 -149 -98 -21 -283 270 -291 -519 -116 4
4598 4 177 373 18 271 -164 -178 -30 -24 306 -168 -113 25 137 -102 70 300 367 133 -64 -222 217 22
4620 22 124 260 39 -139 -142 26 281 45 -183 7 -213 -123 -209 122 75 -783 166 -121 306 337 299 -58 -375
4643 -375 120 -169 -231 456 -49 -335 152 -38 52 82 126 362 36 -350 -401 369 -5 56 280 84 -228 392
4665 392 -257 204 -130 -250 -412 -168 202 161 -174 283 -101 -588 -22 -400 -22 271 74 434 183 282 206
4686 206 -479 231 60 -298 138 -274 52 181 339 -241 -274 248 -468 -96 271 -6 221 -146 -358 43
4706 43 -50 -23 182 -256 376 -192 278 315 59 -60 -204 127 246 75 -189 -78 102 -355 -422 68 1 376
4728 376 128 -245 -12 314 -254 -158 154 175 -55 -107 -270 -164 238 -418 -105 34 -83 -242 -67 -582 406
4749 406 -55 -169 14 -96 236 170 137 135 -38 93 -81 -219 -190 -211 -26 -140 -51 -190 -68 -10 -50 1 -174
4772 -174 -28 45 172 -1 167 168 -222 127 302 -143 -162 -179 -17 -140 -129 -180 88 33 77 215 89 137 -95
4795 -95 -2 80 503 158 359 30 217 -1 188 -132 -66 -109 -117 -93 -126 -268 -74 117 242 77 -225 2 -246
4818 -246 415 233 172 61 311 -12 165 -491 -20 170 -186 156 207 -61 -11 -37 62 -533 122 245 -160 -44
4840 -44 -170 90 1 -434 -552 -371 99 -125 122 -51 -469 -477 66 79 -119 19 256 83 54 28 136 -184
4862 -184 -70 79 242 -115 -382 -54 279 -70 340 66 50 -120 28 271 20 28 141 -6 -78 181 -42
4883 -42 -118 -83 59 336 144 35 -101 18 371 -327 112 60 212 162 178 -209 -102 302 -50 -25 116 30 -156
4906 -156 44 -221 209 -97 244 -388 -300 -108 -457 -355 388 227 -169 12 278 -75 -206 131 -131 270
4926 270 -77 49 -241 364 398 83 125 -108 -92 239 -9 189 205 438 62 242 153 62 395 339 -216 50
4948 50 8 -229 -131 255 78 314 44 88 -35 584 -60 16 333 338 -101 -420 -85 -423 -261 74 -317 -84
4970 -84 241 148 -154 90 185 267 -319 -628 211 -16 210 189 -367 -114 139 23 414 -286 -396 160 164 355
4992 355 -50 -53 35 -306 -421 -92 203 446 41 -83 135 -105 310 -318 -110 226 -153 323 133 184 82
5013 82 34 115 -100 -203 51 -108 77 -146 -55 35 223 -348 187 235 -316 -155 -85 -131 127 -712 -113 -137 -223
5036 -223 -138 334 -90 402 158 28 211 135 -330 -238 46 136 8 -46 308 -188 -73 161 -151 -86 -55 -30 221
5059 221 -241 85 -58 152 138 134 -227 124 295 66 -6 -27 112 6 -165 149 285 243 -81 219 -248 106
5081 106 -49 422 205 59 373 78 -216 -245 -134 93 -155 7 -218 346 -27 -954 -205 -191 35 275 -31
5102 -31 -414 -128 349 128 -302 133 12 -270 -21 230 -166 272 224 -181 275 -375 52 -21 94 -63 -137
5123 -137 242 219 51 -460 64 -226 30 -166 36 -129 14 -79 332 155 46 -95 427 -182 3 -436 -55
5144 -55 122 244 79 343 139 43 254 -385 -46 -114 -65 305 -165 116 -533 242 122 -26 -173 -195 196 267
5166 267 69 63 257 -567 68 -458 2 51 -217 -351 -31 23 81 -35 -425 148 -221 162 191 -121 213 123
5188 123 120 -315 -43 90 -100 105 -111 -63 586 -70 -114 -202 -313 -239 262 198 -210 -584 -183 66 -123 149
5210 149 283 -82 -344 353 137 474 231 306 -101 -80 -99 135 136 -35 -22 -13 -124 -151 192 320 -155 38 -275
5233 -275 199 98 -381 -89 -100 310 -168 124 -363 -199 152 99 475 390 -428 -102 -123 384 142 -417 346
5254 346 -7 75 29 6 355 -407 135 -307 -211 -154 81 -209 -214 -199 -7 361 439 -60 37 239 -19 352 142
5277 142 77 9 435 184 -412 114 -401 303 717 170 -424 -120 356 245 103 260 141 -159 6 -308 -233
5298 -233 -251 244 93 -136 -133 -113 -41 -89 175 97 -33 -499 2 27 309 -99 266 7 264 187 -261 -279 -111
5321 -111 -247 -243 -2 -27 -591 323 -1 -29 48 118 -328 -133 29 -222 -83 106 3 -354 571 -335 110 229
5343 229 78 509 181 -622 299 -29 -369 134 108 -65 -165 57 -7 -120 145 165 -34 -385 106 -316 137
5364 137 67 -27 -466 -220 -40 -161 -214 37 151 421 82 -114 76 -329 -222 -132 -95 241 -304 -125 -116 -66 193
5387 193 181 25 -218 -50 -149 159 165 271 58 -108 -54 94 291 -111 -217 89 110 -137 -157 247 178 -110 118
5410 118 364 -31 288 -333 -44 -99 293 661 446 71 -151 282 88 324 -20 -6 159 -273 -532 -113 -34
5431 -34 -460 -2 31 35 -407 444 16 7 98 90 41 -289 -194 -113 -268 -309 -11 172 75 154 -142 -163 70 113 54 217
5457 217 60 -212 -273 109 263 308 -443 154 173 -39 6 91 8 -42 -323 -52 13 -137 319 246 160 39 177
5480 177 167 -136 111 -27 -297 -265 -30 33 140 77 -60 -240 94 62 165 -43 -337 -151 109 165 -83 319
5502 319 126 198 119 -257 40 -579 32 146 -196 45 249 2 -254 129 60 -31 -128 -144 -212 92 18 -47 340
5525 340 -26 91 448 22 102 -166 -282 -19 6 -54 -191 -72 -152 248 -92 290 12 -237 -233 -100 5 -256
5547 -256 56 -37 156 -347 -223 -422 57 171 -65 79 -127 -227 -89 -208 207 -84 262 -66 -72 -307 -230
5568 -230 226 40 -1 -485 8 562 -38 -214 178 391 313 -166 505 -148 -63 427 -54 152 226 259 220 377
5590 377 95 35 -166 -323 -28 -194 229 343 71 -240 129 -182 344 -131 -45 504 275 317 -167 -132 -92 164
5612 164 26 23 168 111 -11 230 -110 -137 -453 -134 -34 -245 18 150 442 111 62 -8 146 159 313 199
5634 199 244 186 -135 32 312 -104 179 190 354 323 -254 153 571 -180 169 -33 43 -211 -31 -240 555 -105
5656 -105 -134 224 24 266 -189 209 -14 -117 262 -227 19 92 58 -11 -346 -197 -138 763 233 -272 -81 31
5678 31 279 -139 -74 176 273 69 28 300 -62 -455 -115 -223 -135 128 -415 390 236 -52 226 -48 115 -114
5700 -114 248 395 346 -294 641 154 -243 9 106 -437 106 142 -288 -208 401 505 -281 -296 -94 -4 -337 390
5722 390 438 120 -142 -433 33 78 -206 67 -197 503 388 -28 150 76 336 -5 -23 -148 -228 -625 147 108
5744 108 -48 -176 184 -255 -324 -363 -274 212 273 -147 -267 -350 242 216 -124 407 -377 -672 -209 131 -163 75
5766 75 218 57 232 -342 -360 -13 -129 3 363 270 -354 -102 383 192 235 38 186 5 189 -75 -150 -17
5788 -17 49 237 -24 -255 342 -303 149 -144 86 -263 -255 23 -275 488 -60 -4 -28 228 135 -345 304 -187
5810 -187 -351 205 -220 342 -154 -83 413 115 296 -83 -14 220 48 131 111 -502 138 135 80 128 44 -155 133
5833 133 401 260 31 68 149 15 269 -175 -399 370 -148 19 -274 189 80 337 307 -5 2 -7 -32 -262 95
5856 95 -336 -138 82 -130 -542 255 -339 41 -227 120 -257 361 -303 -183 11 116 -46 163 -31 -309
5876 -309 58 548 -118 383 -271 93 -238 -135 123 -228 319 -59 -238 481 40 298 134 -143 86 -321
5896 -321 -56 126 -260 -139 20 -31 51 -120 354 -301 -320 16 -209 322 -89 -283 -71 -93 -121 77 140 4
5918 4 153 -138 -176 183 147 7 245 -162 1 16 444 375 -112 -131 202 201 260 335 -256 230 -88 -237 122 216
5942 216 212 395 -85 -132 133 -290 188 -15 -211 203 198 185 369 137 -235 -123 -143 98 275 -295 90 -377
5964 -377 76 -295 102 -37 -258 -111 -180 -82 -232 -118 328 132 263 69 -131 90 -41 -162 170 82 -73
5985 -73 19 8 -41 172 -180 -350 -70 -471 -83 -239 -317 -362 -143 83 -89 -331 227 -79 150 -121 -56 -164
6007 -164 -117 -114 54 -396 -56 368 90 16 48 -39 -147 -101 222 37 -141 318 -217 -54 -135 45 -245 -378 33
6030 33 66 44 -18 -47 -31 -244 -129 130 -135 76 223 182 -111 -128 16 -44 306 43 -328 239 -64 3 475
6053 475 -61 -23 136 -155 65 -88 -35 -56 199 22 3 67 -204 -263 -442 -314 278 -87 137 -210 -114 -64 70
6076 70 -170 61 67 -63 127 -445 -94 69 -48 -176 242 103 -104 -172 -306 55 15 125 233 153 415 76
6098 76 -296 128 -91 -17 -124 -48 -150 -136 140 -135 -91 -96 -279 68 -76 -246 -270 -421 -17 -294 -233 427 65
6121 65 127 41 176 -174 -110 -336 -259 -462 298 -35 -262 -143 146 43 -329 -6 -384 446 127 90 211 -128
6143 -128 -81 -134 -219 6 89 41 -19 -30 231 89 328 142 326 0 -346 318 -46 30 -310 31 339 -97 -256
6166 -256 188 0 -303 -318 -104 -37 190 157 -94 -69 -453 -12 201 -5 -16 -136 391 150 -270 -329 307 -147
6188 -147 -101 99 -243 -72 -197 -77 -87 406 168 -423 -117 -161 -64 -95 -380 215 -189 56 -123 -230 48 108
6210 108 42 -300 127 296 89 421 -330 88 297 -205 293 -138 -11 495 211 -153 -106 -55 -219 -284 62
6231 62 -144 -23 -267 -26 59 63 -191 -334 321 209 -409 41 391 -135 198 257 -23 -192 396 50 -230 -342
6253 -342 45 191 -18 -66 -310 48 114 281 17 -79 -139 59 217 -17 -127 -2 366 55 -233 212 -156
6274 -156 380 244 110 109 258 166 63 -292 -271 -486 108 -167 460 165 146 103 138 75 -188 -221 240 -105 -260
6297 -260 -437 -83 202 -60 -101 -79 139 -43 203 423 -54 2 -225 -193 -106 123 -59 144 -411 210 163 -8
6319 -8 -118 61 158 -208 96 -49 231 -174 -48 275 -85 -543 -140 -92 112 -42 59 452 -5 95 300
6340 300 -203 -160 -14 -34 391 -330 -10 563 47 -8 -250 -111 -112 406 47 -184 89 133 261 -398 250 8
6362 8 -143 66 -285 -151 142 228 -195 50 -183 -307 -69 331 -7 196 475 225 -32 -17 2 129 20 74
6384 74 5 -6 -157 155 278 -49 208 -38 -290 34 -29 284 -220 66 54 116 -114 28 -124 -15 108 -154
6406 -154 161 -17 230 -261 305 91 106 -90 121 539 14 186 101 285 51 -292 -301 -145 -107 85 49 146
6428 146 385 156 -364 109 -276 -80 217 -352 302 -40 54 210 -111 -184 197 127 308 -21 -655 71 393
6449 393 283 -99 158 75 -123 -184 -17 166 -54 354 182 -196 -26 227 -130 -346 -326 -803 -485 -60 416
6470 416 -165 223 -124 -66 219 -5 -286 -173 365 -262 371 -150 -341 -72 -80 -59 196 239 212 -79 330 -294
6492 -294 -47 70 -39 -230 407 138 -249 103 -502 -267 78 111 43 -39 -69 84 -417 272 -231 -81 -110 -180
6514 -180 -532 -281 45 302 -34 -145 -197 -83 64 110 -358 -629 -51 -174 6 -64 266 -55 -118 333 12
6535 12 -399 -170 30 75 289 108 151 -114 -66 103 383 -235 -228 386 -426 28 182 210 -312 1 150 -541
6557 -541 -327 -34 514 -83 -166 -79 -35 328 -177 223 -42 -138 -122 -61 154 234 -268 -190 39 -54 -578 -377 -98
6580 -98 138 -49 403 361 213 243 419 99 126 22 90 -18 40 260 359 88 -431 27 -351 -67 -56 -80 -64
6603 -64 -54 223 0 -286 275 119 25 324 40 415 239 43 -77 18 297 250 17 218 -245 364 152 -72
6625 -72 324 396 -484 253 235 -144 -72 438 -103 102 46 -377 -212 318 -42 -133 186 15 326 -232 344 142
6647 142 126 -147 24 -73 -28 323 -90 -50 -76 277 -192 56 -250 -368 -435 374 510 -159 50 -26 -122 281 425
6670 425 -175 -103 146 143 -144 -67 -71 11 199 307 46 -43 383 165 -252 124 -212 -269 489 -93 -152 295 -2
6693 -2 255 86 48 -95 -225 -11 -100 64 54 -284 379 64 -344 7 16 102 35 -292 136 -191 375 -30 25
6716 25 -151 36 -49 -233 -271 147 -291 -343 68 -184 567 -321 65 -77 0 -531 -168 -115 -52 211 -29 -257
6738 -257 -29 110 353 -432 -78 13 -124 60 -248 22 -145 -572 305 32 -458 -592 113 -120 28 -86
6758 -86 -102 -118 -306 -309 126 201 35 -314 6 275 115 -367 -93 -110 -83 -155 100 227 -23 45 -149 -39 -152
6781 -152 -313 -174 129 109 -119 -505 25 -379 -299 -170 16 205 -281 -320 -111 -191 -119 307 -290 78 -192 84
6803 84 241 115 -124 -110 16 97 21 -25 128 226 172 134 92 398 -13 -288 376 20 82 371 54 289 -388
6826 -388 511 459 -513 68 43 -108 166 215 5 -103 -330 122 143 -43 137 -103 692 254 -361 -132 -392
6847 -392 -112 -288 -37 235 -10 -487 -197 -84 211 -199 -121 255 61 -135 94 88 -413 -344 241 464 -316
6868 -316 351 -370 102 -137 220 -7 106 61 -320 49 24 -194 -241 -237 152 169 -254 -61 428 180 -488 106
6890 106 -291 230 -307 -120 75 121 290 -224 -173 -114 100 -45 -43 -2 65 447 285 -58 -272 381 -27 -261
6912 -261 256 270 -179 128 -309 98 228 -75 -6 -47 -84 -166 11 150 -253 241 32 236 359 302 149 194
6934 194 -78 -296 -407 -48 33 36 -54 62 -142 -137 116 -232 274 -170 -17 -179 -282 -39 -247 420 -497 -9
6956 -9 -66 110 -291 72 -177 -22 68 -253 205 22 209 39 238 226 98 120 43 19 111 297 -68 26 5 224
6980 224 226 -43 -85 176 584 -526 -98 -51 49 -271 -60 -105 -227 -85 -106 40 -377 -454 -189 310 -217 92
7002 92 -238 240 224 -125 -55 -705 -41 -100 -33 -350 -351 -113 158 146 -328 -87 -105 64 -160 -68 -69 238 -61 242
7026 242 -96 453 -108 -241 88 -85 64 269 417 -261 161 -59 -188 -480 89 75 152 -102 2 -175 96
7047 96 219 -125 212 -302 119 -171 120 -88 5 -155 -118 56 227 476 -312 104 164 291 -100 168 558
7068 558 -320 -99 -88 28 -386 78 -273 -154 -23 257 74 -117 83 129 360 -46 -380 -174 189 189 -143
7089 -143 -179 -398 1 116 116 -229 -36 -71 -294 -231 5 -119 153 144 -294 189 139 687 -93 -60 -320 -23 6
7112 6 182 -89 48 397 -190 -25 24 -315 -112 -337 0 152 310 -485 255 -80 -58 -409 -291 290 167
7133 167 68 -186 390 -195 -138 -44 -41 -512 4 -110 -130 -317 52 191 -337 108 163 116 109 628 0 132 92 -347
7157 -347 -195 -343 17 36 233 162 -238 -190 181 73 150 -5 -54 -122 -259 52 101 128 -264 -323 9 68 123 -113
7181 -113 84 119 -14 -678 42 -58 -128 -43 265 414 283 243 249 29 18 -143 259 53 328 162 -324 -61
7203 -61 149 -205 204 -142 71 -14 105 416 -263 167 43 -188 -94 -203 25 68 125 -188 -291 -50 154 -111
7225 -111 300 -450 -113 158 232 -247 12 60 40 288 -154 -122 -1 164 113 -103 -96 -379 -31 -91 286 312 -253
7248 -253 515 -14 -386 -90 137 144 517 130 -244 -99 -95 -64 104 384 77 -235 589 610 103 219 -279 138
7270 138 115 99 -145 10 170 -205 94 138 180 94 -33 -42 80 -42 -101 -95 -412 -211 16 167 207 -10 36 256
7294 256 -5 -116 16 220 25 -61 -198 -128 315 43 -274 -67 -106 296 -103 -222 -42 206 86 -61 204
7315 204 119 306 -104 187 98 162 -66 211 454 -39 65 -89 -387 228 -120 189 98 -137 -72 600 29 368
7337 368 180 -387 -99 -208 -88 -33 -129 266 364 410 -227 0 -163 -173 -211 107 420 -120 53 251 -126 251
7359 251 202 -68 245 247 87 -6 -479 272 -220 71 159 63 -123 103 -95 2 197 211 61 -281 360 -239 -81
7382 -81 166 281 7 -26 140 -75 -303 -108 68 105 -336 115 -21 -219 165 12 228 328 42 25 35 -215
7404 -215 -151 178 29 63 354 296 -21 -105 -409 210 32 192 -129 -278 -34 -5 101 22 -62 -239 -166 -200 189
7427 189 -287 -105 133 -39 -236 115 -42 -165 -60 220 77 -49 -403 162 200 -12 493 -58 -64 -178 -1
7448 -1 -75 78 203 116 -171 241 515 -88 -186 183 181 -118 -24 -199 -235 -423 159 -147 -52 133 95 -212 172 -140
7472 -140 272 -376 150 116 168 -153 284 122 113 57 49 84 62 115 -169 -329 95 -29 -301 34 -269 -366 204 218
7496 218 -329 424 87 79 -10 101 126 -308 -169 341 193 -265 -509 19 22 269 -127 207 196 115 227 121 -54
7519 -54 -28 -8 -138 -426 103 145 -21 59 21 440 -87 -70 -272 347 204 27 1 -61 47 -287 12 -38 -116 -192
7543 -192 -230 243 237 -126 361 383 345 -30 -231 286 -88 -309 -245 331 -46 0 226 116 -136 128 90 5 -177
7566 -177 -253 157 271 297 184 -253 -240 341 -349 132 253 -657 -151 293 -97 146 382 195 33 -312 2
7587 2 -143 -32 -168 -334 -286 369 -15 96 308 120 208 73 181 -37 -98 -187 -254 37 332 -276 -22 -370
7609 -370 -19 150 -65 262 -192 -371 -263 428 262 242 364 12 137 -139 331 264 -333 -360 -88 68 367
7630 367 -111 -45 47 -70 -148 189 -88 -227 -277 94 217 618 24 94 -335 20 -109 -78 -212 -156 179 117 -9
7653 -9 28 341 228 92 -42 221 -273 128 -222 168 69 383 -58 220 -202 -128 151 231 274 -86 351 -748
7675 -748 217 320 337 -108 39 -127 11 26 44 -57 -61 37 -489 -382 -428 -122 -173 -146 -103 -454 -8 152 172 -56
7699 -56 120 -190 -149 313 -420 -266 84 384 -252 180 -269 148 -82 311 -244 230 216 122 -43 274 152
7720 152 197 -147 -89 324 11 -124 -340 284 84 -465 -466 157 -290 -38 28 25 132 179 26 16 315 107 -80
7743 -80 -584 -40 -89 125 349 -197 66 96 26 -134 -103 163 -212 143 -12 102 -29 -45 -118 -195 152 -37 242
7766 242 91 -82 -203 253 294 228 -294 -215 -275 200 -75 16 204 303 82 -28 107 -99 67 -344 125 79
7788 79 -278 114 333 86 -288 -28 -308 458 126 -208 -112 -461 173 298 -150 -309 195 -194 -148 557 69
7809 69 -327 -62 -130 -177 -59 140 155 -340 -286 45 -215 13 -136 96 -75 -18 -148 -584 -308 -271 -178 175 31
7832 31 -33 323 333 173 -454 -18 -363 295 163 -181 -74 299 325 -187 -48 268 67 -92 156 -400 143
7853 143 211 -220 -543 56 -174 -99 -217 477 296 42 174 53 403 651 174 95 16 -73 25 -145 -183 -62
7875 -62 -396 -134 392 -185 208 604 21 -79 -302 100 -86 -112 -251 -284 405 -423 -391 184 325 -197 -323
7896 -323 -218 -13 -29 149 -4 -84 -340 -390 -251 96 191 -131 138 170 109 -65 -27 -236 115 -13 117 -303
7918 -303 92 27 -377 149 -163 -8 378 -39 -145 295 -16 117 52 50 45 -79 83 -214 225 -241 68 41
7940 41 142 89 -540 98 2 -309 -49 449 -290 293 -350 -219 189 -259 78 50 172 -33 -87 -75 161 63
7962 63 -25 475 88 -194 87 188 271 -68 -197 -10 -137 -318 -49 -131 -266 -60 59 -76 172 -152 367
7983 367 214 -233 -93 -80 161 65 -189 -6 -130 122 27 521 -183 391 -374 -233 155 128 22 -513 -305
8004 -305 -384 151 27 166 380 169 -469 5 -154 -32 -92 -25 -344 201 -337 -199 -227 61 168 -382 -111
8025 -111 -161 331 -210 -309 81 104 45 -114 169 -104 159 35 177 149 -18 -75 239 -77 -89 -20 187 -673 162
8048 162 164 168 278 159 194 275 303 -251 402 302 -319 -153 -135 343 482 -407 -72 -38 22 356 149 -425 233
8071 233 33 -30 -252 310 517 97 -440 -429 34 -190 -86 447 354 -317 -251 -569 149 145 -375 34 -272 -150
8093 -150 -51 2 278 -225 40 150 113 98 231 126 0 -472 -196 -244 -66 -159 238 331 -130 131 194 116 -22
8116 -22 31 8 21 -325 407 155 51 -377 139 83 122 191 -44 84 -256 -321 -234 -116 125 196 59 -65 125
8139 125 -167 139 139 -171 148 -21 326 -190 -11 14 111 -175 250 -160 -207 -56 -358 -144 220 492 -232 95
8161 95 -59 -342 397 -69 -51 102 140 -17 -15 15 -151 -226 237 -318 10 50 452 -124 78 13 -207 -110 -101 181
8185 181 255 235 381 -108 158 -229
8191b29
##END NTUPLES=NMR FID
##END=
