##TITLE=1H_K-324/2
 CDCl3
 8 sc, 
 15.02.2022
##JCAMPDX= 6.0         $$ Bruker NMR JCAMP-DX V2.0
##DATA TYPE= NMR FID
##DATA CLASS= NTUPLES
##ORIGIN= UXNMR, Bruker Analytische Messtechnik GmbH
##OWNER= root
$$ XWIN-NMR		Version 3.5
$$ Tue Feb 15 10:35:44 2022 Russian Standard Time (UT+4h)  she@DPX200
##.OBSERVE FREQUENCY= 200.131346
##.OBSERVE NUCLEUS= ^1H
##.DELAY= (6, 6)
##.ACQUISITION MODE= SIMULTANEOUS
##.ACQUISITION SCHEME= undefined
##.AVERAGES= 8
##.DIGITISER RES= 18
##SPECTROMETER/DATA SYSTEM= spect
##.PULSE SEQUENCE= zg30
##.SOLVENT NAME= CDCl3
##.SHIFT REFERENCE= (INTERNAL, CDCl3, 0, 15.7039)
##AUDIT TRAIL= $$ (NUMBER, WHEN, WHO, WHERE, WHAT)
$$ ##TITLE= Audit trail, XWIN-NMR		Version 3.5
$$ ##JCAMPDX= 5.01
$$ ##ORIGIN= Bruker BioSpin GmbH
$$ ##OWNER= she
$$ F:/spectra/data/she/nmr/H-F/1/audita.txt
$$ ##AUDIT TRAIL=  $$ (NUMBER, WHEN, WHO, WHERE, WHAT)
(   1,<2022-02-15 10:34:10.48 +0400>,<she>,<DPX200>,
      <created by zg, POWCHK disabled, PULCHK disabled
       configuration hash MD5:
       00 E9 B6 7A A2 85 ED C7 34 08 36 98 17 FE 4E 26
       data hash MD5: 16K
       E2 DC 89 03 E5 8C 33 64 F6 F3 62 96 88 C6 24 39>)
$$ ##END=
$$ 
$$ hash MD5
$$ EF 85 65 1C 02 A7 3D 15 E9 96 2E DA 73 F7 03 27
##$RELAX= 
##$RELAX= 
##$RELAX= 
##$RELAX= 
##$RELAX= 
##$RELAX= 
$$ Bruker specific parameters
$$ --------------------------
##$DU= <F:/spectra>
##$EXPNO= 1
##$NAME= <H-F>
##$PROCNO= 1
##$TYPE= <nmr>
##$USER= <she>
##$AMP= (0..31)
100 100 100 100 100 100 100 100 100 100 100 100 100 100 100 100 100 100 
100 100 100 100 100 100 100 100 100 100 100 100 100 100 
##$AQSEQ= 0
##$AQ_mod= 1
##$AUNM= <au_zg>
##$AUTOPOS= <>
##$BF1= 200.13
##$BF2= 200.13
##$BF3= 200.13
##$BF4= 200.13
##$BF5= 200.13
##$BF6= 200.13
##$BF7= 200.13
##$BF8= 200.13
##$BYTORDA= 1
##$CFDGTYP= 0
##$CFRGTYP= 5
##$CHEMSTR= <none>
##$CNST= (0..31)
1 1 145 1 1 1 1 1 1 1 1 1 1 1 1 1 1 1 1 1 1 1 1 1 1 1 1 1 1 1 1 1 
##$CPDPRG= <>
##$CPDPRG1= <>
##$CPDPRG2= <>
##$CPDPRG3= <>
##$CPDPRG4= <mlev>
##$CPDPRG5= <mlev>
##$CPDPRG6= <mlev>
##$CPDPRG7= <mlev>
##$CPDPRG8= <mlev>
##$CPDPRGB= <>
##$CPDPRGT= <>
##$D= (0..31)
0 1.2 0 0 0 0 0 0 0 0.06 0 0.03 0 0 0 0 0.0002 0 0 0 0 0 0 0 0 0 0 0 0 
0 0 0 
##$DATE= 1644906849
##$DBL= (0..7)
120 120 120 120 120 120 120 120 
##$DBP= (0..7)
150 150 150 150 150 150 150 150 
##$DBP07= 0
##$DBPNAM0= <>
##$DBPNAM1= <>
##$DBPNAM2= <>
##$DBPNAM3= <>
##$DBPNAM4= <>
##$DBPNAM5= <>
##$DBPNAM6= <>
##$DBPNAM7= <>
##$DBPOAL= (0..7)
0.5 0.5 0.5 0.5 0.5 0.5 0.5 0.5 
##$DBPOFFS= (0..7)
0 0 0 0 0 0 0 0 
##$DE= 6
##$DECBNUC= <off>
##$DECIM= 32
##$DECNUC= <off>
##$DECSTAT= 4
##$DIGMOD= 1
##$DIGTYP= 9
##$DL= (0..7)
0 120 120 120 120 120 120 120 
##$DP= (0..7)
150 150 150 150 150 150 150 150 
##$DP07= 0
##$DPNAME0= <>
##$DPNAME1= <>
##$DPNAME2= <>
##$DPNAME3= <>
##$DPNAME4= <>
##$DPNAME5= <>
##$DPNAME6= <>
##$DPNAME7= <>
##$DPOAL= (0..7)
0.5 0.5 0.5 0.5 0.5 0.5 0.5 0.5 
##$DPOFFS= (0..7)
0 0 0 0 0 0 0 0 
##$DQDMODE= 0
##$DR= 18
##$DS= 0
##$DSLIST= <SSSSSSSSSSSSSSS>
$$ [...]
##$SUBNAM2= <"">
##$SUBNAM3= <"">
##$SUBNAM4= <"">
##$SUBNAM5= <"">
##$SUBNAM6= <"">
##$SUBNAM7= <"">
##$SUBNAM8= <"">
##$SUBNAM9= <"">
##$SW= 18.0517287032376
##$SWIBOX= (0..15)
0 0 2 0 0 0 0 0 0 0 0 0 0 0 0 0 
##$SW_h= 3612.71676300578
##$TD= 16384
##$TD0= 1
##$TE= 0
##$TE2= 300
##$TE3= 300
##$TEG= 300
##$TL= (0..7)
0 120 120 120 120 120 120 120 
##$TP= (0..7)
150 150 150 150 150 150 150 150 
##$TP07= 0
##$TPNAME0= <>
##$TPNAME1= <>
##$TPNAME2= <>
##$TPNAME3= <>
##$TPNAME4= <>
##$TPNAME5= <>
##$TPNAME6= <>
##$TPNAME7= <>
##$TPOAL= (0..7)
0.5 0.5 0.5 0.5 0.5 0.5 0.5 0.5 
##$TPOFFS= (0..7)
0 0 0 0 0 0 0 0 
##$TUNHIN= 0
##$TUNHOUT= 0
##$TUNXOUT= 0
##$USERA1= <user>
##$USERA2= <user>
##$USERA3= <user>
##$USERA4= <user>
##$USERA5= <user>
##$V9= 5
##$VALIST= <valist>
##$VCLIST= <CCCCCCCCCCCCCCC>
##$VD= 0
##$VDLIST= <DDDDDDDDDDDDDDD>
##$VPLIST= <PPPPPPPPPPPPPPP>
##$VTLIST= <TTTTTTTTTTTTTTT>
##$WBST= 1024
##$WBSW= 4
##$XGAIN= (0..3)
0 0 0 0 
##$XL= 0
##$YL= 0
##$YMAX_a= 267702
##$YMIN_a= -93470
##$ZGOPTNS= <>
##$ZL1= 120
##$ZL2= 120
##$ZL3= 120
##$ZL4= 120
##$ABSF1= 10
##$ABSF2= 0
##$ABSG= 5
##$ABSL= 3
##$ALPHA= 0
##$AQORDER= 0
##$ASSFAC= 0
##$ASSFACI= 0
##$ASSFACX= 0
##$ASSWID= 0
##$AUNMP= <proc_1d>
##$AZFE= 0.1
##$AZFW= 0.1
##$BCFW= 1
##$BC_mod= 2
##$BYTORDP= 1
##$COROFFS= 0
##$CY= 11.3945322036743
##$DATMOD= 1
##$DC= 2
##$DFILT= <>
##$DTYPP= 0
##$F1P= 2.36226072786647
##$F2P= -0.459571619588291
##$FCOR= 0.5
##$FTSIZE= 0
##$FT_mod= 4
##$GAMMA= 1
##$GB= 0.15
##$INTBC= 1
##$INTSCL= 1
##$ISEN= 128
##$LB= 0.24
##$LEV0= 0
##$LPBIN= 0
##$MAXI= 10000
##$MC2= 0
##$MEAN= 0
##$ME_mod= 0
##$MI= 1.114404
##$NCOEF= 0
##$NC_proc= 0
##$NLEV= 6
##$NOISF1= 3.799351
##$NOISF2= 2.8
##$NSP= 1
##$NTH_PI= 0
##$NZP= 0
##$OFFSET= 15.70392
##$PC= 1
##$PHC0= -16229.84
##$PHC1= 11.80078
##$PH_mod= 1
##$PKNL= yes
##$PPARMOD= 0
##$PSCAL= 0
##$PSIGN= 0
##$REVERSE= no
##$SF= 200.130013532006
##$SI= 16384
##$SIGF1= 3
##$SIGF2= 2
##$SINO= 400
##$SIOLD= 16384
##$SREGLST= <1H.CDCl3>
##$SSB= 0
##$STSI= 0
##$STSR= 0
##$SW_p= 3612.71676300578
##$SYMM= 0
##$S_DEV= 0
##$TDeff= 0
##$TDoff= 0
##$TI= <>
##$TILT= no
##$TM1= 0
##$TM2= 0
##$TOPLEV= 0
##$USERP1= <user>
##$USERP2= <user>
##$USERP3= <user>
##$USERP4= <user>
##$USERP5= <user>
##$WDW= 1
##$XDIM= 8192
##$YMAX_p= 0
##$YMIN_p= 0
$$ End of Bruker specific parameters
$$ ---------------------------------
##NTUPLES= NMR FID
##VAR_NAME=  TIME,          FID/REAL,        FID/IMAG
##SYMBOL=    X,             R,               I
##VAR_TYPE=  INDEPENDENT,   DEPENDENT,       DEPENDENT
##VAR_FORM=  AFFN,          ASDF,            ASDF
##VAR_DIM=   8192,          8192,            8192
##UNITS=     SECONDS,       ARBITRARY UNITS, ARBITRARY UNITS
##FACTOR=    0.0002768,     1,               1
##FIRST=     0,             0,               0
##LAST=      2.2672688,     0,               0
##MIN=       0,             -93470,          0
##MAX=       2.2672688,     267702,          0
$$ Real data points
##PAGE= N=1
##DATA TABLE= (X++(R..R)), XYDATA
$$ [...]
1733B23m40L31p3N4n6K1R7l9L36m45k19K39r1J29o9J50l15L44k05l15J38K47j4
1756B8j15J04o4M0j67Q8j5m7J92J15L7K9j36R8j41l89K28m5k0J93m5J42P7o31
1780d44M28j54P9J23k34J97K57N9Q2k31k01J32P7k00K45O0J49J67j01o9o95j21
1802c95p5j22M28n1K33Kj72l65J32k17M07P0J69K65j7p0p5k06l1nq5J98J78R1
1826B87K51l53J28n25K37m50Q8J0K33r1j20L71l56K01j94K97j3M13l28J91l04
1847b7M4k11j18N62J84l24J03K94r7k01J68l70J28l05J84k38O0M39l79%j23P1
1869a56O3L0j7K14j11K35k96Q5r7jj54O27m08m49O68k61J48j06k01K12k14O9J00
1892b0K69m22R0j70K42l06N3K92l26K91j17J45K09k82j70J31LK55K50l24j09M14
$$ plain form
1733 223 -217 114 41 95 39 60 157 118 454 9 -210 29 -62 67 -2 148 -167 177 -28 -343 -205 42 28
1756 28 -87 17 -47 -7 -174 -86 -101 -148 44 159 196 225 89 187 46 -343 -115 -160 -180 13 -32 110 187 -444
1780 -444 -16 -170 -91 32 -202 -5 252 311 393 162 -39 93 170 -30 215 275 424 591 490 421 -274 -395
1802 -395 -470 -592 -164 -215 18 20 -152 -517 -385 -602 -195 -125 44 309 292 222 147 -59 -90 -95 -180 18 196 287
1826 287 538 185 313 -212 25 -425 -337 -327 -94 -185 -305 66 -290 -89 -283 14 1 414 86 277 -27
1847 -27 17 -194 -312 250 434 110 213 507 410 209 377 7 135 -170 14 -224 -164 275 -104 -104 -227 -156
1869 -156 -93 -63 -80 134 23 258 -38 47 -50 -51 -205 422 14 -435 233 -28 120 14 -187 25 -189 -120 -20
1892 -20 249 -173 -83 -253 -11 -317 -264 28 -298 -7 -124 21 230 -52 -222 -91 -88 167 417 93 -16 398
1914C98j42j17J12k74N3O1M8L8q5p5k70J79J43k86M69j80j2J07Q1m07L44K1k94
1937h8p1k64L93R5l67L11n04J72L21l04K86r6L92j20j05k0K49r6n6r1k56J02j7
1960a34J78q5j53L9L2m6q5J60R1J91m0N2L22o31J11J91o3R9k43n5J70Jl84K54
1984b8r6K31j49J79K03k34j36M3j34J74Mk11K29k42k81N12l17J61kj57K36J39
2006A24o3l7RJ11J49k28r5J78k85k8M5M5L1j28nK26M7k16L00l07K09k05k5N5l7
2031a30J14J5k00K23r4K7R5OK3K8NN8j26K64k58O1k1k66K81m02K77j22j9J59l4
2056c6j23K00j79J27m3o9j47J40J72k88M27J10k82j72nJ97J65j90J61j45N8m3
2078C5PR9p2RJ0j30q7J33l0Qj1j35M6J3j16J9L06j86K74p2L1j29J40J37k32J7
$$ plain form
1914 398 256 139 251 -23 30 91 139 177 92 17 -253 -74 69 -217 252 72 60 167 248 -159 185 206 -88
1937 -88 -159 -423 -30 65 -302 9 -495 -323 -2 -306 -20 -116 276 156 51 31 280 184 128 37 -219 -117 -134
1960 -134 44 -41 -194 -155 -123 -169 -254 -94 -3 188 148 200 522 -109 2 193 130 229 -14 -69 101 102 -282 -28
1984 -28 -124 107 -42 137 340 106 -30 13 -121 53 57 -154 75 -167 -448 64 -253 -92 -94 -251 -15 124
2006 124 61 24 33 144 293 65 -30 148 -137 -165 -120 -75 -44 -172 -177 49 96 -120 180 -127 82 -123 -148 -93 -130
2031 -130 -16 -1 -201 22 -72 -45 50 56 79 107 112 170 44 308 50 111 90 -176 105 -297 -20 -142 -161 -2 -36
2056 -36 -159 41 -138 -11 -54 -123 -270 -130 42 -246 181 291 9 -163 -168 29 194 4 165 20 78 35
2078 35 42 141 69 78 88 -42 -129 4 -26 -18 -29 -164 -118 -105 -221 -202 104 -82 192 120 151 22 162 299 67 84
2104H4qk7J1J29j35p6%k18L13k49J07QJ47k08K13j43L5k66p5L74k34J11L0N3M6
2129B2L03l88Q7M7l6J95k97J94p3N2o6J84l93K63j52j99M60o3l26J96j5m9Q0j36
2153a10J84j48N0j11L42j55Q9q9K62l47J29N8j26j14L33j73J11p5j48K33l50Q4
2175g1rJ00NK9k40J86k78j45J00K40N5Pj77J52k16J79j20j28M18J55k64p5K50
2198A53k92J35J69k62M3J17k2Nj63j13K02J94l89k6R3J25j07K65m7J69k18j10
2220g9K72j31q9o5j41M05Ql8pKl53P1n5K27k64K96j45p9K51k35m2L33j61k33L50
2245I8Oj78j18R1J09M4J7P4j46jO8M5j88R6l1l6K8K11o1j49o0j50J74j09j08K10
2271f4Q8O1k27K30m4j34J19q8L70j06j84K01q3r0k76L54n6k14K16k79K98j02j31
$$ plain form
2104 84 76 49 60 189 54 -22 -22 -240 73 -176 -69 -61 86 -122 91 -52 -17 -283 -358 16 -218 -107 -77 -24 22
2129 22 325 -63 24 71 35 230 -67 127 54 106 40 224 -169 94 -58 -257 203 140 -186 10 -5 -54 26 -110
2153 -110 74 -74 -24 -135 207 52 141 52 314 -33 96 154 28 -86 247 74 185 110 -38 195 -155 -71
2175 -71 -80 20 25 54 -186 0 -278 -423 -323 -83 -28 -21 -198 -46 -262 -83 -203 -331 87 242 -22 -97 153
2198 153 -139 -4 165 -97 -54 63 41 46 -117 -230 -28 166 -223 -249 -156 -31 -138 127 80 249 31 -79
2220 -79 193 62 -27 -92 -233 172 180 142 135 137 -216 -145 -200 27 -237 59 -86 -165 86 -149 -191 142 -19 -252 98
2245 98 104 -74 -192 -101 8 52 69 143 -3 -4 64 109 -79 17 -14 -50 -22 189 128 -21 -81 -231 -57 -166 -274 -64
2271 -64 24 85 -142 88 44 -90 29 -59 311 205 21 222 139 49 -227 127 71 -143 73 -206 92 -10 -141
2294a41J65N7k30RK6j3q7L41j26k7l0O8J68k11k4J02O7o3j37J88J9l35J75R2R4
2319A47N3k40lQ2R8l35Q5q7M23k44m6J01J3j7P5M6j77P7J29p3j37j29J20m1J58
2344G8j73mQj6l2L43o3k16L61k82J7QK9j48K57j48L05n18M31k17lo0j76L46j56
2369b9k57R0J60p1j33L64j13L27l33j7K24k72J68j17J66r0J72j41R5j18n6L68
2391C87m01P8j46J41k73q2L39R9l2j79j39J93j25K7J80J29l34J26l2l7o5m8J2
2414a82L11L2M5k70J02%l6L6k14O8j55M02r0n1j33k07L99k33m7K30kj29L66j27
2438A15m2j22J79o8k06K13j36J30k26J73j12Q5J04N9k33L85qq4j42L5mj55K2k24
2462b62J74l29L35J73j12l9m6L38j34j64J32K25k81N2L50k67r0Lj7l26M33j14
$$ plain form
2294 -141 24 81 -149 -140 -114 -127 -214 127 1 -26 -56 12 180 -31 -55 47 114 51 -86 102 121 -214 -39 53 147
2319 147 200 -40 -43 39 137 -198 -113 -200 223 -21 -67 34 47 30 105 151 -26 51 180 107 -30 -159 -39 -80 78
2344 78 -95 -99 -91 -107 -139 204 141 -75 286 4 21 29 58 -90 167 19 324 -194 237 20 17 -43 -219 127 -29
2369 -29 -286 -196 -36 -107 -240 124 11 338 5 -12 212 -60 108 -9 157 67 239 98 193 75 19 387
2391 387 -14 64 -82 59 -214 -296 43 142 110 -69 -208 -15 -140 -113 67 196 -138 -12 -44 -81 -146 -194 -182
2414 -182 129 161 206 -64 38 38 2 38 -176 -108 -263 139 49 -2 -135 -342 57 -176 -223 7 5 -124 242 115
2438 115 73 -49 130 62 -144 69 -67 63 -163 10 -102 -17 87 146 -87 298 290 206 64 99 95 -60 -38 -262
2462 -262 -88 -417 -82 91 -21 -60 -106 232 98 -66 66 291 10 62 412 145 55 58 41 -285 148 34
2484C4j59n7K01j54l8O0N9q9L38j09O1L9q9j16Q4Qk51n7l4K02J85M9j86J11l8
2509E4QJ07n5J29j17j16J9k59L2J82O1j35L23k37P2L4k01K4J59k79M4J67j93J77
2533@l6oJ69q0k21K5K89q5j78K95j67j31mJ05j73J18K44q2l7Jj75n1M1K21k09
2558a27J11K13l11LK55j18r9J06J55r9N2j20N4k05K93l48L0j5J18K4K0J63p8k56
2582a79K53j17J20k51K07m2k13J26J69j55J82k25J85j62J32j6o1o2K13j67n8N7
2604f4K34k44L02j85n8M3o8P9k69LK39j29K5J83q1NJ21R8r5k13M2L1n7J18m9k39
2630b28L12k2m45M67j55K72j63J95j44J11q9j46O4p7N1P8r2l39K92k01M14j68
2652a3O7m5N8m12M80o1P8J11m7k02j35J14J24r2l7N6O1o5l29J88R5j64J11J11
$$ plain form
2484 34 -125 -182 19 -135 -173 -113 -54 -143 195 86 147 186 97 -19 65 73 -178 -235 -269 -67 118 167 -19 92 54
2509 54 62 169 114 243 126 10 29 -230 -198 -16 45 -90 233 -4 68 102 -99 -75 84 -195 -151 16 -177 0
2533 0 -36 -42 127 47 -174 -149 140 55 -123 172 5 -126 -130 -25 -198 -80 164 82 45 46 -129 -180 -139 82 -127
2558 -127 -16 197 -114 -111 144 26 -73 33 188 89 141 21 75 -130 163 -185 -155 -170 -52 -28 -8 155 77 -179
2582 -179 74 -43 77 -174 33 -9 -222 -96 73 -82 100 -125 60 -102 30 14 -47 -109 104 -63 -121 -64
2604 -64 170 -74 228 43 -15 28 -40 39 -230 -227 12 -117 -92 91 10 15 136 234 139 -74 -32 -1 -58 60 11 -228
2630 -228 84 62 -383 84 -71 201 38 233 89 200 111 -35 29 -48 3 81 -11 -350 -58 -259 155 -13
2652 -13 54 9 67 -345 135 74 152 263 216 14 -121 -7 117 25 -12 44 105 40 -289 -101 -6 -170 -59 52
2676E2k27J28j66M26Q6j90r6M7j70j84O5LJ66P7m4o6R7J01l3j11Q6K0P9j84K38
2701B00j57P2L6k1k78J64j72M9p1L71k02R7j55m1j29J65J84l06n1K78J52k13J78
2724A50j21K32j93N8k5j31r3J40JJ28j06k80J24L39k05k19J06K35k26J82j82j77
2746b63K32k3K8K53n18K85J40j87J46%k07p8J80j49J92P6o3Q6k9o9j54K38j00
2769A6q1r6N5r8J65Q6oj89k31M38k16K03j19J22J45j77R8l0j58K58l47J65M3n1
2793eq3K46k95J02J52l02J45J77k11J14K01l59J25J36k93K43j99K57j91J33Q1
2814A74j66k39M74j65Q1Lj2j14L4j60K98j08j6m4l28L32k5k69J42J05j52oj7L1
2838a47oL68k44J72j31O5o5m8N3L8j94J25Mq3k94K96R1j50j1J69Rk1n2J1j6J16
$$ plain form
2676 52 -175 -47 -213 213 299 109 13 60 -110 -294 -229 -226 -60 17 -27 -93 4 105 72 -39 47 67 146 -38 200
2701 200 43 115 151 130 -148 16 -156 -107 -178 193 -9 88 -67 -108 -237 -72 112 -194 -245 33 185 -28 150
2724 150 29 261 68 126 101 -30 -123 17 18 146 40 -240 -116 223 18 -201 -95 140 -86 96 -86 -263
2746 -263 -31 -54 -26 227 -291 -6 134 -53 93 93 -114 -192 -12 -161 31 107 44 130 101 32 -122 116 16
2769 16 -65 -161 -106 -204 -39 47 41 -148 -379 59 -157 46 -73 49 194 17 115 85 -73 185 -162 3 46 -5
2793 -5 -88 158 -137 -35 117 -185 -40 137 -74 40 241 -118 7 143 -150 93 -106 151 -40 93 174
2814 174 8 -231 243 78 159 162 150 36 70 -90 208 100 84 40 -288 44 19 -250 -108 -3 -155 -161 -178 -147
2838 -147 -153 215 -29 143 12 77 12 -36 17 55 -139 -14 -10 -93 -387 -91 0 -150 -161 8 17 -4 -56 -45 -61 55
2864E5l1j85J62l2J12k23P1J37k81L2M13l72L22k87m1K56qk49J08K1N9l01K17
2887d5J31J3r4k14K63j38QJ81k31N3Q2j04K7O5k9L2l26K50qj36J96j7j5J06J35
2912A85k2o4j84J6K24l24J74O9k41Q4j05K74j69o8O1J75Ok14J04J73j92p5L96
2935B83j97j21P2m8N2n6M1n1J11j68k03L48j14l3n2J88P0M2k73K91j23l7q1K27
2959A68J08l15K11k96J91k94J82M9q7J98m8p1M3M5j67O3M1J06j17J00k68N5j36
2982b39J92J46q6P6J47r1k10k01K51j61K54l1j79l15L08L2J29m7K69k02n7M0p3
3005d8j25K96j31L0p7l5M0L03k32mj14J27m0k30K45P3n0n2N1o4q2Q8K6K5J52k57
3031h5J86n2k5J0q4J1O0M1k05k1M10k31j18J59J21l4j86K1J2m6j43J87J14j58
$$ plain form
2864 55 24 -161 1 -31 81 -142 -71 66 -215 -183 230 -142 180 -107 -148 108 100 -149 -41 -20 39 -262 -45
2887 -45 86 99 5 -209 54 -84 -76 105 -126 -73 9 -95 -68 -3 -32 0 -326 -76 -84 -220 -24 -41 -56 50 185
2912 185 163 99 -85 -69 155 -169 5 74 -167 -83 -188 86 -83 -151 -90 85 91 -123 -19 154 -38 -113 283
2935 283 86 -35 37 -11 41 -15 26 -25 86 -82 -285 63 -51 -84 -136 52 122 164 -109 182 59 22 -59 168
2959 168 276 -39 172 -124 67 -227 -45 4 -83 115 67 -4 39 84 -83 -20 21 127 10 110 -158 -103 -239
2982 -239 -47 99 13 89 236 145 -65 -266 -15 -176 78 47 -132 -447 -139 -107 22 -25 244 42 -15 25 -48
3005 -48 -173 123 -8 22 -55 -90 -50 253 21 17 -97 30 -10 -240 5 78 28 -24 27 -37 -119 -31 -5 20 172 -85
3031 -85 101 49 24 34 -50 -39 21 62 -143 -164 246 15 -103 56 177 143 -43 -22 -10 -56 -199 -12 102 -56
3055e6j06J75j69J18J14j62K00k34J22Q8n9K18j96J12j13j58R5q1K1j48K84j83
3077a18K99j49k58K17r7J02j03J62Pj10K31j09j46Q6P5k20K36J38r4k90P1J82
3099A12l8j5q9M1J50j22j1R5l45K95R9m02J66j8L5p2K94j74M5k70J79K16k37K67
3123B01l42K46l05J88j36J04J25j85K40j03j45p2L50k61J13j5k6J54Pk95J18l8
3145g7J14j1l92K22J36j39J0O2K8j80J09J70j65L61j75lR6j85K73k61j81K94m1
3168F5k26M2J91n4j56J67k25K9K45K4j56K4M1O7q2N0j62K17k9M9J83l49j5m1p6
3193a77K42j9j02kj2K62k86J79J62l61K9P4q8K14j18l18M01R6j19l33Q8M00m0
3216A72l06M8L77m04J28o7J09L5oJ0j59j02O2K73l36K74r3q3r6J62M6Lj10J44
$$ plain form
3055 -56 -162 13 -156 -38 76 -86 114 -120 2 90 31 249 53 165 52 -106 -11 -92 -71 -219 65 -118
3077 -118 181 32 -226 -9 -106 -4 -107 55 62 -48 183 74 -72 14 89 -131 105 243 149 -141 -70 112
3099 112 74 59 -30 11 161 39 28 123 -222 73 172 -230 -64 -82 -47 -119 175 1 46 -224 -45 171 -66 201
3123 201 -141 105 -200 -12 -148 -44 81 -104 136 33 -112 -184 166 -95 18 3 -23 131 138 -157 -39 -77
3145 -77 37 26 -366 -144 -8 -147 -137 -75 -47 -227 -118 52 -113 248 73 70 166 -19 254 -7 -188 106 65
3168 65 -161 -119 72 18 -138 29 -196 -167 78 102 -54 -30 11 78 -4 46 -116 101 72 121 304 -45 -60 -101 -177
3193 -177 65 46 -56 -58 -70 192 -94 85 247 -114 -85 -11 -99 115 -3 -321 80 176 57 -276 -188 212 172
3216 172 -134 -86 291 -113 15 -52 57 92 86 96 -63 -165 -103 170 -166 108 15 -68 -164 -2 44 47 -63 81
3240H1k1l21K69j06L09l32L4L2j18L61j69J32k78K27j48R2M1j43m6om6J24l76
3263d08J52L48o2K1j27K76k54K0k51K26J0o2K72l81K54M8L6j4O8l19N23l27l5
3286A4P8P0Q0l03L3J29K0j81q8j04K27M2J0k17J93k8J97l11J4J04J58J04k44O0
3310E7J38l10J9M4j6k2L09l21P3J37J05k92J37j94K91l16J06M0M4k25N2L2j9K16
3334H5R6j76n6p6P8R3j45L55m3n6k44l3NK33j8j40QL0M4l4L47m50J07qj54Q3J15
3361D6l8R8l0J1k10j57L15q6K7R5j55J7J80J07k42R7J8k22K05J7J8k54L50j33
3385G4J25R6j93j09Q3k59J11O6K61l69k6K66j22Nj64O3O0Q3j11Q0j1j96L11j21
3409Cj26r0L87k19l1R1j16j1mK00k5k09N9J76J43k60qo0Q2LM4K24k65Q8l11K30
$$ plain form
3240 81 60 -261 8 -98 211 -121 -87 -55 -173 188 19 151 -127 100 -48 44 85 -58 -104 -110 -156 -32 -408
3263 -408 -256 92 30 51 -76 200 -54 -34 -285 -59 -49 -111 161 -220 34 82 118 104 172 -147 376 49 14
3286 14 92 162 242 -61 -28 101 121 -60 -148 -252 -25 17 27 -190 3 -25 172 -139 -125 -21 137 241 -3 57
3310 57 195 -115 -96 -52 -68 -90 219 -102 -29 108 213 -79 58 -136 155 -161 -55 -15 29 -196 -144 -112 -131 85
3334 85 181 5 -51 -127 -49 44 -101 254 211 155 -89 -122 -117 116 98 -42 -34 -4 40 6 353 -97 10 2 -152 -69 46
3361 46 8 106 76 87 -123 -280 35 -51 -24 71 -84 -67 113 220 -22 75 93 -129 76 93 111 -143 207 74
3385 74 199 295 102 -7 76 -183 -72 -6 255 -114 -140 126 4 9 -155 -92 -32 51 -60 20 9 -187 124 3
3409 3 -123 -213 174 -45 -76 15 -101 -112 -116 84 59 -150 -91 85 228 -32 -40 -100 -18 -15 29 253 -12 76 -235 -5
3435eJ88l13J53m33L72J24j00j24J93n2J3j09m2M7M20k83j26K37n33J97K11M6
3457H1j56M1o4J12n3k3k1M1K43l50J00O%P2k72K59j09M06l25L10l09j07L22oj04
3482I4j96kL9J14q6J12j92K10k25L70j54J33m58J1J72lJ24j5m0J52r2l3J17k6
3506A26k33J35j59N19k39k07J51j71K84m08J34o6K80j97J22j35J56p1J54P2q6
3527A61j54j08J29l1J00k13j47K67K2J07j52J13k50K17o4K1LO4l8j04J11m9j77
3550a72q8L02q6J8p9J85k33K90p2n9J33j42M4j62m4Q1K3J77j24q2R5K0J27l88
3574b36K8J61L9q5K16j3m81K50J30K5N5o8k52J12J08K71l38l4J82J4p1o9j41K31
3598C4J9Q1q4M4j77J78k57K20k49J62k4K86Kj07j98K26j15j5O1k95J46qj18K16
$$ plain form
3435 -5 183 -130 23 -410 -38 86 -14 -138 55 3 16 -93 -135 -88 332 49 -77 160 -373 -176 35 81
3457 81 -75 -34 -98 14 -39 -62 -83 -42 201 -149 -49 -43 -43 29 -243 16 -93 313 -12 298 -11 -118 204 198 94
3482 94 -102 -104 -65 49 -37 75 -117 93 -132 238 84 217 -241 -230 -58 -61 63 48 8 160 68 35 152 126
3506 126 -107 28 -131 388 149 -58 93 -78 206 -202 -68 -134 146 -51 71 -64 92 21 175 247 161
3527 161 7 -101 28 -3 97 -116 -263 4 26 133 -19 94 -156 61 -3 18 21 85 47 -57 54 5 -172
3550 -172 -260 42 -44 -26 -105 80 -153 137 65 6 139 -3 41 -121 -165 -84 -61 116 -8 -90 5 25 152 -236
3574 -236 -208 -47 -8 -93 123 110 -371 -121 9 34 89 21 -231 -119 -11 260 -78 -112 70 84 13 -56 -197 34
3598 34 53 134 50 94 -83 95 -162 58 -191 -29 -53 233 235 128 -70 156 41 26 87 -208 -62 -70 -188 28
3622B8J47l4M0j39O9K6l42K56J19j21o6K5J61j97J79j61r7K5J35j82R2j9j4J43
3646G3J25k69J13N3J14m2m9k22J2K4L51j44k57L4l3K9J38k50P4K47j1k41j9K00
3670E0n0j59K17j30J6J86J45n11K65P8k23n1K97Rl74J8L11l5j90J04L90k26m02
3693b65P7J44J14k03K20q6oO3j45L2j44M40j90J30m27K37r1o9L08n8N7j56j05
3716a23jL04j12K01q1k53l4K92k72K33j96K42l97J97J24q5j94J51Q2mj29M2Nk6
3740c4N4j39lj05J98j3P8j24M00m10L26l5j03J17k09K45j55J9j34n6Q5J01q0K05
3764B28k85J89j24j78J62M0J52k39J05j28m4J71K45k19j93O1K9k79M86O0l68K69
3786A40p0j03j08p4L61j66j61K25p3r9J81j66L41k66n2J81k72L65j33j96J43o6
$$ plain form
3622 28 175 141 181 42 111 137 -205 51 170 49 -17 8 169 -28 151 -10 -107 -82 53 -129 -37 -56 -70 73
3646 73 198 -71 42 95 209 167 118 -104 -92 -68 283 139 -118 -84 -117 -88 50 -200 -126 121 110 -131 -150 50
3670 50 0 -159 58 -72 -56 130 275 -236 29 107 -116 -167 130 139 -235 -217 94 59 -131 -27 363 137 -265
3693 -265 -188 -44 70 -133 87 1 -5 58 -87 -55 -199 241 51 181 -246 -9 -100 -169 139 81 138 -18 -123
3716 -123 -124 180 68 269 188 -65 -99 193 -79 154 -42 200 -197 0 124 39 -155 -4 78 74 -55 -13 -8 -34
3740 -34 20 -119 -122 -227 -29 -42 36 -88 312 -98 228 193 90 207 -2 243 88 107 -27 -83 2 103 23 228
3764 228 -57 132 8 -170 -8 32 184 -55 50 -78 -122 49 294 75 -118 -57 -28 -307 179 239 -129 140
3786 140 70 -33 -141 -215 146 -20 -181 44 -29 -128 53 -113 228 -38 -90 91 -181 184 51 -145 -2 -68
3808f8P5oj99K08N1j81K11Q4k40J67j59O2j83L58j85m0L5k68L01j07j4L4K55R3
3832B84m61K32M6K6k39j00K68j92J32l5J36k0O6K7k55J71J93k8m37N1J39k11J5
3855a92J19l7m5R6l22L76l8l1J11k41L03m88J94K00K0J76kj70Q0Nk43J42J25J91
3879C29k45J6p7j4J49%k78R0J05J1j07j05J69j65K02j10p5R2J73r6k6J35l35K21
3903E9n5J07j25J40o4J53n1j58Pj02K01J03k35K77O1n86M28RL1k06mk41L23l89
3927c17J80K19r4J94j63o3K31k45roj40M0L6J1j68K13j04J80j35N9J00R6j68n3
3951a06N3J12j84J43j8L1j78Q9P1rL3j47o9J01ln0O1j48L26l67L14j6r8j79K99
3976F1j00k84K98M1k85K08J99K4l82L16j70K52j40N2k27L8R8K03l37m6MK21m6
$$ plain form
3808 -68 7 1 -198 10 61 -120 91 175 -65 102 -57 5 -178 180 -5 -45 -10 -278 23 -84 -98 -64 191 284
3832 284 -177 55 101 127 -112 -212 56 -136 -4 -39 97 77 143 170 -85 86 279 251 -186 -135 4 -207 -192
3855 -192 -73 -110 -155 -59 -381 -5 -43 -74 37 -204 99 -389 -195 5 25 201 199 29 109 114 -129 13 138 329
3879 329 84 100 23 9 158 158 -120 -30 75 86 -21 -126 43 -122 80 -30 -105 -13 160 64 38 173 -162 59
3903 59 4 111 -14 126 62 215 164 6 13 -89 112 215 -20 257 318 -268 160 169 200 -6 -10 -251 72 -317
3927 -317 -137 82 -12 182 19 -44 187 -58 -67 -73 -213 -173 -137 -126 -294 -81 -185 -5 -140 -81 19 115 -53 -106
3951 -106 -53 59 -125 18 0 31 -147 -58 13 4 37 -110 -179 -78 -81 -131 -70 -218 108 -259 55 39 -59 -238 61
3976 61 -39 -323 -25 16 -269 -61 138 162 -220 96 -74 178 38 90 -137 -99 -1 202 -135 -181 -177 44 -2
3999bJ26k01J46O9P5j33j36l6k6J96j32j82L28M4j49J32n0J06j40k00Q2K21M4
4022A82n9j92J32j8m0k19K18J38q2R0k10J68j51M9M6j50P1j17L54j85J72j72J9
4045D4k74J65K19n0N9j33K37k59j49m2K31j71L38o5k65J34p5K1L6j67J94J08J61
4068B97k36L20l59j04J99Q4k00r6L62j48J96n33O8J34j94J80J86l0j38J69k26
4089f9L14j82j0l00K98k4Q5Q4j00k8q9p7N2J71N3P5l47J52K0N7k80p6J80K8j20
4114a33J45l0l9J35k43L68l65K89l11J75K45k78q4N6n7J83o6p0j38J75k2K19m31
4137b77L60j33j0k9O9R7J1j61l49N13j98J80J31l32L8K42o6j31K9O4j07J38J59
4160B38k29r4K46j64j70R3k04L19J3p4K18k08K43j57n3K3N4J18j80j32J85p9m7
$$ plain form
3999 -2 124 -77 69 138 213 80 -56 -92 -118 78 -54 -236 92 136 -13 119 69 175 35 -165 -83 138 182
4022 182 123 -69 63 45 5 -214 4 142 60 150 -60 108 -43 6 52 -98 -27 -144 210 25 197 25 44
4045 44 -230 -65 154 104 163 30 267 8 -141 -183 48 -123 215 150 -115 19 -56 -35 1 -166 28 136 297
4068 297 61 381 22 -82 117 201 1 -95 267 119 315 -218 -150 -16 -210 -30 156 126 -12 157 -69
4089 -69 245 63 53 -247 51 27 112 196 96 68 -21 -98 -46 125 178 253 -94 58 78 135 -145 -221 -41 -13 -133
4114 -133 12 -18 -57 78 -165 203 -162 127 -184 -9 236 -42 -126 -70 -127 56 -10 -80 -218 -43 -65 154 -277
4137 -277 83 -50 -60 -89 -20 77 88 -73 -422 91 -107 73 204 -128 -90 152 86 -45 -16 48 -59 79 238
4160 238 9 -85 161 -3 -173 -80 -284 35 48 -26 192 -16 227 70 17 40 94 212 32 -100 85 6 -41
4183d1L4l06M31o2j65%K03j37J66j22P8k34K60j51L7l2J5L05l00o0N1P8J03k74
4207a23R0J08p0N7j31O8Q6R8k65N7R8j88J84l4r4l7n9J27Q5R2l49J25J88l20P4
4232a33L5L32j20j67J78j29o3k8R1k00K12OJ36R9k63j8J18L4j34j31K70J18k28
4255A5k28K40j74K53j29J81O6n3rj67Nq6M2j04J81j80OJ25k9k48J61JL85m45L72
4280A81K7n19K02K70k53J09J17k47J31oJ32p4p0R5k46J44R6L1rk35l1Q2k5O9j34
4305a63J91J91k99J51j00N1K8O5L0l34L06N9k07J07n9k93K4L68j83K37n7n7k05
4328a49J78J84k39N2L06n52J1J76N4O8j47r3J63j13r3J70M9P5L8m2P1q2k86K06
4352Ek40K59J85j68J14j06l61L49Q8r9J39J14l62J22j28R9q9K9J03m7P9m3l7j09
$$ plain form
4183 -41 -7 -313 118 56 -109 -109 94 -43 123 1 79 -155 105 -46 -9 -41 -26 279 -21 -81 -30 48 151 -123
4207 -123 -33 75 5 62 -69 -1 85 183 -82 -25 73 -115 69 35 -59 -96 -155 -28 57 149 -200 -75 113 -207 -133
4232 -133 -98 234 114 -53 125 -4 -67 -95 -4 -204 8 14 150 249 -14 -32 86 120 -14 -145 125 243 15
4255 15 -213 27 -147 106 -23 158 224 171 162 -5 0 -86 -44 -148 33 -147 -141 -16 -45 -293 -132 -131 254 -191 181
4280 181 208 -311 -109 161 -92 17 134 -113 18 12 144 70 0 95 -151 -7 89 120 111 -124 -155 -73 -98 -29 -163
4305 -163 28 219 -80 71 -29 22 50 115 145 -189 117 176 -31 76 17 -276 -252 116 -67 170 113 56 -149
4328 -149 29 213 -26 26 332 -220 -209 -33 21 89 -58 -151 12 -101 -194 -24 25 100 138 96 167 85 -201 5
4352 5 -235 24 209 41 155 49 -312 37 125 26 165 279 -83 39 -89 10 -79 -50 53 6 85 42 5 -104
4376a04J63j46j15K90j36K03r4LQ1k69J44j17J56o8pM4R6k35j43K15k13L74j5
4399A07n2j98j2M5j54K67Lk04P2L92l59J04j74L31M1j41k5J9J2J6N9o8q1k20J69
4424e1K29k19k16K31N9J34j68Q4ol40N12k84J80k2j5j46j6j2N7R4l67J66K15k82
4448a83J88n6J38q6J10j70J04L8p8J02k67J89L9J16n1P0k16M5N0N1J07j39k6O0
4472A35k06K21j96O3q0K7ML42l32Q1q7M1P9l77M17J50l29QK59m58K47R2l45J61
4496h3Q5J98j37J21k17J2p8J81j52K0K62k95K00n4m4m7m5J51k58L47k54K18j37
4519fJ22KL5o5j24O2l0M1j85J66qJ5R3oj4M4k78J20qM8k4j73K34j29J66N3N4j04
4547A01k64M3J57l5K04l82L47k49L1j5j1Q4j09L4n3L23j68j85K6J66N0j19m8J25
$$ plain form
4376 -104 59 -87 -202 88 -48 155 61 64 145 -124 20 -97 59 -9 -16 28 124 -111 -254 -39 -252 122 107
4399 107 55 -143 -155 -110 -264 3 6 -198 -126 266 -93 11 -163 168 209 68 43 62 74 90 149 81 0 -220 -51
4424 -51 178 -41 -257 -26 33 167 -1 83 77 -263 249 -35 145 123 108 -38 -54 -66 -9 85 -282 -116 99 -183
4448 -183 5 -51 87 1 111 -59 45 83 5 107 -160 29 68 184 133 203 -13 32 82 133 240 101 75 135
4472 135 -71 150 -46 17 -63 -36 -32 310 -22 59 -28 13 92 -285 132 282 -47 -39 220 -238 9 101 -244 -83
4496 -83 2 200 63 184 -33 -21 -99 82 -70 -50 212 -83 117 63 19 -28 -73 78 -180 167 -87 131 -6
4519 -6 116 118 153 88 -36 26 -4 37 -148 18 10 25 118 112 98 142 -136 -16 -24 24 0 -173 61 -68 98 151 205 101
4547 101 -163 -120 37 2 206 -176 171 -78 -47 -62 -73 11 -98 -64 -117 206 38 -147 -121 45 95 -24 -72 53
4571E3j65K78k70Lj1M11k26J13l14K80p8R7j21k28j1J75k20J07N6j2J37j65J47
4594C6j97M67l49L01l47J36j80Q9r0K74k06l6J39k2L1o0k16K48J06l64M71m80
4616b49K09Q2k6K49k56q1K00M2r9n9mj79M85l28J35k43r7L49O7j72N4j59K3k12
4640b69K32J92q7j88J22pl9J48l09R5j22K35K41l38L4oP9P3P6J19k23k02J11J24
4664I1j21o3Q4j01J50j29P3j02K38k93J20J88j18j58K29o6Nj58N4R5J24Kp2j69
4688i7M5l2j11K18j98J77J74j05l5K4j56J32j27l2J65j58j10J34M1j16N8mL5K30
4712A52j29j30J97M5n6j32l07K28J79o9K8M6j14J7J29j5k07O6K05k90n5L65k83
4735a30o6J44J15q3j04J51j76J96J45k73J68k5R1j15k7j24k2RJ94n6M2J30j43
$$ plain form
4571 53 -112 166 -104 -101 -112 299 73 186 -128 152 74 171 50 -178 -189 -14 -234 -127 -71 -83 54 -111 36
4594 36 -161 306 -43 258 -89 47 -133 -44 -134 140 -66 -102 37 15 46 -14 -230 18 124 -240 231 -249
4616 -249 -40 42 16 265 9 -72 128 170 71 12 8 -171 314 -14 121 -122 -219 130 197 25 79 -80 -57 -269
4640 -269 -37 155 68 -120 2 -5 -44 104 -205 -110 -232 3 244 -94 -60 -66 13 86 162 281 58 -144 -33 91
4664 91 -30 -93 -9 -110 40 -89 -16 -118 120 -173 -53 135 17 -141 88 22 27 -131 -77 18 142 144 72 -97
4688 -97 -52 -84 -195 23 -175 2 176 71 36 60 -96 36 -91 -123 42 -116 -226 -92 -51 -167 -109 -113 -78 152
4712 152 23 -107 90 135 79 -53 -360 -132 47 -22 6 52 -62 -45 84 69 -138 -72 133 -157 -212 153 -130
4735 -130 -196 -52 63 -20 -124 27 -149 47 192 -81 87 62 153 38 11 -113 -135 -126 68 12 54 184 41
4758D1j47M01m07L5J6K1K82o0k15k7qq6Q0Q8k94K83J3l2J33k05j2L19k0m58K56
4783cOR0j06J4K25j91o7r8M7K05j93J56j35M3k10J55Q9j39O9l2j84K16J24P6m9
4808A08j65K57k95K4J7M9K37k20J27l72L46k93K48J20k26Q8J0j00K4p9K4K23n9
4831I3K8k21P5K6K30l31J94j11P3k03k0J52N9N6j44K09p1l9k64RK40J4m5J7j70
4856a44J01K31k59j13L30k08K10k47K91k41k7J72l6k12q1J76j4N3R9l7n1j17q9
4879b13J06j07K44k5p5J86k03JK00m9p0j51K61j92RK27j46j36N5J93j65M1k84
4902b93K20J10j43m8K54j7k74L17o6J29k09K06J62l26n0P6L1n3j31N4r5J17J68
4925A39O7j85J25O1k86J24q4k4R5o2l8l2J48K4n8n7q1J56n1l8J09O9j12j25M00
$$ plain form
4758 41 -106 295 -112 -77 -61 -40 242 182 -33 -60 -68 -154 -74 14 -280 3 16 -16 117 -88 -100 219 199 -259 -3
4783 -3 3 93 -13 1 226 35 -32 -130 -83 122 -71 85 -50 -7 -217 -62 27 -112 -43 -75 -259 -43 81 157 108
4808 108 -57 200 -95 -71 -54 -5 232 12 139 -233 113 -180 68 188 -38 50 60 -40 -16 -95 -71 152 93
4831 93 121 -100 -25 1 231 -100 94 -17 56 -147 -167 -15 44 100 -44 165 94 55 -209 -200 40 54 9 26 -144
4856 -144 -43 188 -71 -184 146 -62 148 -99 192 -49 -76 96 60 -152 -233 -57 -71 -18 81 44 -7 -124 -213
4879 -213 -107 -214 30 5 -70 116 -87 -86 114 65 -5 -156 105 -87 -78 149 3 -133 -78 115 -50 -9 -293
4902 -293 -73 37 -106 -154 100 83 -191 126 60 189 -20 186 348 22 -28 48 79 26 -105 -51 -146 -29 139
4925 139 206 21 146 207 -79 45 -39 -63 32 -30 -68 -100 48 72 14 -43 -124 32 -19 -57 52 121 9 -116 284
4950B84m76J40J6Nn1K93L0m05N7J51J44j93m9m5J46N5o6l17J04P0J55j88L85m85
4974b40K53J01M8j32O2l39L70j54J61j12r4o8R5R4L8r3J05o6q0K44k07p2lJ35
4998D6K5k8j1L49l64k90L8J80N0j02P9j02L33m3j07K5j59J4j19j28L87K7l47L49
5022A02k46K9K02k89P5L48J14j07l48pP6jM2N4k7j04K3K74k09k13J03J56j23m4
5046a20K39j56j42K68j9j36J78m9J3M9n0J7p6n9k6n6K44p3Oj08q3J97J29K5j67
5071D5j73P9J12O5j59n6J66j80P2k55L66O0j22m5j44j4q3j1M47j04j05L12l37
5094f4J43n0J01k41m3J39J38j72J01k88J41J16n1Pj27J76k61K69q2o3J86k20M7
5117i8j32K96j3k36L81k37J00k70J69P4q0L1J21j02M5M1PJ54l45L79m07J9K7Q1
$$ plain form
4950 284 -192 -52 -36 -31 -82 211 241 -164 -107 44 188 -5 -54 -99 47 102 36 -281 -177 -107 48 -140 245 -240
4974 -240 13 114 162 30 92 -247 123 -31 130 18 -76 -144 -49 45 83 -10 95 29 -51 193 -14 -86 -89 46
4998 46 71 43 32 381 17 -273 -235 -55 -5 -107 -28 -130 203 160 53 78 -81 -67 -186 -314 73 100 -247 102
5022 102 -144 -115 87 -202 -127 221 335 228 -120 -127 -51 -52 -10 44 17 -87 -64 210 1 -212 -109 47 -76 -120
5046 -120 119 -37 -179 89 70 -66 112 63 76 125 75 92 16 -43 -69 -125 119 46 52 -56 -139 58 187 212 45
5071 45 -128 -49 63 128 -31 -87 79 -101 -29 -284 82 142 20 -25 -169 -183 -266 -277 170 66 -39 273 -64
5094 -64 79 29 130 -111 -154 -15 123 -49 52 -236 -95 21 -30 -23 -150 26 -235 34 -48 -111 75 -145 -98
5117 -98 -230 66 53 -183 198 -39 61 -209 -40 34 -46 -15 106 4 49 90 97 251 -94 285 -122 -103 -76 5
5141EJ64k17l2K07q8k10K53k04k4o5J76m0j42K61m9J48j38m2Q4k86K22K24j57
5164E0J14j23k3r8K22j07j58J61o6J48j81J62o5j13O1O2oK35l26K1k31Q7R7q3
5188a60M61j28j25J9j28p8J13JJ8j0K18l90M13m41O1J26k09L47k56K54k04K71
5210A73R0m07k5J16K49j85L8J04l13J41J61j94K78j73o9L1m4m6j87J84J71l49
5232b56M19k23r4K43j04L3m8J61j66J51j39j98K58j26P0P6l12N18j17j63q8J94
5254H9P5j53K8j33n7L23j99j20L2K41k9o3j37L52k71k45L15r7Q8l17L53N9M4j43
5278C5j33K04l02K17or8L32n16M22q4j97L24m10L14m5L2k71K90L13m23n5LJ1j55
5302a98J78J39j7j93L37j36l8j44P2q6j00l2M82j59j68J61j42J66k77P2K72j53
$$ plain form
5141 5 169 -48 -80 127 39 -171 82 -122 -146 -211 -35 -75 -217 44 -5 143 5 -37 47 -239 -17 207 50
5164 50 164 41 18 -80 142 35 -123 38 -28 120 -61 101 36 -77 -16 46 40 275 -51 -30 -261 -174 -77 -160
5188 -160 301 173 48 67 -61 -139 -26 -25 -7 -17 201 -189 224 -217 -156 -30 -239 108 -148 106 -98 173
5210 173 263 -144 -169 -53 196 11 49 153 -160 -19 142 -52 226 53 -16 15 -29 -75 -262 -78 93 -256
5232 -256 163 -60 -154 89 -15 18 -30 131 -35 116 -23 -221 37 -89 -19 57 -255 263 146 -17 -105 89
5254 89 164 11 39 -94 -151 172 -27 -147 -115 126 97 34 -103 249 -22 -267 48 -49 39 -278 75 134 178 35
5278 35 -98 106 -196 21 15 -83 249 -267 155 71 -126 198 -212 102 57 89 -182 108 421 -2 -57 -54 -43 -198
5302 -198 -20 119 102 -91 246 110 72 -72 0 -86 -186 -218 264 105 -63 98 -44 122 -155 -83 189 36
5324C6l04L31j4L8j81R7K87k72K75l84O3J28l05K01o8n7K82j29p0k67L19j17J88
5347G7j05K37k63j6J95K80o03L23N8j22j7q1p9K47l37L7J53J29J44l80j1J70K08
5370B44k45K6pOl21M34N9j51j60j07L73j41pQ4j42K47k38J7P6k91Q7K04r1J19
5394G5o5k66J07J43K74j77j88r1Q0j58M52l83K38O7k1k84K68L8j29J7j18J20j07
5417a08K6K43k59L15k66j9K80j56j60J22k04J8J12j70n5K75R1j59m7N2l8R1L0
5440A4J2j37o0J39j10K39r8j79J35Q8J96l70J46n0J74m2l5k20J99j14n9Q5k5p4
5464a46J26Q5K60m60o3L71l41K67j74j72L00K05l47O6K43k86m9K17N2n2p6l91
5486c65L21jK4J8Q6j2m3k5N4K2M1j3j81ok7J18K9N7J10p7m9j45Q3J6P3j20j90
$$ plain form
5324 36 -268 63 49 87 -94 3 290 18 293 -91 -28 100 -205 -4 -72 -129 153 24 -46 -313 6 -111 77
5347 77 -28 209 -54 -70 125 405 -198 125 183 61 44 -37 -116 131 -206 -169 -16 113 257 -123 -134 36 244
5370 244 -1 25 18 24 -297 137 196 45 -115 -222 151 10 3 87 -55 192 -46 -29 47 -244 -157 47 -44 75
5394 75 10 -256 -149 -6 268 91 -97 -188 -108 -266 186 -197 41 108 87 -197 71 109 -20 -3 -121 -1 -108
5417 -108 -82 161 -98 217 -49 -68 212 56 -104 18 -186 -168 -56 -226 -281 -6 85 -74 -121 -69 -107 -16 14
5440 14 26 -111 -171 -32 -142 97 -1 -180 -45 43 239 -131 15 -35 139 97 62 -158 41 -73 -132 -47 -72 -146
5464 -146 -20 65 325 -135 -198 173 -168 99 -75 -247 53 258 -89 -23 220 -66 -115 102 154 102 26 -365
5486 -365 -44 -45 -21 -3 83 71 28 3 57 79 120 107 -74 -80 -107 11 40 97 207 130 81 -64 19 35 108 -12 -202
5513b02J08K43k8j13J40k39J78L8j01k8n3K29k65r0M8J38J62l14K74n1j32QJ42
5536I2j67Q3K54j06n1J11k80J95k45j25K52k40K42P9k22L36l00K0J63j81l07M62
5558F5l4j74L2K92l25K05j17K15l87K63J19J1j06J3J46k92Q5k57J88J23j51K3
5580f3q9J99j0P3n9RN0q8O3n7K6K34k32P6k25P8J25K38l13o9P2J8m6O1J21k62
5606g0j69L41k55J57R2k61J09J7p4J45M5j15J8K11j82j06J88j43K29L7j09j40
5628c5J06j28R4J15J02l69M6k75M99m34L65J74l16N3P4j26R8o6jK27k59o0J33
5651A7jo6%L4j9J33j03L13n2k92L6j1k4P1Q5l70L13M5k48q6K46J63k58K19o8j21
5677d4p8K22j77P5J33l86J11L63k56O0j0lJ04M5k56j13J06N7j37J80P1l85L90
$$ plain form
5513 -202 -94 149 121 8 148 -91 87 125 24 -4 -57 172 -93 -183 -135 3 165 -149 125 74 -58 -50 92
5536 92 -75 8 262 156 105 216 -64 131 -114 -239 13 -227 15 94 -128 208 -92 -72 91 -90 -397 65
5558 65 31 -143 -111 181 -144 61 -56 159 -228 35 154 165 59 72 218 -74 11 -246 -58 65 -86 -63
5580 -63 -152 47 37 110 51 60 110 22 85 28 54 288 56 132 -93 -15 110 348 35 -34 38 56 10 71 192 -70
5606 -70 -239 102 -153 4 96 -165 -56 -39 -113 32 77 -38 -20 191 9 -97 91 -52 177 214 105 -35
5628 -35 71 -57 37 152 254 -115 -69 -344 155 -279 86 260 -56 -3 71 -55 43 -23 -24 203 -56 -116 17
5651 17 16 -50 -50 -16 -35 98 -5 308 256 -36 0 -11 -35 36 121 -249 64 109 -139 -225 21 184 -74 145 77 -44
5677 -44 -122 100 -77 -2 131 -255 -144 219 -37 23 13 10 114 159 -97 -210 -104 -47 -184 -4 67 -318 72
5700G2k01N7m6K52k11KQ2J84j0k52J13k4j11q6k6L36q7r1K44M7j09k42J48j70
5724a29L54n41J75J21k60K54r3Q4q1R5J10lr1mM8n08L38K2J37k15J3L02l3j36
5748d1K58k92p5P2O5j75l1J83M8q9P7j08j7K31k53J41o4qJ93P5j04j07j49K76
5772A06JN0p1j05m4P2J03o7O6k04J15j07J41l4k31l0K05o3p1k8k3L57j36Q2Q2
5797A66l72K90q2k0J75j59M6q1k38K40J12j24JJ38n9N9r7JK26l61n9L41j26j71
5821a54L55n0l25K32mj37j53K25J30l08L08o5J4M0j57R3K22k82J74P1r5o9Pj13
5845d1%p7L34j96j43j47K53K21j59j7J11j17j20J57Nq0K14l82J61J68l35J19O1
5868a0j05J14J37j94j28K30j50M9M9l0j54K78k70P4J80j36J13j27k37L35j57K98
$$ plain form
5700 72 -129 -72 -118 134 -77 -75 7 191 181 -71 42 18 -93 -179 -205 131 44 -47 197 244 135 -107 41 -129
5724 -129 225 -316 -141 -20 -280 -26 -119 -35 -116 -21 89 86 -5 -9 39 -469 -131 -109 28 -187 -174 128 95 -41
5748 -41 217 -75 -150 -78 -13 -188 -219 -36 12 -77 0 -108 -125 106 -147 -6 -70 -78 115 190 86 -21 -170 106
5772 106 107 157 86 -19 -63 9 112 45 111 -93 22 -85 56 22 -209 -239 -34 -97 -168 -196 -219 138 2 84 166
5797 166 -206 84 2 -18 157 -2 44 -37 -275 -35 77 -47 -46 92 33 92 -5 -4 222 -139 -198 143 17 -154
5821 -154 201 151 -174 58 54 -83 -236 -11 119 -189 119 54 68 108 -49 44 266 -16 158 229 134 65 72 -41
5845 -41 -41 -118 216 20 -123 -270 -17 204 45 28 139 22 -98 59 64 -16 198 -184 -23 145 -190 -71 -10
5868 -10 -115 -1 136 -58 -186 44 -106 -57 -8 -38 -192 86 -184 -110 70 -66 47 -80 -317 18 -139 159
5890A59j25j28J26j70K18j77K60j39n0J13m0o6n1J88P5j11J30k90K96m04L63j15
5912F2L4n8q6K88k20o3j37OL20k04m8L1J88k32K33O5k94J06j0J8l2j87J38L07
5936B25j37k00J48k04J38j8j30K02l1q3m9K73k46L17j99j20lJM48l46J50P4k47
5959c7R8N7Pl05J23K62j20o8k7R5j4j52J39J08O5k80J53M6k14P6L66m35q7M3O9
5984c2O9j83k3K62k7j16L9J11K67k51jj64K10k40J45m3N5k4j06O7R9k1M0j12j23
6009a02J24M8M75n91l2L26k71K2m2J9l4O6MR7J52n38L92k54j1o0J20j33J08m1
6033a56MQ9j06J87j45J22q2M09m07K72p9k15K57j29KL67k00k20o3j99N37l5k53
6056d3j6M3M4J1J4N6k74M2N6NN1m4J67O0j29m1k8j43J89R0j06MJ50j14O2j17J1
$$ plain form
5890 159 34 -94 32 -138 80 -97 163 24 -26 87 47 -19 -70 118 193 82 212 -78 218 -186 177 62
5912 62 96 38 -48 240 20 -43 -180 -174 146 -58 -106 -75 113 -119 114 179 -115 -9 -19 -1 -33 -220 -82 225
5936 225 88 -112 36 -168 -30 -48 -178 24 -7 -90 -139 134 -112 205 6 -114 -117 -116 332 -14 136 210 -37
5959 -37 61 118 125 -180 -57 205 85 17 -10 85 71 -81 58 166 231 -49 104 150 -64 12 378 -57 -144 -101 -32
5984 -32 37 -146 -169 93 66 -50 -11 100 367 116 115 -49 161 -79 66 23 78 54 -52 15 114 93 133 21 -102
6009 -102 22 70 545 -46 -78 248 -23 -1 -43 -24 -58 8 12 109 261 -277 115 -139 -150 -210 -90 -223 -115 -156
6033 -156 -152 -63 -169 18 -127 -5 -87 322 -85 187 108 -107 150 21 23 390 190 -30 -93 -292 245 210 -43
6056 -43 -59 -16 28 39 53 109 -165 -123 -67 -62 -11 -55 112 172 43 2 -26 -169 20 110 4 8 158 44 106 -11 0
6083@o7r6R6J51Kl1J70j15j8k40j49K67P9n0j11K40k06N3n5k4j62M2N35j69j75
6108c3J35o7k94M86k45K58j58J69k82j35L61k08K6l3J25P8k63j2J66k79L35j6
6130A14j18R4q6q0J18K5J21J32m2l68m7l5K20L7j37M9n5lN0L34l12P7Q6m1k36
6155a03l8m7K54k50L16k38lP8p7K23l06QL05M6k53K43l93J68J96M3l4j95qQ7j35
6180a13J57l0L0k6o6j48J7J06L00k81m6pQ4k08J95K05j36J42m15K94r5j09pJ66
6204Ik83l8L24J94k08l8J56J1k06J05JJ9R4j06q4J04k30J22m9J54r7o0P0K08l40
6229a68J61j27J45J01l33K83j47J13k72J99M9n8M1k61J46K73j07J72j64l9N7l2
6251C2j17R8o3L30k02j05J0N3J41k69j93M83l20l7R5j82K21K30j5k12K1K2j41
$$ plain form
6083 0 -67 -163 -67 84 86 55 225 110 92 -148 -297 -30 49 -1 -112 128 -78 -25 -80 -104 -266 -224 311 142 -33
6108 -33 102 35 -259 227 -18 240 82 251 -31 -166 195 -13 13 -20 105 183 -80 -92 74 -205 130 114
6130 114 -4 90 4 -76 42 67 188 320 278 -90 -137 -172 48 85 -52 -3 -58 -61 -11 323 11 88 174 133 -103
6155 -103 -141 -188 66 -184 132 -106 -109 -31 -108 115 -191 -183 122 168 -85 158 -235 -67 129 172 138 -57 -65 22 -113
6180 -113 44 14 44 18 -48 -196 -179 -73 227 -54 -100 -107 -23 -231 -36 169 33 175 -240 54 -41 -150 -157 9
6204 9 -274 -312 12 206 -2 -40 116 127 -79 26 27 46 140 34 -50 54 -176 -54 -103 51 -46 -106 -36 172 -168
6229 -168 -7 -134 11 112 -221 62 -85 28 -244 -45 4 -54 -13 -274 -128 145 38 210 46 7 64 32
6251 32 -85 13 -50 280 78 -27 -17 36 177 -92 -285 198 -122 -159 -64 -246 -25 205 190 -22 -1 21 -120
6274a20J13J43k11J76j78J78j66J68n7j93J10j0q7J63Lr7L50j95j01p9J36Q6N8
6297A90k46M1k37J07K61k8J35m41O6L37qK9m45L25K9j41o3J52R4m6J9j78l2J37
6321E7R9l39K39nj10J60J71j46j78j13J43L3k7j6NJ05J26k81N9l38L07J09j26
6344f6P6j96K32P7r0M6j41j99K52K49m78J18J38j12l8N3J09K1K35j60l5m3l5Q1
6368I4j34Q2oJ01l02Q5K10J14k54K52Qj74j84K07N7p4M6k97L02m21K06l4M6J63
6392I3j77q4K89j55j44J73n6k29M90np3q1J20j10ql7J97j95n8K3N7j78K39P8k79
6417a10J5J16J1r9J7R0o7J48q2J14j07J05k6j94K78j79Q4L6m27L35J09j44p1J12
6441F4J09j99l3J74q8j42r7L82M8k50J10k12J49J33j01M7l04K84j15K40k09L9
$$ plain form
6274 -120 -7 136 -75 101 -77 101 -65 103 46 -147 -37 -47 -134 29 32 -65 285 90 -11 -90 46 132 190
6297 190 -56 -15 -252 -145 116 88 223 -218 -152 185 177 206 -239 86 115 -26 -89 63 157 111 130 -48 -80 57
6321 57 156 -183 56 51 -59 101 272 126 -52 -165 -22 11 -16 -32 -27 78 204 -77 -18 -356 -49 60 -66
6344 -66 10 -186 46 123 33 79 -62 -261 -9 240 -238 -120 18 -94 -132 -79 30 51 286 126 91 48 13 94
6368 94 -40 42 36 137 -165 -80 130 244 -10 242 250 76 -108 99 156 82 128 -169 133 -288 -82 -116 -70 93
6392 93 -84 -168 121 -34 -178 -5 -61 -290 200 195 122 41 161 51 43 6 203 8 -50 -27 30 -148 91 169 -110
6417 -110 -95 21 32 -67 -50 40 -27 121 39 153 46 151 125 -69 209 30 114 150 -277 58 167 23 -48 64
6441 64 173 -26 -59 115 27 -115 -212 170 218 -32 78 -134 15 148 47 94 -210 74 -41 199 -10 29
6463B9n3L5k09J85k86K23J57KJ09j75J75j88j7Q2Q3k87K42k17J81M8q6k05J08
6486f4J20k83L77j49J93K9k88O3J18j54J97pL8n2j66O9m4l65L44Mm9J12K7n1K14
6511B33j38k52j6L5J38k56L96K1k53R5K0N1j49j1P2J00k32L89l84K05k68M39k84
6534d9J66j4l26K44R2l6m1p4j58K53p0J26k3J83j85k9j31k8J52J45l77M19Q2l11
6558A0K2l5j0j21O4K55m8m4R1k39Ln5K26m1N5k01J58k09K25j20K42j03j88K8j2
6583d7o1N1oJ44p8L3J15j66J90l44J2K48Q2j63m8K3j6n2o2J67j51J83m3r0K03
6608A24k50m5K35j74J69J07k84J0O9K01k51J8J89l12K82r2j63J94j15J74Q1j31
6630C6j20R6L1j39K00j14j5p7Q7Q8R5m4j18k30l2L35K1j61J59J55k96J34N5j66
$$ plain form
6463 29 -24 11 -198 -13 -299 -76 81 83 192 17 192 4 -13 69 152 -135 107 -110 71 119 33 -172 -64
6486 -64 56 -227 150 1 194 223 -65 -2 116 -38 159 152 190 138 -28 41 -3 -368 -24 -20 -69 43 70 19 233
6511 233 95 -157 -173 -138 0 -256 140 161 -92 3 23 74 -75 -86 -14 86 -146 243 -141 64 -204 235 -49
6534 -49 117 103 -223 21 113 77 36 -38 -196 57 -13 113 90 273 88 59 -72 -100 52 197 -180 239 321 10
6558 10 32 -3 -13 -134 -70 185 137 93 184 -55 -52 -107 119 78 133 -68 90 -119 106 -14 228 125 -63 -35 -47
6583 -47 -108 -57 -63 81 3 36 151 -15 175 -169 -157 91 173 10 -38 -15 -31 -83 -145 22 -129 54 11 -79 124
6608 124 -126 -171 64 -110 59 166 -118 -108 -39 162 -89 -71 118 -194 88 -4 -167 27 -88 86 167 36
6630 36 -84 12 43 -96 104 -10 -25 -102 -15 73 168 124 6 -224 -256 79 100 -61 98 253 -43 91 146 -20
6654b0P2k1n1j96K41j58K8J23oj52K19J13k58J12J66j16j17K31k20J18k4n4J27
6677A57j88K79k81nJ15n7m7p4K01j69R5j13M55m02J1J94q6r8J55O2l92J48l3K51
6701A78O7j41q2J26k71J02q4M6oP3j99P7R0J12j75J99j1K3r0J14j05k56J45q1
6725a49P6K18k15J47jj12o2J40m3k20K83N8j02J33j70Rj14m4l6M67k05k42L71
6748A87k13o7M3jL8K9M3j01J69M7j69J59l69N11m33K22j72pK05k2n8m0JN9J46
6773B07p0O3P3l30K24j98N9j26J67q1m7j8j55K12p6O2j35K63n0j91J76k3k20J68
6797d6j6K09j74o0K43j95j79L7L17k97k27M57p7J69j73M8j24J39j01j87K66j56
6819a27K75p1o1jo9J89l19J07K9K73%m29L99k80K18j76KJ94j71l9J16m1j1n2P0
$$ plain form
6654 -20 52 31 -20 -216 25 -133 -105 18 12 -140 79 192 -66 46 212 96 -21 210 -10 108 84 30 157
6677 157 -31 248 -33 -38 77 20 -27 -101 100 -69 26 -87 368 -34 -23 171 85 -13 142 204 -188 -40 -73 178
6701 178 245 104 22 148 -123 -21 -105 -59 -65 8 -191 -114 -24 88 -87 112 101 124 34 148 43 -213 -68 -149
6725 -149 -73 145 -70 77 76 -36 -98 42 -1 -221 62 120 18 151 -19 -10 -124 -168 -204 263 58 -184 187
6748 187 -26 -93 -50 -51 -13 16 59 -42 127 174 5 164 -205 306 -127 95 -77 -84 121 99 41 1 2 61 207
6773 207 137 200 273 -57 167 -31 28 -98 69 -12 -59 -77 -232 -20 -96 -34 -169 94 44 -147 29 6 -214 -46
6797 -46 -62 147 -27 -87 156 -39 -218 -181 136 -161 -388 69 -8 161 -12 36 -88 51 -50 -237 29 -127
6819 -127 148 77 16 15 -54 135 -184 -77 -48 225 225 -204 195 -85 133 -43 -41 153 -18 -57 59 18 7 -45 25
6844B5l27L01J6r7J44lj37jl7K00j08r5J30J37J3P6l00J09J1j8J51J94l32o7k22
6869b37K04K07o5J75l78L86k90j15mP6R4J18k56J53o1M6J1p2j32K48j40K65K7
6892B60n64L88J23l7j03l5j24l3L1J00J47k43j33L04j91K63J18m02J51k00J29
6913e1K18j59n2J16l2j38K32j98J35n0r6q4J2o3K86l8L5m7r0r3M01j36m6k21M01
6938B42l30J47j36Mm2K2P2lj3l0j40J60n7J77j0k4L3m10N57l13o0N8K20j52J01
6963G3j22K0n4J31j43k34L74l2K77k76l00J15L5J31J20j98N1jpj04j10J70J2J45
6987G3R4j57o9n2J92L4q7j15J02K53l84J39Q8j68K63J00n20J57J53J37l33O0j0
7010e0O6Q0J88j81j21j45J67Q8n3j64j52K26p6J01J33q2O7jK12l03r6q3N6L9k9
$$ plain form
6844 25 -302 -1 15 -82 62 59 -78 -79 -116 84 -24 -119 11 148 161 237 -63 46 57 39 190 384 52 -15 -237
6869 -237 -33 174 109 284 -94 292 2 -113 -117 -41 53 171 -85 68 7 53 64 -8 -140 108 -32 233 260
6892 260 -304 84 207 170 67 32 -92 -125 -94 6 153 -90 -223 81 -110 153 271 -131 20 -180 -51
6913 -51 167 8 -44 72 40 -98 134 -64 71 21 -75 -159 -147 -210 76 38 73 26 -64 -157 244 108 62 -159 242
6938 242 -88 59 -77 -73 -115 -93 -21 -24 -37 -67 -207 -47 -104 73 63 39 72 -338 219 -94 -154 -96 124 -28 73
6963 73 -49 -29 -83 48 -95 -329 45 13 290 14 -286 -171 -136 -5 115 -83 -32 -33 -40 -144 -254 -84 -72 73
6987 73 167 10 -59 -111 81 115 28 -87 15 268 -116 23 111 -57 206 306 -214 -57 96 233 -100 -40 -50
7010 -50 16 96 284 103 -18 -163 4 92 39 -125 -277 -51 -127 -26 107 25 92 91 303 0 -96 -179 -123 -84 -113
7035a13NJ10P5j05o8n8K19Q2j03r3J59k78L46j6j3M5qn0k78R5R5J7k11K09j23
7060f0RJ11j09o6L46m23J59J06R9k84K96k48q1K34r5K8p1k8k0J00K05l23L57l66
7084a24J89j69j10K42%M3J4j75N1J23o1q4R2Q0n8j23n3J16j09L25n13M00k8k56
7108a88N5K2K11L37m09l42J01L1K93k32J6L3LJ86j69J45r7q8j57K61K0J36N2J10
7132C30k04j24J93l06O5K98k13k46M75l08m8L43l28R8l36M39o5j41m6J18K23l18
7154a01L61l48K02L4j21j21J2O5Q0k53K74m5J55j50Rq2J94j42o9j01K61J55k52
7177A7J20l53L54r3l8J87n58M16k16J26K39j53o3p5p2M1K02k84L18k1o1r8LJ43
7201H1J2J6j91r6M81l28p8K27L1l45K24N4k56KLJ65R9L0l71J06NJ6N5K7j19P2
$$ plain form
7035 -113 -108 2 77 -28 -96 -154 65 147 44 -49 110 -168 178 162 149 194 186 136 -142 -47 48 65 -146 63 -60
7060 -60 -51 60 -49 -115 231 -192 -33 73 172 -112 184 -64 -145 89 -6 22 -49 -77 -97 3 208 -115 242 -124
7084 -124 65 -104 -214 28 28 71 85 -90 -39 84 23 -61 31 111 53 -70 -123 -7 -116 209 -304 96 68 -188
7108 -188 -133 -111 100 437 28 -314 -213 -182 111 -121 -105 -72 -69 117 -52 93 -4 -92 -249 12 32 168 220 330
7132 330 126 2 195 -111 -46 252 39 -207 268 -40 -88 255 -73 25 -311 128 63 -78 -124 -6 217 -101
7154 -101 260 -88 114 148 27 -94 -82 -17 63 -190 84 39 194 44 53 -29 165 23 -46 -147 114 269 17
7177 17 137 -216 138 45 7 194 -364 52 -164 -38 201 48 -15 -90 -162 -121 81 -203 115 94 33 -65 -62 81
7201 81 93 109 -82 -178 303 -25 -103 124 155 -190 34 88 -168 -166 -163 2 101 131 -240 -134 -129 -113 -58 -31 -150 -78
7227g8k1L8K30k18l5K80J19j24k24O7P2n8R9l19p8J21J23pO6j52J0P0J45k55J15
7252a4P1P5j10j8j34J19J81k05n5k12L40k60L25l06K45j21J6J92j70J28j20n6
7274h9P4K28j03l62K90j21j20J16J31K12o8k96J61j09O3K78j93n3k29L52j41j7
7296Dk66M39l22K17q4J07j41r0J00LKJ74J51l21J40N5m12J47OJ06k22J61N2k21
7320b15m3L17j93J11o4K1M6L71k95j02q3L41k57LM7J79j57k72K43m4J71j96L03
7343B32q6o7o2k8K23j75k09P7K83j89J6m5q6L1kJ31j27L8j47L14j17J09j76J26
7367F4l1N3o4j2p7L02jk88J45j65J33J37j65k75K13J24R0j99J53K4j73%R5l65
7391b82J27K65j64J5n5QR9m8M85l85m0J49j35j30J21j84K20k26L32l01l7L71l22
$$ plain form
7227 -78 -99 -61 169 -49 -84 196 315 191 -33 34 106 48 147 -172 -250 -129 -6 -13 53 -99 -89 -19 126 -129 -14
7252 -14 57 132 22 4 -130 -11 170 -35 -90 -302 38 -222 103 -203 42 -79 -63 129 -41 87 -33 -89
7274 -89 -15 213 110 -252 38 -83 -203 -87 44 256 188 -108 53 -56 7 285 92 39 -190 162 21 4
7296 4 -262 177 -145 72 -12 95 -46 -136 -36 -33 -31 143 294 -27 113 168 -244 -97 -91 15 -207 -46 6 -215
7320 -215 -258 59 -134 -23 -87 -66 -20 351 56 -46 -129 212 -45 -42 5 184 27 -245 -2 -46 125 -71 232
7343 232 146 79 17 -11 212 37 -172 -95 188 -1 15 -30 -116 -85 -87 44 -83 -45 -192 122 5 114 -62 64
7367 64 33 86 22 10 -67 235 234 -54 91 -74 59 196 31 -244 -31 93 183 -16 137 161 -12 -12 83 -282
7391 -282 -155 110 -54 -39 -94 -86 13 -35 450 65 25 174 39 -91 30 -154 66 -160 172 -129 -166 205 -117
7414a17N47k61l08J50M0J92k6m3p3p9k7k45N18n60R3J17L01Q7m70Q9m2Q1m3nQ1
7439cl4j09j5J45L4j98N4K59r3j17J60q7J08m7m8m1j86L05o0l97J36J27K66r7
7463F2Q0k69L8Q8j29J08J4O7n5j24l6o7K29j58K27J14l6j57MOr6j49K82j19K99
7488B23l11J67K3k54J07J64k2j94o4K80j95J53o2J4K74n65M50j08o4J7j16J39
7510E6q8J39j69L7L57k21j65K06k03K08j09j8q2k6pN0L00j18j24O2k32J82J22
7533A57l19oL84j57k06L4k01K11K35j87K47k57O6J8j03K23j35o4J08J7Ln4M3j5
7557D2j65L98k50K9r6J11l51P7J89L2mk24L39j01J57l27J16J19O5j39j2o2J18
7580F1mJ70j06J47j45j43K47j50n7Q9K9l7mq5K26j54j80Q6K87l95L23k00M3k05
$$ plain form
7414 -117 430 169 -139 11 51 243 217 174 101 22 -5 -250 268 -292 -199 -82 219 306 -164 -75 -117 -36 -79 -84 -3
7439 -3 -37 -146 -161 -16 18 -180 -126 133 40 -77 83 -4 104 57 9 -32 -218 87 27 -370 -234 -107 159 62
7463 62 142 -127 -89 -1 -130 -22 -8 59 4 -120 -156 -223 6 -152 75 189 153 -4 0 6 -90 -239 43 -76 223
7488 223 -88 79 102 -152 -45 119 97 -97 -161 119 -76 77 15 29 303 -262 188 80 16 33 -83 56
7510 56 -32 107 -62 -25 332 111 -54 152 -51 157 48 30 -52 -78 -85 -35 265 147 23 85 -147 35 157
7533 157 -162 -168 216 59 -147 -113 -314 -103 132 -55 192 -65 1 19 -84 139 4 -60 48 65 68 14 57 42
7557 42 -123 275 25 54 -42 69 -282 -205 -16 16 12 -212 127 26 183 -144 -28 91 156 17 5 -57 61
7580 61 57 227 121 268 123 -20 227 77 20 109 138 101 97 12 238 84 -96 -10 277 -118 205 5 48 -157
7604a57K05J60k19L20l77L42j08l17j06L91n8K79l51j33j02L02j27K5L0N4m8j87
7626a82L65r7j78N8K1K0Q4J81k93O8j43j77O7pJ23J46n2Mj2M9j08Q0J37k17M5
7651a8O7j76P9j1J89k63J98J0j12J23J11j09l21M11J9n05L13No2m5J41O2j70K04
7675A40L5k53J04j04j14L82j19n3n0L64k10J44j22j44j9M7ok22K87l9k02L88k63
7698b9o6j2J27Q6k80K41j28PJ34k41J55Jj89J92q1M1L1j61K20J47Op9p7k06L18
7723A57k07k68M98k48J18j03R8J12j03j13Q2J01r0j36J09K06j97N2q4R5j85J54
7745D8Mq3J04P6j63J23k18j22J82J73j47p5N2j03J14Q2r3nJ45o6J5j36J2P9O4
7770F2j13l1j01P5M1rO9J69m34K40k9J8RRp2L70l57q8J25K90k75q9m3q9K53P6
$$ plain form
7604 -157 48 208 -11 309 -68 274 166 -151 -257 134 76 355 4 -129 -231 71 -56 -31 -1 53 5 -182
7626 -182 183 86 -92 -34 -13 7 91 272 -21 47 -96 -273 -206 -213 -90 56 4 8 -4 45 -63 17 154 -63 -18
7651 -18 49 -127 -48 -59 130 -133 65 75 -37 86 197 88 -233 178 197 -308 5 10 -52 -97 44 106 -64 140
7675 140 175 -78 26 -78 -192 190 71 18 -32 332 122 266 144 0 -19 28 22 -200 87 48 -154 234 -29
7698 -29 -95 -107 20 106 -174 67 -61 -54 80 -161 -6 -5 -194 -2 -83 -42 -11 -172 48 195 201 122 45 -161 157
7723 157 -50 -318 180 -68 50 -53 45 157 54 -59 23 124 34 -102 7 213 16 68 -16 79 -106 48
7745 48 52 -31 73 149 -14 109 -109 -231 -49 124 -23 -98 -46 -149 -35 47 -46 -51 94 28 43 -93 -81 -2 62
7770 62 -51 -82 -183 -108 -67 -76 -7 162 -272 -32 -61 -43 -34 -25 -97 273 -84 -172 -47 243 -32 -121 -164 -253 0 76
7796G6K11l93K22n1p8l6L0l5k3J50j55j6K29q9j03k4K40j64m8K84l03J76q8K8
7820D0q9N4j07O3j26J63k33J40L8Q9P2k61R4J82L7j93JK56k59J75k76K03j62K04
7844A05J3L9q8j78J60J18L9j92k05L46l3j07M4k14R0J77K18j38k01j9p8M2J77
7867A15k99N6J05J21r9k67L80k15O2J92K2m6k32R5R9j45M0K85k45N1j81J7R6K07
7891B14l30J64r7J60m68K23J7J1J89k66L42k94K57j40r4M6J24k24%M7k0m8K43
7914E6K25j97j19p7J04r2L8J10r0Q3k53K18k69L63q6m5r4K99k61J61k29p9L03
7937F9p4J68k44K38j44J45q1j22J03L26k84k70j0J32K27j69P8k42K03m6OM8N3
7960A10qk43J62K1j85L38nk50R3l3J42k66q3L33N0K7m29J8J95n0J95m71M26J1
$$ plain form
7796 76 287 -106 116 65 -13 -49 -19 -54 -77 73 -82 -98 131 42 -61 -85 155 -9 -57 227 -76 100 12 40
7820 40 -49 5 -102 -39 -165 -2 -235 -95 -57 32 104 -157 -63 119 156 -37 -36 220 -39 136 -140 63 -99 105
7844 105 118 157 69 -109 51 169 208 16 -189 157 124 17 61 -153 -63 114 332 194 -7 -26 -104 -62 115
7867 115 -184 -128 -23 98 -1 -268 112 -103 -41 151 173 127 -105 -10 89 -56 -16 269 24 75 -106 -89 7 214
7891 214 -116 48 -49 111 -357 -134 -117 -106 83 -183 159 -135 122 -18 -112 -66 58 -166 -166 -119 -139 -187 56
7914 56 281 84 -35 -112 -8 -100 -62 48 -42 41 -212 6 -263 100 14 -31 -125 174 -87 74 -155 -234 69
7937 69 -5 163 -81 157 13 158 77 -45 58 384 100 -170 -180 -48 179 10 88 -154 49 3 9 57 110
7960 110 102 -141 21 42 -143 195 190 -60 33 0 142 -124 -207 126 176 203 -226 -208 -13 -63 132 -339 87 98
7984I8k24L82j41m3j76J7J29R8j66j83MR8K43n0m46N75k73oKN9n0J86L1l15J55
8009Dr6J52r3N7mJ53k12k0J06N0j19l4J73J9k62J81j73j11L23j17j2J59k11K55
8033A68j70n8K13K3j18jn0N9%m2R5j39j23K01P4m9k14J54N4K15j57J94j76j55
8057bo0n2m9P1Q4L3k20J88k0m2r3K48j32J43p0J9j23J32k22J42J38R3k17N9J9
8082F7LK8l79M30n05M46k84J48j59k1M6J50K1L5J50j31n2P7k11N3L4k69K81J25
8106H3j09m7R9J79n04J47J38l0O4k36J08j04j4J89M4J05j43j46J10K12j47M9r8
8129e1L72l19r1o8K95k66J53j82K98o4j81J38n8L7K8L41m49k5j0L16k52P7J60
8152A99k03j21j52L86j32J98l88M37l21l5J24J80l3j32j13L8Q3J67Q7l40q7K07
$$ plain form
7984 98 -126 256 115 72 -104 -87 42 140 -26 -209 -205 -107 136 86 -360 215 -58 -64 -62 -3 -53 133 164 -151 4
8009 4 -92 60 -33 24 20 173 -39 -59 47 97 -22 -56 117 136 -126 55 -118 -229 94 -23 -35 124 -87 168
8033 168 -2 -60 153 176 58 57 7 66 66 24 119 -20 -143 58 132 83 -131 23 77 292 135 329 153 -2
8057 -2 -62 -114 -163 -92 -8 25 -195 -7 -27 -69 -162 86 -46 97 27 46 -77 55 -167 -25 113 206 -11 48 67
8082 67 70 98 -281 149 -356 90 -194 -46 -205 -226 -180 -30 -9 26 176 45 -7 70 -141 -88 -54 -323 -42 83
8106 83 -26 -73 26 205 -299 -152 -14 -44 20 -216 -108 -212 -226 -37 7 112 -31 -177 -67 145 -2 47 -51
8129 -51 321 2 -89 -157 138 -128 25 -157 141 77 -104 34 -24 13 41 382 -67 -92 -102 214 -38 39 199
8152 199 -4 -125 -277 109 -23 175 -213 224 -97 -132 -8 172 139 7 -106 -68 15 182 269 -71 -158 49
8174D9LJ1j70J77j25R8l25L32j07p2J72k94K30J45j41J5M6
$$ plain form
8174 49 52 63 -107 70 -55 43 -282 50 -57 -129 43 -251 -21 124 -17 -2 44
8191D4
$$ Imaginary data points
##PAGE= N=2
##DATA TABLE= (X++(I..I)), XYDATA
0@%%%%%%%%%%%%%%%%Qj6J6j6J6j6K4l2L2m0M8n5O3p2Q6r4J04j20J36j54J76j96
38a02K18k45K72l03L37l73M14m59N07n59O15o77P48q25R06r97J102j220J353j506
58g94J682j885K128k424K794l272L908m809O199q639J4190m9310P471J17509N0103
73A34851O390l0480j0253j3179k6824l1525P56K602j5921l7226k3735q439j7341
86g0324k3146J0006L6052L5962J3219P129J3779l89k5928k1553j041J1652Q86
99a3696k487J7041K3949K717q968J05J0487J394j1353J455J4031J785j4778j7703
113C979n296l610j5598q008J3280J6375L333o820J08M580j0284j4682O07J2838
127i198J0152k455J538J3303L647j0558m821P689J0354m078p659N348L775j0898
$$ plain form
0 0 0 0 0 0 0 0 0 0 0 0 0 0 0 0 0 0 8 -8 8 -8 8 -8 16 -16 16 -24 24 -31 32 -40 46 -48 56 -64 72 -82 94 -102
38 -102 116 -129 143 -160 177 -196 218 -241 266 -293 322 -355 393 -432 474 -523 579 -641 712 -794
58 -794 888 -997 1131 -1293 1501 -1771 2137 -2672 3527 -5112 9078 -40232 -32761 84748 134851
73 134851 141241 110761 100508 87329 60505 28980 29736 32338 16417 -20809 -44544 -52983 -70324
86 -70324 -93470 -83464 -47412 -11450 1769 8898 22677 22288 -3640 -25193 -26234 -14582 -13696
99 -13696 -16183 858 24807 27524 18556 18661 29148 30542 19189 20644 34675 36460 21682 3979
113 3979 -1317 -4927 -20525 -28533 -15253 1122 4455 -2365 -2257 2323 -7961 -22643 -22036 -9198
127 -9198 954 -1501 37 13340 16987 6429 1608 9297 19651 15573 7914 13262 17037 6139
141F139j5487n120N209l803j2032P68J1145L901n181j643J0879P298p468l113
155h508R337R891L55m958O344J0364n545j1911j713P371R35r265J02R922p00j2655
171f34q993K779N292n182k362J1836R578m438j0235k878L935n134p980N852J3670
186E106O859l358k285N750r52j1410n244N612N785k691o617K593J312j1928j2163
201b3631k410N618L073j162Q849J4181M138m535l620L197J792o287k87R244N550
216A3710l045o874j642N95o869n944N022R525M065l057j332K784n832j0948l924
231a3766N759O923M88J113Q281L412o565o662J178O605J116k394N271O040m325
246A2474j1057p917r57j677o631Q65Q528O197j812n012J360K064n869n348M584
$$ plain form
141 6139 -9348 -14468 -9259 -13062 -25094 -24326 -13181 -9280 -14461 -16104 -5225 2073 -5395 -8508
155 -8508 829 10720 11075 6117 12461 22825 17280 5369 3656 11027 11962 2697 2799 12721 12021 -634
171 -634 -9627 -6848 -1556 -6738 -9100 2736 12314 7876 -2359 -5237 -1302 -6436 -14416 -8564 5106
186 5106 11965 8607 6322 12072 11120 -290 -5534 78 5863 3172 -3445 -852 460 -11468 -23631
201 -23631 -26041 -20423 -17350 -18512 -9663 4518 8656 4121 501 3698 5490 -797 -1084 8160 13710
216 13710 10665 3791 2149 2744 -4125 -10069 -5047 4478 8543 5486 4154 6938 1106 -9842 -13766
231 -13766 -8007 -1084 -596 517 8798 12210 5645 -1017 161 6766 7882 5488 10759 16799 12474
246 12474 1417 -6500 -7457 -9134 -15765 -14900 -6372 -175 -1987 -6999 -5639 -3575 -9444 -14792 -10208
261a0208P728K937k991J867N914k094o823j948N338N452j791M58Q003K940n547
276I235p616k209J124n406n483L998O814J687l669m91M400K63n659J041O817N871
292A0717l01j513L995J595o825o037L05K661j132m200K841N195k453n340j850
307b342J552o97n247j307M550O90k625k219J453K451l551l091L658M180J000j022
323b567J859N350r18m265j00K563M69k994j870L706R31n277k666J624K164j272
339c263k316L779M371j340k228j9L281J60l681O20L993J134k358j835K758K410
355E466k330k013L096K525q14l655k13K957k803n092j445J708J15l663q09M496
371b474J363k157q26K356K968j649k245J639K285k182l706j269K442j37k713K002
$$ plain form
261 -10208 -2480 457 -2534 -667 5247 3153 -3670 -5618 -280 5172 3381 3839 11842 14782 9235
276 9235 1619 -590 534 -4872 -10355 -6357 457 2144 -1525 -2016 2384 2647 -3012 -1971 4846 10717
292 10717 10416 8903 12898 14493 7668 1631 1936 4597 3465 -735 2106 7301 4848 -492 -2342
307 -2342 -790 -1487 -6734 -8041 -3491 -2801 -5426 -7645 -6192 -3741 -7292 -10383 -6725 -2545 -1545 -2567
323 -2567 -708 4642 3724 -541 -641 1922 2391 -603 -2473 1233 2164 -3113 -5779 -4155 -1991 -3263
339 -3263 -5579 -1800 2571 1231 -997 -1016 2265 2425 -1256 -636 3357 4491 2133 298 3056 5466
355 5466 3136 1123 4219 6744 5930 2275 2062 5019 2216 -2876 -4321 -2613 -2498 -6161 -6970 -2474
371 -2474 -1111 -3268 -4094 -1738 1230 -419 -2664 -1025 1260 -922 -4628 -5897 -3455 -3592 -6305 -4303
387d303M440K950m28q30K787J915l011j609P80Q29k255m439N6J748k350k027J357
404d390L494K061q04J795M090J287j341j025O25M39l628k799P66N14j216j548
420a680K64L050q64j917J178K404Q90j266j176K055k01l263k023J72J29j935l184
437g367Q75J382j019o41J772L307J808j340J203K832M01j100j006K069J520k428
453B268k029N25K56j335k336J081K874j5j726O74J461L71k203j106K347J75k145
470h63r96O80J451q19j382K413K469P31k62O54K663r4k998j330p44j891l079k990
488f387J141J448j562m13J291Q80o08j535J438L136K80K9Q80Q84r48l504j272
505d822J398M99L82R46K740K226q18j404J132m6j048j290j38J692o98j740Q21
$$ plain form
387 -4303 137 3087 2659 1829 4616 6531 3520 1911 2691 3520 1265 -3174 -3118 -1370 -3720 -5747 -4390
404 -4390 -896 1165 361 2156 6246 7533 6192 5167 5792 6231 2603 -196 570 1084 -132 -1680
420 -1680 -1416 1634 770 -1147 31 2435 3325 2059 883 2938 2737 -526 -2549 -2377 -2248 -4183 -7367
437 -7367 -6492 -5110 -6129 -6770 -4998 -1691 117 -1223 -20 2812 3213 2113 1107 3176 4696 2268
453 2268 239 764 1020 -315 -2651 -1570 1304 1289 -437 237 1698 2069 -134 -1240 1107 1282 -863
470 -863 -1859 -1179 272 -547 -1929 484 2953 3684 3422 4076 6739 6645 3647 2317 1573 -318 -3397 -6387
488 -6387 -5246 -3798 -5360 -5773 -4482 -3602 -4210 -5745 -4307 -1171 -891 -862 18 902 -46 -3550 -4822
505 -4822 -3424 -2925 -2543 -1597 1143 3369 2551 1147 2279 2233 1185 -105 -243 1449 751 -989 -168
522a68J082L45q39J44K737J045p58KN80J78j959k659K66N92p88k39J361K579J059
541D560j112j90J264n76j652j601J13m03l338l043m47J0k41j55L071M695J372
558B327M89J318Q74m30k151k331O83r46k907j901r50N16q41m60K609L196K270
575A365J201J044K432K52k510j058j97q22j892j816J462J138j366o79J338J506
591A398P9q22J418K930l25j566j151p50j597l008j125J858Q62M5J053N98Q34k241
609a510k382N92O00O74J167J371K886m5k173o36m50p14j255L26K207R03j950j696
627b085j464j602k422j546J983L292J983J734K538J913l24j940l20J612P13k46
643C819O58J235M19l507k472q29k28p60l32J712K731m83k017q20q35r35j764J69
$$ plain form
522 -168 914 1259 420 564 3301 4346 3588 3590 4170 4348 2389 -270 -4 588 -200 -439 922 3501 4560
541 4560 3448 3258 4522 3946 2294 693 806 403 -2935 -5978 -6425 -6415 -6656 -6811 -3740 955 2327
558 2327 2816 4134 5008 4578 2427 96 779 -167 -3074 -4975 -5925 -5409 -6250 -6710 -4101 -905 1365
575 1365 2566 3610 6042 6294 3784 2726 2529 1707 -185 -2001 -539 599 -767 -1446 -108 1398
591 1398 1477 655 2073 5003 4678 3112 1961 1211 -386 -3394 -4519 -2661 -1799 -1754 -701 -103 731 -1510
609 -1510 -3892 -3300 -2700 -2026 -859 512 3398 3353 1180 544 94 -620 -1875 -1549 658 1561 -389 -2085
627 -2085 -3549 -5151 -7573 -9119 -7136 -3844 -1861 -127 2411 4324 4000 2060 1740 3352 4065 3819
643 3819 4477 5712 6131 2624 152 -677 -905 -1665 -1997 -285 2446 1963 -54 -874 -1709 -2644 -4408 -4239
661d239L301K048J50M29K48L88j597j900J764J697P14Q9n28O71k007l863j939
678d574M80M85q0N51K049J387j754j470K43M21Q3R8K164L175p0r75n2l6k97j794
698C4K29K355N70l79K59j0L79k011k006N35P44l57o1P66R81q33k072n35K62m13
718a563n52K95K359J455r49k08M67M18j191j110J171J204r82p96m08k16j581k749
736d936j15J064J41k84N72K055J110j395k17J192P74k45k56J040J646o34j788
753b76j68N74m67r33L16K246Q12j191j76L39L16j794j089J698J064J8k52J91O10
772A838j032j923M82J498R66R9J17J496k05k725j695O0L85k78m57J232J768j750
790a24j595l57k09k25m44J275K690L41r37m10l71l59j727m55K114J644M34K6O5
$$ plain form
661 -4239 -938 1110 1260 1689 1937 2325 728 -1172 592 2289 3003 3092 2564 3235 1228 -2635 -4574
678 -4574 -4094 -3609 -3689 -3138 -1089 298 -1456 -2926 -2683 -2262 -2179 -2081 83 3258 3188 2213 2161 2125 1828 34
698 34 263 2618 3188 2809 3068 3058 3437 1426 -580 -45 699 342 281 1047 2028 1195 -877 -1412 -1150 -1563
718 -1563 -2115 -1820 539 1994 1045 837 1304 1722 531 -579 592 1796 814 18 -390 -606 -2187 -4936
736 -4936 -5051 -3987 -3846 -4130 -3558 -1503 -393 -1788 -2005 -813 -39 -284 -540 500 2146 1512 -276
753 -276 -444 130 -337 -1270 -954 1292 2104 913 737 1076 1392 -402 -1491 207 1271 1289 1037 1228 1838
772 1838 806 -1117 -635 863 1829 1928 2045 3541 3336 611 -1084 -1024 -639 -917 -1374 -142 1626 -124
790 -124 -1719 -2076 -2285 -2510 -2954 -1679 1011 1352 415 5 -366 -725 -2452 -2907 -793 851 1285 1311 1376
809A376N55j822k107O46J215P45L3J73J569q36k440p81P7K04j63O38K589J658
827C329p79q33K27K68j055o65N57J954l78q93m92j00p38k559l79J363P29l5l66
846h45R30R00j515j904N85P96l70p48Q72J710l10j115L86O48Q01j023j07J766
864A457M14j267q42P9J82j148j300O09Q07P1q64O55J612K27j139J69J084R4o91
883B09m41J057Q87j115m45O75L80j66j203L48J694m63j140K52M59n61j328q94
901a795Q94M53q63J64P77M60q08r07O37O72l43l66M10J100Jj372L99O67o08n32
921i60K25J396J70j230n1N04J70n26q84J037J188o72m82O65N79k1j554J88J303
940A045K0p12k83R97K96n87r00J540N30n94n25R47R84p95j611L33J41m69j034
$$ plain form
809 1376 1931 109 -1998 -1352 -137 608 641 814 2383 1547 -893 -1674 -1597 -1393 -1556 -918 1671 3329
827 3329 2550 1717 1944 2212 1157 492 1049 3003 2625 1732 1240 1140 402 -2157 -2536 -1173 -444 -479 -845
846 -845 85 985 -530 -2434 -1849 -1053 -1423 -2171 -1299 411 101 -1014 -628 20 821 -202 -309 1457
864 1457 1871 604 -238 -159 23 -1125 -2425 -1816 -1009 -938 -1802 -1147 465 692 -447 -278 806 900 209
883 209 -232 825 1712 597 152 827 1207 1041 -162 186 1880 1417 277 529 988 427 -901 -1795
901 -1795 -901 -448 -1311 -1147 -370 90 -718 -1625 -988 -316 -659 -1025 -615 485 486 -886 -487 180 -428 -960
921 -960 -735 661 831 -399 -450 54 224 -302 -1186 -149 1039 367 -115 550 1129 1108 -446 -258 1045
940 1045 1065 353 70 1067 1363 776 -124 1416 1946 1352 827 1774 2758 1963 352 685 826 357 -677
959f77l83J385M6r93k73O64N05p76m51P69O39j113p25M04M86j04j102M51J271
978B3k05m97J88Q57M23j220j85N54N7p50n25N01R43q63MP05Q19Rq10L58R21k96
1000A011j139K31J50K23j055n45J261N47o34k30R18O26k70r32N13P66n81r61j80
1019b81Q55q7r78J51P99p0p04k9P21j31j108m75M77J42o59q86M45Q61n50n78J042
1040a043J122P01o15J85J448m64n93o11P63L6r57q81O09M32o26m85l8J499l89
1059I3l66Q09O23M96k97k73O09l89j096j80J71L7l92q28P39N67k02m14L83N49
1079F39K23q11N61Q02j93o26q64K13K85j225q0O02J49k67m52M12L57m75k56L73
1099f33Q05M3l72j11R02k67p94J00N14N20m75L6O23M1p75m88J51K53k36n96P24
$$ plain form
959 -677 -1060 325 371 -622 -895 -231 274 -502 -953 -184 455 -658 -1383 -979 -493 -597 -1699 -1248 23
978 23 -182 -679 -491 366 789 -431 -616 -62 -5 -755 -1280 -779 164 -699 -695 10 829 838 28 386 1307 1011
1000 1011 -128 103 253 476 -579 -1124 137 684 50 -180 738 1364 1094 162 675 1441 860 -101 -281
1019 -281 574 487 -491 -340 459 389 -315 -344 377 246 -862 -1337 -860 -718 -1377 -2263 -1818 -957 -1507 -2085 -1043
1040 -1043 79 780 165 350 1798 1334 741 130 893 929 -28 -909 -300 132 -494 -979 -1017 482 93
1059 93 -273 536 1159 1655 1358 1085 1694 1305 209 29 200 237 -155 -983 -244 323 121 -293 90 639
1079 639 862 51 612 1414 1221 595 -269 -56 229 -996 -1076 -474 -325 -592 -1044 -632 -275 -750 -1006 -633
1099 -633 172 215 -157 -268 634 367 -427 -327 187 707 232 268 891 932 157 -331 -180 73 -163 -759 -35
1120c5O25j00o39L06N15L55p51J95J85J79n96p48L61J66q46k41L48O36L7n06N78
1141B4N46l36n56J66K69J77n32r3K26P1p16j94R6M90l60n03O02N46j20m82j1M95
1163a95P0l98j56Q27M2Mo11N54L22k99j53L05P09k77l7K52K64n9q75rL37q3l29
1186B05J45M35l31k77l24j09M09p03j18O04L33J05m26J39N17n83m57K09K05M47
1206D25k58%L94q6q45k66OM99j50n26L63L44l64m85j27K09Q5m92Q07N26N36k30
1228C65l45K33R8n97J79O18M45J34l67m8M06p91n48J98J9K16l35J24O07j89p86
1249c64k53J48L22j83l58Q57L95j99m26p6L90l98l41L42L40J33N5n17O82q3j195
1270g29K93J13L13k63j76jL13l84n21Q6L62L06l50L27N72j23k27q8K16J73l29
$$ plain form
1120 -35 590 490 -149 157 672 1027 276 471 656 835 239 -509 -148 18 -828 -1069 -721 -85 -48 -554 24
1141 24 570 234 -322 -156 113 290 -242 -335 -109 -38 -754 -948 -852 -362 -722 -1225 -623 -77 -197 -679 -690 -195
1163 -195 -125 -523 -679 148 190 194 -417 137 459 160 7 312 1021 744 707 959 1223 1164 289 280 617 534 205
1186 205 350 785 454 177 -147 -256 153 -550 -668 -64 269 374 -52 87 604 21 -436 -227 -22 425
1206 425 167 167 561 475 -370 -636 -630 -131 -281 -807 -444 -100 -464 -949 -1076 -867 -782 -1274 -467 59 595 365
1228 365 20 253 351 -246 -67 551 996 1130 763 715 1121 330 -218 -20 -1 215 -120 4 611 422 -364
1249 -364 -617 -469 -147 -330 -688 169 564 365 -61 -137 253 -145 -486 -144 196 329 384 -133 549 466 -729
1270 -729 -436 -323 -10 -273 -449 -450 -137 -521 -1042 -956 -594 -288 -638 -311 261 138 -89 -177 39 212 -117
1291a17j90M56J27K03k3k00N42n35k14M70j8L02n02k24N04m33j85n12R5K93J98
1312C7l14M00K60l02q8k86N08l09k28J61N70k50j63k93OJ23j08j82M75L53r4o56
1334c80L99J31m04m8o1K05M06k77n5L50n9l01m04L62L73k87P3K87J08k43m13K57
1356A9k5R3j64M23J76j28m4j39R0L06q19J73K06lL4l04m3J89k54j63Q3L63k7l28
1380b86J89j56J85l20L9k80N70k15P7L94l13J68k61m5L29k74j27K10J09K3j28
1401a12l03K54j49j06J41k13M48n4k08J93R0k01K96j60J37K71l58L11J07j98L22
1422E08k59J82P0l62J30J06J24o14q3M99j09k90J25j29m0J62j47j56K24k27j45
1443d31J19n5M32j80l51M46N3k67L12J98l68J99j88N9M7k86k1l7L9L13k60Q4o
$$ plain form
1291 -117 -307 149 276 479 456 256 798 263 49 519 501 803 301 77 581 148 -37 -549 -454 -161 37
1312 37 -277 123 383 81 -7 -293 215 -94 -322 -161 409 159 -4 -297 -291 -168 -276 -458 17 370 276 -380
1334 -380 19 150 -254 -302 -363 -158 248 -29 -84 266 207 -94 -498 -136 237 -50 23 310 418 175 -238 19
1356 19 -6 87 -77 346 522 394 350 211 301 607 -212 -39 167 164 198 -106 -149 40 -214 -377 -294 69 42 -286
1380 -286 -97 -253 -68 -388 -349 -629 -59 -274 -197 197 -116 52 -209 -254 75 -199 -326 -116 -7 16 -112
1401 -112 -415 -161 -310 -416 -275 -488 -40 -94 -302 -109 -19 -220 76 -84 53 324 -34 277 384 186 508
1422 508 249 431 501 139 269 375 499 -115 -198 301 192 -98 27 -102 -142 20 -127 -283 -59 -286 -431
1443 -431 -312 -367 65 -115 -466 -20 33 -234 78 276 -92 107 -81 -22 25 -261 -282 -319 -280 33 -227 -143 -149
1466a49L55j25j97R6L0K2j24j97M79j05M5r8RK55L72n51K38K68j83m18N11k54
1488B79p1Kl7K76n56J38nj62J07r1jK23j63m77L60j4j68m9j61L93j25J85J25m7
1512c9l49K34j76K92j8K5P7Q0k7L66m46n7J35k41K32n22N10N0L5l81Q5j01m4J96
1536h4K24l3j08m1J84O9J44m56R5M10k7j70J56j63J30l55k34L64m2JN6r8J68q6
1560A04l73o8j09P4O0Q0R4J57j96k68J51n1M9O5J47J81J98j23m00K80J13P9k08
1583C6J91j76K01NJ98j67k85m44K49K14j16k24K63K19Lp2k18l4OL51O3J02pn7
1607C01K74j80j2r5k12O2k59N15l97J90r8j18R5j81m6j31l8k62M06J00q5o1mK3
1631b13m5m8J61J81J6l6K14J69j65l10l4J50O0l19M66j50o4o9j04k43K84J2J59
$$ plain form
1466 -149 206 81 -116 -20 10 32 -92 -289 190 85 130 32 41 296 668 117 355 623 440 22 533 279
1488 279 208 210 173 449 -107 31 26 -136 -29 -120 -121 102 -61 -538 -178 -192 -360 -409 -570 -177 -302 -117 8 -39
1512 -39 -388 -154 -330 -38 -56 -31 46 126 99 465 19 -38 97 -144 88 -434 76 126 161 -220 -135 -236 -280 -84
1536 -84 140 107 -1 -42 142 211 355 -101 -6 404 377 207 363 200 330 -25 -259 105 63 64 120 22 190 104
1560 104 -269 -337 -446 -372 -312 -232 -138 19 -177 -445 -294 -345 -296 -231 -84 97 295 172 -228 52 165 244 36
1583 36 227 51 252 257 455 288 3 -441 -192 22 -94 -318 -55 164 167 95 -123 -157 -151 200 263 365 358 301
1607 301 575 395 383 288 76 138 -121 394 -3 187 89 -29 66 -115 -161 -292 -330 -592 -186 -86 -171 -232 -236 -213
1631 -213 -258 -306 -145 36 52 16 230 399 234 -76 -110 40 100 -219 247 97 33 -36 -140 -383 -99 -87 72
1654G2j16L95j67k00M9k34M1J6J24K16K90L18k45l75m86K88m5j77M48k18J46%
1676A40j18j75l18K52J61J99l2K18j90r7q8l67l03J56K45K18P6J92Lk76Q9K0j64
1699a59J22K0K68p5l55L0J11l29K72k24P37k66M7j08J94m22J88j06n0L80Kk95
1721a8j07L14j18nj41K48k7J58l25K76j93k31p5K56k29L67k7l57M06o1l4P7j41
1744A3Q7l25l2J46J49j86J43k25P2J21k94K45l1j36J66j22L74j43J92l73N9j42
1766b42L07J81r9O0K16%k31Ml15K07j95K41j02j3j74J90J57j69k87r5M6J50M3
1789a20J13J18k05k93L49k57J77K11J76J13J53l4k55Nl45L0l49K23K95o8n2k39
1811b54p3ok53J01J83J90J69J34j27P1j5k02j54J42J62K25J5M01l50k73K09j10
$$ plain form
1654 72 -44 351 184 -16 33 -201 -160 -144 -20 196 486 804 559 184 -302 -14 -59 -236 212 -6 140 140
1676 140 22 -153 -471 -219 -58 141 109 327 137 40 -48 -415 -718 -562 -317 -99 -23 169 172 -104 -15 5 -159
1699 -159 -37 -17 251 176 -179 -149 -38 -367 -95 -319 418 152 199 91 285 -137 51 -55 -105 275 277 -18
1721 -18 -125 189 71 66 -75 173 146 304 -21 255 62 -169 -244 12 -217 150 123 -234 172 111 77 154 13
1744 13 100 -225 -257 -111 38 -148 -5 -230 -158 -37 -331 -86 -117 -253 -87 -209 165 22 214 -159 -100 -242
1766 -242 65 246 147 207 423 423 192 196 -119 88 -107 134 32 19 -155 35 192 23 -264 -359 -313 -163 -120
1789 -120 -7 111 -94 -387 -38 -295 -118 93 269 382 535 501 246 251 -94 -64 -413 -190 105 37 -15 -254
1811 -254 -327 -333 -586 -485 -302 -112 57 191 64 135 120 -82 -236 -94 68 293 308 709 359 86 295 185
1833A85m61J95P5J33Qj60k7r8K1k5p2M7J38M7L8Mj0J2k04J90j63l1J36J76K76
1858D30j7k56O8o5j74J53j74K4R6p8l11l8j23R7N3l7K54j24K63l11L75j95k08
1881b98jK35k81M23L0l15L95J61l41J50p0J0K95k88n8j00K52k15J39r5J05j23
1903A0m1M08m28N4J21k59l7J13j94J68L15j79P3K02l85J04j37J3K33j29j7R6l15
1926b11n0O0p4J66k28L66J2K22j03j74n3mq0K22j19J50k4l15R2J13k41L88m43
1949c28K04J04K23j13l9J62J87k25N4k17M70k48j83L2J07M3l42K07l19J20j12
1970b13K17q2J23J32k69K71k15m6J07j94J39K28j37j37J87o3k96J48K8O2J83j75
1992bRK15k33P8M6O8j05qml86J64K34l77j23K11O4O1J59J67l3l03L14j03m0j31
$$ plain form
1833 185 -276 -81 -6 127 135 -25 -52 -150 -129 -154 -226 -179 -41 6 44 48 38 50 -154 36 -127 -158 -22 154 430
1858 430 413 157 225 160 -14 139 -35 -11 85 7 -304 -342 -465 -368 -315 -352 -98 -222 41 -270 105 -90 -298
1881 -298 -299 -64 -345 78 108 -207 188 349 8 158 88 98 393 105 47 -53 199 -16 123 28 133 10
1903 10 -31 377 -51 3 124 -135 -172 -59 -253 -85 230 51 124 326 -59 45 -92 -79 154 25 8 104 -211
1926 -211 -261 -201 -275 -109 -337 29 41 263 160 -14 -67 -71 -151 71 -48 102 78 -237 -145 -32 -273 115 -328
1949 -328 -124 -20 203 90 51 213 400 175 229 12 482 234 51 83 190 233 -109 98 -221 -101 -213
1970 -213 4 -78 45 177 -92 179 -36 -82 25 -169 -30 198 61 -76 111 48 -248 -100 -72 -10 173 -2
1992 -2 7 222 -11 67 113 181 76 68 64 -322 -158 76 -301 -424 -213 -149 -88 71 238 205 -98 216 113 73 -58
2017e8j5J6J78j83J33k43J82QQ6j04K30q7r3q6K33q9k45Q4j4k20J84j61J41k08
2041c31M61N7j32J32j49J70j81j5J74m40K79j3l2j70J18j00J2K72l17M49l22J2
2063f6J72r2jL1Q4m9J22j00j52K02%P5j60Q7J1k79K36j02r1J41j46J07L22j70
2087A82j23J3m4J99l06J75o6j59P3O1j60R6K6J1K67r0l9o4l7q2JJ62k14J35k10
2112a93j30J47L36k81J4P9m9j1J68P7j81L14n82M4K86k29L3J38k77J51P8M1q2
2135a09p3L27k7Oj21N5Q6J18j77J85l08J08N2K1k68oOJ76j23j16K78j04j18J51
2159A9n4J19J7n9O8j78J97m4J32j88M3j55J51J46m00J07Pj25M1J33J99k15P0r
2183B2o0J48kj15J50j82j02J50j11j63Q9j3J70J40K5j87J36L2j06n2J42J58j36
$$ plain form
2017 -58 -73 -57 121 -62 71 -172 10 18 104 0 230 143 50 -36 197 108 -137 -53 -67 -287 -103 -264 -123 -331
2041 -331 130 187 55 187 38 208 27 12 186 -254 25 12 -20 -190 -72 -172 -160 112 -205 244 -78 -66
2063 -66 106 14 13 44 128 79 201 101 -51 151 151 226 66 153 164 -115 121 19 -72 69 -77 30 352 182
2087 182 59 72 28 227 -79 96 30 -129 -56 5 -155 -59 -33 -22 245 155 116 52 15 -67 -66 96 -118 17 -193
2112 -193 -323 -176 160 -121 -107 -28 -77 -88 80 157 -24 290 -292 -248 38 -191 -158 -20 -297 -146 -68 -27 -109
2135 -109 -182 145 118 124 3 58 144 262 85 270 -38 70 122 143 -125 -131 -125 51 -72 -188 90 -14 -132 19
2159 19 -35 84 101 42 110 -68 129 85 217 29 72 -83 68 214 -186 -79 -72 -197 -156 -23 176 -39 31 22
2183 22 -38 110 108 -7 143 -39 -141 9 -102 -265 -176 -189 -19 121 146 -41 95 127 21 -31 111 269 133
2206A33O5k22J20l7M9K2j02j19k5l1M3K0LJ02k91J36q0K25K22k02R2K79o07K78
2230G3J8j13Q1k5p0P3r4j6o5N1N4p0m1k0Q6J00J98k70j0Q7j6M1j34K00n2Jk10
2257a43PM3J45l68K96P7j9m5K21k54j18K57k15L01k37j01l5J22m6L86k12p3l56
2280c67L07q3oK21j32k00K43K97k16pj30L6J35q6j13j65M15l87Q6N9R4N1k37K48
2304F3j94M08l05J93k16J53j77n5J04J12J02k80rK02k18J68j31K32M3R4k45j24
2326h0L62k88J57j85J96k15p1Q2L0Q8k3jJ9j64J73n7j44J84P0j45j07R1q1l24
2350d33L38J82j90%P4k25n5K76N5K22j87Q7J27p0k58J24j4j60RJ03N1J23j09r0
2374b0L5j45N0P0O6j88J96nL2K3j6j32J18L9Oj77k18N70Qk99K30j91K60l22o7
$$ plain form
2206 133 198 -24 96 59 108 130 28 -91 -116 -147 -104 -84 -81 21 -270 -134 -214 11 233 31 123 402 -205 73
2230 73 91 -22 59 34 -36 37 -57 -73 -138 -87 -33 -103 -144 -164 -78 22 220 -50 -60 27 11 52 -82 118 66 67 -143
2257 -143 -136 -93 52 -316 -20 57 38 -7 214 -40 -158 99 -116 185 -52 -153 -188 -66 -112 274 62 -11 -367
2280 -367 -60 -143 -149 72 -60 -260 -17 280 64 57 -73 -37 98 12 -101 -266 149 -238 -152 -93 1 52 -185 63
2304 63 -131 277 -28 165 -51 102 -75 -130 -26 86 188 -92 -101 101 -117 51 -80 152 195 289 44 -80
2326 -80 282 -6 151 -34 162 -53 -124 -42 -12 76 53 52 71 -93 80 23 -121 63 133 -12 -119 -28 -109 -433
2350 -433 -95 87 -103 -103 -29 -254 -309 -33 22 244 57 144 271 201 -57 67 53 -107 -98 5 56 179 70 -20
2374 -20 15 -130 -80 -10 56 -132 64 59 91 114 98 -34 84 123 129 -48 -266 304 312 13 243 52 312 -10 -77
2399g7J16O6o7k00j08J8K42o5k7oL3J99L1l69j5J59j9P6J66O3j48j50P5j00o6
2424a73N84l70J47q0L2m22M53k62J21j06j72K17p6K25j45r1k02L20m3K8l5J25
2446G5j33n7J11j18j2J43n6O6j66K08j23J73p2q9L26k13L9j19n4J01k8k42N7Q4
2470i9j8M5K93Jj18J32j47K05Q2k17l9m5o2k58L62j83J45J28l96K39M5K9k57J61
2494B8J13k12m5r0K76j80O2Q4j0J7J56l98K36rj39R7L34o04K75MJK04k23J73L7
2519A87J08m75J75Q3o8j47K83j39K13j62j77m5J80j2j15j00L08j42l8P6L71n07
2541a43L10l8r4J14j3N8mo11K38K45J20Q9n42L92l5M5k09L3j36m1L3L49l3j83
2565e6lo2m7K7K58J00k8l76K59J38l17K34q5j32n1L5K81l72L56j82O0j11l6L26
$$ plain form
2399 -77 39 105 38 -162 -270 -252 -10 -75 -102 -108 -75 124 155 -214 -229 -70 -89 -13 153 216 68 -82 -7 -107 -173
2424 -173 411 41 188 108 140 -282 171 -91 30 -76 -248 -31 -107 118 -27 -118 -320 0 -43 -15 -50 75
2446 75 -58 -115 -4 -122 -134 9 -47 19 -147 61 -62 111 39 -50 276 63 102 -17 -71 30 2 -240 -183 -99
2470 -99 -117 -72 221 222 104 236 89 294 376 159 120 75 13 -245 117 -66 79 207 -189 50 95 124 -133 28
2494 28 141 -71 -116 -206 70 -110 -48 36 26 43 199 -199 37 28 -111 -14 320 -284 -9 -5 -4 200 -23 150 187
2519 187 295 -180 -5 78 10 -137 146 7 220 58 -119 -164 16 4 -111 -211 97 -45 -83 -7 364 -143
2541 -143 167 129 35 149 136 194 190 -421 -183 62 182 271 -271 121 86 131 -78 -45 -181 -222 -189 160 127 -56
2565 -56 -59 -121 -168 -141 117 217 189 -187 72 210 -107 127 42 -90 -141 -106 175 -197 159 -23 37 -74 -110 216
2589B16j76m5r5K9M5m7j12Q2l2l4O1Q5M1Q2q8k5J74j46J92L3k90J66Q7k86O1k00
2615b22J80j38l3L58Kp2k3k21NpJ83Q7n5k3P5P7k39k1N3K44k07j07O3P8j43Q3
2641b3J6L03j51l12M07o5p7k59Q4K95l30P1R5j01L4j14P6p3J82o0J09j36L9K9
2665C9j81K22K15k48O1k47K14J45r0j82JL8m1m3P1m9P5R2J47l79L4R2N8l10K53
2690a3P2J14j28j97J18Q7N7m6l30K09K46M5l01O9O4j00M1lJ15j47rL6L2m8k85
2715c02J92l1j67L40j84K31n8j78K11lj69J37R2l8J9j48J61m9j01p5J92k48N15
2738C39o2l37j29K33p9q1K28k59J87o3j4r7R6n2J67j36J81j23l15J64K51K50m58
2761a09K16j91K74j60J07l25J94J91k29n6K27p1j8K0J32l23J20K7l01M76k31J84
$$ plain form
2589 216 40 -5 -100 -71 -26 -73 -185 -103 -135 -169 -108 -23 18 100 12 -13 161 15 207 240 -50 116 203 -83 -22 -222
2615 -222 -42 -180 -213 145 147 75 52 -169 -164 -171 12 99 44 21 96 173 -66 -87 -34 210 3 -104 -41 37 -106 -23
2641 -23 -7 296 145 -167 240 175 98 -161 -77 218 -112 -41 54 -47 -13 -127 -51 -124 58 -2 107 -29 10 39
2665 39 -142 80 295 47 108 -139 75 220 130 -52 -51 -13 -54 -97 -26 -75 0 92 239 -140 -106 -14 44 -266 -13
2690 -13 59 173 45 -152 -34 53 110 64 -266 -57 189 234 -67 2 66 -34 7 4 119 -28 -37 -1 31 -17 -302
2715 -302 -110 -141 -308 32 -152 79 21 -157 54 51 -118 19 111 73 92 -56 105 56 -45 -120 72 -176 339
2738 339 277 -60 -189 44 -35 -116 112 -147 40 -23 -37 -134 -38 -90 77 -59 122 -1 -316 -152 99 349 -109
2761 -109 107 -84 190 30 137 -188 6 197 -32 -88 139 68 50 70 202 -121 -1 26 -275 201 -30 154
2783A54m74L05l7N7J01j12L5k84L26J4k58M5J48J02J90m12j07J55k38N35j69R
2805H5n6K68l74N6j51R5q0J94r6L03n06K48P8k38m2J98J93l96J89M2L4M8l50K37
2829b1K19k62J91l70L05R7j91J69o2l60K38O2O3j77QJ43j18L9R7M4l36L08R6j64
2853A8op6j41J94K6k10K35J7m9K16r2j37J01r0ll4K29L4l47R8j97K36j95J13l3
2878i3Q0O7Q3k39O2J40K05l48N7j04Q9q4K53j55j59L22k31j48K05P2N6m14J10
2901a74K86K9k44M4J85k96L96j72J04j12P6m0m3j30R2L16l33K77l9j71j0j57K83
2924A67k85K93r9j10l0J77o7j5p8J04k7j68l3J77J36k90J22K46l15J33L15k18
2946A35j18p1Q8P9j81L7O4J01k8j99j07K52M0O5j86m8J43q6rO0J58k35J43Q9m45
$$ plain form
2783 154 -320 -15 -52 5 106 -6 29 -255 71 85 -173 -128 20 122 312 -100 -207 -52 -290 245 76 85
2805 85 29 297 -77 -21 -172 -77 -157 37 -59 244 -262 -14 64 -174 -216 -18 175 -221 -32 10 44 92 -258 -21
2829 -21 198 -64 127 -243 62 159 -32 137 75 -285 -47 15 78 -99 -91 52 -66 -27 70 114 -222 86 182 18
2853 18 12 -64 -205 -11 15 -195 40 57 8 224 132 -5 96 6 3 -31 198 232 -115 -17 -214 22 -173 -60 -93
2878 -93 -13 54 137 -102 -40 100 305 -43 14 -90 -1 -85 168 13 -146 176 -55 -203 2 74 130 -284 -174
2901 -174 112 141 -103 -59 126 -170 226 54 158 46 122 82 39 -91 1 317 -16 261 222 51 41 -116 167
2924 167 -118 175 76 -34 -64 113 46 31 -47 57 30 -138 -171 6 142 -148 -26 220 -95 38 353 135
2946 135 17 -54 34 113 -68 -31 33 134 106 -93 -200 52 92 157 -29 -77 66 -20 -29 31 189 -46 97 186 -259
2971b59J74j23R7M40m60R4J72k33K89l44L7K87k18M7J24k58O4J7P7j29M8k28L53
2994F8k02o0K9R3n1j0K1Q7j03L13q1k7m3R7p1j47M3J15J56l39J27j19R2J50j90
3019e2M1k1j7J58O3rq3p8mp5K32K2j35O9Q8j15j48j68M14Q5l43m2J24k3L10j96
3045I7Q3j11J61k77L1Oj04M0R9l4j56K06k87R4m0K5n1K29j01J80j57j45K00L02
3069B90l20J70k25j27L78l33K36Nj39k6l0J20m0n1J95j43J89j24o1Q7j32J44M0
3092A03l1o6p0K04K3k04k4j73P0J64K4K6m4J63M3l66L83k21L7R3j41J77j94m1
3116f5N8P0J81l94j18L16l2j84J06jJ4K5J17R3j87jk37M58k92r4J37K11k79K8
3140g0p5J2N7M6K26k53R0j70m6K10p6o4m4J49J57m38N07l02J75j17K0p2j29L91
$$ plain form
2971 -259 -85 -208 -111 329 -131 -37 135 -98 191 -153 -116 171 -47 0 124 -134 -70 -53 24 -105 -57 -285 68
2994 68 -134 -194 -165 -72 -123 -133 -112 -25 -128 185 104 77 34 131 60 -87 -44 71 227 -112 15 -104 -12 138 -52
3019 -52 -11 -32 -49 109 172 163 80 2 -2 -77 155 177 42 111 199 84 -64 -232 182 267 -76 -118 6 -17 293 97
3045 97 180 69 230 -47 -16 -10 -114 -74 25 -9 -165 41 -246 -152 -192 -167 -218 11 -90 90 -67 -212 -12 290
3069 290 -30 140 -85 -212 166 -167 69 74 -65 -91 -121 -1 -41 -92 103 -40 149 25 -36 51 -81 63 103
3092 103 72 6 -64 140 163 -41 -65 -238 -168 -4 20 46 2 165 208 -158 225 4 41 134 -7 170 -24 -65
3116 -65 -7 63 244 -150 -268 48 16 -168 -62 -63 -49 -24 93 186 -1 -2 -239 219 -73 -167 -30 181 -98 -70
3140 -70 -145 -133 -76 -30 196 -57 33 -137 -183 27 -49 -113 -157 -8 149 -289 218 -84 91 -26 -6 -78 -207 184
3164A84j06l6m3k00L37j91j64L57j00l0J03j30K95k70K54k93J06q5M5j94K09j61
3186a13Q6n5j68L87Oj08r0n7J33j16J71j03KN1q2P6J44P3j64L0O7k20RJ11K8J13
3212B11Kj94Q2k26J61k0j56L2J59j24J5k0K20K9j33j48j56M37n4l4k2l75L90o7
3236IM3k24J83k47K13N9j9r0j14L55j80K67j93o4n4J5J18j8k74J22M7K23M2R1
3260C10o6j75Pl26L08L8r9j03J62j9r2QJ24J92n15K95j42P0m8J41qj92J26j56
3284a60J03J91j32L2q7j20L41k37J09l0l1J11j4n6k4j03m5K96j54n3J12qn2J36
3308A25m71L83m2j06n1Q8J11m8J1J8N8j82K14j35Q8J8J27j39l6P4p3P3j76k53
3332c24M50m2k15j3K00K40j56j57r7j11K98mk07J70k54K10K1p3P4Q6R2j61j19
$$ plain form
3164 184 78 42 -1 -201 136 -55 -219 138 38 8 111 -19 276 6 260 -33 73 -12 33 -161 48 -113
3186 -113 -27 -82 -250 137 143 35 -55 -112 21 -95 76 -27 -25 26 -56 20 164 237 73 103 170 -50 -41 70 98 211
3212 211 213 19 101 -125 36 16 -140 -108 51 -73 -58 -78 142 171 38 -110 -266 171 117 83 61 -314 76 9
3236 9 52 -172 11 -236 -23 36 17 -73 -187 168 -12 255 62 -2 -56 -41 77 59 -215 -93 -46 177 219 310
3260 310 244 69 76 -250 58 96 -3 -106 56 37 -55 -47 77 269 -246 49 -93 -23 -71 70 62 -130 -4 -160
3284 -160 -57 134 2 34 -53 -173 168 -69 40 10 -21 90 76 20 -4 -107 -152 144 -10 -63 49 41 -11 125
3308 125 -346 37 -5 -111 -162 -74 37 -11 0 18 76 -106 108 -27 61 79 206 67 31 105 32 105 -71 -324
3332 -324 126 84 -131 -144 56 296 140 -17 -114 -225 73 69 -138 32 -222 -12 9 -64 10 96 188 27 -92
3355i2l8n7J7L20l17L49k34Q1J28l79J37K09n3L4l2l69J96P3J54j82l1J20p4l2
3379g2J62lj46O6q8J12j50J1J3K54j69J32k54J20P4j89J69k1k6k6k46L51j85K71
3403A60l46p0Q7J35j89M14j22r2K11k95p8J57j56L60kj95L8N0Kq8J17j30N9J55
3427A82k91K50k83M4m1J14r0K15j31J19j96N4L30l85J35Q0j04k5K16m9j23%J03
3450A24k02Q6n1Q4o1m2J65Qk22J02j54J91K1j13J27m2k7j15K61K1k24J01J37k24
3474d9J18J1k48J68m4R3K8l4J1j43o6L71l40R2M4J41k62K53o4J00k51J14j28M9
3498c6M3j59L64J04l18K71j14j12K14l73J94J30k01k8j06J54N6l9r2J11j71k1
3520a29J62r7J97l24K32j74N0P4j80J16K23j49j2J1J7j22J60j08k87J70K62j84
$$ plain form
3355 -92 -130 -187 -170 150 -167 182 -52 29 157 -222 -85 124 71 105 73 -296 -100 -27 127 -55 -86 34 -40 -72
3379 -72 90 87 -59 7 -81 31 -119 -108 -95 159 -10 122 -132 -12 62 -127 42 21 -5 -31 -277 74 -111 160
3403 160 -186 -256 -169 -34 -223 191 69 -23 188 -107 -185 -28 -184 176 174 -21 17 67 69 -19 98 -32 27 182
3427 182 -109 141 -142 -98 -139 -25 -115 100 -31 88 -108 -54 276 -109 26 106 2 -23 193 144 21 21 124
3450 124 -78 8 -43 41 -20 -62 103 111 -111 -9 -163 28 49 -64 63 21 -6 -121 140 161 -63 38 175 -49
3474 -49 69 80 -168 0 -44 49 77 43 54 -89 -155 216 -124 -32 12 153 -109 144 80 180 -71 43 -85 -36
3498 -36 7 -152 212 316 -2 269 155 43 257 -116 78 208 7 -21 -127 27 83 44 -48 63 -108 -129
3520 -129 33 -64 133 -191 41 -133 -83 -9 -189 -73 150 1 -11 0 17 -105 55 -53 -340 -170 92 -92
3542i2K04nq5K9nn7k59K06J9J25j74K95J30j48k8j40Q2k83p3M43p1k94J82J98
3566A99k04J5J47k3k30K03n8j20Q3j02J52P0l34N03j21m56K93k53L64k13p0K73
3588A18k16J15N7R4q8J83m03j56L25k16M65k75K19l10N6j38K5J62K22n3j05r4
3610a3K05j63m4L0M3J57j28j76J67j64J87j55J78k61R5J92m33K19L10k52J09n3
3632E0j3o6m6Q8J90k21J75j07Q2j08j28k6L7L26l35nnK25j43nL8j57R8K67l14
3657a03M0j05N5L11r8J08j10L2k9J02j80j65J68J9j24K55k33k2j58K26J33j73
3679e1j84K46J16j09j06j36J35j1j11J38J35j83K20L5n8j97N5q2R2Q3m55J55L37
3702F4q5k2Q2L9JR2J09j60q6Rj81p6N1J62J7J47k7m1j36J41j49J09l27L42j86
$$ plain form
3542 -92 112 107 22 51 46 -11 -270 -64 -45 80 -94 201 331 183 155 15 97 -186 -259 184 113 -181 1 199
3566 199 -5 10 157 134 -96 107 49 -71 12 -90 62 132 -202 301 180 -276 17 -236 128 -85 -155 118
3588 118 -98 17 74 168 80 263 -140 -296 29 -187 278 3 222 -88 -32 -170 -145 17 239 186 81 -13
3610 -13 192 29 -15 15 58 215 87 -89 78 -86 101 -54 124 -137 -42 150 -283 -64 246 -6 103 50
3632 50 37 -29 -75 13 203 -18 157 50 132 24 -104 -130 -93 233 -102 -107 -112 113 -30 -35 3 -154 -56 211 -103
3657 -103 -63 -168 -113 198 100 208 98 130 101 203 23 -142 26 45 -79 176 -57 -79 -237 -11 122 -51
3679 -51 -235 11 127 18 -88 -224 -89 -100 -211 -73 62 -121 99 134 76 -121 -66 -148 -56 27 -428 -273 64
3702 64 -21 -43 39 78 79 171 280 120 34 43 -138 -214 -163 -1 16 163 136 95 -41 100 -49 60 -267 75 -111
3727a11J84j90K37m1k1K23n9l4j07j59pJ45k42J63j23L90k24M0J35m60M44j65
3749A8j49J04J24j77p1K42Q4n10J86R1P6P3j94J83j76J03L25n20M06m08J37p1
3771a24Q5K16k29k37N43j33j22R8j70M5P9j63J78j21j09P5O7j65J02r4K23Q7L0
3794A61O0m45j36L41K72m28N00m28J57J62l76K75n8J53k25J96r8l15M41m48M98
3815B59l79n6J92l5P5J34j59j6J11k49J81j83K98q9R3Jl8k21J17K24m36J61J09
3838I4J51k05k99NK50J56r2j48Q8No8m2J4J4m8L16j14j48J34j86n1J32j70L69
3862A57n6k6j58q0K68J13l79K43j30J21j11Q9N8J7j50P5m6M02m49k1O7J15j0k70
3886a61L47j03r2k85K75l7K86j28l6j06NK22m1K90n19k8o0K47j53j4N4K56k06
$$ plain form
3727 -111 73 -117 120 79 58 281 222 188 81 -78 -85 60 -182 -19 -142 248 24 64 199 -261 183 18
3749 18 -131 -27 97 -80 -151 91 175 -335 -149 -58 18 91 -103 80 -96 7 332 -188 218 -190 -53 -124
3771 -124 -39 177 -52 -289 254 121 -1 97 -73 -28 51 -112 66 -55 -164 -89 -22 -187 -85 -179 44 131 161
3794 161 221 -224 -360 -19 253 -175 325 -103 54 216 -160 115 57 210 -15 181 83 -232 209 -239 259
3815 259 -120 -176 16 -19 56 190 31 15 126 -123 58 -125 173 84 177 178 140 -81 36 260 -176 -15 94
3838 94 245 40 -259 -254 -4 152 60 -88 0 5 -63 -105 -91 -77 -125 191 77 -71 63 -123 -174 -42 -212 157
3862 157 101 75 -83 -163 105 218 -161 82 -48 73 -38 51 109 126 -24 51 5 407 -42 -63 4 119 109 -161
3886 -161 186 83 -9 -294 -19 -56 230 102 66 -40 -35 187 146 436 -83 -111 -171 76 -77 -91 -37 219 13
3909A3k4j15K51j04n2K21k19m1K51n2j53P6j40K18k80l4K47j12q1P1K43L7q2k44
3933a05N5J62l17K64K1j46P8j41J60j3j92J28j03J93l4k09O9L21J3k10l9p4J36
3956A7K33l11k47K41J23K0O0P5k67J08J8j98K33p6K42j93J20J33n08K90p4j1J27
3979A55k68J01J95j56j88L49L0k18N3k10J13nJ10n1k02j4m1L48l69L40k78N1M70
4002C15m26P3j22J87j69K30j39J84j23q9K29l36k4K98J70j66m2K6n7o5M9J22j13
4025A2m16P16l28m9Q7j62K81k31K60Pk02q6L29l27l3J28J06o1r6J55n7j11K80
4048B02k42K53o4rN5m8pj9k37L67O7m74K07k23J84k7K24k56L8Q8k44r7K67J64
4072A69j56m5p5J13k59K34j83M12j33r4j41J68K5Q8k09M0J38j6k14J7j13J65K25
$$ plain form
3909 13 -11 -126 125 21 -31 190 -29 -70 181 129 -24 52 -88 130 -150 -184 63 -49 -130 -59 184 221 139 -105
3933 -105 -50 112 -205 59 80 -66 12 -129 31 18 -174 -46 -149 44 10 -199 -130 191 204 -6 -45 -119 17
3956 17 250 -61 -308 -67 56 76 136 211 -56 52 70 -128 105 29 271 78 198 331 -177 113 39 28 155
3979 155 -113 -12 183 27 -161 188 218 0 53 -157 -44 -49 61 10 -192 -206 -247 101 -268 72 -206 -155 315
4002 315 -111 -38 -160 27 -142 88 -51 133 10 -79 150 -186 -210 88 258 92 50 76 19 -46 3 125 12
4025 12 -404 312 -16 -65 22 -140 141 -90 170 177 -25 -111 218 -109 -142 -14 92 31 -65 90 33 -78 202
4048 202 -40 213 149 140 195 147 140 121 -116 251 318 -156 51 -172 12 -15 209 -47 -9 79 -165 -262 5 169
4072 169 13 -32 -107 6 -253 -19 -202 210 77 -17 -158 10 35 123 -86 -46 92 76 -138 -121 -234 -69 156
4095A56k66K31j88J05R3k84j20J29J11J45m6R2j30j57K68k75K23j23o7P2K00k7
4117A42j23k2J68k11J18j4k08l7P5RL26j06L4k84K06l7Q2j36l9j02k5M84l52k91
4141c43R2L99j77J26l6o3N3k49J63J01j57k2P4K81j31j19J37o8j85L36j3m04M3
4164a62J24J09o9pJ83j14l32N73l05o8J03P5r6l2r9J18m3K83k91J68l66j1L77
4187A18J01j47o9L6j31P2N8Q3j87K76k75J19R4k20K8L11j55K0k3j91p2R6k0j49
4211b27J15qK62n9k3N8j79J1J14k3j5K3j76J12J62q8k72N8J45j04P7P6NR8j73
4236c1k9J21K45j61j7j65n9r6J14l8O4j31L03k16KpK8K94k08M5R8j70Pr3L23k88
4262f5J18j80J82k40L63k10k2pJ35o7j11K10j2j78k8K38j50k4k7R2J9j8p6j47
$$ plain form
4095 156 -110 121 -67 38 131 -153 -273 -144 -33 112 66 158 28 -129 139 -136 87 -36 -103 -31 169 142
4117 142 19 -3 165 -46 72 58 -150 -187 -112 -103 223 117 151 -133 73 36 118 -18 -57 -159 -184 300 -52 -343
4141 -343 -251 148 -29 97 61 -2 51 -198 -35 66 -91 -113 -39 242 111 -8 129 61 -124 212 199 -205 -162
4164 -162 -38 71 2 -5 178 64 -268 305 0 -68 35 110 14 -18 -117 1 -42 241 -50 118 -248 -259 118
4187 118 219 72 3 39 -92 -20 38 121 -66 210 -65 54 148 -72 -44 267 112 132 109 -82 -154 -58 -78 -227
4211 -227 -112 -120 142 83 60 118 -61 -50 64 41 26 49 -127 -15 147 59 -213 -155 -10 -114 -37 39 44 142 -31
4236 -31 -60 61 306 145 128 -37 -96 -192 -78 -116 -52 -183 120 -96 -94 -101 -73 221 13 58 156 -14 -7 -100 223 -65
4262 -65 53 -127 55 -185 178 -32 -54 -61 74 7 -104 106 94 -84 -112 126 -24 -48 -75 17 36 18 -58 -205
4286b05K99J78l40J5J85q2k2j29q0P7rL5k0m4L19K4l83L06k97J76n8J82o0Nl6
4311C6o4p4P1J39j46p1Q7P0j07j49K40j05J85k99J28J42k53J10J8J11j4j86m3
4334a74%j10M39O2j04k02O4j72K87%k37j91L20Q9J68k29j79L63l7j36N1j00j36
4357a64M16j94r2J52n1j97M51j21j99J20K5j67L8qr9J40j69R9J43J58l31mJ66
4380A12j63J59k35J86k75J36P4R6j51l2P7P4m8Jq6l8L52k53J53J7J21l87m4L46
4404A92k17j43K58k5J12K4L9l14K0J8Q9R2k99K23M3k73n9pK24J43m31J93J19k11
4428a90K22Qp6R6O7j69j53p8L00J4j45K07l49K38q7k2K52k48P2k5J71j26P8K5
4452H2m3q0J49o6j3J15l13J13k13L02o2J81l07K12J5k29mK03n6l5lJ36j20j01
$$ plain form
4286 -205 94 272 -68 -53 132 50 28 -101 -181 -104 -113 -78 -98 -142 177 201 -182 124 -173 3 -55 127 67 72 36
4311 36 -28 -102 -31 108 -38 -109 -22 48 -59 -208 32 -73 112 -187 -59 83 -170 -60 -42 69 55 -131 -174
4334 -174 -174 -284 155 217 113 -89 -25 -197 90 90 -147 -338 -18 71 239 10 -169 194 157 21 72 -28 -164
4357 -164 252 58 -34 118 67 -130 321 200 1 121 146 -21 17 9 -90 50 -119 -20 123 281 -50 -54 112
4380 112 -51 108 -127 59 -216 -80 -6 90 -61 -93 -16 58 10 11 -75 -113 239 -14 139 156 277 -110 -154 192
4404 192 -25 -168 90 65 177 201 240 -74 -54 -36 53 145 -154 69 112 -161 -220 -227 -3 140 -291 -98 21 -190
4428 -190 32 40 -36 60 127 -42 -195 -273 27 41 -104 103 -246 -8 -95 -117 135 -113 -41 -66 105 -21 57 82
4452 82 39 -41 108 42 29 144 -169 -56 -269 33 -29 152 -155 57 72 -157 -161 42 -14 -49 -52 84 -36 -137
4476a37K30m33K28J12l5J13J9p1m7J57j16k20K45l21L70k17P7N5J22n0O4j52q
4499a5j59M46k32j36O0J30R3j33n7L7K29k26k2J68k94K49j71m2Q0q6J20n25M84
4522bj6o1MJ65j5l54J85J37j21j58M30j41k8J83k96J09J7j47J33k75J83J38l23
4545b53L65m4L6k46K37j94j87M33j63J43l0o2n8P9l78M46l9k06J33j23Q2m6J57
4568H2j39J15l94L17K89k80R2k26P9K8J71P0l12J83j22Q7k91K48L3q7L38l58j34
4591b11K61K22j76j94L3J4m1J62k09K56K58n99O8J48p0L4o5j07L24j17O6L8j06
4614a1j05PL03j78j3j2O7j20q0J43P9J01j61k35K06P9j41O4J28pk90K38k74J87
4638b5N1j24K35l00K84o3m3J22j21j76J24J29p3L00l46j38L65j92k88L40p5J36
$$ plain form
4476 -137 93 -340 -112 0 -35 78 97 26 -21 136 20 -200 45 -276 94 -123 -46 9 131 81 145 -7 -15
4499 -15 -174 272 40 -96 -36 94 187 54 -3 34 263 37 15 183 -111 138 -33 -75 5 -81 39 -486 -2
4522 -2 -18 -79 -75 90 75 -279 -94 43 -78 -236 194 53 25 208 -88 21 38 -109 24 -251 -68 70 -253
4545 -253 112 68 104 -142 95 -99 -286 147 -16 127 97 35 -23 56 -322 124 85 -121 12 -111 -29 -75 82
4568 82 -57 58 -336 -19 270 -10 82 -144 -65 -37 134 204 -108 75 -47 40 -251 -3 30 -57 281 -77 -211
4591 -211 50 272 96 -98 -65 -51 -92 70 -139 117 375 -224 -156 -8 -78 -44 -109 -216 108 -9 57 95 -11
4614 -11 -116 -109 194 16 3 -9 58 -62 -142 1 80 181 20 -215 -9 70 -71 -7 121 114 -176 62 -212 -25
4638 -25 26 -98 137 -163 121 58 15 137 16 -160 -36 93 20 320 -26 -164 201 9 -279 61 -14 122
4660A22k6l85J82J30j02KPj2J41j3j80J84j85m1L21j39j41L30k21K44k59K27n8
4683A28j86J78j89Q7J3kP9J17n09N36p9j07j27k2J5K1Q3j35J55j1K24k36n9o3
4707h9K56l59J00L48j75K41l14j5J96k68J36j6j86L30j46j09O9O0j08J24l1k9
4729A5p1J50o0O4J8j01J9j88R8L6J46k3q9J7J6P7q2K0j08j7J31j80J28J51l37
4754a70M49k18J24n53Q6M20k3o8l93K92J24o3j56l1J45q7K71j48j57K78p8N5l5
4777F4j24l4N0k44L75j01J77l91lK57k32J03J69j5l08M30k93L20l7P3k32J25j56
4800b7l0J70j38n0K78k97J18q9N8n2n2L26k65K51k86q5J23J24j13J05l5p7n9Q6
4824a6Ro7O0Q7q1l9L01m10K1L87k94K47k76M7q0o8j13M27n6k57J95Q8k45K55J4
$$ plain form
4660 122 96 -289 -107 23 -79 -77 -70 -82 59 46 -134 50 -135 -176 145 6 -135 195 -26 218 -41 186 128
4683 128 -58 120 -69 18 31 29 108 225 -284 252 173 66 -61 -83 -68 -47 36 -99 56 45 269 33 -26 -89
4707 -89 167 -192 -92 256 81 322 8 -7 189 -79 57 41 -145 185 39 -70 -1 59 -49 75 44 15
4729 15 -56 94 34 98 116 15 34 -154 -56 -20 126 103 14 31 47 124 42 62 -46 -63 68 -112 16 167 -170
4754 -170 279 61 185 -368 -282 138 115 47 -346 -54 70 7 -149 -180 -35 -122 149 1 -156 122 44 99 64
4777 64 -60 -94 -44 -288 87 -14 163 -228 -231 26 -206 -103 66 51 -257 173 -120 200 163 236 4 129 -27
4800 -27 -57 113 -25 -75 203 -94 24 -65 -7 -59 -111 215 -50 201 -85 -170 -47 77 -36 69 34 -43 -102 -16
4824 -16 -7 -74 -14 73 -8 -47 254 -156 -135 252 -42 205 -71 -24 -104 -172 -285 142 86 -171 24 112 -133 122 136
4849A36l42J8K31q6n9K81j93Q7L9N6N9j76J17l54M06l72K21j26J37Pm86K99k8
4872a28J83l2l4R3p6K1k07J39J09k34L27j07Pp3J90j28oJ51k32J10P3l8Q2j78
4896A2j28J6L9J48n3j84J9K64k73J57k96J94L21k58j80L03L0k46j74K08J90k52
4918a43J60NPk6O1r8K24k70O2k29J61K0K79j38k07K51k51L62k14n1j31J95P0M
4942A03j78J00p2K65r3J16P4n61L44k06L08j30j18J09pj00j4l4P9R8r7R4q4p1
4966g5O9n4k17P90n48R8j66J08J98j25p7M6j31j58P3K40J7j3M8k23J34K2j38K
4990h0J27j05j9j60K61k89K35K4k8P8n14L77n3J21O3m4L9J76k21J28j28J02L02
5013C92j30k10k92K76j17Om7Q6L7J18K8k0j79n9L77o1j12j81J21J59l30R5J17
$$ plain form
4849 136 -206 -188 43 -43 -102 179 -14 73 112 168 227 51 168 -186 220 -152 69 -57 80 87 -399 -100 -128
4872 -128 55 23 -11 82 6 27 -180 -41 68 -166 161 54 61 -12 178 50 44 195 -37 73 146 108 190 12
4896 12 -116 -100 -61 87 34 -150 -131 133 -140 17 -279 -85 236 -22 -202 101 131 -115 -289 -81 109 -143
4918 -143 17 22 29 3 64 -34 190 -80 -18 -247 -86 -66 213 75 -132 119 -132 230 16 -35 -166 29 99 103
4942 103 -75 25 -47 218 125 241 315 -246 98 -108 200 70 -48 61 54 -46 -60 -94 -15 83 -14 80 -4 -75
4966 -75 -6 -60 -277 513 -35 63 -103 5 203 78 1 47 -84 -242 -169 71 88 75 123 -100 34 56 -82 -80
4990 -80 47 -58 -77 -237 24 -265 -30 -6 -34 44 -470 -93 -146 -25 38 -6 33 209 -12 116 -12 90 392
5013 392 262 52 -240 36 -81 -75 -122 -36 1 119 147 127 -52 -111 266 205 93 -88 33 192 -138 -43 74
5036G4o9k27j6L59L9k77K15K8k24j92L32p7L1l4J97r0j73Q7j60L22l27j46O01
5059B73l50j14K32j00j56M43k79R6O2n3m6p1J3J83p3J59k38P9j83o3K40m8j01
5082i5p3L42j72P4mk86J91j18J86q0K1R8j36J73j79m3j06K16n4J95J3k07K04j21
5106C9m7r2l8n1Q5j69M05j65R2k8J63k28M8j55J43p2r4J5J35J56l38J50N3Q8o8
5131B7O8j48K20k74o8J58mO0J60Lk09M2J43j73n9Q5N6J44j80k77O8K61k87L7L72
5156B25k75k6L22o54L73j15J08o2J61k65j60N01l62K33Mk3N3kM9j59J8Q1k17J84
5180hrm0j3J55j85J83n1J86k04K4M2k66K76j96P8K57k34LM2k47M34m08Q1K40j93
5205e3k0m2K65k31l66N15L6q9R3n3n1l20K04L05k18m9L1J13n4J58j13j23j15K57
$$ plain form
5036 74 5 -222 -238 121 160 -117 98 126 -98 -290 42 -35 -4 -38 159 69 -104 -17 -177 145 -182 -328 273
5059 273 -77 -191 41 -59 -215 228 -51 45 107 54 8 -63 -50 133 60 219 -19 60 -123 -186 54 6 -95
5082 -95 -168 174 2 76 72 -214 -23 -141 45 -35 -14 84 -52 121 -58 -101 -207 9 -45 150 163 -44 160 39
5106 39 -8 -100 -138 -189 -104 -273 132 -33 59 31 194 -34 14 -141 2 -70 -164 -149 -14 142 -196 -46 7 95 27
5131 27 95 -53 167 -107 -175 -17 -21 39 199 202 -7 35 178 5 -54 31 87 231 51 -226 -158 103 -184 -147 225
5156 225 -50 -76 246 -408 -35 -150 -42 -104 57 -208 -368 133 -229 4 8 -15 38 36 85 -74 -56 25 -192 -8
5180 -8 -17 -57 -70 85 -100 83 32 218 14 38 80 -186 90 -106 -28 229 -5 -2 40 -207 227 -181 -100 140 -53
5205 -53 -73 -115 150 -81 -447 68 104 15 108 55 4 -316 -112 193 -25 -74 -43 70 16 174 61 -62 -177 80
5229H0p9n4K59m76J72K55k40j27J61J04m32N38j30K77k96j43K02n7J10j55k1k7
5251g9j18J89N6k5L8j18K28M6j11j11K83n02K93k48J11J87k08J5J5r8K8Q7lr0
5275a35N1J7p9K81n4q6j25Q7pJ57K0q9n5n2M9P1q9j06K37k21J08J21l58K06J58
5300A07l09K49j24q5L45j79J9j0k14K62k90L54k97j30K28J71j07P0J27j9qJ31
5322B91n5k03J18r5r6l1J09P4r7j05J19kQ2j15r6K22Ok53J42q9ll6J78lm3o0q1
5349a22K45l97M72l3j12J7k30J56m2J27J41l81J22j55L51j34o3J77O3j78r9J53
5371G8k61J03J65j48j6Q9r7N9J40p6K15l69K39k06J97k30K81r2k96K67k12J32
5393c8Q0k07K64k2m7O5p8K05r0m7m18M65n7R5m10M94k76r2J72j29PM2J80J19j37
$$ plain form
5229 80 1 -53 206 -270 -98 157 -83 -210 -49 55 -377 161 31 308 12 -131 71 14 124 -31 -52 -79
5251 -79 -197 -8 48 23 61 -57 171 217 106 -5 278 -224 69 -179 -68 119 -89 -74 -59 -157 -129 -42 -45 -135
5275 -135 -84 -67 -146 135 81 -5 -130 -43 -50 107 127 38 -17 -69 -20 51 -38 -144 93 -128 -20 101 -257 -51 107
5300 107 -202 47 -77 -162 183 4 23 13 -201 61 -229 125 -172 -302 -74 97 -10 60 187 168 160 291
5322 291 236 33 151 56 -40 -71 38 112 15 -90 29 27 109 -6 -102 120 126 -127 15 -74 -77 -113 65 62 19 -41 -122
5349 -122 123 -274 198 165 53 70 -160 -4 -46 81 222 -159 -37 -192 159 25 -38 139 202 24 -75 78
5371 78 -183 -80 85 -63 -79 10 -87 -28 112 36 251 -118 121 -85 112 -118 163 71 -225 42 -170 -38
5393 -38 42 -165 99 77 30 95 17 222 132 85 -333 132 75 170 -240 254 -22 -114 58 -71 -64 -22 158 277 140
5418A40j22K29l04m7J31q9J38j31J75l7k61J71R5p8oKj80K30L2q9J32j83K51m29
5442b30K61o3R4r1o9j85K04J41N3j15j01K34j48J74q3K1j61qK01j48J65kp8j41
5466g5K03j94j79R2L8J96O3K18n39J17j78L16pk82L4k8K29j12K22j82J18j59N9
5489c0lm1mJ61k59J62L08k52j43J33Q0j21J90l94K07j85M1P3K92j07j39j42J88
5512A5j89L64n2n1m7N3j27K28k36jQ7Q2l53L46r4J01j41o1J60n2l59J96J74k01
5536a58L25j20K5l29J19M5oK12k53J83k9M0j59J85J11k65J07j68M9J9N9j68J10
5559f6KL1k8K23j35k27J33k47J92P3k59K88j78J72Q1n6J17j84J03J46m69L80r0
5582Bj53K53k6k6j4J21k46J39j63R8n3L38k70K24j61q6o3N4k15K44K7j5J95k65
$$ plain form
5418 140 18 247 -57 -104 27 -62 76 -55 120 83 -178 -7 88 10 4 6 -174 56 88 -1 131 -52 199 -230
5442 -230 31 -32 62 -29 -98 -283 -79 62 115 0 -101 133 -15 159 76 97 -64 -72 129 -19 146 144 66 -75
5466 -75 128 -66 -245 -153 -115 81 144 362 -177 -60 -238 78 71 -211 -177 -205 24 -88 134 -48 70 -89 -30
5489 -30 -33 -74 -78 83 -176 -14 294 42 -101 32 112 -9 181 -213 -6 -191 -150 -77 215 108 -31 -173 15
5512 15 -174 190 138 87 40 93 -34 194 -42 -43 44 126 -227 119 25 126 -15 -76 84 32 -327 -131 43 -158
5536 -158 167 47 72 -257 -138 -93 -99 113 -140 43 14 54 -105 80 191 -74 33 -135 -86 -67 -8 -176 -66
5559 -66 -64 -33 -61 162 27 -200 -67 -314 -122 -49 -308 -20 -198 -26 55 -1 116 -68 35 181 -288 92 2
5582 2 -151 102 76 50 36 157 -89 50 -113 -15 -68 270 0 224 63 -23 -86 -32 -247 -3 24 9 204 -61
5606f1J72m37L61j13K54k00P2m4J01R9l19J58j25J01k62N04l3k90j5j03L37j2
5628A45j99J56j80J44k37M6l6K45kK7p7n1j90J8J90j51L72m05L17j38K07q0j32
5651a1j78J00L2nJ67m4j05J86k30O4L6k38L08k3N1j25l1K6kp0%l4P8j81K08lq7
5678a11j39M58l54K98n1o5P7k02J17J88k7j62k19q0M29r4m0nJ59j06P3k71J5J48
5702C6J44l78J98m9j15J78k40K10m8k42J00K10j11K24j8m66N14p8j72J30J01p5
5724E3o8J08k25NK24PP3k57m5q1J58O0n5j1q2K45k47J94j23L0J27R8j29k31J54
5749a8N7k94L03q6J72j02m0o7n1P8L2Mm0r8K25j37J38q1j56L12j22N0J23j37j70
5774a05K73k50J94M6k85K19mJ49l87L08k59K37k07P0J16o9q0O2p2LOj86j2J99
$$ plain form
5606 -61 111 -326 35 -78 176 -24 48 4 105 204 -115 43 -82 19 -243 261 228 -62 -77 -180 157 145
5628 145 -54 102 -78 66 -171 -125 -161 84 82 109 32 -19 -209 -191 -1 -152 220 -185 132 -6 201 121 -11
5651 -11 -189 -89 -57 -62 105 61 -44 142 -88 -24 12 -226 82 59 110 -15 -46 -20 -22 -92 -92 -126 -48 -229 -21 -24 -111
5678 -111 -250 208 -146 152 101 36 113 -89 28 216 189 27 -192 -272 157 63 23 18 177 71 144 -127 -112 36
5702 36 180 -198 0 -49 -164 14 -226 -16 -64 -306 -206 4 -107 117 99 -367 147 69 -103 27 128 53
5724 53 -15 93 -132 -127 97 104 177 -80 -125 -206 -48 12 -43 -54 -136 109 -138 56 -67 -37 90 188 59 -172 -18
5749 -18 39 -255 48 -38 134 32 -8 -75 -126 -48 -16 -12 -52 -150 75 -62 76 -5 -161 151 29 79 202 65 -105
5774 -105 168 -82 112 158 -127 92 88 237 -150 158 -101 136 -71 -1 115 46 -34 28 -44 -41 -35 -221 -233 -34
5798c4R1j52J04j29j3J73m8K2m4j57K2M7J19j14qJ32p3J10k8N3k8J60j37pN1n2
5824F0k89M72k38j06J61J72l64p1J76J59o7K26m16J7J79l24L96k73K33j56L2J49
5846A28N4k61j18P3J38N6Rj06j22k2J81Jj46J01P5j25K89k52P0j61K43K4j38o6
5870g5J96K0k19q4M07l31J08J86j12J05k75K74n0ok88J72J62k4k02k33M42j40
5892C3N6j10J2oR9O3l72L18J3k14L62k52J85R3j80J18r9l98M30k17L5M0o0K5N0
5917B4L8j84L31k13M8n1q1J51j49K00l5j91J77j59P9q1J3n0J78n2J40p5K56j79
5941A35j63K02J12l68J59j06J29k16K74k23J02m1K8N7M5j89J73Nj09j81J31K1
5963b3RL45m00L73m49L43l87P3K80K3j23l5N6o1O2N0j07N8j35l9L6J23L5j92o3
$$ plain form
5798 -34 57 -95 9 -120 -133 40 -8 14 -30 -187 -165 -118 1 -113 -121 11 -62 48 20 73 45 205 68 61 112 60
5824 60 -229 243 5 -101 60 232 -132 -203 -27 132 65 291 -125 -108 71 -253 143 -130 103 -53 -21 128
5846 128 182 -79 -197 -124 14 70 79 -27 -149 -171 10 11 -135 -34 41 -84 205 -47 23 -138 105 129 -9 -75
5870 -75 121 141 -78 -162 245 -86 22 208 96 201 -74 200 150 144 -144 28 190 166 -36 -269 173 33
5892 33 89 -21 -9 -15 84 147 -225 93 106 -108 254 2 187 280 100 218 119 -279 151 -66 -31 9 -51 -26 24
5917 24 62 -122 209 -4 44 -7 -88 63 -86 114 79 -112 65 -94 -15 -96 -83 -133 45 -7 133 58 314 135
5941 135 -28 174 286 -82 77 -29 100 -116 158 -65 37 -4 24 81 126 -63 110 115 6 -175 -44 -23
5963 -23 -14 331 -69 304 -145 198 -189 -116 164 187 64 29 85 24 86 136 29 87 -48 -87 -51 72 107 -85 -148
5988a48Q1K43J09k36M0k08K11m8k4q1L4j5J0J87k54M6J41k27K29j29p3J16k52
6011b48L00j30n1K53M4J0k13M9l4J31j82J29r8q8O8j02K87j28J67j22Rk03K03
6034E1Q8j21r2J76k91K90m0j75L7k55L45j41O7k6K3K37k69O8L4Q1q2R2j54j78
6058b35J37J99J8j50j72K37o1K21j60k93K23k1J60r3n5q1K79n6o2J01m5j18J47
6081A20m6j06m6N4J53k22K07P5k79L32r9k9k08P8p8J19m3p7n9M3L53k11Q0j48
6105c7j12Q9J72j17j21J64J44j32j79K50J2k05K05k8j31P5o7o1L4K32j01oo8N5
6129F7J18K41k45o1l19J47N9L4J54m35J13Q6J99k73j6J16J23Q1k19P1N2j51J9
6152c9k16M24l56j6J79j98K50L9j17j58P0J36J01k06N3J52j96O4Kl3J58j99j40
$$ plain form
5988 -148 -67 176 285 49 89 -119 92 44 20 -61 -27 -42 -32 155 -99 -53 88 -139 90 -39 -112 4 -248
6011 -248 52 -78 -129 124 168 178 -35 14 -20 111 -71 58 -40 -128 -60 -162 125 -3 164 42 51 -152 51
6034 51 139 18 -74 102 -189 101 61 -114 -77 -332 13 -128 -61 -87 -64 173 -96 -28 6 87 5 97 -57 -235
6058 -235 -98 101 119 -31 -203 34 -27 194 34 -259 -36 -57 103 10 -45 -126 153 97 35 136 91 -27 120
6081 120 74 -32 -78 -24 129 -93 114 189 -90 242 143 114 -94 -16 -94 25 -18 -95 -154 -111 242 31 111 -37
6105 -37 -149 -60 112 -5 -126 38 182 50 -129 121 133 -72 133 105 -26 49 -18 -79 -45 187 86 80 12 67
6129 67 185 426 181 120 -199 -52 7 41 195 -240 -127 -41 158 -115 -131 -15 108 189 -30 41 93 -58 -39
6152 -39 -255 169 -187 -203 -24 -222 28 67 -50 -208 -138 -2 99 -107 -54 98 -98 -34 -32 -65 93 -106 -246
6175b46M34j86l57M81j71J44K6k14m8J32K46k31j9r3J2J61j84L5R0q4J47j65n9
6198a49O8J00j40J53j88J34K28j95l6r3J67l59K79J19k94L12j22o0J12nj79J64
6220A6n1J43N5k84J47O3J74k96j52K85k7j87K07L8rp3k17K09j00M67m53j8J53
6243I0k45N5K19l81m6M92m14K39P4j97O1j80J04O5J59l4k10J54k29J67p9R2R0
$$ plain form
6175 -246 188 2 -355 126 -45 99 125 -89 -137 -5 241 10 -9 -102 -90 71 -113 -78 12 -72 75 -90 -149
6198 -149 -81 19 -121 32 -156 -22 206 11 -25 -118 49 -310 -31 88 -206 106 -16 -76 36 31 -148 16
6220 16 -35 108 163 -121 26 89 263 -33 -185 100 73 -114 93 131 122 49 -168 41 -59 408 -45 -63 90
6243 90 -155 -100 119 -262 -308 184 -230 9 83 -114 -53 -233 -129 -64 95 61 -149 5 -224 -57 -136 -44 46
$$ [...]
8191C11
##END NTUPLES=NMR FID
##END=
