##TITLE=1H_K-324/1
 CDCl3
 8 sc, 
 11.02.2022
##JCAMPDX= 6.0         $$ Bruker NMR JCAMP-DX V2.0
##DATA TYPE= NMR FID
##DATA CLASS= NTUPLES
##ORIGIN= UXNMR, Bruker Analytische Messtechnik GmbH
##OWNER= root
$$ XWIN-NMR		Version 3.5
$$ Fri Feb 11 12:13:47 2022 Russian Standard Time (UT+4h)  she@DPX200
##.OBSERVE FREQUENCY= 200.131346
##.OBSERVE NUCLEUS= ^1H
##.DELAY= (6, 6)
##.ACQUISITION MODE= SIMULTANEOUS
##.ACQUISITION SCHEME= undefined
##.AVERAGES= 8
##.DIGITISER RES= 18
##SPECTROMETER/DATA SYSTEM= spect
##.PULSE SEQUENCE= zg30
##.SOLVENT NAME= CDCl3
##.SHIFT REFERENCE= (INTERNAL, CDCl3, 0, 15.7039)
##AUDIT TRAIL= $$ (NUMBER, WHEN, WHO, WHERE, WHAT)
$$ ##TITLE= Audit trail, XWIN-NMR		Version 3.5
$$ ##JCAMPDX= 5.01
$$ ##ORIGIN= Bruker BioSpin GmbH
$$ ##OWNER= she
$$ F:/spectra/data/she/nmr/H-F/1/audita.txt
$$ ##AUDIT TRAIL=  $$ (NUMBER, WHEN, WHO, WHERE, WHAT)
(   1,<2022-02-11 12:09:22.46 +0400>,<she>,<DPX200>,
      <created by zg, POWCHK disabled, PULCHK disabled
       configuration hash MD5:
       00 E9 B6 7A A2 85 ED C7 34 08 36 98 17 FE 4E 26
       data hash MD5: 16K
       5D A9 72 47 73 C2 9D 15 35 26 3C 4D 16 E1 CD 7B>)
$$ ##END=
$$ 
$$ hash MD5
$$ D5 F0 C3 C4 33 3B A9 95 21 19 69 07 55 E5 F3 55
##$RELAX= 
##$RELAX= 
##$RELAX= 
##$RELAX= 
##$RELAX= 
##$RELAX= 
$$ Bruker specific parameters
$$ --------------------------
##$DU= <F:/spectra>
##$EXPNO= 1
##$NAME= <H-F>
##$PROCNO= 1
##$TYPE= <nmr>
##$USER= <she>
##$AMP= (0..31)
100 100 100 100 100 100 100 100 100 100 100 100 100 100 100 100 100 100 
100 100 100 100 100 100 100 100 100 100 100 100 100 100 
##$AQSEQ= 0
##$AQ_mod= 1
##$AUNM= <au_zg>
##$AUTOPOS= <>
##$BF1= 200.13
##$BF2= 200.13
##$BF3= 200.13
##$BF4= 200.13
##$BF5= 200.13
##$BF6= 200.13
##$BF7= 200.13
##$BF8= 200.13
##$BYTORDA= 1
##$CFDGTYP= 0
##$CFRGTYP= 5
##$CHEMSTR= <none>
##$CNST= (0..31)
1 1 145 1 1 1 1 1 1 1 1 1 1 1 1 1 1 1 1 1 1 1 1 1 1 1 1 1 1 1 1 1 
##$CPDPRG= <>
##$CPDPRG1= <>
##$CPDPRG2= <>
##$CPDPRG3= <>
##$CPDPRG4= <mlev>
##$CPDPRG5= <mlev>
##$CPDPRG6= <mlev>
##$CPDPRG7= <mlev>
##$CPDPRG8= <mlev>
##$CPDPRGB= <>
##$CPDPRGT= <>
##$D= (0..31)
0 1.2 0 0 0 0 0 0 0 0.06 0 0.03 0 0 0 0 0.0002 0 0 0 0 0 0 0 0 0 0 0 0 
0 0 0 
##$DATE= 1644566961
##$DBL= (0..7)
120 120 120 120 120 120 120 120 
##$DBP= (0..7)
150 150 150 150 150 150 150 150 
##$DBP07= 0
##$DBPNAM0= <>
##$DBPNAM1= <>
##$DBPNAM2= <>
##$DBPNAM3= <>
##$DBPNAM4= <>
##$DBPNAM5= <>
##$DBPNAM6= <>
##$DBPNAM7= <>
##$DBPOAL= (0..7)
0.5 0.5 0.5 0.5 0.5 0.5 0.5 0.5 
##$DBPOFFS= (0..7)
0 0 0 0 0 0 0 0 
##$DE= 6
##$DECBNUC= <off>
##$DECIM= 32
##$DECNUC= <off>
##$DECSTAT= 4
##$DIGMOD= 1
##$DIGTYP= 9
##$DL= (0..7)
0 120 120 120 120 120 120 120 
##$DP= (0..7)
150 150 150 150 150 150 150 150 
##$DP07= 0
##$DPNAME0= <>
##$DPNAME1= <>
##$DPNAME2= <>
##$DPNAME3= <>
##$DPNAME4= <>
##$DPNAME5= <>
##$DPNAME6= <>
##$DPNAME7= <>
##$DPOAL= (0..7)
0.5 0.5 0.5 0.5 0.5 0.5 0.5 0.5 
##$DPOFFS= (0..7)
0 0 0 0 0 0 0 0 
##$DQDMODE= 0
##$DR= 18
##$DS= 0
##$DSLIST= <SSSSSSSSSSSSSSS>
$$ [...]
##$SUBNAM2= <"">
##$SUBNAM3= <"">
##$SUBNAM4= <"">
##$SUBNAM5= <"">
##$SUBNAM6= <"">
##$SUBNAM7= <"">
##$SUBNAM8= <"">
##$SUBNAM9= <"">
##$SW= 18.0517287032376
##$SWIBOX= (0..15)
0 0 2 0 0 0 0 0 0 0 0 0 0 0 0 0 
##$SW_h= 3612.71676300578
##$TD= 16384
##$TD0= 1
##$TE= 0
##$TE2= 300
##$TE3= 300
##$TEG= 300
##$TL= (0..7)
0 120 120 120 120 120 120 120 
##$TP= (0..7)
150 150 150 150 150 150 150 150 
##$TP07= 0
##$TPNAME0= <>
##$TPNAME1= <>
##$TPNAME2= <>
##$TPNAME3= <>
##$TPNAME4= <>
##$TPNAME5= <>
##$TPNAME6= <>
##$TPNAME7= <>
##$TPOAL= (0..7)
0.5 0.5 0.5 0.5 0.5 0.5 0.5 0.5 
##$TPOFFS= (0..7)
0 0 0 0 0 0 0 0 
##$TUNHIN= 0
##$TUNHOUT= 0
##$TUNXOUT= 0
##$USERA1= <user>
##$USERA2= <user>
##$USERA3= <user>
##$USERA4= <user>
##$USERA5= <user>
##$V9= 5
##$VALIST= <valist>
##$VCLIST= <CCCCCCCCCCCCCCC>
##$VD= 0
##$VDLIST= <DDDDDDDDDDDDDDD>
##$VPLIST= <PPPPPPPPPPPPPPP>
##$VTLIST= <TTTTTTTTTTTTTTT>
##$WBST= 1024
##$WBSW= 4
##$XGAIN= (0..3)
0 0 0 0 
##$XL= 0
##$YL= 0
##$YMAX_a= 156573
##$YMIN_a= -48212
##$ZGOPTNS= <>
##$ZL1= 120
##$ZL2= 120
##$ZL3= 120
##$ZL4= 120
##$ABSF1= 10
##$ABSF2= 0
##$ABSG= 5
##$ABSL= 3
##$ALPHA= 0
##$AQORDER= 0
##$ASSFAC= 0
##$ASSFACI= 0
##$ASSFACX= 0
##$ASSWID= 0
##$AUNMP= <proc_1d>
##$AZFE= 0.1
##$AZFW= 0.1
##$BCFW= 1
##$BC_mod= 2
##$BYTORDP= 1
##$COROFFS= 0
##$CY= 11.3945322036743
##$DATMOD= 1
##$DC= 2
##$DFILT= <>
##$DTYPP= 0
##$F1P= 2.36226072786647
##$F2P= -0.459571619588291
##$FCOR= 0.5
##$FTSIZE= 0
##$FT_mod= 4
##$GAMMA= 1
##$GB= 0.15
##$INTBC= 1
##$INTSCL= 1
##$ISEN= 128
##$LB= 0.24
##$LEV0= 0
##$LPBIN= 0
##$MAXI= 10000
##$MC2= 0
##$MEAN= 0
##$ME_mod= 0
##$MI= 1.114404
##$NCOEF= 0
##$NC_proc= 0
##$NLEV= 6
##$NOISF1= 3.799351
##$NOISF2= 2.8
##$NSP= 1
##$NTH_PI= 0
##$NZP= 0
##$OFFSET= 15.70392
##$PC= 1
##$PHC0= -16236.83
##$PHC1= 19.80079
##$PH_mod= 1
##$PKNL= yes
##$PPARMOD= 0
##$PSCAL= 0
##$PSIGN= 0
##$REVERSE= no
##$SF= 200.130013532006
##$SI= 16384
##$SIGF1= 3
##$SIGF2= 2
##$SINO= 400
##$SIOLD= 16384
##$SREGLST= <1H.CDCl3>
##$SSB= 0
##$STSI= 0
##$STSR= 0
##$SW_p= 3612.71676300578
##$SYMM= 0
##$S_DEV= 0
##$TDeff= 0
##$TDoff= 0
##$TI= <>
##$TILT= no
##$TM1= 0
##$TM2= 0
##$TOPLEV= 0
##$USERP1= <user>
##$USERP2= <user>
##$USERP3= <user>
##$USERP4= <user>
##$USERP5= <user>
##$WDW= 1
##$XDIM= 8192
##$YMAX_p= 0
##$YMIN_p= 0
$$ End of Bruker specific parameters
$$ ---------------------------------
##NTUPLES= NMR FID
##VAR_NAME=  TIME,          FID/REAL,        FID/IMAG
##SYMBOL=    X,             R,               I
##VAR_TYPE=  INDEPENDENT,   DEPENDENT,       DEPENDENT
##VAR_FORM=  AFFN,          ASDF,            ASDF
##VAR_DIM=   8192,          8192,            8192
##UNITS=     SECONDS,       ARBITRARY UNITS, ARBITRARY UNITS
##FACTOR=    0.0002768,     1,               1
##FIRST=     0,             0,               0
##LAST=      2.2672688,     0,               0
##MIN=       0,             -48212,          0
##MAX=       2.2672688,     156573,          0
$$ Real data points
##PAGE= N=1
##DATA TABLE= (X++(R..R)), XYDATA
0@%%%%%%%%%%%%%%qJ6j6J6j6K4l2L2m0M8n6O9p8Q9j04J20j37J57j80K04k30K59
36A37k91L27l67M10m56N07n65O28o92P63q44R32j026J129j247J375j512J668j843
55i67K039k262K517k811L154l566M067m689N489o570Q113j0505J4778k4816R7749
70H1720P4853n7402j119l9503l4981m2680N38L738n663j4489O363K540m035j8092
84d8212Q901K5816J2629P10J4369J3468J861k1493j5011J872m266j3338n15J1769
98a1440J6751l18l115J2305R510o918p529J732R700l802j1830J273L213p248j1418
113i134p150N600L215p495K545J1686N057l805n541L645L336q114l951N175N935
128A004J384n682J385P290l432n843J552O276N418m456p88O355k183q157n747
$$ y = [0, 0, 0, 0, 0, 0, 0, 0, 0, 0, 0, 0, 0, 0, 0, -8, 8, -8, 8, -8, 16, -16, 16, -24, 24, -32, 37, -41, 48, -56, 64, -73, 84, -96, 108, -122, 137, -154, 173, -194, 216, -240, 267, -298, 330, -362, 401, -443, 489, -537, 592, -655, 720, -792, 876, -967, 1072, -1190, 1327, -1484, 1670, -1896, 2171, -2518, 2971, -3599, 4514, -5991, 8787, -16029, 81720, 156573, 99171, 98052, 58549, 23568, -19112, -18574, -14836, -20499, -34988, -28625, -26085, -30120, -48212, -39311, -13495, -866, -156, 14213, 27681, 29542, 8049, -6962, -5090, -9356, -22694, -23209, -11440, 5311, 4993, 1878, 14183, 23693, 16775, 9246, 10978, 20678, 16876, 5046, 6319, 9532, 2284, -9134, -16284, -10684, -7469, -14964, -12419, -733, 4324, 519, -5022, -1377, 1959, -6155, -10106, -4931, 1004, 2388, -3294, -1909, 5381, 1949, -3894, -2342, 3934, 9352, 4896, 4108, 10463, 8280, 123, -5624]
143e624m78L320l117m170O921N086j529l353o97N093j297n384L493N091J62k697
159H20k980L083K01p046k164L672L479K05k034N758N815m188l594l13Q97k643
175a032o040Q93N668l22k280O47L015J389n052j125O538J805k92J090K944K432
191A0278n416n178K11j208l376k769J383N357o48k735L072K791r94k249l14M975
207C180J50l185J354J990n90l471l270K129O02l899O23L763K967j37j240K564
223C530J795l527j535Q43J624j35k994J122K086k705l115j3J468P90k087J401
239a452L935l77k054n09M74J114k504r82L435J071j546n33Q33J781k446j958K604
256H86J012m48m01L85K052j046k799Q94O77m27j416l04K357j28k532K8O64o15
$$ y = [-5624, -6102, -2782, -5899, -10069, -3148, 1938, 409, -2944, -3641, 1452, 155, -5229, -1736, 3355, 3517, 820, -2160, 923, 1124, -5922, -8086, -4414, -935, -730, -2764, 2994, 8809, 4621, 1027, 714, 1611, -1032, -7072, -6179, -511, -833, -3113, -2466, 549, 1938, -3114, -4239, 2299, 4104, 3812, 4902, 7846, 10278, 4862, -316, -105, -1313, -4689, -7458, -6075, -718, -1366, -4101, -1029, 1762, 768, -1481, -1795, 3180, 3330, 145, 1499, 3489, 2899, -572, -3842, -1713, -1111, -5010, -4387, -624, 2343, 2206, 966, 3530, 5325, 1798, 263, 1106, 2730, 2595, -399, 723, 2809, 104, -3011, -3024, -1556, -766, -2853, -1452, 2483, 2106, 52, -457, 17, 1131, -1373, -2355, 1080, 2151, 605, 72, 905, 2686, 240, -1718, 886, 1898, 1450, 1049, 1434, 3486, 2440, -359, 535, 1212, 785, -631, -935, 1422, 1294, -1238, -1210, -546, -1161]
274a161q28j920J905J716j695L52J720R61k49j958J757J783j367o04Q79J023Q8
291B402k407o47J436o46j740n9J294J327j827o59K382j37j449m45L99J593j463
308f46j681J559Q97j018j540J80K488J01k007J161J878K04q03j074K009M00k104
325Dl49J019M74j218k146J403J447k070r26J048J196j30k162J002K336j275j227
342a574J25J536Q47k385k58K652Qj259o90J242J733k299j330K148R46o77j507
359g42M18K608r53k634J102J698q70j886q3K699l66k268M16R13N64j640j259K234
377d9J446k085o62J830J655r70k095J329J997j624j341J96J841j58k432M30K118
394A426m33j621o15J544J047k150p54K201N47j276j329R92J511j751j252J415
$$ y = [-1161, -1989, -3909, -2004, -288, -1983, -1631, 89, 1050, 801, -1157, 600, 2383, 1016, 412, 1291, 2314, 2402, -5, -652, 784, 138, -1602, -1661, -367, 960, -867, -1526, 856, 719, -730, -1175, -776, 817, -646, -2327, -768, 129, -889, -2429, -2249, 239, 340, -1667, -506, 1372, 1576, 773, -301, 1708, 2108, 4, -345, 674, 1148, -70, -2216, -813, 634, -1436, -2362, -1314, -118, -248, -2410, -1408, 928, -347, -1574, -1449, 87, 934, -1451, -1709, 943, 951, -308, -998, 244, 1977, -322, -1652, 496, 1442, 765, -742, -324, 2284, 1331, -1303, -201, 1497, 627, -1259, -1342, 1357, 991, -1277, -861, 52, 616, -1024, -2283, -49, 1397, -688, -1350, 480, 2135, 1165, -930, 399, 2396, 772, -569, -373, 1468, 1310, -1122, -692, 1426, 993, -628, -1243, 301, 1348, -802, -1556, 645, 1192, -84, -1413, -421, 1090, -661, -1913, -498]
410d98J368j79j653N66K206k51k279M50J131M48j653n72J608P99j983n84J229
427A53P77q81j578J454J303r06r43O04J414j83j625L30J242m48j253n98J502N01
445H65j718o1J625K62r85j135R15R74j266o82J169P26l62j070J12J320n05j605
463a421M91J423K0j197K21J362N7j284l10L78R41o16j685J742P04o02p50P89R22
482A185l62j510M47J103q33p75l18J024K29j656k26J165O1p51n38J428J112q87
500a02j51J171O69l31r16K39J235q97q77L71K03k34j007m46J352k68p88J98O20
519D1J81q22p66J115L78j100j56L41P98p77q69J088Q35n73k70P77J121J66r36
538E72M47N50m28r94n96Q18M28j247J79Q22j58m40l54K54Q25p94q5P25K04j08
$$ y = [-498, 870, 691, -962, -396, 1810, 1559, -720, -270, 861, 1309, -344, -916, 692, 1491, -492, -1076, 153, 930, 49, -1529, -75, 1228, 322, -621, -17, 1397, 1214, -411, -81, 1161, 713, -540, -1138, 364, 865, -853, -914, 711, 973, -12, -1147, -232, 742, -524, -1206, -37, 689, 327, -743, -631, 689, 184, -1421, -930, 493, 513, -684, -463, 899, 956, -328, -638, -260, 681, 65, -1620, 122, 826, 224, -526, 263, 1185, 823, -687, -240, 863, 30, -745, -1063, -39, 190, -1466, -1692, -527, -466, -1217, -1755, -327, 785, -102, -253, 918, 1587, 1256, 340, 579, 1814, 917, 40, 411, 614, 380, -627, -1073, 279, 11, -777, -579, 41, 222, -600, -1366, -251, 127, -973, -1129, -788, 10, -767, -1636, -548, 287, -286, -556, 221, 1342, 1508, 572, 1019, 1569, 1141, 147, -449, 369, 797, -450, -271, 551, 393, -47, -401, -147, 678, -116, -201, 524, 728, 620]
558F20o93l36K68j255n58P63L74O08m43L51R22L2m59k16P58O46l30n3Q50Ro10
579A248o23k31J73q02o96L27N16l47L1k80O31j73r45J57R07m20J23K6P69L82r28
600a55K48N7l5J62m06L25M93m39q3L88kj95k85n6Q46k69j03r5O0K20q92l59O13
623C8l41k56o1P2N12m97l54N83K72k94m28M52Q85l45n06L36N30l06l18k33N37
644B78M19r94N43N23k11l59p56N69K79p56J0M21O6P9l00J0M81q00l25M03J13K56
666e1m22N26O58m40n06k9K61R5p47K46J103k0l82k33J9j14o42l18Q49J20J29p2
688C0P8K90l44o38R0N49j63j65P01K08M9r47R1K10m49Mm82Q75J95l10OJ39J12
711A29l22l81M31O58m00l12N55M64j69r12j66O68k60l04K56L00N19l80k02L55
$$ y = [620, -73, -409, -141, -1396, -1954, -1191, -817, -209, -652, -301, 621, 653, 194, -22, 736, 1382, 1052, 999, 1849, 1858, 1248, 625, 394, 567, -235, -931, -604, -88, -435, -404, -684, -53, -226, -1171, -1014, -107, -527, -404, -378, 391, 773, -155, 93, 150, 115, 277, -129, 196, 689, 250, 167, 555, 553, 358, 73, 17, 863, 594, 491, 396, 456, 676, -216, -575, 38, -303, -559, -620, -548, -36, -533, -887, -304, -32, -326, -754, -302, 583, 238, -268, 68, 598, 292, -26, -259, 278, 697, -297, 246, 769, 558, 199, -557, 12, 291, -465, -455, -34, 32, 111, -189, -179, 302, -498, -823, -420, -307, -51, -473, 53, 711, 271, -235, -264, -3, 92, -655, -409, 694, 674, 292, 59, 78, -36, -678, -996, -147, -27, 102, 30, 108, 398, 54, -584, -494, 55, -108, -273, 428, 636, 685, -262, -171, 39, -410, -406, -888, -13, 182, -128, -122, 17, 129, -193, -574, -143, 515, 115, -197, 358, 822, 653, -259, -425, 243, -17, -321, -65, 235, 754, 374, 172, 527]
731E27j33o13P3J40M24n4m93J18L54m89m53j28M48K86o18O18O76l82k41o6N15
752E09k18n53K57M16l0k27j78J35M76o72k63K69O7K71n16K44L57q1m51l3P5L24
774A78p49p6N99J33k10N4N9l8j91l85P25K34J56j05j7K33j73p81L50N9j32M0p4
797a11N32L2o80J66o0M0l48k22O66qj80q7J77L03j42l56Q3M98k06j68K15K99k21
820B22k20j42K87j06q0r4L41J43l64j18K61k37k05k76J52K17J92m14K05M32m11
841b15K1m27M63L54n56L52J95K36n24p6J74J59qn1k9R7j62p1M3L96l82m23K47
864a87M20j50m93O7K09L51m95J97r3L17l34R3L70l1k16l67J24N88m40m14M04K33
886A53j59k92K89L73l67m20L87K45j46j88k09L54P0j49m51N89k30J4j64N49m8
$$ y = [527, 394, -219, -146, -6, 418, 364, -129, -11, 343, -146, -599, -727, -279, 7, -611, 7, 683, 301, 60, -6, 509, 291, -262, -5, 411, 381, 154, -24, 111, 587, -85, -348, -79, -12, 259, -257, -13, 344, 263, -188, -221, -146, 178, -571, -647, -48, 85, -125, -71, -12, -50, -241, -626, 99, 333, 489, 384, 367, 600, 427, -354, -4, 55, -77, -37, -111, 421, 453, -227, -61, -121, -81, -429, -651, 15, 7, -173, -260, -83, 220, 78, -278, -195, 303, 97, -71, 144, 443, 222, 2, -140, 147, 41, -39, -133, 208, 351, -13, -131, 130, -107, -312, -588, -436, -219, -27, -441, -236, 196, -215, -194, -621, -158, 196, -360, -8, 187, 423, -101, -177, -3, 156, 148, 97, 68, 165, 3, -68, -25, 371, -11, -434, -187, 233, 83, -410, -343, -134, 217, -278, -81, -174, 143, -191, -98, 272, 241, 25, -342, -218, 370, -70, -484, -80, 153, -6, -298, -9, 364, -3, -423, -36, 209, 63, -125, -334, 20, 90, -59, -510, 79, -151, -137, -301, 248, 200]
907B00k95o8J48K82J00l35j43M24j50j47m3J40k0k85J54O3J28k20j8M94k43l30
929a64N3J46j94K4J99k21K23j4l23M00j28J34k53N51m7j29k80J39J16l13o2j48
951b91J45J81k38K69j44K87k51m9M8q7K30m46K36K02p2k21J55L51p7k77P6oJ86
974B07q7O1K45kk98j66M8L66l16l89L65k73K34m73L23M25l25j47K77j17j56J7
996a81r5K87j01j35k1L21j7k27m0L77O2M7j97K19j22J14j69p2L54m18J03r8o1
1019g0j32mO3Q0m0Ql4J18K17l90L6K17k83K00k03N3N4J03k9M4L18l60K18o7L6
1044A53Kl46N06j07R5l38r5K94j22j86J02o2L09j2m39L21l79M13p8k07K41k05
1066a40J08j8m5L1L2p6J41J42k89K93m6P5p0p1P7K44m66J18l4K9j39l7O4K67j14
$$ y = [200, -95, -163, -15, 267, 367, 32, -111, 313, 163, 16, -27, 113, 93, -192, -38, 25, 153, -67, -85, 409, 166, -164, -111, 35, -159, -135, 64, -157, 66, 52, -271, 129, 1, 135, -118, 433, 386, 257, -23, 116, 232, -81, -143, -291, -146, 35, -203, 66, -78, 209, -42, -91, -43, -130, 100, -346, -110, 92, 20, -201, -46, 305, 228, -49, 27, 21, 207, 120, 181, 426, 424, 126, -40, 8, 374, 58, -331, 34, -239, -5, -478, -155, 270, -55, -202, 75, -42, -198, -181, -276, 11, -90, -225, -246, 75, 58, -169, -209, 168, 230, 277, 80, 299, 177, 291, 122, 50, 404, -14, 89, -9, -70, -202, -206, -143, -63, -103, -95, -129, -11, 206, -184, -148, 69, -214, -14, -217, -164, -110, -7, -36, 8, 326, -34, 184, 117, 153, 155, -191, 315, 208, 303, -35, -130, 164, 42, -144, -42, -104, 205, 193, -246, 75, -304, 109, 31, -176, 65, -140, -32, -50, -95, -64, -32, -108, 33, 175, -114, 179, 133, 208, 138, 67, 144, 388, -78, 40, 6, 35, -104, -141, -77, 190, 76]
1091G6l57L58j21l7j13J56J15l3o2J29l3j08M17m78R4j1j18R0J39R2j50q9Q0m3
1115gN3j36nK06P1l62K25r9J13p0J04L17j61Jr9Q8m3l55O1j29M03k02o0L40q7
1140A67m6j87RK04k80J53%P4J31n03L9K99J44k81p3J04L36k48j81J78l8O4j9J87
1164B33P5k13Q3q1n1M0j69J21K59j43k30J59J76j45j29j52J07K46m02J63J63j70
1186f0J31m4j72R5O1m3O2Qj09J0J67k40J59j41R7q5M5j46J25J39J44j60m1j8p6
1211i2R4j19K41k9k01q8K01L8l0r9m8L83k76j01Q9q6M62l54r9J76M7j25n9k7J93
1236I1k89q4K29k4P5k04K32J67L2l37J00P7k1q6j34L59q8o7K00q7Kr0M2j03j75
1261a83J36m9j4K32J1r3k68L16l47K98j69m7l6N8L44k5k44L5J54j75J1j29J33
$$ y = [76, -281, 77, -44, -81, -194, -38, 77, 44, -18, 111, 78, -30, 387, -91, 3, -8, -126, -36, 103, 195, 45, -44, 36, -7, 46, -90, -95, 111, 182, -180, 45, -54, 59, -11, 93, 410, 249, 250, 151, 239, 196, -159, -98, -227, 176, -26, -86, 254, 167, 121, -66, -57, 147, -133, 20, 20, 94, 225, -278, -239, 60, 204, -77, -150, -46, 290, 42, -139, 39, 1, 65, 46, 233, 308, 95, 178, 97, 46, 86, -83, 38, 297, 154, -76, 83, 259, 114, -15, -167, -60, 186, -216, -53, 110, -60, 71, 27, -145, -50, 11, -32, 30, 38, -71, -61, 106, -134, 25, -116, -19, -104, -59, -205, -80, 59, 203, 43, 2, -16, -92, 2, -117, 124, 95, -106, -194, 7, 45, 15, -84, -132, 251, -25, -126, -37, -123, 339, -15, -114, 62, 109, -16, -75, -102, 91, -198, -282, -53, -77, -2, -206, 26, 193, 225, -112, -12, 65, 44, -42, -176, 183, 95, 28, 228, 141, 143, 53, 95, -8, -183, -47, -96, -110, 122, 133, 40, -228, 88, -259, 39, -130, -177, -213, -155, 189, 164, -80, -45, 109, -66, -55, -184, -51]
1284e1K85J12m50J84r7K27l77m3J70M0m8j06L25J7l48kj42K76l4k35J58J50n6
1307d5J20j6k7j36p9J36L8J54j61j05L13l77L19j52J2L74k56j80K58j0p8j86L06
1330B22j17j37J3j25J48J05J24k53N0k65L38j3K2l3j20J20M7k4j64J64j67M0p2
1353i7J46J62j99J62k06q6K02k10Q7J39j84Q4l9P9K71Lm47K69j46J84k70L0K9
1376c7J38K6k57l5L51k35N2M6j43O5L2r1K05k14J03J11R1j05m2p8jJ86k75Q9j27
1401a45K53k02P6k3j9Rj16O0J3j5K64K0j40O6k2N0n4j34J88l6k58Q3J78j82j68
1426b54L35J52p9jN2j27j86l1l7J61Q5j28J62n0K20o58M11l3J73j06n0j26J06
1449iK3l8L40o9j28J41n3J12l81j18K98j09j5QKK48j00j52rK7K02l58J09o1J62
$$ y = [-51, 234, 346, -104, 80, -17, 210, -167, -210, -40, 0, -48, -154, 171, 188, -160, -162, -304, -28, -62, -297, -139, 11, -45, 75, 59, 32, -104, -183, -47, -9, 145, -16, -121, 192, -185, 134, -18, -6, 368, 112, -68, 190, 180, 102, -84, 222, 105, -32, -19, -144, 4, 109, 233, -20, 30, -235, 103, 90, 112, 79, -41, 79, 126, 102, -62, 102, -65, -25, -97, 49, 211, 12, 174, -32, -118, 84, -126, -39, 100, -84, 0, -39, 40, 311, 314, -133, 136, -10, 174, -96, -66, -37, 101, 127, -130, -165, 186, -49, 3, 49, -94, -29, 3, -88, 117, -97, 6, 117, 208, 103, 61, -17, -18, 168, -107, -18, -145, 108, -94, -18, -41, -60, -51, -167, -107, -94, -109, 155, 175, 35, 101, 79, 129, 75, -59, 129, 93, -165, -82, 96, -86, -254, 81, 233, 154, 153, 205, 78, -108, -139, -176, -15, 70, -58, 104, 54, 274, -384, 27, -6, 167, 61, 11, -115, -9, 14, -24, 316, 247, 119, 260, 207, 319, -62, -180, 118, 9, -6, 2, 4, 252, 152, 0, -9, 18, 220, -138, -29, -90, 72]
1474G2k56K30p2lp4M1L3j04J2l7K34j58m4J51J52j45k11K85k0j63J34r2j7N2r
1499iJ29l22L17Q1m6l18L77l25m1J90j82K19L41n68K46L9m19M29j6k24J30J76
1521B04m14J38J81p2j38J35k64K09O7j33N1k3N6k68K3M89P7j22q2j86M4K09k03
1544b2J65k89J07j52K95j53M6j41l6o7J58r1L86k21J36k77K22K59l18o0l1l2L46
1567B30j57k01J72N1k30m2J59j33j20K81J36k67J92l0k12K75m3k5N0j59r9K5j5
1590a62L46l17nM59l28N5K9n4j59J02R2nj5J44j64L23m04J43k27K16q3q8K58l80
1614b24K48J7k22L24j47M4l1j58K60j00K4k0Q4j06j33QJ53L7k34R8OJ13k8j31
1638a18J22l6N5k73J81r7N0j07L85r6j49K72l2l95J03K08pN8k24R5kk06J46J35
$$ y = [72, -184, 46, -26, -29, -103, -62, -29, -133, -121, -158, 76, -82, -126, 25, 177, 32, -179, 106, 86, -77, 57, -35, -52, 0, -9, 120, -202, 115, 196, 150, -168, 209, -116, -157, 33, -149, 70, 411, -157, 89, 128, -291, 138, 122, -102, 28, 204, -210, -72, 109, 37, -101, 34, -230, -21, 46, -87, -36, -59, -3, -271, -248, 241, 318, 196, 114, -72, -28, 181, -22, 143, -146, -39, -191, 104, -49, -3, -144, -180, -247, -89, -180, 206, -15, 121, -156, 66, 325, 7, -53, -84, -116, 230, 73, -128, 44, 95, -135, -177, -18, -151, -271, 10, 146, -121, 71, 41, -171, 104, 61, 36, 86, -73, -172, -147, -162, 184, -133, -138, 321, -7, 48, 77, 23, -136, -34, 58, 53, 38, 182, 18, 341, -63, 80, -147, 69, -14, -102, 156, -224, 24, 41, -181, 143, -4, 40, 9, -149, 111, 11, 35, 15, 99, -7, -140, -132, 21, 58, -176, -78, -72, 41, 13, -118, 4, -32, 23, -250, -69, -166, -116, -223, 162, 66, -83, 189, 157, -238, -135, 73, 66, 124, -100, -5, -7, -213, -67, 68]
1662F8m8J54k40L7K70j04k92k11L54J32j49m7J30Q7k55M2R5r7K07l13l9J29J2
1685g8K4j40M75j35l00K89p5r0J74k10l96M46R1j21j61J33nJ8P8n7k7K4k5J90
1709A22j12R7j43J65o8J70j46j56M19m45K30m6l9l58J94O4K2n0P3n6lO6k20J37
1733h3j18L97m16J02K43l45J84K63r2j02j99K33k05J80p9r7M8J91n7j8K8q5K3
1756dJ5K04l08J26k41j2P8R9K67j41j17Q9k8j48K84j27N0Q4l33J72j7O4j68J16
1780Dm5L04l75J88j52K02o8q6j96K27o1K56k74K34Ok06K74k23L72m03j4J66j60
1803c0J61l71J94k25L74k4m3R8n6k82K98Q3j82N2j97L22k29P5j26P4l4q1J18L21
1827B90k51j18Q0J61k35J87n6j25Q6J35k61n2M01j54j50K5R6l53M62k63R6O0j69
$$ y = [68, 20, 174, -66, -29, 241, 137, -155, -366, -12, 120, -29, -76, 54, 141, -114, -72, 23, -74, 133, -180, -219, -90, -78, -54, -194, 281, 146, -154, 135, 60, -30, 144, -66, -462, -16, 75, -46, -207, -74, -79, -61, 17, -40, -67, -43, -68, 122, 10, 107, -36, 129, 61, 231, 85, -71, 348, -97, 133, 87, 48, -310, -116, -52, -30, -80, -7, -63, -66, 0, -220, -83, -201, 196, -220, -118, 125, -220, -36, 227, 135, 33, -166, 67, -138, 42, -37, -134, -86, 105, 48, 30, 58, -27, -4, 11, 215, -93, 33, -208, -220, -142, -43, 224, 83, -34, 55, 27, -121, 163, 36, 86, 170, -163, 9, -8, 56, -112, 4, -41, 263, -112, 76, -76, 126, 58, -28, -224, 3, -58, 198, -76, 158, 164, -42, 232, 9, 381, -22, -36, 130, -30, 131, -240, -46, -271, 103, 79, 36, 134, 78, -204, 94, 177, -5, 47, -150, 172, -57, 18, -108, -34, -68, -149, -31, 290, 39, -79, 1, 162, -73, 114, 58, -67, 19, 154, -107, -159, 242, 88, -62, -37, 59, -294, 168, -95, 1, 61, -108]
1850a08L7J66j62O6j00o1J21n7k0J57j32k7p5L39q5j82K47j59j9r8L62j79J44
1873A75j45l1r9R5Q6j59L70l53P3J96m40K10Q2J00J56m74K20k8n1j62L8jJ57Q2
1897I7j21J4j08N1L66l63n4K15o8j74J37j38o3J73l6m5J78J53K6j67j25K47o6
1920A29m1j99K44L4p4k00L9o5K29j43J47L7l52L53j4J70l69J96l65K96P2m4Ll84
1944c01J38J51J03j9j14Q5N2j18QL04k92k26J31P9N0r5J95k15J00j27L15M6j67
1967H3m3m8j04k3MJ49Q9k03p8J34K09j16k18J6O2R8l9j20K56k21K27k44M67l06
1991C1r2M3q4P5j28K25j09J47j49l1j61L48k96K87j01j25J8K78Q7l88K46p8k33
2014a90J00o9PL52k19K2j37J04n7L0j82K21l7K16o0n9k62K41P1Q6k28Lj54R0K4
$$ y = [-108, -71, 95, -67, -1, -101, -162, -41, -98, -118, 39, -93, -120, -195, 144, 59, -123, 124, -35, -54, -152, 210, 31, 175, 30, -1, -100, -5, 81, -78, 292, -61, 12, 208, -232, -22, 60, 160, 316, -158, 62, 34, -17, -179, -141, -142, 15, 97, -24, -10, -118, -67, 299, -64, -118, 97, 29, -145, -8, -146, -209, -36, -72, -117, 61, 214, 240, 73, -52, 195, 129, 88, -111, 133, 167, 93, -107, -68, -133, 96, -47, 100, 137, -215, 138, 124, 294, -75, 121, -244, 52, 124, 80, 83, -301, -163, -12, 91, 72, -42, 43, 95, -23, -15, 289, -3, -229, -98, -19, 31, -64, 131, -84, 16, -111, 204, 250, 83, 40, -8, -112, -135, -131, 18, 107, -96, -174, -40, 169, 53, -165, -149, -87, 11, -28, -148, 108, -113, 114, -130, 337, 31, -61, -18, -102, -27, -155, 70, -39, 108, -41, -72, -233, 115, -181, 106, 5, -120, -102, 176, 263, -125, 121, 43, -190, -90, -159, -152, 200, -19, 3, -134, -30, -87, -57, -239, -18, -55, 161, 101, 42, -220, 21, 92, 178, -50, -47, -201, -111, -87]
2039h7J53k1J21k98M94m56K69m16J76l6Q5R3k83L24p7p6q0q1J97L6n8M0kj49j04
2064b36M61n51J53K12J29j08k3k18J17J5K49o7N3k73J07J31jl01L78j4j51j73
2086a11j15K27m3J91k83J47l4J81j10j03J56M2k80r7N1J61K13k75J75j66J13J38
2108A78k3l97L74j83l3J23q3l7K4j52K32Oj4Q0ll05K00J45J87j31j16R3k3o0q8
2133fL5k25M51k51J2j84J30K33j9l44M8K41k39r8N01j20k70m9q4L03j58j25J13
2156a05K37k02r1Q6j54M06k00J20J4l23k6M01l06K45J60m46M08k81K4J03l3k71
2178b34K48o1N3l4P5j28J89j01q0L6J08L0j54k65K82J5Q5k60N5M8Kk2K04O7j54
2203DO9J95k97J91j76O1k13L55j01l66L92j85j07O3N7N6k8P6j79R9J09p7J87r8
$$ y = [-87, 66, 45, 166, -132, 362, -94, 175, -241, -65, -101, -16, 77, -206, 118, 41, -35, -115, -196, 1, 37, -21, 19, 17, -132, -236, 225, -326, -173, 39, 168, 60, 37, -181, -64, -49, 200, 133, 186, -87, 20, 151, 150, -151, 227, 213, 62, -111, -226, 1, -42, 149, -134, 13, -21, 160, 50, -53, 103, 145, -135, -232, -181, -20, 193, -82, 93, -73, 40, 178, 155, -242, 132, -51, -84, 39, -44, -81, -57, -209, 23, 29, 15, 95, 92, -213, -13, 132, 319, 188, 72, 165, 142, 82, -6, 29, -196, 255, 4, 16, -168, -38, 195, 176, -168, -120, 121, -118, -216, 285, 165, -105, -154, -238, 65, -93, -218, -105, 132, -70, -161, -75, -229, 177, -23, 97, 111, -212, -238, 163, -143, 102, 262, -184, 224, -57, -33, 70, 37, -234, 14, -47, 6, -28, 47, -81, 108, 7, -73, -37, 71, 101, -53, -318, -36, -21, 64, -196, -141, -93, -91, -113, 91, 158, 4, 73, 268, -29, 162, -14, 47, -166, 189, 88, -278, 114, -71, -178, -115, -58, -2, -30, 46, -133, -34, 75, -2, 185, 87]
2227H7p6R2Lj71K71j27k27K34j47j53K24k2n6J23n9R8p2j33J69J40k82L59j00
2250A75l42Q3J81r9j13Q3J89k73J84K74l94j4J04q3j06N7O7J03M0l8n2M3O1n3
2274G7q2O5M8k58J45j35j7JJ99L0r1J40j25L5K12m78K92P1l2n0OQ8k72K02j77
2299a06jqJ96o7Nj03J84k15K41j53j02K05p2k8k7J47j93M9J67q5q2J30R1o4Nk04
2325i0J10q3L62k38j7j92J94J96m87L51l57P1L28J4j47M0k11J07J05j41J12l2
2347ek7O5J28m62J42J86o4j10L72k40j49J40j73M20j89l17K65j17L86k71R0k61
2369a91K34J73k44K35k32o9m4j62N36m21M33m20K35j78j19P4o8L37J4k46m0L94
2391B31l59K71j35L0m4q9M31l29NPK1l7O4K7O6rq1j0m03N29K13j43k60k60L50
$$ y = [87, 11, 103, 106, -65, 206, 79, -148, 86, -61, -214, 10, -12, -68, 55, -4, 94, 22, -111, 58, 198, -84, 275, 175, -167, -84, 97, -2, -115, -32, 157, -116, 68, 342, -52, -66, 38, -45, -151, -94, -27, 76, 116, 78, 26, 69, 130, 77, -5, 60, 108, -150, -5, -140, -157, -156, 43, 73, -18, 122, -3, 32, 244, -234, 58, 129, 97, 47, 53, 141, -131, 71, -106, -107, -115, 81, 14, 19, -84, 100, -115, 126, -27, -129, 76, 4, -24, -51, 96, -97, -48, 119, 34, -48, 82, 173, 109, 114, -90, 20, -63, 299, 61, 44, -148, 46, 242, -245, 106, -251, -180, 148, 162, 15, 55, -156, -49, 56, -85, 27, -5, -32, 33, 161, -301, -159, 27, -37, -147, 225, -15, -164, -24, -197, 223, 34, -283, -18, -135, 251, -20, 70, -191, 43, 216, -28, 207, -25, -94, -138, -300, 236, -185, 248, -172, 63, -115, -234, -160, -228, 109, 123, -123, -163, 231, -128, 143, 8, 38, -6, -95, 336, 7, 12, 19, 40, 3, 67, 94, 160, 151, 70, 60, -343, 186, 399, 256, -4, -264, 86]
2416H6R0k74K46m4r4p9K35j44j45L10k91J99m4n2lk40K85j24N8M2K09n2j46K1
2440D9n9l1l67K85R3o0J12N4j54%rJ4J47J01j84J28Q1n7j76J89j64l75K76J68
2464F1k68J15k2J78j23k8J27L3m1M9l43j08K66J47j26J28M3l5j47O4J3r3K78j67
2488AK50l9k07r5R6l5J6Q6j19K70m30JL90m07L88k22K48q2j22M9l3M0j21p8J64
2513Ik84K85q5K09Pj31m1N3J21n8j7r8M7l51L90j19J34J65K3j3n28J27M8J11k01
2538a97P7J0j48L46r7L34l79J09K87j86p9M1N9m0k88M4K9J57L8j00P8j85J10l6
2562a6j41N5J27L1j03L92n13PJ56M3J5o5M3k66J60L34m41J34J04J14k87R4k4j9
2586f6O7J10P6j03j46Qo7k14L81R1j14j52K8K8L19j91k05J50K66n90L00J70k45
$$ y = [86, 176, -98, 148, 104, 10, -69, 166, 22, -123, 187, -104, 95, 51, -1, -4, -244, 41, -83, -25, 17, 226, 174, 28, 49, -10, -41, -408, -123, -30, -90, 22, 76, -78, -78, -87, -73, 74, 175, -9, 119, 200, 143, -33, 156, -8, -383, -107, 61, -207, -92, -114, 64, -59, -87, 40, 73, 32, 81, -262, -370, -104, 43, -83, 45, 88, 53, -94, -30, -17, -110, 168, 1, 251, 212, 5, -90, 6, -29, -13, 73, -46, 224, -206, -205, 185, -222, 166, -56, 192, 110, -12, 37, 4, 44, -77, -155, 9, -275, 10, -75, 134, 141, 10, -31, 22, 143, 85, 68, -30, 17, -334, 56, -63, 71, 236, 259, 246, -282, -155, -107, 4, -197, -120, -110, -258, 88, -9, 325, -54, 55, 342, 156, 77, 118, 177, 137, -151, -107, -78, 79, 117, 17, 95, -90, 20, -16, -157, -102, 25, 56, -47, 345, -168, -161, -5, 38, 53, -12, 31, -235, -75, 259, -182, -48, 56, 170, -117, -23, -47, -66, 1, 111, 187, 84, -62, -54, -121, -335, 46, 137, 23, -129, -101, -73, 246, 55, -150, 0, 266, -324, -24, 146, -99]
2609i9q6J83O3r0J25k64J53q3m5R2K11J88j87k31J16Q4oP4j0m12L75j07o3J57
2633A38k31K25j22K4k36L67L8j87J52o3j15R9Q4n2n4j60K76J03j64k3N3j28K04
2656B28l94J14M6J2Q1Q4k11k23J91k8J35j52K06j3r0o9K18m31L41j20lm9K14l1
2680E6l05N22m03K59%j25j27K48k54L90k36O4j48J51n9p8K70n8j08k23M35k58
2702A3j33K81p1O9m4q3J37j40O5Ll8j32Q5J9o4K2J36j86j65N12m60J92r6m3l3
2727a54J57J65j73k26M33o9j5j79o9J86m14K61p2J18R5k65K29j16j39K12j21K83
2749A27j20j1q5K83k62NN2o8j7K59l81K74N0k13J91j7l4j8Pko9p3J47OK3k6p3
2776d5J64m2m3j22J84k76J19J82j32l3qk18J30K13Nm1Q1j90M6j49L19k39p0J05
$$ y = [-99, -185, -2, 61, -29, 96, -168, -15, -98, -143, -51, 160, 348, 161, -70, 46, 130, 124, 198, 188, -224, 151, 44, -19, 138, -93, 132, 10, 34, -202, 165, 203, 16, 168, 105, -10, 89, 173, 121, 67, -93, 183, 286, 122, 99, 152, 24, 228, -166, -52, -6, 6, 87, 171, -40, -263, -72, -100, 35, -117, 89, 76, -14, -83, 135, -296, 45, -75, -78, -127, 87, 56, -249, 273, -130, 129, 129, 4, -123, 125, -129, 261, 25, 89, -59, 92, 33, -45, 225, 167, 59, -164, 271, 13, -120, 161, 90, 159, 115, 32, 169, 29, 94, 97, 59, -73, 12, 31, -33, -11, 125, -61, -226, 286, -174, 18, -78, -121, -154, 3, 168, -5, -231, 202, 133, 118, -61, -130, 56, -358, -97, -169, -51, 44, -221, 8, -108, -247, -35, -156, 127, 7, -4, -89, 194, -68, -63, -11, -79, -96, 163, -218, 56, 106, -107, 84, 67, 33, 15, 22, 20, -49, -122, 25, 31, 54, 28, -45, 119, 77, 34, -88, 96, -180, -61, 121, -11, -44, -52, -270, -140, 73, 78, 37, 118, -72, -26, -175, 144, -95, -165, -60]
2800f0N8Q2k3K09j32j73J06pm4j05J2J03J15m7j26J56o3J4k10R7L2k4M1J81k85
2825i3K12J10m22K90p3j1J9J12j23J93m16qK31J02P4n6q1j33J6k0J94j72M1K3
2849Ij58L7N1R8K76k50k24J75N1l1J43m9k61O8R5k69L80j63r5L38k50J13l3m9
2873Bj36L01k51K4j4L52j94j42J27j30L78m30K9J68k87o2M55m91L60j94N6q3J43
2896a9Q8O1L4k29J43j50j90L38k03J38l2J59j54m6j53o5M89l72K13Q0j69J25J1
2919I7k23J60Rj56J82L6m7r4R1q7O1K84o53L39J16Q8m52K28J81J05n11J24J56
2942C4l4J4J17o3o1n3M1oQ2j36J20k30L22j59L19l17n2j06J1J37J57j77j05m9
2966a94L10j40J29n5l3Q6Rj54Q3R4k33J02k37M6J06r2J30K93k22Q1O1j05k07O9
$$ y = [-60, -2, 80, 57, 266, 134, -39, 67, 60, 16, -89, -77, 26, 141, 94, -32, 124, 61, 75, -135, -38, -6, -30, 11, 192, -93, 119, 229, -193, 97, 24, 13, 32, 144, 21, 214, -202, -210, 21, 123, 197, 141, 60, -73, -57, -77, 117, -55, -14, 9, -149, -112, -61, 37, 313, 63, -161, 14, 65, 34, 177, 128, -133, -65, 30, -239, 141, -22, -117, 221, -29, 84, 51, 2, -134, 167, -84, -60, -74, 278, 84, -58, 69, -61, 317, -113, -84, 84, -203, -265, 190, -301, 59, -135, -79, -162, -19, 69, 130, 164, -65, 78, -72, -262, 76, -127, 11, -21, 138, -16, -62, -215, -280, 209, -163, 50, 130, -39, 86, 97, -126, 34, 43, -113, 69, 105, 58, -36, 55, -32, 29, 313, -340, -1, 115, 203, -249, -21, 160, 265, -246, -122, 34, 0, 14, 131, 68, 7, -46, -5, -11, 71, -65, 55, -175, 147, -12, 307, -10, -62, -168, -157, -20, 137, -40, -145, -194, 116, -24, 105, 50, 17, 103, 112, -42, 41, 135, -98, 4, -233, -187, -81, -173, -43, 250, 28, 109, 170, 65, -142, -73]
2990g3K18L3o0j86j4K67q4j04j8L46j38j82j65K26j41J6R2j62J09o9J20J8k7o5
3014d3L9m4k27L62j6l8R0jp7k10K38j96K27J7m0j07j54K6K4J57J92j67LM3j42
3039d4O1J71r0k70L6J44O8r3L69m28l2j10j16M59r5j16J42K5o4M7k55N6o0P6J82
3064F3o1N1n1J16l23K55k4k11R6J03o2J91j13m8p6K65k19L37Q6m58mR3K8lj01
3089g0j1Q7k16K95o3l3J37j58k8p7j9nJ08Oj06K10M5p8J69l87J62nR5j97L40k52
3115e1J42n8j66K78j29Qj4j59K10kJ22m7q3m7J35q8l7o7J1m6MJ47p5j71o6J88
3141f1oPL6K35k28l6J13P0j96k53K28J66o3N2k67J28J12J88n09K22M2j18J51L07
3165C20l12L23l82j61K64p3J21k49Q9J18K6k21P1J34P6n1nk43J47j73K21l29J31
$$ y = [-73, 145, 178, 118, -68, -82, 185, 101, -3, -21, 325, 187, 5, -160, 66, -75, -59, 33, -129, -20, -89, 31, 49, 22, -43, -4, -48, -275, 87, 71, 33, 123, 122, 45, -165, 73, -123, 104, 121, 81, -26, -180, -154, -130, 27, 219, 52, 55, 98, -44, 17, 188, 98, -172, -136, 8, 76, -17, 352, -76, -108, -218, -334, 125, 30, -86, 56, 81, 17, 64, -191, -135, -195, -119, 63, 2, 53, 2, 118, -205, 50, 26, -185, -89, 14, -48, 143, 30, -18, -94, 171, -48, 289, 375, -83, -87, 6, 34, 31, -70, -81, 6, -210, 85, 22, -11, 126, -32, -60, -137, -156, -161, -53, -47, -153, 57, 102, 24, 193, -194, -32, -37, 58, -139, 201, -51, 91, 33, -133, 145, 16, 24, 10, -149, 61, 59, 181, 134, 51, 4, 139, 51, 14, -53, -42, -88, -84, 63, -12, -183, -249, -61, -67, -60, -24, 211, -17, -53, 60, 130, -66, -319, -91, 75, 12, 64, -203, -75, 37, 225, -284, -62, -20, -138, 13, 320, 8, 331, -51, -212, 52, -21, 100, -149, -60, 58, 84, -137, -66, 68, 144, 93, 88, -155, -8, -181, 40, -289, -158]
3188a58K60n4J20m26K90j48j3K88l05M24k02j19pK1O9k97Q3M7J21o5L40j11l00
3211a42K3K24j36l9K38o4j24j2J45n2j82J9J28o7jq2m5J31j60M97n59J41J37l2
3235a4n0J31J26j86J32k38K0J63j39J5p9J06P4K0k79Q2J07L1j45m5J96j66K16
3258G8l62L32J25l48j6L83O7k93Q1p9j16K8J9J54P6j99rj31K82Lj46J56j28Q5
3282D2p4j11L76j15j39M3p3R9J70l38r9K76k69j57L68j85M18j42k83n9L46r0k08
3305b04K54j19nK00k07j6m9K43N9n5r7k30K00J60j48j00K44l0Q2j81qK8k5P8k74
3330b00J95Q3Q7jj12l08K30o0k3j44J70K78l24K72j10k09K55l3k5j82K03o3k8
3353d9Q9J9K07j81j01j44K73K8L2k3l70L37k28k6L9L06j95l48M32j46k41J93J41
$$ y = [-158, 102, 48, 168, -258, 32, -116, -129, 159, -146, 278, 76, -43, -50, -29, 40, -257, -174, -127, -6, -71, 269, 158, -142, -119, 105, -31, -70, 168, 104, -20, -32, 113, 61, -121, -102, 26, -41, -42, -124, -169, -38, -198, 299, -260, -119, 18, -14, -64, 67, 193, 7, 139, -99, -79, 84, -55, -40, -119, -13, 61, 81, -198, -116, -9, 22, -123, -168, 28, -138, 78, -284, 48, 173, -175, -191, 192, 259, -34, 47, -32, -148, -120, -101, 53, 129, -70, -79, -210, 72, 75, -71, 85, -43, 42, -32, -143, 233, 118, -21, 22, -51, 48, 218, -120, -219, 57, -212, -369, -1, -186, 232, 90, -193, -252, 94, 4, -204, 50, -69, -74, 126, -81, -97, -146, 97, 156, 101, 4, -226, -26, 134, -14, -114, 130, 100, 182, 1, -7, 21, -4, 74, -200, -5, 78, 165, 164, 52, -256, -26, -86, -109, -253, -83, 195, -129, 143, 33, -176, 79, 46, 21, -161, 42, -21, -49, 40, 59, 266, 85, -16, -160, 113, 141, 173, 150, -220, 117, -111, -137, -98, 208, 13, -335, 97, -49, -290, -97, 44]
3376D4o8K04pj99j81J39K3K54k68J99j75j87J56J11j17n6J31m0j95J16J41J78
3398B03j26k76p9L02J83j21K9j3P0Mm8l40o8K35O3J47k59J51j54P7j1j57M04r1
3422A25j6p9O4m1k9J6J97k01J24j59J76k51R7J06l47K12J31j58P7K56l91K37o8
3445G8J07q0o4k9J62N9j46k4j3K63j30n8J21l64j53J91J90j56j68J33J3K75m24
3468b17K93j82K90l98K83p2J43l7j82J75k02J83j31J99k69p1N1r7K76K66l12L51
3490C40j98j54n9L03l5l89J52j79M08j68j69L43j92k67M03k32M75o49K77j41K26
3511I5kj68r6l4L04K1Kk04J12K09l30K37k11j94L43j07j25n5M13l52K01l61K69
3534c3J82n9l59M67l44J55m2j5J38j96J80j04k3l9L7J33k38J4K01l22K60K26l19
$$ y = [44, -24, 180, 173, -26, -207, -68, -45, 209, -59, 140, -35, -222, -66, 45, -72, -128, 3, -37, -232, -116, 25, 203, 77, -199, -278, 24, 207, 86, 115, 102, 172, 176, 128, -212, -280, -45, 18, 165, -94, 57, -97, -20, -31, -188, 216, 125, 109, 30, 94, 53, 24, 40, 237, 36, 160, 1, 177, -74, 23, 129, -218, -6, 125, -33, 44, 300, -91, 146, 78, 185, 105, 41, 12, 174, 233, 87, 63, 50, 313, 183, 125, 246, -118, -271, -80, 110, -46, -214, -81, -68, 207, -217, 76, -106, 184, -214, 69, -3, 140, 103, -79, 96, -106, 77, -54, 145, -124, -195, -144, -241, 35, 301, -11, 340, 142, -12, -71, 232, 197, -192, -40, -219, 189, 21, -148, 195, 3, -264, 139, -93, 382, -267, 10, -131, 95, 93, -75, -171, -205, 99, 120, 122, -82, 30, 239, -91, 146, -65, -259, 84, -23, -148, -203, 210, -142, 59, -302, -33, 149, 90, -269, 198, -146, 9, -33, -48, 90, -106, 74, -30, -53, -92, -55, 78, -160, -146, 55, -267, -7, 219, -100]
3557a00n8R0J73l9P0l43Q7Q7L9o9K28n6l10K21k48L6J82L85j75l73o9L01p8L6
3581A7R0k61K23l38L37j13J13J11m28M51r0k71Q8J32k49L1L44K3k25N7J3J5j51
3604h1M7K9j29J25J02k51K81k90J87j83L40l43J20J07r8j27K13pJ43j10k80L20
3626A15k19L82k22j82J28j13N8K38j34j82lK58k81J00J38r8j2j48K88P8j83k24
3648b18M66j17j73QK18O4j64P8p9Kr4n6L57k43L91n92O6jK4j14M24k11j39j79
3672b82L76O7j38J59k65J79J13m08J05K72j19o6j41J52k6K27j46Jj91Rq7L72k58
3695i5J91J8o3o3J25j72m1j64M91q8j05R7m04J48K66j07r0q4L27j6j85J66k44
3718i2j36M0L93j81j15k7kL33j99k1O8j72J88J1k91K76j08LM6J3p3O4K04k94J40
$$ y = [-100, -158, -68, 105, 66, 136, -207, -120, -33, 6, -63, 165, 109, -201, 20, -228, -192, -10, 375, 200, -173, -242, 59, -19, 17, 107, -154, 69, -269, 68, -45, 68, 179, -249, 202, 112, -159, -71, 61, -188, -157, 187, 210, -15, 42, 55, 70, -81, -34, -5, -134, -9, 93, -158, 123, -167, 20, -163, 177, -166, -46, 61, -37, -164, 49, 42, 185, 75, -205, 115, -104, 278, 56, -126, 2, -111, -53, 185, 51, -131, -134, 124, -157, -57, 81, -17, -29, -177, 111, 189, 6, -218, 248, 131, -42, -34, 184, 248, 84, 162, 83, 85, -9, -65, 292, 49, 440, -152, -86, -87, -63, -177, 247, 36, -103, -282, 94, 161, 23, 182, -83, 96, 209, -199, -94, 178, 59, -7, -148, 4, -22, 205, 59, 60, -131, -122, -209, 163, -95, 96, 114, 51, -12, 113, -59, -100, -264, 227, 139, 34, 131, -273, -125, 141, 34, -56, -140, 187, 171, -14, 152, -92, -228, -188, 205, 24, -91, -118, -120, 213, 14, -7, 61, -111, 77, 88, -203, 73, -35, -32, 14, 27, -46, 18, 222, -72, 68]
3743F8J0r1N6Jrj32K1K73R3l30j4O8M8k35J64p0N0L89m53R6nj56J09J93l6k0k02
3770a14j72M01j17j04J48J02k53Q6O5j7q4L9l2k53M34k04J29L7k45L7K7r0J18
3793f2M3J94l80K36K48n04J13K38j42k4j26K09J95j21l21K70J87P7j49K1m10K26
3815A8j2j36J74l0J51l60K49R3l7k79J50M2N1J15k09P8l4j64K88l7k92N0K35q8
3839A6o5o3J80o5j9no3J11J34l42J31R5j56R7O9j95Q6J04R1l9j00l2M9J57k57
3864h1j4n1K5q1L9j41K36l2m6R8n0L0J17k30J6L56j1n3N8j89N5n8J48j57kK63
3890B45k57K7m7K28k69l0J04k63K96o7J41j87P2o1K38J6k89L49o2j1j28K1J11
3913A77j64j33J31J88l54o5K34J61m25L48j15J76j86L09l70O8P3n0J09k31J7K14
$$ y = [68, 78, -13, 43, 44, 35, -97, -76, 197, 290, -40, -54, 14, 62, -173, -9, -79, -29, 360, -93, 3, -2, -158, -49, 144, 108, 88, -114, -286, 115, -2, -106, 42, 144, -109, -23, 42, 25, -59, -20, -52, -305, 129, -75, 54, 91, -154, -117, -90, -180, -62, -19, 175, -205, 31, 279, -225, -112, 126, -16, -40, -166, 43, 238, 117, -204, 66, 253, 330, 181, 202, -208, 18, 6, -130, 44, 14, 165, -195, 54, 147, 110, -169, -19, 23, 74, 189, -20, 58, 24, -140, 148, 111, -181, -131, 104, 16, -49, -112, 68, 3, -16, -21, -84, 27, 161, -181, -50, 45, -111, -14, 55, -140, -54, 50, 141, 102, 2, -30, 19, 176, -81, -95, -146, -121, -202, -163, -304, -68, -100, -146, -48, -98, -68, 49, -181, -165, 191, 180, 127, 185, -4, 51, -7, 141, -16, -18, 245, -12, 15, -32, 196, -73, -103, 1, -262, 34, -33, 108, -79, -7, -68, 170, 186, -103, 246, 184, 173, 45, 66, 177, 13, -120, 11, 199, -155, -220, 14, 175, -250, 98, -17, 159, -27, 282, -88, -20, 53, 3, 112, -119, -102, 112]
3935A12m12K90J16k01P2J27j04m4l0K10L5j69j50N9MJ73q3q6Q9j10M3JJ1j30m6
3960b23M4L08p9j64J51o1m4J12q9K17k15j33K90j85K52N9j14j00j52R0JR9J65
3983B29r4j30o3M5N4j92J35m0M1j54J71J89l91J92K97l00j7L0R2j83K85j46P3
4006A23j74K37l01J35J37r2k24K4J13J10Lo2j54J25O0n7p1K10j94J55j83Rj85
4029b56K03P9K69k80k17J08J69q9l3j51M16j12k71K55j59J1J18n7L4M8l18L46
4051A13k74L7r3L86Nk9l44K71j45Rr8K29k45K98j42J60j45p2J3P2o3J03j16J22
4075E2j36K12K1k54j72J08J19K2m5J19j44p4qM24j25k22J87j01o5L9J87q3q7k58
4099b84L84k05J43j23p0J53o2K95o09M08l37L88r8j26J33Q7J49o8m8j12n4K35
$$ y = [112, -300, -10, 106, -95, -23, 104, 0, -44, -74, 136, 171, 2, -148, -89, -85, 88, 5, -81, 8, -102, -59, -58, -47, -177, -223, -179, 129, 50, -114, 37, -24, -68, 44, -45, 172, -43, -176, 114, -71, 181, 240, 126, 26, -126, -36, -35, 64, 229, 135, 5, -58, -13, 41, -151, -16, -56, -15, -169, 2, 191, -200, -8, 289, -11, -28, 2, 94, -89, 196, 50, 123, -51, 186, -115, 20, 157, 65, -159, -135, -22, 88, 91, 29, -125, 0, 60, 3, -68, 142, -52, 103, -80, -71, -256, -53, 26, 295, 15, -202, -94, 75, -14, -47, -198, 218, 106, -165, 90, -69, -58, 60, 3, 37, 85, -233, 113, -161, -124, -217, 169, 174, 145, -199, 72, -73, -64, -162, 67, -178, 120, -22, 138, -7, -79, -66, 6, -57, 46, -70, 52, -84, 128, 149, -105, -277, -169, -50, -28, -73, 46, -98, -172, -180, 244, 119, -103, 84, -17, -82, -43, 144, 61, -26, -284, 100, -105, 38, -85, -155, -2, -64, 231, -378, 30, -307, 81, -17, -143, -10, 77, 226, 158, 110, -2, -56, 179]
4121A79l2oj54J75k53J67j3q2M3r5j71N3L60j16P2k60M04l24J3L4lr6P5O7l6n8
4147e7J67J6k45J98l1o5K1j42J82k04J02K23L7k63q0R8o4P2k4K97k55j19J31j89
4171a94J73J06L7k34k7K18J6l44L69k10P0R4k28K09k6j65P4J16j44r3n7M51j55
4194E6j37J21k57L71j10R6r3J24m00K44j37q2K44J25q3k72M39l65J89j54l9l1
4216a51K33m5j55J23k4J25k05m9J15N6J68k75J12K8k1p7K82k21K64m09M3K6P8
4239B1j87M18j80j21j02K64j31p6Pm1K12k33J63j81K16P1m8j88L0J29J10j00p5
4262b2m7q8Q5K26k99K58k08K40j05J29l23L29m15K43J04k03QK81l22K02M0l00
4284a87J27O9K10k52QL00p3k35J99r2k01J87J86o5r4m0k4K37k55O6j51K69o5k32
$$ y = [179, 147, 141, -13, 162, -91, 76, 63, -19, 24, -71, -242, -189, 171, 55, 127, -133, 271, -53, -40, -6, -9, -105, -30, 37, 1, -57, 110, 126, -119, 79, 48, -17, 4, -138, 44, -160, -58, 165, 202, -61, -141, -43, -107, -35, -59, 238, -17, -136, -5, -194, -21, 85, 122, -112, -139, 79, 95, -249, 120, -90, -20, 74, -154, 55, 29, -136, -62, 54, -90, -183, -240, 211, 56, -81, 40, -217, 154, 44, 140, 47, 171, -229, 15, -122, -204, 40, 165, 82, -190, 249, -116, 73, -81, -120, -151, 82, 37, -118, 5, -19, 106, -99, -148, -33, 23, 191, -84, 28, 56, 35, -42, 240, 19, 283, -126, -83, -57, 21, -166, 252, 72, -49, -151, 113, -18, -94, -87, -128, 84, -149, 14, -167, 49, 120, 72, -116, -86, 43, 153, 53, -22, -69, -157, -72, 154, -145, 113, -95, 145, 40, 169, -154, 175, -240, 3, 107, -96, -88, 193, -129, 73, 113, -187, -60, 9, 219, -33, -25, 275, 202, -33, 166, 74, -127, 60, 246, 181, 87, 47, 23, 260, 5, 71, -80, 189, 124, -108]
4308a08j8K38j77m7K03j0L7j40q4P9J09o8J88k43J15k36J4J87j75K32j48K4K67
4331B39k39%j31m7J25J7k0O2J98m07J09J68k39K01j13O1K04k23j93K47mP5o8j0
4355A2k62L13O3o4J15k1q9K55m41r6L75l16J92j63N5O4o6O7j42K06k91K55R0j30
4379a9m0J83j45K49l33J67K28k68Q6Kq6Lp5J78j20J32o1r3r2m0O9p4j05L90k40
4404a04j21M69q9k17J44j9k54K41M3k35M3K83l60J57L1M4K5Q0j69r3p1o4K12n8
4428h2Qk10L39N9r5J78k71J95J15m57K3K20j25J96j85J1M4k6n2J77j76K67k12
4451e9Q3k0O7R4k93K0J26J72n07K18K66k56K84k18L51l07l6O0m5J58N3j09k5p6
4475Aj10K01n5J58k92K1K36l35q1J72K64k18j47L10M6J12j50j97J98j29j3j01
$$ y = [-108, -126, 112, -65, -112, 91, 81, 118, -22, -106, -27, 82, 14, 202, -41, 74, -162, -148, 39, -136, 96, -52, -28, 239, 0, 0, -131, -178, -53, -36, -56, 6, 204, -203, -94, 74, -165, 36, -77, -16, 188, -35, -228, 19, 15, 90, 22, 12, -250, 63, 126, 62, 177, 156, 67, 322, -119, -215, 160, -156, 36, -127, -72, -8, -74, -7, -149, 57, -234, 21, 111, -19, -59, 124, -21, 228, -105, 62, 290, 22, 108, 110, 24, 27, -48, 130, 10, 142, 81, -12, -104, -144, -75, -149, -254, 136, -104, -225, 244, 155, -62, 82, 63, -191, 50, 93, -142, -99, 184, -176, -19, 12, 56, 81, 161, -8, -101, -172, -236, -24, -82, -74, -284, 55, 114, 19, 197, -74, 121, 236, -221, -198, 22, -103, 93, -92, -81, -37, -63, -115, 62, -114, 153, -59, 24, 4, 71, 165, -128, -108, 18, 190, -317, -99, 167, -89, 195, -23, 328, 21, -15, 45, 0, 158, 211, 102, 77, 1, -109, 92, 37, 195, -97, -76, 160, -175, -256, -84, 180, -38, -185, 125, 171, 283, 133, -64, 134, 5, -8, -109]
4497a09J37P7j08J6J62J76n82J14j2OJ58o1j5L75n3j01J11k06j76J60m3j91K91
4520A26k47J46P3l85O55k84l4j24j55K80J3K89k77J46n03K46R2k56Q5M34j72l39
4542a91K55p3J07k46K36j17J6k4J31l1r3K5k26J85J20j38O7K8j39n6K17j3j04
4565f4n7O7L8K35j60k52J92j24K40P3q7k4mj16J14j72K2J5m2J63J40j42j64J74
4589F5j74Q9Q2q8L29n16K39J99m35L25nk72o4J40OJ50k38L40k47O5J22j35L4J29
4613A40k13P5k24L07L5k62L68l63j44R5K85N4p6j78J2J29o8L14k0k11r9P3o7K20
4637A82j64L21m32K13m6Ro9l8O4J70l74P8J04q3M1K85m95K40j30M5j33M55k37
4660FR0j32J31R9l10L48m11J22J64J63l98L3j05J0J67n9K6K0Q9j58L4J44O3l05
$$ y = [-109, 28, 105, -3, 13, 175, 351, -231, -117, -129, -123, 35, -26, -41, 334, 281, 180, 291, 85, -91, 69, 26, -165, 126, -121, 25, 98, -287, 368, 84, 50, -74, -229, 51, 64, 353, 76, 222, -281, -35, 57, -199, -114, 320, 148, -191, 64, -9, 98, -148, 88, -29, -13, -37, 94, 63, -30, -5, -231, -46, 74, -64, 3, 31, -108, -164, 53, 40, -64, -121, -54, -16, 219, 59, -193, -1, -125, 115, 188, 101, 77, 73, -43, 71, -101, -79, -64, -106, 57, 197, 55, -109, 65, -109, -20, 62, -26, 303, -213, 26, 225, -210, 115, 110, -162, -226, -86, -80, 70, -168, 172, -75, -10, 112, -23, 11, 140, -73, 2, -222, 85, 120, -142, 226, -137, -281, -186, 99, 153, 77, -101, -89, 40, -28, 286, 266, 55, -44, 29, -38, 182, 18, 339, -93, 120, 74, 83, 14, -24, 40, 210, -164, -86, 18, -65, -24, 261, -234, 6, -124, -79, -212, 243, 6, 96, -36, 95, 194, -116, 232, -179, -57, 107, 270, -128, -95, -200, -190, -23, -82, -56, -36, 53, -105, -71, 73, 136, -169]
4684a69J65jJ36k14p2L8M6K06m31L42J0L4M4j34j0j70K93j14k74J47K9L5M7J43
4708A26k02p9J1J87J81l55K21j42J95j17j35L6J34Q0k20p1O7J54n6L6j34J24j59
4731a18p1J99j79K83k49K33NP7r6j85J81n31L03K85Q3l19J73k3O1k22J83j11L1
4754gJ64R9k36K1p6K01m0l36L75o9L8j18L10m40M03l94J49l01K18j01Q6J91k87
4777a50J38Nr7K30j96m8K47P8r4l6j34r6J31k4J65J83m77J62K29j00j14o9M3P1
4801D7k62J18k16L96l95L69l63L25j36J60k21O7L22j60p3K30k18J5l42L63P4o3
4823C7k17J62j60K08R7j54j6J07l9J7k70L97q3j50Q1J36r7l06K56N9L0j27Q4m6
4847FJ33j66K9R3k63J14j23L05j58j00N6J23K04l97j67M38n4p7Q9J2J3j85o1Q3
$$ y = [-169, -4, -5, 131, -83, -155, -117, -71, 135, -296, 46, 56, 90, 134, 0, -10, -180, 113, -1, -275, -128, -99, -64, -17, 126, -76, -155, -144, 43, 224, -131, 90, -52, 143, 26, -109, -73, 61, 141, -79, -150, -83, 71, 15, 51, -83, 41, -118, -189, 10, -169, 114, -135, 98, 103, 180, 84, -101, 80, -451, -148, 137, 220, -99, 74, 51, 112, -110, 73, -38, -7, 157, 256, 20, 41, -35, 166, 126, -210, 165, 96, 134, 16, 326, -114, 289, -105, 44, -257, -39, -140, -54, 137, -150, -12, -7, -104, 126, -70, -118, 129, 207, 113, 77, -57, -153, -22, -46, 119, 302, -175, -13, 216, 116, 2, -67, -24, 47, -215, -97, -313, 83, -312, 57, -306, 19, -117, 43, -178, -111, 211, 51, -22, 208, -10, 5, -337, 26, 100, 37, -180, -18, -178, 30, 127, -27, -43, 64, 25, 42, -228, 169, 86, -64, 17, 153, 56, -250, 6, 65, 95, -32, 52, 6, 139, -27, 2, 95, -168, -54, -177, 128, -30, -130, -74, 49, 253, -144, -311, 127, 73, -4, 85, 97, 110, -75, -136, -53]
4871e3J48r5J74k95L40m0m34L58p6N8k79J34j86J17m8O9L01p0k4p4O1j21J46j8
4895I3J09m01J9J81Q8Mj01j99R1L05k97L37l01k3J53J01P1j12K3j74o1J73k03
4918a24J27KK3lo5Mj40L32k06o1K04r2J93j39j87K75k57m9K12Q9j38R9j81K57
4942A75k35k52K46J82j0j66j45K09j41J00J25j8j9O4l50M8K1j48R2M20k62J97
4964A33j08j82K48k22L14j71r7J84p8L08l39oJ11m6K36l3l89K79nJ1k38q1K44
4987G3k02o6M19l40M4j37L61j80P9J79k61J20r0N8Q9J68k55j06q4K72J2%k09L81
5011C25m26K56j2j12j7J03n0L33l88J25k1l67K63r0J71j72J11J40p9p4L0j7K25
5034B57k11K68l67P5j22m7K87j95K79l85P6Q8K07k10j69j1NOJ26L43l41j6K16
$$ y = [-53, 95, 0, 174, -121, 219, 179, -255, 103, 27, 85, -194, -60, -246, -129, -177, -108, 193, 123, 99, 25, 86, -35, 111, 93, 202, -199, -180, 1, 89, 93, -8, -207, -116, 189, -108, 229, -72, -95, 58, 159, 230, 118, 141, -33, -94, 79, -124, 3, 5, 28, 25, -40, -36, -176, 156, -50, -111, 93, 1, 194, 55, -132, 143, -114, -163, 49, 138, 0, 99, -82, 175, -60, -312, -66, 116, 106, -60, -205, 4, -137, -37, 88, 70, 51, 115, -235, -187, -166, -314, -222, 198, -64, 133, 25, -157, 91, -131, 183, 12, -85, 99, 21, 329, -10, -16, 95, 49, 285, 252, -137, 142, 137, 148, -90, -171, 73, -129, -195, 224, -116, -72, -209, 152, -28, 51, 230, -31, 89, -1, 57, 146, 314, 59, -47, -131, 141, 153, 153, -56, 325, -101, 155, 143, 31, 14, 117, 67, 400, 12, 137, 116, -251, 12, -78, 93, -79, 32, 172, 93, 19, 49, 32, 257, 46, 314, -53, 22, -100, -147, 140, -55, 224, -161, -85, 3, 210, 0, -169, -180, -175, -169, -43, 300, -41, -57, 159]
5057A59k14J47K2j01J63q4J66n65K73k0J48k06K24j15j14J1k9o5K45Rk3j89K77
5080A19k15R4m8k14K62J0p7qJ52l20K21J02j54Q2J31k95J91J31O3k65j89K09L0
5103A2o2P1nj11L3J14K21j89j66r5K03J13l6J23j96o6L78o03L30q7O6P7L1j61
5127eP0K02l00J76k97L67j55j06j00O3j1N3O4R5mJ6q6rk18R3J09j18R2J06O1m8
5153A10L6l2j2J0l63L12L7k58L35k19k7M47k91m0r0K01k23k31J80J68p0N3j1K46
5177B68n01J70Oj00J57J01n1J02o3Q5l29K68j93J97M8k01J08j89J48j38J9K55
5199A67j3J46k68jJ50j34R7k40J22j81J81k3j67J63l2L0J74j66o3N5j08J3J00
5222Bo3M7J91l8J51k86j49J99p4N7k11L36j27r0K59l92O7K34O7j07L5k61O9N00
$$ y = [159, -55, 92, 114, 13, 176, 92, 258, -307, -34, -54, 94, -112, 112, -3, -117, -106, -135, -200, 45, 54, 31, -158, 119, -96, -2, -50, -264, -2, 8, -69, -77, 75, -245, -24, 78, -76, 6, 137, -158, 33, 164, 227, -38, -227, -18, 12, -50, 21, 16, -95, -62, 52, 273, 84, -82, -177, 26, 139, 103, 226, 30, -36, 342, -261, 69, -18, 48, 125, 156, -5, 65, 267, -33, 143, -154, 213, 58, -48, -148, -85, -96, -43, 21, 116, 112, 128, 42, 33, -185, -92, 17, -101, -9, 97, 158, 110, 146, 114, 102, 112, -251, 61, 98, -160, 175, -44, -71, 376, 85, 45, -45, 156, -67, -298, -118, 50, -20, 33, 22, 268, -233, -63, -57, -157, 0, 101, 50, 152, 89, 174, -155, 113, -80, 117, 165, -36, 72, -117, 31, -107, -88, 167, 154, 300, 32, 31, 181, 47, 144, -96, 26, -155, 26, 3, -164, -1, -33, -3, 171, 5, -58, -3, -111, -98, 2, -61, -14, 177, 139, 290, 4, -145, 54, -20, 37, -174, 162, 35, -55, 204, -188, -121, 113, 180, 73, 108, -153, -84, 416]
5246D16o34J49j24J13n9N5K89l76J72J31j99O9k7nj82M67l17k19L53j87J78J77
5268B40m03K06k3P3q8k27J98P8p1L6k71J99J45k49m0L36jj23j28M2j28K98j24
5291b5k5J5P1M0k32J99R0l31J64o6P6l35L80m09J71L08q1L2j04J90P9om74K64
5315il4j13m5R4K41K97o45J53Q5j73L17k82n4L95l50K19j30j36M6J08n2Q6L3q9
5339c8J63k54K15J02l60K27m3J79k42j36J87K45k21L59j34n2k12R4j56K3J80j22
5361DR4k94NK46J55J5m8j76q1rJ98j58j37J72j4pK21j21M3k81J58K64j76m36N39
5386A76j53K46j44j41K07l70J24k06K98K25k88j29M5J15j88R2K2J36J49j80j33
5407i7J7K53m70K90j01J79k55OJ50K2J7K13k03j00n4K7L50l28O5N8l7K75l25M7
$$ y = [416, -218, -69, -193, -80, -139, -84, 205, -171, 1, 132, -67, 2, -25, -30, -212, 255, -62, -281, 72, -115, 63, 240, -163, 43, 20, 93, 5, -222, -24, 54, -17, 19, -252, -53, 92, -157, -197, 139, 138, 15, -113, -71, -199, 99, -25, -50, -35, 36, 76, -156, 43, 133, -198, -34, -100, -24, -359, 21, -388, -217, 91, 10, 42, -62, 128, 207, 201, -273, -9, -43, -156, -201, -107, 134, 431, -214, -61, 24, -149, 168, -114, -168, 227, -123, 96, -34, -170, -124, -16, -68, 18, 51, -38, 125, -129, 86, 188, -172, 55, 12, 191, -51, -187, 0, 245, 24, 383, 249, 197, -15, 79, -77, -54, 126, 4, 98, -196, -191, 55, 210, 225, 177, 1, -80, -89, 109, -49, -186, -14, -28, -35, 186, 65, 108, -173, -15, 249, 73, -363, 176, 23, 269, 125, -16, 191, -179, -55, -261, 37, 262, -26, -155, -110, 5, -183, -91, -69, 67, 216, 36, -97, -80, 173, -297, -7, -108, 71, -184, -178, -28, -6, 11, 224, 21, -79, -133, -106, 244, -84, -19, 39, 2, 277, -48, -1]
5431aK66k80m6J39j06M0K47l45Lm9n9J97rJ48j03jj6nj78M09Q0m74L05j02m3L4
5457E1j43K12p2n4M5J27l98M14k75J62j15J65j57J73j19K03k74Q7l3Q4j96J60
5479D7K4j17OJ8nk36K70J78k20k9K71k31q3K4K57k51J26M0l8j49q2J98KJ55o5
5504A10M6j02K37l39J0Rj36K02O5N2l81L24j79J66k27L04r2pN7J74j68k23j59
5527b57K26K30k7q9j24K19k40L0j17K65r1j06K64m0j48k33R3O0K79k81O2NJ64
5550A44j94k8O8J71j37j80J67J64k06P5m7k2K46k09o9L37j77j04J55k59JJ44N0
5573I0m1R1j87L6N5j61J28Lr6J07j09K9J81r8j53J03J72r6N0n8J40k94R5k9r7
5598a39R1J33J08k32M01m73j7J37k96N31k64L04l33M6j15K11P4l38N42m39J57
$$ y = [-1, 265, -15, -61, 78, -28, 12, 259, -86, -83, -132, -191, 6, -3, 145, 42, 41, 25, 20, -158, 251, 331, -143, 162, 60, 17, 51, -92, 120, 48, -6, 39, 166, -232, 182, -93, 69, -46, 119, -38, 135, 16, 219, -55, 32, -1, 83, -113, 47, 71, -46, -40, -22, -27, -263, 7, 185, -35, -64, 207, -24, -107, -83, 174, -77, 49, 89, 51, -98, -180, 18, 20, 175, 110, 156, 54, 291, -48, -38, -29, -165, 37, 102, 154, -227, 97, -82, 84, -143, 161, 69, 62, 119, 293, 125, -98, -257, -31, 199, 172, 83, -41, 178, -62, -32, -149, 116, 25, -81, 183, 143, -5, -238, -145, -85, 194, -87, -25, -20, 144, -50, -78, -10, 161, 24, -156, 11, 175, -31, 44, -3, -25, 221, 12, -57, 280, 103, -1, 154, -105, -104, 40, 90, 49, 140, -47, -11, 44, -117, 11, 14, -82, 25, -84, -55, 126, 28, -125, -22, 150, 54, 104, 46, 186, -108, -13, -42, -139, -48, 85, 193, -39, 362, -111, -128, 9, -287, 244, -20, 284, -49, -3, -118, 93, 167, -171, 371, -68, 89]
5619H9j55O6qj64J89nJ72j31Nj05o3J43O1j42J27Jn0J33m13J84k8J15O5J24k07
5644CJ86m84K03J50j25K41j97J1J31Jj93R6k0pj20K05n7J06k37K54r6j49n7J87
5668C2R0k31J19kK9k30P1K09j86J02P7K5J2p0NN2K64m81J59j19K23k89J42j1p6
5693h4J16l83L47j5l5O2K30o6K0j10m3%K0j3K55m83KR4J04k23J35J48o5J61k87
5718a13J48N4Q5P2n28K24P4J05k46K2J14k7q8o3K60Q9k86R8K19m30L70j54J5M0
5742E4K41j29j82j02L99k91Rj80J69l5j56K96l52QO5J45J14l35K37L37j46j17
5764D9r4j17J31k25L75n0j56R1k31P6J16R5o9n4n2L73j54l27J55m5L9j69L38P5
5788A70j13J07j22j23J73j6j83J11J23K1l15N8LK47m0j9J23k01M1j14NJ83k43
$$ y = [89, -66, 0, -8, -172, 17, 12, 184, 53, 58, -47, -110, 33, 94, -48, 79, 80, 30, 163, -250, -66, -94, 21, 86, 210, 3, 189, -295, -92, 58, -67, 174, -23, -12, 119, 120, -73, 23, 3, -4, -124, 81, 24, 130, -107, 147, 51, -98, -155, 32, 122, -109, 10, 8, 37, -193, -122, 87, -99, 3, 80, 105, 117, 47, 52, 104, 368, -113, 46, -73, 150, -139, 3, -8, -84, 32, -351, -4, -19, -54, 8, 238, 172, 192, 82, 39, 39, 59, 46, 301, -182, -180, -86, 18, -205, -70, 78, 13, 174, -113, 35, 89, 174, 246, -282, -58, 16, 121, -125, -103, 11, -16, -104, -167, 93, 182, -104, -6, 213, -217, 153, -1, 14, 54, 295, 166, -16, -118, 281, -10, -1, -181, -12, -47, -203, 93, -259, -251, -186, -41, 73, -262, -25, 312, 166, 49, -45, -162, -31, -256, 119, 69, -87, 4, -227, -151, -35, 60, -9, -63, -115, 258, 104, -223, -68, -113, -74, -243, 95, 170, 57, 164, 42, -81, 92, 76, -107, 4, 127, 148, -167, -109, -106, 141, 101, 82, 205, 4, 45, -69, -64, 119, -124]
5811a24Q3J77j15p1j9N9l48M05j61P8J60o5J27l95R2q7L82l15J84j25l8p3J53
5834c6k17M06k66KK11k2j05K8j64p3K75RMr5L45o24J31K51j74K34J47j61n5n9
5858hJ82k58K41j42L7n7J24j24j76L14j82R8j44j12K95k93P9j56O6N22m03J21
5880B4J12kJ86k80pj6r9M3lJ05M6j42j04J41Q2j09J5K22j58Oj90J26J06k60J48
5905hj59L07j71K6O2K2k6l5J4l2J40n8jj03j01L14r0j69k2k42L88J19q5j13k0
5930d3K3K38m6j66j26K01K4Q2k2j36k92J70O1J37k89K96M7l91K31pp4K26k53K02
5954I3ok51J98Mn1k28K30O5j06J56nM0j51Nj23K18P7m44Q9K25j99J09J64l04M42
5979B47j80R1l45K38N7m0k54J7K1K8L23k14P1j68k00L64j54MrJ63o3k26M22k94
$$ y = [-124, -41, 136, 21, -50, -69, -10, -358, 47, -114, -36, 124, 59, 186, -209, -117, -204, 178, -137, 47, -78, -116, -189, -36, -253, 153, -113, -111, 100, 78, -27, 1, -163, -236, 39, 48, 52, -43, 302, -322, -191, 60, -114, 120, 267, 106, 51, -8, 174, -84, 157, 15, 52, -5, 119, -5, -181, 133, -49, 49, -95, -207, 88, -205, -126, -282, -216, 306, -97, 24, 136, 134, 320, 40, 33, 17, -82, -39, -42, 63, 109, -33, -137, 4, 86, -23, -8, 214, 56, 62, -128, -2, 104, -156, -8, -167, 140, -31, -5, 57, 79, 53, 18, 32, 0, 140, 82, 81, -22, -123, 191, 101, -68, -90, -332, 56, 175, 90, -23, -43, -20, 218, 172, 6, -120, 81, 105, 187, 165, 29, -263, -93, -32, 105, -184, 112, 159, -232, -1, -8, -82, 144, -109, 93, 87, -164, 34, 38, -13, -241, -11, 54, -52, 104, 99, 139, -12, -7, -130, 88, 165, -279, -190, 35, -164, -55, 109, -195, 247, 67, 158, -187, 51, 108, 68, -186, -169, -148, -120, 203, -11, 60, -108, -308, 56, -98, -94, -103, 60, -3, -229, 193, -101]
6003a01J00J74k01K7J93j44o8L92k72p7pOK91l30%j46N3P8L3j69K38J54j70N8
6027A12J18j13l2pj83K67R1j2k01M6K65l71J30j26k67L31J29m0L4o6k27K74k23
6050g1k52K34J85pn7j23J49kJ13rk00n5k19O00j58q6j27L2%%L21l73P7Mk11L18
6076H3j49N4q3J16O8j00K5J21pl67J56K31j64j21L03k94L41M6m79K58j68K01k74
6099b03L07k48K18j63K73j70n3R0l04K29j8J88j35J38o4p9J14k34J8K41j38j66
6121a59r0K35J00l7M1j28j13j1j0K81jj81j8N0k54M26M6k71j4k4K54q2K03j01
6145A42m28N58j71j43J97j44J5k8r0R1J1k58J77n7PJ27J54k64R5J33j35O9R3l93
6169b42L07j16N8J41j57k12J35K48Pj97j67j11L03J15J15%j73k9p9j42K37K70
$$ y = [-101, -1, 173, -28, -1, 192, 48, -20, 372, 100, 23, 16, 22, 313, -17, -17, -163, -110, -32, 1, -168, 70, 224, 54, 112, 230, 117, 85, 78, -105, 162, 253, 241, 40, 86, 351, -20, 110, -16, -283, 48, 177, 137, 171, 105, -122, 152, -71, -323, -89, 96, 89, 32, -91, 58, 56, 169, 160, -40, -95, -314, 286, 128, 42, -85, -53, -53, -53, 268, -105, -28, -24, -235, 83, -66, -12, -95, 21, 89, -11, 14, 135, 128, -239, -83, 148, -16, -137, 166, -128, 213, 259, -220, 38, -130, 71, -203, 104, -144, 74, -89, 184, 14, -39, 51, -253, -24, -42, 146, 11, 149, 85, 6, 120, -114, -96, 145, 7, -159, -249, -14, 86, 49, 90, -38, -151, -162, -172, 109, 108, -73, -91, -41, -295, 131, 177, -94, -108, -132, 122, 40, 243, 142, -286, 272, 101, -42, 155, 11, 26, -2, -92, -1, 10, -248, -71, -128, -121, 6, 160, -104, -9, 124, -11, 58, 151, -242, 65, -51, 7, 148, -9, -221, -86, 162, 169, -28, -195, -306, -3, 112, 227, 227, 54, 25, -54, -196, 41, 311]
6191C11m44J57k8k06J39LO2Kr3J04m6J46N8l0q9K1l05K95q1J38j79J31l49l8K54
6216f7j76M07k03N2K32l00K48p7l4j8J55k51r6j09J50J97j31q4J90k09J87K2K3
6239A08j09O3j41O7p4K46rk09J03k45K34O0j58K96j71k20J50j15J32P1Q1k32p4
6262a46J88M6J45l87L42p7j71O3j58J67j7j8j64L57l19K63k81L81j16O4j55qn
6285fM8r5J71k36L49j02J20M0k28K9j52J34j12j0%K26j78K9J52l56L23l1j95P9
6309aj87J44j9R5J24k14k4k02K91N7k52K54O0k98J93L2l35N39m39L06k71K32m04
6332c19M06L4j3k1j14k7K23o09O27j78Q8j27Q8j80K04m1J70k18p9J12J4K7J15
6355A82k22k26K25R0J39j72r6L7J63l82K02Lk3j03P7o6K60n3j15J85Kj61Q3J6
$$ y = [311, -133, 24, -4, -210, -71, -68, -6, -4, -97, 7, -39, 107, 165, 135, 46, 67, -238, 57, -24, 114, -65, 66, -283, -321, -67, -243, 164, -39, 13, 245, -55, 193, 116, 82, 64, 219, -32, -128, -237, -87, 110, -21, -105, 85, -124, 63, 85, 108, -1, 62, -79, -12, -86, 160, 151, -58, 45, -200, 34, 94, -64, 232, 61, -159, -9, -124, 8, 79, 160, -72, -146, 42, 88, 233, -154, 188, 111, -60, 3, -155, 12, -5, -23, -187, 170, -149, 114, -167, 214, 98, 162, 7, -1, -6, 42, -53, 118, -118, 231, 129, 249, 289, 61, 90, -62, 72, -40, -50, -50, 176, -2, 27, 179, -177, 146, 115, -80, -1, -188, -44, -63, 32, 156, -58, -82, -284, 7, 64, -188, 66, 126, -172, 21, 53, -282, 257, -182, 124, -147, 85, -319, 87, 121, 108, 87, -27, -54, 169, -440, 187, 9, 97, -30, 58, -122, 82, 41, 211, -7, -86, 26, 40, 67, 182, -40, -266, -41, 49, 188, 16, -80, -43, 120, -262, -60, -57, -80, -183, -106, -172, 88, 35, -80, 105, 107, -54, 29, 45]
6379D5qk95L43j56j03P4J27k21J55O9p7K12k1j73j1n7N8J08j89O0J36l22K20J62
6403A36k59J17j00J95k51J54j75J72J5j53J49j45l6K44L9j88j05k2L76k01K04
6424A66l99k6L80r8r1k29M47l50L47p4j02Q5k20L02q8j25N4r2J61J9q4j61J75
6447cJ18k01K11j9O8l10J93m6L8K5r4K82l35K96k92N2K07l70K79j0j95M4P2k28
6471b18K80k22J66j20J24J42O0k12J40j08J58l64K82j71j25M20l31m7K18j55J75
6492I2j87J77mj13j87Q6K9O3Q5j58K58k07j4Q5J3j86K88j40K2J39j20N1k02J2
6516a18K65k91K74J1j87J55K7Q0l94P1J82Q7qr5m79K86M8O8n9J55J92k24j49J54
6540E1l09L13K8Ml8j47L10q8j92K90k27L8o7J64n9%j19k07J74r2K44K2Q2l05J2
$$ y = [45, 37, -258, 85, -71, -174, -100, 27, -194, -39, 30, -47, 165, 144, -29, -40, -97, -39, 69, -120, -60, 76, -246, -26, 136, -123, -6, -106, 89, -162, -8, -183, -11, 4, -149, 0, -145, -181, 63, 102, -86, -191, -213, 163, -38, 166, -233, -259, 121, 23, -68, -297, 150, -200, 147, 73, -29, 56, -164, 138, 50, -75, -21, -113, 48, 67, -17, -178, -3, 115, -86, 125, 106, 174, -136, 57, 11, 49, 74, -20, 262, -73, 223, -69, -17, 190, -180, 99, 89, -106, -62, 10, -218, 62, -160, 6, -114, 10, 152, 212, 0, 140, 32, 190, -174, 108, -63, -188, 232, -99, -146, 72, -83, 92, -95, 82, 78, -35, -222, -136, -107, -44, 41, -117, 141, -66, -80, 5, 18, -168, 120, -20, 2, 141, 21, 72, -130, -118, 147, -144, 130, 141, -46, 109, 136, 216, -178, -107, 75, 162, 154, 59, -420, -134, -86, -18, -77, 78, 270, 46, -103, 51, -258, 55, 83, 87, 49, -98, 212, 124, -68, 222, -5, 33, -34, 130, 71, 71, -48, -255, -81, -173, 71, 93, 175, -130, -118]
6565a18L6L3J2J09k56J60N0k92L63R6j77j60Q7J85j58J94j66P4k55L10J32p7n7
6588A25Q5k92J81M5k88J61j72l0R1M33m78J58j78P5J55m0p0K4j03J86j75L00j68
6611B5J36k45R1J95k61RK9Q0R1k09p0j23J92L2J01n8j06L87m31L26j24j17J8K69
6635B37q5j09m9N7k29M47j52j33j01j7O9K7j50J82j69N1J21lj85K49O0j21j22
6658a25J63P2k59L82k63K42L3m23J58J42K7j91L7R5J6k26J83j46J1j66K90Ll9
6681A6kJ78n5m1m7l22K56M8k8n6K26j04q1J78l30K71n8J50j19j13j71J24N9m6
6705f7lN4p8K3K17k6k24J66o8k30M24k40J33j6Lk53J88r9L19l08m1J67n2K02j91
6730@M0J1j16L61j31j70J26j1k25J88r0J87p9qK6N1j63j03L6K14k51K21j03N5
$$ y = [-118, -82, -49, -37, 72, -184, -24, 26, -266, 97, 193, 16, -144, -57, 128, -30, 164, -2, 72, -183, 127, 259, 182, 125, 210, -82, 99, 144, -144, 17, -155, -185, -94, 339, -139, 19, -159, -84, 71, 31, -39, -15, -118, 68, -107, 193, 25, 161, -84, 7, 202, -59, -50, -21, 59, 150, -59, -129, -252, -60, -28, 73, 15, -91, 296, -135, 191, 67, -50, -32, 237, 152, 43, -6, 51, -178, 269, 117, -16, -117, -134, -65, -38, -188, -6, -175, -124, -3, -6, -191, 58, 118, -3, -125, 38, 110, -149, 233, -30, 212, 245, -178, -20, 122, 149, -42, -5, 90, 106, -120, 63, -83, -72, -238, 52, 55, 16, 14, 192, 137, 96, 49, -273, -17, 31, 3, -53, 173, 69, -12, 166, -164, 107, 49, 199, 80, -33, -204, -80, -21, -67, -70, -16, -94, -71, 146, 120, -104, 62, -6, -236, 188, -52, 81, 65, 68, -185, 3, -96, 223, -85, -126, 41, -11, 191, 0, 40, 51, -65, 296, 165, -5, 121, 110, -115, 73, -17, 170, 91, 83, 109, 160, -3, -106, -70, 144, -107, 114, 11, 66]
6754F6q8K8J00k75L2P1M5r6J03o3J31j22j48m6L50j97K60j14o2K62l17J40j32
6777g2k44K71J04j42Q1n4Rq1J99r1K8j65nL46j04J39k31j57J94O7J81j42j06j5
6801A0Q4L7l04Q0J14j98J46R0J62l05r3N9J06P2j16K3N9N6m6j20R3q2J95j14m12
6826d04M55L7n6k52Q7J52l4J02R4k31j7o5K68j75J69j13j99L40j01j27K70p3R4
6849B21k37LM6p0N1J15k21J94k17j8K41l62P0L32j05L0k93K50n6O1PJ35l4L2j33
6874D2k29K87j92J44Q7pj02P6j33j02M3L53k84j12k9L5K53j54j43l2M07j16J94
6897B86l12L3q1P4m1j57O2K15j98K56m11M71j42j10K29l60Q8L12j53k94K35P1
6919G3k0k38J93Lp9j8K09j41K67j33N8K77n36jj60M04q9J22j36K7j61r1L24R2
$$ y = [66, -22, 6, 106, -169, -137, -66, -21, -117, -14, -77, 54, -68, -216, -262, 88, -109, 151, 37, -25, 237, -80, 60, -72, -316, -45, 59, -83, -2, -56, -47, -128, 71, -20, 8, -157, -162, 184, 80, 219, -12, -169, 25, 92, 273, 131, 25, 10, 94, 131, -173, -93, 21, -177, -31, 59, 221, -84, -177, -118, -12, 60, -56, -33, 26, 82, 36, -84, 9, -73, 122, 8, -404, 51, 88, 32, -220, -133, 19, -15, 87, 181, -50, -67, -132, 136, -39, 130, 17, -182, 158, 57, -70, 200, 127, 221, -16, -13, 33, -37, 14, 129, -92, 102, -115, -133, 108, -254, -184, 148, 43, 73, -220, 30, -26, 35, 42, 177, 143, 175, 42, -187, 100, -92, 52, 139, 132, 30, 106, -27, -129, -86, 267, -17, -129, -158, -123, 130, -24, -167, -199, 208, 92, 286, -26, 7, -74, 0, -41, -198, -136, 79, -119, 137, -274, 197, 55, -55, 174, -186, -98, 214, 61, -233, 2, 73, 53, -185, 8, 11, -68, -86, 123, -18, 249, 116, 174, 451, -85, -86, -246, 158, 69, 191, 55, 82, -79, -170, 154, 246]
6943B46k36l7N6K11p5n5m1l45L51j14J8Q3jj47J27j05N9l06L78J50j76K58j96
6966A03J37k6m06K81K21l49l9R2K61j74j69M1qP6Q6l37P1J96N0J03j64n7J08l84
6990b87K41q4L3j6J73pl8l53N76q0p4l8l70K55K84j54j34J51k75M10k07k0J38
7013A24j87%k4m5K37j15l3J13L4pO6k01J05O6j14j02o9jR2J38p9l6K7k07M4j1
7039a85M40j30m12M34k61J14K17j37j90K30k35L1K7M0j0R0j84K20k07P6r2J33
7061IJ79j82J21k22K39Kj47j50L92l41K57k45K15j22j17l3J49N2l2o4j32K85j08
7084Ej27Q3K22r5k9j51K04j10J84k26J02j94L26j18j60J36R1m9J71l76J54m3J35
7107A35j46j24P6J78r9j40r0J08J07K34m20J33L9k43J07L07l8m7J10k91K95l33
$$ y = [246, 10, -27, 29, 240, 165, 110, 69, -276, 75, -39, -21, 62, 61, -86, 41, -64, -5, -311, 67, 217, 41, 299, 103, 240, 214, -192, 89, 310, -39, -78, 14, 275, 101, -68, -27, -35, 41, 127, -210, -139, 57, 107, 210, 46, -11, 97, -287, -46, -130, -97, -113, 60, 53, 15, -338, 238, 158, 84, 46, -324, -69, 215, 61, -73, 78, -197, 213, 6, -14, 124, -63, -63, -87, -132, 105, -10, -43, 70, 104, 97, 163, -38, 67, 133, 19, -83, -152, -153, -61, 77, -2, -38, -11, -218, -174, -185, 255, 125, -287, 147, -114, 0, 217, 80, -110, 120, -115, -84, -57, -17, -27, 63, -121, 99, -108, -32, -124, 9, 188, 6, 127, -95, 144, 146, -1, -151, 241, -100, 157, -88, 127, 5, -112, -145, 4, 56, 24, -40, -172, 113, 5, -122, -39, 183, 88, 59, -92, 112, 2, 186, -40, 62, -132, 194, 76, -84, 52, 143, 94, 265, -111, 43, 0, 135, -11, -135, -59, 119, 20, -120, -210, -102, 5, 239, -181, -48, -9, -252, -145, 162, 124, 77, 187, -104, 191, -142]
7129a42K72Ok01R1m8R7l27J09L90j96Q7j2N7j73J4l5J50k24j31K25j26r5L08r0
7153FP0n9j07K41j15L57l26j42J76l17L35k23J06oK32j95p9L5J79j93k29L78k40
7176a16J12k0J77j85K4J54m29L22j24J85j58p5K92k49r3K38j79K62N0k70j57J77
7198f2J4j0O3j53J26L7j72L00k8l72J90O1n7l6Lj46L22K56m33J44Rj9q3k5K4j86
7224b33K39K51m7l58N4N2j74L38k59%K3M1J30m0O0n7K6QP4j22j98K05p4J02N8
7249I9N8j90n1J63j5j58nm3O5K18l8j68Q9j38K41k59L88k88m4k28L18j02Mj78
7273b62K47k19K18L10k50j54j37J41N5K0j9M9O7j48O9j3j74N8K01J32k82K58m8
7296A19m22K54J6j29N7pP3M2j63J84K1m2L05j41j27pj71J83j78J05j46J97J5Q
$$ y = [-142, 130, 136, -65, 26, -22, 75, -252, -143, 247, 51, 138, 126, 183, 10, 24, -11, 139, -85, -216, 9, -117, -212, 96, 6, 76, 17, -90, 151, 36, 393, 67, -75, 101, -216, 119, -104, 2, -4, 228, 33, -46, -11, 168, -25, -254, 124, -116, -4, -24, 153, -32, -8, 146, -283, 39, -85, 100, -58, -133, 159, -90, -183, 55, -124, 138, 188, -82, -239, -62, -48, -58, 5, -148, -22, 15, -157, 143, 115, -257, -67, -6, -63, -99, -96, -242, 80, 336, -97, 47, 56, 37, -46, -71, -47, -233, 6, 257, 210, -148, -94, -42, -216, 122, -137, -137, -114, -73, 57, 17, 77, 20, 46, 54, 128, 6, -192, 13, -61, 41, 99, 157, -33, -84, 79, 64, -94, -99, -142, -77, 141, 103, -65, 24, -114, 127, -132, 256, -32, -76, -304, 14, -88, -84, -262, -15, -234, -16, 294, 44, -110, -247, -106, -51, -31, -50, -1, 66, -82, -13, -26, -200, -142, 59, 191, -91, 167, 119, -303, -49, -33, -162, -105, -112, -39, 3, -160, 24, 45, 3, 308, 167, 40, 33, -138, 45, -133, -28, -174, 23, 38, 46]
7320D6N2p7Nq9j96L51j37j17J89K0q4P6%j13J01k8P5k63J22o7K91k73j1J89k56
7345a94K01O8r2P2O6o3k18L05j95j31n3L92j52j39M0J02j43K37j42J01j5J87j48
7368H6j44K18p3jn4k94j23M39p9N3J71n3k68O9mJ60K3j56L7J15q5qm2pM6k84p9
7395c37K83p3j11R6L03j21k36J40p2J52k11O0J78j51J98j95J67k89K27J24k11
7416g9M12n18o1M8K46j5j64J09K79l08M6j10L69l20o5J87R0M1k36L4j88J50j56
7439b09K18M6K1j0o2j52K99j15k5m6l8J84j24J15J4m83L27J50q7j3j25K18k16
7462a13J83J22k27K3K58k79m4k0J21Q3k93J52M2j82J97J43J06m0N8k15K86q5m28
7485a52J42R9m3j03k03L23k6N2J5j05j3L72k87j60J00J45r1j13j1J83pp1o6J78
$$ y = [46, 98, 21, 26, -63, -259, 92, -45, -162, 27, 47, -37, 39, 39, -74, 27, -1, 74, -189, -67, -134, 157, -116, -127, 62, -194, 7, 75, -17, 55, 121, 58, -160, 145, -50, -181, -234, 158, 6, -133, -93, 9, -134, 103, -39, 62, 47, 234, 86, -58, 160, 87, 86, 32, -262, -385, 54, -25, 28, 199, 146, -122, -53, -57, 103, 126, -30, 7, 122, 37, 29, -13, -20, 26, -258, -337, -54, -127, -238, -142, 161, 40, -196, -56, -128, 24, -187, -127, 51, -100, 98, -97, 70, -219, 8, 132, -79, 333, -185, -246, -198, 48, 33, -131, -22, 257, -51, -5, -115, 254, -66, -131, 56, 146, 187, -49, -15, -203, -53, -209, 9, 55, 76, 66, 4, -148, 151, 36, 11, -35, -73, 111, -13, 102, 116, -367, -40, 110, 23, 10, -115, 103, -113, 70, 192, -35, -12, 246, -33, -77, -97, 24, 107, -186, -34, 8, -174, 23, 166, 272, 232, 290, 75, 361, 276, -152, -10, 89, 46, -57, -260, 63, 37, 89, 104, -1, -14, 358, 71, -89, 11, 156, 65, -48, -59, 124, 117, 46, -20, 158]
7509A58n5L0o8j35N2j6kL2l0pJ13k36K53j22r7M04n65L94j72J02K7O5m7j79K16
7534A15j95K90k85K47j12j37J55k16m0K49j69L70ol28J81k71J05j36l6K92r7o9
7556i3J38o6L3P8j34J5J8R6l37L27p6Q9j85K54k41O9K45k32n8J39j36J56j47J87
7580A39Rk97J32J34K8k18j12J81j36J64N8j0p1K4%N0j51L7N9k46J04J08k4K3J67
7605A52j74J46j16n8O7j7rjo7M6K26j84K35j22k35K72k14M0J20r2K08l03Q2jj94
7630a93K39K39l40L2M2p1J39j90J55o6j26K38J15k22R6lj94K8J30O6j4p8Q4l0
7654G6Kj22K30j09j60Q4j04J78j47QL0J80m37M03o7p7J64j65J64j41J2k46R7L16
7678A69k58O4J30j35J22j17j63O4N3J63q3P5J0L3j97K19l52K81J31r8j15K81k59
$$ y = [158, 103, 133, 65, -70, -18, -34, -36, -4, -34, -41, 72, -164, 89, -33, -130, 274, -291, 103, -69, 33, 60, 125, 78, -101, 115, -80, 210, -75, 172, 60, -77, 78, -138, -178, 71, -98, 272, 266, -62, 119, -152, -47, -183, -219, 73, -24, -93, 45, -21, 12, 90, -44, -29, -11, 85, -252, 75, -1, 88, -97, 157, -84, -15, 230, -2, -60, 79, -57, 99, -48, 139, 148, -149, -17, 117, 145, -73, -185, -4, -140, 24, 82, 72, 1, 25, 25, 75, -76, -39, 20, -226, -122, -14, -38, -15, 152, -22, 124, 8, -50, 17, 0, -9, -10, -77, -31, 195, 11, 246, 124, -111, 161, -53, -13, 107, 15, 223, -80, 2, 1, -193, 46, 285, -55, -23, 19, -52, 87, -103, 52, -14, -140, 98, 213, -9, 87, 84, -110, -82, 48, 114, 100, 22, 106, 76, 78, -44, 186, 77, -83, 1, -103, 75, -72, -64, -34, 146, -291, 112, 45, -32, 132, -33, 131, -10, 2, -244, -147, 169, -89, -25, 105, -30, 92, -25, -188, -124, -71, 92, 9, 84, 94, 127, -70, 149, -203, 78, 209, 111, -4, 277, 18]
7701A8k0J74l0l8m1J33j49K06n33K49J35r0J12ol16J20l4K70l27k6L17j43Q7m7
7725B1n6Q0j89k6J65J89k92J01j2K1J8j23n5J48n3N7j51K6O6R1K87j68j61p4K11
7750A21j0q1j39L89k30J0J2j08L5M0n8J04P0j31O5J22k82r2j0K56o4k4k9K98m45
7775a81L03k92K42j53J4p8J22K00R4l67N2K70P5n14K50O5j94J22l3L0k12j83M75
7798A07r1q8j90K08n4K47J08m87K91o1j70J90N4N2j88O0n6K48nk07m2L98k79j04
7822e9K46n0L0j80M9j69R4J85l20J38Q1o1J40j39j09L75n40M09K21l22J22o5j73
7845i7P5K29j3o9J8p5R2k0J60l25r2J82j30J70j03N2j86N0j96K22K54k41K02q3
7869G6r6j32J18N9Q6lo8k63L24r1K10l59J08O9O8r2j2j25M5J23j51m3q6M16j84
$$ y = [18, -2, 172, 142, 104, 63, 196, 47, 253, -280, -31, 104, 14, 126, 120, -196, -76, -110, 160, -167, -193, 124, -19, 68, 21, -35, 45, -144, -170, -5, 184, -108, -7, -19, 2, 20, -103, -158, -10, -63, -6, -157, -131, -65, 26, 313, 145, -16, -90, 121, 111, 30, -109, 280, 50, 60, 72, -36, -1, 39, -19, 85, 155, 24, 89, 211, -71, -163, -173, 83, 19, -5, -34, 264, -181, 122, -170, 72, -81, -67, -145, -23, 177, 271, -96, -44, 226, 301, -213, 37, 102, -92, 30, -3, 27, -185, -368, 107, 16, -72, -262, -54, -108, 139, 247, -240, 51, -10, -180, 10, 64, 116, -72, -12, -68, 180, 175, -32, -74, 324, 45, -59, 187, 137, 167, -13, 36, -133, -39, 146, -174, -36, 45, -16, 124, -15, -124, 251, -289, 120, 341, 19, 141, 76, -97, -22, 207, 194, 125, 143, 68, 160, 140, 300, -25, -117, 65, -65, 105, 2, 54, -132, -82, -278, -56, 198, -43, 159, 76, -20, -152, -34, 25, 111, 108, 40, -223, 101, 10, 220, -139, -31, 38, 106, 14, 2, -123, -78, 45, -106, -149, -235, 181, -3]
7894cP3k82M33O9l64j46R7J26k4J2j16j1K23q0Q2k77K23J40p0P9j79j11oJ89r
7919F8j2n2j34J69Q8j40J3J47k04M9J31j32J03qJ68k41L2R9k17K92l28J48j51
7942a12L47k08k30L08K0J73k23j86K17q6j38J35j03m5J46J10l1M3j35n8j73K63
7964C4k39J58j37K98J13j78M5k65R8K37O7l12K04l02j34L90%j67R4p1q7K48j48
7987e4LK22l26M15j75J48j58RJ15k64J60j98L57p13P86l01L4j92K29m1M6o7j07
8010g2J75q0j56j33L38j78J90k3m3j1n5k9j36J69k3L7J36J1k32Q0O3k22L53J6
8034A75j6Qj03j31j03K8J69p1L1m4L00m58J1J03L4J35j23J41o1K37l48J21k32
8057a97L97l6k84K00j3j90j9M62k61R0J70m75j40M28k62K19j63M3K37l66j51K27
$$ y = [-3, 70, -212, 221, 290, -74, -220, -123, 3, -21, -9, -125, -136, 87, 7, 89, -188, 35, 175, 105, 184, 5, -106, -112, 77, 68, 56, 4, -130, 39, 127, -13, 0, 147, -57, -8, 123, -9, 94, 86, 254, 13, 45, 144, -73, 219, -109, 39, -112, 235, 27, -203, 105, 125, 298, 75, -111, 106, 20, -118, 17, -86, -131, 15, 125, 94, 137, 2, -56, -229, 34, -205, -47, -184, 114, 227, 49, 94, -171, -73, 164, 231, -81, 123, -179, -313, 77, 77, -90, 4, -67, -154, 94, -54, -51, 171, -155, 260, 85, 233, 75, 84, 199, -65, 95, -103, 254, -459, 327, 26, 60, -132, 97, 56, 102, 35, -72, 103, 23, -133, -266, 72, -106, 84, 61, 18, 7, -48, -77, -213, -44, -67, -30, 106, 117, -115, -35, 28, -194, 159, 175, 159, 167, 64, -67, -170, -142, 27, -44, -13, -57, 243, -215, -204, -101, -67, 68, -55, 86, 25, 262, -86, 35, -197, 200, 164, -120, 80, 67, -123, -142, 320, 59, 149, 319, -156, -296, 132, -130, 89, -74, -31, 206, -160, -311, -84]
8079h4O3p6K21j96J44O6N1l95J55O6k08L16j18N0j68K56k32J70J7r6P6Nj75m2
8103a34Q3k70L45k34L32q4J77k91J33J9k63M33l33K16j40K30l15K6rJ45l7q2K37
8126A84Mj07Nl35K07Q5l5J12r2K64k81J15j01N6M7j27M8Mj88J20R6p8j04J29j32
8151a04P7J2k6N2K5j99K76r3m9R0J02l33K56J2k16J9J27q8j8oK94k55R3l3j36
8176a21J70L2r0k1K01j92J05j09K35k78m1N3p3K18J77
$$ y = [-84, -21, -97, 124, -72, 72, 138, 189, -206, -51, 15, -193, 123, 5, 55, -113, 143, -89, 81, 98, 2, 78, 83, -92, -134, -51, -321, 24, -210, 122, 38, 215, -76, 57, 76, -187, 246, -87, 129, -11, 219, -96, -70, -79, 66, 29, -53, 184, 188, 81, 86, -249, -42, 43, 8, 120, 28, 292, 11, 126, 25, 81, 128, 1, 49, 53, -135, -15, 81, 3, -101, 28, -104, -27, -15, -41, 11, 36, -163, 113, 20, -29, 61, 163, -170, 86, 98, -118, -99, 28, -60, -78, -84, 210, -45, 48, 15, -121, 49, 81, -9, -30, 171, -21, 84, -25, 210, -68, -109, -56, -129, 89, 266]
8191B66
$$ Imaginary data points
##PAGE= N=2
##DATA TABLE= (X++(I..I)), XYDATA
0@%%%%%%%%%%%%%%%%%%Mj2J6j6J6j6J8k6L2l2L9m7N0n8O6p4Q7r7J08j23J37j53
40h1J70j88K10k33K58k85L14l48L83m21M64n10N64o24O88p60Q43r39J049j178
60f24J332j515J745k046K445l012L890n443R008l2145k99P2509L1766N459j5262
75F7808k385n196k2101k2920N570N034q098k2139j0322J708j2754j9534P085K0168
89a8076J4810K431N241J6482R27j9527j2172j422n35r404r077J2250J3833l632
103g871j993P432J0382J64p851O996J3122j149n620j852L146j899j5206p539O845
118b893J169m320q81P655P372p555o296L331P85k728n090J553R243q79p502P67
134f269L284om459p03J0890N007k842Q25K757Q44n803q127K325L475l342j995
$$ y = [0, 0, 0, 0, 0, 0, 0, 0, 0, 0, 0, 0, 0, 0, 0, 0, 0, 0, 0, 4, -8, 8, -8, 8, -8, 10, -16, 16, -16, 23, -24, 26, -32, 34, -40, 47, -50, 58, -65, 72, -81, 89, -99, 111, -122, 136, -149, 165, -183, 200, -221, 243, -267, 297, -327, 361, -399, 444, -495, 554, -624, 708, -807, 938, -1108, 1337, -1675, 2215, -3228, 5780, -26365, -26664, 45845, 77611, 83070, 67808, 65423, 60227, 38126, 15206, 20776, 25810, 17712, -4427, -14749, -13041, -25795, -45329, -38244, -18076, -3266, -835, 4406, 20888, 21815, 2288, -9884, -11306, -11841, -21245, -30322, -18072, -4239, -7871, -9864, -2432, 7950, 8114, 263, 7259, 20381, 19232, 13612, 11760, 14906, 13007, -2199, -9738, -2893, -1724, -6044, -6925, 730, 8102, 547, -5749, -2418, -1633, -4361, -9451, -7898, 1345, 466, -7036, -6269, -2985, -2991, -7450, -8153, 2737, 7744, 4902, 5727, 8484, 9328, 3525, -4602, -2277, 1198, -2144, -4139]
150d139J921N362k33p122Q66M701p57j765K38N559L485n134k935K689j215m325
166b804m165K281O542k154p27N844L496l85n361j403L636l466m731R13L493J605
182B614m317k428L896j074m643O75L875N126N95l80N043K031m619l503j641J047
198B297k426m683K404L505j784j943j28K891L13l962J153M817O82r47q38K807
214D158P65n509k429J390p04j467j071L070M134k016o64K167R04q31k254R92L856
231D491j158j961J198K87j508l207j222K918j41j826J345J708Q51k072k506K293
247e10N82k442n4J603J884j470k388K175P93k396m43J006K313P9k056J647J675
264A998j240j046o59K040L91k413O30K461o51j052j565P48Q09k967q64J714L69
$$ y = [-4139, -2218, 3144, 2911, -4211, -3345, 1356, 599, -1166, -928, 4631, 8116, 2982, 47, 2736, 1521, -2804, -6969, -4688, 1854, -300, -1027, 4817, 8313, 7928, 2567, 1164, 4800, 1334, -3397, -2484, 1009, 2614, -1703, -4131, -235, -1309, -5952, -5277, -1402, 3724, 4319, 3939, 8982, 11013, 6394, 2891, 1250, 2297, -129, -4812, -2408, 1097, -687, -2630, -2758, 133, 446, -3516, -2363, 2454, 3136, 2189, 1351, 4158, 4923, -586, -3015, -1625, -2329, -3796, -4867, -1797, 2337, 321, -343, 1824, 2728, 1897, -357, 635, 4491, 3333, 1372, 2570, 2857, 1349, -1858, -3080, -162, -303, -2129, -784, 924, 1775, -297, -2803, -510, 72, -2370, -2424, -821, 1063, -407, -2795, -620, 173, -2223, -2666, -1660, 653, 732, -1324, 323, 1998, 758, -288, -947, 1093, 1484, -929, -299, 2162, 1511, 459, -1106, -358, 451, -2516, -3380, -1666, -1297]
281a297m59j118O40K683j736j085J565J143M87j067L75K691q07k240O32L47J99
298I53j325j341K732P23j996J84M39J001q01j936J823R76j438r18m29J563o01
315c91k783Q15K041k70j057m34K219J064j904k0K080M15m79j613J313J804k273
332E27j461J403O67o10j907L37K527r86j826P43J313K17j709j293L047q2j973
349a066l58J768J370j428j913K404J058j929r08P85K257p22k092J184K137j270
365A277j539j94K255J3k492L62J797O1j516j357J541J204k782o51J521J118q24
382b06j732J348K386j160j729R72J267j28k073K46K655n39j818R4J546M82j939
399c28j066K163O92j708n75J166J413j287j709J176R51r47j664J84K289k50k023
$$ y = [-1297, -1756, -2874, -2234, 449, -1287, -2372, -807, 336, 823, -244, 131, 2822, 2015, -225, 407, 754, 953, -372, -1713, 1019, 1742, -254, -70, 369, 1370, 569, -1367, 456, 1432, -6, -924, -1353, 210, -391, -3174, -2359, -318, -588, -1645, -2079, 140, 1204, -700, -720, 1360, 1775, 1296, -317, 996, 2800, 527, -934, 469, 1136, 526, -1381, -1044, 1483, 497, -1329, -586, 727, 944, -765, -2058, 989, 907, -1066, -1424, 344, 1714, 286, -1627, 777, 1835, -94, -1002, -217, 2040, 1318, -774, 410, 2547, 1277, -262, -456, 1799, 1812, -680, -318, 1479, 1540, 24, -1333, 208, 1412, -1370, -2021, -500, 618, -206, -1938, -590, 1796, 636, -1093, -121, 1146, 1018, -1055, -809, 1846, 1307, -511, -417, 1129, 1611, -328, -1394, 769, 1461, -247, -822, 344, 1757, 470, -1239, -63, 888, -59, -1723, -1539, 750, 500, -1523]
416a523Q16J727k17j165o35J897P47k456n4J388O77r98j400R46J337j597r98P30
434g78R72k78j433O36K143l66j576K78P41K60j243r02J665M92j234m72J049R52
452I06r43j530J341Q01p45j018N30J697l72j847M84J043r2j309n19J594M99j280
470g60O7J268M92j005j203P97J201j167p89R26R65j6j460P21J544o92j242K42
488a11J049O39j782q4Q79L8j367o80L66P07j422n81J425M32j93m42N07J610m95
507D95j129J265N83o5q93k30J394l13j359J77O29M23o26o70R01N66j134k10K76
526H0P02p63r99O00P82j186n95N0O15rn62R24J309K06p10J06L87M23j221n44J133
547G28j32j36m60O8Q56r37o96Q09L84J10j6J83J044k38j386j04R6q23p14k62R41
$$ y = [-1523, -707, 1020, 803, -362, -997, 900, 1647, -809, -863, 525, 1202, 204, -1196, -250, 1087, -510, -1508, -778, 194, -84, -1517, -881, 1262, 896, -680, -402, 339, 599, -644, -1546, 119, 611, -623, -1095, -46, 906, -37, -1567, -226, 575, -170, -1188, -658, 1039, 667, -1180, -696, 347, 255, -1054, -1573, 21, 520, -760, -693, 575, 1067, 62, -1141, -344, 857, -310, -1099, -173, 792, 776, -684, 37, 1581, 889, -353, -111, 938, 1577, -205, -289, 590, 628, -739, -1419, -1053, -346, -1768, -2349, -924, -492, -685, -1127, -620, 990, 495, -634, 631, 1214, 1149, 256, 26, 1420, 1107, -252, -75, 554, 977, 351, -319, 582, 1148, 14, -196, 80, 782, 19, -980, -380, 402, -784, -1379, -1329, -714, -723, -1285, -361, 948, 1154, 444, 550, 937, 1360, 139, -405, 728, 596, 460, 0, 68, 924, -13, -709, 100, 484, 594, 578, 761, 1805, 1567, 181, 77, 173, -650, -1364, -1626, -685]
568f85q5p31K62L61M07o84P8Q01P65k83K93R35P9k44o51K41K47p07m01M02O9J83
590F52p94m9N21n64o95Q0L96L84o93J8O19K48j56m48J9O51n60l41O45L10p7k96
612a30p0O95n36m88N34J22M54p3k72Q16m83n79J33R7J28o47k90M91J08l28k46
633e64j02M19l67l77M53M97j68k66J34L77R0p81J35P42Q4j31m29Q53K47o54l41
654a49O27j29k16n10O66M66m08m58N87k60l79n61j81Q60l7k37N02K29k51l98m01
675f38N49J26n02O31L88P4l25n65J65K42p02j22M17N44m6l98O7O83o64m87J95
696c68N3L62k15L68N32j26l80l14J90j6p24RP23K14j7k40J09J47l38o08M65K72
718I8J60k2J20M38j90q61l20K04N27m67o9R54l2l91j98J39L27j01o13O66K12j09
$$ y = [-685, -770, -1501, -1239, -878, -471, -1155, -1077, -276, 489, 206, 499, 1434, 1513, 1269, 618, 859, 1106, 399, -2, 400, 469, 652, -142, -191, 330, -234, -929, -849, -453, -69, -762, -744, -125, 123, -33, -481, -462, 189, -371, -712, -67, 243, 166, -130, -200, 495, -41, -529, 5, 127, 581, 508, 236, 1052, 569, -10, 123, 220, 348, -299, -589, -98, 10, -318, -564, -666, -247, -614, -991, -538, -41, -209, -475, -341, 36, 126, -655, -520, 222, 306, 175, -254, 599, 846, 192, -149, 478, 349, 133, -377, 289, 755, 347, -111, 476, 216, -163, -724, -905, -45, -82, -319, 183, 412, 161, -237, -638, -89, 37, -465, 166, 554, 628, 303, -262, -97, 145, -557, -679, -262, 282, 236, -162, -95, 588, -76, -563, -368, -315, 47, -168, 200, 732, 606, 226, -88, 102, 86, -638, -629, 94, 308, 291, 51, 160, 307, -31, -639, -174, 98, 258, 236, 356, 794, 604, -257, -577, -373, 154, -313, -382, 572, 540, 149, -49, 90, 417, 316, -297, 369, 581, 472]
740D72k48m3K40k49r53O6P54j55l39O3N43J26n05k05M06o8Or1J51O31m16m08L68
763A46R3l88n43J51P88m11K0N96p3K62m09o09M55p8m06Q6J51L54p04N4J53J08
785b04j74J73p3N37K2n67N36j17L37o18J26K69L76m89k24L71Kk57k95J41M43n54
807b39n3K42M75o04m44M38L94m46j84L29J54K54m52l0K28K44p16L18J32L68l17
828I1k28M20J60j53m01R2L01k7n16K29J54M2m66J9J29L16l92k04J91J81j10J44
850b8J57L04o93J48K99q3j10j84J78N57m16j10K39j41J33o78O15N3j45l25K30
871@j53q8M1k86M51k34J62J4J91K14r0k93O9M6k77J62N7J36K7k47K32J36l32P5
895A3k3J29J14q8p1l5J70q8l52J50J02l72N0L13mK04n37L23L35m1l12J10J21o2
$$ y = [472, 224, 181, 421, 172, -781, -715, 39, -116, -455, -392, 151, 277, -228, -433, -27, -95, -89, -180, -29, 602, 186, -222, 146, 239, -149, -692, -541, 247, -164, -144, 452, 379, 641, 232, -377, 78, 0, -406, -320, -169, 185, -519, -465, -312, -204, -378, -205, -278, 259, 281, -286, 250, 133, 470, -148, -22, 247, 623, 134, -90, 281, 283, 26, -269, -128, 315, -239, -292, -50, 425, -179, -623, -185, 209, -237, -421, -92, 62, 316, -136, -166, 62, 306, -410, -92, 40, 408, 91, -137, 283, 443, 290, -111, -19, 282, 255, -261, -32, 122, 164, -302, -283, -154, 162, -230, -434, -243, -62, -172, -28, 129, 433, -260, -112, 187, 104, -6, -190, -12, 545, 129, 19, 258, 117, 250, -428, 187, 240, 95, -230, 0, -153, -241, -200, -486, -35, -269, -107, -93, 98, 312, 222, -71, -2, 44, -233, -71, -14, 122, 149, -98, 134, 270, -62, 13, -10, 119, 233, 145, 74, 39, 209, 121, -231, -81, 21, -351, -301, 12, 8, 212, -325, -2, 333, 292, -20, 90, 211, 149]
919A49q8j65L06l77J98k74L73k64J35p4K7K41k31r0p1K74l44p0N20k36K06l39
941a94Q2L28p8k15J09J37j18q6PK48N7m02j06L73Q6k46j25Q2J89kl01J08O1j6
965b2j15l5J88l7j93NJ62M9l01K3N29l77K09k46J09L13n6P3j56J7j63j17J54l
989A0K2m56L32pK03J51n14J68J57l31L62k8L6m89R8M6L1j7J86p8LK34L7m1R4M9
1015B58k81K19R8R1l41J21j77k4J08r9K8j43R6p3J19K8j14N6R3j82p5K11P4r7
1039fj14pM2o9L06k39J68l8R2L9k86L78K1m03J99r6o6J02k3nm3N2k11L65l66K65
1065E7k16L41m8k91J09j21j1L57k33R3k33K22n4J23k65L00r1r9L26n5n3r4J61
1088B25j44K9l95M79j45l82L65j90J14j1j10k6R7J59r5P2R4m6M7j21JJ66%l91
$$ y = [149, 61, -104, 202, -175, 23, -251, 122, -142, -7, -81, -54, 187, -44, -134, -205, 69, -275, -345, 175, -61, 145, -194, -112, 216, 138, -77, 32, 169, 51, -35, -28, 220, 277, -125, -231, 142, 228, -18, -143, -61, 128, 126, -175, -67, -6, -22, -137, -172, 16, -21, -214, -209, -47, 2, -299, -276, 253, -124, 85, -161, -52, 261, 205, 278, 122, 139, -24, -141, 13, 10, 32, -424, -92, -99, 104, 255, -259, -91, 66, -265, 97, 69, 105, -384, -286, -240, -209, -226, -40, -118, -115, 119, 156, 115, 209, 258, -23, 196, 294, 385, 44, 165, -12, -36, 72, -27, 1, -142, -46, -119, 0, 28, -86, -30, 63, -119, -194, 17, 91, -6, -120, -127, -85, -154, 152, -87, 81, 43, 135, 174, -112, 266, 287, -116, 83, -13, -79, 23, 0, -5, -48, 4, -207, 158, -208, 57, -159, 182, 134, -157, -48, -169, -180, 177, -56, 37, -196, 26, -28, 95, -170, 130, 39, -60, 266, 211, 158, 64, 225, 81, 110, -285, 194, 49, -333, 32, -158, -44, -55, -165, -191, -94, 65, -30, 42, 136, 90, 137, 16, 17, 183, 183, -208]
1112b08J78O3k44J35K69k2q1j85k30L77J20k47N1m8L25k02j09K58Jl20Q5N9K01
1135B26j50l95K13K93m65J42J03j8k34K17M18m10O6k21K79p6l26M09p0M7l1l9
1157b2k20O2J60j14j05J21N7rj27K97K48j90j12J49o9j54K2o5OK71p6k74j5L31
1181A72m32J73K19P6m40K29Q1k07K10l3j16L88l68k39K29K41q9l6J41j40ln8k12
1204b14M07M3l63M9J72R5k39j85L74j23K74k13k19K03k18O0R2J48j79j5rj9K87
1227B08l38J76P1n7j06M5J09j66p6K24l4P0j52j6j2K49q4k30P7J85l19J88j39
1250a27K26l72K02J6J18o7L8j19j9J89l34j0L89k59K12J26M1j68K53j98k5j19
1272gp0J81m10K98J73k05j01K54Nj81J23J13k98O7j37J66K5j30K14j98L75n04
$$ y = [-208, -30, 33, -211, -76, 193, 171, 90, -95, -325, 52, 172, -75, -24, -72, 253, 51, -58, 200, 201, -119, -34, 25, 226, 76, -319, -106, 187, -278, -136, -33, -51, -285, -68, 350, -60, 6, -215, 64, -12, -338, 71, 1, 48, 17, -22, -242, -180, -20, -134, -239, -118, -61, -70, -197, 100, 348, 158, 46, 195, 126, -28, -6, -71, -65, 206, 130, -144, -159, 172, -260, -87, 132, 208, -232, -3, 78, -129, 81, 48, -68, 320, -48, -287, -58, 183, 94, 58, 199, 59, 56, -2, -214, 193, 236, -127, -78, 94, 189, -50, -235, 139, 16, 290, 77, -142, 61, -157, -97, -5, 143, -36, -51, -60, -79, 208, -130, 46, 117, 60, -46, -1, 108, -58, -134, 90, 56, 126, -26, -42, -54, 195, 111, -119, -42, 143, -176, 12, -127, 99, -273, -71, -55, 63, -4, 34, -85, -104, 85, -249, -259, 130, -129, 83, 209, 250, 82, 335, 137, 112, -7, -77, 104, -306, -8, 165, -40, -141, 113, 118, -63, 60, 173, -125, -58, -195, -29, -4, -134, 80, -118, 257, -247]
1294b47L1p6M06l3k0K2L7R0l25N8J18j20L41j67j02J05k71M7LO0K31j56k8l1J0
1319a7k07K28j59K31k28j24J68J46O8k09J23k80L56R6j87j21L15l91K20P7l04
1340a99p6L73ko6j0L7l7N4j92r4J4l3K92O5r3J2J00r0K24q0Rm38K25Q7j76j65
1366b59M77j78k0p2r6K80Ml41M4L36m22L87p8Q0o0m21L43k7K0k7M4q9O1J5j35
1391a34K34k58J37Q2M3L6j50K43o2j92J9lo1r3J07mJ5K71j13L7k18L29l66J09
1415HJ99m59M68k35P5n8K16k20J81j82K27k02K5J0m2J77k13J00J93l18P4k3K7
1438B8j58J02j45J86Q0k36K59J35k37k7j03J74r0J63m38K5M13J77m85J64j66J55
1460b4J4P5l74L72j94K2J69j80J82k7P0Q6l14J6R6k0L8J11j03j93M02l74J31J86
$$ y = [-247, -216, -292, 114, 81, 61, 83, 120, 210, -115, -57, 61, -59, 282, 115, 13, 118, -153, -106, -103, -43, 188, 32, 4, -27, -17, -224, 4, -155, 76, -152, -276, -108, 38, 106, -103, 20, -260, 96, 192, 5, -116, 199, -192, 28, 105, -199, -275, 98, 96, 30, 20, 57, 20, 74, -118, -212, -198, -231, 61, 126, 33, 45, 145, 55, 279, 199, 208, -230, -5, 82, -94, -259, 218, 40, 20, -52, -148, 132, 136, -205, -161, 175, -247, 140, 62, 142, 82, -339, 4, -23, -3, -30, 14, -75, -14, 1, -134, 100, -158, -21, 61, 104, 140, -10, 233, 171, -21, -2, -5, -66, -159, -52, -56, -41, 230, 117, 154, -64, 265, -101, 8, 207, -252, 216, -19, 56, -2, 214, -6, 175, -7, 220, 18, 43, 53, 11, 188, -25, 75, 268, -50, 24, 1, 28, -130, -28, -173, 13, 93, -143, 116, 251, 14, -13, -116, 58, -32, 131, -307, -282, 131, 308, -177, -13, -179, -24, -10, 65, -309, 63, -131, -109, 60, -120, 62, 35, 105, 191, -123, -107, -11, -31, 7, 118, 15, -178, 224, -150, -19, 167]
1484A67kj98J86j28J49k15K23o3j94j1L7L67l24n9J52k13k3J58J52jj22R3j41
1507a0LO8p8k67N20L2k10r8O7q3o1J38k04L50k72J23k04J40J17k90L30k41R3Q9
1531E2j5j99K23k58L08M9k77m2J75j78l7K08M3p6J81k06N0m8Q5j84K79p3p4J23
1555A09j4M7m45L07r4K02n1j92k60M71L9M6R5l0m50L43P8k88O5J70k52K25j2o1
1579D8m8M6J86m84K63l8k77J87j98K17O8K07r0J15n2k65J32J8N1j27n0K51n20
1602c60K46J8M3j2K91k06J82j72O0k78J57K46j79l32L90O8m9k4j22q1K20l20L82
1625A68r7p6p1j51J68k29L21J68l75K77q8L87l64m5Q3Q2N6k13J81j14j57j81M02
1648A32j33n3KO0j30lK37k70P0J28j89L06j21l5qJ2k83J60L11k87R0Jl32K61J29
$$ y = [167, 165, -33, 153, 25, 174, -41, 182, 119, -75, -86, -49, 318, -6, -65, 87, -126, -149, 9, 161, 160, 38, 131, -10, -7, 61, -17, -284, 236, 268, 58, -40, 27, -56, -117, 21, -183, 167, -105, 18, -186, -46, 71, -219, 111, -130, -37, 52, 37, -162, 61, -197, 111, 160, -117, -159, 16, -162, -199, 9, 52, -24, 157, -49, 1, -47, 38, -146, 133, 60, -14, 109, 95, 142, -303, 4, -90, 112, 61, -131, -391, 80, 119, 165, 260, 230, -220, 123, 201, -87, -22, 148, -104, 121, 109, 48, 0, 46, 232, -252, 11, -27, -304, -117, -315, -98, -30, 177, 87, 202, 150, -115, 17, 35, 86, -41, -91, 160, -360, -114, -96, -53, -65, 226, 20, 202, 30, 90, -188, -31, 215, 36, -296, 94, 162, 113, 89, -33, -114, 106, -214, 168, 71, -5, -76, -227, -59, -288, 33, 201, -174, 103, 15, 402, 38, -7, 76, 158, 214, 1, 182, 68, -89, -270, 132, -1, -54, -52, 8, -122, -125, 112, -158, -88, 40, -149, 157, 36, 1, -7, 5, -278, -118, 193, -94, -4, -3, -335, -74, 55]
1673E5l37M48l02J17J35j83L51k88n6k16L56O5n1M8l0k69P4J34j80K27K23l43
1695b2J97j62P7j32K38k43J07l80L96n2Q4l08K20O5k29N08r3m37K7j22M09j20
1717B8k2M8J45j71m5j60J7K7L9Q6mJ41m1Q4j69K05k8k18o6J61k45N43n50KL40
1742A47k17K0p6K54l38L54j84K10j36PL0k77O5J92j93K89M1j50K7n5j19J47L6
1765G4o0K3n7k6J22m9K5o8Qq7J34o6N6k32J51J3J85j27L2%l00K99J31j22j09K52
1791B02m97L93J6k26L71l57J74J3k04J38J92j25k1r9J08J62n08J01J08J97q2l24
1813b68J33MJ65k33L95j44j8K18k41l6J95j08J51k09n9J76p1J04J06j40j94Q8
1835A4Oj00K42j04j0m2J96j45n2j97J58J4N4l1K9J09j13j02L60j44j78o2l6K02
$$ y = [55, -282, 166, -136, -19, 116, -67, 284, -4, -60, -276, 80, 145, 94, 142, 112, -157, -83, 51, -129, 98, 321, -22, 175, 13, 90, -42, 196, -47, 60, -320, 76, 24, 108, -200, 20, 85, -144, 364, 271, -166, -139, -261, 148, 28, 6, 54, 199, 28, -17, -177, -160, -133, -94, -8, -12, 129, 88, 172, 3, 208, 180, -38, -104, 57, -188, 355, -195, -193, 147, -70, -50, -126, 128, -210, 144, -40, 170, 34, 41, 71, -206, -141, 51, -142, 147, 188, 38, 65, 10, -109, 38, 74, 14, 37, -20, -46, 76, 27, 52, -16, -8, -95, 39, -27, 29, -203, -52, -39, 146, 19, 51, 51, -249, 50, 181, 59, -50, 202, -295, 98, 114, -112, 259, -98, 76, 89, -115, 23, 215, 90, 69, -30, 78, 240, -268, -167, -59, 138, 56, -268, -135, -131, 34, -199, 196, 52, 34, 252, 11, -25, 170, 62, 213, 4, -55, 121, 50, 154, 260, 120, -74, 14, 20, -80, 162, 58, 48, 6, 202, 57, 5, -192, -34, -20, 34, 3, 32, 141, 28, -74, 286, 142, -36, -98, -134, 68]
1859F8Q6j90r7J39K38j79K6L9m3k14P0m4K04o5N2L4k43K89k02j1K34J2j93p1j11
1884a72K50P5k11L03l77L56N5m76J75r7O2L28j24l67L47j56nk65J51K02Kk64K97
1907H9l41K31j09k5j23M46j40k07K17k09M14k56m7J8K4J29p4k98J85J3J39l88
1929c12M43q6j68K36j68M4j00J72J00L4r7o9J5n0m7j17J46k01M07j6n4l70J68
1952i0nQ7k12K01NJ1j87J53J86m43M22k55J65Q8k54K86m0j68j6J49k59M28k43
1975IM6ol01K71o%pl2q8J14R9j48j44K23P7q0j34n3J66L7n6o1J9j29L05l9m9k53
2003b20L84k00K9J14K7K2p8k29L38j49N4j13O5r7N5k8J01o5J52k37M7J55j70j
2027d4L8K2j7j95J18J6K4KJK6K45j30q4k6l46L66l1M9J43j81P1j16j29P7P8R6
$$ y = [68, 154, -36, -133, 6, 244, 65, 91, 130, 87, -127, -57, -101, 103, 38, 90, 124, -119, 170, -32, -43, 191, 203, 10, -61, -172, 78, 153, -58, 245, -132, 224, 279, -197, -22, -119, -57, 271, 147, -220, 127, -29, -34, -299, -148, 54, 56, -208, 89, -252, -21, -130, -155, -278, 168, 28, -179, 38, -171, 243, -13, -60, -42, -18, 111, 37, -261, -76, -63, 76, -312, 131, 45, -123, 113, -55, -11, -111, 61, 161, 195, 98, 29, 44, -6, -53, -170, -24, -225, 182, 166, 112, -258, -90, -95, -8, -220, -19, -14, -3, -190, -37, 149, -294, 128, -127, 38, 126, -128, 158, 118, -50, -66, 83, -176, 252, 9, 55, 49, -252, 19, 13, 13, 6, -26, -114, 0, 99, -49, -193, 30, 107, 27, -107, -160, 6, 43, -13, -74, -55, -184, 121, 82, 33, -220, 164, -36, -7, 107, 134, 156, 78, -151, 187, 38, 92, -21, 44, -53, 2, -26, 75, 10, 162, -75, -28, 127, -43, -44, -6, 16, -1, -196, -78, -62, -38, -36, -35, -9, 236, 106, 22, -4, -350, 16, -15, 34, 177, -4, 67, -49, -178, -101, -23, 73]
2053G3Oj32l0p9J28o9J01k08L76n9k32N0K92j62q5J4K69nk69M1J26k25m2P9k2
2078f4J6j17Q5o4J62k85Q1K27l8L1j05K61L5k08J77o2J21j69J31j37o3Qo0K3J3
2103aK84k56j73R2K04j02k9P2J29k3k87M7L8J28j8P8K8l8j74k18J80j34K15r6
2127e4L4O7o9M8J32o9j18np7kK46j85J46l56L31j21K35o5j53k06M2N1J88n0k31
2152b41M1K92l37L03Q9J2l7k36K38m0j14J56j40j00P2K02k11L5j74N8K01m4k3
2175Bj3o6l0K72j02J46k73J68j51O7j04J65m2O4J95k84J23j0l30K59j29K41k12
2198d4N0K9Jp2L0j68L6j02L54l71J35Q3N3nJ06j00K26j49k9j64K23l8l82K89K08
2223A99k6l18M7J84M1k06K11j7j31q3K76j44J69q0j93J04j12Q1R2k8K3J1l43K36
$$ y = [73, 79, -53, -83, -162, -34, -103, -2, -210, 166, 107, -125, -75, 217, 55, -30, -16, 253, 248, -21, 20, 146, -79, -121, -42, -64, -48, -165, -80, -144, 18, -267, -186, 41, 3, 34, -71, 190, 225, 17, 194, 132, 253, 84, 215, 78, 15, 23, -37, -14, -1, 283, 27, -146, -54, 150, 48, 19, 91, 220, 197, -90, -43, -5, 123, 105, 183, 211, 173, -1, -219, -39, -173, 42, -54, -20, 47, -22, 26, 158, 89, -29, -34, -111, -113, 133, -52, 94, -262, 69, -52, 183, 118, -35, -241, -199, -148, 40, -10, -241, -200, 92, -245, 58, 147, 159, 122, -114, 124, 84, -30, 126, -14, -114, -42, 160, -51, -16, -190, -132, 69, 25, 2, -11, -77, -107, 165, 63, 209, -64, 104, -47, 20, -84, 81, 39, 103, 298, 14, 137, 127, -203, 56, -73, 168, -44, 6, 35, 36, -36, -6, -174, -138, -240, 114, -257, -122, -39, 14, 9, 115, 15, 241, 92, 63, -101, 122, 84, -298, -9, 199, 173, -145, -98, 86, 127, -79, 132, 115, -16, -99, 177, 33, 202, 122, -71, 33, -79, 2, 94, 66, 89, 100, -243, -7]
2247gK97m24k8M1K27j47p6K44N3l19J80M8m3L07k27m02L75j92qK27k35p2K31k0
2271C0K91l45Q8K6k99M19j20j26O4Q9jj42O9m0r9j32J03pJ11l28N95l68J8m1J7
2296a28K38n1Q4l0j97J21m7Pl5J33j22q2J52k6q5o0R2o6K02j00k03J97O2P0j24
2321Bn0M3K4r1l6q5O3jJN6j4j3N3J17m02J24K16m4J23r7K12k09J14k85K19k29
2347a89K13N6j72J29k77L48o7J1k3j90K84j85J5N5R6N5j79K36k74J95j88j81K20
2370a2J19k11N4L10k02n9N6n7k9K15j06r2K5R8k21M10k05r2l07K70J49j39J33
2393A07J88k46j15J17j37J57j13J3jJ2r2K29j35k5K10o9k2p0J30o7j92L21m06
2416b06J99k78K87J76l80J7K50k91J23qj49L98j3j67j01j0K21j38j34K36P7k57
$$ y = [-7, 290, -134, -162, -121, 106, -41, -117, 127, 180, -139, 41, 89, 46, 353, 126, -276, 99, -93, -101, 126, -109, -181, 50, 30, 321, -24, 64, 90, -209, 210, 90, -36, 28, 117, 116, -26, 43, 3, -96, -228, -125, -132, -21, -349, 246, -122, -104, -145, -128, 110, 59, 143, 113, -84, 37, -10, -3, -38, 95, -27, -109, 43, 17, -68, -128, -36, -102, 100, 0, -203, -6, 56, 126, 2, -48, -5, 19, -72, -108, -193, -130, -131, -130, -74, -88, -101, -48, 69, -333, -209, 7, -37, 86, -11, 201, -8, 106, -179, 40, -189, 24, 80, -92, 37, -240, 108, 41, 52, 29, -161, 123, -62, -47, 8, 104, 159, -20, 216, -58, 137, -51, -232, -12, 107, -104, -50, 260, 58, -1, 55, -2, -31, 184, 78, -14, 11, 109, -112, 298, 93, 1, -306, -36, 113, -26, 107, 295, 49, -66, 51, -86, 71, -42, -29, -30, -18, -110, 119, -16, -41, 169, 100, 78, 8, 138, 71, -121, 200, -206, -7, -285, 2, 178, -202, -185, 65, -226, -103, -111, -260, 138, 125, -42, -143, -153, 68, -70, -204, 32, 109, -148]
2438a48L5J49q9J80m65L15K36ok87j33K15J15J36p2k08J38p5Ok30J53J49k36L20
2461A98l72j37L09q3ql8K90j0j21j27J62K5k68OL37k79L6jQ3nK9l6r9n8J42j06
2487a31L94l70j26K81m9J1K37k96l5q7J89K09k91K10j03J57j89K67j28k01J29
2508G8n4M8j39Jk05L62j02j43k8K92j21j28L06k23K1k44M37n5j09Q8J34k23K1
2531A4Q8k24J42J27k37K31r8P4L3k17J22p5K14Ll00K74k73R8p2r4J67n0O5k4L71
2556C59m32J08p2o7m2L4K87j15j93J78K6j43mJ77L6j76j72K37K2j24N0J44j17
2579AJ82j19j49o7K44J9l82M63q9j06O8k44J28p0K12k45N5RP2J26L9l18k8J64
2603c5k83J66L07l64K12r3j75L28j10M08l94o5O5L52n33l0K04O7K0m4j91O7J69
$$ y = [-148, -113, 36, -53, 127, -338, -23, 213, 207, -80, -213, 2, 117, 253, 181, -27, 111, 36, 42, -188, -35, 114, -122, 198, -174, -311, -2, -85, -93, -131, 159, 149, 28, -99, 63, 88, -180, -174, 163, -116, -80, -81, 2, -3, 26, -10, -109, -167, -25, -131, 263, -107, -233, 48, -1, 10, 247, -49, -84, -171, 18, 227, -64, 146, 43, 200, 11, 278, 150, -51, 78, 24, 72, -67, -66, -271, 91, -11, -154, -182, 110, -11, -139, 167, -56, -35, -279, 158, 103, -6, 82, 216, -7, 14, 102, -122, 20, 147, -90, 141, 43, 117, 150, -67, 55, -20, 194, 197, -103, 171, -102, -4, -76, -170, -3, -53, 12, -12, 359, -73, 35, -37, -104, -146, -112, 175, 60, -133, 45, 71, -72, -76, 101, 137, -39, -211, 26, 48, -76, -26, 118, 1, 183, 64, -85, -152, 92, 111, -271, 192, 103, -3, 65, -179, -51, -121, 91, -154, -99, -90, -18, 108, 147, -171, -199, -35, -318, -152, 155, -209, 3, -90, -265, 63, -47, 361, -33, -98, -33, 319, -214, -244, -40, 27, 47, 3, -188, -121, 48]
2626D8r5P9r2J75k09J97k27O7J18Mj21K5J46l19J50lO2O3j50J99j64L32k62P7
2650A00l36J81J07j36K94k30L22n80K13L4q2n9R0P2LL8P9l40K10K8M2J63m04K03
2674A2J00o2p7J62j09J29j80Ql39K94N3N4q9j6K5L62j56j26j06J46P8j71l5m9
2698i2L61k47J02k10j01K22j29J32p7J34j55J96r4o8m5n9P5Q3J75l68J9J2L15
2721A81k1m01K03N5p5J5j12J41k76N03l1p3j29k09J03R9K22j45q1o7lq0K31L2
2745H2M6k14O9q5j7J8J18R1J18j93Qj40k87K92K24m11J55Q9J00K2k54K57O4l52
2769b00K74Q5p2r9N7P6n7ml13K33K48l2j43q8p8k10J79K10k30J48j4J3L32k55
2793F0j17K37j72p1q5K83k21J98q5j47q2J34O0N3J1o3j01j90K43k6j80L28R8o7
$$ y = [48, -47, 32, -60, 115, -94, 103, -124, -57, 61, 65, -56, -31, 115, -204, -54, -57, 5, 68, -82, 117, -47, 285, 23, 100, -236, -55, 52, -84, 210, -20, 302, -278, -65, -31, -113, -172, -82, -10, -7, 31, 110, -230, -20, 8, 50, 213, -191, 12, 112, 50, -27, 135, 26, 155, -25, -17, -356, -62, -9, 45, -44, -60, -35, 327, 171, 45, -61, 85, 163, -8, -43, -92, 269, 22, 124, -86, -187, 35, -94, 38, -39, 95, -60, 136, 42, -26, -71, -130, -55, 28, 203, -165, -146, -134, 181, 160, -241, -38, 17, -58, -43, -155, -14, -290, 213, 182, 109, -20, -229, -126, -27, 195, 50, -31, -98, -101, -181, 50, 82, 128, -86, -17, -102, -119, -101, 17, 108, 226, 33, 41, -99, -386, -94, 130, -281, -126, -37, 63, 85, -169, 88, 152, -200, 74, 159, 87, -12, 45, 121, 64, 60, -253, -20, 228, 196, 53, -35, -113, -323, -144, 66, -164, -16, -30, -17, 315, 60, -57, 180, 8, -63, -148, 135, -86, 112, 27, -120, -202, -68, -8, 45, 56, -7, -108, -298, -55, -81, -261, 67, 165, 98]
2817I8K3mn5k25J56K59k90jJ30j72K58j63j54J33l49L18M6J05k11K22j30J09j63
2840f0J40m3Q1r6j15P8k0K92l63j78N10l25N5J73k84JJ74o5q9j90M21o9k45J26
2864i1J27K45k13m1N0M9k24o2J36J27j30K32k37q5M07j53j99J52k77J41J00R9
2886A53L4n4j74J03n0l9k10J73K38m22K72o0l17L50j19K73k43n2K63q3p6J37j88
2909i1MOk4J12q1L0Q8p6j6j38J04J81j97M3K25j7k27J47j38J12j24K79k77m6J40
2934A9m1j84K06n2N7OM4lk16J60J02j21j01J43Oj3k2j69K88q2j10J25j07R2L4
2959F1K30l16J13q2J9J63m72L13R9l86L41j88n7K27k80Q3J55k4j61M89m54J80
2981E3Q7j94M9J9p2l8q4K66k27J4m8L17k37K66k39J58P0K1m15M44p7j98K34q1
$$ y = [98, 121, 117, 62, -163, -7, 252, -38, -39, 91, -81, 177, 14, -140, -7, -356, -38, 8, 113, -98, 124, -6, 103, -60, 80, 37, 118, 22, -93, -15, -35, 257, -106, -284, 226, -99, -44, 129, -155, -154, 20, -45, -134, -324, 97, 28, -217, -91, 36, 281, 68, 27, 77, 126, -98, -160, -24, 103, -27, 205, -32, -117, 290, 137, -62, 90, -187, -46, 54, 153, 187, 133, -41, 62, 12, -27, -237, -64, 174, -248, 24, -36, -353, -3, -122, 151, -92, -144, 119, 36, -40, 97, -91, -87, -81, -105, 7, -74, -44, 44, -32, -48, -186, -82, 99, -98, -55, 170, 153, -74, 73, -65, 47, -77, 202, -75, -121, 19, -22, -206, 0, -52, 5, 11, 55, 52, -164, -4, 98, -23, -124, 19, 25, 12, -10, -179, 109, 27, -83, 42, -65, 27, 61, 291, -25, 88, 6, 25, 188, -284, 29, 128, -258, 83, -105, -162, 65, -215, -132, 23, -1, -162, 327, -127, 53, 140, -54, -5, 14, -58, -96, -180, 86, -141, -127, -175, 142, -95, 171, -68, 90, 160, 181, -234, 210, 133, -65, 169, 88]
3005H8j97j04J38J01o6J28J07j27j30mK87K7m17o6K45j11R1nK3J75lj17j69m4
3029a50M3k0J70M3j71j80J65J25j80K57j31J1k04J21L56m85K80J7j51j75J80K33
3051A54j26j09n3K68n9j55J20k4K2j13J85R1k32J24j35P2J14j1j19Q3k8Q5j5j73
3075c4O3j28L45j74q5j54K37j35J90k04L58k34O6n5k15K29r9J7j59L36l18Q3M7
3098b3j67N8J93k60K38P2M2o8j35O3J07l33N5l8L27k93J76O4j45N0J15M7l01M0
3122a16J2J59L5l06J8K81l67L54j09J76l7J4m12L68J13k01J27k88J48M0o5J49
3144I3j98J29J4M7k2k11K68k25J59k2q1O4j77L47l07J22Q7k03J14k9K56k85J27
3167F7J28m01K28J03j16Q5k02J74j20K62k76r9K12n9j2q7N1J34q7N8L24l47P5
$$ y = [88, -109, -213, -75, 26, -40, 88, 195, 68, -62, -66, 221, 248, -169, -235, 10, -101, -10, -15, 8, 183, 180, 63, -106, -150, -107, -127, 43, 86, -85, -265, -100, 25, -155, 102, -29, -18, -222, -101, 255, -230, 50, 67, -84, -259, -79, 154, 28, -81, -134, 134, 75, -80, 40, 16, 38, -75, 110, 201, -31, 93, -42, 30, 144, 133, 14, 97, 69, 154, 139, -34, 29, -99, 246, 72, -13, -167, 70, -65, 125, -79, 279, 45, 111, 56, -159, 70, -29, -12, -171, 165, -153, -70, -23, -190, -132, 61, -199, 39, 111, 153, 85, -50, 13, 120, -213, -158, -196, 131, -162, 14, 78, -67, -17, 98, 145, -156, -116, -104, 55, 90, -216, -198, 83, -284, 70, -39, 137, 100, 114, -298, 70, 183, -18, 109, -179, -31, 9, -56, 93, -105, 24, 38, 85, 63, -148, 120, -105, 54, 32, -49, 15, -162, 185, -122, 0, 87, -116, -2, -31, 225, -60, 67, 195, -206, 22, 125, 9, 94, -108, 66, -54, 208, -68, -167, 45, -14, -26, -113, -62, 72, -15, 43, 367, 20, 95]
3190I5j99M0J03j58J26k60K59k24J66n3J62K4n4l40K74p7J33L0j05j42LL24J16
3213B43m23K26m7J64k72l16L14R1M2K0l32M33j95j27J51O0j76M01j83J25k30R3
3235F2J3m6j5j06o6P7J12Q6k1j36M5On1k65M04J75k71Q9K2j8L14o99J95K02j07
3260An0K1l5L79j93l06L51l81R2P5K19j23J25o5R0j71J20j43p8Q5m7Q4J7K05m38
3285a66K25k60Q9K98J5J30k81k25J6m8m1L25j43J34j45L80l99J06r1p2p0J79j45
3308a89J84nJ06j61J42j14n3J35j52J93k41N0J12M8j10K4K31k04j51M17l91K91
3330A62j63n6M1Pj0k9k8l11M12k65J60J78k96M11J9r8k17Q1j76j46J37K12l52
3353c27J95J73N7j13K49k79J80k00J55j22K87l29J35R1pk83R4L98l36l4j2j29
$$ y = [95, -104, -64, 39, -119, 7, -253, 6, -218, -52, -105, 57, 81, 27, -313, -39, -116, 17, 47, -58, -200, -197, 127, 243, -180, 46, -1, 163, -109, -425, -111, -20, 22, 42, -290, 143, -52, -179, -28, 32, -144, 257, 74, 199, -31, 62, 75, 29, 14, -92, -158, -81, 31, 117, 96, -40, 5, 11, -40, -305, 99, 274, 3, 92, 114, 96, 410, -289, -94, 108, 1, -49, -28, -63, 316, 123, -183, 168, -213, -121, -46, 173, 50, 175, 110, 200, 29, 149, 6, -72, 13, -34, 50, 67, 272, -166, 59, -201, -112, 186, 201, 331, 50, -175, -159, -207, -248, 77, -66, 68, -77, 303, -96, 10, -81, -153, -223, -44, -189, -5, -10, 96, -65, 77, -37, -90, 45, -107, 86, -155, -105, 7, 55, -55, -31, 200, -4, -155, 262, -129, 162, -1, -57, -16, -9, -19, -48, -76, -387, 25, -240, -80, 98, -198, 213, 232, 134, -83, -2, -178, -324, -187, 25, -327, -132, 41, 98, -15, 234, -45, 135, -65, 90, -32, 255, -74, 61, 152, 145, -138, -44, 354, 18, -16, -28, -157]
3375a57R3J28k08K34j11m7m1J7K13J11j64K89l26k0j80J28nK18m3l60J37J06Q7
3398I9j04Q5J6l85J19L9K06J45j28k48K38l92L69Q1N9j29K0k22J65K03k56N7j06
3421f9j6j04K08L50m95J02J74O7k03j13L45k13k05J50mJ16j29K6O5N8k33k3PQ0
3445e9k7J74p9j0N7j94J44k2j92K28j94J51J20j34lK42j40j55J37L62m37K51l60
3468a40L06k85L35R7n68k4L29m5k7P8p6j5L23l64j03K85j05K6l1J05j21N1O1j63
3492g1j6L5j30K05K8J13k28m2J32Ln1J26j64L73l60j44J65j9L4k7l5J52j49K9
3516d1K9j85L5J98k0K0m3P9j59J93p2K45m47J5R3Q4j63M5L06j44j09N6k38J56
3540f7J00j35J5K00l23J52O5J66k19j81J76rp2q2K54L7J40j49o0r4J34j20J7q7
$$ y = [-157, -64, 64, -144, 90, -21, -68, -109, -92, 121, 232, 68, 357, 31, 11, -169, -41, -46, 172, 129, -231, -94, 12, 99, -5, 80, 96, -289, -170, -131, 75, 220, 92, -156, 82, -310, 59, 140, 199, 70, 90, -132, 33, 236, -20, 37, -69, -85, -189, 19, 369, -126, -24, 150, 217, 14, -99, 246, 33, -172, -22, -26, 90, -39, -13, 52, 110, -123, -146, -139, -59, -86, 88, 9, -1, 56, -138, 6, -16, -208, 20, -174, -23, 97, -37, -40, 202, 62, -93, 44, 406, -31, 220, -140, 166, -119, 216, 313, -255, -279, 50, 5, -22, 56, -20, -35, 288, -76, -179, 106, 1, 27, -4, 101, -20, 31, 92, -71, -87, -52, -182, 23, 51, 164, -64, -106, 26, 29, -22, 104, -60, 313, -47, -191, -26, -45, -11, -38, -73, 79, -70, -41, -12, -197, -162, 36, 16, 36, -7, 72, -87, 106, 34, 279, -168, -153, -60, 24, -139, -94, 212, 68, -41, 15, -223, -67, 33, -102, -87, 113, -210, -58, 7, 173, -46, -227, -51, -60, -132, -214, 40, 77, 217, 68, 8, -86, 48, -72, -55, -142]
3564a42k88N42k75K14L3m3j33j64J11mK33j59L0k59p3N21k88n3j3j56M05J88j53
3587G4J36k26NJ54k65K65pj34j4J6J11j88r5N4K04k2J8%O4j57j69J11n7J07M7
3612C2jj92J44J21J5j89N1k64J34N3m7L15j89M4J36j95kk38K96J06K7l15L35k19
3636d2j31L35l40M6J00J66p2q5N8k21L23q1j97K18mk36L19l62K34k48M3J10l1
3659i8j98K22q9R5n0q5K44Rm1K29L4n80M17R3k22j4J85o6k69K64q2k34L47R4j83
3684B2Lo6j0j32K13J09q4j25j68K41q2r7J11M0n8J61m9j87J36J18j96J53Lj34
3708g8J05m5K1P3q4J72P2k97Q8j34J08l2J62j3j38m5j31R4m6K54J15m22K4q3L28
3733F8p6J31k84K43Mk7j67O3K33k13N0q1r9J23P3j08K18k22R5p1J51o2R2j06J13
$$ y = [-142, -430, 112, -163, 51, 84, 41, -92, -256, -145, -149, 84, -75, -45, -304, -377, 144, -144, -197, -210, -366, 39, 227, 74, 210, -16, -11, 143, -122, 143, 136, 2, -12, 4, 115, -73, -168, -114, 90, 68, 86, 86, 150, -7, -176, -65, -122, -15, 32, 31, -161, -17, 104, 119, -70, -19, -283, -149, -96, -143, 172, -17, 27, 163, -32, -34, -272, 24, 130, 157, -158, 177, -42, -173, 162, -178, -132, -32, 134, 62, -23, 35, -186, 137, 56, -141, 77, 73, -163, 156, -206, 28, -220, -177, -67, -98, -296, -74, -163, -68, -118, -203, 41, 50, 9, 238, 272, -308, 109, 202, -20, -34, 151, 85, -184, 80, -2, -236, 111, 205, 22, 25, -41, -51, -183, 30, 139, 55, -70, -238, 3, -79, -176, -65, -25, -83, 78, 29, -158, -22, 96, -100, 53, 56, -78, 27, -18, 3, 76, -8, 164, 236, -61, 27, -107, 1, -31, 131, 118, -20, -65, -196, -102, -148, 106, 221, -201, -177, -260, 68, -8, 123, -161, 82, 86, 59, -108, -45, 188, -25, 25, -56, -155, -32, 41, -67, 151, -71, 24, -47, 104, 42, 134, 28, 141]
3758A41j05k70K26r5J74j95l1L23l28j5Q1L81m73K50l9k58L77l08J82Rl5k3j97
3781b28L37J47k53J38mk61J0L10j74n6l9K38j53J30l45J10OK40j95L00l57l17
3803d16L64J23P5k03J65j75J01k2R1R3k72o3J43n6q7K99l40K16J3O5j05K5R0k09
3827h5k8P1j19P3j15L6K92k11J30R1k82j51L51r1J04K9J34j06j61K18m8m05J61
3850a12j9K54k2j30k85O20k72Q8q5J46r7K4k07J3N5R5J19j79N7MO4m01L01k5k18
3875b12L72l06J11J42l1l99M75l78L54j38k48L27j27J17j20K07j62rj29L1J78
3896E5Ok9L92n15J47k80L44r3j8j07L31j61k88L27J48j37m7k26K09j15L1j11l
3919a40o0J54R5j27J07JN7j9LJ75m01K64J55p0l51O7m6L04k4m00J87K37j52j8
$$ y = [141, 36, -234, -8, -103, 71, -124, -155, 168, -160, -175, -94, 287, -186, 64, 25, -233, 144, -164, 18, 27, -8, -31, -228, 109, 256, 3, 141, 137, -124, -114, 196, 22, -34, -73, 165, 12, 142, -203, -93, -87, 153, -42, 258, -99, -416, -52, 71, 146, -57, 108, -67, 34, 12, 103, 196, -76, -139, 4, -52, -139, 160, -180, 36, 49, 114, 9, 34, 124, -85, -113, -42, -161, -88, -203, -167, 125, -86, 44, 135, -147, -298, 53, -38, 66, 95, 229, 123, -38, 180, 132, -273, -112, -131, 123, 101, -29, -314, 306, 34, 122, 37, 183, 86, 110, -97, -84, -29, 66, 185, 6, 63, 67, 131, -270, 31, 6, -212, 160, -146, -35, 107, 76, -323, 152, -226, 128, -10, -258, 69, -58, 59, -61, 146, -16, -25, -154, -123, 55, 61, 32, 424, -91, 56, -224, 120, 27, 9, -98, 233, 72, -216, 111, 259, 122, 75, -151, 58, -57, -26, -137, -140, -200, -46, 49, -78, 29, 30, 87, 68, 71, 246, -155, 109, 264, 194, -157, -90, -136, 168, 144, -256, -69, 168, 16, -2]
3943bq4j46Q4L1J55K01k6l45P0K10j49k56n3J69K78k8R8k48J3L33j94k52K99P5
3967B33j10j21M3j97L80l5j61j3nk38k7J00J31k09J2L21R1k49R6R2p6J71l57R4
3991c4J40k23K77m9k04j2j58R0M52j70l73L37o8j81J76J1m3K47O8j89Pk28M6j47
4015b28K27J54J58l37N7R7j05j15L8J51J36k82j06J31L8n8J24K0K3k5k40M35j96
4038I7M1j45p0j20K62j35j33K70R3k94L23j69k87L42k62J73j40M51k23K05k07
4059G2J55k17j7j91J7L39j55k17K12j44J41lk34K73n0q3L49k83j32J18K9m2L8
4082b5q8J35k4L26n19L43j78j80K61l9J11O6n30J50K96j33Qj03j25K80O1k12J72
4105E3J32j54Q9K7q9J13Q7j81q3L17k88j05K89j61l3J74L3O2j57j95K75k10N2
$$ y = [-2, -86, -232, -148, -117, 38, 239, 213, -132, -62, 148, -1, -257, -310, -141, 137, 109, 207, -41, -28, 305, 111, -141, 158, 233, 123, 2, 45, -152, 228, 193, 32, 19, 14, -224, -251, -151, -20, -229, -217, 104, 195, -54, 42, 134, 58, 229, -128, -34, 106, -117, 160, 111, -93, -105, -263, -173, 279, 109, -264, 73, 5, -176, 0, 11, -32, 215, 283, 94, 101, -127, -81, -228, -1, 153, 311, -26, 31, 128, 23, -92, -54, 97, 233, -49, -155, -24, 14, -44, 80, 100, 123, 98, -142, 293, 97, 138, -7, -77, -197, 65, -70, -203, 67, 160, -134, 189, 20, -267, 75, -187, -14, -154, 297, 74, 279, 72, 227, 10, -7, -198, -181, 158, 3, -214, -2, -146, -5, -8, -242, 31, -19, -102, 247, -36, -168, -50, -21, -63, -25, -113, 22, -2, 324, -195, 148, -30, -210, 51, 12, 123, 189, -341, -191, 105, -28, -20, -123, -248, 32, 93, -119, 53, 185, 31, 120, 147, 58, 171, 258, 77, -6, 311, 23, -82, 207, 46, 13, 187, 220, 282, 125, -70, 205, -5, 47]
4128D7j72K13j36J4N5j33J97J26j85k24O0K16n4P3k1nk5j37J92M9o8r7k58K92
4152A9J91j77m4j8j29k0J18qJ82j92l5J22k81M35j39j6l7J93l48L58k05J9OK82
4176B76n86N02k73l7J81L7k16MJ64j0j07j52M54l06K64j08j41l1R5N5N5k2r5K2
4200B5J24l19M23n3j87o1m1k03L04J31m49K95%M6j3J6J96k64j52J87r6M9j32M13
4224B39j70q5N2j04q0L47j25j34J1j26L77k81K1J32j50L2r4K84OJ36k2l60P8J70
4248A54k31J24J45Ml38K0L00q6k09R2K03l49j08K85j09N2J93k91K53o1m5m45M49
4271Bj63lQ5p6L42l50K18J48m94N77k33j31K91m63P7N7J22r1M2M6k45L22k01q3
4295b04J56J2q2N9P2k39N8J67J3MK38k03k1J55q4n0P2j45P6r5R6j13J48j42J68
$$ y = [47, -125, 88, -48, -34, 21, -112, 85, 211, 26, -198, -138, 78, 24, 97, 76, 71, 46, -91, 101, 150, 82, -15, -273, 19, 210, 33, -11, -29, -158, -178, -60, -68, 114, -78, -113, 9, -272, 163, 24, 8, -29, 164, -184, 174, -31, -12, -6, 276, -310, 192, -81, -118, 63, 100, -116, -112, 52, 42, -65, -217, 237, -69, 195, 87, -54, -85, 10, 65, 120, 98, 3, 25, 149, -170, 253, 200, 13, -48, -89, -292, 12, 143, -306, -11, -11, 35, 22, 38, 234, -30, -182, 5, -91, -42, -174, 239, 69, -16, 36, -68, -148, 199, 74, -60, -49, -175, 202, -79, -58, 74, -76, -44, -138, 146, 152, 288, 266, -94, -16, 154, -77, 47, 192, 196, -142, -122, 178, 92, -117, -25, 178, -171, -279, 6, -103, -51, 142, -149, 104, 43, -2, -447, 2, -161, -164, -79, -155, 187, -163, 55, 203, -291, 286, 53, -78, 213, -250, -173, -116, 6, -85, -43, 3, -242, 80, -121, -204, -48, -36, -118, -59, 13, -226, -168, -1, 12, 16, 254, 51, 30, 185, 101, 51, 123, -22, 54, -41, 55, -58, 90, -52, 116]
4320A16mj36k19j4K93Q3k15N5J50j89r4K80p8N4j88P4J63j72P9Qn1o9J36l24K20
4345d2J94j00M7K9j03j51l7J98j85L26K02n12k6N6O3p0L27k49j94K77k19M50j44
4368A37p4r8r8L96l53J25j16J36j67l0J76q8L3q6N4o6K36k05j1M01m41P6M6l7
4392e4K4M1k27k1LK06M81m96j04k8R7K42l3k53k16L58j74J23Q3j3p1k4K14m16
4416b58J86J38N4k78M10m5l57O8K23j67j55J45K65j36L9j44p3K23l35L44j98J39
4438H8j66N1K5j66L67j58k4P0m1l55K73J81l11K45k22K59o1M3k75R2k5q5M32l07
4462g0K42O3k02qm75L87J21L7L2k58K8K86k55j27J68Q0L05k56q6Q7J35m65L00
4485F9K1j73N9j01J93j22jK03q1J48l40N4K18j89k1J80r9j18O2k76J75q3J85q3
$$ y = [116, 112, -24, -243, -257, 36, 119, -96, -41, 109, -80, -174, 106, 28, 82, -106, -32, 131, -41, 38, 46, -5, -74, 62, -262, -42, 152, 52, 99, 128, 25, -126, -163, 35, -150, 176, 378, -134, -160, -104, -41, -111, 216, -33, -227, 50, -169, 281, 137, 63, -35, -133, 263, -90, 35, -81, 55, -112, -142, 34, -54, -21, -107, -53, -119, 117, -88, -99, 302, -139, -63, -17, -54, -30, 11, -216, -237, -234, -28, 453, -43, -147, -175, -78, 164, 131, -122, -338, 20, -154, -31, 52, 39, -32, -56, 158, -258, -72, 66, 120, -158, 252, 207, -150, -82, 141, -26, -181, -36, 229, 93, 132, -12, -85, 138, -197, 147, -51, 88, -78, -27, -2, -168, 199, 41, 17, 87, 46, -309, -36, 145, -166, 79, -143, 116, 55, 98, -177, -85, -110, -195, 237, -70, 172, 235, 33, 25, -450, -63, 58, 95, 127, -131, -103, 183, -72, -199, -31, 49, 354, 98, 12, 99, 234, -231, 69, 90, -83, -24, -125, 68, -54, -55, 148, 67, 215, -125, -71, 147, -42, -63, 117, 18, -100, -38, -314, -139, -222, -37, -120]
4509a20K02o9J0j25J17j91J86j73J46m3J44M3m20J35r3K42J25M2k40J53j10J15
4531G6j20J20k42L41j91k9k6J98k36R8J22J3m7k04J29K54m2J1m03j09M35N0l42
$$ y = [-120, 82, 13, 23, -102, 15, -176, 10, -163, -17, -60, 84, 127, -293, -158, -251, -9, 116, 158, -82, 71, -39, 76, -44, 76, -166, 175, -16, -45, -71, 127, -109, -11, 111, 124, 77, -127, 2, 256, 214, 225, -178, -287, 148, 198, -144]
$$ [...]
8191a03
##END NTUPLES=NMR FID
##END=
