##TITLE=1H_K-319
 DMSO-d6, 8 sc, 
 23.10.2019
##JCAMPDX= 6.0         $$ Bruker NMR JCAMP-DX V2.0
##DATA TYPE= NMR FID
##DATA CLASS= NTUPLES
##ORIGIN= UXNMR, Bruker Analytische Messtechnik GmbH
##OWNER= root
$$ XWIN-NMR		Version 3.5
$$ Wed Oct 23 15:52:13 2019 Russian Standard Time (UT+4h)  she@DPX200
##.OBSERVE FREQUENCY= 200.1315
##.OBSERVE NUCLEUS= ^1H
##.DELAY= (6, 6)
##.ACQUISITION MODE= SIMULTANEOUS
##.ACQUISITION SCHEME= undefined
##.AVERAGES= 8
##.DIGITISER RES= 18
##SPECTROMETER/DATA SYSTEM= spect
##.PULSE SEQUENCE= zg30
##.SOLVENT NAME= CDCl3
##.SHIFT REFERENCE= (INTERNAL, CDCl3, 0, 15.7039)
##AUDIT TRAIL= $$ (NUMBER, WHEN, WHO, WHERE, WHAT)
$$ ##TITLE= Audit trail, XWIN-NMR		Version 3.5
$$ ##JCAMPDX= 5.01
$$ ##ORIGIN= Bruker BioSpin GmbH
$$ ##OWNER= she
$$ F:/spectra/data/she/nmr/H-F/1/audita.txt
$$ ##AUDIT TRAIL=  $$ (NUMBER, WHEN, WHO, WHERE, WHAT)
(   1,<2019-10-23 15:51:21.53 +0400>,<she>,<DPX200>,
      <created by zg, POWCHK disabled, PULCHK disabled
       configuration hash MD5:
       00 E9 B6 7A A2 85 ED C7 34 08 36 98 17 FE 4E 26
       data hash MD5: 16K
       E9 06 A5 D3 11 67 29 4E 00 78 31 A9 EB 92 1C DA>)
$$ ##END=
$$ 
$$ hash MD5
$$ 7D 0A 3B FD 31 79 1D 2B 38 5F 6F C3 09 93 39 FB
##$RELAX= 
##$RELAX= 
##$RELAX= 
##$RELAX= 
##$RELAX= 
##$RELAX= 
$$ Bruker specific parameters
$$ --------------------------
##$DU= <F:/spectra>
##$EXPNO= 1
##$NAME= <H-F>
##$PROCNO= 1
##$TYPE= <nmr>
##$USER= <she>
##$AMP= (0..31)
100 100 100 100 100 100 100 100 100 100 100 100 100 100 100 100 100 100 
100 100 100 100 100 100 100 100 100 100 100 100 100 100 
##$AQSEQ= 0
##$AQ_mod= 1
##$AUNM= <au_zg>
##$AUTOPOS= <>
##$BF1= 200.13
##$BF2= 200.13
##$BF3= 200.13
##$BF4= 200.13
##$BF5= 200.13
##$BF6= 200.13
##$BF7= 200.13
##$BF8= 200.13
##$BYTORDA= 1
##$CFDGTYP= 0
##$CFRGTYP= 5
##$CHEMSTR= <none>
##$CNST= (0..31)
1 1 145 1 1 1 1 1 1 1 1 1 1 1 1 1 1 1 1 1 1 1 1 1 1 1 1 1 1 1 1 1 
##$CPDPRG= <>
##$CPDPRG1= <>
##$CPDPRG2= <>
##$CPDPRG3= <>
##$CPDPRG4= <mlev>
##$CPDPRG5= <mlev>
##$CPDPRG6= <mlev>
##$CPDPRG7= <mlev>
##$CPDPRG8= <mlev>
##$CPDPRGB= <>
##$CPDPRGT= <>
##$D= (0..31)
0 1.2 0 0 0 0 0 0 0 0.06 0 0.03 0 0 0 0 0.0002 0 0 0 0 0 0 0 0 0 0 0 0 
0 0 0 
##$DATE= 1571831481
##$DBL= (0..7)
120 120 120 120 120 120 120 120 
##$DBP= (0..7)
150 150 150 150 150 150 150 150 
##$DBP07= 0
##$DBPNAM0= <>
##$DBPNAM1= <>
##$DBPNAM2= <>
##$DBPNAM3= <>
##$DBPNAM4= <>
##$DBPNAM5= <>
##$DBPNAM6= <>
##$DBPNAM7= <>
##$DBPOAL= (0..7)
0.5 0.5 0.5 0.5 0.5 0.5 0.5 0.5 
##$DBPOFFS= (0..7)
0 0 0 0 0 0 0 0 
##$DE= 6
##$DECBNUC= <off>
##$DECIM= 24
##$DECNUC= <off>
##$DECSTAT= 4
##$DIGMOD= 1
##$DIGTYP= 9
##$DL= (0..7)
0 120 120 120 120 120 120 120 
##$DP= (0..7)
150 150 150 150 150 150 150 150 
##$DP07= 0
##$DPNAME0= <>
##$DPNAME1= <>
##$DPNAME2= <>
##$DPNAME3= <>
##$DPNAME4= <>
##$DPNAME5= <>
##$DPNAME6= <>
##$DPNAME7= <>
##$DPOAL= (0..7)
0.5 0.5 0.5 0.5 0.5 0.5 0.5 0.5 
##$DPOFFS= (0..7)
0 0 0 0 0 0 0 0 
##$DQDMODE= 0
##$DR= 18
##$DS= 0
##$DSLIST= <SSSSSSSSSSSSSSS>
$$ [...]
##$SUBNAM2= <"">
##$SUBNAM3= <"">
##$SUBNAM4= <"">
##$SUBNAM5= <"">
##$SUBNAM6= <"">
##$SUBNAM7= <"">
##$SUBNAM8= <"">
##$SUBNAM9= <"">
##$SW= 24.0689530833862
##$SWIBOX= (0..15)
0 0 2 0 0 0 0 0 0 0 0 0 0 0 0 0 
##$SW_h= 4816.95568400771
##$TD= 16384
##$TD0= 1
##$TE= 0
##$TE2= 300
##$TE3= 300
##$TEG= 300
##$TL= (0..7)
0 120 120 120 120 120 120 120 
##$TP= (0..7)
150 150 150 150 150 150 150 150 
##$TP07= 0
##$TPNAME0= <>
##$TPNAME1= <>
##$TPNAME2= <>
##$TPNAME3= <>
##$TPNAME4= <>
##$TPNAME5= <>
##$TPNAME6= <>
##$TPNAME7= <>
##$TPOAL= (0..7)
0.5 0.5 0.5 0.5 0.5 0.5 0.5 0.5 
##$TPOFFS= (0..7)
0 0 0 0 0 0 0 0 
##$TUNHIN= 0
##$TUNHOUT= 0
##$TUNXOUT= 0
##$USERA1= <user>
##$USERA2= <user>
##$USERA3= <user>
##$USERA4= <user>
##$USERA5= <user>
##$V9= 5
##$VALIST= <valist>
##$VCLIST= <CCCCCCCCCCCCCCC>
##$VD= 0
##$VDLIST= <DDDDDDDDDDDDDDD>
##$VPLIST= <PPPPPPPPPPPPPPP>
##$VTLIST= <TTTTTTTTTTTTTTT>
##$WBST= 1024
##$WBSW= 4
##$XGAIN= (0..3)
0 0 0 0 
##$XL= 0
##$YL= 0
##$YMAX_a= 150330
##$YMIN_a= -105109
##$ZGOPTNS= <>
##$ZL1= 120
##$ZL2= 120
##$ZL3= 120
##$ZL4= 120
##$ABSF1= 10
##$ABSF2= 0
##$ABSG= 5
##$ABSL= 3
##$ALPHA= 0
##$AQORDER= 0
##$ASSFAC= 0
##$ASSFACI= 0
##$ASSFACX= 0
##$ASSWID= 0
##$AUNMP= <proc_1d>
##$AZFE= 0.1
##$AZFW= 0.1
##$BCFW= 1
##$BC_mod= 2
##$BYTORDP= 1
##$COROFFS= 0
##$CY= 11.3945322036743
##$DATMOD= 1
##$DC= 2
##$DFILT= <>
##$DTYPP= 0
##$F1P= 20.1720416913024
##$F2P= 0.152960286110954
##$FCOR= 0.5
##$FTSIZE= 0
##$FT_mod= 4
##$GAMMA= 1
##$GB= 0.15
##$INTBC= 1
##$INTSCL= 1
##$ISEN= 128
##$LB= 0.24
##$LEV0= 0
##$LPBIN= 0
##$MAXI= 10000
##$MC2= 0
##$MEAN= 0
##$ME_mod= 0
##$MI= 1.114404
##$NCOEF= 0
##$NC_proc= 0
##$NLEV= 6
##$NOISF1= 3.799351
##$NOISF2= 2.8
##$NSP= 1
##$NTH_PI= 0
##$NZP= 0
##$OFFSET= 15.70392
##$PC= 1
##$PHC0= -9573.942
##$PHC1= 16.4008
##$PH_mod= 1
##$PKNL= yes
##$PPARMOD= 0
##$PSCAL= 0
##$PSIGN= 0
##$REVERSE= no
##$SF= 200.130013532006
##$SI= 16384
##$SIGF1= 3
##$SIGF2= 2
##$SINO= 400
##$SIOLD= 16384
##$SREGLST= <1H.CDCl3>
##$SSB= 0
##$STSI= 0
##$STSR= 0
##$SW_p= 3612.71676300578
##$SYMM= 0
##$S_DEV= 0
##$TDeff= 0
##$TDoff= 0
##$TI= <>
##$TILT= no
##$TM1= 0
##$TM2= 0
##$TOPLEV= 0
##$USERP1= <user>
##$USERP2= <user>
##$USERP3= <user>
##$USERP4= <user>
##$USERP5= <user>
##$WDW= 1
##$XDIM= 8192
##$YMAX_p= 0
##$YMIN_p= 0
$$ End of Bruker specific parameters
$$ ---------------------------------
##NTUPLES= NMR FID
##VAR_NAME=  TIME,          FID/REAL,        FID/IMAG
##SYMBOL=    X,             R,               I
##VAR_TYPE=  INDEPENDENT,   DEPENDENT,       DEPENDENT
##VAR_FORM=  AFFN,          ASDF,            ASDF
##VAR_DIM=   8192,          8192,            8192
##UNITS=     SECONDS,       ARBITRARY UNITS, ARBITRARY UNITS
##FACTOR=    0.0002076,     1,               1
##FIRST=     0,             0,               0
##LAST=      1.7004516,     0,               0
##MIN=       0,             -105109,         0
##MAX=       1.7004516,     150330,          0
$$ Real data points
##PAGE= N=1
##DATA TABLE= (X++(R..R)), XYDATA
$$ plain form
0 0 0 0 0 0 0 0 0 0 8 -8 8 -8 9 -16 16 -24 24 -32 39 -41 49 -57 69 -79 89 -104 120 -136 152 -174 192 -217
32 -217 245 -273 305 -342 378 -420 468 -518 574 -635 703 -779 862 -956 1062 -1183 1322 -1484
50 -1484 1673 -1902 2181 -2534 2995 -3625 4545 -6020 8781 -15782 73031 108324 -2166 29585
64 29585 105087 150330 83898 14795 8182 68931 95740 68975 20519 14214 32378 47832 42959
77 42959 39988 30951 10627 -8538 6366 38857 38610 -13315 -57325 -38631 20651 37859 -14012
90 -14012 -73194 -62502 5163 46327 11548 -52137 -63100 -6765 46636 33856 -26280 -58069
102 -58069 -26056 25853 33619 -6776 -42690 -33407 3997 25624 15596 -6780 -15862 -6900 10133
115 10133 25374 27253 6749 -21693 -25133 9329 40476 19576 -38012 -59534 -12779 42267
$$ packed form
0@%%%%%%%%Qj6J6j6J7k5L2m0M8n6P1q0R0j06J26j48J68j93K24k56K88l26L66m09
32b17M62n18N78o47P20p98Q88r86J092j209J338j482J641j818K018k245K505k806
50a484L157l575M083m715N529o620Q170j0565J4801k4563Q8813L5293j10490L1751
64B9585P5502M5243o6432o9103o613O0749K6809k6765m8456o305J8164J5454m873
77D2959k971r037k0324j9165J4904L2491k47n1925m4010J8694N9282J7208n1871
90a4012n9182J0692O7665M1164l4779o3685j0963N6335N3401j2780o0136l1789
102e8069L2013N1909P766m0395l5914R283L7404K1627j0028k2376r082Q962J7033
115A0133J5241J879k0504k8442l440L4462L1147k0900n7588k1522M6755N5046
$$ plain form
127 42267 32133 -31318 -64595 -23486 37661 42311 -11015 -50937 -31210 14738 28977 -878
139 -878 -34847 -39959 -20732 -554 4699 -9092 -32305 -42320 -22185 11878 19644 -11505 -45732
152 -45732 -38687 2997 26929 999 -45685 -58200 -24909 11192 5405 -34432 -61578 -44952
164 -44952 -4289 14370 -7335 -41121 -46320 -16864 15614 15311 -15355 -41017 -31868 843 20040
177 20040 6042 -23683 -35044 -14560 18584 32819 13009 -17192 -18947 17806 55059 47379
189 47379 3479 -22001 5653 50939 55915 13282 -23250 -10856 30416 46299 20942 -10287
201 -10287 -12346 10311 27380 24462 10631 -4757 -13346 -7281 11628 20632 -1819 -38711 -45797
214 -45797 -10626 22348 5400 -44070 -62867 -24154 24631 21428 -27083 -56495 -28930 19545
$$ packed form
127D2267j0134o3451l3277M1109O1147M650n3326l9922J9727M5948J4239k9855
139h78l3969n112J9227K0178N253j3791k3213j0015K0135L4063P766l1149l4227
152d5732P045M1684K3932k5930m6684j2515L3291L6101n787l9837k7146J6626
164d4952M0663J8659k1705l3786n199K9456L2478l03l0666k5662R149L2711J9197
177B0040j3998k9725j1361K0484L3144J4235j9810l0201j755L6753L7253p680
189D7379m3900k5480K7654M5286M976m2633l6532J2394M1272J5883k5357l1229
201a0287k059K2657J7069k918j3831j5388q589O065J8909R004k2451l6892p086
214d5797L5171L2974j6948m9470j8797L8713M8785l203m8511k9412K7565M8475
$$ plain form
226 19545 28909 -7550 -41425 -32489 3397 22568 8066 -16760 -22639 -5918 15310 23614 15975
239 15975 2939 -1978 7829 26167 37978 27820 2701 -10363 7797 39015 42548 6089 -29197
252 -29197 -17009 30455 51939 15943 -32785 -31158 19854 52398 23841 -27835 -37497 2692
264 2692 34174 16596 -22695 -35418 -14314 5398 2615 -10290 -15592 -15398 -15162 -7810 7558 13019
278 13019 -5313 -27878 -21057 13674 31924 4581 -36432 -36839 6700 38405 16258 -31767 -41869
291 -41869 -1141 38841 29511 -13248 -34027 -8711 27877 31531 1272 -24790 -18937 6103 18079
304 18079 5840 -13303 -20285 -11639 -123 7125 5346 -5541 -18062 -16707 3231 21982 12987
317 12987 -18663 -33634 -9515 25871 25277 -14714 -43518 -22160 23271 34781 -1724 -36117
$$ packed form
226A9545R364l6459l3875Q936L5886J9171j4502k4826n879J6721K1228Q304p639
239A5975j3036m917R807J8338J1811j0158k5119j3064J8160L1218L533l6459l5286
252b9197J2188M7464K1484l5996m8728J627N1012L2544k8557n1676r662M0189
264B692L1482j7578l9291j2723K1104J9712k783j2905n302J94K36P352J5368N461
278A3019j8332k2565O821L4731J8250k7343m1013m07M3539L1705k2147m8025j0102
291d1869M0728L9982r330m2759k0779K5316L6588L654l0259k6062N853K5040J1976
304A8079j2239j9143o982Q646J1516P248j779j0887j2521J355J9938J8751q995
317A2987l1650j4971K4119L5386n94l9991k8804K1358M5431J1510l6505l4393
$$ plain form
329 -36117 -22777 19134 36493 11729 -17780 -17231 6751 22818 16173 -776 -10743 -8996 384
342 384 12126 14344 1647 -15803 -16901 4814 25563 17374 -12823 -28086 -7632 23422 24434
355 24434 -7547 -33898 -23448 9174 22632 1222 -28229 -31209 -4941 18546 13403 -11622
367 -11622 -26003 -13743 10013 18826 4544 -14659 -19219 -5468 11479 15058 570 -17089 -17678
380 -17678 905 21097 18878 -4450 -21821 -9185 20768 32170 9218 -21054 -19969 10533
392 10533 30613 14719 -16562 -24568 -3166 18923 15564 -5106 -17911 -12580 2325 11850 8879
405 8879 -4240 -16785 -15756 672 15367 8069 -16904 -30891 -13431 15496 19252 -9389 -33843
418 -33843 -21925 12357 26073 3917 -24123 -22698 4958 23828 13751 -10250 -19431 -5720
$$ packed form
329c6117J3340M1911J7359k4764k9509N49K3982J6067o645j6949r967J747R380
342C84J1742K218j2697j7450j098K1715K0749q189l0197j5263K0454L1054J012
355B4434l1981k6351J0450L2622J3458k1410k9451k980K6268K3487n143k5025
367a1622j4381J2260K3756Q813j4282j9203m560J3751J6947L579j4488j7659n89
380a7678J8583K0192k219k3328j7371J2636K9953J1402k2952l0272J085L0502
392A0533K0080j5894l1281q006K1402K2089l359k0670j2805N331J4905R525k971
405H879j3119j2545J029J6428J4695p298k4973j3987J7460K8927L756k8641k4454
418c3843J1918L4282J3716k2156k8040J425K7656J8870j0077k4001r181J3711
$$ plain form
430 -5720 13268 16530 3619 -9998 -11171 300 13044 15656 5532 -8345 -10828 2849 19765
443 19765 19181 -1691 -19919 -13062 13136 26052 6722 -23291 -26563 3270 28383 16224 -17961
456 -17961 -30025 -4586 24927 21214 -7484 -23504 -9011 14356 18245 2924 -10043 -8082 1685
469 1685 8976 11150 9182 725 -7029 -2391 15311 26338 13280 -10902 -13909 12337 34799 22861
483 22861 -10816 -22197 2676 32188 26833 -5284 -24100 -7076 21395 25708 2490 -18832
495 -18832 -14039 6831 17333 6956 -9332 -14760 -6991 3375 6592 1663 -8377 -14650 -10578
508 -10578 2657 12131 5214 -12770 -20220 -4415 18580 19441 -4979 -24744 -12735 18957 28822
521 28822 3920 -23095 -17584 13366 28952 11740 -14759 -17178 4339 20590 13596 -4450 -11847
$$ packed form
430e720J8988L262j2911j3617j173J1471J2744K612j0124j3877k483J3677J6916
443A9765n84k0872j8228O857K6198J2916j9330l0013l272K9833K5113j2159l4185
456a7961j2064K5439K9513l713k8698j6020J4493K3367L889j5321j2967J961R767
469A685P291K174j968q457p754M638J7702J1027j3058k4182l007K6246K2462j1938
483B2861l3677j1381K4873K9512n355l2117j8816J7024K8471M313k3218k1322
495a8832M793K0870J0502j0377j6288n428P769J0366L217m929j0040o273M072
508a0578J3235R474o917j7984p450J5805K2995Q61k4420j9765J2009L1692R865
521B8822k4902k7015N511L0950J5586j7212k6499k419K1517J6251o994j8046p397
$$ plain form
534 -11847 -4903 4842 7672 4173 -3510 -11968 -13069 -2712 9447 5846 -13361 -26154 -14427 9037
548 9037 13876 -8092 -29719 -22924 4235 17742 1140 -23881 -25785 -2427 16984 10306 -11112
561 -11112 -20331 -7417 11565 15595 3603 -8716 -8435 3736 14669 14875 4682 -4896 -4392 7352
575 7352 18508 17290 1977 -10626 -4724 14824 23932 9235 -14143 -16185 4956 22931 13444
588 13444 -12579 -23150 -6080 15427 14188 -6569 -21342 -13242 4046 9866 501 -11867 -14356
601 -14356 -6611 2887 7223 2810 -8251 -13579 -5000 11922 17403 3048 -13647 -10335 12438 26413
615 26413 14912 -8312 -12946 7379 27322 22338 -158 -11745 501 19980 23115 8225 -5731
628 -5731 -4832 7901 17347 13881 1900 -6427 -4335 5634 12581 8658 -4061 -13219 -7935 6457
$$ packed form
534a1847O944R745K830l499p683q458j101J0357J2159l601j9207j2793J1727K3464
548I037M839k1968k1627O795K7159J3507j6602k5021j904K3358J9411o678k1418
561a1112r219J2914J8982M030j1992j2319K81J2171J0933K06j0193r578N04J1744
575G352J1156j218j5313j2603N902J9548R108j4697k3378k042K1141J7975r487
588A3444k6023j0571J7070K1507j239k0757j4773Q100J7288N820r365j2368k489
601a4356P745R498M336m413j1061n328Q579J6922N481j4355j6695L312K2773J3975
615B6413j1501k3224m634K0325J9943m984k2496j1587J2246J9479L135j4890j3956
628e731Q99J2733R446l466j1981q327K092R969O947l923j2719r158N284J4392
$$ plain form
642 6457 13700 3021 -14954 -17897 -537 17107 12793 -9721 -21530 -7125 15705 18498 -1556
655 -1556 -19140 -11312 10125 18853 6050 -9889 -9959 3791 14045 12155 2946 -2711 -1983 4193
669 4193 11332 13650 5199 -6893 -8309 5487 18435 12358 -7769 -17413 -3251 17956 17937 -4009
683 -4009 -20379 -10249 12528 19145 1781 -16982 -14736 3184 14180 5830 -9623 -14618 -5613
696 -5613 5701 7910 524 -8006 -9868 -3469 5507 8947 1519 -9426 -12417 -2247 10442 9195
710 9195 -7090 -20402 -13278 6354 13085 -2947 -22698 -22027 -1148 12674 1709 -20040 -25404
723 -25404 -9462 6137 1727 -14983 -23967 -16725 -5239 -2090 -8245 -15890 -18322 -14391 -6606 -222
737 -222 -2589 -12579 -19064 -11427 4751 9934 -3625 -19261 -15957 4480 16774 5028 -14644 -17015
$$ packed form
642F457P243j0679j7975k943J7360J7644m314k2514j1809J4405K2830K793k0054
655a556j7584P828K1437Q728j2803j5939p0J3750J0254j890r209n657P28O176
669D193P139K318q451j2092j416J3796J2948o077k0127r644J4162K1207j9k1946
683d009j6370J0130K2777O617j7364j8763K246J7920J0996q350j5453m995R005
696e613J1314K209p386q530j862O399Q976L440p428j0945k991J0170J2689j247
710I195j6285j3312P124J9632O731j6032j9751O71K0879J3822j0965k1749n364
723b5404J5942J5599m410j6710q984P242J1486L149o155p645k432L931P785O384
737b22k367r990o485P637J6178N183j3559j5636L304K0437J2294j1746j9672k371
$$ plain form
751 -17015 1801 18739 13338 -4853 -12930 -1393 14625 16666 4384 -7030 -5249 4849 11653
764 11653 8414 -748 -7303 -6054 2091 8315 6042 -4391 -12596 -8017 5253 11961 1688 -14101
778 -14101 -16696 -1264 12844 7249 -12219 -21350 -9031 9916 11239 -5445 -18172 -11185 6274
791 6274 13381 3294 -8118 -8005 2150 10129 9930 2940 -2818 -3704 2405 10471 12888 4386 -5795
806 -5795 -4744 8527 19940 13884 -3214 -9895 3594 20262 18759 -295 -12033 -3946 13601
819 13601 17446 3245 -10950 -9224 4226 12603 6823 -4503 -9376 -3143 5544 8371 3333 -4815
833 -4815 -8492 -4178 4634 7915 710 -10701 -12519 -1836 10189 7878 -6406 -15883 -7099 10028
847 10028 14850 785 -14375 -10891 6237 15847 6090 -9709 -12883 -308 10683 8377 -3123
$$ packed form
751a7015J8816J6938n401j8191q077J1537J6018K041j2282j1414J781J0098O804
764A1653l239r162o555J249Q145O224k273j0433q205M579J3270O708j0273j5789
778a4101k595J5432J4108n595j9468r131J2319J8947J323j6684j2727O987J7459
791F274P107j0087j1412J13J0155P979j99o990n758q86O109Q066K417q502j0181
806e795J051J3271J1413o056j7098o681J3489J6668j503j9054j1738Q087J7547
819A3601L845j4201j4195J726J3450Q377n780j1326m873O233Q687K827n038q148
833d815l677M314Q812L281p205j1411j818J0683J2025k311j4284r477Q784J7127
847A0028M822j4065j5160L484J7128R610r757j5799l174J2575J0991k306j1500
$$ plain form
860 -3123 -9306 -4628 4180 8424 5607 -890 -5269 -3157 4699 10874 7216 -4165 -10723 -2655 10906
875 10906 13134 -528 -13483 -8905 8648 17099 5728 -10218 -10299 4730 16622 10704 -4167
888 -4167 -9870 -1296 10071 11004 1483 -6512 -5599 1561 7657 7315 932 -5371 -5184 2205 10327 8468
904 8468 -1974 -10152 -5280 7246 12552 1782 -12474 -13528 1435 12686 6165 -9844 -16101
917 -16101 -3835 10867 9675 -3949 -13068 -7396 5041 8800 1266 -7834 -8716 -2782 3564 4278
931 4278 -114 -6208 -7591 -2459 6584 9385 1034 -8974 -7324 5432 14757 7697 -7556 -11886
945 -11886 166 14348 11107 -4015 -12989 -4141 10306 12884 1594 -8528 -6375 4427 10650
958 10650 6127 -2529 -6581 -3333 3079 6260 2456 -4730 -9485 -5593 3139 7200 598 -10066 -11175
$$ packed form
860c123o183M678Q808M244k817o497m379K112P856O175l658j1381o558Q068J3561
875A0906K228j3662j2955M578J7553Q451j1371j5946q1J5029J1892n918j4871
888d167n703Q574J1367R33r521p995R13P160O096l42o383o303J87P389Q122j859
904H468j0442q178M872J2526N306j0770j4256j054J4963J1251o521j6009o257
917a6101J2266J4702j192j3624r119N672J2437L759p534r100q82N934O346P14
931D278m392o094j383N132R043K801q351j0008J650J2756R325p060j5253m330
945a1886J2052J4182l241j5122q974Q848J4447K578j1290j0122K153J0802O223
958A0650m523q656m052L248O412L181l804p186m755L892Q732M061o602j0664j109
$$ plain form
973 -11175 -557 10076 7281 -6265 -14082 -5645 8710 10947 -2116 -14177 -10021 4253 10929
986 10929 2628 -9181 -9804 49 8914 7086 -822 -5980 -3150 3188 6755 5813 -351 -5814 -4896
1001 -4896 2688 9131 5325 -5560 -11009 -2309 9832 10463 -1867 -12683 -7155 7419 12640 1931
1015 1931 -10977 -10715 1338 9875 4508 -6961 -10786 -3730 5071 6457 466 -5590 -5730 231 6195
1030 6195 7275 1902 -4544 -4992 2353 9976 8247 -1563 -8617 -3214 9086 12897 3781 -7880 -7382
1045 -7382 6152 15011 8421 -5170 -9099 800 11355 9483 -1928 -9215 -4854 4251 6930 1109
1059 1109 -5614 -7204 -3125 2097 4471 848 -5584 -8648 -3362 5217 6576 -2237 -11356 -9360 2814
1074 2814 10028 2951 -9721 -11975 477 11084 8441 -3902 -9691 -1922 9456 10942 2410 -5431
$$ packed form
973a1175J0618J0633k795j3546p817Q437J4355K237j3063j2061M156J4274O676
986A0929q301j1809o23R853Q865j828p908n158K830O338L567r42o164n463R18
1001d896P584O443l806j0885n449Q700J2141O31j2330j0816N528J4574N221j0709
1015A931j2908K62J2053Q537n367j1469l825P056Q801J386n991o056j40N961N964
1030F195J080n373o446m48P345P623j729r810p054N403J2300L811r116j1661M98
1045g382J3534Q859o590j3591l929R899J0555j872j1411p287M361R105K679n821
1059A109o723j590M079N222K374l623o432l064N286Q579J359q813r119J996J2174
1074B814P214p077j2672k254J2452J0607k643j2343n789P769J1378J486q532p841
$$ plain form
1088 -5431 -3738 4070 8881 6294 -26 -3941 -1944 3821 8139 6010 -1532 -5538 -2033 6343 9719
1103 9719 2719 -7810 -8515 896 9616 5329 -7888 -13617 -5161 6391 6665 -4280 -13549 -9313
1117 -9313 2489 6465 -72 -9232 -9924 -2555 3456 2530 -3422 -7956 -7028 -2055 2486 2547 -2912 -8409
1133 -8409 -7119 1086 7321 3434 -6792 -10652 -1952 9083 8293 -3688 -12067 -5942 6202 9671
1147 9671 -132 -10437 -8803 1709 8122 3844 -5120 -7705 -2678 4438 5572 730 -4736 -5580 -1437
1162 -1437 4165 5508 440 -6258 -6320 898 8134 6486 -3122 -8767 -2867 7948 10690 1259 -8593
1177 -8593 -6667 4751 11413 4989 -6041 -8603 -115 8089 6369 -2385 -7624 -3826 3154 5486
1191 5486 2151 -3644 -5465 -2909 2460 5119 1868 -5222 -7901 -2677 5424 6984 -1628 -9620 -6601
$$ packed form
1088e431J693P808M811k587o320l915J997N765M318k129p542m006L505Q376L376
1103I719p000j0529p05R411Q720m287j3217n729Q456J1552K74j0945r269M236
1117i313J1802L976o537r160o92P369O011r26n952m534R28M973M541O1n459n497
1133h409J290Q205O235l887j0226l860Q700J1035p90j1981q379O125J2144L469
1147I671r803j0305J634J0512O413m278q964k585N027P116J134m842n466q44M143
1162a437N602J343n068o698o2P218P236j648r608n645N900J0815K742r431r852
1177h593J926J1418O662o424j1030k562Q488Q204j720q754n239L798O980K332
1191E486l335n795j821K556N369K659l251p090k679N224Q101J560q612p992L019
$$ plain form
1206 -6601 4914 10213 3456 -7277 -7948 2648 11248 7949 -2860 -6738 -263 8788 9535 2525
1220 2525 -3313 -1854 4361 8705 7189 1844 -1605 -519 4937 9032 6745 -391 -4513 -1049 7140
1235 7140 9277 1881 -6792 -6763 2306 8973 4582 -6162 -10099 -2505 6680 6334 -3450 -10299 -6765
1250 -6765 2180 5357 -150 -7368 -8218 -2997 2599 2464 -2087 -6126 -6102 -1303 4108 4207 -1410 -7058
1266 -7058 -5031 3242 8714 4172 -5656 -7776 1090 9841 7790 -2037 -8165 -2449 7968 9920 1971
1281 1971 -5708 -4183 3769 8182 5092 -1988 -4484 -1327 3679 5202 1885 -3196 -5339 -1946 3725
1296 3725 5719 -90 -6525 -6764 128 6921 3946 -5536 -10089 -4056 5476 6443 -2387 -10525 -7330
1311 -7330 2539 6821 785 -7656 -8667 -1346 4969 3443 -2670 -6830 -4449 542 3595 1596 -2992
$$ packed form
1206f601J1515N299o757j0733o71J0596Q600l299j0809l878O475R051P47p010
1220B525n838J459O215M344j516n345l449J086N456M095k287p136m122L464Q189
1235G140K137p396q673K9R069O667m391j0744l937P594R185l46r784o849L534
1250f765Q945L177n507p218q50N221N596j35m551m039K4M799N411R9n617n648
1266g058K027Q273N472m542r828k120Q866Q751k051r827o128N716J0417J952p949
1281A971p679J525P952M413l090p080k496L157N006J523l317n081k143L393N671
1296C725J994n809o435k39O892O793k975r482m553O033R532R67q830q138L195
1311g330R869M282o036q441j011P321O315j526o113m160K381M991L053j999m588
$$ plain form
1326 -2992 -5889 -4050 1770 4934 1851 -5196 -7554 -1467 6161 5735 -1903 -9142 -5433 4534 7843
1341 7843 1065 -7884 -7729 1580 7906 3804 -5072 -7371 -2165 4639 5141 -778 -5187 -4607 32 3867
1357 3867 3241 -1033 -4704 -4399 822 5387 3870 -2953 -6874 -3144 5148 7482 744 -7359 -6261
1372 -6261 2977 8665 4302 -5221 -7343 -209 7413 6476 -1634 -6758 -2904 4313 6569 2285 -2926
1387 -2926 -4063 146 4432 4941 1638 -2806 -3657 503 5388 6201 181 -5690 -3607 4206 8622 3719
1403 3719 -5025 -6375 1315 8819 6741 -2322 -6602 -1361 7002 7722 1199 -4947 -3641 3124 6773
1418 6773 3968 -1551 -3771 -1148 3154 5506 2928 -1985 -4068 -1154 4507 5635 947 -5164 -5122
1433 -5122 1476 7104 4197 -4251 -7889 -2049 5930 6137 -1675 -7814 -5555 2691 6490 1643 -5446
$$ packed form
1326b992k897J839N820L164l083p047k358O087P628m26p638p239L709R967L309
1341G843o778q949J55R309O326m102q876k299N206O804N02n919m409N80M639L835
1357C867o26m274l671L05N221M565j517o823l921L730Q292K334o738q103J098
1372f261R238N688m363r523k122P134P622r37q110n124L854P217K256m284n211
1387b926j137M209M286N09l303m444q51M160M885Q13o020n871K083P813M416m903
1403C719q744j350P690P504k078r063m280N241Q363P20o523o146J306O765L649
1418F773k805n519k220K623M302K352k578m913k083K914N661J128m688o111M2
1433e122O598N628k907q448l638N840P979K07p812o139K259Q246L799m847p089
$$ plain form
1448 -5446 -6714 -812 4265 3469 -1727 -5172 -3733 862 3881 2231 -1590 -4932 -2796 2413 5714
1463 5714 2344 -4294 -5976 -127 6543 6133 -1669 -6857 -2929 5314 7825 1431 -6095 -5292 2445
1478 2445 7004 3736 -3084 -5392 -1339 3785 4683 472 -3812 -4274 -333 3379 3544 -725 -5006 -4399
1494 -4399 990 5117 3117 -3468 -7029 -2546 4955 6230 -542 -6932 -5023 2649 7317 2519 -4562
1509 -4562 -6068 222 6296 5117 -1356 -4903 -2560 3047 5545 2358 -2463 -3551 -816 3199 4458
1524 4458 1104 -3149 -4708 -173 4607 4461 -1654 -6800 -4544 3006 6373 755 -6642 -7141 350
1539 350 5900 3348 -4203 -7571 -2854 4129 4295 -866 -5618 -4485 707 4268 2333 -1698 -3916
1554 -3916 -2291 2228 4351 2595 -1983 -4571 -1358 4229 5866 787 -4537 -4425 2103 7053 3716
$$ packed form
1448e446j268N902N077p96n196l445J439M595L019j650l821l342K136N209L301
1463E714l370o638j682N849O670m10p802n188L928Q243K511o394p526Q03P737
1478B445M559l268o820k308M053N124Q98m211m284m62L941L712J65m269m281O07
1494d399N389M127k000o585l561M483P501J275o772o390J909P672M668m798p081
1509d562j506O290O074j179o473l547K343N607K498l187m821j088K735M015J259
1524D458l354m253j559M535M780j46o115n146K256P550L367n618p397m99P491
1539C50N550k552p551l368M717O983J66n161m752J133N192L561j935m031k218
1554c916J625M519K123j756m578k588L213N587J637n079n324J12O528M950l337
$$ plain form
1569 3716 -3896 -6604 -612 5611 5293 -1536 -6779 -4160 2543 5144 1007 -4791 -5405 -1566 2870
1584 2870 2486 -1657 -4629 -4301 -437 2861 2078 -2246 -5389 -3677 1880 5056 1668 -4433 -5928 -226
1600 -226 6222 5319 -1870 -6174 -2189 5336 6854 1099 -4516 -3520 2925 6537 3651 -1436 -3576 -491
1616 -491 3759 4937 1427 -2727 -3018 -245 3595 4034 -66 -4161 -3939 822 4466 2761 -3710 -6655
1632 -6655 -2433 4031 4843 -1449 -6901 -5088 1940 5233 1406 -5094 -6064 -455 4873 3728 -1506
1647 -1506 -4451 -2584 2056 4323 2464 -1799 -3148 -823 3368 4344 1919 -2351 -3244 779 5717
1662 5717 5529 -261 -4687 -2025 4725 6937 1919 -4538 -4364 1841 6237 3775 -2480 -5182 -1224
1677 -1224 3849 4623 202 -3641 -3447 582 3455 2677 -1099 -3775 -2473 1421 3616 2190 -2729 -4829
$$ packed form
1569C716p612k708N992O223l18o829n243K619O703K601m137n798o14L839M436
1584B870l84m143k972L28L864L298p83m324l143J712N557L176l388o101j495N702
1600b26O448r03p189m304L985P525J518n755n615R96O445L612k886n087k140L085
1616d91M250J178l510m154k91K773L840M39m100m095K22M761L644j705o471k945
1632f655M222O464Q12o292n452J813P028L293l827o500r70N609N328j145n234
1647a506k945J867M640K267j859m263j349K325M191R76k425m270q93M023M938
1662E717j88n790m426K662O750K212n018o457J74O205M396k462o255k702L958
1677a224N073P74m421l843J94M029K873p78l776k676J302L894K195j426m919k100
$$ plain form
1693 -4829 -1750 3485 4592 -50 -5294 -4370 1796 5880 2761 -3886 -5839 -867 4957 4316 -1740
1708 -1740 -5552 -3073 2129 4176 1122 -3266 -4299 -682 2883 3112 -161 -3736 -3144 72 3412
1723 3412 2656 -1762 -4903 -2665 2322 4811 1407 -4636 -4976 581 5925 4200 -2350 -5403 -1781
1738 -1781 4649 5588 326 -4337 -3662 1540 4972 2645 -1917 -3593 -1543 2702 4086 925 -2879
1753 -2879 -3720 -850 2594 3461 -449 -4687 -4249 705 3872 1806 -4258 -6935 -2446 3471 3589 -2077
1769 -2077 -6648 -4515 1739 4103 544 -4473 -5163 -564 3368 2778 -1587 -4216 -2796 1142 3763
1784 3763 1968 -1600 -3065 -906 3132 5306 2276 -2055 -2767 1249 5796 5121 -53 -4077 -1266
1799 -1266 4583 6305 1874 -3586 -3113 2288 6303 3566 -1612 -3597 -347 3589 4280 415 -3060
$$ packed form
1693d829L079N235J107m642n244R24O166M084l119o647j953M972N824o41o056
1708a740l812K479N202K047l054m388j033L617L565K29l273l575N92L216L340
1723C412p56m418l141K238M987K489l404o043l40N557N344j725o550l053L622
1738a781O430R39n262m663O75N202L432k327m562j676K050M245J384l161l804
1753b879q41K870L444Q67l910m238M38M954L167k066o064k677M489N917J18n666
1769b077m571K133O254K364l559n017o90M599L932n90m365k629J420L938K621
1784C763j795l568j465K159M038K174l030m331p12M016M547o75n174m024K811
1799a266N849J722m431n460M73N401M015k737n178j985L250L936O91l865l475
$$ plain form
1814 -3060 -3012 219 2864 2204 -1465 -4098 -3316 529 3240 1512 -2811 -5194 -1879 3029 3875 -980
1830 -980 -5250 -3906 1382 4823 1516 -3891 -5095 -362 4287 4120 -837 -4124 -1696 3046 4815
1845 4815 1848 -1466 -2445 662 3676 4169 1393 -2210 -2407 1295 4380 3603 -237 -3718 -1158 3452
1861 3452 5481 1742 -3447 -3818 1101 5214 3234 -2595 -5125 -1684 3248 3911 -1068 -4557 -3617 810
1877 810 3183 1402 -2026 -4093 -2161 1482 2781 639 -2914 -4264 -1449 2804 3023 -1014 -4622
1892 -4622 -3762 1080 4395 1864 -3443 -4808 -635 3790 3700 -1280 -4966 -2893 1792 4271 769 -3936
1908 -3936 -4284 -510 2878 2458 -1084 -3609 -2534 1073 3114 1751 -1770 -3564 -1867 2381 3675
1923 3675 568 -3497 -4117 -35 3970 3074 -2196 -4615 -1957 3374 4381 428 -3932 -3361 1400 4436
$$ packed form
1814c060M8L231K645o60l669k633P82L845K711j728m323k383L315M908Q46m855
1830i80m270J344N288L441l307n407j204M733M649j67m957l287K428M742J769
1845D815k967l314r79L107L014M93k776l603j97L702L085p77l840l481K560M610
1861C452K029l739n189l71M919M113j980n829k530L441M932O63m979l489R40M427
1877H10K373j781l428k067J932L643J299k142l553j350K815M253K19m037l608
1892d622Q60M842L315k531n307j365M173M425r0m980l686K073M685K479l502m705
1908c936l48L774L388m20l542k525J075L607K041j363l521j794J697M248J294
1923C675l107m065o20M082M005q96n270k419K658N331J007l953m360N71M761L036
$$ plain form
1939 4436 2328 -2065 -3838 -1104 2252 2932 -75 -3132 -3194 -235 2647 1761 -1070 -3950 -3037 791
1955 791 3353 1163 -3461 -4773 -1702 2789 2809 -1985 -5449 -3762 1646 3812 975 -3516 -4237 -254
1971 -254 3509 2804 -859 -3487 -1507 2225 3780 1639 -1422 -2490 -79 3128 3854 1277 -1947 -1758
1987 -1758 1966 4737 3998 -256 -3224 -932 3614 5162 1295 -3379 -3160 1373 5015 2615 -2050
2002 -2050 -4426 -655 3072 3448 -21 -3431 -2407 722 3155 1647 -1621 -3644 -1981 1173 2588
2017 2588 602 -2714 -3666 -1110 2877 3043 -139 -3516 -2513 2122 4718 2201 -2600 -3950 -44
2032 -44 4223 3539 -1047 -3801 -1843 2727 4422 1472 -2022 -2576 549 3448 2958 -79 -2138 -1585
2048 -1585 1322 3011 1988 -1322 -3532 -1984 1989 3378 435 -3243 -3064 544 4051 2975 -1792
$$ packed form
1939D436k108m393j773K734L356O80l007l057o2K959K882q86k831k880R13L828
1955G91K562k190m624j312L071M491K0m794l464J687N408K166k837m491p21L983
1971b54L763p05l663k628J980L732J555k141l061j068K411L207P26k577l224J89
1987a758L724K771p39m254k968K292M546J548l867m674K19M533L642k400m665
2002b050k376L771L727L76l469l410J024L129K433j508l268k023J663L154J415
2017B588j986l316r52K556L987J66l182l377J003M635K596k517m801j350L906
2032d4M267o84m586k754J958M570J695k950l494n54L125K899m90l037k059N53
2048a585K907J689j023l310k210J548L973J389k943l678J79L608L507j076m767
$$ plain form
2063 -1792 -4049 -1385 3208 3956 391 -3489 -2907 1279 3744 1979 -1941 -3026 -741 3048 3084 930
2079 930 -2073 -2152 302 3091 2780 -379 -2751 -1981 1528 3372 1200 -2543 -3825 -927 2917 2866 -1011
2096 -1011 -4042 -3071 1459 3321 847 -3365 -3728 -962 2564 2415 -1526 -3987 -2260 1149 2878 1089
2112 1089 -2160 -2944 -936 2573 2895 456 -2381 -2270 916 3970 2586 -1121 -3087 -845 2767 3989
2128 3989 774 -2802 -2616 1469 3985 2531 -1018 -3080 -807 2441 3182 440 -2723 -2679 -81 2078
2144 2078 1431 -2020 -4085 -2361 702 2415 285 -3283 -4036 -586 2392 2250 -1759 -4720 -2844 1082
2160 1082 2571 204 -3445 -3852 -362 3008 2035 -1308 -3252 -1562 1622 3316 1253 -1331 -2226 -37
2176 -37 2594 3176 460 -2542 -2011 911 3447 2484 -1305 -3481 -1117 2924 3910 640 -3061 -2749 1173
$$ packed form
2063a792k257K664M593P48l565l880N82M186K465j765l920j085K285L789L6k154
2079I30l003p9K454K789l11l159k372P70L509J844k172l743j282K898L844n1l877
2096a011l031R71M530J862k474m212l63K766L526j49l941k461J727L409J729j789
2112A089l249p84K008L509L22k439k837J11L186L054j384l707j966K242L612J222
2128C989l215l576J86M085K516j454l549k062K273L248P41k742l163M4K598K159
2144B078o47l451k065J724L063J713k130l568p53L450K978j42m009k961J876L926
2160A082J489k367l649m07L490L370r73l343j944J690L184J694k063k584q95K189
2176c7K631N82k716l002N31K922K536r63l789k176K364M041R86l270l701L12L922
$$ plain form
2193 1173 3599 2091 -2253 -3867 -1070 2756 2550 -891 -3495 -2710 874 2594 1268 -1607 -2568 -889
2209 -889 1236 2326 486 -2300 -2973 -851 1945 2534 -633 -3269 -2445 1366 3599 1658 -2357 -3424
2225 -3424 109 3629 3393 -807 -3564 -1700 2335 3348 549 -2708 -2679 313 2745 2359 -709 -2104
2241 -2104 -1286 1640 2973 1353 -592 -1902 -599 2434 2916 1129 -1823 -2097 539 3746 2821 -849
2257 -849 -3044 -1017 3070 4226 918 -2743 -2202 1801 4147 2410 -1768 -3156 -666 2832 3030 -380
2273 -380 -3022 -2397 601 2133 1068 -1523 -2758 -1667 711 1828 197 -2526 -3126 -1105 1525 2031
2289 2031 -879 -3627 -2749 680 2927 1061 -2632 -3281 -360 3044 3122 -538 -3239 -1305 2437 3627
2305 3627 1186 -1970 -1898 555 3337 2766 34 -1602 -1001 1916 3202 1966 -468 -2015 -376 2068
$$ packed form
2193A173K426j508m344j614K797L826k06l441k604P85L584J720j326k875r61J679
2209h89K125J090j840k786o73K122K796N89l167k636Q24L811K233j941m015j067
2225c424L533L520k36m200k757J864M035J013k799l257K9K992K432l86l068j395
2241b104Q18K926J333j620j945j310J303L033M82j787k952k74K636L207r25l670
2257h49k195K027M087J156l308l661N41M003K346j737m178j388K490L498J98l410
2273c80k642O25K998J532j065k591j235J091K378J117j631k723o00K021K630N06
2289B031k910k748Q78L429K247j866l693o49K921L404P8l660k701J934L742J190
2305C627k441l156P2K453K782n71k732j636O01K917J286j236k434j547J639K444
$$ plain form
2321 2068 2862 233 -2375 -2251 48 2633 1585 -1727 -3653 -2026 1033 1982 -596 -3671 -3817 -974
2337 -974 1875 644 -2438 -4265 -2725 643 1936 -638 -3625 -3478 -633 1894 1603 -1630 -3220 -1770
2353 -1770 1775 2685 537 -2004 -2125 356 2652 2516 -174 -1903 -811 1964 3522 2062 -563 -1648
2369 -1648 724 3003 3535 873 -1544 -1493 1606 3456 2158 -1193 -2948 -747 2403 3135 -285 -3119
2385 -3119 -2532 1045 2985 961 -2329 -3446 -876 1712 1772 -1233 -3181 -2468 -54 1711 473 -1584
2401 -1584 -3253 -1509 858 1531 579 -2232 -2384 -262 1938 1982 -337 -2638 -1607 1518 3259 1387
2417 1387 -1823 -2609 689 3831 3311 -353 -2416 -775 2694 3732 1081 -1582 -1734 1288 3413 2406
2433 2406 -553 -1562 -99 1593 2507 1608 -641 -1169 -51 1943 2307 698 -1620 -1835 447 2605
$$ packed form
2321B068P94k629k608J24K299K585j048l312j926J627L059R49k578l075j46K843
2337i74K849j231l082j827J540L368J293k574k987J47K845K527k91l233j590J450
2353a770L545R10k148k541j21K481K296j36k690j729J092K775J558j460k625j085
2369a648K372K279N32k662k417N1L099J850j298l351j755K201L150P32l420k834
2385c119N87L577J940k024l290j117K570K588O0l005j948P13K414J765j238k057
2401a584j669J744K367O73r52k811j52K122K200M4k319k301J031L125J741j872
2417A387l210p86L298L142n20l664k063J641L469J038k651k663j52L022K125j007
2433B406k959j009J463J692R14q99k249n28J118J994L64j609k318k15K282K158
$$ plain form
2449 2605 1999 -1296 -3061 -1321 1774 2539 -279 -3172 -3001 669 3009 1173 -2713 -3530 -816 1798
2465 1798 1835 -1263 -3172 -2248 660 1563 414 -1736 -2351 -550 970 1702 770 -1394 -1971 -217 2179
2482 2179 2316 381 -2170 -1395 1787 3404 1914 -1193 -2066 663 3734 3079 480 -2388 -1019 2614
2498 2614 4056 1228 -1996 -1865 937 2989 2082 -760 -2198 -858 1046 1944 370 -1778 -2238 -1019
2514 -1019 939 898 -724 -2813 -2734 -868 1302 395 -2120 -4027 -2513 696 1101 -760 -3308 -3327 -763
2531 -763 2082 1013 -2342 -3561 -1181 1783 2142 -463 -2284 -1639 721 2895 1568 -1054 -1588 -151
2547 -151 2283 2817 1117 -794 -839 845 2890 2464 451 -1094 -284 1619 3141 1847 -834 -2082
2563 -2082 -115 2421 2224 60 -2529 -2052 848 2553 1083 -2168 -2917 -1060 1658 1586 -1015 -3020
$$ packed form
2449B605o06l295j765J740L095P65k818k893J71L670K340j836l886q17K714K614
2465A798L7l098j909R24K908R03j149k150o15J801J520P32r32k164n77J754K396
2482B179J37j935k551P75L182J617j490l107q73K729L071o55k599k868J369L633
2498B614J442k828l224J31K802K052r07k842j438J340J904Q98j574k148m60J219
2514a019J958m1j622k089P9J866K170r07k515j907J514L209M05j861k548j9K564
2531g63K845j069l355j219K380K964L59k605j821O45K360K174j327k622n34J437
2547a51K434N34j700j911m5J684K045m26k013j545Q10J903J522j294k681j248
2563b082J967K536j97k164k589M77K900J705j470l251p49J857K718p2k601k005
$$ plain form
2579 -3020 -2290 663 1993 309 -2185 -2970 -530 1523 1143 -818 -2215 -1554 275 1712 1175 -766
2595 -766 -1713 -562 1654 2629 603 -1582 -1803 450 2668 2347 -111 -2300 -1245 1932 3066 937
2611 937 -1719 -1784 446 2865 2448 -840 -2355 -626 2291 2517 220 -2091 -1798 367 1928 1079 -893
2628 -893 -1752 -861 912 1597 583 -1424 -1900 -475 1158 1351 -202 -1876 -2007 41 2053 1427 -1609
2645 -1609 -3112 -914 1993 2143 -215 -2726 -2187 881 2616 956 -1747 -2757 -428 1917 1829 -849
2661 -849 -2495 -1112 856 1975 960 -1180 -1677 -453 1295 1692 752 -633 -1291 274 1895 1917 361
2678 361 -1475 -1264 1127 2983 1467 -1044 -2007 476 2793 2623 -173 -2109 -806 2314 3154 605
2694 605 -1882 -1775 893 2478 1454 -617 -1739 -495 1364 1845 446 -1186 -1868 -402 1289 1255
$$ packed form
2579c020P30K953J330j684k494p85K440K053l80j961j397O61J829J437n37j941
2595g66r47J151K216R75k026k185k21K253K218l21k458k189J055L177J134k129
2611I37k656o5K230K419m17l288j515J729K917K26k297k311K93K165J561q49j972
2628h93q59Q91J773O85j014k007m76J425J633J93j553j674j31K048K012o26l036
2645a609j503K198K907J50k358k511N39L068J735j660k703j010K329K345q8k678
2661h49j646J383J968J119j015k140m97J224J748L97r40j385o58J565J621K2j556
2678C61j836K11K391J856j516k511r63K483K317j70k796j936J303L120Q40k549
2694F05k487J07K668J585j024k071j122J244J859M81j399j632o82J466J691l4
$$ plain form
2710 1255 70 -2005 -2172 -348 1481 1359 -1176 -2655 -1374 968 1931 137 -2521 -2464 411 2518
2726 2518 1378 -1612 -2860 -558 1652 2315 -364 -2394 -1787 986 2124 774 -1314 -1758 -188 1290
2742 1290 1468 33 -1210 -1275 180 1278 969 -243 -1919 -1278 612 1663 460 -1296 -2403 -672
2758 -672 1519 2135 -297 -2556 -1740 1193 2470 634 -1866 -2409 -366 1844 1840 -629 -1892 -1213 856
2775 856 2092 713 -1303 -1657 -77 1436 1450 -38 -1615 -1235 705 1421 844 -786 -2172 -981 1256
2792 1256 1907 210 -1682 -1717 -120 1851 1267 -1027 -2461 -1414 1246 2134 46 -2200 -2131 176 1943
2809 1943 1295 -1307 -2208 -617 1427 1859 97 -1938 -1296 893 1722 1256 -534 -1366 -381 1229 1851
2826 1851 1173 -433 -1021 410 1891 2045 551 -1170 -900 829 2604 1240 -1042 -2179 -599 1839
$$ packed form
2710A255j185k075j67J824J829j22k535j479J281K342R63j794k658N7K875K107
2726B518j140k990j248K302K210O63k679k030O07K773J138j350k088m44J570J478
2742A290J78j435j243o5J455J098l09j212j676O41J890J051j203j756j107J731
2758f72K191O16k432k259Q16K933J277j836k500n43K043K210mk469j263O79K069
2775H56J236j379k016l54J580J513J4j488j577L80J940P16n77j630j386J191K237
2792A256O51j697j892l5J597J971n84k294j434J047K660Q88k088k246O9K307J767
2809A943o48k602r01J591K044M32j762k035O42K189Q29m66j790q32R85J610O22
2826A851o78j606n88J431J481J54j494j721K70J729J775j364k282j137J580K438
$$ plain form
2842 1839 2054 -397 -2218 -1681 691 1985 697 -1624 -2434 -500 1315 1629 -1109 -2033 -1520 564
2858 564 1073 287 -1527 -1669 -1004 1095 1009 -101 -1401 -1628 -108 1411 1175 -480 -1553 -968 905
2875 905 2465 904 -1118 -1699 135 2550 2184 -373 -1928 -395 2136 2801 877 -1308 -1146 1020
2891 1020 2541 1546 -669 -1522 -632 1095 1493 182 -1009 -1132 -4 1299 909 -583 -1788 -1238 142
2908 142 1354 793 -1507 -2323 -878 909 1375 -625 -2295 -1679 240 1802 769 -1419 -2410 -529
2924 -529 1428 1470 -203 -1747 -1030 622 1788 512 -1011 -1679 -254 1184 1567 376 -1181 -833 362
2941 362 1668 1335 -76 -1272 -625 920 1779 880 -1030 -1519 48 1817 1926 -285 -1707 -910 1401
2958 1401 2153 626 -1447 -1617 251 2043 1408 -590 -1624 -832 1020 1620 62 -1280 -1611 146
$$ packed form
2842A839K15k451j821N37K372J294j288k321q10J934J815L14k738r24N13K084
2858E64N09p86j814j42O65K099q6j110j300k27J520J519k36j655j073N85J873
2875I05J560j561k022n81J834K415l66k557j555J533K531O65j924k185J62K166
2891A020J521r95k215q53Q90J727L98j311j191j23J128J303l90j492j205N50J380
2908A42J212n61k300q16J445J787M66k000j670O16J919J562j033k188r91J881
2924e29J957M2j673j544P17J652J166j276j523o68J425J438L83j191j557L48J195
2941C62J306l33j411j196O47J545Q59q99j910m89J567J769J09k211j422P97K311
2958A401P52j527k073j70J868J792o35j998j034P92J852O00j558j342l31J757
$$ plain form
2974 146 1312 1030 -305 -1679 -1492 197 1031 551 -958 -1790 -620 1105 1339 -109 -1600 -1514 378
2991 378 1715 1003 -1225 -1830 -754 1220 1714 -330 -1653 -1331 202 1805 803 -920 -1388 -562 1504
3008 1504 1784 -100 -1112 -1207 495 1720 1050 -465 -1369 -311 755 1503 507 -1040 -1374 245 1255
3025 1255 1369 -65 -1412 -1259 522 1379 687 -1367 -2013 -567 1325 1296 -531 -1981 -1267 278 1358
3042 1358 564 -1694 -1919 -365 1073 1229 -471 -1785 -1209 830 1576 453 -760 -1439 -404 1084
3058 1084 1278 364 -1077 -975 66 1416 1374 -260 -1308 -419 1311 2009 672 -991 -1398 327 2021
3075 2021 1273 -506 -1449 -334 1238 1950 396 -1346 -1104 159 1493 1084 -768 -1541 -730 790 1311
3092 1311 373 -840 -1345 -143 1155 1311 62 -1416 -707 749 1672 921 -705 -1314 -328 1315 1770
$$ packed form
2974A46J166k82j335j374J87J689Q34m80j509q32J170J725K34j448j491Q6J892
2991C78J337p12k228o05J076J974M94k044j323L22J533J603j002j723m68Q26K066
3008A504K80j884j012r5J702J225o70j515r04J058J066P48r96j547l34J619J010
3025A255J14j434j347J53J781Q57o92k054o46J446J892k9j827j450P14J545J080
3042A358p94k258k25J554J438J56j700j314N76K039P46j123j213o79J035J488
3058A084J94r14j441J02J041J350m2j634j048Q89J730O98j337j663m07J725J694
3075B021p48j779r43J115J572P12j554j742K42J263J334m09j852p73Q11J520N21
3092A311r38j213n05J202J298J56j249j478P09J456R23p51j626o09R86J643M55
$$ plain form
3109 1770 442 -1366 -657 892 1670 874 -1004 -1442 -378 1405 1537 -51 -1435 -1060 750 1328 740
3126 740 -1218 -1340 -601 1081 1073 -74 -1527 -1359 27 1084 707 -1082 -1718 -1316 509 985 -139 -1521
3144 -1521 -1893 -531 1377 779 -929 -2175 -700 722 1583 430 -1292 -1436 -192 1134 1220 -457
3160 -457 -1546 -424 663 1574 336 -1072 -1473 -103 1174 1108 -434 -1087 -759 353 1007 768 -782
3177 -782 -1393 -476 1183 1369 215 -1692 -1204 370 1490 946 -994 -1491 -381 1175 1383 -220 -1396
3194 -1396 -1265 249 1569 719 -839 -1761 -360 598 1255 221 -1290 -910 594 1421 1262 -403 -970
3211 -970 -560 1122 1192 482 -450 -1135 492 1173 1146 -204 -1463 -747 632 1588 395 -630 -1020 -52
3229 -52 1428 1133 -367 -1203 -789 483 1676 413 -1098 -1427 -27 1389 1307 -330 -892 -658 658
$$ packed form
3109A770j328j808P09J549P78p96j878m38J064J783J32j588j384L75J810N78n88
3126G40j958j22P39J682qj147j453J68J386J057l77j789o36M02J825M76j124j382
3144a521l72J362J908n98j708j246J475J422Q61j153j722j44J244J326Q6j677
3160d57j089J122J087R11j238j408m01J370J277o6j542o53L28J112O54k39j550
3177g82o11R17J659J86j154j907M88J574J120n44j940m97J110J556K08j603j176
3194a396J31J514J320q50j558r22J401R58O57j034j511L80J504Q27j59j665n67
3211i70M10J682P0p10r32o85J627O81k7j350j259P16J379R56j193j025l90R68
3229e2J480k95j500q36M14J272J193j263j511l29J400J416q2j637n62K34J316
$$ plain form
3246 658 1592 841 -678 -1252 -105 1051 1173 70 -884 -1058 458 1339 771 -641 -1008 -291 1169 1181
3264 1181 183 -1013 -960 593 1337 1360 -120 -1267 -374 1254 1743 795 -639 -888 444 1481 1352 -38
3282 -38 -736 -346 1215 1650 581 -733 -843 580 1334 1512 -185 -955 -443 1129 1559 1015 -546 -1027
3300 -1027 84 1258 952 245 -1071 -832 656 1573 697 -916 -1280 -139 905 1158 -329 -1460 -883
3317 -883 235 1086 621 -775 -1667 -701 782 885 -75 -1297 -1056 -17 734 604 -981 -1505 -696 583
3335 583 852 -199 -1271 -1372 -126 1024 631 -907 -1417 -674 417 1162 371 -1173 -1492 -113 1138
3352 1138 661 -533 -1383 -920 464 861 258 -1267 -1487 -248 968 590 -798 -1527 -1029 132 942
3369 942 89 -1079 -1615 -491 841 540 -451 -1570 -1290 263 1352 294 -968 -1373 -299 1012 1039
$$ packed form
3246F58R34p51j519n74J147J156J22j103r54j74J516Q81n68j412l67P17J460J2
3264A181r98j196N3J553P44K3j480j147Q93J628M89r48j434k49J332J037j29j390
3282c8o98L90J561M35j069j314j10J423P54J78j697p70N12J572M30n44j561m81
3300a027J111J174l06p07j316K39J488R17q76j613l64J141J044K53j487j131N77
3317h83J118Q51m65j396q92R66J483J03r60j222K41J039P51j30j585n24Q09J279
3335E83K69j051j072j01J246J150l93j538n10P43J091P45p91j544l19J379J251
3352A138m77j194q50M63J384L97o03j525k20J239J216l78j388p29M98J161Q10
3369I42q53j168n36J124J332l01r91j119K80J553J089j058j262m05J074J311K7
$$ plain form
3386 1039 364 -1003 -977 645 1299 663 -896 -942 -56 922 1519 292 -674 -817 218 1536 953 -551
3404 -551 -1229 -241 1035 1587 720 -528 -957 274 1274 798 -280 -1321 -443 864 986 335 -1148
3421 -1148 -808 546 1147 704 -703 -1026 -543 612 1028 183 -786 -1134 -88 1149 804 -400 -1162 -909
3439 -909 359 1230 104 -890 -890 -149 1056 916 -24 -1004 -994 640 1248 854 -601 -849 -233 792 1356
3458 1356 354 -957 -975 67 1207 794 -480 -967 -279 999 1145 230 -1155 -762 143 1171 669
3475 669 -567 -897 -619 946 940 325 -1098 -1157 177 949 878 -445 -1219 -534 964 1211 133 -812 -865
3494 -865 -155 1099 1007 -217 -956 -693 773 1292 513 -847 -1037 -237 668 726 -64 -875 -866 461 1100 619
3514 619 -848 -878 -237 944 1023 124 -1025 -835 254 1344 642 -204 -786 -278 875 917 425 -851 -961
$$ packed form
3386A039o75j367K6J622O54o36j559m6Q86R78N97j227r66j43J035J318n83j504
3404e51o78R88J276N52q67j248m29J231J000m76j078j041Q78J307J22o51j483
3421a148L40J354O01m43j407l23M83J155M16q45r69l48J046J237l45j204p62K53
3439i09J268Q71j126r94%P41J205j40r40r80J0J634O08l94j455k48O16J025N64
3458A356j002j311j8J042J140m13j274m87O88J278J46r15j385L93R05J028n02
3475F69j236l30K78J565oo15j423n9J334P72p1j323p74O85J498K47j078r45n3
3494h65P10J254r2j224p39K63J466N19p79j360j90Q00R05N8p90q11RJ327O39m81
3514F19j467l0O41J181P9q99j149J90J089J090p02q46n82N08J153M2m92j276j10
$$ plain form
3533 -961 192 1008 696 -411 -888 -620 621 1225 394 -919 -767 282 862 592 -197 -931 -545 662
3551 662 1006 222 -1124 -744 -171 1016 795 -585 -1353 -682 361 784 127 -987 -1405 -221 885 791
3569 791 -230 -972 -553 620 646 559 -642 -1219 -45 705 1021 -77 -1122 -466 285 1201 590 -679
3587 -679 -797 -296 1091 979 31 -1103 -697 250 1111 653 -303 -1178 -404 380 968 -139 -829 -726 -27
3606 -27 870 359 -476 -1157 -323 545 964 -9 -1113 -909 108 771 663 -611 -1236 -792 618 957 308
3625 308 -899 -996 63 889 1066 -181 -974 -213 318 1052 497 -903 -905 -166 931 929 -85 -839 -676 460
3645 460 824 585 -749 -1106 -292 796 1100 -170 -860 -809 363 1263 671 -365 -771 106 737 1061 60
3664 60 -1045 -530 306 983 664 -675 -903 -469 666 873 -115 -761 -1061 243 834 563 -274 -975 -394
$$ packed form
3533i61J153Q16l12j107m77K68J241O04q31j313J52J049N80k70p89p34L86J207
3551F62L44p84j346L80N73J187k21j380p68O71J043M23o57j114m18J184J106r4
3569G91j021p42M19J173K6q7j201n77J174P50L16j098j045O56P51R16o11j269
3587f79j18N01J387j12r48j134M06R47Q61m58r56q75P74P84N88j107o90J03O99
3606b7Q97n11q35o81Q34Q68M19r73j104K04J017O63j08j274o25M44J410L39o49
3625C08j207r7J059Q26J77j247p93P61N31P34n55j400kP39J097kj014p54J63J136
3645D60L64k39j334l57Q14J088L04j270o90N1J172R00n92j036m06Q77O31L24j001
3664F0j105N15Q36O77l19j339k28M34J135K07r88o46l00J304N91k71q37p01N81
$$ plain form
3683 -394 577 703 -146 -953 -914 -63 1029 737 -570 -1053 -338 501 951 556 -771 -816 -80 757 573 127
3703 127 -1036 -644 428 1089 387 -556 -873 -77 831 788 -91 -869 -802 -49 1045 714 -410 -859 -102
3722 -102 495 1093 399 -745 -799 298 668 744 -639 -1308 -656 677 601 -97 -664 -637 123 1136 571 -481
3742 -481 -1269 -340 593 988 -223 -772 -923 -104 806 716 -324 -802 -231 296 1097 369 -699 -776 236
3761 236 1127 1029 -219 -854 -485 529 1086 583 -376 -664 177 1089 898 117 -747 -378 534 911 663 -233
3781 -233 -400 -72 1054 1282 298 -641 -433 554 901 740 -22 -361 -108 740 822 178 -650 -625 646 1064
3801 1064 540 -368 -774 -25 809 1125 758 -248 -751 306 1123 879 43 -498 -200 936 1052 448 -525
3820 -525 -517 249 713 851 -44 -883 -339 367 847 318 -534 -680 35 537 825 121 -850 -562 502 921
$$ packed form
3683c94R71J26q49q07L9Q51J092k92j307m83P15Q39M50l95j327m5P36Q37j84m46
3703A27j163L92J072O61p02r43l17P96R08m3q79p78O7P53J094l31j124m49P57
3722a02N97N98o94j144n4J097L70P6j383o69O52J333p6o98n67K7P60J013n65j052
3742d81p88R29R33L95j211n49j51Q19R10r0j040m78N71N27Q01p28j068p7J012
3761B36Q91r8j248o35L69J014N57n03r59k88Q41R12j91p81q64L69R12L77k48q96
3781b33j67L28J126K28r84r39K08R87L47j61p62l39K53Q48Q2o44q28K5J271M18
3801A064n24r08m06P49Q34L16l67j006n03J057Q17k44q36n41K98J136J16o04r73
3820e25QP66M64J38q95q39N44P06M80n29q52j46P15N02K88p04r71K88J064M19
$$ plain form
3840 921 201 -452 -1085 -236 555 961 -131 -904 -965 67 637 225 -573 -988 -648 388 262 -351 -1075
3859 -1075 -829 -230 616 44 -637 -1146 -639 179 486 -226 -1088 -913 -234 500 616 -629 -1075 -481 417
3878 417 557 -85 -721 -1063 -336 707 259 -577 -976 -463 662 669 192 -717 -927 -268 536 324 -298 -629
3898 -629 -613 244 596 284 -592 -791 -149 677 509 1 -890 -481 280 739 341 -768 -897 -400 601 592
3918 592 -108 -872 -695 149 573 597 -473 -1011 20 657 830 -114 -1011 -920 191 803 350 -393 -878 -363
3938 -363 466 716 444 -589 -957 -112 232 321 -241 -749 -632 394 829 -40 -788 -1135 -92 546 340
3957 340 79 -600 -491 169 547 346 -568 -692 96 645 945 94 -497 -333 443 786 407 -394 -583 -322
3977 -322 632 796 113 -450 -603 542 865 439 41 -647 -245 741 768 125 -733 -366 165 820 518 -521
$$ packed form
3840I21p20o53o33Q49P91M06j092p73o1J032N70m12p98m15L40J036j26o13p24
3859a075K46N99Q46n72o81n09N07Q18L07p12q62J75O79P34J16j245m46N94Q98
3878D17J40o42o36l42P27J043m48q36l99N13J125Pm77r09k10O59Q04k12o22l31
3898f29J6Q57L52l12q76j99O42Q26j68n08q91M09P61M59l98j109j29M97J001r
3918E92p00p64J77Q44M24K4j070n38J031O37J73r44q97R1J111O12m53p43m85N15
3938c63Q29K50k72j033l68Q45L44Q9n62n08J17J026M35q69p48l47J043O38k06
3957C40k61o79J09O60L78k01r14j24P88N49L00q51n91J64P76L43l79q01j89K61
3977c22R54J64o83n63j53J145L23m26l98o88M02R86K7o43q58L67N31O55l02j039
$$ plain form
3997 -521 -500 -174 310 441 208 -742 -328 329 768 390 -229 -712 -133 482 795 415 -402 -452 112 901 732
4018 732 -177 -603 139 659 874 489 -230 -678 296 668 773 -10 -681 34 399 673 272 -681 -766 -144
4038 -144 460 622 -183 -895 -578 190 792 139 -503 -1117 -82 413 735 -94 -522 -302 51 634 305 -293
4058 -293 -776 -127 314 510 66 -842 -636 -42 433 431 -241 -855 -604 561 816 -60 -420 -702 104 588
4078 588 176 38 -859 -436 481 666 420 -522 -998 18 791 622 -309 -830 -526 388 571 251 -746 -557
4098 -557 -4 588 559 -50 -827 -220 152 964 227 -457 -599 33 362 571 337 -807 -472 116 535 544 -279
4119 -279 -401 -168 515 508 52 -693 -715 120 599 234 -624 -782 -293 609 365 72 -890 -381 -76 806 417
4140 417 -549 -816 -459 291 771 66 -524 -743 159 838 518 -307 -819 -391 677 992 264 -342 -529 -105
$$ packed form
3997e21K1L26M84J31k33r50M14O57M39l78o19m83N79O15L13l80q17n0N64P89j69
4018G32r09m26P42N20K15l85p19m48R74L72J05p83o71P15L65K74m01r53q5O22
4038a44O04J62q05p12L17P68O02o53o42o14J035M95L22q29m28K20L53N83l29n98
4058b93m83O49M41J96m44r08K06N94M75ko72o14K51J165K55q76l60k82Q06M84
4078E88m12j38q97M23R17J85k46r42m76J016P73j69r31n21L04R14J83l20r97J89
4098e57N53N92k9o09p77O07L72Q12p37o84j42O32L29K09k34j144L35N88M19Rq23
4119b79j22K33O83pm56p45k2Q35M79l65q58j58M89R02k44k93r62N09L05Q82l89
4140D17r66k67L57P50M80p05n90k19R02O79l20q25n12M28J068L15p28o06j87M24
$$ plain form
4160 -105 613 535 -340 -699 -347 635 928 303 -347 -815 -54 549 567 25 -586 -243 450 592 127 -504 -248
4181 -248 -221 717 416 32 -612 -319 182 583 328 -407 -598 -366 416 842 91 -394 -689 41 659 497
4201 497 -384 -676 -308 636 730 346 -758 -514 137 625 353 119 -378 -236 513 572 154 -510 -720 -15
4221 -15 917 413 -34 -799 -505 282 568 241 -491 -567 71 562 628 -122 -528 -257 185 420 382 -615 -627 -205
4243 -205 524 647 309 -467 -334 -72 689 483 -69 -653 -506 581 498 270 -410 -200 -112 494 451 -390 -815
4264 -815 11 423 420 358 -463 -376 237 591 205 -351 -616 -312 132 469 210 -565 -477 -140 484 517 -48 -510
4286 -510 -465 244 647 265 -330 -542 30 493 324 -212 -250 -488 362 670 425 -451 -426 -60 437 633 -221
4307 -221 -735 -494 210 148 408 -379 -682 -375 390 514 -153 -572 -511 -146 650 464 -486 -745 -363 323 167
$$ packed form
4160a05P18p8q75l59L52R82K93o25o50m68P61O03J8n42o11L43O93J42m65o31K56
4181b48K7R38l01l84o44K93N01M01k55p35j91K32P82M26p51m85k95P30O18j62
4201D97q81k92L68R44R4l84j104K44O51M88k72k34m97J42P49N9m18o64k10P05
4221a5R32n04m47p65K94P87K86l27p32p6O38M91O6p50m06K71M42K35l8r97j2M22
4243b05P29J23l38p76J33K62P61k06n52n84J47J087q3k28o80K10Q8O06m3q41m25
4264h15Q26M12lo2q21Q7O13L54l86n56k65L04M44L37k59p75Q8L37O24L3n65m62
4286e10M5P09M03l82n95k12N72M63j69n36l8k38Q50L08k45q76K5L66M97J96q54
4307b21n14K41P04o2K60p87l03L07P65J24o67m19O1L65P96j86r50k59L82O86j56
$$ plain form
4328 167 -329 -704 -681 21 488 355 -257 -630 -729 273 471 145 -621 -382 -37 524 334 -360 -551 -388
4348 -388 375 580 -56 -455 -610 -187 296 238 -296 -309 -131 210 724 416 -698 -470 -133 535 532 137 -430
4369 -430 -404 13 314 286 -373 -310 -261 579 423 99 -793 -504 9 176 342 -18 -600 -26 567 639 -105 -398
4391 -398 -627 244 695 569 -61 -627 -403 386 383 252 -416 -404 312 227 378 -472 -614 -381 407 564 -108
4412 -108 -388 -711 -42 273 197 -187 -1016 -440 296 568 29 -615 -640 -69 427 675 -277 -355 -374 295 787
4433 787 439 -347 -295 128 576 519 67 -280 -286 376 776 118 -252 -498 11 428 646 -108 -574 -479 -319 458
4455 458 194 -543 -879 -487 80 387 -250 -774 -758 -215 218 186 -715 -918 -526 -254 343 -230 -627 -534 -182
4476 -182 245 117 -444 -914 -142 90 347 178 -332 -377 45 243 220 -129 -398 -96 400 488 484 -165 -490 -47
$$ packed form
4328A67m96l75K3P02M67j33o12l73r9J002J98l26p66K39L45N61j90o94j91J63
4348c88P63K05o36l99j55M23M83n8n34j3J78L41N14l08j114K28L37O68ll95n67
4369d30K6M17L01k8o59O3M9Q40j56l24q92K89N13J67J66l60n82N74N93P2p44k93
4391c98k29Q71M51j26o30n66K24P89lj31o68J2P16q5J51q50j42K33P88J57o72
4412a08k80l23O69L15p6l84q29N76P36K72n39o44k5N71M96K48r52p8j9O69M92
4433G87l48p86N2M23M48n7m52l47oO62M00o58l70k46N09M17K18p54m66R5J60P77
4455D58k64p37l36L92N67L07o37n24J6N43M33l2r01k03L92K72N97n73l97R3L52
4476a82M27j28n61m70P72K32K57j69n10m5M22J98k3l49k69L02M96Q8mo49l25M43
$$ plain form
4498 -47 465 299 92 -221 -178 418 593 332 -352 -558 -101 506 506 57 -591 -386 450 597 428 -214 -812
4519 -812 26 537 710 -402 -604 -374 49 658 109 139 -356 103 310 545 58 -192 -99 115 530 375
4539 375 -515 -820 -450 57 946 22 -497 -485 136 158 512 -240 -394 -326 -124 780 209 -276 -372 -19 434
4560 434 582 -192 -242 -335 165 948 386 -308 -285 -219 439 468 64 -267 -189 338 480 73 -198 -70 -258 308
4582 308 424 197 -381 -448 -226 371 152 -302 -543 -129 141 536 208 -869 -258 28 589 435 -118 -459
4602 -459 -361 345 371 114 -203 -311 -76 531 513 -140 -336 -93 404 386 260 14 -278 369 571 565 427 -60
4624 -60 -419 441 547 238 -412 -342 45 395 417 146 -301 -240 281 675 491 -204 -520 -273 275 198 169 -525
4646 -525 -442 42 310 143 -303 -531 -235 325 472 83 -407 -602 67 298 449 -198 -541 -69 -72 514 -43
$$ packed form
4498d7N12j66k07l13M3N96J75k61o84k06M57O07%m49o48K05Q36J47j69o42n98
4519h12Q38N11J73j112k02K30M23O09n49L0m95M59K07K35m87k50R3K14M15j55
4539C75q90l05L70N07Q89r24n19J2O21K2L54p52j54O8K02R04n71m85r6L53M53
4560D34J48p74n0r3N00P83n62o94K3O6O58K9m04l31P8N27J42m07k71J28j88N66
4582C08J16k27n78o7K22N97k19m54k41M14K70L95l28j077O11K86N61j54n53l41
4602d59R8P06K6k57l17j08K35O07j8o53j96K43M97j8j26k46k92O47K02oj38m87
4624f0l59Q60J06l09o50P0L87L50K2k71m47O1N21L94j84o95l16K47N48p7k9o94
4646e25Q3M84K68j67m46k28K96N60J47l89m90j95O69K31J51o47l43M72lN86n57
$$ plain form
4667 -43 -560 -498 92 721 311 -209 -436 15 290 401 -84 -479 -393 -27 384 237 -195 -370 -332 272 423
4688 423 219 -268 -556 134 641 411 -361 -430 -116 106 356 346 -480 -539 115 398 443 170 -541 -318 350
4709 350 416 253 26 -296 -124 636 484 -146 -470 -276 83 363 6 -253 -625 -27 399 -34 -123 -233 -339
4730 -339 -118 665 128 -456 -560 -208 79 459 169 -318 -484 -44 717 292 -324 -208 -196 461 302 188
4750 188 -499 -425 63 102 335 -23 -595 -278 320 160 217 -360 -259 -276 237 256 39 -426 -209 -61 517 -32
4772 -32 -141 -367 -280 117 401 -32 -561 -212 9 542 271 -371 -758 54 143 549 -66 -233 -308 -68 262
4793 262 394 -182 -568 -268 64 388 136 -221 -233 -20 371 103 148 -654 -153 279 649 355 -585 -515 -171
4814 -171 234 335 -56 -385 -155 -86 545 288 -40 -319 161 248 383 17 -447 -407 223 160 -261 -521 -533 -290
$$ packed form
4667d3n17O2N90O29m10n20k27M51K75J11m85l95Q6L66M11j47m32j75L8O04J51
4688D23k04m87k88O90N07k30p72o9L14K22K50j0q26n9O54K83M5k73p11K23O68
4709C50O6j63k27l22J72P60j52o30l24J94L59K80l57k59l72N98M26m33q9j10j06
4730c39K21P83n37n84j04L52K87L80k90m87j66M40P61m25o16J16J2O57j59j14
4750A88o87P4M88L9K33l58n72L17N98j60N7n77J01j7N13J9k17m65K17J48N78n49
4772c2j09k26Q7L97K84m33n29L49K21N33k71o42l87Q12Q9M06o15j67p5K40L30
4793B62J32n76l86L00L32L24k52l57j2K13L91k68M5q02N01M32L70k94r40P0L44
4814a71M05J01l91l29K30O9O31k57l28k79M80Q7J35l66m64M0O30o3m21k60j2K43
$$ plain form
4836 -290 105 341 171 -251 -274 170 261 155 -205 -519 -269 282 265 285 -419 -360 121 311 285 -269 -275 -221 446
4859 446 463 -296 -524 -669 105 347 158 -486 -343 -293 233 247 -185 -221 -414 -209 258 87 86 -161 -273 86
4881 86 296 200 -542 -401 142 458 252 -193 -400 -263 340 448 245 -288 -427 110 415 387 -88 -353 -200
4902 -200 274 774 -60 -334 82 2 173 308 81 -329 -116 -283 528 528 308 -308 46 88 536 233 -64
4923 -64 -257 34 316 265 -49 -493 -82 64 385 -84 -262 -289 35 711 81 -338 -142 -179 382 99 -33
4944 -33 -17 -507 127 557 367 167 -293 -265 11 407 -44 101 -374 79 418 358 -225 -270 -176 396 435 248
4966 248 -440 -423 -124 157 527 167 -497 -297 -179 122 446 -304 -385 -7 313 170 100 -316 -59 41 493
4987 493 346 -155 -206 -252 279 510 178 -155 -154 296 376 144 -206 -140 -230 -78 565 -87 -283 -411 23 295
$$ packed form
4836b90L95K36j70m22k3M44R1j06l60l14K50N51j7K0p04N9M81J90k6n54oN4O67
4859D46J7p59k28j45P74K42j89o44J43N0N26J4m32l6j93K05M67j71jk47j12L59
4881H6K10r6p42J41N43L16k06m45k07J37O03J08k03n33j39N37L05k8m75k65J53
4902b00M74N00q34k74M16q0J71J35k27m10K13j67Q11%k20o16L54M2M48l03k97
4923f4j93K91K82n1l14m44M11J46L21m69j78k7L24O76o30m19J96l7N61k83j32
4944c3J6m90O34M30j90k00m60K8K76L96m51J45m75M53L39o0n83m5R4N72L9j87
4966B48o88J7K99K81L70l60o64K00J18L01L24p50q1L78L20j43p0m16K57J00M52
4987D93j47n01n1m6N31K31l32l33JM50Q0k32l50O6r0J52O43o52j96j28M34K72
$$ plain form
5009 295 663 -548 -296 -251 307 290 66 -424 -210 -74 297 65 -455 -530 -82 58 92 80 -400 -308 -291 84
5031 84 177 24 -248 -366 -3 371 240 27 -404 -347 81 529 239 -479 -177 124 752 386 -221 -828 -150
5052 -150 550 243 32 -44 -485 -185 354 27 -238 -399 -292 -47 298 -135 -619 -399 -144 178 141 -32 -259
5073 -259 -327 126 427 282 -23 -278 349 487 306 80 -362 -412 171 347 180 -198 -406 248 139 80 -157
5094 -157 -392 -140 233 342 192 -40 -391 -86 497 113 29 -580 -412 -145 173 165 89 -227 -208 272 570 -102
5116 -102 -399 -251 -21 414 175 -4 -314 -156 34 859 275 -255 164 86 453 671 106 -118 231 497
5136 497 359 342 -117 -209 43 328 246 68 -29 -31 272 254 174 -277 -382 -212 -33 305 -28 -474 -278 261 440
5159 440 -18 -119 -519 -333 379 333 144 -373 -278 74 327 118 -77 -143 -6 276 68 -77 -318 -60 73
$$ packed form
5009B95L68j211K52M5N58j7k24m90K14J36L71k32n20p5M48J40L4j2m80R2J7L75
5031H4R3j53k72j18L63L74j31k13m31N7M28M48k90p18L02L01O28l66o07o07O78
5052a50P00l07k11p6m41L00N39l27k65j61J07K45L45m33m84K20K55L22l7j73k27
5073b59o8M53L01j45l05k55O27J38j81k26m42n0N83J76j67l78k08O54j09n9k37
5094a57k35K52L73J09j50k32l51L05N83l84q4o09J68K67L18qp6l16J9M80K98o72
5116a02k97J48K30M35k39j79l10J58J90Q25n84n30M19p8L67K18n65k24L49K66
5136D97j38j7m59r2K52K85q2j78r7kL03j8q0m51j05J70J79L38l33m46J96N39J79
5159D40m58j01m00J86P12m6j89n17R5L52K53k09j95o6J37K82k08j45k41K58J33
$$ plain form
5180 73 319 -5 1 -366 -93 105 236 109 -371 -342 -96 178 183 -42 -490 -568 70 338 25 -627 -568 132 215
5203 215 141 -365 -598 -318 -98 169 -6 -441 -431 148 256 268 -158 -448 -200 272 112 134 -230 -59 -183
5224 -183 220 314 -91 -277 -318 22 242 -121 -248 -527 -167 41 451 226 -499 -296 134 587 242 -293 -288
5245 -288 -63 476 232 -143 -386 94 -27 138 327 -178 -457 -131 401 264 -56 -242 -211 343 -54 283
5265 283 193 -173 -225 274 615 206 -9 -140 -172 100 244 10 -634 -542 267 180 -11 -393 -460 -314 407 432
5287 432 -246 -611 -270 15 194 -172 -194 -332 -267 243 344 -224 -235 -120 -103 318 171 147 -407 -116 482 476
5309 476 389 -9 -50 446 384 304 -33 -556 -313 375 138 -262 -267 -28 125 228 173 -118 -404 84 106 289 35
5332 35 -100 195 58 352 -32 385 -152 -93 232 374 -89 -174 -277 -34 253 485 -221 -299 -676 -75 248
$$ packed form
5180G3K46l24Ol67K73J98J31j27m80K9K46K74Nk25m48p8O38K68l13o52N9P00Q3
5203B15p4n06k33K80K20K67j75m35J0N79J08J2m26k90K48M72j60K2l64J71j24
5224a83M03R4m05j86m1L40K20l63j27k79L60K08M10k25p25K03M30M53l45n35N
5245b88K25N39k44l75k43M80j21J65J89n05k79L26N32j37l20j86L1N54l97L37
5265B83r0l66n2M99L41m09k15j31l2K72J44k34o44R2Q09q7j91l82o7J46P21K5
5287D32o78l65L41K85J79l66k2j38O5N10J01n68j1J15J7M21j47k4n54K91N98o
5309D76q7l98m1M96o2q0l37n23K43O88k37m00nK39J53J03n5k91k86M88K2J83k54
5332C5j35K95j37K94l84M17n37N9L25J42m63q5j03K43K87K32p06p8l77O01L23
$$ plain form
5353 248 80 -189 -50 229 -175 201 -46 -423 -55 347 321 44 10 -377 -95 182 103 28 -184 -371 94
5374 94 310 286 -33 -496 -192 349 169 56 -53 -253 -88 217 263 -95 -298 -219 -90 418 16 -267 -236 -172
5396 -172 536 335 -18 -265 -137 226 373 -90 -50 -326 2 237 224 -50 -426 -11 -19 274 -82 -9 -178 141
5418 141 -70 -139 -128 -263 -102 350 470 253 -116 -404 175 435 65 208 -471 -148 97 105 299 -44 -427
5439 -427 -120 150 133 4 -457 30 148 213 117 -245 -142 69 95 346 -80 -351 -169 59 209 372 145
5460 145 -213 -178 143 -81 421 -222 -202 30 255 227 -188 -304 -50 358 313 -123 -378 -488 -90 421 105
5481 105 -31 -337 -168 66 345 93 -240 -72 -221 367 1 -60 -159 64 32 380 186 -214 -137 -126 193 611
5503 611 84 -203 -135 267 427 83 86 -278 -190 195 231 176 -62 -57 50 511 -46 8 -140 -35 89 185 61
$$ packed form
5353B48j68k69J39K79m04L76k47l77L68M02k6k77l4l87K82K77p9p5k12j87M65
5374I4K16k4l19m63L04N41j80j13j09k00J65L05M6l58k03P9J29N08m02k83L1O4
5396a72P08k01l53k47J28L63J47m63M0k76L28K35j3k74l76M15qK93l56P3j69L19
5418A41k11o9J1j35J61M52J20k17l69k88N79K60l70J43o79L23K45QJ94l43l83
5439d27L07K70j7j29m61M87J18O5r6l62J03K11K6K51m26k71J82K28J50J63k27
5460A45l58L5L21k24N02o43K0K32K25k8m15j16K54M08m5m36k55j10L98N11l16
5481A05j36l06J69K34K79k52l33J68j49N88l66o1r9K23l2L48j94m00P7J1L19M18
5503F11n27k87O8M02J60l44Ll64Q8L85L6n5k38NJ07M61n57N4j48J05J24R6j24
$$ plain form
5526 61 -434 -177 -160 43 89 -103 -273 -50 441 314 100 -224 -271 -36 127 208 -257 -139 -280 207 632 309
5548 309 -388 5 -138 538 313 161 -347 -361 129 348 16 -163 -332 -97 135 119 136 -251 -164 -193 193 126
5570 126 30 -69 -270 178 183 29 -403 -19 122 304 143 -338 -229 -240 373 487 100 -245 -504 167 12 217
5592 217 -30 60 -36 402 -66 36 -383 31 122 152 237 -309 106 -325 281 214 440 -136 48 -40 -48 207 -219
5615 -219 -260 -385 -54 266 -262 -214 -333 -201 98 135 -266 -174 -103 -43 456 156 -107 -372 -158 -5 315 184
5637 184 -62 -449 4 398 150 -41 -393 128 437 240 245 13 -5 36 192 193 68 -378 -295 177 169 -21 -172
5660 -172 -213 225 236 4 -78 -531 -135 -156 -27 29 -362 -342 -135 265 82 -304 -117 24 410 250 -136 -280
5682 -280 -122 -34 130 99 228 -278 -198 182 351 271 -78 -186 -190 223 219 200 -237 -347 -169 629 190 -132 7
$$ packed form
5526F1m95K57J7K03M6j92j70K23M91j27k14l24m7K35J63Q1m65J18j41M87M25l23
5548C09o97L93j43O76k25j52n08j4M90K19l32j79j69K35K32j6J7l87Q7k9L86o7
5570A26r6r9k01M48Nj54m32L84J41J82j61m81J09j1O13J14l87l45k59O71j55K05
5592B17k47R0r6M38m68J02m19M14R1L0Q5n46M15m31O06o7K26n76J84q8qK55m26
5615b19m1j25L31L20n28M8j19J32K99L7m01R2P1O0M99l00k63k65K14J53L20j31
5637A84k46l87M53L94k48j91l52N21L09j97Nk32j8M1J56Jj25m46Q3M72qj90j51
5660a72m1M38J1k32q2m53L96k1J29N6l91K0K07M00j83l86J87J41L86j60l86j44
5682b80J58Q8J64l1J29n06Q0L80J69q0l49j08mM13mj9m37j10J78P98m39l22J39
$$ plain form
5705 7 14 246 429 87 -125 -257 235 107 -99 -169 -198 58 552 485 -98 -231 -242 52 258 345 50 -5 -230
5728 -230 152 272 583 -352 -271 -189 231 352 112 -127 90 36 265 -304 -298 -251 -71 124 -81 -253 -268 -302 102
5751 102 202 -57 -23 -57 203 -26 20 243 -310 100 408 -118 376 -144 -319 283 394 336 87 26 37 264
5773 264 220 248 176 155 185 315 321 -26 58 -31 7 455 373 -102 -533 -115 196 -141 -68 148 -294 -300 103 153 -362
5798 -362 -292 -258 -150 48 -34 -369 -669 -173 69 -147 -15 -299 -41 -42 109 167 -336 -240 -281 202 23 -108 -60
5821 -60 -40 70 -26 2 -108 -267 25 -70 57 0 -200 123 -51 355 289 -219 -183 -333 61 100 131 -214 -246 -29
5845 -29 233 60 -342 -21 193 89 155 -51 63 -503 -105 42 140 136 -293 179 -91 339 -180 -209 -354 125
5867 125 235 129 -98 -89 -63 -104 346 -112 -140 -213 -3 146 244 135 -223 -203 45 -36 181 -40 -342 -309 129
$$ packed form
5705GPK32J83l42k12j32M92j28k06p0k9K56M94o7n83j33j1K94K06Q7k95n5k25
5728b30L82J20L11r35Q1Q2M20J21k40k39K17n4K29n69OM7J80J95k05j72j5l4M04
5751A02J00k59L4l4K60k29M6K23n53M10L08n26M94n20j75O02J11n8k49o1J1K27
5773B64m4K8p2k1L0J30Ol47Q4q9L8M48q2m75m31M18L11l37P3K16m42oM03N0n15
5798c62P0L4J08J98q2l35l00M96K42k16J32k84K58jJ51N8n03R6m1M83j79j31M8
5821f0K0J10r6K8j10j59K92r5J27n7k00L23j74M06o6n08L6j50L94L9L1l45l2K17
5845b9K62j73m02L21K14j04O6k06J14n66L98J47R8mm29M72k70M30n19k9j45M79
5867A25J10j06k27RK6m1M50m58k8p3K10J49R8j09l58K0K48q1K17k21l02L3M38
$$ plain form
5890 129 77 101 -137 -170 -230 173 32 -209 -56 -111 221 301 225 56 52 314 -93 179 -105 86 -78 339 404
5913 404 -5 31 -337 -38 185 149 12 -508 -271 187 129 168 -201 -102 230 56 194 -198 105 -155 167 115
5935 115 158 -149 -156 5 62 -17 100 -188 -73 211 237 -48 19 38 -381 -5 150 -150 -207 184 390 182 349
5958 349 250 26 86 195 275 -87 -168 -267 201 145 207 -127 -186 28 -77 120 70 -119 -220 -129 80 86 -16 42
5982 42 40 31 -158 378 -320 -465 -57 188 201 -210 -152 -127 239 49 83 -63 -83 24 453 241 -77 -168 -177 -66
6006 -66 115 323 -3 -52 129 112 293 106 11 -33 129 189 36 -192 -89 168 120 122 -159 -13 -136 -62 249
6029 249 40 173 -189 6 125 -18 122 -166 119 297 87 -154 -91 -148 78 269 72 -107 -134 -294 -42
6050 -42 68 404 219 -199 -72 -124 203 -172 -323 -53 147 106 306 -13 -94 -267 60 204 74 32 -97 -45
$$ packed form
5890A29n2K4k38l3o0M03j41k41J53n5L32Q0p6j69mK62m07K72k84J91j64M17O5
5913D04m09L6l68K99K23l6j37n20K37M58n8L9l69R9L32j74J38l92L03k60L22n2
5935A15M3l07pJ61N7p9J17k88J15K84K6k85O7J9m19L76J55l00n7L91K06k08J67
5958C49r9k24O0J09Q0l62q1r9M68n6O2l34n9K14j05J97n0j89j01R1K09Oj02N8
5982D2krj89N36o98j45M08K45J3m11N8K5L66j90L4j46k0J07M29k12l18r1rJ11
6006f6J81K08l26m9J81j7J81j87r5m4J62O0j53k28J03K57m8Kk81J46j23P4L11
6029B49k09J33l62J95J19j43J40k88K85J78k10k41O3n7K26J91j97j79k7j60K52
6050d2J10L36j85m18J27n2L27l75j51K70K00m1K00l19q1j73L27J44j30m2j29N2
$$ plain form
6072 -45 132 318 -141 -28 -219 -340 211 362 -83 -257 -282 144 58 -174 -340 -26 15 110 -213 151 51 -33
6094 -33 -56 171 -18 -693 -286 154 -130 54 -73 -262 -261 110 -35 129 -144 25 355 259 133 144 -180 2
6116 2 121 82 218 -117 -224 -285 318 -141 -105 -274 -114 161 313 -295 -110 -41 -18 243 225 377 -213 -114 214
6139 214 57 113 65 -334 19 206 -117 231 -92 -327 99 327 65 -161 -51 321 281 278 451 -147 71 186
6161 186 223 310 -63 -55 -147 -327 365 32 -165 -111 174 177 79 -145 -246 -90 -16 359 111 -312 -234 14 60 74
6185 74 -66 -221 -31 45 520 337 31 37 94 197 195 22 -167 -177 14 198 104 -196 -50 -140 244 230 -106 -14
6209 -14 -85 43 94 98 -161 -257 9 211 -141 -77 -153 -427 -170 269 -115 -328 -226 185 158 270 -287 -197 -134 33
6233 33 219 5 -170 -156 -94 80 60 -99 -78 -195 -85 252 65 45 -185 -216 93 117 -41 -245 -133 -184 46
$$ packed form
6072d5J77J86m59J13j91j21N51J51m45j74k5M26q6k32j66L14M1R5l23L64j00q4
6094c3k3K27j89o75M07M40k84J84j27j89JL71j45J64k73J69L30r6j26J1l24J82
6116BJ19l9J36l35j07o1O03m59L6j69J60K75J52o08J85O9K3K61j8J52n90R9L28
6139B14j57N6m8l99L53J87l23L48l23k35M26K28k62k26J10L72m0lJ73n98K18J15
6161A86L7Q7l73Qr2j80O92l33j97N4K85Lr8k24j01J56P4L75k48m23P8K48M6J4
6185G4j40j55J90P6M75j83l06ON7J03kj73j89j0J91J84r4l00J46r0L84j4l36R2
6209a4p1J28N1Mk59r6K66K02l52O4p6k74K57M39l84k13J02M11k7J12n57R0O3J67
6233C3J86k14j75J4O2J74k0j59K1j17J10L37j87k0k30l1L09K4j58k04J12n1K30
$$ plain form
6256 46 154 32 -159 3 80 163 293 -179 -104 -275 151 152 -205 -325 -445 154 119 108 -215 -24 8 114 95
6279 95 -74 57 -122 248 368 -153 -82 -165 -6 284 227 -118 -5 89 -88 -49 313 -210 -201 145 96 220 -144
6302 -144 171 -184 113 571 52 222 -221 55 -279 -20 206 -78 -11 257 497 59 130 -274 23 64 94
6323 94 -15 -4 -58 159 19 260 23 131 -66 108 9 -57 -365 -140 240 171 -76 -206 222 11 251 3
6345 3 -48 -220 -20 37 40 -122 -316 -50 -276 -188 145 -16 -322 -119 -313 186 75 -178 -307 12 -35 301 125
6368 125 -293 -37 -102 -80 289 -73 36 -229 -135 240 -50 -248 -104 -62 105 224 281 171 -226 -17 338 296
6390 296 -139 -132 18 -231 219 177 -221 -405 67 -5 -207 181 -240 -282 145 -7 -32 82 -151 266 251 -183
6412 -183 97 -206 -53 124 53 117 -163 254 131 -28 161 96 -173 -45 10 -12 249 -424 -59 -152 74 171
$$ packed form
6256D6J08j22j91J62P7Q3J30m72P5j71M26Jl57j20j20N99l5j1l23J91L2J06j9
6279I5j69J31j79L70J20n21P1q3J59K90n7l45J13R4j77L9L62n23RL46m9J24l64
6302a44L15l55K97M58n19J70m43K76l34K59K26k84O7K68K40m38P1m04K97M1L0
6323I4j09J1n4K17j40K41k37J08j97J74r9o6l08K25L80o9k47j30M28k11K40k48
6345Cn1j72K00N7Lj62j94K66k26Q8L33j61l06K03j94M99j11k53j29L19m7L36j76
6368A25m18K56o5K2L69l62J09k65R4L75k90j98J44M2J67J19N7j10l97K09L55m2
6390B96m35PJ50k49M50m2l98j84M72p2k02L88m21m2M27j52k5J14k33M17j5m34
6412a83K80l03J53J77p1O4k80M17j23j59J89o5k69J28N5k2K61o73L65r3K26R7
$$ plain form
6434 171 -61 1 -65 -287 191 265 -124 -144 -207 373 116 -244 -110 365 39 248 -250 -79 14 32 37 46 -76 9
6458 9 3 -212 30 53 -203 22 -25 121 29 29 -282 -398 151 54 62 -154 -197 -226 66 140 23 -60 -279 -30 211
6483 211 144 -105 -221 -183 -225 -85 128 -398 -126 -308 104 43 -10 -134 -326 -194 562 188 183 -200 98 342
6505 342 107 -222 -145 -82 -252 134 -1 25 -355 38 6 241 15 25 5 105 -146 -101 10 -123 -56 15 84
6528 84 151 -175 -114 123 35 109 -28 -311 -215 327 22 -103 12 -443 -126 -83 73 -170 23 -130 194 279 25
6551 25 -34 -42 -142 -125 371 -5 -115 -256 115 169 278 70 -121 -235 120 280 139 -206 99 199 185 38
6573 38 180 117 30 192 121 132 -230 -102 99 255 209 -9 -82 -4 235 79 89 -66 -47 171 390 -39 -84 136
6597 136 -91 -87 -75 104 27 164 -34 291 214 -247 -140 -61 -145 -67 214 -190 -82 39 -76 349 168 131 199
$$ packed form
6434A71k32O2o6k22M78P4l89k0o3N80k57l60J34M75l26K09m98J71R3J8NRj22Q5
6458Iok15K42K3k56K25m7J46r2%l11j16N49r7Qk16m3k9K92P4j17q3k19K49K41
6483B11o7k49j16L8m2J40K13n26K72j82M12o1n3j24j92J32P56l74nl83K98K44
6505C42k35l29P7O3j70L86j35K6l80L93l2K35k26J0k0J00k51M5J11j33O7P1O9
6528H4O7l26O1K37q8P4j37k83R6N42l05j25J15m55L17M3J56k43J93j53L24Q5k54
6551B5n9qj00J7M96l76j10j41L71N4J09k08j91j14L55J60j41l45L05J00j4j47
6573C8J42o3q7J62p1J1l62J28K01J56m6k18p3P8K39j56J0j55J9K18K19m29m5K20
6597A36k27MJ2J79p7J37j98L25p7m61J07P9q4P8K81m04J08J21j15M25j81l7O8
$$ plain form
6620 199 -23 31 222 -136 -98 7 71 361 -53 -64 -104 -90 125 -88 -148 -86 86 111 -35 183 52 -12 -94 34
6644 34 -11 -57 -110 -179 -151 168 24 -124 9 -5 67 -82 0 10 -14 219 16 148 0 -212 -186 20 -251 -164
6668 -164 80 -198 35 -66 68 -207 -128 201 153 240 -43 -172 174 -78 114 -279 -9 17 -82 94 247 209
6690 209 -250 58 -62 223 137 87 134 -88 -35 -38 44 7 -89 -44 -12 111 -112 -29 -223 147 451 -72 46 -183
6714 -183 -55 243 77 -6 -220 44 187 253 -155 73 151 -255 227 329 -12 -13 -187 149 100 164 -104 42
6736 42 -18 303 180 -113 -27 -76 248 179 302 -64 -265 222 223 -14 410 71 60 389 352 2 202 -136 340
6759 340 133 101 166 -447 -49 -14 221 81 -6 -80 -203 368 114 -298 101 -237 184 70 486 -1 -11 -129
6781 -129 -204 210 -20 141 -152 -58 -17 229 96 -322 -12 109 79 -107 -136 -244 -134 70 -101 -148 57 102
$$ packed form
6620A99k22N4J91l58L8J05O4K90m14j1m0J4K15k13o0O2J72K5j46K18j31o4q2J28
6644C4m5m6n3o9K8L19j44j48J33j4P2j49Q2J0k4K33k03J32j48k12K6K06k71Q7
6668a64K44k78K33j01J34k75P9L29m8Q7k83j29L46k52J92l93K70K6r9J76J53l8
6690B09m59L08j20K85q6n0M7k22N3lQ2l7r6M5L2J23k23Q3j94L70L04n23J18k29
6714a83J28K98j66q3k14K64J43O6m08K28P8m06M82J02l41jj74L36m9O4k68J46
6736D2o0L21j23k93Q6m9L24o9J23l66k01M87Jk37M24l39j1L29l7l50K00l38M76
6759C40k07l2O5o13L98L5K35j40q7p4j23N71k54m12L99l38M21j14M16m87j0j18
6781a29p5M14k30J61k93R4M1K46j33m18L10J21l0j86k9j08J10K04j71m7K05M5
$$ plain form
6803 102 64 11 421 -196 -208 113 217 0 119 112 21 201 34 336 -281 5 -19 171 17 30 32 -222 -295 26
6827 26 -92 -170 -137 -270 119 -109 233 -416 -149 71 -80 282 -20 -88 88 -11 -164 -178 -24 9 -407 128
6849 128 -73 -147 -6 -102 180 270 219 -206 18 271 118 40 -62 10 -246 49 191 181 19 -97 207 -77
6871 -77 290 -109 215 -241 358 346 312 86 -102 -232 142 250 -189 -61 68 211 134 175 -162 9 206 138
6893 138 11 218 -125 -159 48 387 151 167 -115 -87 21 71 -113 62 188 16 -40 -141 -12 -48 -37 36 -198
6916 -198 -28 12 -308 44 429 29 -272 13 26 221 -74 -364 -189 -13 229 441 -4 -87 -64 -188 322
6937 322 41 315 -24 -92 4 -41 240 45 -115 -68 206 128 58 -15 -142 111 -20 85 -64 78 137 -139 138
6960 138 -210 -354 -75 -101 -235 382 58 81 -62 -71 192 -177 -38 -5 88 43 93 -84 -149 -238 129 280 113
$$ packed form
6803A02l8n3M10o17j2L21J04k17J19pr1J80j67L02o17K86k4J90j54J3Kk54p3L21
6827B6j18p8L3j33L89k28L42o49K67K20j51L62l02o8J76r9j53j4J54L3m16N35
6849A28k01p4J41r6K82R0n1m25K24K53j53p8j02P2k56K95J42j0j62j16L04k84
6871g7L67l99L24m56N99j2l4k26j88j30L74J08m39J28J29J43p7M1l37J71J97o8
6893A38j27K07l43l4K07L39k36J6k82K8J08N0j84J75J26j72n6j01J29l6J1P3k34
6916a98J70M0l20L52L85m00l01K85J3J95k95k90J75J76K42K12m45q3K3j24N10
6937C22k81K74l39o8R6m5K81j95j60M7K74p8p0p3j27K53j31J05j49J42N9k76K77
6960A38l48j44K79k6j34O17l24K3j43rK63l69J39L3R3m5N0j77o5q9L67J51j67
$$ plain form
6983 113 -40 -314 69 84 204 -147 -48 -162 23 -254 235 34 -156 -285 -18 276 11 -17 -292 96 197
7004 197 -38 22 -149 -188 -150 13 109 -69 6 -101 39 -38 -40 -204 77 86 193 2 -150 -179 28 -157 202 64
7028 64 -39 -138 -205 244 -90 89 -112 -134 225 -37 -28 170 109 -141 -122 64 151 -301 87 23 156 164 67 -243
7052 -243 -103 102 -140 91 100 -82 58 -73 241 212 -164 -1 -118 125 -111 117 2 -193 86 82 197 27
7074 27 -113 248 447 -324 -168 -136 -2 -174 -221 273 13 57 -19 -61 366 -254 -212 351 347 -119 -41 -281 69
7097 69 -67 -259 -47 -388 -394 167 -7 190 -108 95 -28 -30 150 -149 -46 -51 -264 -178 53 67 -232 21 39
7120 39 98 -51 -16 -62 44 42 -61 188 -87 76 -44 182 284 -245 132 21 -138 14 -196 -93 -137 9
7142 9 -26 172 -148 -184 -85 178 271 34 19 -148 196 177 -251 -233 145 85 -41 88 75 -283 -108 292 28 188
$$ packed form
6983A13j53k74L83J5J20l51R9j14J85k77M89k01j90j29K67K94k65k8k75L88J01
7004A97k35O0j71l9L8J63R6j78P5j07J40p7kj64K81RJ07j91j52k9K07j85L59j38
7028F4j03r9o7M49l34J79k01k2L59k62RJ98o1k50J9J86Q7m52L88o4J33Qr7l10
7052b43J40K05k42K31Rj82J40j31L14k9l76J63j17K43k36K28j15j95K79mJ15j70
7074B7j40L61J99p71J56L2J34j72m7M94k60M4p6m2M27o20M2N63mm66P8k40L50
7097F9j36j92K12l41oN61j74J97k98K03j23kJ80k99J03nk13Q6K31J4k99K53J8
7120C9N9j49L5m6J06kj03K49k75J63j20K26J02n29L77j11j59J52k10J03m4J46
7142Il5J98l20l6R9K63R3k37j5j67L44j9m28J8L78o0j26J29j3l58J75M00k64J60
$$ plain form
7166 188 121 -138 -74 -199 -210 -107 11 -172 107 11 -55 -495 -268 -89 -33 36 107 123 -78 45 227 349 31
7189 31 -298 -246 136 449 343 10 -272 34 258 144 -114 -145 146 170 -4 80 22 58 137 246 -22 -124 156
7212 156 29 39 -184 197 -148 -150 -19 253 9 -172 -131 81 122 -29 -74 -154 -370 -225 63 -66 14 121 120
7235 120 -199 -55 -56 -185 85 -310 -182 -19 -91 77 -175 -160 173 149 -32 -124 -77 49 -24 106 -98 -330 -19
7258 -19 197 120 -126 -220 35 30 69 -105 -222 -32 -191 204 144 316 -363 -112 -18 -358 -5 -89 -81 300 -71 -43
7282 -43 92 -254 8 -323 -168 -118 -7 -190 -249 -68 219 -91 -9 -404 171 76 -206 -86 71 21 -43 -102 -275
7305 -275 208 -7 10 -61 27 -169 -32 61 235 58 -5 -213 70 -169 51 -63 34 -202 -20 -8 -39 -84 -62
7328 -62 -100 101 229 265 65 -131 62 -304 59 -209 19 -162 162 -89 -46 28 -167 60 152 77 -46 18 -35
$$ packed form
7166A88o7k59O4j25j1J03J18j83K79r6o6m40K27J79N6O9P1J6k01J23J82J22l18
7189C1l29N2L82L13j06l33k82L06K24j14k58l1K91K4j74Q4n8L6P9J09k68j02K80
7212A56j27J0k23L81l45kJ31K72k44j81M1K12M1j51m5q0k16J45K88j29Q0J07j
7235A20l19J44jj29K70l95J28J63p2J68k52J5L33k4j81r2M7J26p3J30k04k32L11
7258a9K16p7k46r4K55nL9j74j17J90j59L95o0J72o79K51R4l40L53q4QL81l71K8
7282d3J35l46K62l31J55N0J11j83n9J81K87l10Q2l95N75r5k82J20J57n0o4n9j73
7305b75M83k15J7p1Q8j96J37R3J74j77o3k08K83k39K20j14R7k36J82J2l1m5K2
7328f2l8K01J28L6k00j96J93l66L63k68K28j81L24k51M3P4j95K27R2p5j23O4n3
$$ plain form
7351 -35 110 -28 140 -47 91 -28 6 -72 178 -46 10 115 372 432 332 -69 42 -81 348 210 231 36
7373 36 22 97 53 280 72 -414 -61 276 -213 -392 76 142 246 53 -189 -122 46 -123 -14 218 44 171
7395 171 -282 73 60 -29 -30 -80 -102 -139 270 17 61 19 4 4 16 -257 -3 -26 5 54 -218 -37 -155 28 20 103
7421 103 184 206 -33 168 196 -161 -243 55 165 283 -35 -144 -198 -182 -34 -153 -30 -290 -290 -132 -44 -149 111
7444 111 -158 -125 -101 -28 13 178 -171 -162 131 -25 -163 -230 -204 -174 8 186 -178 -47 -24 -168 376 134 -175
7467 -175 175 -243 -485 372 -105 -411 173 271 163 -175 -210 -209 98 166 211 -267 -211 -144 229 126 27 -479 -78
7490 -78 54 146 3 17 -152 -7 1 77 231 -119 53 272 -55 315 -28 44 -126 95 229 203 143 -122 -34
7513 -34 192 229 51 57 -285 80 242 52 -25 -77 146 245 150 -105 118 -69 215 200 112 -185 -219 64 455 -14
$$ packed form
7351c5J45j38J68j87J38j19L4p8K50k24N6J05K57O0j00m01J11j23M29j38K1j95
7373C6j4P5m4K27k08m86L53L37m89j79M68O6J04j93k42O7J68j69J09K32j74J27
7395A71m53L55j3q9jn0k2l7M09k53M4m2j5%J2k73K54k3L1M9k72J81j18J83qQ3
7421A03Q1K2k39K01K8l57q2K98J10J18l18j09n4J6J48j19J23k60%J58Q8j05K60
7444A11k69L3K4P3M1J65l49RK93j56j38o7K6L0J82J78l64J31K3j44N44k42l09
7467a75L50m18k42Q57m77l06N84R8j08l38l5JL07O8M5m78N6O7L73j03r9n06M01
7490g8J32R2j43J4j69J45QP6J54l50J72K19l27L70l43P2j70K21J34k6o0k65Q8
7513c4K26L7j78Ol42L65J62j90p7n2K23R9r5k55K23j87K84j5q8k97l4K83L91m69
$$ plain form
7537 -14 9 136 97 93 40 48 -213 -263 -111 100 39 234 -125 100 -45 179 27 -182 24 263 102 -352 -114
7560 -114 62 -55 208 -86 -46 -106 -74 -193 -18 -34 126 -46 -73 -302 217 116 -207 -34 26 -30 -72 37 -132
7583 -132 -291 -4 113 -19 35 103 49 304 -39 51 -176 -37 9 -18 -14 -144 -80 -39 -114 50 -85 64 -133 126
7607 126 104 165 20 -19 119 -146 168 -27 -333 -279 -86 -111 -103 -39 354 -47 -11 103 306 -231 -119 -26 -177
7630 -177 350 57 -210 -140 253 219 88 -9 -52 -47 -21 53 173 222 63 274 230 116 -30 -57 42 53 94 89 -362
7655 -362 90 23 -299 -35 -166 -6 -362 406 408 25 -235 -219 160 172 265 -26 -80 -239 359 389 251 -236 79
7678 79 229 207 225 -142 -136 155 -24 -87 -5 9 -312 88 83 94 8 -52 35 -25 -332 204 37 15 -22 13 175 -10
7704 -10 -170 -106 5 30 110 16 -52 122 14 -142 -228 -219 -22 51 206 167 9 -151 -93 90 75 143 52 -262 -50
$$ packed form
7537a4K3J27l9mn3Qk61n0J52K11o1J95l59K25j45K24j52k09K06K39j61m54K38
7560a14J76j17K63k94M0o0L2j19J75j6J60j72k7k29N19j01l23J73O0n6m2J09j69
7583a32j59K87J17j32N4O8n4K55l43R0k27J39M6k7Mj30O4M1p5J64j35J49j97K59
7607A26k2O1j45l9J38k65L14j95l06N4J93k5QO4L93m01L6J14K03n37J12R3j51
7630a77N27k93k67P0L93l4j31r7m3NK6P4J20M9j59K11m4j14j46k7R9J1M1nm51
7655c62M52o7l22K64j31J60l56P68Kl83k60J6L79J2R3k91n4j59N98L0j38m87L15
7678G9J50k2J8l67OK91j79o3Q2J4l21M00nJ1q6o0Q7o0l07N36j67k2l7L5J62j85
7704a0j60O4J11K5Q0r4o8J74j08j56q6RJ97P3J55l9j58j60N8J83j5O8r1l14K12
$$ plain form
7729 -50 376 169 -109 -50 98 241 26 -90 20 3 -323 -123 2 125 -126 209 -35 86 225 -48 60
7750 60 69 -100 -33 -249 -77 289 116 136 103 -150 -214 293 189 350 -69 22 157 -170 465 193 -123 183 59
7773 59 -65 145 107 -266 81 -45 127 55 -88 -373 -73 -13 234 -87 -302 70 -257 88 495 407 -5 9
7795 9 83 190 -207 -237 -62 225 75 103 -53 204 121 -103 241 73 -93 -94 -210 39 70 241 37 -100 -8
7818 -8 9 49 -105 117 241 205 -129 -12 102 -173 84 77 264 -119 -106 103 -130 -23 -137 -155 -197 -390 -68
7841 -68 -271 -52 -77 28 55 239 -11 -33 -162 -280 -117 40 34 -83 -97 40 -94 152 -296 -51 27 155 208
7864 208 -129 -124 -90 -7 -63 1 152 -9 -72 -9 -193 -254 -306 -136 75 43 -49 -169 -76 -367 -10 35 158 74 -124
7889 -124 -24 38 177 -216 104 -199 94 193 -114 -27 8 88 221 274 195 -292 311 36 237 137 -257 176
$$ packed form
7729e0M26k07k78N9J48J43k15j16J10j7l26K00J25J23k51L35k44J21J39k73J08
7750F0Rj69O7k16J72L66j73K0l3k53o4N07j04J61m19R1J35l27O35k72l16L06j24
7773E9j24K10l8l73L47j26J72p2j43k85L00O0K47l21k15L72l27L45M07q8m12J4
7795IP4J07l97l0J75K87j50K8j56K57q3k24L44j68j66jj16K49L1J71k04j37R2
7818hJ7M0j54K22J24l6l34J17J14k75K57pJ87l83J3K09k33J07j14j8m2j93L22
7841f8k03K19k5J05K7J84k50k2j29j18J63J57oj17j4J37j34K46m48K45P8J28N3
7864B08l37NL4Q3n6O4J51j61o3O3j84o1n2J70K11l2r2j20R3k91L57M5J23q4j98
7889a24J00O2J39l93L20l03K93R9l07Q7L5Q0J33N3p9m87O03k75K01j00l94M33
$$ plain form
7911 176 -249 216 279 -24 -291 -161 -47 139 7 22 52 -47 182 40 14 -158 -117 -119 18 4 65 -118 -16
7934 -16 -6 1 161 231 61 255 148 -108 35 216 -232 86 -39 -74 -6 40 -49 114 363 -98 33 -45 248
7957 248 -78 -125 41 292 -169 -9 -127 86 -37 43 -107 94 152 12 -64 -347 -138 83 50 209 -315 -45
7979 -45 260 165 -105 -264 -85 2 330 99 72 -78 6 -23 158 7 -122 44 169 135 -100 -200 25 171
8001 171 58 272 430 -63 166 -175 -9 -257 -89 78 176 340 -103 -41 -371 -133 -82 71 154 -106 148
8022 148 -127 -29 190 126 35 -78 -55 -209 -232 -84 -13 139 216 -29 -80 91 22 76 83 -162 -377 -93 -66 -253
8046 -253 93 -81 -153 -186 -154 -30 -40 -57 -323 91 -104 14 -212 -91 -198 -170 59 -302 243 -340 53 173
8068 173 47 18 -284 19 -125 278 204 45 65 -199 -23 196 -94 71 -90 -113 74 30 7 -142 -162 279
$$ packed form
7911A76m25M65O3l03k67J30J14J86j32J5L0r9K29j42k6j72M1kJ37j4O1j83J02
7934a6J0PJ60P0j70J94j07k56J43J81m48L18j25l5O8M6q9J63K49m61J31p8K93
7957B48l26m7J66K51m61J60j18K13j23Q0j50K01N8j40p6k83K09K21l3J59n24K70
7979d5L05r5k70j59J79Q7L28k31k7j50Q4k9J81j51j29J66J25l4k35j00K25J46
8001A71j13K14J58m93K29l41J66k48J68J67R8J64m43O2l30K38N1J53Q3k60K54
8022A48k75R8K19o4r1j13K3j54k3J48P1J52P7k45n1J71o9N4Pk45k15K84K7j87
8046b53L46j74p2l3L2J24j0j7k66M14j95J18k26J21j07K8K29l61N45n83L93J20
8068A73j26k9l02L03j44M03p4j59K0k64J76K19k90J65j61k3J87m4k3j49k0M41
$$ plain form
8090 279 -267 -145 149 168 17 -174 63 99 19 -57 -68 106 131 -223 275 228 55 154 -37 -431 120 -74 104
8113 104 202 130 -46 -21 162 -35 188 -160 -455 -247 350 10 -140 -45 100 280 120 -160 107 -201 45
8134 45 -41 25 -62 -55 -28 52 -156 -225 153 57 -53 -12 276 -136 119 -25 -178 -21 -79 -19 231 -14 -134 216
8158 216 50 11 -80 -189 17 -155 -20 -93 -94 111 -20 65 -78 128 109 131 3 -194 -41 -131 82 78 -88 -230
8182 -230 -109 58 340 -150 -26 -74 -246 -36 177
$$ packed form
8090B79n46J22K94J9j51j91K37L6q0p6j1J74K5l54M98m7j73R9j91l94N51j94J78
8113A04R8p2j76K5J83j97K23l48k95K08N97l40j50R5J45J80j60k80K67l08K46
8134D5q6O6q7PK7Q0k08o9L78r6j10M1K88m12K55j44j53J57n8O0K50k45j20L50
8158B16j66l9r1j09K06j72J35p3jK05j31Q5j43K06j9K2j28j97J53r0K13mj66j42
8182b30J21J67K82m90J24m8j72K10K13
8191A77
$$ Imaginary data points
##PAGE= N=2
##DATA TABLE= (X++(I..I)), XYDATA
$$ plain form
0 0 0 0 0 0 0 0 0 0 0 0 0 0 -8 8 -8 8 -8 12 -16 16 -18 24 -24 32 -33 40 -46 52 -59 65 -75 84 -94 103 -118
35 -118 130 -144 162 -178 195 -217 241 -267 295 -328 364 -404 451 -505 568 -641 731 -841 981
54 981 -1165 1420 -1803 2430 -3652 6933 -32672 -105109 -44326 30363 48354 -10868 -57220 -40591
68 -40591 21125 49670 20967 -27851 -34100 622 33298 28263 6019 -6368 -237 12051 28418
81 28418 42023 36819 6504 -14482 6391 52218 59199 4046 -52035 -35651 33794 61172 848
94 848 -73115 -64670 13905 56111 7622 -64659 -66697 -4968 34979 6524 -45607 -59428 -32472
107 -32472 -8383 -10195 -26983 -42738 -50402 -44287 -22295 -1349 -6381 -36021 -52201 -25031 21811
120 21811 32529 -7720 -47969 -33405 21055 48236 15134 -35836 -40844 6632 51028 42494
$$ packed form
0@%%%%%%%%%%%%qJ6j6J6j6K0k8L2l4M2m8N6o5P3q6R8j11J24j40J59j78J97k21
35a18K48k74L06l40L73m12M58n08N62o23O92p68Q55r56J073j209J372j572J822
54I81k146K585l223M233o082J0585l9605p2437O0783P4689J7991n9222m6352J6629
68d0591O1716K8545k8703m8818o249L4722L2676n035k2244j2387O131J2288J6367
81B8418J3605n204l0315k0986K0873M5827O981n5153n6081J6384O9445K7378o0324
94H48p3963Q445P8575M2206m8489p2281k038O1729L9947k8455n2131j3821K6956
107c2472K4089j812j6788j5755p664O115K1992K0946n032k9640j6180K7170M6842
120B1811J0718m0249m0249J4564N4460K7181l3102n0970n008M7476M4396q534
$$ plain form
132 42494 -3604 -28234 1503 53244 67497 32281 -4955 826 39100 62725 46837 13285
144 13285 -2519 10374 34299 45080 32290 7199 -6778 7913 40224 55347 29998 -9689
156 -9689 -14326 24988 60699 41650 -12762 -36540 -2294 42444 37312 -9400 -38561 -18679 20193
169 20193 32311 11849 -12792 -16914 1059 23728 32505 17083 -10339 -20818 2352 35640
181 35640 37478 74 -31744 -15299 33816 55172 23598 -18110 -13907 31809 64504 47075
193 47075 6545 -7111 18146 49455 51221 23835 -2157 -768 22787 41901 36284 12948 -3290
206 -3290 4013 27815 43371 33937 6776 -10413 2125 31630 41312 13415 -25923 -31863 3775
219 3775 36354 20400 -28875 -51546 -16790 31684 31004 -17874 -50772 -26032 19496 26684 -9892
$$ packed form
132D2494m6098k4630K9737N1741J4253l5216l7236N781L8274K3625j5888l3552
144A3285j5804J2893K3925J0781j2790k5091j3977J4691L2311J5123k5349l9687
156i689m637L9314L5711j9049n4412k3778L4246M4738n132m6712k9161J9882L8872
169B0193J2118k0462k4641m122J7973K2669Q777j5422k7422j0479K3170L3288
181C5640J838l7404l1818J6445M9115K1356l1574m1708M203M5716L2695j7429
193D7075m0530j3656K5257L1309J766k7386k5992J389K3555J9114n617k3336j6238
206c290P303K3802J5556r434k7161j7189J2538K9505R682k7897l9338n940L5638
219C775L2579j5954m9275k2671L4756M8474o80m8878l2898K4740M5528P188l6576
$$ plain form
232 -9892 -40795 -32231 -5121 4016 -8850 -23375 -27660 -24785 -18639 -5749 3684 -6268 -30436 -35951
246 -35951 -6330 25698 15083 -30393 -52256 -18455 27853 24094 -26672 -58689 -31307 19175
258 19175 29279 -10438 -45868 -33265 10173 30429 8173 -24226 -27975 -3083 17131 11788
270 11788 -8107 -20079 -16615 -5480 3449 5902 -1997 -15349 -21201 -6683 17674 23304 -2585
283 -2585 -31358 -23063 16953 37247 6348 -40818 -42906 4437 37070 11145 -40094 -49341 -6642
296 -6642 30455 16784 -24400 -37971 -11726 16395 13825 -8752 -20857 -16209 -6496 -1378 1261
309 1261 -717 -13015 -24576 -15902 10407 22334 1838 -27024 -23114 13938 38355 18722 -20363
322 -20363 -28914 4712 37734 28698 -10807 -31552 -9188 26935 32379 4079 -21480 -14437 14705
$$ packed form
232i892l0903Q564K7110R137j2866j4525m285K875O146J2890R433r952k4168n515
246c5951K9621L2028j0615m5476k1863L3801M6308l759n0766l2017K7382N0482
258A9175J0104l9717l5430J2603M3438K0256k2256l2399l749K4892K0214n343
270A1788j9895j1972L464J1135Q929K453p899j3352n852J4518K4357N630k5889
283b585k8773Q295M0016K0294l0899m7166k088M7343L2633k5925n1239r247M2699
296f642L7097j3671m1184j3571K6245K8121k570k2577j2105M648R713N118K639
309A261j978j2298j1561Q674K6309J1927k0496k8862L910L7052K4417j9633l9085
322b0363q551L3626L3022r036l9505k0745K2364L6123N444k8300k5559P043K9142
$$ plain form
335 14705 30378 17521 -5946 -13645 -1120 15510 18196 6053 -9590 -15703 -7609 8091 15644
348 15644 2857 -19572 -25150 -1935 24923 20580 -12285 -32366 -11303 24934 29642 -3148 -32267
361 -32267 -21005 14148 27974 5935 -21295 -21482 2276 20510 16036 -515 -10818 -6486 6672
374 6672 19405 18055 1363 -15411 -11771 11758 26040 10369 -18586 -25880 -873 25422 19592
387 19592 -10853 -28109 -11616 18181 24472 1485 -22373 -19487 3334 18586 9661 -11411 -22059
400 -22059 -11630 7561 14904 3825 -13039 -17264 -2471 15780 19714 3989 -13671 -12861 8362
413 8362 26830 19625 -7365 -22333 -4966 24719 29751 2190 -23351 -13935 18157 33113 12863
426 12863 -15793 -16587 7677 24989 15714 -5967 -14760 -5285 6658 10093 4317 -4841 -13446 -12493
$$ packed form
335A4705J5673j2857k3467p699J2525J6630K686j2143j5643o113Q094J5700P553
348A5644j2787k2429n578K3215K6858m343l2865k0081K1063L6237M708l2790k9119
361c2267J1262L5153J3826k2039k7230j87K3758J8234m474j6551j0303M332J3158
374F672J2733j350j6692j6774L640K3529J4282j5671k8955p294K5007K6295n830
387A9592l0445j7256J6493K9797O291k2987k3858K886K2821J5252q925k1072j0648
400b2059J0429J9191P343j1079j6864m225J4793J8251L934j5725j7660Q10K1223
413H362J8468p205k6990j4968J7367K9685N032k7561k5541R416L2092J4956k0250
426A2863k8656p94K4264J7312r275k1681q793R475J1943L435n776r158q605R53
$$ plain form
440 -12493 996 14943 9718 -12564 -25173 -8080 20082 22707 -6178 -30830 -18143 16007
452 16007 28084 2334 -27435 -23683 7859 27009 11622 -15052 -20403 -111 19126 17355 160
465 160 -10989 -6418 5825 13567 10072 -51 -9230 -8673 2164 13470 12274 -3924 -18692 -11712
479 -11712 11453 23136 5165 -22589 -24641 3454 26157 13288 -21096 -32386 -6907 21647
491 21647 16683 -14512 -31141 -13897 12136 14797 -4952 -19948 -14477 -7 6006 2602 -4144
504 -4144 -9880 -12391 -7498 4547 10197 -1395 -19585 -19949 1850 19987 9400 -19321 -28381 -4621
518 -4621 22213 17372 -13080 -30458 -12749 15528 18751 -4628 -25267 -18781 3638 14745 3314
531 3314 -15227 -19320 -7446 5748 6390 -2711 -12857 -14656 -7291 3393 6963 -1803 -16420 -19455
$$ packed form
440a2493J3489J3947n225k2282j2609J7093K8162K625k8885k4652J2687L4150
452A6007J2077k5750k9769L752L1542J9150j5387k6674n351K0292J9237j771j7195
465A60j1149M571J2243P742l495j0123r179N57J0837J1306j196j6198j4768O980
479a1712K3165J1683j7971k7754k052K8095K2703j2869l4384j1290K5479K8554
491B1647m964l1195j6629J7244K6033K661j9749j4996N471J4470O013l404o746
504d144n736k511M893J2045N650j1592j8190l64K1799J8137j0587k8721r060K3760
518d621K6834m841l0452j7378J7709K8277L223k3379k0639O486K2419J1107j1431
531C314j8541m093J1874J3194O42r101j0146j799P365J0684L570q766j4617l035
$$ plain form
545 -19455 -4531 12402 10032 -11963 -26444 -13675 12558 19258 -3489 -26741 -20393 7658 21837
558 21837 4791 -19734 -21006 734 17001 10332 -7425 -14713 -5527 6918 10507 5481 -3081
571 -3081 -8511 -5014 6999 15818 10184 -6591 -13917 -97 20522 21597 250 -17207 -7387 17933
585 17933 26753 8537 -13654 -12099 9488 24791 15490 -5082 -12247 974 16976 18543 5850
598 5850 -6501 -5509 6474 15938 14040 3101 -6902 -4503 7586 18041 13680 -2485 -11877 -2420
612 -2420 16464 21822 5907 -13324 -11371 11005 25702 14486 -9697 -15714 3046 22227 18096
625 18096 -2679 -13671 -4001 12999 16310 5473 -5570 -6229 1667 9919 12312 6011 -4341 -8835
639 -8835 -432 13420 15892 764 -15423 -11577 9937 21617 7243 -15527 -17618 3898 22080
$$ packed form
545a9455J4924J6933k370k1995j4481J2769K6233O700k2747k3252O348K8051J4179
558B1837j7046k4525j272K1740J6267o669j7757p288R186J2445L589n026q562
571c081n430L497J2013Q819n634j6775p326J3820K0619J075k1347j7457R820K5320
585A7933Q820j8216k2191J555K1587J5303r301k0572p165J3221J6002J567j2693
598E850j2351R92J1983R464j898j0939j0003K399J2089J0455m361j6165r392R457
612b420J8884N358j5915j9231J953K2376J4697j1216k4183o017J8760J9181m131
625A8096k0775j0992R670J7000L311j0837j1043o59P896Q252K393o301j0352m494
639h835Q403J3852K472j5128j6187L846K1514J1680j4374k2770k091K1516J8182
$$ plain form
652 22080 13545 -9190 -18236 -3155 15685 15575 -1621 -14001 -9382 4394 11160 4734 -6356
665 -6356 -11195 -6239 2781 8212 3816 -6861 -13624 -7522 6158 11203 -708 -16775 -18271 -1155
679 -1155 13846 7155 -14463 -24353 -8590 13219 14197 -6756 -21913 -12277 9986 16930 2149
692 2149 -13618 -11245 3688 13355 8461 -1823 -6032 -1693 6319 11511 11133 4278 -3198 -2117 10991
707 10991 21423 15397 -2153 -9331 4611 23453 21672 -73 -14793 -4435 17293 21733 3862
720 3862 -14799 -10816 7511 17529 6921 -9717 -13352 -2944 7577 6475 -3578 -11692 -12061
733 -12061 -5341 2011 1995 -5717 -14580 -14770 -4062 7133 5074 -9217 -18465 -9432 9376 14343 -970
748 -970 -18301 -14447 6357 18248 6683 -13085 -15845 1654 16974 12846 -3813 -10899 -1763
$$ packed form
652B2080q535k2735r046J5081J8840j10j7196j2380M619J3776O766o426j1090
665f356m839M956R020N431m396j0677o763O102J3680N045j1911j6067j496J7116
679a155J5001o691k1618r890J5763K1809R78k0953j5157R636K2263O944j4781
692B149j5767K373J4933R667m894j0284m209M339Q012N192l78o855p476J081J3108
707A0991J0432o026j7550p178J3942J8842j781k1745j4720J0358K1728M440j7871
720C862j8661L983J8327J0018j0608j6638l635J0408J0521j102j0053q114l69
733a2061O720P352j6p712q863j90J0708J1195k059j4291r248R033J8808M967j5313
748i70j7331L854K0804J1891j1565j9768k760J7499J5320m128j6659p086R136
$$ plain form
761 -1763 11120 13299 5091 -3384 -4660 302 7056 9125 3816 -5899 -10354 -3302 9123 10659 -3192
776 -3192 -16368 -11915 6805 15466 2487 -16120 -17158 618 14049 6497 -12372 -19141 -7037
789 -7037 8141 7876 -4936 -14691 -10647 1102 7872 3832 -5115 -9294 -5372 3106 8206 4148 -6229
804 -6229 -11826 -5869 5932 10069 -440 -14671 -14232 1332 13689 6699 -11473 -17921 -3989 12719
818 12719 11307 -6191 -17564 -9791 6306 10273 -1147 -13023 -12048 -1116 6401 4081 -3346 -7917
832 -7917 -6030 728 7695 7747 -34 -8775 -6805 5501 14063 6404 -9155 -13678 -192 14745 11717
847 11717 -5973 -16241 -5236 12085 14193 -558 -13262 -9950 3977 10732 2698 -9514 -13072
860 -13072 -6023 2049 2997 -3656 -11178 -12390 -6272 1853 3788 -3423 -12199 -12366 -1495 8609 5293
$$ packed form
761a763J2883K179q208q475j276M962O754K069n309r715m455P052J2425J536j3851
776c192j3176M453J8720Q661j2979j8607j038J7776J3431p552j8869o769J2104
789g037J5178k65j2812r755M044J1749O770m040q947m179L922Q478N100m058j0377
804f229n597N957J1801M137j0509j4231M39J5564J2357o990j8172o448J3932J6708
818A2719j412j7498j1373P773J6097L967j1420j1876R75J0932P517k320p427m571
832g917J887O758O967N2p781q741J970J2306Q562p659j5559m523J3486J4937l028
847A1717j7690j0268J1005J7321K108j4751j2704L312J3927O755q034j2212l558
860a3072P049Q072R48o653p522j212O118Q125J935p211q776j67J0871J0104l316
$$ plain form
875 5293 -8989 -16156 -6686 9200 11574 -2327 -15182 -9830 8056 16888 6341 -8049 -8182 5819
889 5819 16792 12505 826 -4246 1724 10276 12204 7185 438 -2409 926 7420 11673 7261 -2660
904 -2660 -7025 1313 13252 13354 -671 -11942 -6686 8943 14498 1671 -14069 -13241 2077 12296
918 12296 4781 -9755 -13785 -3176 7961 8089 -1575 -8696 -5974 2328 7648 5106 -1730 -6558
932 -6558 -4648 3077 8753 6224 -3401 -8913 -2390 9985 13294 3168 -8800 -7838 6833 15928
946 15928 8799 -7384 -12038 -38 12965 10315 -4405 -13197 -5989 6411 8872 274 -8486 -7725
960 -7725 -122 5178 4568 -959 -6406 -7215 -1649 5288 5719 -2750 -11228 -8650 3628 10718 3560 -9586
976 -9586 -11996 1420 13970 10225 -4631 -11617 -2035 11537 12396 184 -9464 -6182 5022 9770
$$ packed form
875E293j4282p167R470J5886K374j3901j2855N352J7886Q832j0547j4390j33J4001
889E819J0973m287j1679n072N970Q552J928n019o747k847L335O494M253m412r921
904b660m365Q338J1939J02j4025j1271N256J5629N555j2827j5740Q28J5318J0219
918A2296p515j4536m030J0609J1137J28r664p121K722Q302N320k542o836m828
932f558J910P725N676k529r625n512O523J2375L309j0126j1968R62J4671R095
946A5928p129j6183m654J2000J3003k650j4720q792P208J2400K461q598q760P61
960g725P603N300o10n527n447q09N566O937M31q469q478K578J2278P090p158j3146
976i586k410J3416J2550l745j4856o986R582J3572Q59j2212r648L282J1204M748
$$ plain form
990 9770 4375 -4114 -6746 -1211 5266 7429 2430 -3855 -6422 -1575 5844 7488 -9 -9666 -9725 355
1006 355 8964 4595 -8483 -14005 -5147 8622 9124 -3624 -13853 -8290 5667 11311 2307 -9900
1020 -9900 -9850 747 8540 5299 -3591 -7574 -3376 3365 6664 4544 -1277 -4617 -1940 5419 10776
1035 10776 6220 -3530 -7330 1335 12015 10973 -2048 -11239 -4521 9292 13102 1923 -10030
1048 -10030 -7792 5206 12494 5849 -5537 -8136 -706 7317 7047 -868 -6656 -5729 -158 4576 3880
1063 3880 -1874 -7305 -6110 1325 7542 4873 -4400 -9364 -3213 7740 9839 -519 -10879 -8444
1077 -8444 4145 11205 3818 -8930 -11112 -240 9776 7009 -3946 -9380 -3575 5653 7672 1530
1091 1530 -5316 -5617 -556 4205 4625 46 -5704 -6857 -1448 5962 6430 -1718 -9658 -6039 5587
$$ packed form
990I770n395q489k632N535O477K163m999o285k567M847P419J644p497r657n9J0080
1006C55Q609m369j3078n522Q858J3769N02j2748j0229N563J3957N644r004j2207
1020i900N0J0597P793l241q890l983M198O741L299k120n821l340K677P359N357
1035A0776m556r750l800Q665J0680j042j3021r191O718J3813L810j1179j1953
1048a0030K238J2998P288o645j1386k599P430Q023k70p915n788R27N571M734o96
1063C880n754n431J195P435O217k669r273m964O151J0953K099j0358j0360K435
1077h444J2589P060p387j2748k182J0872J0016k767j0955n434N805R228K019o142
1091A530o846l01N061M761M20m579n750j153N409P410M68q148p940L619J1626
$$ plain form
1106 5587 11269 3008 -8768 -9602 2191 11833 7062 -6222 -10624 -1698 8939 8936 -985 -8031 -4118
1121 -4118 4470 8633 4847 -1707 -4228 -908 4749 7276 3629 -2898 -6175 -1963 5457 7315 344
1136 344 -8501 -7798 1816 9161 4518 -7274 -11772 -2944 8102 6938 -4819 -13093 -7632 3423
1150 3423 6532 -1282 -9960 -9220 -1209 4691 2469 -3595 -6935 -4123 1542 4806 3868 -1725 -5489
1165 -5489 -3351 4320 9177 4776 -4642 -7009 2159 11715 10177 -1071 -7689 -566 11218 13358
1179 13358 3227 -6341 -3590 6793 11599 5736 -3407 -5883 338 6557 5947 146 -5003 -4766 -267
1194 -267 3944 3784 -1906 -7548 -6826 -254 5259 2048 -7128 -11462 -5253 4548 6002 -3430 -12005 -8599
1210 -8599 2988 8720 1574 -8045 -8808 732 8626 6156 -2587 -6609 -1666 5682 7450 3007 -2436
$$ packed form
1106E587N682q261j1776q34J1793R642m771j3284m402Q926J0637lr921p046L913
1121d118Q588M163l786o554k521L320N657K527l647o527l277M212P420J858o971
1136C44q845P03R614P345m643j1792m498Q828J1046j164j1757q274N461J1055
1150C423L109p814q678P40Q011N900k222o064l340K812N665L264r38n593l764
1165e489K138P671M857m401r418k367R168R556j538j1248o618P123J1784K140
1179A3358j0131r568K751J0383M806n863r143k476O221O219o10n801n149K37M499
1194b67M211j60n690n642P22O572N513l211r176m334O209R801J454r432q575L406
1210h599J1587N732p146r619p63R540P894k470q743m022M943P348J768m443n443
$$ plain form
1225 -2436 -3061 991 5920 7496 3346 -2683 -3670 1812 8527 8161 -529 -7512 -3409 6341 9943 1906
1241 1906 -8547 -8086 1587 8845 3828 -6969 -9993 -3157 5190 5025 -2869 -8542 -6087 341 3503
1256 3503 1155 -4040 -7206 -5019 739 4125 1479 -5244 -7998 -3226 4379 5924 -1148 -8576 -6731
1271 -6731 2460 8516 2985 -6999 -9393 -913 7514 5667 -3780 -9441 -4694 4280 6258 -81 -6805
1286 -6805 -6198 -238 4211 3003 -1818 -5394 -4605 462 4268 3328 -1987 -6453 -4026 3778 7791 2534
1302 2534 -5548 -6673 1982 10240 7640 -2562 -7080 -264 9150 9735 1470 -5516 -2645 5667 9305
1317 9305 4699 -1604 -3459 784 5850 6131 2396 -2384 -3546 145 4896 5510 -412 -6073 -5697 1328
1333 1328 6596 2870 -6014 -9534 -2795 6054 5816 -2902 -10035 -5704 3833 7478 926 -7098 -6836
$$ packed form
1225b436o25M052M929J576m150o029r87N482O715l66q690o983M103R750L602q037
1241A906j0453M61R673P258n017j0797l024O836Q347j65p894n673K455O428L162
1256C503k348n195l166K187N758L386k646o723k754M772P605J545p072p428J845
1271f731R191O056n531r984k394Q480Q427j847r447n661M747Q974J978o339o724
1286f805O07N960M449j208m821l576P89N067L806r40n315m466K427P804M013n257
1302B534q082j125Q655Q258k600j0202m518O816R414N85q265o986K871Q312L638
1317I305m606o303j855M243N066K81l735m780j162L691M751O14n922n661L76P025
1333A328N268l726q884l520O739Q849k38q718p133M331R537L645o552q024K62
$$ plain form
1348 -6836 1196 6842 4188 -2368 -5182 -1374 4291 6014 3529 -1302 -2980 101 5330 7296 3615
1363 3615 -2473 -4339 1008 7845 7077 -971 -7301 -3005 6012 8495 417 -8373 -7069 2077 7318
1378 7318 2184 -6645 -8842 -2505 3775 2904 -2952 -7623 -5944 -575 2316 685 -3687 -6481 -4886
1393 -4886 471 4036 1417 -4089 -6950 -2500 5273 6505 -473 -6927 -4400 4144 9165 3929 -4770
1408 -4770 -6195 1445 8610 6484 -1130 -5794 -1607 5637 6965 1706 -3970 -3963 784 4301 3925 -513
1424 -513 -4162 -4055 -3 4038 3260 -2824 -6880 -4207 2647 5722 702 -7019 -7766 -16 7038 3973
1440 3973 -5069 -8683 -2321 5945 6233 -895 -6129 -3906 2923 6459 3179 -3005 -4193 -370 4127
1455 4127 5457 1686 -2306 -3770 135 5051 5314 319 -4977 -3964 2191 6725 2743 -5140 -7389
$$ packed form
1348f836Q032N646k654o556k814L808N665J723k485m831j678L081N229J966l681
1363C615o088j866N347O837p68q048o330M296R017K483q078q790J304R146N241
1378G318n134q829k197O337O280q71n856m671J679N369K891j631m372k794J595
1393d886N357L565k619n506k861M450P773J232o978o454K527Q544N021n236q699
1408d770j425P640P165k126p614m664M187P244J328n259n676PM747L517l76m438
1424e13l649J07M052M041p78o084m056K673O854L075n020p721p47P750P054l065
1440C973r042l614O362Q266K88p128n234K223O829L536l280o184j188L823M497
1455D127J330l771l992j464L905M916K63m995n296J013O155M534l982p883k249
$$ plain form
1470 -7389 -1432 5849 4912 -2796 -8216 -5010 3224 5675 90 -6641 -6348 -479 4649 2353 -2682
1485 -2682 -5442 -3074 1691 4305 2003 -2220 -4137 -1542 3247 6024 1620 -3714 -4581 1621 7500
1500 7500 5642 -1853 -6427 -1324 6841 8105 963 -5258 -3919 3572 7522 3097 -3308 -5035 -341
1515 -341 4716 4021 -512 -4317 -3574 142 3763 2790 -1591 -5264 -3939 962 4312 1919 -4079 -6626
1531 -6626 -1581 4589 5301 -1580 -7309 -4506 3369 6918 2027 -5049 -5809 977 6370 4508 -2019
1546 -2019 -5020 -1600 3866 5571 1751 -2608 -3034 226 4020 4288 690 -3096 -3593 954 5004 4144
1562 4144 -1662 -5742 -3144 3715 6235 505 -6370 -5945 1083 6384 3000 -4729 -7269 -1594 4747
1577 4747 4573 -1252 -5866 -3841 1649 4155 1738 -2428 -4084 -1374 2658 4082 1530 -2703 -3894
$$ packed form
1470g389N957P281r37p708n420L206Q234K451n585o731K93N869N128k296n035
1485b682k760K368M765K614k302m223j917K595M789K777m404n334q67O202N879
1500G500j858p495m574N103Q165J264p142o221J339P491L950m425o405j727M694
1515c41N057o95m533l805P43L716L621r73m381l673J325M901L350k393n998k547
1531f626N045O170P12o881n729K803P875L549m891p076p60O786N393j862o527
1546b019l001L420N466J705l820m359m26L260L794K68l598l786m97M547M050q60
1562D144n806m080K598O859K520n730o875M25P028N301l384p729k540N675O341
1577D747j74n825m614K025N490K506k417m166j656K710M032J424k552m233j191
$$ plain form
1592 -3894 -333 4631 5164 -108 -4792 -3584 3097 6645 3198 -4080 -5946 338 6577 5061 -1876
1607 -1876 -6366 -2733 4097 5691 808 -4372 -4278 901 4379 3076 -1571 -4340 -2279 1684 3691
1622 3691 2313 -2077 -4559 -1870 2607 5122 1495 -4077 -4456 1290 6454 5033 -2251 -5597 -1183
1637 -1183 5786 6743 565 -4973 -3009 3034 6232 2857 -2593 -4162 -339 4295 4185 -140 -3283
1652 -3283 -3258 92 3316 2774 -1485 -4973 -4131 1205 4167 1235 -4776 -6601 -1850 4015 3893 -2425
1668 -2425 -7088 -4576 2424 5129 489 -5711 -5107 172 4784 3231 -2339 -4819 -1976 2702 4558
1683 4558 1599 -2289 -2733 87 3967 4677 1385 -2561 -2848 1561 5149 4415 -1387 -5056 -1828 4034
1699 4034 5752 832 -5490 -4646 1240 5350 2112 -4624 -6393 -2032 2992 2565 -2621 -6273 -4721
$$ packed form
1592c894L561M964N33n272m684J208O681L548l447p278j866O284O239j516o937
1607a876m490L633O830J594m883n180R4N179L478j303m647k769K061L963K007
1622C691j378m390k482K689M477K515l627n572l79N746N164j421p284l346M414
1637a183O969R57o178n538J964O043L198l375n450j569L823M634j10m325l143
1652c283K5L350L224n42m259l488Q42N336K962k932o011j825M751N865j22o318
1668b425m663K512P000K705m640o200O04N279M612j553n570k480K843M678J856
1683D558k959l888m44K820L880P10l292l946k87M409L588p34n802l669L228N862
1699D034J718m920o322Q44N886M110l238o736j769M361N024m27n186l652J552
$$ plain form
1714 -4721 -614 1710 28 -3912 -5438 -3446 102 2363 -236 -4222 -5427 -2049 3084 3301 -1582
1729 -1582 -5545 -4229 2266 5820 1865 -4136 -4589 742 6246 4671 -959 -4197 -1188 4410 5759
1744 5759 2004 -2542 -2706 1307 4517 3444 106 -2986 -1837 1701 4097 2402 -1748 -4075 -1718
1759 -1718 2821 4610 317 -4977 -4977 155 5022 2415 -3913 -6314 -1964 3640 4129 -1221 -5292 -3670
1775 -3670 1876 4706 1781 -2364 -3714 -882 2873 3701 786 -2381 -2877 516 3877 3656 180 -3594
1791 -3594 -2276 2716 5618 2998 -2686 -4006 629 5894 4991 -999 -4578 -2012 3769 5658 1464
1806 1464 -3923 -3386 1205 4885 3296 -947 -3023 -769 2934 4525 2026 -1267 -2434 -128 3642
1821 3642 4072 964 -2703 -2966 1314 5536 3966 -1541 -4363 -822 4577 5602 301 -4435 -3267
$$ packed form
1714d721M107K324j682l940j526J992L548K261k599l986j205L378N133K17m883
1729a582l963J316O495L554l955o001m53N331N504j575n630l238L009N598J349
1744E759l755m546j64M013L210j073l338l092J149L538K396j695m150k327K357
1759a718M539J789m293n294%N132M867k607o328k401M350N604M89n350m071J622
1775c670N546K830k925m145j350K832L755Q28k915l167m96L393L361k21l476l774
1791c594J318M992K902k620n684j320M635N265r03n990l579K566N781J889m194
1806A464n387N37M591L680j589m243k076K254L703J591k499l293j167K306L770
1821C642M30l108l667k63M280M222j570n507k822L541N399J025n301m736J168
$$ plain form
1836 -3267 1971 5282 1985 -3430 -4550 -1026 3102 3004 -1258 -4253 -3281 -12 2652 1140 -2263 -4183
1852 -4183 -2665 972 2301 534 -3720 -5281 -815 3015 3103 -1552 -5180 -2784 2654 5366 1492
$$ packed form
1836c267N238L311l297n415j120L524M128r8m262k995R72L269K664j512l403j920
1852d183J518L637J329j767m254j561M466L830Q8m655l628K396N438K712l874
$$ [...]
8191a12
##END NTUPLES=NMR FID
##END=
