##TITLE=1H_K-317/2
 CDCl3,8 sc, 
 8.02.2021
##JCAMPDX= 6.0         $$ Bruker NMR JCAMP-DX V2.0
##DATA TYPE= NMR FID
##DATA CLASS= NTUPLES
##ORIGIN= UXNMR, Bruker Analytische Messtechnik GmbH
##OWNER= root
$$ XWIN-NMR		Version 3.5
$$ Mon Feb  8 11:38:35 2021 Russian Standard Time (UT+4h)  she@DPX200
##.OBSERVE FREQUENCY= 200.1315066352
##.OBSERVE NUCLEUS= ^1H
##.DELAY= (6, 6)
##.ACQUISITION MODE= SIMULTANEOUS
##.ACQUISITION SCHEME= undefined
##.AVERAGES= 8
##.DIGITISER RES= 18
##SPECTROMETER/DATA SYSTEM= spect
##.PULSE SEQUENCE= zg30
##.SOLVENT NAME= CDCl3
##.SHIFT REFERENCE= (INTERNAL, CDCl3, 0, 15.7039)
##AUDIT TRAIL= $$ (NUMBER, WHEN, WHO, WHERE, WHAT)
$$ ##TITLE= Audit trail, XWIN-NMR		Version 3.5
$$ ##JCAMPDX= 5.01
$$ ##ORIGIN= Bruker BioSpin GmbH
$$ ##OWNER= she
$$ F:/spectra/data/she/nmr/H-F/1/audita.txt
$$ ##AUDIT TRAIL=  $$ (NUMBER, WHEN, WHO, WHERE, WHAT)
(   1,<2021-02-08 11:37:08.53 +0400>,<she>,<DPX200>,
      <created by zg, POWCHK disabled, PULCHK disabled
       configuration hash MD5:
       00 E9 B6 7A A2 85 ED C7 34 08 36 98 17 FE 4E 26
       data hash MD5: 16K
       F2 12 BF 28 A3 02 84 70 78 0B 5D CA E1 87 A7 5F>)
$$ ##END=
$$ 
$$ hash MD5
$$ AD 59 AB C9 96 7F 4B 97 33 1F A3 05 5E 59 3B 1E
##$RELAX= 
##$RELAX= 
##$RELAX= 
##$RELAX= 
##$RELAX= 
##$RELAX= 
$$ Bruker specific parameters
$$ --------------------------
##$DU= <F:/spectra>
##$EXPNO= 1
##$NAME= <H-F>
##$PROCNO= 1
##$TYPE= <nmr>
##$USER= <she>
##$AMP= (0..31)
100 100 100 100 100 100 100 100 100 100 100 100 100 100 100 100 100 100 
100 100 100 100 100 100 100 100 100 100 100 100 100 100 
##$AQSEQ= 0
##$AQ_mod= 1
##$AUNM= <au_zg>
##$AUTOPOS= <>
##$BF1= 200.13
##$BF2= 200.13
##$BF3= 200.13
##$BF4= 200.13
##$BF5= 200.13
##$BF6= 200.13
##$BF7= 200.13
##$BF8= 200.13
##$BYTORDA= 1
##$CFDGTYP= 0
##$CFRGTYP= 5
##$CHEMSTR= <none>
##$CNST= (0..31)
1 1 145 1 1 1 1 1 1 1 1 1 1 1 1 1 1 1 1 1 1 1 1 1 1 1 1 1 1 1 1 1 
##$CPDPRG= <>
##$CPDPRG1= <>
##$CPDPRG2= <>
##$CPDPRG3= <>
##$CPDPRG4= <mlev>
##$CPDPRG5= <mlev>
##$CPDPRG6= <mlev>
##$CPDPRG7= <mlev>
##$CPDPRG8= <mlev>
##$CPDPRGB= <>
##$CPDPRGT= <>
##$D= (0..31)
0 1.2 0 0 0 0 0 0 0 0.06 0 0.03 0 0 0 0 0.0002 0 0 0 0 0 0 0 0 0 0 0 0 
0 0 0 
##$DATE= 1612769827
##$DBL= (0..7)
120 120 120 120 120 120 120 120 
##$DBP= (0..7)
150 150 150 150 150 150 150 150 
##$DBP07= 0
##$DBPNAM0= <>
##$DBPNAM1= <>
##$DBPNAM2= <>
##$DBPNAM3= <>
##$DBPNAM4= <>
##$DBPNAM5= <>
##$DBPNAM6= <>
##$DBPNAM7= <>
##$DBPOAL= (0..7)
0.5 0.5 0.5 0.5 0.5 0.5 0.5 0.5 
##$DBPOFFS= (0..7)
0 0 0 0 0 0 0 0 
##$DE= 6
##$DECBNUC= <off>
##$DECIM= 32
##$DECNUC= <off>
##$DECSTAT= 4
##$DIGMOD= 1
##$DIGTYP= 9
##$DL= (0..7)
0 120 120 120 120 120 120 120 
##$DP= (0..7)
150 150 150 150 150 150 150 150 
##$DP07= 0
##$DPNAME0= <>
##$DPNAME1= <>
##$DPNAME2= <>
##$DPNAME3= <>
##$DPNAME4= <>
##$DPNAME5= <>
##$DPNAME6= <>
##$DPNAME7= <>
##$DPOAL= (0..7)
0.5 0.5 0.5 0.5 0.5 0.5 0.5 0.5 
##$DPOFFS= (0..7)
0 0 0 0 0 0 0 0 
##$DQDMODE= 0
##$DR= 18
##$DS= 0
##$DSLIST= <SSSSSSSSSSSSSSS>
$$ [...]
##$SUBNAM2= <"">
##$SUBNAM3= <"">
##$SUBNAM4= <"">
##$SUBNAM5= <"">
##$SUBNAM6= <"">
##$SUBNAM7= <"">
##$SUBNAM8= <"">
##$SUBNAM9= <"">
##$SW= 16.9725356469052
##$SWIBOX= (0..15)
0 0 2 0 0 0 0 0 0 0 0 0 0 0 0 0 
##$SW_h= 3396.73913043478
##$TD= 16384
##$TD0= 1
##$TE= 0
##$TE2= 300
##$TE3= 300
##$TEG= 300
##$TL= (0..7)
0 120 120 120 120 120 120 120 
##$TP= (0..7)
150 150 150 150 150 150 150 150 
##$TP07= 0
##$TPNAME0= <>
##$TPNAME1= <>
##$TPNAME2= <>
##$TPNAME3= <>
##$TPNAME4= <>
##$TPNAME5= <>
##$TPNAME6= <>
##$TPNAME7= <>
##$TPOAL= (0..7)
0.5 0.5 0.5 0.5 0.5 0.5 0.5 0.5 
##$TPOFFS= (0..7)
0 0 0 0 0 0 0 0 
##$TUNHIN= 0
##$TUNHOUT= 0
##$TUNXOUT= 0
##$USERA1= <user>
##$USERA2= <user>
##$USERA3= <user>
##$USERA4= <user>
##$USERA5= <user>
##$V9= 5
##$VALIST= <valist>
##$VCLIST= <CCCCCCCCCCCCCCC>
##$VD= 0
##$VDLIST= <DDDDDDDDDDDDDDD>
##$VPLIST= <PPPPPPPPPPPPPPP>
##$VTLIST= <TTTTTTTTTTTTTTT>
##$WBST= 1024
##$WBSW= 4
##$XGAIN= (0..3)
0 0 0 0 
##$XL= 0
##$YL= 0
##$YMAX_a= 100192
##$YMIN_a= -17410
##$ZGOPTNS= <>
##$ZL1= 120
##$ZL2= 120
##$ZL3= 120
##$ZL4= 120
##$ABSF1= 10
##$ABSF2= 0
##$ABSG= 5
##$ABSL= 3
##$ALPHA= 0
##$AQORDER= 0
##$ASSFAC= 0
##$ASSFACI= 0
##$ASSFACX= 0
##$ASSWID= 0
##$AUNMP= <proc_1d>
##$AZFE= 0.1
##$AZFW= 0.1
##$BCFW= 1
##$BC_mod= 2
##$BYTORDP= 1
##$COROFFS= 0
##$CY= 11.3945322036743
##$DATMOD= 1
##$DC= 2
##$DFILT= <>
##$DTYPP= 0
##$F1P= 15.9154993809931
##$F2P= -4.1035820241983
##$FCOR= 0.5
##$FTSIZE= 0
##$FT_mod= 4
##$GAMMA= 1
##$GB= 0.15
##$INTBC= 1
##$INTSCL= 1
##$ISEN= 128
##$LB= 0.24
##$LEV0= 0
##$LPBIN= 0
##$MAXI= 10000
##$MC2= 0
##$MEAN= 0
##$ME_mod= 0
##$MI= 1.114404
##$NCOEF= 0
##$NC_proc= 0
##$NLEV= 6
##$NOISF1= 3.799351
##$NOISF2= 2.8
##$NSP= 1
##$NTH_PI= 0
##$NZP= 0
##$OFFSET= 15.70392
##$PC= 1
##$PHC0= -10763.81
##$PHC1= 14.40094
##$PH_mod= 1
##$PKNL= yes
##$PPARMOD= 0
##$PSCAL= 0
##$PSIGN= 0
##$REVERSE= no
##$SF= 200.130013532006
##$SI= 16384
##$SIGF1= 3
##$SIGF2= 2
##$SINO= 400
##$SIOLD= 16384
##$SREGLST= <1H.CDCl3>
##$SSB= 0
##$STSI= 0
##$STSR= 0
##$SW_p= 3612.71676300578
##$SYMM= 0
##$S_DEV= 0
##$TDeff= 0
##$TDoff= 0
##$TI= <>
##$TILT= no
##$TM1= 0
##$TM2= 0
##$TOPLEV= 0
##$USERP1= <user>
##$USERP2= <user>
##$USERP3= <user>
##$USERP4= <user>
##$USERP5= <user>
##$WDW= 1
##$XDIM= 8192
##$YMAX_p= 0
##$YMIN_p= 0
$$ End of Bruker specific parameters
$$ ---------------------------------
##NTUPLES= NMR FID
##VAR_NAME=  TIME,          FID/REAL,        FID/IMAG
##SYMBOL=    X,             R,               I
##VAR_TYPE=  INDEPENDENT,   DEPENDENT,       DEPENDENT
##VAR_FORM=  AFFN,          ASDF,            ASDF
##VAR_DIM=   8192,          8192,            8192
##UNITS=     SECONDS,       ARBITRARY UNITS, ARBITRARY UNITS
##FACTOR=    0.0002944,     1,               1
##FIRST=     0,             0,               0
##LAST=      2.4114304,     0,               0
##MIN=       0,             -17410,          0
##MAX=       2.4114304,     100192,          0
$$ Real data points
##PAGE= N=1
##DATA TABLE= (X++(R..R)), XYDATA
0@%%%%%%%%%%%%%%%Pj5J6j6J6j6K4l2L2m0M8n6O4p2Q7r6J06j22J39j60J81k01
37a06K26k54K83l16L51l87M29m76N24n78O40p04P75q56R42j037J143j261J396
56G34j550J725j927K164k448K795l228L787m540N615p289J0269j7167O1650M7353
71I7943n2661J8024l5118k219L871o851Q494R356j6021R923j1692n882R421j5773
85A0815K383m584j7357Q21p696j792P533K902l710R423j0500K792N178o933J1266
100E41k384n941J622p471l690J0045k934P599Q342j1029J1494r093j921R389r368
115d799M840l22r754M443N87m725J2679m213n45L579j3287M596k830K84Q208Q88
131c71J815M252l313j260N489p467M797l156o631M503m195L512O999K965L303
$$ plain form
0 0 0 0 0 0 0 0 0 0 0 0 0 0 0 0 0 7 -8 8 -8 8 -8 16 -16 16 -24 24 -32 32 -40 47 -49 57 -65 74 -86 95 -106
37 -106 120 -134 149 -167 184 -203 226 -250 274 -304 336 -368 407 -449 493 -544 599 -662 734
56 734 -816 909 -1018 1146 -1302 1493 -1735 2052 -2488 3127 -4162 6107 -11060 50590 97943
71 97943 45282 63306 28188 25969 29840 22989 31483 40839 24818 34741 23049 17167 26588 10815
85 10815 13198 8614 -8743 -7922 -15618 -17410 -9877 -6975 -10685 -1262 -11762 -8970 -3792 -10725 541
100 541 -1843 -7784 -6162 -13633 -17323 -7278 -10212 -2613 5729 -5300 6194 -2899 -4820 4569 -4799
115 -4799 41 -281 -10035 -5592 -5005 -9730 2949 -1264 -1809 1770 -11517 -6921 -9751 -9467 -1259 -371
131 -371 1444 5696 2383 1123 6612 -855 3942 786 -5845 -1342 -5537 -2025 4974 7939 11242
146A1242N050p921N66k626q616O602q143J216J221n699M069J503l27N996j96m536
162e99M757r752J065J102o042O866m082m91J720j974J055N216j060K713K753o411
178c164M756m799J24L610l112K386l42k426K31K166l206N577k382j859L446o318
194e312L790L59n13L135m34l130J113l821k401M333n011N132J03j466N508k575
210a190L245J820r23q95J37n692J112p98j987O654k648M190J057j406K092N1j706
227C113K50m76m617L290m549J429K755k674M869k025q16M66j213j709K620k408
243a695N90J431m171L805l021N83L226l508J492j318j883k46K184j637L966q49
259a051m84L025m674K806r12j819O26j378k110J303J98R3N198l170M095m42k552
$$ plain form
146 11242 16292 8371 8937 6311 -2305 4297 -3846 -2630 -1409 -7108 -3039 -1536 -1863 4133 3937 -599
162 -599 4158 -5594 -4529 -3427 -9469 -2603 -6685 -7176 -5456 -7430 -6375 -1159 -2219 494 3247 -3164
178 -3164 1592 -3207 -3083 527 -2585 -199 -541 -2967 -2736 -570 -3776 1801 -581 -2440 1006 -5312
194 -5312 -1522 -1163 -1676 1459 1025 -2105 -992 -4813 -7214 -2881 -7892 -2760 -2657 -4123 1385 -1190
210 -1190 2055 3875 2952 2057 2194 -3498 -2386 -3184 -5171 1483 -1165 3025 4082 2676 4768 4819 3113
227 3113 3363 2887 -1730 1560 -2989 -1560 1195 -1479 3390 1365 549 1015 -198 -1907 713 -1695
243 -1695 -1105 326 -3845 -40 -3061 -2478 748 -2760 -1268 -2586 -4469 -4715 -2531 -4168 -202 -1051
259 -1051 -1535 1490 -3184 -378 -1290 -3109 -2483 -3861 -5971 -4668 -4470 -4377 821 -2349 1746 1304 -1248
276a248K142l498n3n17r49n30K756k388L480J783j327N040l261J174o73k542M52
293a59j24p75J486J208j873M454k921K136J524l158K510k515n51K29j48p49L075
310C649j567O02J828l939K905k945l43J027k444R03J04J04J8K612k383K986k080
327A037k074J358m279J444j317k84J330M41k73K154R1j028K683m228J353j787
343c379k576J857j613J309J654J001l36K668k535J455l12k674K547l084J341M26
359b251K2J899J197J52Q35R12k703K329k977R58J244j686K600o37Q14P24O69j072
377C029J786j932o45J131l228K930j679N12J493q28O24l95r73m45R55l114J974
394A195k343q10J749k689K405l36n15O56J89j515N58j430j479J720l057J887m47
$$ plain form
276 -1248 894 -2604 -2657 -3174 -4123 -4653 -1897 -4285 -805 978 -349 4691 1430 2604 1931 -611 -159
293 -159 -283 -1058 428 1636 -237 4217 1296 3432 4956 1798 4308 1793 1242 1471 1323 574 3649
310 3649 2082 2684 4512 573 3478 533 190 1217 -1227 -324 -220 -116 -98 2514 131 3117 1037
327 1037 -1037 321 -3958 -2514 -3831 -4115 -2785 -2344 -2617 -463 -372 -1400 1283 -2945 -1592 -3379
343 -3379 -5955 -4098 -5711 -4402 -2748 -1747 -2083 585 -1950 -495 -807 -3481 -934 -4018 -2677 -2251
359 -2251 -2229 -330 867 1019 1854 2766 63 2392 -585 373 1617 -69 2531 1894 2708 3432 4101 3029
377 3029 4815 2883 2238 3369 141 3071 1392 1904 3397 2569 3193 2798 1825 1380 2335 -779 1195
394 1195 -1148 -1958 -209 -2898 -493 -829 -1344 -688 -499 -2014 -1456 -2886 -4365 -2645 -5702 -3815 -4262
411d262l66K191p04O98K64M6j643J124k706J084K26j124L433j433K174N82j90
428f06M59K39j504o2L88j778L201j455K160J704m28J936j323K61m38l60j212J906
446C088j356O16K123j679L385j388P78n9j219m28l74r67l09J617j873K072o80
463C347m59J503k336J141j188q74m45J05j423R76r5p23J975k647J635r69j060
480a537O45j213r6j2p3q30J671j590J823K63j117K213k134P85m88l85l07L23j32
499b191R06J448j078L092j270J089L92j378M29r29Q2j10Q21l79K053o72P15J388
517D408k125J512j657k82j1p00J39M34l0P8J623k089J582j802l67O51k058J163
535D69m93O45K67M12m98J157o81r53O86k226J185j139j20Q75j09O06L36M45q34
$$ plain form
411 -4262 -4628 -2437 -3141 -2443 -2179 -2133 -3776 -2652 -5358 -4274 -4048 -5172 -1739 -3172 -998 -416 -606
428 -606 -147 92 -1412 -1474 -1086 -2864 337 -1118 1042 2746 2318 4254 2931 3192 2754 2394 1182 3088
446 3088 1732 2348 4471 2792 6177 4789 5567 5508 4289 3861 3487 2520 2211 3828 1955 4027 3347
463 3347 2888 4391 2055 3196 2008 1134 689 794 -629 347 252 -471 1504 -1143 492 -477 -1537
480 -1537 -892 -2105 -2201 -2213 -2286 -3116 -1445 -3035 -1212 -949 -2066 147 -1987 -1202 -1690 -2075 -2382 -2059 -2191
499 -2191 -1285 163 -915 2177 907 1996 2388 1010 1439 510 592 482 1303 924 2977 2305 3020 4408
517 4408 2283 3795 2138 1856 1845 1145 1284 1718 1688 1766 3389 1300 2882 1080 713 1364 -694 469
535 469 -24 621 888 1300 802 1959 1278 325 1011 -1215 -30 -1169 -1289 -414 -523 83 419 864 30
554C0J100k041L69j80j662Q05j388Q86K19L32R5R38j48M88L69j958J759j761Q04
573i44j13n01J557k67O26N97R26l11J298j113JP05j607J528j026R19M16L84J49
592C224J37J65p09R0j847J429j404M44P34n49R28K83K08j357O99q75n6m43j382
611b81J871j514J601j26N57Q66l60L9n22k94j508O09j809P24k8m45J634p50Q57
630A121k66j5n61q3j144m74j98j015J467j219R97M11j11M95l64K40n87M80j190
649b016J291p51L66Q02p95J832p92L69L8l78l03L63K1m08J649j546K038o64m7
668A069Q86j123O30q10j12q26N27o08J154M3L4J528j175J312j148l8m05o71j63
687A04n7M12q50J796j185J193J8p83J425j395n6q86m1n79L80o17L53P23j137J683
$$ plain form
554 30 1130 -911 -542 -722 -2384 -1579 -2967 -2081 -1862 -1530 -1435 -497 -645 -157 212 -1746 13 -1748 -944
573 -944 -1057 -1558 -1 -268 358 955 1881 1570 2868 1755 1756 2461 854 2382 1356 2275 2691 3075 3224
592 3224 3361 3526 2817 2907 1060 2489 1085 1529 2263 1714 2642 2925 3133 1776 2475 1600 1544 1101 -281
611 -281 1590 76 1677 1551 2108 2974 2614 2653 2131 1837 329 938 -871 -147 -175 -620 1014 264 1121
630 1121 855 840 279 196 -948 -1422 -1620 -2635 -1168 -2387 -1390 -979 -1090 -595 -959 -719 -1306 -826 -2016
649 -2016 -725 -1476 -1110 -308 -1103 729 -63 306 344 -34 -337 26 47 -361 1288 -258 1780 1116 1069
668 1069 1955 832 1462 652 540 -286 241 -367 787 830 864 2392 1217 2529 1381 1343 938 267 104
687 104 47 459 -391 1405 220 1413 1431 648 2073 678 622 -264 -305 -884 -504 -1121 -768 -45 -1182 501
707E01j532Q69o37o85K28o93N1p2P02j000J384o56M51N42j429J012r37L81p5M11
727a184p5M93L80L4J095j429J354j132k32N86j054P24j37O75K87J044p43J042
745A728n2n36N50j741P66n90K48r0L24N28K31L55l40Q60j396N81r00m56P41j205
765c94R46n92N04k52P38n56J13P4j335Q70j164P08l03O1M25k58J08j76J56o46
785i73O77j040j8L14p56J037m64K08M12K47k99L2k98m12M09j246J079p23N45N63
805g06q5Q12l8M96l37L01q55N18n32n54J246q65J156L4N74J26J06J21m87L93j274
826A50R98j031P10nj13J001q88N62j96K10j189N19o88k25M37q15J349q91Q42o
846G31n35L05m09l7p31L81p52J101p18M67M90n84R55p43J17m06M8n09j1l6k33
$$ plain form
707 501 -1031 -162 -799 -1484 -1256 -1949 -1898 -1970 -1268 -2268 -884 -1540 -1089 -547 -1976 -964 -1901 -1520 -1595 -1184
727 -1184 -1259 -766 -386 -352 743 -686 668 -464 -696 -110 -1164 -440 -577 98 385 1429 686 1728
745 1728 1676 1140 1690 -51 715 125 373 283 607 1135 1366 1721 1381 2241 845 1426 526 70 811 -394
765 -394 552 -40 464 212 950 394 507 581 -754 116 -1048 -340 -643 -582 -157 -415 -307 -483 -327 -973
785 -973 -296 -1336 -1354 -1040 -1796 -759 -1223 -1015 -603 -356 -655 -623 -921 -1333 -924 -2170 -1091 -1814 -1269 -706
805 -706 -791 21 -17 479 142 443 -412 106 -426 -980 266 -599 557 591 1165 1291 1397 1518 1031 1424 150
826 150 1148 117 827 822 709 1710 822 1384 1188 1398 209 728 40 -185 252 -563 786 -105 737 731
846 731 196 501 92 55 -676 -295 -1047 54 -664 -197 293 -291 664 -79 38 -368 -320 -829 -840 -876 -1109
867a109M70l79Q50m16N19O4m69K83p17Q0o91Q01m54P78l0p3J041p23J116p57J37
888C21j95j32l19L96N15n35R52l13P19k84mN66r06K02m69L69n58P19k29L59J83
909A357p08P30p43M57p60J2K0m78M32k72P14n98R15p27K03M4r97N51q47O26m15
930d84L30j49L50L1Q1O87j639J235j128r4J53q35M83k97O30k91O42q67N87j23
950f98m46O27j087O23m80N94k78K98K80J05O50p95P31p31P72m13j45N20l92O19
970C54OQ06l57M42p37N05p0o41N19p46L29O5O2M21P9o5L2L16j203P71r12K61j81
993E6m22Q55m05M91N7L60p33P7k68n62O85j074P81p42M13L35m7J10l41K47o25
1014g52M60j106P07n92J21O38q05R49j57K09k58Q8k09j81J30p69J061p07R68j83
$$ plain form
867 -1109 -639 -1018 -168 -584 -65 -1 -470 -187 -904 -824 -1515 -714 -1168 -390 -420 -493 548 -175 941 184 321
888 321 126 -6 -325 71 586 51 1003 690 1409 1125 1121 1687 781 983 514 883 325 1044 815 1174 1357
909 1357 649 1379 636 1093 333 345 365 -113 319 47 761 163 1078 351 554 598 -399 152 -695 -69 -484
930 -484 -154 -303 47 78 159 846 -793 442 -686 -780 -627 -1462 -979 -1276 -646 -937 -295 -1162 -575 -698
950 -698 -1144 -517 -1604 -981 -1461 -867 -1145 -847 -567 -462 188 -607 124 -607 165 -248 -393 127 -265 354
970 354 360 1166 809 1251 514 1019 949 308 827 81 410 475 537 958 1037 972 1004 1320 117 888 -24 237 56
993 56 -366 489 84 575 632 992 259 336 68 -494 191 -883 -102 -844 -431 -96 -143 -33 -374 -127 -752
1014 -752 -292 -1398 -691 -1283 -1162 -524 -1329 -380 -537 -328 -586 -498 -707 -888 -758 -1527 -466 -1173 -205 -388
1034c88L02M41l52N35m48J99n04O13n31M19J98o82J286o88P31l97J29J58l81K5
1054F65l22M22p48J018o50Q15l5n72O43p17K89m65J63l49J27j67k5L85o85J143
1074I35p70K91k42l29mj09q9m42O37q33Q86j42l79O42o10L10n98L06m31J83k73
1095a061J27M0N3Q93p51P31l90k37j3k6K49k83J71k3O87k69L08K72k15N87q59
1116iO60n72R8K8L9J37K8N01o12J093p21L12j27l89K45k78M76n30M07k26N63k31
1138H92r7L48p84L81p30L16j57k76O6L25j90oL18n90L95k97j22l0n53M58m37K32
1160e38NO26m97L07l40k13N38r73O12n85Q8L60J9L81l63P94p09N21m82R1J7n83
1182i24O06m27R45m82Q29o95O45j10k1M02p73J038m69j56k44j46N20k35O49j73
$$ plain form
1034 -388 -86 355 3 538 90 289 -215 398 -133 286 484 -198 1088 400 1131 734 863 1021 640 665
1054 665 343 765 17 1035 385 1200 1165 593 1236 519 808 343 506 157 284 117 92 477 -208 935
1074 935 165 456 214 -115 -119 -228 -317 -759 -122 -955 -69 -211 -590 52 -558 -248 -846 -540 -971 -788 -1061
1095 -1061 -934 -894 -841 52 -699 32 -358 -595 -608 -634 -385 -668 -497 -520 167 -102 206 478 263 850 -9
1116 -9 651 79 177 205 244 381 409 910 298 1391 670 982 855 466 711 433 909 379 786 560 1123 892
1138 892 795 1143 359 740 10 326 169 -107 -41 284 94 88 406 -184 211 -86 -208 -238 -791 -333 -770 -538
1160 -538 -533 93 -404 -97 -437 -650 -112 -1085 -473 -1058 -970 -610 -591 -210 -573 221 -488 33 -449 -358 -341 -924
1182 -924 -318 -745 200 -282 547 -148 497 387 366 768 -5 1033 564 408 164 18 538 303 952 779
1202G79K63n22J49o28K74L82p21O67k99M70l16J46K7j41K09o05O50p23K73n40
1222b06LK80j22N92n32L29p58L61o06K98M3m80L76o62R64o36M79rk08K65l55R0
1244d94o03N62n06M97k16K00L64n36O67k83K11j11l1l3n7Rk01O60k86K85J33L6
1266B67K62m97L12k86M64o80N88j59q5M03k90N57k64K33l17j34J31k15r4k27P90
1287G59o54M96k79P1K15l12K30n26L81m82J73j75J13r8M7L83o86M71n15J27n29
1308g90L02l22M1L22l56N54l32%j22j21N07o17P26o53K70n04P42j30p8J69P5M01
1330H4j81J78l25r6K12Q5j39j80R45m30J19l5L49q2r33Q50m4R1k91K45n61N57
1352D18n8K77O59p81K17l62l28M44k10Q25j058O65k94L96m46P0J51l02n2n03k83
$$ plain form
1202 779 1042 520 669 41 315 697 -24 643 344 814 498 644 671 530 739 134 784 61 334 -206
1222 -206 -203 77 -45 547 15 344 -414 -53 -659 -361 -318 -798 -422 -1084 -120 -756 -277 -286 -494 -229 -584 -494
1244 -494 -1097 -535 -1041 -544 -760 -560 -196 -732 -65 -348 -137 -248 -279 -312 -369 -360 -561 99 -187 98 231 267
1266 267 529 32 344 58 522 -158 430 271 186 589 299 856 592 825 508 374 505 290 196 -31 759
1287 759 105 601 322 393 608 296 526 0 381 -101 72 -103 10 -88 -41 342 -344 127 -388 -261 -790
1308 -790 -488 -810 -769 -447 -803 -249 -581 -581 -703 -824 -317 -934 -208 -861 -591 -1095 -353 -483 -561 -392 -317 84
1330 84 -97 81 -244 -340 -128 -43 -182 -362 583 153 272 237 586 504 -429 421 377 468 177 422 -139 418
1352 418 360 637 1296 515 732 370 42 486 276 1101 43 708 414 810 364 434 585 283 231 -272 -555
1373e55M36J084j151l03P63m15lJ22p5l50P06n29n62M07o5N4j48K24j57k1k20
1394g58J24J99k30M82o13K27J12j2L59j07K90l65M39j39J40m66K22J53m37N49
1414A69l12P16k37J05l6k16J78l62N12n69J52k83O87Ro13O41k42N44k31l50n6
1435B06J71m6J67P8m90N21p38O13q31Q87p36m27Q25n70J05R0q3q34J206J25m91
1456b52J38L0l8j057J491j430L35N48o53J393r09k01L26m69J441q67n01K73K21
1475a81L31p54R9L7J09j31P79l78K28k18K11k7q6K11k70K58pK28m5J36lk56J23
1498C94k49K82l48M06m40N48k05n0K95k56M79o32J46k67K30j42j34N56p18O12
1518E07j96PK4l20J53m25J68k36m7j10M55j65n8J68l56M70o30K39k11J07k27N3
$$ plain form
1373 -555 -119 965 -186 -489 274 -141 -144 -22 -97 -447 259 -270 -832 -425 -490 -436 -584 -360 -517 -538 -758
1394 -758 -634 -435 -665 -183 -796 -569 -457 -469 -110 -217 73 -292 147 8 148 -318 -96 57 -380 169
1414 169 -143 573 336 441 405 189 367 5 517 -52 100 -183 504 513 -100 541 299 843 612 262 206
1435 206 377 331 498 576 86 607 -131 482 -349 538 -198 -625 200 -370 -265 -175 -258 -1092 114 239 -252
1456 -252 -114 -84 -122 -1179 312 -1118 -783 -235 -888 505 -404 -605 -279 -748 693 -174 -675 -402 -181
1475 -181 150 -604 -505 -468 -359 -490 289 -89 139 -79 132 105 19 230 -40 218 211 439 394 530 527 271 394
1498 394 145 427 79 485 45 593 388 338 633 377 856 224 370 103 333 191 57 613 -105 507
1518 507 311 318 342 22 175 -250 -82 -318 -365 -475 -20 -185 -243 -75 -431 39 -591 -352 -563 -456 -683 -630
1540f30N29k82M39n65M48m12k21L67j85P4o9K80k27J87Q3K76J11l69M82o18O98
1561C96n25p2K09j15L80j13K38j6J73l89K80n0q1L44l81J01j83J39J5J00j62P7
1583C65J67k74L20m70L00j89k43M88j84j03j92N42n04K10k33p3jj22K25m79K45
1604b05k22J73N0J77J4o01L92l57K78k58k2K15j22N26k80J23l41M44n46O29l55
1625b88j27K44k98M46j83J39Q4n4M11k41L10k52Q2k68O9r5J65K61k69M14l76K08
1647C82j05L17o3q9k1m21O51m94J78J07n8J57k49L51n59K88l85K57k35m0J30o0
1669C9M98n09J35%j97K18k42k9l17L51l69M43k62L1o1K6P8m18L16m60M14l47L90
1692b72N8k91M65l94M50j81O9j50m2K46l63J99j27N85n82M12r6n7L5Q8L05m54
$$ plain form
1540 -630 -101 -383 56 -509 -61 -473 -694 -327 -512 -438 -507 -227 -454 -267 -184 92 203 -166 316 -302 396
1561 396 -129 -201 8 -107 273 160 398 382 555 166 446 396 315 659 278 379 196 335 350 450 288 365
1583 365 532 258 578 108 408 219 -24 464 280 177 -15 527 23 233 0 -73 -74 -196 29 -450 -205
1604 -205 -427 -254 -204 -27 -13 -614 -222 -579 -301 -559 -581 -366 -488 38 -242 -119 -460 -16 -562 67 -288
1625 -288 -415 -171 -469 -23 -206 -67 17 -37 374 133 443 191 273 5 74 -21 144 405 136 550 174 382
1647 382 277 594 531 442 421 0 651 157 335 442 384 541 292 643 84 372 -13 244 9 -31 99 39
1669 39 537 28 163 163 -34 184 -58 -87 -404 -53 -422 21 -241 -210 -271 -245 -167 -585 -269 -729 -315 -662 -272
1692 -272 -214 -505 -40 -434 16 -165 -96 -246 -288 -42 -405 -206 -333 252 -330 82 -14 -71 -36 52 357 -97
1714i7L1J78J9q8Q4R2q4o2J00J94J0K49m53J36m0j77K12k27N72m65o6O85m98k93
1738A2M3l22j21O86j83J05l32L44kL9P10r46M01l40j57l2p09K97r5Q35o18L01
1760h4O00j055K82L9L1l23L21l61m60J648r62M17n62L94L81j7o18k89O08k45L76
1781A21j17L83o50N50J32K96o6n28J49n4K38m46R9k0L34K87n09L53J35m57K16
1802D46l43J94J00N20n07L37n45K56p9k70K67J04j79n69O38j51k35M2L1K45kj42
1824A58o4K70o54J90k69J82J67l71O7j35L21k27K95j18J70j50m44M14m63L3r0
1845g18J76K20r9J51l12N66k13Q4k62L61n2k13L60j07q0P9L06j44k16J79n0K76
1867B92q76J108j82n11m20J31J207p49R23r95j43J63l59N66J12O7N76J98k94j105
$$ plain form
1714 -97 -66 112 131 43 127 219 135 73 173 367 377 626 173 309 269 92 304 77 649 184 118 803 305 12
1738 12 55 -267 -388 298 115 220 -112 232 230 269 979 33 434 94 -63 -95 -804 -507 -602 233 -385 -84
1760 -84 516 -539 -257 -218 -187 -510 -189 -550 -1010 638 -324 93 -469 -75 306 289 -329 -618 -10 -255 121
1781 121 4 387 -263 287 419 715 649 121 270 216 454 8 107 87 421 708 199 552 687 230 446
1802 446 103 297 397 917 410 747 202 458 379 109 376 480 301 -268 370 219 -16 26 57 302 300 158
1824 158 94 364 -290 -100 -369 -187 -20 -391 -324 -459 -138 -365 -70 -188 -18 -168 -612 -198 -661 -628 -718
1845 -718 -542 -322 -421 -270 -582 -16 -229 -145 -407 -46 -98 -311 49 -58 -138 -59 247 103 -113 66 16 292
1867 292 -584 524 342 -169 -589 -458 749 0 923 -72 -215 -52 -411 155 267 334 910 1108 814 -291
1887b91M65l60J057q20L03P2K00n65Q96j040p63J115j186J329o48j83O35l31P8
1906c7k67j17J12l66p3M78L43m66J07J72n89K24j22N1L00l08K2N69k11J26q7J52
1928A3l30m2j82M67r7o2M26o55O98j40L9o9O2K41m00L29k62J88k42O9L50j58J58
1951D01l74M06m84M03k96J51J62l31K57j09J4j95O6n2J5J80m06M44m97L00k81
1972b26K90j35k6M2j72K98l09J34l03o5J12j14L64n40L58j51K98k83P4N3k02K61
1994b42k52M68k86M9j0J08J65p8RqJ24l90L51r5r1K54k35N33m51M3K30J94k46
2017A44P4l3k79L43l26K69J05j22JR7km07M59j08j39J34O0L8l03O04n99L76j05
2040B81k18l3Q1J48n20M25m70L39k63K95j29k30J7J20L55n89J48p9J17k13J9J06
$$ plain form
1887 -291 174 -186 871 51 354 426 626 61 957 -83 -846 269 -917 412 -236 -419 216 -115 -37
1906 -37 -304 -421 -309 -675 -748 -270 73 -393 -286 -114 -703 -479 -601 -550 -250 -558 -536 33 -178 -52 -139 13
1928 13 -317 -359 -541 -74 -171 -233 193 -462 236 96 135 66 128 369 -31 298 36 224 -18 51 401 243 401
1951 401 27 433 -51 352 56 207 369 38 295 186 200 5 71 19 34 214 -192 252 -245 55 -226
1972 -226 64 -71 -97 -55 -227 71 -238 -104 -407 -472 -360 -474 -110 -650 -292 -443 -145 -428 -354 -301 -503 -242
1994 -242 -494 -26 -312 -263 -273 -165 0 -78 -69 -77 47 -343 8 -87 -178 76 -159 374 -77 -34 196 390 144
2017 144 218 185 -94 249 -77 192 297 175 176 273 271 -136 323 215 76 210 270 308 5 609 10 386 281
2040 281 63 30 111 259 -261 164 -306 33 -230 65 -64 -294 -277 -157 198 -391 -243 -322 -205 -418 -399 -293
2062b93L4J22j62j1J05q9J74j68M9O2K2j23K44j53P6J3o2oq6O9J86k5J28k49L87
2087B44j90J88l58K26L7k3J86m5q1j30J65j08J68j52K11k13J47R0l43L55k62q
2109A04Q1r8l2l00N50m46J22J57j40j33J60j0j6J93o55N47m85P44n24K16k29j14
2131c08M59o48M45k93n5J35Q8J41l31L56k63K49q6p0j43r4K28m9J23N3J21n2q5
2154g9K15k6j32j38J88j04R0J94k16K81k61J61k9J73k32J57l7j57K73l97N77l81
2176A20K57n6j40K47l5l55K3O14p65L64q8k08L56m63M33j61J03l88K78n9M8j23
2198Bo1J30n06j57O95l85J28L94L1j74o8m19M47k68P01J71q08N74r0j022N13M9
2220a23N6J83n4L13rj00j49L43m60J86l0q2j03p2k26J091q70O54n45k65L98j35
$$ plain form
2062 -293 -259 -137 -299 -310 -205 -294 -120 -288 -239 -177 -155 -278 -34 -187 -111 -98 -160 -166 -252 -183 3 -22 106 -143 244
2087 244 54 242 -116 110 147 124 310 265 184 54 219 111 279 127 338 125 272 362 19 374 112 104
2109 104 185 87 55 -245 305 -141 -19 138 -2 -135 25 15 -1 192 -463 84 -401 343 -181 35 -194 -308
2131 -308 151 -497 -52 -345 -400 -265 -177 -36 -367 -11 -274 -25 -111 -181 -324 -418 -190 -239 -116 -63 58 6 -79
2154 -79 136 110 -22 -160 28 -76 14 208 -8 273 12 173 144 317 85 242 205 48 321 -76 501 120
2176 120 377 321 181 428 393 38 61 675 -90 274 186 -22 334 -129 304 143 246 -142 136 77 125 2
2198 2 -59 71 -435 -592 103 -282 -154 240 271 97 29 -390 57 -211 490 661 -147 427 337 -685 -172 -123
2220 -123 -67 116 62 375 366 266 117 460 0 186 156 74 -29 -101 -327 764 -106 548 3 -262 136 1
2242AL07O23r04J75K48l14O6R1n68R38j96O9o2m94M87q04N08j3m8l4K41l06j52
2265a41P79p22P1J38R5k41j59J25M1O4o11M50j60L97l40N8l6j3l9P0J82q9Qr4
2289a67k16K97k21J54M3N1k78K76m26K85K36o6L7m59K69K7L02r6k54L07j91J48
2311E8j04K5l3Q7j04K5K18q4k2q8j07J47J41J3r1K11j43m0K05j34k96L29N0r7
2335A66Jo3J6q7Q6j66J2N9o3J1k54L40j41j04J04J64j48j78k0L29j62o9J9j2J50
2360a0l36RK57k64J81J75k11J20q5K79m14M26n28L54j87J17R8J32q5l15N17k97
2382f7J13nn5Q3k39J40k00M9L26m8K87l01L08k70K81r6r8k20Q5R9K69k64r9J47
2406B25m1N3r8p2Q9Mj0q7K24k53J3Nj21J94j39J18j50K23l39KQ1jQ7l6Rk22P2
$$ plain form
2242 1 308 931 27 202 450 136 202 293 -275 663 467 536 474 -20 467 -337 171 158 110 76 317 11 -141
2265 -141 638 -84 -13 125 220 -21 -180 -55 -14 50 -561 -111 -271 126 -214 -156 -192 -205 -244 -174 8 -81 -73 -167
2289 -167 -383 -86 -307 -153 -110 -59 -337 -61 -487 -202 34 -32 5 -454 -185 -158 144 48 -206 101 -90 58
2311 58 -46 -21 -54 33 -71 -46 172 88 66 -22 -129 18 159 172 81 292 149 109 314 180 -116 213 263 166
2335 166 167 104 120 33 119 -47 -35 24 -39 -28 -282 58 -83 -187 -83 81 -67 -245 -265 64 -98 -167 -148 -160 -10
2360 -10 -346 -337 -80 -344 -163 12 -199 -79 -164 115 -299 127 -401 -47 -234 -117 -19 113 28 -287 230 -67
2382 -67 46 41 -14 69 -170 -30 -230 -181 145 97 384 83 391 121 402 306 208 -12 73 172 441 177 78 225
2406 225 184 237 139 67 156 160 150 63 287 34 47 52 -69 125 -14 104 -46 177 -162 -160 -79 -80 7 -29 -20 -242 -170
2433a70k8q2R1q4K84m29M91l63K89j4j15J14O7K34m77M38l67J67j87J55J34n69
2455d21O61k74%k6k3L23k01%j5N21n00M1k9J8%J50o9J00k9J25j01p5k2J13m4J67
2481C90k41L49k69j99J42l10M59l45N3k21l2L62j53L4p0J84k51J30P0j20l64J39
2503b63o1q0L34P0Rk10J56j06k41L93l12L31k14K0j24J33j59m0J54K26nP5L2k98
2527a80K56o7J72l97J57O7j98L21l12K75r5N6R0q3Q7q0K05m98M48j42j70K5Q7
2550B4L3j43L32L9k93m4o1K92j35J19k14K94O4l66J96k42J84J13N1k62q7m8L33
2573A79l39Q5M7j36J41m71L79o9o6J64k93K34J11K04m19K02l2m7J55N0j96j54
2595b71K32m5j13Q2M6J93k27J58j42L5J06M1j00j27M17k55K31j86J25L3m6Mo2
$$ plain form
2433 -170 -198 -280 -189 -273 11 -418 73 -290 -1 -15 -130 -16 51 285 -192 246 -121 46 -141 14 148 -421
2455 -421 240 -34 -34 -60 -83 240 39 39 24 545 45 86 57 75 75 225 156 256 227 352 251 176 154 267 223 390
2481 390 149 498 229 30 172 -138 321 -24 29 -192 -224 138 -15 19 -51 133 -118 12 82 -38 -402 -263
2503 -263 -324 -404 -70 0 9 -201 -45 -151 -392 1 -311 20 -194 -174 -298 -165 -324 -364 -210 16 11 86 118 -180
2527 -180 76 9 181 -216 -59 8 -190 131 -181 94 -1 55 145 62 149 69 274 -224 224 82 -88 -63 24
2550 24 57 -86 246 285 -8 -52 -113 179 44 163 -51 243 307 -59 137 -105 79 192 243 -19 -106 -154 179
2573 179 -160 -75 -28 -164 -23 -494 -115 -184 -250 -86 -379 -145 -34 170 -249 -47 -79 -126 29 79 -117 -271
2595 -271 -39 -84 -197 -115 -69 124 -103 55 -87 -52 54 95 -5 -132 285 30 261 75 200 233 187 191 129
2618A29n6M7k42K05J20q1j13J2J18n6K6L3k28J43K72k89J08J2M2k14N7R9j49j
2642fJ10J17j76P8j93j43K05k92M13j37j94J51r3K10k03m0jl9J40M8m06N15j95
2665a31o2n8Q8K58k47l1K94k11j40J17q3J73K82m61J13L8J07K35k34L56k59J7
2687A61j59o4lK23r3o2L2M25k71j8K4J3j35K29l15Q3k1J46k71O5o2K19J9l79K44
2712C0M3n5r8J71j60K33J21j73j7J14l66K87j13J41j37K57o54P99n43M94j99k08
2734c3P2n12M92N90l46jk19m97K08K09Q4k03J86O1o9j06p2J14J21j90M22n92M37
2757A56j42k1j37M42k88l8J62j8O6l56K41K10k12N2j62J34J30j29J08Pj08j20
2779b3K43n07P34n83J55jR2Pk56K96k03k6J85k63K55j08J07l7R5n7j73P8o5k2
$$ plain form
2618 129 73 120 -122 83 203 122 9 21 139 83 109 142 -86 57 329 40 148 160 202 -12 45 144 -5 -6
2642 -6 104 221 45 123 -70 -213 -8 -300 113 -24 -218 -67 -160 50 -153 -193 -194 -233 -93 -45 -451 64 -131
2665 -131 -193 -251 -163 95 -152 -183 111 -100 -240 -123 -206 -33 249 -212 -99 -61 46 281 47 403 144 161
2687 161 2 -62 -65 158 65 3 35 460 189 171 195 208 73 302 -13 70 49 195 -76 -11 -73 146 165 -214 30
2712 30 73 18 -80 91 -69 164 285 112 95 209 -157 130 17 158 21 278 -376 423 -120 374 175 -33
2734 -33 39 -473 19 609 263 262 43 -454 -246 -37 47 -156 30 91 22 -84 -156 -42 79 -111 311 -281 156
2757 156 14 -7 -144 298 10 -28 134 116 182 -174 67 277 65 117 -45 89 219 90 198 205 97 -23
2779 -23 220 -287 447 -136 19 18 110 117 -139 157 -46 -72 113 -150 105 -3 104 67 162 105 -68 10 -55 -77
2803g7j42j24L18m0j49J18n7o3q7L60j22j62J62J20j10j77M2q9k1K27j90M10m12
2826b65K13P1k1J85j11M0j35J90k40L72k54J6J41r3l5l3K26k41K74l16K28M8k98
2849c8K00k9k8J0j45K9M8J58j40k16J00K35j06moq4R8M3j62J5O9j63Nj50m4L57
2875E2k46P9R9j22K28n19K52l0Q3N6J0j08K37j38k45K33j1q1J89J4j4j42J14N
2899ej52o3K76k01K34l00J62L51j31k69J24Q5j19L28p8l16J24n6J46j50m3K87
2921B34N1j01m9j36J09K07l23K29M4lm38K07J12k59M6K45k50K48nk02L7J71l63
2944a89L87k63k34M20k57N0R4k27L9L3n5J48J10j70K4Q6j12q3j6j3J67Mj10K2
2968a45k0Q3J39k92K67k6L2J56j45j55J93O5q7M7J78l19Q2n9q5L61k82K22j07
$$ plain form
2803 -77 -219 -343 -25 -65 -214 -96 -153 -216 -303 57 -65 -227 -65 55 -55 -232 -190 -279 -300 -73 -263 147 -265
2826 -265 -52 19 -2 183 72 112 -23 167 -73 299 45 61 202 109 74 41 267 26 300 -16 212 260 -38
2849 -38 162 133 105 115 -30 -1 47 205 65 -151 -51 184 78 74 68 -16 82 125 -37 -22 47 -116 -111 -261 -305 52
2875 52 -194 -115 -16 -138 90 -429 -177 -207 -124 -68 -58 -166 71 -67 -312 -79 -90 -171 18 32 18 -124 -10 -5
2899 -5 -157 -220 56 -145 89 -211 -49 302 171 -98 26 111 -8 320 242 -74 50 -6 140 -10 -53 234
2921 234 285 184 135 -1 108 315 -8 221 265 262 -176 31 143 -116 -70 175 -75 173 168 -34 3 174 -189
2944 -189 198 -65 -299 121 -136 -86 8 -219 -180 -147 -202 -54 56 -114 -90 -4 -116 -199 -215 -228 -61 -57 -167 -145
2968 -145 -165 -82 57 -235 32 6 38 194 49 -106 87 152 65 112 290 -29 53 -6 -91 270 -12 210 103
2991A03m1m3j60L57j82j8K27n9k20J28n8n9K75l01%k4m8J21OnJ05k3M3k17M0N4
3017An2J41k05J79J04k92Q1L0m9K13j83J9j28K30k82K32q6j2j67K29r1J4k95M14
3041D5r7k5Q2j9J4j14L40k76J4J10l19L79l29L16r3j76K07j90k61J58L18RK1l5
3065G9r4m4K81k7k89J69Q7j01K60j84k0J0j21J47j91J01K09k09k0k69M06j08j46
3088g4J83k13j5j46K43R4k76L30k41l4M1p5K00k80K99N5j27j54k15L51l29M54
3110G1k27j00K33k9O2P9k02K9P1j39K12k0k02J60l26K78m1l6J31j78J65k5O6j78
3134a46J18J86j40Q1k13K35j47N4R0R5k46Q6Q7j33L8J67k12K34l75K31j33K21
3156A78l91P7JL04j50k7n3o1K11l64K78R8l40K09j98K66k5R0j53K28l54R3o2j96
$$ plain form
2991 103 62 19 -141 216 34 16 243 184 -36 92 34 -25 250 -51 -51 -75 -123 -2 4 -1 104 81 124 -93 -53 1
3017 1 -51 90 -115 64 168 -124 -43 -13 -62 151 -32 -13 -141 89 -193 39 -47 -59 -226 3 -88 -74 -369 45
3041 45 -52 -77 5 -14 0 -114 226 -50 -36 74 -245 134 -195 121 28 -148 59 -131 -392 -234 84 93 114 79
3065 79 -15 -59 222 195 -94 75 162 61 321 137 117 127 6 153 -38 63 272 63 43 -226 180 72 -74
3088 -74 109 -104 -119 -265 -22 72 -204 126 -115 -149 -108 -183 17 -263 36 91 -36 -190 -405 -54 -383 71
3110 71 -156 -256 -23 -52 10 89 -113 -84 -13 -152 60 40 -162 -2 -328 -50 -91 -127 4 -174 -9 -34 32 -146
3134 -146 -28 158 18 99 -114 121 -26 28 118 213 -33 53 140 7 45 212 0 234 -141 90 -43 178
3156 178 -213 -136 -135 169 19 -8 -61 -122 89 -275 3 101 -239 -30 -228 38 13 103 -50 178 -176 -83 -145 -341
3180c41K43j12K52QJ6k31J14K5j60L16l48K48J3j70K13j02J7m2K74k75J61j65
3202d6J95k17k57K46J65M4j39N6j42J02j83K70k54K02J16j69K81j80l5m9Q0K8
3224A14K11l85J10k0J19m7L3k12J88k16L83m34J86l55L94k97J93J47j19k72J63
3245a16j5N8J15j81K8M24l72K0k14K41q5j35N75m89L90j56o36P95q09O81j31J34
3267A22J25Jr4L6l8j85J53j80J89j55J03j0k6k7R6j03K2R5pp7Q8j60J30j09M8
3292C7O1M8k08p4K23l4J9N4J03k43M2K1J52q1r6j11J15p1j39L20k67K55j27q2
3316h3K47k2j34l01K83N5J5j98j0N3M0j6l21L98o8J88J27j49k02J24O0j12J78
3339A52j81k12K93j50K79k30j16L1O6N65m82j87K42J53k77L19L08o28j94L67P0
$$ plain form
3180 -341 -98 -210 42 50 66 -165 -51 -26 -186 130 -218 30 43 -127 86 -16 1 -41 233 -42 119 -46
3202 -46 149 -68 -325 -79 86 130 -9 47 -95 7 -176 94 -160 42 158 -11 270 90 55 6 86 114
3224 114 325 -60 50 30 149 102 135 -77 111 -105 278 -156 30 -325 69 -228 -35 112 -7 -279 -116
3245 -116 -131 -73 42 -139 -111 313 -59 -39 -253 -12 -97 -232 343 -146 244 88 -548 247 -562 119 -12 122
3267 122 247 248 154 190 152 -33 120 -60 129 -26 77 67 41 14 110 7 29 124 117 40 128 -32 98 -11 37
3292 37 98 146 -62 -136 87 53 72 126 229 -14 28 49 201 120 24 -87 28 -43 -182 138 -129 126 -1 -83
3316 -83 164 142 8 -293 -10 45 60 -138 -148 -95 -55 -71 -392 6 -62 126 253 104 -98 26 86 -26 152
3339 152 -29 -241 52 -98 181 -49 -165 -134 -68 497 15 -172 70 223 -54 265 573 -55 -249 118 188
3360A88l96Q5P32q84M37K65o4o86R31o31r4l72J134n23m18N88j26M19m68j53N2
3381A6R8k7k12L4Q4K0J12k09M8K00m6j15J43k14j51j3J06K08R9m47K48n7L49k47
3405B7K5J74m92N28l52L93j55L3k55K1J30m8K36j00j03p5j39k61L82l52M65n0
3427C2r9J71J66j28l67J80j30l45J236qr12L16l26L96j12K56m64L46j89P9q0Q1
3449I9n6Q1m2l7l7L42j53j77j36K59K74n26j39J07J078j121M25j98r9n0Q2p9K
3472a01K33k59K5K21p0j59j1K82j80Q1j2o1m7j3PJ87J60k82k45p1K91M4j64Q4
3496f0N4j36R7R2j41J08n2O4K8N2m4J2K5q7K02k53J2KJ30j2j62J66m2J84j72J46
3522B13k89K59j52k1Q2j09j21M36m37J21L4j13R9M0p5J24k9j11o3J07M3k67L83
$$ plain form
3360 188 -208 -123 609 -275 162 427 363 -323 608 -23 -117 -489 645 122 -296 292 166 585 117 -36 16
3381 16 114 87 -125 -91 -7 13 125 -84 -36 164 118 3 146 -68 -219 -232 -126 82 181 -266 -18 -75 274 27
3405 27 52 226 -266 262 -90 303 148 181 -74 -53 77 29 265 165 62 -13 -152 -413 -31 -383 82 32
3427 32 -67 104 270 142 -225 -45 -175 -520 716 708 -204 112 -214 182 70 326 -138 208 19 98 18 99
3449 99 43 124 82 45 8 350 197 20 -116 143 417 -109 -248 -141 937 -184 241 43 -56 -106 -24 -103 -101
3472 -101 132 -127 -102 119 49 -110 -121 161 -19 62 50 -11 -58 -71 -64 123 283 1 -244 -315 -24 20 -144 -60
3496 -60 -6 -142 -45 47 -94 14 -38 26 54 106 62 74 99 12 214 -39 -27 -25 105 93 -69 97 55 239 67 213
3522 213 -76 183 31 10 92 -17 -138 298 -139 -18 16 -97 2 42 -33 91 62 -49 -112 -5 38 -229 154
3545A54k05j9R6r1q8J06J39O1k60R9k0J66q3Oj46k27J93J51k33J58O9k46oK55
3569B9j39J71J10J22m33M00j80L24j34m20K8JK34j61J85l21J71m30M04L17l67
3590h9O8O2k11j17L57l4K21p25M94L84m64N2j34J4L59J10o01O03k24m10O51k31
3612A35k88n20N23l91P57L04r38M3k62M47L96N33j48p67K7o1j23M27j34K11l85
3633b14K19j2p0o7J68Q6j54J25r6J37j85O8O0J05k37J02P6k65J73o0n5K61J02
3656B67o5j04R4M5k26JM8j2J14J90l25N9R9j64j85L43M2k94O6L2Q3j02L3J7p4
3681a8k60J22L13j31p7J28J22q8k43K53l28J88O1m3j28R8J58j67j2J79j7o6L3
3704G7n9J93j53j91J19j06L08k34j88R1N2O9O4o1j45J78k40K97j34K77k42J58
$$ plain form
3545 154 -51 -70 26 -65 -153 -47 92 153 -107 -8 -28 138 55 61 -85 -312 -119 32 -201 -43 26 -220 -226 29
3569 29 -110 61 171 293 -140 260 80 404 270 -150 -122 -121 113 -48 137 -184 -13 -443 -39 278 -89
3590 -89 -21 41 -170 -287 70 36 257 -468 26 410 -54 -2 -136 -122 237 347 -254 349 125 -285 366 135
3612 135 -153 -673 -150 -541 216 520 -418 -375 -637 -190 206 739 591 -176 -149 -210 -333 94 -40 171 -214
3633 -214 5 -7 -77 -144 24 110 -44 81 -15 122 -63 5 65 170 -67 35 111 -154 19 -41 -96 165 267
3656 267 202 98 192 237 11 12 60 48 162 352 27 86 185 21 -164 179 221 -73 -7 25 108 6 39 56 -18
3681 -18 -278 -156 157 26 -51 77 199 111 -132 121 -207 -19 42 -1 -129 -31 127 -40 -52 127 110 44 77
3704 77 18 211 58 -133 -14 -120 188 -46 -234 -143 -91 -22 42 -19 -164 14 -226 71 -63 214 -28 130
3726A30k8q5J06j84l5n2K49o2J22k33J64k65J42O4K26j96l9k1J73j58O0j82m2
3749a46JK33k19L02J86o21M77l51K04oj62K26O6j52l1k44L76k93J1j86J61q2L74
3772A24j48J02j62J17l43L95j82j11M93l96J43N31n55j23j2L94mk03l17O66n15
3793a06j31J021o77r33R83N10m02j1j14q5j26J33r2L9M12j52k51l1K1N2o1J6J31
3816A46m7m3J85k97j75J09J23j4l5K27P3k72J97k70N2J04q6j34jQ2p6L22K9k78
3840g9J99j46J61j61k8L5J69M0l07M4N0J00r7r3kJ05q9K86j74j82J84r0j96J12
3864a59J73R4k47M5K85j73p9Q5j41o3K35J8n9Q1J09k53j5J75o0j02J82j70J94
3887A55m15K06K62n3l00J65J2K0o0O3J04j57L0J63k61J82k34J44J71q5k1k66J39
$$ plain form
3726 130 102 17 123 -61 -96 -148 101 39 161 -72 92 -173 -31 33 259 63 24 3 176 18 78 -104 -146
3749 -146 -145 88 -131 171 357 -264 213 -138 66 60 -102 124 190 38 7 -237 139 -154 -143 -329 -168 -250 124
3772 124 -24 78 -84 33 -310 85 -97 -208 285 -111 32 563 8 -115 -127 267 263 60 -257 409 -106
3793 -106 -237 784 107 -826 157 667 265 254 140 55 -71 62 -30 9 421 269 18 -13 8 60 -1 15 146
3816 146 99 56 241 -56 -231 -122 1 -13 -48 179 252 -20 177 -93 -41 63 -23 -157 -158 -76 -152 170 199 -79
3840 -79 120 -26 135 -26 -54 -19 150 190 -117 -73 -23 77 -20 -113 -115 -10 -99 187 13 -169 15 -75 -271 -159
3864 -159 14 108 -139 -94 191 18 -61 24 -117 -180 55 73 14 95 204 -49 -64 111 51 -51 131 -39 155
3887 155 -260 -54 208 155 -145 20 32 52 -8 55 159 2 32 195 -66 116 -118 26 197 112 91 -175 -36
3910c6N7j6J8j87P1R4J81j65q2j57K49m0Q5j29n7M3j60J08qj53K51l86M12J97
3934A90j31j95J62j35J30j09j06L57j11Q9j16k14K18j18K28j78O5K01M5j65l4
3955G3o6k4L90k83rl35L11l9k2r7m9K73k8J3j2j23K91l82J20j23Q4j52K53p4l9
3980d9J97l46L37j87L3k2J99k13p3L47m45J40k97M29L25q18Q02m39j26j47K36
4001a17l29j07R21j63m77n6M32K40l62m0j07J6K37j20J45j24o1K81r4l30N3J16
4023d6r7K11k80J80K21j08lJ47l9n9j14J15j08j06J48Oj83K56k7k0p4n2J37j99
4047i4M4j12J88O5l61K09K34j78k93J71J57o2R0M1K40n23P1J4j48L23J57k72J08
4070F9j17lJ87j05O3Rk6l51J77O8j57J20j5L07n5m82L73O3P0j43k54O5j7o1P16
$$ plain form
3910 -36 21 5 23 -164 -93 1 182 17 -65 -222 27 -13 72 -57 -114 -71 -231 -123 -131 -284 -33 -419 -7 190
3934 190 59 -136 26 -109 21 -88 -194 163 52 141 25 -189 29 -89 139 -39 26 227 272 107 73
3955 73 7 -17 373 90 81 -254 57 18 -4 -101 -150 123 95 108 96 -27 264 -118 2 -121 -37 -189 64 -10 -49
3980 -49 148 -198 139 -48 -15 -37 162 -51 -124 223 -222 -82 -379 50 375 -443 359 -80 -206 -353 -117
4001 -117 -446 -553 368 205 -272 -328 104 344 -18 -58 -165 -149 88 -32 113 -11 -72 209 115 -215 -162 -46
4023 -46 -143 68 -212 -32 189 81 78 225 186 127 13 128 20 -86 62 68 -115 141 114 94 20 -32 105 -94
4047 -94 -50 -162 26 91 -270 -61 173 -5 -298 -127 30 -32 58 99 339 -184 -113 -99 -247 76 233 -39 69
4070 69 -48 -51 136 31 94 103 77 -274 -97 -29 -186 -66 -81 226 171 -311 62 125 195 52 -202 -137 -154 -215 501
4095E01qm24j42N60l28o67K34M02k9l56M07k92L65j19k97L87l11J3j38K24r5P5
4117c8j78M53j4J04j72L81p02P01m69m35M11m01M98p94O41J67l37J59j8n1J99
4138A05k3p3Lo1J47O0k32k67L40q3n6p2J52N6M7m3k66K69N3j25Pr9K06j74J00
4163b9n6J17J15k23k3J43O1p3K34k99l6L7j63K01j16l6J57P9N5J70j66k67K72
4186A54l98J02J86K25j56j01nJ96j22j66N3Q0M9K1r9j41k6K03j21M4lJ2J38L4
4210A59l01Q4P3J56k72l2Kl2J47R5K8j14J38l2k52N7j45M55j70N4k7k13L03k27
4234f6J13k27J23J77j09O7k03K75j02N3p8l7o0J7o2J28mQ9L07l82rr6Q3qJ26m13
4260b98N69k67P4K18k60j30J30j87J11P4r0J46o8q7L11q4j85O3R3j75J91l5j94
$$ plain form
4095 501 493 69 -73 487 159 -508 -274 128 99 -257 150 -142 223 104 -193 194 -117 -104 -242 -18 -113 -38
4117 -38 -216 237 223 327 155 536 -166 535 66 -369 42 -359 139 -655 -14 153 -184 -25 -43 -94 105
4138 105 82 9 12 -49 98 158 -74 -341 -1 -84 -140 -212 -60 -4 43 0 -266 3 56 -69 -62 -161 45 -129 -29
4163 -29 -85 32 147 -76 -99 44 105 32 266 -33 -69 -32 -195 6 -110 -146 11 90 145 315 149 -118 154
4186 154 -244 -142 44 269 113 12 7 203 81 -85 -32 48 97 118 19 -122 -148 55 -66 -22 -25 -13 125 159
4210 159 -142 -58 15 171 -101 -133 -131 -163 -16 79 107 -7 131 99 -153 -96 -241 214 44 98 71 -142 161 -66
4234 -66 47 -180 -57 120 11 78 -125 150 48 101 23 -14 -74 -57 -119 9 5 94 401 19 10 -86 -3 -11 115 -298
4260 -298 271 4 78 296 36 -94 36 -151 -40 34 -56 90 22 -65 246 162 -23 40 133 -42 149 114 -80
4283h0L6J83j67j03k72L49K13j87J00j08l08P9K05K29m3j2m03N83l56J41l46K60
4305gK46j61n05N01l4K93m70N6n1k44RL24M09m87Q29o78K22j462J352K68K26r52
4327c16N47n95J88M21p6k70J89k65L67q1j10R5Q6l93K37K0K7R2j75P4j07k7P4
4350Bo0J38k09J30j57J27k0J34k87P9j54J52K75l74J27R4n4k2L0J15k15j00Q7
4373a62j53L39k68M45q83O86L32N1l06Q87m49j198J189q52L15L44J65p15L96K46
4393D09l37j03q2M31j97M6j20K2N5k57K50l50K82l3j5j17J94P1j84j07K50j76
4415f8K03n7m0j64m7L81j88R8k8m56M91l7k65J49K13n53L15K90k97M90k56n36
4437c62Q06o54K62n3l85K51J72j38K05k49q0J40k05K99k54K63j00Q6M5o9n8j1
$$ plain form
4283 -80 -44 139 -28 -131 -403 -54 159 -28 72 -36 -344 -265 -60 169 126 114 -289 294 -62 79 -267 -7
4305 -7 239 78 -427 74 40 333 -137 -81 -132 -376 -367 -43 366 -121 708 30 252 -1210 142 410 636 -316
4327 -316 231 -364 -176 245 169 -101 88 -177 190 109 -1 94 180 -213 24 44 71 163 -12 62 -45 -72 2
4350 2 -58 80 -129 1 -156 -29 -49 85 -202 -123 -277 -125 150 -224 -97 -3 -57 -79 -49 66 -149 -249 -162
4373 -162 -315 24 -244 201 -682 4 336 387 81 968 519 -679 510 -342 -27 317 482 -233 163 409
4393 409 72 -31 -113 318 121 167 47 69 124 -133 117 -233 49 16 1 -116 78 149 -35 -142 108 -68
4415 -68 135 78 38 -126 -173 208 20 118 90 -366 125 88 -177 -28 185 -368 -53 237 -60 430 174 -362
4437 -362 444 -210 52 -1 -386 -135 37 -101 104 -145 -225 -85 -290 9 -245 18 -82 4 49 -20 -78 -89
4459h9J83p1p8J52Q7n2j79m7P9L03k11J0m6k5L81k43r5j15R4L07l87j45p9K36
4483c0J65j93J08jKp1J49J67j66k29K68k41O0j89K59k2l9m5j31J07J57K5K1j13
4507A8p9O9j68L91j48%q8N1J03j40Nj24J3j94K29n9K34j76j3K3k3J29k14L64j99
4532Dn1J63j12m2J54k94K48n9K8J9J67k61J41m1l4K41j17j03j01k1J26Q9l8p2
4556C4j56L90n5j78r7L62l28J0K1J78j74J42j74l6K20j93J58rk69J55r7k1O7p3
4580a23l4O7j8J34P1Rk10O2L3j34K69k18K5Ql9J42j14j78K66j59K24k77J91J2
4604Ij87K00m5J20l02L02j02p8k4J35K06m15Q9j11J88J57J19j52k72J47p7J76
4626H3K1N8j51PJ29l31K01K4J82k9l01K14K12l11L1n2r1R2K37k48j0M8j9Jj31
$$ plain form
4459 -89 94 23 -55 97 184 132 -47 -94 -15 288 77 87 41 16 397 154 59 -56 38 345 -42 -187 -266 -30
4483 -30 135 -58 50 49 51 -20 129 296 130 -99 169 -72 -12 -201 58 36 -3 -48 -179 -72 85 110 131 18
4507 18 -61 8 -160 231 83 83 -5 46 149 9 14 -110 -97 -291 -62 -121 113 -63 -76 -53 -76 53 -161 203 4
4532 4 -47 116 4 -38 116 -178 70 11 39 58 225 -36 105 64 30 271 154 51 -50 -71 55 144 106 34
4556 34 -122 268 213 35 -62 300 -28 -18 3 181 7 149 -25 -61 159 -34 124 115 -154 1 -96 -117 -50 -123
4580 -123 -157 -90 -108 26 97 106 -104 -42 -9 -143 126 -92 -67 -59 -98 44 -70 -248 18 -141 83 -194 -3 9
4604 9 -178 22 -23 97 -205 97 -5 -83 -107 28 234 -181 -92 -203 -15 142 261 109 -163 -16 -93 83
4626 83 104 162 11 18 147 -184 17 41 223 194 -107 107 319 8 39 -13 -104 -12 225 -23 -33 15 -4 -3 -134
4651a34K58p4n5k8j0J83n6j4j73n8K16k51M32m08K70m22N46k41M0L3J09k13J99
4674A49M4n4P7k92J1R5l82P7J53r3l7P5N58n90L61L7L91q47m9P11j092L52L58
4697A3J107r55n90k67J394r74N15p53n3N79OL56k23j38Q4M0J7j19l6J19J95j73
4719A44n42M16j6k87K58nJ58l02M45k89j17R7j35J34L0J38j15o4j52K30P9j39
4741c4l6L91l75P8j55j5LK70l1N8l65K71j44N3R8K3p7j71pl4K94j10J79k23N3
4766fk10R7M44m46L89k39km9k49K81L0J13J40k15O4k71J19J5j10L2L58l66J46
4789F5j43P8L33l55r4l0L16j79K08j53r9l2k2j48n9L40N9j8k99K56K11m22J86
4812aJ77j30p9q5N4n9K34k18J27j8J33j74J15q2rL7l5p4q0j5o2L27k06J44J20
$$ plain form
4651 -134 124 50 -5 -33 -43 140 84 70 -103 -161 55 -196 236 -172 98 -324 222 -19 21 54 163 -50 149
4674 149 193 139 216 -76 -65 30 -352 -275 -122 -215 -252 -177 381 -209 152 189 580 -267 -316 395 -697 -345 13
4697 13 1120 165 -425 -692 702 -272 243 -510 -563 16 22 378 155 17 101 141 158 39 3 122 317 144
4719 144 -398 18 2 -285 -27 -32 126 -176 269 -20 -137 -40 -175 -41 -11 127 12 -52 -204 26 105 -34
4741 -34 -70 321 -54 24 -131 -146 -143 127 96 154 -211 60 -84 -31 67 90 13 -158 -165 -199 95 -15 164 -59 -6
4766 -6 -216 -119 325 -121 268 29 27 -22 -271 10 40 153 293 78 142 -129 -10 5 -105 -73 285 -81 65
4789 65 -78 0 333 -22 -116 -146 170 -9 199 46 -53 -85 -107 -255 -314 26 85 67 -232 24 235 -187 -1
4812 -1 176 46 -33 -118 -64 -123 111 -107 20 2 135 -39 76 -6 -15 22 -13 -87 -167 -182 -244 83 -123 21 141
4837A41j82K59k68J43k24P7j09J79K51j89o27P16k65N28q3m27M27N3o70k37N32
4858B5Jn8kK09m9L8p0J76n00J29O8R2K71m28L4j42J24Q7J8L8q6j55J62K5j08J
4884a00m9K27j52j61K45Oo4J69j41j27K26r5K34k63R2o5J66k16J93j78K92j3m20
4907a94K25Kj48O6J99k17J58q9j5J26j27k31L5Q0K5M8L23l31J09J3O7M1p3J23
4931B15j85J17j70J59j77N0Jj3J06p1j25P7j5R6k61J3L25N1nj51j99K99k35L74
4955B76k47o3j22N20j032P0R19j11n35r5M67N74o95N7n0K34k34k21M86q4n50M97
4977F1j25N24l87q5q5oK05r1Q3j27j0j6j45J25k2m2Q8O9k1J67R7l09P3j24K4Q
5003g1K70j01J1k91R9J7k8K07n1j20p1J93J18j75K72m41J92Nk76K23J3k34J73
$$ plain form
4837 141 -41 218 -50 93 -131 -54 -163 16 267 78 -549 167 -98 430 347 -80 347 400 -270 -507 25
4858 25 26 -32 -34 175 126 164 94 270 -230 -101 -33 59 330 -98 -64 -206 -82 5 23 61 -25 -180 -18 7 -101 -100
4884 -100 -149 78 -74 -235 10 16 -48 121 -20 -147 79 -16 218 -45 47 -18 148 -68 125 -53 239 226 -194
4907 -194 31 33 -115 -49 150 -67 91 2 -13 113 -14 -245 -210 -130 -105 -57 266 -65 44 57 124 165 92 215
4931 215 30 147 -23 136 -41 9 10 -3 103 32 -93 -16 -31 65 -196 -183 142 193 188 37 -162 137 -98 276
4955 276 29 -34 -156 364 -668 -598 321 210 -325 -420 47 621 -74 -17 -67 167 -67 -288 198 114 -436 61
4977 61 -64 460 73 -12 -97 -103 102 11 94 -33 -43 -59 -204 -79 -101 -143 -55 14 -7 160 257 -52 21 -103 -79 -71
5003 -71 199 98 109 -182 -83 -66 -94 113 62 -58 -129 64 182 7 279 -162 30 35 -241 -18 -5 -239 -66
5026f6L02k82m6k73L40k04M5R9J9J5J0J38j09K5J2J67l23j99K32L37o9j50o0O7
5050B7j66J93k6L0j09n1L00k61p9M54l98L04j87kj12L17L6k77j60O2r3J76R3o5
5074Fl9J37P2j35O1K6k4l9o0j52K86j0k65K50Q3n3n3j25m8K74k32L5j21n6O4j54
5100b72M05l56J99J67k07J66j72j01J58J82j42j32J9J99l97L48j24mN7m3O7Q4
5122A01k60J39l1K01j51m0M5j34n2P7K20k08N1R4j29K85j90M8k39N5K30R8k40
5145c0j2K82k05KJ7o2j1RK47j68k0j09K7j6l1Q1M5K83l75Q8R7l19J14JJ35l39
5171b69L00l7O2j29J94J12j91jj3r7J41j35p0n1L06j64j20J09J40j55J43J7J6
5194A08j15l9K65j79k02n8J28k6Q4j82K60O8K6j05J3j76O3K20m16L85l21J65K75
$$ plain form
5026 -66 236 -46 -92 -365 -25 -229 -184 -85 -66 -51 -41 97 -12 13 25 192 -131 -330 -98 239 170 20 -40 27
5050 27 -139 54 28 58 -51 -102 198 -63 -142 312 -86 218 31 29 -83 234 270 -7 -167 -105 -198 -22 71 6
5074 6 -33 104 176 41 102 128 104 65 5 -147 139 129 -136 114 197 144 91 -34 -82 192 -40 -5 -126 -182 -118 -272
5100 -272 133 -223 -24 143 -64 102 -70 -171 -13 169 27 -105 -86 113 -284 64 -60 -64 -7 -50 17 101
5122 101 -159 -20 -51 150 -1 -41 4 -130 -182 -105 115 -93 -42 52 -77 208 18 66 -173 -118 112 210 -30
5145 -30 -42 240 35 37 54 -8 -19 -10 237 69 49 -60 -33 -49 -80 1 46 329 -46 42 139 -180 -66 -65 70 -269
5171 -269 31 -6 56 -73 121 233 42 41 28 -69 72 -63 -133 -184 122 -42 -162 -53 87 -68 75 92 108
5194 108 -7 -46 219 40 -162 -220 -92 -118 -34 -216 44 112 138 33 46 -130 -67 153 -263 122 -199 -34 241
5217B41j23Q4j74Qj17l4p0K83j26J26j70Lp7Q4J49PO2j09J9k83K70OR4j32k3L23
5243C21j65J8k84J81j29O7R8j19j83J7K03P4Q2j28l8j97M25m09K37J4n8K52m76
5266a97M0O3J69k55L36k32R7k3J8k30K12J40l03J38J10O6k66m9K83m8j7n8J39
5289A33r1J6k80K80j82K35j21K68m93L64q0J14m46L65j20J00j66j62M54k34K40
5310A94m49K93r1p2J47J89j05m26N87k69O4j4k37K10q8j53K02j7k1K4m7J3L1J15
5334H0p8n3O3Q6j47j36O4J60q6N0R3j43P3K33k59k01K89l71L57j4m2J10k52J9
5358a05J64M6j60J63j29j65R1J24m3Q2k30L9p3J53j2j65L10J82k91j7O6j21J16
5381B5L1j24P1j24K13r9J7mO2R4k09L00k94J38j56P6J45k91J58R7L4o5p4O9l2
$$ plain form
5217 241 118 202 28 36 -81 -115 -185 98 -28 98 -72 -69 -146 -62 87 94 156 47 66 -217 53 59 153 21 -2 321
5243 321 156 174 -110 71 -58 9 107 -12 -195 -178 25 99 181 53 15 -182 243 -166 71 85 27 279 -197
5266 -197 -157 -94 75 -180 156 -76 21 -2 16 -214 -2 138 -165 -27 83 149 -117 -166 117 69 52 -6 133
5289 133 42 58 -222 58 -124 111 -10 258 -235 129 49 163 -283 82 -38 62 -104 -266 188 -46 194
5310 194 -255 38 -53 -125 22 211 106 -320 267 -2 62 48 -189 21 -67 -220 -18 -35 -56 -32 -79 -66 -35 80
5334 80 2 -51 12 98 -49 -185 -121 39 -47 3 96 -47 26 259 0 -201 88 -283 74 60 18 128 -124 -105
5358 -105 59 105 -55 108 -21 -186 -95 29 -14 68 -162 -123 -196 -43 -55 -220 90 272 -19 -36 30 -91 25
5381 25 56 -68 3 -121 92 -7 10 6 68 162 -47 253 -41 97 -59 17 162 -129 29 126 160 95 21 90 58
5406E8j58J2l8L53q7j67j04M4P6p2lL39k58j40J49o3lQ0j50n7K83n2k84J53J22
5431C3N1M9p9o7j3J23k9j19N1j80J50pK24l60K24LJ20n3j9j43K38j02k53J25K55
5456B22j85j00j14J58K36p0j22j24j26o4R1J57M0q5K23m74Q2J60N2j6R6k1r8L9
5480d3j16R4J98N1k71L68j81j74J59j35k7QJ4J00j61R0N0m6J32m9j33J66j23q5
5504a14K19kj75J81j01r5K20l76J60P6L8M4rJ27k79J86k80K76k08J80l5n2o1P1
5528iKk52M44j74k11J33r7L11k70j79N01k5k06n5N6J10k55J85n3r1r9K68K6k23
5552a63R6J90k59J27p7K9J04j63L46l06M2nj52J24K39j92J97k61QJ94j57k04M57
5575B14n11K49k3R6N6j51J10P9l03K05o2J02k4J27j64q8L5J79j11j3L6j28jM25
$$ plain form
5406 58 -100 -88 -126 227 140 -27 -131 -87 -11 -83 -86 253 -5 -145 4 -59 -62 18 -132 -189 94 42 -242 -89 33
5431 33 84 133 54 -13 -26 97 68 -51 0 -180 -30 -37 187 -173 51 54 174 121 102 -41 197 95 -158 -33 222
5456 222 37 -63 -177 -19 217 147 25 -99 -225 -289 -198 -41 -1 -86 137 -337 -255 -95 -43 -59 37 16 -82 -43
5480 -43 -159 -65 133 184 -87 281 100 -74 85 -50 -77 -69 -55 45 -116 -26 24 -22 110 61 -72 94 -29 -114
5504 -114 105 103 -72 109 8 -87 133 -243 -83 -7 31 75 66 193 -86 100 -180 96 -112 68 33 -19 -80 -9
5528 -9 -7 -259 185 11 -200 -67 -164 147 -123 -302 199 174 -32 -87 -31 79 -176 9 -44 -135 -234 34 60 -163
5552 -163 -67 123 -136 -9 -86 -57 47 -116 230 -76 -34 -39 -191 -67 172 -20 177 -84 -76 118 -39 -243 214
5575 214 -297 -48 -71 25 81 -70 40 119 -184 21 -41 61 37 164 0 -88 -53 126 15 2 38 -90 -91 334
5599C34m90J51j56J44J12N9k56K32n0k84L07j41Q1j98K32j15L3o8L14k57o8j52
5621b36M18L5p8r9m1j11K00j13k1j61K48L9j65R8K2j40K59k5m33L95n8J7Q5j01
5645C4M9k16J87l21K42r0K09M9k09N8r4J52k09J28M2M9J82k99K66k91R8J1l8L4
5669B3p1m0L6K80k06n2l2J33k60J01P1m3p5O3J31O3j50R4j65K32j81l6J17K0J7
5694G0j93j07K29L0Rr4r3J43M8p3P9J6l13K47l16L53k7O8q9l6J20j49K59k85N
5719i9K7L0K30m22J19K57o0j14r0n3J84q9O3J52j81K55o7p4k83J71p9m8K34P6
5743A39j33K66m12K70K7k14J97j37P4K6p9j50n7M4O1q3k8K11J07l15J49l7M2j6
5767d8J67j05j1M8j51j54K38o9j67J72J99j10qo1o1k10N1M04j22M6j16N0n9K01
$$ plain form
5599 334 -156 -5 -161 -17 95 154 -102 130 80 -204 103 -38 43 -155 77 -38 -5 -73 241 -16 -84 -236
5621 -236 182 217 139 40 -1 -112 88 -25 -46 -207 41 80 -85 13 35 -105 154 129 -304 91 33 50 135 34
5645 34 83 -133 54 -267 -25 -115 94 143 -66 -8 -102 50 -159 -31 11 60 242 -57 209 -82 16 27 -11 23
5669 23 -48 -88 -52 228 22 -30 -62 71 -189 -88 -17 -60 -135 -72 59 122 -28 66 -99 133 -48 -84 33 53 70
5694 70 -123 -230 -1 29 38 -56 -149 -6 42 -31 48 64 -249 -2 -318 35 8 76 -13 -49 71 -78 181 -104 -99
5719 -99 -72 -42 188 -234 -115 142 82 -32 -122 -175 9 -80 -17 135 -46 209 142 68 -215 -44 -123 -171 63 139
5743 139 6 272 -140 130 157 -57 140 3 77 103 24 -126 -183 -139 -78 -161 -189 22 129 -186 -37 -74 -32 -48
5767 -48 119 14 3 51 -100 -254 -16 -85 -252 -80 119 9 1 -60 -121 -331 -280 124 2 48 -68 -18 -77 124
5791A24k00J77j60M9k3J8j43Q4m0j9J67m6P0M0Mk39J95q8j29J51rl76L14K52k29
5816e6L9j70L5J49q6K66k81J99j07O4M7k36J54J0j43R2R8k5j55J26J77j61M6j0
5840G2j83L46k40k4j96K37o8K4o7Q6NL8J56k69l24K65J52m2P6j06J61j40l70M63
5864E2Km9jO4Pj95K72k74K02Rl04J51r1o3J21K4j21L30m0j66J70k39j7K53j61
5889f4O7q5q5L74j82K8k38Q6K49j37J06M6p1j03k1j01K32P0j67J92k17J82n6P4
5913A79p1j78j51L16Q0j22k7l4k99L32Oj77K24j66K8J11o5K28k66o8MP1K53l38
5937a30Q5k06M19j69j0K06l69J59O2o9M9m1m3J9L9l63L42nj5Q1R0l2p0j28j34
5962b33K35O3q0j58K63M1l68K57L0J00k60K15l3K2j84J18k09J35L23k29J45j38
$$ plain form
5791 124 -76 101 -59 -10 -33 -15 -158 -74 -114 -133 34 -12 58 98 102 -137 58 -30 -159 -8 -17 -393 -79 173 -56
5816 -56 -17 -187 -152 -3 -89 177 -104 95 -12 52 99 -137 17 27 -116 -24 74 49 -106 20 197 36 82 72
5840 72 -111 235 -5 -29 -225 12 -56 -32 -99 -13 -8 30 186 -83 -407 -142 10 -32 44 -62 99 -41 -411 52
5864 52 54 5 4 68 75 -120 152 -122 80 89 -215 -64 -155 -218 -97 -73 -194 136 96 -70 100 -139 -156 97 -64
5889 -64 3 -82 -167 207 25 53 -185 -99 150 13 119 165 94 -9 -30 -131 101 171 4 196 -21 161 105 179
5913 179 108 -70 -221 95 175 53 26 -8 -307 25 31 -146 78 -88 -60 51 -14 214 -52 -120 -116 -45 208 -130
5937 -130 -45 -251 168 -1 -11 195 -174 -15 47 -22 27 -14 -57 -38 1 -362 -20 -25 -40 41 131 99 29 -99 -233
5962 -233 2 65 -15 -173 90 131 -237 20 50 150 -110 105 72 94 -90 28 -181 -46 277 48 193 55
5984E5j17R5K01J0l69K22k38oJ22qj01J82l3M2K9j29j20K08K9j61L46n1n20J97
6008a15k10J13J92r0J84q0j61K18K20k48J39l10J7K27j92N3J27j99J40k51Q2J91
6030D7j34O3M7l2J21j66j56K89j50J35j89J6J99n5J45k36K62k87P1O5p0J59j63
6053a9j35O0L7n1P9mN0K0J18j61l41L93k35K02j7Q8n8m7k28M2L74o2j30q4k5P0
6079f4J34k02j3K25j61J4K38k48L36m26K58n4k69L36k60j47K08M6l4L8j08L87
6101B34l09j00J70k7r7lJ48j5K31k89R9r4J70j32p7J8K15p8j82J35J88j72j00
6124f7O7O7mj39P1J8K2J45k65J53k03K73l41R2Q2n0Q3o1J0J06j06K4l2L2M39m56
6150d0p9J11O7Rj1q6K18j57J72j47j0n6m1n3K89k03Q5j97n4K60j06N8J09M0p3
$$ plain form
5984 55 -62 33 234 244 -125 97 -141 -147 -25 -33 -134 48 15 57 86 -43 -163 45 74 -87 259 208 -312 -115
6008 -115 -325 -212 -20 -110 74 -6 -167 51 271 23 162 -148 -131 96 -96 -43 84 -115 25 -226 -144 47
6030 47 -87 -24 23 -9 112 -54 -210 79 -71 64 -125 -109 90 35 180 -56 206 -81 -10 55 -15 144 -19
6053 -19 -154 -94 -57 -108 -29 -33 17 37 155 -6 -347 46 -189 13 -4 84 26 -21 -249 -207 167 105 -25 -109 -134 -64
6079 -64 70 -132 -145 80 -81 -67 171 -77 259 -167 91 37 -232 104 -156 -303 -95 -49 -83 -45 -153 234
6101 234 -75 -175 -5 -32 -129 -132 16 1 232 -57 42 -52 118 -14 -91 -73 142 64 -118 17 205 33 -67
6124 -67 0 67 63 -76 -5 13 35 180 -85 68 -135 138 -203 -111 -29 -79 4 -57 -47 59 -47 -23 -55 -23 416 -40
6150 -40 -119 -8 59 68 57 -29 189 32 204 57 47 -9 -50 -103 186 -17 68 -129 -183 77 -29 29 138 178 105
6175A05j68j5K86k38j43M70m11n9J16J57l51L06lj06K16q6P5k33L3K05j39j12
6197i5l4J63m4J38J01o8r8jr8k9J76o9o5q3J97r1p4j35J28Q7n2p4M6J64j39J97
6223A48j00No4pk48J31R0P8n9JJ00j27N8l59L22n8j53K69j26K46qo4J64j55Q2
6248A66l22J05J93j60J65j78L51k71P2j23L9M6j35J24O8k57N3L9Q8k05K91j26
6270B3l0O8k34J40N8Q4j24K5o4J81j97o8k8K51j77L35l68K71k94R4K34M3j72m8
6294CJ9j54L79n20k6K08o8K44J47o23O31l96k5L27J27j312J084m08L57L66m88
6315a28K28n75O03l37k14J62O92o12K35n1K15K22l63J74j1m77N4K50k04p7j65
6336c79l03J507j334K73N46n14M20n7k27L38l54J93j36K55k51j95K89j2l49K34
$$ plain form
6175 105 -63 -78 208 -30 -173 297 -114 -173 -57 100 -251 55 52 -54 162 76 151 -82 -49 156 17 -95
6197 -95 -129 34 -10 128 229 161 63 62 -36 -65 111 42 -23 -106 91 0 -74 -209 -81 6 -46 -120 -74 90 -49 148
6223 148 48 53 -11 -18 -266 -135 -45 33 -26 -25 75 -52 6 -353 -31 -89 -242 27 -99 147 139 75 239 84 166
6248 166 -156 -51 142 -18 147 -31 320 49 121 -2 37 83 -52 72 140 -117 -64 -25 63 -142 149 23
6270 23 -7 61 -173 -33 25 109 -15 10 -54 127 -70 -138 -166 85 -92 243 -125 146 -148 -54 180 223 51 3
6294 3 22 -132 247 -273 -299 -91 -159 85 232 -391 240 -156 -181 146 273 -1039 45 -363 -6 360 -128
6315 -128 100 -475 128 -209 -423 -261 431 -181 54 3 218 440 77 251 240 -237 -183 67 -137 -214 -379
6336 -379 -682 825 -509 -236 310 -204 216 159 -68 270 -84 109 -27 228 -23 -218 71 59 -290 -56
6356e6J36j5j78K3l3N4RM8j66K66j31n4P9J45j26K8k3k09K68k52K52j88J76n7
6380dJ49j37oQ8R2m0k08J08k6j46m6J93N3J16n96N73L34o84o7K88R6J78l66k99
6404c57J59M16Q9r3j14q33M52O79j7j12j22M78p20P7j92K45jJ45j80q9L53k84
6426b1p4J19P0j77M0J82m26K40N0k4p6PR8L36l06j37L25k50N9J1j06K1J34j37
6450d2K42l20J87o3r7n3P1J18j05o3L09k05j06J2N3M9m00K04L68k19k00J86O3
6473a1K4O9k24K29j72P0l8L24l79P4j7N1m0Rj36L69k01p2J49Pj09j80L0l0K67
6498F3M0j53J35j8n5O9k31JJ25K72l09K38k25L21n31K94j80R9J77j29j11O7m0
6521h1j68K11N1j6J22k21LK17l23J84J30o9J65m3j19J07r8j26K06k93M38l38O0
$$ plain form
6356 -56 80 65 -113 -90 -123 -69 -60 -12 -178 88 -43 -97 -18 127 1 29 6 -203 65 -187 65 -123 53 -4
6380 -4 145 8 2 90 182 142 -66 42 16 -130 -176 17 70 186 -410 163 497 -187 -254 34 130 308 -58 -357
6404 -357 -198 218 307 214 100 -733 -281 398 381 269 147 625 -95 -18 -210 35 34 179 -1 -90 263 -21
6426 -21 -95 24 94 -83 -43 139 -287 -47 3 -21 -97 -90 8 344 38 -99 226 -24 35 46 -60 -39 95 -42
6450 -42 200 -120 67 4 -93 -146 -75 43 -62 -125 184 -21 -127 -115 -62 -13 -413 -209 159 -60 -260 -74 -11
6473 -11 13 82 -142 87 -85 -15 -53 271 -108 -34 -51 0 -40 -31 -167 202 1 -71 78 85 -24 -204 -174 -204 63
6498 63 103 -50 85 67 12 81 -150 -149 -24 248 -61 177 -48 273 -258 36 -144 -45 132 3 -108 -41 -81
6521 -81 -249 -38 13 -3 119 -102 -99 118 -205 -21 109 40 205 162 43 150 52 -74 132 -161 277 -61 -1
6544aM7m5O7J82j10k71J64j53J3M6j88K33j15K42r1j55O6k92N30j64k0m6L21k40
6568B0k5k28K53O4j71L40r0k99J73K17j05k04J29k03M82k62r4J67j43N5l00K94
6590G0k00K5J32K17k33J09J5k23k2K0J04K84l24J70l58J45J47j18rn4J24p8J76
6613A19k55P4L8J48j93L1q9J67m1n5K0K35j87j5j34Q9n2J81k22L67l57J16j27
6636a42K41j17K08m2k84K24l58L01k01q1K4J19K14L4q3O5j0j51p7Q5L03m18J63
6659A7l6j1L7mrj58J53N8R9r8J50p3j35K82k68J03k4L2j97K68l62K90l4k26P9
6684f7O3j25J02j21K15j8j9O5j41r9J70J64k62K84j40n8n4j0n8r8K54k5j00K64
6708A86pj76k43L2J50J85j89L7j0j72L47k33p5J36M4J15J20k56k57J32N7r6L2
$$ plain form
6544 -1 46 1 68 250 140 -131 33 -120 -107 -61 -249 -16 -131 111 20 -135 -69 -361 169 5 -15 -61 260 20
6568 20 -5 -233 20 84 -87 253 163 -136 37 254 149 -55 74 -129 353 91 -3 164 21 76 -224 70
6590 70 -130 -105 27 244 11 120 135 -88 -110 -90 14 298 -26 144 -214 -69 78 -40 -49 -103 21 -57 119
6613 119 -136 -62 -24 124 -69 -38 -127 40 -1 -56 -36 199 12 -3 -137 -48 -100 81 -141 226 -131 -15 -142
6636 -142 99 -18 190 148 -136 88 -270 31 -170 -251 -227 -108 106 140 57 122 112 -39 -116 -31 272 -146 17
6659 17 -19 -30 7 3 -6 -164 -11 47 146 48 198 125 -10 272 4 107 83 115 -82 186 -176 114 80 -146 -67
6684 -67 -4 -129 -27 -148 67 49 30 95 -46 -145 25 189 -73 211 71 13 -41 -51 -109 -207 47 22 -78 186
6708 186 179 3 -240 -208 -58 127 -62 -25 -35 -207 140 -93 -168 -32 12 127 247 -9 -266 -134 -77 -173 -141
6731a41R4J22j9k10J46J25k0N9m91K43J79j8j40P7k21K41l5q3M9M2r5K91j70p1
6755d6Q0J31n12J92Q2o5j09J98mJ29l16M33j44m0J64l33O6l0j7J6J99K4k6n6j4
6780Bl6K09j86O3Jk74J82R9N3J10k67N4k6J48l07K67r7q7M5J97p3k12N3Q3J18
6805A19k52K76k15Mj17K55R5k49K18j76J56j21k7m5Q7Rj26l3K09r6J06N5q3q8
6829c9L06k26Pj25L5j36L09j28P2j47NR6J3j91MJ26k08K75K7k0j42J84m3k05M27
6854B76k42MK38j97j07k22K64j1K50k02r9n1K32m17M68j76p1M5n4K89k99k1J0
6877i3O3p5K9J72q5k98J8J95J02k14J86J64q8j38K7l5J17J72m90K31J29k17J97
6900F9j61K26j19J99l56K14j2n5p0j33K97k61K29k25K38k46J19K05k01p9J88j20
$$ plain form
6731 -141 -47 75 56 -154 -8 117 97 156 -335 -92 87 69 -71 6 -215 26 -9 -92 -43 -1 -96 195 25 -46
6755 -46 34 165 -347 -155 -73 -138 -247 -49 -53 76 -240 193 49 9 173 -160 -94 -124 -141 -125 74 98 72 16 2
6780 2 -34 175 -11 52 53 -221 -39 60 113 223 -44 10 -16 132 -175 92 -5 -92 -47 150 77 -135 -82 1 119
6805 119 -133 143 -72 -68 -185 70 165 -84 134 -42 114 -7 -34 -79 8 17 -109 -142 67 -29 77 132 49 -39
6829 -39 267 41 48 -77 -42 -178 131 3 75 -72 -67 29 42 -149 -145 -19 -227 48 75 55 -87 97 54 -151 276
6854 276 34 38 276 79 -28 -250 14 3 253 51 -48 -99 133 -284 184 8 -63 -18 -72 217 -82 -103 -93
6877 -93 -30 -105 -76 96 11 -287 -269 -74 28 -186 0 164 76 -62 -35 -70 47 219 -271 -40 89 -128 69
6900 69 -92 134 15 214 -142 72 60 5 -65 -198 99 -162 67 -158 80 -166 -47 158 -43 -122 66 -54
6922e4Nj09J00RL8Q3j60K95r2K5Rk05LM5j40L16j80J65k6j31J90l47J86K58m14
6947a31N8J45r5K39J31k93R6k17O2q2J25K53m37J38Q0r6J81m0p5q6J84l12J49
6970b3L90m27J71P3k8j38j39K24Rj17j44J19K49k47K78k74r0m3L5J80k85K03p
6993c1O5j87L9K95j33j09L30j18k90j5j2l5J23m6O5O8K07q4j62j06J76L7k79K00
7017bR5j16M5L19k26O1q1j9j31L11k01j92Q6J43k12JK28j16J37L5j89M7j80J36
7041b1J43j41j22J73j38P6q5J36j4L0L4q8K22J2k41Q4j18Q4r8K40j20o8M7j49
7065a22l7j7K05R3j05p1K02j90j00L6q4K32J16k57J09J3j74J77j07N2Q4K16l08
7088c7J31J37k37j31K26j86J30j03K91j10j92J07O7j30k1K36l02J48M1k3r3K28
$$ plain form
6922 -54 -49 -158 -58 -49 -11 72 -88 207 115 140 149 -56 -53 -8 -148 168 -12 153 127 -4 186 -161 25 283 -131
6947 -131 -73 72 -23 216 347 54 150 -67 -5 -87 38 291 -146 -8 72 -24 157 117 42 -44 140 -172 -23
6970 -23 367 -60 111 184 156 18 -121 103 112 -5 -149 -30 219 -28 250 -24 -114 -157 -122 58 -227 -24 -31
6993 -31 34 -153 -114 181 48 -61 269 151 -139 -154 -166 -201 -78 -124 -59 9 216 132 -30 -136 40 77 -202 -2
7017 -2 93 -23 22 341 115 176 95 76 -55 256 55 -137 -51 92 -120 -119 109 -7 130 165 -24 23 -157 -21
7041 -21 122 -19 -141 32 -106 -30 -115 21 7 37 71 -17 205 217 -24 60 -58 26 -72 168 48 -20 27 -122
7065 -122 -159 -176 29 122 17 -54 148 -42 -142 -106 -190 42 158 -99 10 23 -151 26 -81 -29 55 271 -37
7088 -37 94 231 -6 -137 89 -97 33 -70 221 111 -81 26 93 -37 -58 178 -124 24 65 42 -51 177
7110A77J3l42P9J11j01O2p1j08L40p4k22J31l6J15j52k0QJ47j91O3l4m8R2J21
7134F0j68PJ51k91N02k10k29K65P9j62l05K02J19N3R4n8j01J2K2Q0k57J68j02
7157f9J84p5p9j52K25j92K14l0j59J41o2NK0L56n05M26j34k59M26k21J1M1q8J02
7181A26j63K7M6j09kJ46J4k53j28L62L7j52N52j31n27K82%q8P8j05n7K8l21O70
7205C32n71j53K28K73l14L19m49k56N19k15R35m92N23j66l07JN9n6n78P47o01
7226b22L43m38J21j07K15m12K51R2J63M5J43m62L37m07J70O4K68j85po8P6p2K47
7249A55j09l7k2j43NJ51LJ05j33j28K36O6p9Q4L9m29J06L04k5nl8j8j08p1J42
7274E1j37K1l8N0J26l86M42k15j33K7K75LJ12k17K53k83j73J21J51p2JJ63j47
$$ plain form
7110 177 190 -152 -73 38 -63 -1 -72 -180 160 86 -136 -5 -41 74 -78 -98 -90 57 -134 -71 -105 -153 -61 60
7134 60 -108 -101 50 -241 261 51 -178 87 166 4 -301 -99 20 73 167 109 8 20 42 122 -135 33 -69
7157 -69 115 40 -39 -191 34 -158 56 26 -133 8 -54 -49 -29 327 -178 248 114 -145 281 60 71 112 24 126
7181 126 -37 -10 36 -73 -75 71 85 -168 -296 66 103 -49 503 372 -155 127 127 39 117 12 -45 -17 -338 332
7205 332 -239 -392 -164 109 -205 114 -335 -591 -72 -287 648 156 679 513 206 207 266 210 -368 379 -222
7226 -222 121 -317 -196 -303 -88 -500 -249 -157 6 51 194 -268 69 -338 -168 -104 164 -21 -28 -96 -20 -92 155
7249 155 46 9 -13 -156 -151 0 3 108 -25 -153 83 149 70 154 193 -236 -130 174 149 144 106 88 -20 -91 51
7274 51 -86 -65 -103 -53 73 -313 129 -86 -219 -192 83 86 198 -19 234 -49 -222 -101 50 -22 -21 142 -5
7297ej5k97L42KJ84k78K21k11j31J96J14k27r9K65l32K31nN4qO5j75K22p6k70
7321b33J63j8J89q0j27J85p4j41J37J22k04R3K31k37NR4j06J45j06q7o8J49q7
7344e5k19L38jl60K80j19R9L8J26j63J22m7l57L88j0m0j49K67j0jP3k05j43J60
7368A2L17l52l5J72Pl22M3K12k39J9K33L0j28Q7o7M1n6J18p2K5k90K31M4j20M8
7393d2Q2R1Q7K2k8m22J0J8Q5L61k40Pj80K36K93n32K60r8j05MK81j21J02k47k16
7418b92L24J44k18j00J32N8j27K10j5J99k74K5L9j73J28Kq5q3J64P0O1k73K84
7441B00l00L03R2p49O55j38J75n97L30R3K73q60M84j67J47o1k1L71l27L0J87r3
7463B7l37N19m97J27Q5k19J57L58j85M7P9k23K51m4r9m1N0J5m3k44M08k09k82
$$ plain form
7297 -5 -20 -317 25 27 211 -67 154 -57 -188 8 122 -105 -204 61 -271 -40 -45 9 1 66 -109 113 37 -233
7321 -233 -70 -88 101 21 -106 79 5 -136 1 123 -81 12 243 6 11 105 -1 144 38 -49 -117 32 -55
7344 -55 -274 64 63 -297 -17 -136 -37 1 127 -36 86 39 -318 70 60 20 -129 138 128 127 200 -5 -148 12
7368 12 329 -23 -58 114 121 -201 -158 54 -185 -166 67 97 -31 56 -11 30 -26 92 20 45 -245 -14 30 -90 -42
7393 -42 40 131 218 240 212 -210 -200 -182 -97 264 24 31 -149 87 380 -152 108 10 -95 -91 190 69 171 -76 -292
7418 -292 32 176 -42 -142 -10 48 -79 131 116 315 41 66 105 -68 60 62 -23 -106 58 128 189 -84 200
7441 200 -100 203 295 -454 201 63 238 -359 -29 64 337 -523 -39 -206 -59 -120 -141 230 -97 -67 120 27
7463 27 -310 209 -288 -161 -76 -295 -138 220 35 82 161 -62 189 145 46 5 55 70 27 -217 191 -18 -300
7486c00N06j20LO9J13k24k73L95k35R9p9j65J18Q5O9j43K22k71K19j42L3M2p3
7509e2MK6J28j65L3k60L20k35J13J5K96m07L92k21M9J38O5k50M0J81j82O4Lj77
7533h2J45k38R8l6K67j22j04P8n1J35j83J3J34MJ0j54j93L08j03K00o3j41M6j4
7557d6jp1J05j8J23K2k18L21k73J27j33nKlK56j07%k02L1r8j49M97M6j17n2j24
7583h7L23j92k2n9N6Q8r5R1o1J12N3k82J12L7N9j99o6K14o5j16J41n5j34K83k83
7608a47K90P0j44j33J75J04q5m7l42K51k44K88j64K7K13j53K83k60j02M6J39j22
7630e7k6J47P7l4j73K52j92O4l7j15J04K48l70M43l64JN7RJ73k93M67j62l19K66
7654A66j5l11QJ0k66P24J60k94k14J04N58j131N54j56M43k72m51R12j157k16J709
$$ plain form
7486 -300 206 86 89 158 271 47 -226 169 -66 33 -46 -211 -93 -8 61 -82 140 -131 88 -54 -21 21 -52
7509 -52 -48 -22 106 -59 -26 -286 34 -201 -88 -73 223 -184 208 -13 36 174 239 -11 29 210 28 92 95 -82
7533 -82 63 -175 -77 -113 154 32 -72 6 -45 90 -93 -80 54 58 68 -86 -279 29 -74 126 63 -78 -32 -46
7557 -46 -47 -118 -13 -31 92 114 -104 217 -56 71 -62 -67 -65 -68 188 81 81 -121 -90 -188 -337 160 206 89 37 -87
7583 -87 236 44 22 -37 19 107 12 103 42 154 207 -75 37 74 133 -66 -132 82 17 -99 42 -13 -147 136 -147
7608 -147 143 213 69 -64 111 215 130 83 -259 -8 -252 36 -128 -101 112 -41 242 -18 -120 -74 65 -57
7630 -57 -83 64 141 107 -66 186 -6 58 21 -94 10 258 -112 331 -33 -32 25 34 207 -86 381 219 -100 166
7654 166 151 -160 -152 -142 -408 316 476 182 -32 72 630 -501 53 -103 340 68 -383 529 -628 -844 865
7675H65m36o42L28p27L17L35L34j11l47K47k81K34j68P9O5J4k96K55j5r3M0N3
7697E0M0j2P3k83L21j50j33j5J15J55k07K46m22K06k33L05K44o09L83j18M1kJ70
7720A65k36L7k71M00k07J49r9K65K8r9o5l19K26j24J3J67o3o7K98k67K23l07J09
7743d4M2J43r8j3o4J13M1p9o8O0q8j82J88l5j14J21K33j93K02j40nP1j88J83l46
7768b60j26M26J40l95K72KM0p5J67m31J81J95j45nj45o7O0J21J0R7o8J32r7l5
7792fm9M2Nk4j10K14j77J46M5l47J59j83K80l2q1J93J5K2k49J04R2L4j66P8R9
7817A04j70k9J10J06L6j79j86L28k36K61M3k32M5J3K30k82N5P4k22k5L32J14k39
7840E1j36j0K62J2n7j30r9K26k23K43J6k21L83k98j00qM0K12rj73j15j8K92r2
$$ plain form
7675 865 429 -213 115 -612 -295 40 374 263 -84 163 -118 116 -52 27 92 106 -190 65 50 -43 -3 50
7697 50 90 78 151 -132 189 39 -94 -109 6 161 -46 200 -222 -16 -249 56 300 -309 74 -44 -3 -5 165
7720 165 -71 -34 -305 95 -112 37 -62 203 231 132 67 -252 -26 -150 -137 30 -33 -100 198 -69 154 -153 -44
7743 -44 -2 141 43 30 -34 79 120 41 -27 33 -55 -237 -49 -84 -198 -77 156 -37 165 25 20 91 -97 86 -260
7768 -260 -386 40 180 -215 57 59 99 24 191 -240 -59 136 -9 -14 -159 -226 -166 -45 -35 62 -6 126 29 -6
7792 -6 -55 -13 -8 -32 -142 72 -105 41 86 -261 -102 -285 -5 -37 -118 75 90 112 -137 -33 59 93 -73 5 104
7817 104 -66 -95 15 121 157 -22 -208 120 -116 145 188 -44 1 14 244 -38 17 91 -131 -156 176 290 51
7840 51 -85 -95 167 179 122 -8 -107 119 -104 139 155 -66 317 19 -81 -89 -49 163 154 -19 -134 -152 140 48
7864D8q8j09J76k2j42J14J09k32O5K8M1J33q3K3o0j19L31k90l9O8N0J31r1r8R0
7889C4J23o3j43q2J52o0J05N3j08N1q4O0J46j37k16K71m0j10N8l5j17O3j43K73
7913E1p0L5P6J1P8j03j23p0J80P5k71P4j03K32k7j31K45j16j5j0m8m0K00l9k51
7938a60J73N6P3k0p1k62K30L8k20J72j71J18m4L16q6j89j03J24q7N7Kj19K25k18
7962a66R4M9o0J98l5j0o4l89N33o1o9j02Q8O4J66j74l5m9K82k88J32j85J36J17
7986A72j60j58m0K78k17N9o0J99k8k43K81k65J68j81L76J6m42J34K83k9J7l75
8008b15J23L1N1j7K06k31R6J10j73J78n50M43p2J13k60L33k01r4L18r1j40Q8J6
8031F2R0j86n5l8M03l61K55l07j02K66k76K66PJ3l7J72l04j49K87J70n8j54Q2
$$ plain form
7864 48 -40 -149 27 5 -137 -23 86 -146 -81 -53 -12 121 38 61 1 -118 213 -77 -116 -48 2 133 42 -56 34
7889 34 157 94 -49 -131 21 -39 66 119 11 62 -22 38 184 47 -169 102 62 -48 10 -25 -142 -79 -222 51
7913 51 -19 16 92 103 181 78 -45 -115 65 140 -131 -57 -160 72 45 -86 159 43 28 18 -30 -70 130 91 -160
7938 -160 13 69 142 122 51 -211 19 57 -163 9 -162 -44 -88 228 142 -47 -150 -26 -113 -56 -54 -173 52 -166
7962 -166 -72 -23 -83 115 80 70 6 -383 150 89 20 -82 6 70 236 62 27 -22 260 -28 104 -81 55 172
7986 172 12 -146 -186 92 -125 -66 -126 73 45 -198 83 -182 -14 -195 181 197 -245 -111 172 143 160 -215
8008 -215 -92 -61 -10 -27 179 -52 44 154 -19 159 -391 52 -20 93 -167 166 -35 -129 189 98 -42 46 62
8031 62 152 -34 -89 -127 276 -85 170 -137 -239 27 -249 17 24 37 0 172 -132 -281 6 176 118 -36 46
8054D6M5M1J04p8m8K5l6j51J42j74K32j91J16l00j14N33j98kn7Mj18N38n44J64
8078b1K7j88K16P4k87J84r7J98j28j1O0R7o2J6K0j86Mj67K82j15PMl0P8J94k20
8104e1M3O7mJ9o9kj98J64K65k09N3j76J20M6k57L25k74K70r1j46l4Q2l9J14m54
8129d36M37m1j78L96m40L93j16R8l04K02L3J4j29M3L5R3J03k14j10K1K82j25P7
8152A34k41N4j01J45MJ29j77J04j1r6L69n47m7J74j07K82m2j36K19j58M6O0Pj90
8176a26J73k56J76l3L9j5PN2J57k34K68j01r0N1j04
$$ plain form
8054 46 91 132 236 158 110 135 99 -52 90 -84 148 -43 73 -227 -341 192 -6 -8 -65 -61 -179 359 -185 -21
8078 -21 6 -182 34 108 -179 5 -92 106 -22 -33 27 124 62 78 98 -88 -84 -251 31 -84 -77 -73 -103 -25 169 -51
8104 -51 -8 59 55 74 5 3 -195 -31 234 25 78 -98 22 68 -189 136 -138 132 41 -105 -139 -57 -96 18 -436
8129 -436 1 -40 -218 178 -262 131 15 113 -191 11 44 58 -71 -28 7 100 203 -11 -121 -100 182 57 134
8152 134 -107 -53 -154 -9 -5 124 -53 51 40 -56 313 -234 -281 -107 -214 68 26 -110 109 -49 -3 57 64 -126
8176 -126 47 -209 -33 -66 -27 -42 -35 17 174 -60 208 107 17 68 -36
8191c6
$$ Imaginary data points
##PAGE= N=2
##DATA TABLE= (X++(I..I)), XYDATA
0@%%%%%%%%%%%%%%mJ2j6J6j6J6k4L2l2M0m8N6o9P7q8J04j20J36j54J76k00K26
36A20k54K84l20L58l99M43m91N45o04O68p37Q14q96R87j087J198j322J457j608
55h44J777j969K190k444K738l087L513m040M712n609O873q806J2189j9919P4563
70F1837L8355k0274j85l2739J8039k2996k926K26j3968j319R043j1414K0162j0074
84C1767o062P72j9206q74N06m520P660J880p188J647m513q914J1163r209N067
99b4K518q068M678L24j860J0126K04n708N640j6370K73J980r568J6109l869J616
115a999P698o910K936O723n906P099P54j0518P270j0141J246O501l294Q509mj413
131H551K850P71j618P897k893j052K536j1683K694k996k064N481m62j739K811
$$ plain form
0 0 0 0 0 0 0 0 0 0 0 0 0 0 0 0 -4 8 -8 8 -8 8 -16 16 -16 24 -24 32 -37 40 -48 56 -64 72 -82 94 -106 120
36 120 -134 150 -170 188 -211 232 -259 286 -318 350 -387 427 -469 518 -569 629 -693 764 -844
55 -844 933 -1036 1154 -1290 1448 -1639 1874 -2166 2546 -3063 3810 -4996 7193 -12726 61837
70 61837 100192 79918 79733 46994 65033 42037 39111 39337 25369 24050 33093 21679 41841 31767
84 31767 25705 26477 7271 6397 6903 2383 10043 11923 4735 6382 1869 -7045 4118 -5091 -24
99 -24 2494 -5574 -896 -572 -2432 7694 7898 2190 7830 -8540 -8267 -6287 -15855 254 -3615 -1999
115 -1999 5699 -1211 1725 8448 2542 9641 10395 -123 7147 -2994 -1748 4753 1459 9968 9964 8551
131 8551 11401 12172 10554 18451 15558 14506 17042 5359 8053 5057 2993 8474 8012 6273 9084
146I084m142k805N536p888N582k399o200M261p445J907K760k521J662P8p624K542
162g612l171k943R259m242O008J868l990L659l176j858J037k519l654K724n733
177a4343M070M805j80Q998j323P81q36m006k557J113l355Q73K690m150P648j717
193a489L123N660k221L055r20l601m54J62l050N475j716O53M383n631M874j492
209F811l29K748k063j464M04k424o43L932l907M795j793k650J929m836R07n46
225H71j180m60J750l502K883P92j428N345m330J683j714n045J66j176j337K267
241d415J419j009N082k713J819K600l338K422l931j437j098k020J53K337q2K894
257a317K545k440L669k352j03J223l296J052j941k40N1K470r85L783m77m05K145
$$ plain form
146 9084 4942 2137 7673 -215 5367 2968 -3232 1029 -6416 -4509 -1749 -4270 -2608 -2530 -10154 -7612
162 -7612 -10783 -13726 -4467 -8709 -2701 -833 -4823 -1164 -4340 -6198 -5161 -7680 -11334 -8610 -14343
177 -14343 -10273 -5468 -5648 3350 2027 2808 1972 -2034 -4591 -3478 -6833 -5960 -3270 -7420 228 -1489
193 -1489 1634 7294 5073 8128 7208 3607 3153 3315 265 5740 4024 4677 9060 3429 8303 6811
209 6811 6482 9230 7167 5703 6107 3683 3040 6972 3065 7860 6067 3417 5346 510 1417 871
225 871 -309 -769 981 -2521 362 1154 -274 5071 741 2424 710 -4335 -4169 -5345 -6682 -4415
241 -4415 -2996 -4005 1077 -1636 183 2783 -555 1867 -2064 -3501 -4599 -6619 -6466 -4129 -4211 -1317
257 -1317 1228 -1212 2457 105 2 1225 -2071 -1019 -2960 -3200 -3149 -679 -1664 2119 1642 1237 3382
274C382m641L137j625j45K017m31l24J735j2o43L286l814K693j917k742K524k873
291c93J814J168Q39nK145k660J420j282k880K648m847J309p17j327J995O33M89
308C49J896M61k842K208m377R3r4l265K951j936Q34R05N39M71K064j847L3O71
326h86m309K764k624R35J765j197J744L99k18N37J142k419K842k045m90K588l025
343b497L501l92L53J532M2r43J095j026j440K552l301K583n65o94K849j527J453
360C575P81m29q62Q53l312O76m66j890L530k422K211O42jP33Mj471j31j032k988
379a999K169k726J365J484j355K808j105K76j06j216j622M76k209R4J100k248
395d814L849j350J203J076j411K10j263r17o91J109j676L377q93M91K685j993
$$ plain form
274 3382 -1259 1878 253 108 2125 1694 1370 3105 3093 2450 5736 1922 4615 2698 -44 2480 -393
291 -393 1421 2589 3428 3423 5568 2908 4328 3046 166 2814 -2033 -724 -1441 -2768 -773 -140 349
308 349 2245 2706 -136 2072 -2305 -2212 -2306 -5571 -2620 -4556 -3722 -2817 -2278 -1807 257 -1590 -1557 -886
326 -886 -5195 -2431 -5055 -4120 -2355 -3552 -1808 -1409 -1627 -1090 52 -2367 475 -1570 -2060 528 -2497
343 -2497 1004 612 965 2497 2539 1596 2691 1665 225 2777 -524 2059 1494 800 3649 2122 3575
360 3575 4356 3927 3065 3918 606 1282 816 -1074 2456 34 2245 2887 2886 3619 3623 2152 2021 989 -1999
379 -1999 170 -2556 -1191 293 -1062 1746 641 917 811 -405 -2027 -1551 -3760 -3666 -2566 -4814
395 -4814 -965 -2315 -1112 -36 -1447 -1237 -2500 -3417 -4108 -2999 -4675 -1298 -2191 -1700 985 -1008
411a008K170j087k81m22n01q38J134k23k12K965k099K727l49q98J275j420L4l48
429F19j96q79J449j870J940L06j263K931k557R15n28j438K33m74p25K41Q54j323
447a765K256j392J169O49j956R62j980k86k55j19n18K171o61J026J771j999K302
464A375k060k12j61j408k5Q7M73O59J845j194K711r15m42N94k755R44j159l6L17
483a362Q00J50J588ol33J427k566J414j539n74P10r11J392M49J000k81J716j888
501A186J120n02j631J612k110J292QL10P30N91k41J53K73k136J864k638O24M2
519E47j519J480o76Q11J5Q47p15Q64j181n00M88k378J614j650O70Q45n04J448
537E06J88L80k02P13k264J083j477l75N48j359J670m59N44M01K48o07L64o38j045
$$ plain form
411 -1008 1162 75 -206 -628 -1129 -1967 -833 -1056 -1268 1697 -402 2325 1976 1078 2353 933 967 619
429 619 423 -456 993 -877 1063 1369 106 3037 480 1395 867 -571 -338 -812 -1537 -1296 -442 -1765
447 -1765 491 -901 268 917 -1039 -77 -2057 -2343 -2598 -2717 -3235 -1064 -1725 -699 1072 -927 1375
464 1375 -685 -897 -1058 -2466 -2491 -2404 -1931 -1272 573 -621 2090 1175 733 1327 -1428 -484 -1643 -1679 -1362
483 -1362 -562 -412 1176 1170 837 2264 -302 1112 -427 -1001 -291 -1202 190 639 1639 1358 3074 1186
501 1186 2306 1804 173 1785 -325 967 975 1285 2015 2606 2365 2518 2791 655 2519 -119 505 547
519 547 -972 508 -168 643 658 1505 790 1654 473 -27 461 -1917 -303 -1953 -1283 -438 -942 506
537 506 694 1074 872 1585 -679 404 -1073 -1448 -900 -2259 -589 -1048 -504 -103 145 -462 -98 -736 -1781
556a781Q33k107J574n54J22J196k17O23J36Qj285J093j835J155M8j29K017r23
574b6J516q2j24J66m91r37k33J24j037J850j134J332O35m10R73o79J2p33Q8j598
594g88J115j575N87R89j131K146j20j62L04k8n50J15m42K96L20k238K300o87K55
613G06J162j482J491o77j28n09R3q23Q69m13l76J347j523J280n81l35J05j049
631h43M11k62M1k61J656p54J257J78o06J122j541M37q34J69l74O51k85L95J308
650A865o16K033j220N03N3j215J57o31k46l11N58l15J660q48N10R44j485J171
668B567j681J98rp91J33L78K7r0J168j252J309r89k90M87j134O10o96M14j28L53
688E84m12M83k17n28P38j967Q38o17o00M90m2M25K48M27p99J272j406O55o08j068
$$ plain form
556 -1781 -948 -3055 -1481 -2035 -1913 -717 -934 -311 -175 -167 -1452 -359 -2194 -1039 -991 -1120 897 -26
574 -26 1490 1408 1284 1450 959 22 -211 -87 -1124 726 -408 924 1559 1149 2122 1443 1455 722 810 -788
594 -788 327 -1248 -661 328 -803 1343 1223 1061 1365 1337 787 902 460 756 1076 -1162 1138 451 706
613 706 1868 386 1877 1200 1072 563 656 -167 702 289 -87 1260 -263 1017 436 101 206 -843
631 -843 -432 -694 -653 -914 742 -12 1245 1423 817 1939 398 835 1 170 -204 447 162 557 1865
650 1865 1249 3282 2062 2565 2618 1403 1560 929 683 372 930 615 2275 1427 1937 2881 1396 2567
668 2567 886 1084 1075 284 417 795 822 732 1900 648 1957 968 678 1165 31 641 -55 359 231 584
688 584 172 655 438 -90 648 -1319 -481 -1098 -1698 -1208 -1250 -825 -577 -150 -949 323 -1083 -428 -1036 -2104
708b104R65j456J423k26O38P28P16j69M12K46j399J077j489N10j07j35J094l36
726C88Q63R0J039j100O27o82o3L94j330J113q13M21J0M69j50L45l71j29M65j570
746A6J086j244N37K73o21Q40m33J1p7N6r24L50l53p92R31j682J280j96L84K81
766b77l5N6m28j53q75Q16j473R28j66j33J129k62J165l20K65k77j45q10m4J06
786i33o84J409j054J287L36k01P54m69Q5j63J58j159J305j100O05O20p45J553
804A604p95L48J17m2l92j26k79J5Q61q00J107p06L21M31r03L98q43K49p46N90
824D09r73M02K24j15N87q16Q93p26l50m93j53k79K5K27k23P81n52Q17l6j18N77
845A08j118M99p06J72l40K91r1N38N43m46J076j221J092o55j4J56o49J2o7P49
$$ plain form
708 -2104 -1139 -2595 -1172 -1398 -760 -32 684 515 927 1173 -226 851 -638 -128 -235 -370 724 388
726 388 1251 1341 2380 1280 1907 1225 1162 1556 226 1339 526 947 957 1426 1276 1621 1250 1121 1586 16
746 16 1102 -142 395 668 47 887 454 465 388 444 -480 -130 -483 -1275 -344 -2026 -746 -942 -558 -277
766 -277 -312 -256 -684 -837 -1712 -896 -2369 -1441 -1607 -1740 -611 -873 292 -28 237 -40 -185 -995 -1039 -933
786 -933 -1617 -208 -1262 25 361 160 914 445 530 367 525 -634 671 -429 176 796 51 1604
804 1604 809 1157 1274 1232 840 714 435 450 1311 511 1618 912 1233 1664 761 1159 316 565 -181 409
824 409 -564 -162 62 -53 534 -282 611 -115 -465 -958 -1111 -1390 -1365 -1138 -1361 -580 -1132 -315 -351 -469 108
845 108 -1010 -511 -1217 -1045 -1385 -1094 -1185 -647 -104 -550 526 -695 397 -258 -272 -116 -765 -753 -820 -71
865g1o80J093n05O38K70r92Q08p56K26k44L83PJ95K96K18Q64r65Q90j061L15K1
886I50p19N28l50N35j30N63m36P47m62n18K00q99O00r94K46l9o5M01J02K27o20
907a33Q64j483P81m14m95K75l53P60n29O16k21Q26p47K71J14o11O29r67M83n11
927h45L97J09N28j7l11O60j183R97p75J86n5o63R39o47P50LM59l41K13J27k31
948C00K25r05P41n88N17M79J72O05n74O11o41N65q41M37l79R2L93j003J284m43
968A047K24j59k32nj28k07n90M82p64N83r9m00O65m58L05m48K50l69K53p70J75
989f45J19p63J122o85O65j49k4K36l21q9m72M78r71R22o72O58J56k23O28m85K64
1010b51l67L67n37J37J7l2Q07o31J004m43L70M5j70M67o76j35P5Q49j106Q01M8
$$ plain form
865 -71 -751 342 -163 475 745 -247 561 -195 31 -213 170 177 372 668 886 1750 785 1675 614 929 950
886 950 231 759 409 944 814 1377 941 1688 1226 708 908 9 609 -385 -139 -178 -243 158 260 487 -133
907 -133 731 -752 29 -385 -880 -605 -958 -198 -727 -111 -332 494 -253 18 132 -479 150 -817 -334 -845
927 -845 -448 -339 189 172 -139 521 -662 335 -440 -254 -309 -972 -33 -680 70 73 532 191 404 531 300
948 300 525 -380 361 -227 290 769 941 1546 972 1583 942 1507 666 1103 724 816 1209 206 1490 1047
968 1047 1271 1112 880 875 747 540 -50 432 -332 251 152 -248 417 -41 264 -184 66 -303 -50 -820 -645
989 -645 -526 -1289 -167 -852 -187 -336 -360 -124 -445 -534 -1006 -528 -1499 -577 -1249 -591 -435 -658 -30 -515 -251
1010 -251 -618 -251 -788 -651 -634 -666 141 -490 514 71 441 486 316 783 107 -28 47 896 -210 591 639
1031F39K47P06j068R59o67L70n35k77J64N5K9l07Q12q54Q99k81m01K86o84J72
1051B64l56J65n99O25o50M86M21p21R26j206N20l70k84j43k2j85K45J88l05Q40
1071a61q11M55N1n47O36p41K57l44K98N8O66k47o5M71o35R26r77M29j70ML13l95
1093e29M72Q3O37m86R85n49l56N10p91N71k01K72j39K28R5J66J53k03M32q69P33
1114A214p61j84L52n02O29k29L95k02L97p75L88l27m89M73q62O62o57M36j47J97
1134Hk7k70M57r33O56q20K29j77k10M00m25O52k15M26l86J69j46k02K78n73N62
1155e47o36N24L10qL07j42O4p5L61n02K46j48J82J18j82P70n33M39j55M85l24
1176E54P3n6o59Q27o00O08j91J70N65l92M85n97L52j037J10m72P83L26p56J473
$$ plain form
1031 639 886 1592 524 1483 816 1186 651 374 538 593 622 315 1127 273 1172 891 490 776 92 264
1051 264 -92 73 -526 99 -551 -65 356 -365 561 -645 -125 -495 -779 -922 -944 -1129 -884 -696 -1001 -161
1071 -161 -972 -517 -466 -1013 -377 -1118 -861 -1205 -907 -849 -183 -430 -495 -24 -659 267 -710 -281 -451 -447 -134 -529
1093 -529 -57 26 663 177 1162 613 257 767 -24 547 346 618 479 707 802 968 1121 918 1350 481 1214
1114 1214 453 269 621 119 748 519 914 712 1109 334 722 395 -94 379 -483 179 -478 -42 -189 8
1134 8 -19 -289 168 -765 -109 -929 -700 -877 -1087 -687 -1112 -460 -675 -249 -635 -466 -612 -814 -536 -1109 -547
1155 -547 -1183 -659 -349 -357 -50 -192 -128 -203 158 -344 -98 -246 -64 54 -128 642 109 548 393 878 554
1176 554 627 571 -88 739 139 747 556 726 1291 899 1384 787 1139 102 212 -260 523 849 93 1566
1196A566j542N04M9k1k20k27P4l27M02q06P60q97Q24j48j36K91o68K83m30N9j62
1217g72M02n81L0L04j36M30n25M59j88N4J21m72K41j21K13m60P67k95R8K27J6
1238a88L95l96K53l47K00l24L83J25J81J77k17P46k23m5j48n6j88j30M82l97N09
1259G92j3K02nn10P07p10K01m41J98q1j69L71j44L69n44Q65q58J57nm05J20n08
1281d11K35r3J50j76M51l78J48K08l77J42q43N32l27M4N8J01K43l90N25n89O04
1302a43n79p4J01l92Q12n44P38m18K87k67L69m4k76O06k13j57p3L99j3p3O28o02
1324G2M65j55L75k72K97k26l40M33o13M00m49J78Q56k35O8r4M07r46K59q31j39
1345d90O45o6N48m14J22l39K01o0m41P03p86L01p07M28L10M29j041P65o09m75
$$ plain form
1196 1566 24 528 577 556 336 109 183 -144 258 -548 212 -685 139 -9 -145 146 -522 -239 -669 -610 -772
1217 -772 -370 -951 -921 -617 -753 -323 -848 -389 -577 -523 -402 -874 -633 -754 -541 -1001 -234 -529 -431 -204 -188
1238 -188 207 -189 64 -283 -83 -407 -24 101 282 459 242 988 765 720 572 516 328 198 680 283 792
1259 792 779 981 976 466 1173 463 664 223 421 340 171 542 398 767 223 1088 230 387 382 -23 97 -411
1281 -411 -176 -269 -119 -295 156 -222 -74 134 -243 -101 -944 -412 -739 -695 -637 -536 -293 -683 -158 -747 -143
1302 -143 -722 -796 -695 -1087 -275 -819 -81 -499 -212 -479 -110 -154 -430 176 -37 -194 -267 132 119 46 674 72
1324 72 537 382 757 485 782 556 216 649 36 436 -13 165 1021 786 854 760 1167 221 480 -351 -490
1345 -490 155 89 637 223 345 6 207 147 -294 409 -377 -76 -783 -355 -45 384 -657 108 -501 -976
1365i76M05m39Q18j634J311J2M08k51r84L83N17k78J85J96l22P3L78l96M7K01
1385c46K90P6M13l13j63M22l60p4k91N07l22K90K92j99O14l80M19P4l90m18N42
1406F83m1m03N09p34O70n71P88j10k20M51m28J68k62j34m84N21m13R3J05j86R21
1427I23r54L38j42J40n40J12Kk89P01o57L66o07J47Q1K53m66l33O70o48L48k36
1448g91k15M00N78K06r46M51p56P90r54Q88p7k50j69j85J451l66Q7L00m67p0M6
1469d9J9n62N15N05j80k77Q3k30J20P89n04P01l69j10j00P5J06m64P03k54K53
1490G70m2r7k66k61K70k80Qk65N05k89K52p3j15K86n62K79l46J29l82l9M19k99
1512c98K12m42L23j58M18m5k90M7m65L44l29J26R0j83M16r9O6k17N28k62M1j36
$$ plain form
1365 -976 -571 -1010 -192 -1826 -515 -503 -95 -346 -1330 -947 -430 -708 -523 -327 -649 -576 -198 -594 -547 -346
1385 -346 -56 20 433 120 -43 379 19 -55 -346 161 -161 129 421 222 836 456 875 949 559 141 683
1406 683 642 239 748 14 684 113 901 791 571 1022 594 762 500 366 -118 403 -10 83 188 2 923
1427 923 -31 307 165 305 -235 -123 -121 -410 291 -366 0 -607 -460 -379 -126 -592 -925 -255 -903 -555 -791
1448 -791 -1006 -606 -28 178 -768 -317 -1073 -283 -1237 -349 -426 -676 -845 -1030 421 55 142 442 -25 -95 -49
1469 -49 -30 -592 -77 428 248 -29 54 -176 -56 733 229 930 561 451 351 426 532 68 771 517 770
1490 770 728 631 365 104 374 94 102 -163 342 53 305 232 117 403 -159 120 -226 -97 -479 -518 -99 -398
1512 -398 -186 -628 -305 -463 -45 -90 -380 -333 -798 -454 -783 -657 -567 -750 -334 -433 -367 -584 -56 -318 -277 -413
1534d13k69M38n14O08p0K90l66L36K7P6N1j82K12l78L23m5R9K6J13K30k87J19
1556D24k4k0L8l20M97j68K77n87N06j81j89K03k38K41l63M29n52M52m00kO6o8
1578B1J48j70K52j30k41j91N4j74J0L69n54O31m55N57k60j82N9k03K23n94L87
1599d43l15M04l47L18J14k02N92l21j23j37M13l43M9J20m7K50j84L05rJ67R3p9
1621B75j18j2J29j43M35n02L55K54M5k03o7Q2j88K41l44J09kr4J17k10N59j30
1643E88l22J31k49J92m79L96k37P2j30K75r3k22M20p05M05k58l2j70J27J14k23
1664d00jn6N47m71L4j09j03J31n0k4j98L50l97L67Q7J02k9k34N10m97J48j36K08
1687b21j2p9L42q8L27m17P44n67L86k59J7J74k93K37j38M01k20M3J87N1P0l23
$$ plain form
1534 -413 -682 -244 -758 -150 -220 70 -296 40 67 143 194 12 224 -154 169 124 223 249 362 592 305 424
1556 424 400 380 418 98 595 427 704 117 623 442 253 456 218 459 96 525 -27 425 25 23 89 21
1578 21 169 -1 251 121 -120 -311 -257 -431 -421 -52 -606 25 -430 127 -133 -315 -256 -459 -236 -830 -443
1599 -443 -758 -354 -701 -383 -269 -471 121 -200 -323 -460 -47 -390 -341 -221 -268 -18 -202 103 94 261 354 275
1621 275 157 145 274 131 566 64 419 673 718 515 448 530 342 583 239 348 346 252 369 159 718 588
1643 588 266 397 148 340 -139 257 20 92 -38 237 144 -78 342 -363 42 -216 -248 -418 -291 -177 -400
1664 -400 -401 -457 90 -381 -347 -456 -559 -428 -478 -502 -700 -350 -747 -380 -293 -191 -220 -454 56 -441 -293 -429 -221
1687 -221 -233 -312 30 -58 269 -148 596 29 415 156 173 347 54 291 153 554 334 377 564 615 685 362
1709C62L95m58N8N0O8l11M5K06l4r2J7M9k33p4J46p89O70O3M3R8k57k96k54M55
1733g3q2o4m86O06l13L46N4n97M63o12O21l75M38p15qJ32K67Q24q17n7p7O76q39
1756f88O07j81m7K22m23Q70p25J82O76r64N53J17r18J110l76K14M53n53m25J33
1776a63J62M95m86j64K56K73j29o8J42L97k45Kp46M72o8J56n38P05j04l21J65
1797A93K64l17M8n44N48L31p67N64p76j10O75o23O95l09m43M86k23l98L02P36
1817C32o50L25n79M50n34K23JQ5J94l45N0L21o2l51N78l53M03P6m58L43o2J43
1839A30j90j7J73p8N13l91K98k78J20j52M47j21j93K63l65J35NP6O0j94K58O8
1861E67mo11N75j86J54r95N86J93K69j62k64m2Q9M48qk53o31P82J72q3K5j316
$$ plain form
1709 362 757 299 357 407 475 164 209 415 381 289 306 355 122 48 194 -595 75 138 181 279 22 -274 -528 -73
1733 -73 -155 -219 -705 -99 -412 -66 -12 -609 -146 -758 -137 -512 -74 -789 -797 -665 -398 426 -391 -448 -525 151 -688
1756 -688 -81 -262 -309 -87 -510 360 -365 -183 493 -471 82 199 -719 391 15 229 682 129 -296 -163
1776 -163 -1 494 8 -156 100 373 244 176 318 715 470 472 -274 198 130 286 -252 453 349 28 193
1797 193 457 140 188 -356 192 523 -244 320 -456 -566 109 -514 181 -128 -571 -85 -308 -706 -404 332
1817 332 -318 7 -572 -122 -656 -433 -432 -347 -153 -498 -448 -127 -189 -540 38 -315 88 164 -294 49 -13 130
1839 130 -60 -77 96 18 531 140 438 160 280 128 575 454 261 524 159 294 299 375 435 241 499 567
1861 567 563 -48 527 341 495 -500 86 279 548 386 122 80 169 617 609 356 -275 507 679 596 621 -695
1883f95p7R07k78k71j04N13j66j44m70J87M54K72n58M43m6l72m85M8Q11L55q89
1904e65L54k47O77J26m08J44k12j4M82o61l92L79M4l5K87M28K17m05L22m55M11
1925D77k65q0R4k12K54j51L64l55L66k36q3M52m15J54j37K5j52J25q2j7J32k53
1947EK06m52K79m15N03q4j53N0j79J15K20L8l60L31l00n5L20m03J64k49K75k32
1969c76j4K47j18J75m59L94k82L84k65K3M34k06J22k30k5K23N9q1j75K10k5K79
1991B94l88Q7nN5k5Q9N54n37K78k74N09m03P3Q6m19M84k42l0J33J26J7j60J92
2014D94j02kl75M8j80M29j81l7J98n12N01k42J30m22K97k51jj19J67L86k57j58
2036a89r2K21j41J38J09k41m3M9ok68J72P1l47N29k99K45k74J09Q7j48q4K48j4
$$ plain form
1883 -695 -772 135 -143 -414 -518 -5 -171 -315 -785 -598 -144 128 -430 13 -33 -405 -890 -842 -31 324 -565
1904 -565 -211 -458 219 345 -63 81 -131 -145 337 -324 -716 -337 -293 -328 -41 387 604 199 521 66 477
1925 477 212 132 226 14 268 117 481 126 492 256 173 625 210 364 227 252 100 225 143 126 258 5
1947 5 211 -241 38 -377 126 42 -111 -61 -240 -125 95 133 -227 104 -196 -251 69 -334 -170 -419 -144 -376
1969 -376 -390 -143 -261 -86 -545 -151 -433 -49 -314 -291 143 -63 59 -171 -196 27 86 5 -170 40 15 294
1991 294 -94 -7 -12 43 18 107 661 124 402 128 637 234 307 393 -26 458 216 186 319 445 462 302 494
2014 494 392 390 15 63 -117 312 131 94 292 -220 281 39 169 -253 44 -207 -208 -327 -160 226 -31 -189
2036 -189 -281 -60 -201 -63 46 -195 -238 -189 -195 -463 -291 -220 -567 -38 -337 -92 -366 -257 -170 -318 -402 -154 -168
2059a68j32K51j83J60j7J9M68m26K22k01K03j65N3J55p9K96j80j06JK03k37n5
2081H2L21l62K14j31K2k4K62n5j36J02n6j2j49K60k70J74q1l1K01k32M0j51k8
2104d0m8j06J23Q5o5k79L69j06j49p2P4M5k89L36j04l0j70J05L8n8J24rK71l79
2128c34J43l6P8J44l05J67l58L46r9Q9p2K71J42j14k58J66L60l71K17J5L5Q4q5
2151B25K06k84K72l54K39k40k89N59l15K26j02j5J16K12l49k7L21m40J61J78j50
2172A50j12o7k17J41K83k10l1k0j63K46o1k35J63J5P8o6l79K22j21l09O60l93
2194d26j94N44R7k65J82j8N0k05l06N82p58L25p69J101l12L48J67l90j06K71N2
2215c0J45J69p30L92J6J050r93P7J038j087k44L96k59P05r5m22l36Q18N9j25j64
$$ plain form
2059 -168 -300 -49 -232 -72 -89 -70 398 -28 194 -7 196 31 84 239 160 456 276 170 171 374 137 82
2081 82 403 41 255 124 146 122 384 329 193 295 239 227 78 338 68 242 161 130 331 99 139 -12 -40
2104 -40 -88 -194 -71 14 -51 -330 39 -67 -216 -288 -214 -169 -458 -122 -226 -256 -426 -321 -283 -341 -217 -226 45 -334
2128 -334 -191 -227 -149 -5 -310 -143 -501 -155 -254 -165 -237 34 176 62 -196 -30 330 -41 176 191 226 310 225
2151 225 431 147 419 65 304 64 -225 334 19 245 143 128 244 456 107 80 401 -39 122 300 150
2172 150 38 -29 -246 -105 178 -32 -63 -83 -246 0 -61 -296 -133 -118 -40 -106 -485 -263 -384 -693 -33 -426
2194 -426 -620 -76 21 -244 -62 -80 -30 -235 -541 41 -717 -392 -1161 -60 -372 -24 143 -247 -353 -82 -30
2215 -30 115 284 -446 -54 -38 1012 19 96 1134 47 -197 199 -60 645 550 128 -208 610 669 544 380
2236C80q4m5k91P99n44J34j46l11J56j06L21o09N08l76Q8k05p3Q44r64K11J78
2257a35j0j9J41j43J3l3M1j55K14K10n18N53j48k23M2J18n0j94L57k45J46J8P4
2280E4ml57L50k73r0K82r9j8J46J44k08K78k43O1J22k29L45k72K85l17N24l73
2302A08Kk04K02K57m17L62m00K16k68P4K47l26M43j51J59M7j97L0l40J25k0M48
2324C97m37K43j22o0j61r0J53j16K49o03M45j9k20L00k14J49l31M80l91L99k62
2345b11p9J33l43N62n39L74k36L03Mr9k9n9K01l41M27k68J36R4K9j99J41J00p0
2368C1O5P1j04j04J42j91J60J45k5J15j31k01K19K99j78k16K64l27K04pk35J85
2390A81j41K54j12r8K07l16J0K3j13J30j0O2p1j67N4P9k44K10j17K89l08J34q2
$$ plain form
2236 380 296 251 -40 759 215 349 203 -108 48 -58 263 -346 162 -214 -126 -331 -404 440 -524 -313 -135
2257 -135 -145 -164 -23 -166 -153 -186 -145 -300 -86 124 -394 159 11 -212 -170 -52 -102 -296 61 -184 -38 -20 54
2280 54 50 -307 43 -230 -320 -38 -137 -155 -9 135 -73 205 -38 23 145 -84 261 -11 274 -43 481 108
2302 108 110 -94 108 365 -52 310 -90 126 -142 -68 179 -147 296 145 304 351 154 184 -156 -31 -51 397
2324 397 -40 203 81 21 -140 -230 -77 -193 56 -547 -102 -121 -341 -41 -255 -106 -437 43 -348 51 -211
2345 -211 -290 -157 -500 62 -477 -103 -339 -36 -32 -131 -160 -219 -18 -359 68 -200 -64 30 59 -140 1 101 31
2368 31 96 167 63 -41 101 -90 70 215 190 305 174 -27 192 491 313 97 361 34 238 231 -4 181
2390 181 40 294 182 84 291 -25 -15 8 -105 25 15 77 6 -161 -107 -28 -272 -62 -179 110 -198 -64 -146
2413a46J97j99r3J29m1J02j91J30o0Q0Q2k19J98r0J8On8j74J03L44k23J35Q3m2
2437G1k57K64r0j7J11k12M83k89J55k47L33O8k84J73k3p6K00j76p3O4J05r5J83
2460C71m48K3O2K58k49R4N9j00R2k67M16l27N9j53K65k82q8K18N3k86K04o3r3
2483a82j0R6n3P6K5l3q8M1K3k12L93k33L3k24J87j92L1J65Q4k19N01j97K6j3J05
2508A30J0Kl85L35O2L0l90M82m48L10K7j66J4m0L67l33J06j81K74O1KN3k54J54
2532B22l9k64J11R0K17l77J5M4O6k67N44k30j08J68j20J35l32P9J26l43K43n2
2554g2m9K03J79m91K46J43l24n3L8O1J0j97P0N9n8J15R5O1m0m50L73O9k07J21
2578i8k8J1j11J70j37L94l82K20j81K54k43j11L06j68K73k5j45J10J3J28j20j12
$$ plain form
2413 -146 51 -148 -241 -112 -153 -51 -242 -112 -172 -92 -10 -229 -31 -121 -103 -97 -155 -329 -226 118 -105 30 113 71
2437 71 -186 78 -12 -29 82 -130 353 64 219 -28 305 373 89 262 239 163 363 187 114 178 283 188 371
2460 371 -77 -54 8 266 17 111 170 70 162 -105 311 -16 43 -110 155 -127 -215 3 56 -230 -26 -89 -182
2483 -182 -192 -96 -149 -73 -48 -81 -169 -128 -105 -317 76 -157 -124 -348 -161 -353 -322 -157 -73 -292 209 12 38 25 130
2508 130 140 142 -243 92 154 184 -206 276 -172 138 165 -1 13 -27 340 7 113 -68 206 267 269 322 68 222
2532 222 183 -81 30 120 337 -40 -25 19 85 -182 362 132 24 192 72 207 -125 -46 80 -263 -20 -72
2554 -72 -121 82 261 -230 16 159 -165 -218 -180 -119 -109 -306 -236 -177 -235 -120 -25 36 -4 -454 -81 -12 -219 -98
2578 -98 -126 -115 -226 -56 -193 201 -181 39 -142 112 -131 -242 64 -104 169 144 -1 109 122 250 130 18
2600A8n9J43K12m66L89k42K01l4M9j83n2L83l07K92l65K47o4k12J26N6p2L7L8
2623A35j38K90m03j9K24j88J16j66K85k87M5J19O8j77m6Q3k5j30J57J48k99J33
2645g5Pk47k4j43J29K76rP2j10pj52K87k75L38k9j0K7j16K67k08J12l2J08k37
2669e1J55k62K42j8J4K1J98o7j90l8L5p2K68k03J96l1j55O0m6m9K0N8j19J33j47
2694d8J60l8J25k91R2j72J21po5j21RK27l4rK61k11j10L54l71N0q1j01R1J57l4
2719d6q3n6jL21l14J1k02O16k3j9k26J29k49L6J6k63P14Q8n83o4K22M29k84%j68
2744AJ93k35J76n0p1L0k0K92j25P0k38J18K14m79J67j0J61n2L2N1k77K28M9l04
2768g9m3NJ48K1J08j58O5J5J5k36Q6mkl8j07K08k90L53k5l44J11K4J15K10k94
$$ plain form
2600 18 -41 102 314 -152 237 -5 196 162 211 28 -24 359 52 344 -21 226 162 -50 76 132 60 97 135
2623 135 -3 287 -116 -135 89 -99 17 -149 136 -151 -106 13 81 -96 -142 -59 -84 -214 -57 91 -208 -75
2645 -75 -68 -315 -339 -482 -353 -77 -86 -14 -124 -131 -283 4 -271 67 38 28 55 -61 206 -2 110 78 186 -51
2669 -51 104 -158 84 66 80 101 299 232 42 4 39 -33 235 32 228 197 42 102 56 7 27 85 -34 99 -48
2694 -48 112 74 199 -92 0 -172 -51 -58 -123 -244 -235 -8 -42 -51 210 -1 -111 243 -128 -78 -159 -260 -169 -12 -46
2719 -46 -129 -185 -186 135 -179 -168 -370 246 223 204 -22 107 -142 -106 -90 -353 361 449 -134 -198 24 453 169 169 1
2744 1 194 -41 135 85 14 44 24 316 191 261 23 141 355 -124 43 33 194 142 174 225 -52 176 225 -79
2768 -79 -122 -117 31 52 160 2 67 82 97 -139 -53 -57 -59 -97 -204 4 -286 67 42 -302 -191 -167 -52 158 -136
2793a36k0J75j76J76j85m4K25j89J72k32K86p5l2J15K45j55j52R1m0k04K02J29
2815A76k13K08o1k7o8P4J30j3r3l78K84K65l78K70j87L23q1k0j76J13j61pJ76
2838A56k13J28j2j96R7M5J34l52M09j9j54No4P2k20J67j2l6P0J25k21p7Q6M4n3
2863i1L7J8O2O8l19J57m8j05%k8P2K03j93J90j5Ml55L80n3J00r9O8Jk96J97J63
2889A18l13K34k3j75L01m5r3J94k85L50m5j00j9j02m8K52o2j58J22J07j1L9J73
2912D11l83J30m2l32K53j89K8L76k58k61R1L4K94q3k26k29L85j02P0k34L41m05
2934c31K84J64j83j5l78L24R0J6o0J5j27J12K16j82k4q0L53q7k34K60l24Q3O0
2957d8J88j58m1p5K76n3k4m6j69L30j66O9L2j80J43m4M1m0q1N76m82n4p7O4JK52
$$ plain form
2793 -136 -156 19 -157 19 -166 -210 15 -174 -2 -234 52 -23 -55 60 305 150 -2 89 49 -155 47 176
2815 176 -37 171 110 83 15 89 219 206 113 -265 19 284 -94 176 -11 312 231 211 35 148 -13 -20 156
2838 156 -57 71 59 -137 -40 5 139 -213 196 177 23 28 -36 36 -184 -17 -29 -65 5 130 -91 -168 -82 -38 -91
2863 -91 -54 -36 26 94 -225 -68 -116 -221 -221 -249 -177 26 -167 23 8 12 -343 37 -16 84 -15 53 54 -242 -45 118
2889 118 -195 39 16 -159 142 97 4 198 -87 263 218 118 99 -3 -51 201 139 -19 103 210 199 238 411
2912 411 28 158 116 -216 37 -152 -124 252 -6 -267 -176 -142 152 69 -157 -386 -1 -103 -33 -267 74 -331
2934 -331 -47 117 -66 -81 -459 -135 -45 -29 -89 -74 -201 -89 127 -55 -79 -159 194 107 -127 133 -191 -108 -48
2957 -48 140 -18 -59 -134 142 89 65 19 -150 180 14 83 115 -65 78 34 75 35 -46 530 48 -6 -83 -19 -18 234
2983B34k84K36j50J20j1j56K05j33K65m01J79j14j00Q7J17j60K80m25Q5J54J70
3004A98j85p4O5ok55K44m8Q3Q%J79j50j29q3P3M8P0o0km8p2P9p7K33l51M9RL76
3032A74j97RQk06J35RK71l25K6K38j12j14N8K63m1M4l18L10M2j20P7n4k53L32
3056B56k53r6K14j30K14k36r1K67m1k22Q7Q3n7J29j28M3NJ76j17o3k01k8J14j73
3080b48J27K3Q4l90L07O3J03r8j22K63j41J32k59L30k79Rq7K4l9J4j16K87k06
3103b19J56J08o7k6J16j68j6M1M73l68K10k56KM84m44O4N2j50R8k27J76L32l31
3126D0N8K19q4n0J26k28l0j32M21l21J8O7O9O8l27J08N4k58K02L14l00O1j86k6
3150a17J09j11Q3K8n6J8p6m1k01K63J35k79P9j2KJ10k0j86J31J46j97K22j38Q
$$ plain form
2983 234 -50 186 36 156 145 -11 194 61 326 -75 104 -10 -110 -23 94 -66 214 -211 -126 28 198
3004 198 13 -61 4 -2 -257 -13 -61 22 30 30 209 59 -70 -153 -80 -32 38 -22 -24 -72 -144 -65 -142 91 -260 -211 -202 174
3032 174 -23 -14 -6 -212 -77 -68 203 -122 -96 142 30 -84 -26 237 196 240 -78 232 274 154 231 177 -76 256
3056 256 3 -93 121 -9 205 -31 -122 145 104 -118 -31 52 -5 124 -4 39 44 220 103 40 -161 -189 -75 -248
3080 -248 -121 -98 -14 -404 -97 -34 69 -29 -151 112 -29 103 -156 174 -105 -96 -183 -159 -198 -184 -300 -13 -219
3103 -219 -63 45 -22 -48 68 -100 -116 -75 398 30 240 -16 -14 470 26 90 142 -8 90 -137 39 371 40
3126 40 98 317 233 183 309 81 51 -81 340 19 37 104 173 241 -86 22 76 -182 20 334 34 95 -91 -117
3150 -117 -8 -119 -36 -8 -64 -46 -122 -163 -364 -101 34 -245 -166 -178 -176 -66 -86 -272 -141 5 -192 30 -108 -100
3174a00p6J65l00J14J08j20K12r4J06r3j4p0J10K82j01o5j61R1K4J69q1j63J70
3197A13J61k27j15K21l51K42M3J23j25j59J07R2l39K77l57M40r5Q9j13p6R3J35
3219A79m63K58q3M1M21o96K61J9pl33M35k29L81k36p9j5J79k9j96L30j60k08M16
3242A86m57K14k46J71m3K36k00Kk49L21L60j36K22o06J97k32o0Q81k40K5L65m83
3264B28M91l58j03n28M25Q4k59J91j01J5J5j5o2J39k4L1M3k46N3J23n4Mj01j50
3288a59J54j78L44k93K71n6K8j71m0L22m11K09q3o8J1J44K52l30O2P9j08j62K30
3311D7j0n02K39Q5J99l25K11n6N9%J63j26j59K72R6k89L62j84k55Q1J5L78j83
3334A18J66M6n29N02l46k84M54J58o95L83L10k59j85P60o84N8K56k71J54O21n75
$$ plain form
3174 -100 -176 -11 -311 -197 -89 -209 3 -91 15 -78 -92 -162 -52 230 129 64 -97 -6 18 187 106 -57 113
3197 113 274 47 -68 153 -198 44 87 210 85 -74 33 125 -214 63 -294 146 51 140 27 -49 44 179
3219 179 -284 -26 -109 -68 353 -343 -82 -63 -70 -403 32 -197 184 -52 -131 -146 33 4 -192 138 -22 -230 186
3242 186 -271 -57 -303 -132 -175 61 -139 -137 -386 -65 295 159 381 -225 -28 -260 -320 561 321 346 711 228
3264 228 719 361 258 -270 155 239 -20 171 70 85 100 85 23 162 138 169 212 -34 19 142 88 92 -9 -159
3288 -159 -5 -183 161 -132 139 83 111 -60 -100 222 -189 20 -63 -131 -120 24 276 -54 8 87 -21 -183 47
3311 47 37 -465 -226 -141 58 -267 -56 -112 -53 -53 110 -16 -175 97 193 -96 266 82 -173 -92 -77 301 118
3334 118 284 330 -199 303 -43 -327 127 285 -410 -27 283 24 -161 599 -85 -27 229 -42 112 733 158
3355A58l72K70n90L04L58k0J73K5l81J57L50k85j42J88j20l40M42O0l85M74n71
3376b47k8M76j93Lj35K87m71N6J31j33q3K02K3P8J04J54l09l23L78l22J79r5K05
3399f3M4m0O9j78j16L12j44j1M5L87j19j46J24N2j71L07J50l67L05l63M16o74
3421a81N80o68K65L40p4m42K73m12L17O78m63P42n25n65Q23p0p54p8M74n75P21
3442D06k21l52K81k99J96K8R5j30%l1l6J85l42nK67m55L02m3M60n33K3J019o41
3465A74k54MN9J9kk12L46k67K85j84j87P1K27P8k74M8J44J87k69J41q1K4K15k92
3489@L2K1K01l38q4L68k00N1j72J67K22j62qN4j11m8j57K11j59K76j98N13m80
3512aJ74n1J28k55K19r1k85K94j64J13j68M4K1j98j7M1K22j65o4P0M3N3PJ63l56
$$ plain form
3355 158 -214 56 -534 -230 128 108 281 306 -75 82 432 147 5 193 73 -267 175 235 -150 324 -247
3376 -247 -275 201 8 11 -124 163 -308 -252 -121 -254 -337 -135 -112 -34 70 224 -85 -408 -30 -352 -173 -268 -63
3399 -63 -19 -59 10 -168 -284 28 -116 -127 -82 305 186 40 164 216 45 352 502 135 440 77 493 -181
3421 -181 399 -269 -4 336 262 -180 93 -319 -2 676 213 955 430 -135 688 618 -136 -214 260 -315 406
3442 406 185 -167 114 -185 11 39 134 4 4 -27 -63 122 -220 -225 42 -413 -111 -154 306 -227 -204 815 174
3465 174 -80 -76 -17 2 0 -212 134 -133 152 -32 -219 -148 79 157 -117 -69 75 262 -7 134 53 77 292 0
3489 0 32 53 254 -84 -168 200 0 51 -121 46 268 106 98 152 41 -7 -164 47 -112 164 -34 479 -1
3512 -1 173 122 250 -5 214 123 -162 132 -32 81 -87 -43 -22 -220 -237 -196 26 -139 -203 -133 -90 -37 -30 133 -223
3537b23J0Q2J75j58K78l7l64K02M4n9J69J06M2k44J48l91J3l9L88j76N8n3L40
3560C11k57j26L51j63r0r4J76k0L8l38L15j32J14J62l23K64l13M7p9L63r6K10
3582C20m79M19k9q9j85j39N2l17O44o54M11l08N09l11N48o75J85J66l72j73M90
3603A3K56m15O25p73M76k00Nl24P0O29k99o70Q87k45j09j91L72m06K80J63l09
3624a65K47q80L09K51J35K24k11k01L44k61K91J29k32L64m03J68l45L06j1L33
3644C92l37L5j18r7J45L2Q9j1j39J49J13j93J62Oj87l7M8j8j43K61k18n9K59k4
3668A10k17K36k66K80j99J22k36J01J1K46j98k44J31j58M35k74K87j17j8O9m23
3689c22J66K60j72K28k5l4k21j02K55j14N3J54k71j2O0Q5K87l65J59J24l61J40
$$ plain form
3537 -223 -213 -131 44 -114 164 127 -237 -35 9 -50 119 225 267 23 171 -220 -207 -246 142 -34 24 -29 311
3560 311 54 -72 279 116 26 -68 108 88 126 -212 103 -29 85 247 -76 188 -125 -78 -157 206 110 320
3582 320 -159 260 231 142 -43 -182 -130 -447 197 -457 -46 -354 155 -156 392 -283 -98 68 -304 -477 13
3603 13 269 -146 479 -294 182 -18 -13 -337 -267 362 63 -607 280 35 -74 -265 107 -299 -19 144 -165
3624 -165 82 -798 -489 -238 -103 121 -90 -291 53 -208 83 212 -20 344 -59 109 -236 70 59 392
3644 392 55 90 -28 -125 20 52 141 130 -9 140 253 60 222 228 41 4 52 34 -109 152 -66 -125 134 110
3668 110 -107 129 -137 143 -56 66 -170 -69 -58 188 -10 -254 -123 -281 154 -120 167 50 32 101 -322
3689 -322 -156 104 -68 160 135 101 -120 -222 33 -81 -28 126 -145 -157 -97 -12 275 -90 69 193 -168 -28
3711b8j50L17J04l48J57j68J00n9K40j12QK49j6k17O3j26M2J80k5k13l8jO6J61
3735A86L3k10J10j04R2m1J06l24K19j75j3J51q6p1q2L70l0j09j19k97L72j2N8
3758B4J10k25J21k29N6J0R3Q6k17K63j37kK81l35LJ83l45K61p4K59k91K23n65
3781d47L76j93L48L65L03p29J0M82p23J009q08K68k71L52m90K18K0M28j44l42
3801C2M08K07l26o00L75M79l42l35J52o30M86J67K9J1k17L28l36N6j8R4k2k26
3823b28L33k00Q2Q7j10j53J09J20%J26j59%M5J42k39o8k3n0L22k22M5nO5r4J0
3848f5Mn7J53j91K77n2p9J11k91J90n9K11j10j4L43m16J97j13J17Q8j26k05R8
3871A1O5j83J49r5K21N4L3k50K41l64L98m12J7P4q6R0J06n1J03j68K39l09K30
$$ plain form
3711 -28 -178 139 243 -105 52 -116 -16 -75 165 53 61 310 294 77 140 14 56 236 211 -2 -40 -41 25 186
3735 186 219 9 119 15 107 66 172 -152 67 -108 -121 30 -56 -127 -209 161 131 22 -97 -394 -22 -34 24
3758 24 134 -91 30 -199 -143 -133 -40 46 -171 92 -45 -47 234 -101 -98 85 -260 1 -73 186 -105 118 -447
3781 -447 -71 -264 84 449 752 23 33 515 -208 801 -7 261 -10 342 -148 70 90 518 374 32
3801 32 440 647 321 -279 96 575 233 -102 50 -580 -94 73 102 113 -104 224 -112 -56 -74 20 -2 -228
3823 -228 105 -95 -13 74 -36 -189 -80 40 40 166 7 7 52 194 -45 -113 -136 -186 136 -86 -41 -46 19 -75 -65
3848 -65 -61 -118 35 -156 121 69 -10 101 -190 0 -59 152 42 28 371 -45 152 39 156 244 118 -87 11
3871 11 76 -107 42 -53 168 222 255 5 246 -118 280 -132 -115 -41 -127 -37 69 18 121 -47 192 -117 113
3894A13k16O8k9R5k4r2J11nq9m2m9O4P2j19M21l65R3k42K53nj86P1j04K37R4k55
3920a30K64j53l4J23l61J03J68j70K20j02M4K34j29n6j10K00n7r1J00J80m4j16
3942H3J3Q7k78K5K28j57J37r4k5j07M2K58p4j72o0L5M7j78j34K87K31k52J15P9
3966A36k33M4j18Q9K11l29J53J5n4J13m3J73l47K17j66M6O9j22K69k02J28M7j8
3989G8j37j37K4j74J59J62j07O4j56j33N27k3l61M20L5p29l9Q40l07n75J004n08
4011g3j52K39j98L04k28J64R0l9K1j31Q2%j07J19q9q8p8J48j14P4K86k73J64p9
4035D2j24l2N4l2jN1J70Mj79L5j12Q7j81K43K4o8O0j30mM4j8J52j75K24k24J20
$$ plain form
3894 113 -103 -35 -64 31 7 -85 26 21 -68 -110 -159 -95 -23 -142 279 -86 7 -235 18 13 -173 -102 -206 31 125 -130
3920 -130 134 -19 -53 70 -291 -188 -20 -190 30 -72 -28 206 77 21 -89 111 54 -37 63 243 199 83
3942 83 96 183 -95 -70 158 1 138 44 19 -88 -46 212 138 -34 -94 -59 -12 -190 -324 -37 194 -58 57 136
3966 136 -97 -53 -171 -82 129 -200 -47 -32 -86 27 -16 157 -190 27 -139 -93 -24 -146 123 -79 49 96 78
3989 78 -59 -196 -172 -346 -187 -25 -132 -68 -224 -357 170 147 -214 206 241 -488 -527 313 6 -569 435 -73
4011 -73 -225 14 -184 120 -108 56 146 107 128 -3 79 79 -28 91 2 -86 -164 -16 -130 -56 230 -43 121 42
4035 42 -82 -114 -60 -92 -93 -42 128 132 -47 -12 -124 -37 -218 25 49 -19 41 -89 -93 -49 -67 85 -90 134 -90 30
$$ [...]
8191H
##END NTUPLES=NMR FID
##END=
