##TITLE=1H_K-317/1
 CDCl3,40 sc, 
 2.02.2021
##JCAMPDX= 6.0         $$ Bruker NMR JCAMP-DX V2.0
##DATA TYPE= NMR FID
##DATA CLASS= NTUPLES
##ORIGIN= UXNMR, Bruker Analytische Messtechnik GmbH
##OWNER= root
$$ XWIN-NMR		Version 3.5
$$ Tue Feb  2 10:42:20 2021 Russian Standard Time (UT+4h)  she@DPX200
##.OBSERVE FREQUENCY= 200.1315066352
##.OBSERVE NUCLEUS= ^1H
##.DELAY= (6, 6)
##.ACQUISITION MODE= SIMULTANEOUS
##.ACQUISITION SCHEME= undefined
##.AVERAGES= 40
##.DIGITISER RES= 18
##SPECTROMETER/DATA SYSTEM= spect
##.PULSE SEQUENCE= zg30
##.SOLVENT NAME= CDCl3
##.SHIFT REFERENCE= (INTERNAL, CDCl3, 0, 15.7039)
##AUDIT TRAIL= $$ (NUMBER, WHEN, WHO, WHERE, WHAT)
$$ ##TITLE= Audit trail, XWIN-NMR		Version 3.5
$$ ##JCAMPDX= 5.01
$$ ##ORIGIN= Bruker BioSpin GmbH
$$ ##OWNER= she
$$ F:/spectra/data/she/nmr/H-F/1/audita.txt
$$ ##AUDIT TRAIL=  $$ (NUMBER, WHEN, WHO, WHERE, WHAT)
(   1,<2021-02-02 10:40:33.50 +0400>,<she>,<DPX200>,
      <continue with go, POWCHK disabled, PULCHK disabled
       configuration hash MD5:
       00 E9 B6 7A A2 85 ED C7 34 08 36 98 17 FE 4E 26
       data hash MD5: 16K
       21 0A 2B 3B FC C9 99 D4 E8 15 A2 1D FD C9 59 79>)
$$ ##END=
$$ 
$$ hash MD5
$$ BE FB C1 AA B1 53 50 77 D9 7E 50 8D 56 ED B1 7E
##$RELAX= 
##$RELAX= 
##$RELAX= 
##$RELAX= 
##$RELAX= 
##$RELAX= 
$$ Bruker specific parameters
$$ --------------------------
##$DU= <F:/spectra>
##$EXPNO= 1
##$NAME= <H-F>
##$PROCNO= 1
##$TYPE= <nmr>
##$USER= <she>
##$AMP= (0..31)
100 100 100 100 100 100 100 100 100 100 100 100 100 100 100 100 100 100 
100 100 100 100 100 100 100 100 100 100 100 100 100 100 
##$AQSEQ= 0
##$AQ_mod= 1
##$AUNM= <au_zg>
##$AUTOPOS= <>
##$BF1= 200.13
##$BF2= 200.13
##$BF3= 200.13
##$BF4= 200.13
##$BF5= 200.13
##$BF6= 200.13
##$BF7= 200.13
##$BF8= 200.13
##$BYTORDA= 1
##$CFDGTYP= 0
##$CFRGTYP= 5
##$CHEMSTR= <none>
##$CNST= (0..31)
1 1 145 1 1 1 1 1 1 1 1 1 1 1 1 1 1 1 1 1 1 1 1 1 1 1 1 1 1 1 1 1 
##$CPDPRG= <>
##$CPDPRG1= <>
##$CPDPRG2= <>
##$CPDPRG3= <>
##$CPDPRG4= <mlev>
##$CPDPRG5= <mlev>
##$CPDPRG6= <mlev>
##$CPDPRG7= <mlev>
##$CPDPRG8= <mlev>
##$CPDPRGB= <>
##$CPDPRGT= <>
##$D= (0..31)
0 1.2 0 0 0 0 0 0 0 0.06 0 0.03 0 0 0 0 0.0002 0 0 0 0 0 0 0 0 0 0 0 0 
0 0 0 
##$DATE= 1612247850
##$DBL= (0..7)
120 120 120 120 120 120 120 120 
##$DBP= (0..7)
150 150 150 150 150 150 150 150 
##$DBP07= 0
##$DBPNAM0= <>
##$DBPNAM1= <>
##$DBPNAM2= <>
##$DBPNAM3= <>
##$DBPNAM4= <>
##$DBPNAM5= <>
##$DBPNAM6= <>
##$DBPNAM7= <>
##$DBPOAL= (0..7)
0.5 0.5 0.5 0.5 0.5 0.5 0.5 0.5 
##$DBPOFFS= (0..7)
0 0 0 0 0 0 0 0 
##$DE= 6
##$DECBNUC= <off>
##$DECIM= 32
##$DECNUC= <off>
##$DECSTAT= 4
##$DIGMOD= 1
##$DIGTYP= 9
##$DL= (0..7)
0 120 120 120 120 120 120 120 
##$DP= (0..7)
150 150 150 150 150 150 150 150 
##$DP07= 0
##$DPNAME0= <>
##$DPNAME1= <>
##$DPNAME2= <>
##$DPNAME3= <>
##$DPNAME4= <>
##$DPNAME5= <>
##$DPNAME6= <>
##$DPNAME7= <>
##$DPOAL= (0..7)
0.5 0.5 0.5 0.5 0.5 0.5 0.5 0.5 
##$DPOFFS= (0..7)
0 0 0 0 0 0 0 0 
##$DQDMODE= 0
##$DR= 18
##$DS= 0
##$DSLIST= <SSSSSSSSSSSSSSS>
$$ [...]
##$SUBNAM2= <"">
##$SUBNAM3= <"">
##$SUBNAM4= <"">
##$SUBNAM5= <"">
##$SUBNAM6= <"">
##$SUBNAM7= <"">
##$SUBNAM8= <"">
##$SUBNAM9= <"">
##$SW= 16.9725356469052
##$SWIBOX= (0..15)
0 0 2 0 0 0 0 0 0 0 0 0 0 0 0 0 
##$SW_h= 3396.73913043478
##$TD= 16384
##$TD0= 1
##$TE= 0
##$TE2= 300
##$TE3= 300
##$TEG= 300
##$TL= (0..7)
0 120 120 120 120 120 120 120 
##$TP= (0..7)
150 150 150 150 150 150 150 150 
##$TP07= 0
##$TPNAME0= <>
##$TPNAME1= <>
##$TPNAME2= <>
##$TPNAME3= <>
##$TPNAME4= <>
##$TPNAME5= <>
##$TPNAME6= <>
##$TPNAME7= <>
##$TPOAL= (0..7)
0.5 0.5 0.5 0.5 0.5 0.5 0.5 0.5 
##$TPOFFS= (0..7)
0 0 0 0 0 0 0 0 
##$TUNHIN= 0
##$TUNHOUT= 0
##$TUNXOUT= 0
##$USERA1= <user>
##$USERA2= <user>
##$USERA3= <user>
##$USERA4= <user>
##$USERA5= <user>
##$V9= 5
##$VALIST= <valist>
##$VCLIST= <CCCCCCCCCCCCCCC>
##$VD= 0
##$VDLIST= <DDDDDDDDDDDDDDD>
##$VPLIST= <PPPPPPPPPPPPPPP>
##$VTLIST= <TTTTTTTTTTTTTTT>
##$WBST= 1024
##$WBSW= 4
##$XGAIN= (0..3)
0 0 0 0 
##$XL= 0
##$YL= 0
##$YMAX_a= 618349
##$YMIN_a= -71767
##$ZGOPTNS= <>
##$ZL1= 120
##$ZL2= 120
##$ZL3= 120
##$ZL4= 120
##$ABSF1= 10
##$ABSF2= 0
##$ABSG= 5
##$ABSL= 3
##$ALPHA= 0
##$AQORDER= 0
##$ASSFAC= 0
##$ASSFACI= 0
##$ASSFACX= 0
##$ASSWID= 0
##$AUNMP= <proc_1d>
##$AZFE= 0.1
##$AZFW= 0.1
##$BCFW= 1
##$BC_mod= 2
##$BYTORDP= 1
##$COROFFS= 0
##$CY= 11.3945322036743
##$DATMOD= 1
##$DC= 2
##$DFILT= <>
##$DTYPP= 0
##$F1P= 15.9154993809931
##$F2P= -4.1035820241983
##$FCOR= 0.5
##$FTSIZE= 0
##$FT_mod= 4
##$GAMMA= 1
##$GB= 0.15
##$INTBC= 1
##$INTSCL= 1
##$ISEN= 128
##$LB= 0.24
##$LEV0= 0
##$LPBIN= 0
##$MAXI= 10000
##$MC2= 0
##$MEAN= 0
##$ME_mod= 0
##$MI= 1.114404
##$NCOEF= 0
##$NC_proc= 0
##$NLEV= 6
##$NOISF1= 3.799351
##$NOISF2= 2.8
##$NSP= 1
##$NTH_PI= 0
##$NZP= 0
##$OFFSET= 15.70392
##$PC= 1
##$PHC0= -10766.04
##$PHC1= 19.60095
##$PH_mod= 1
##$PKNL= yes
##$PPARMOD= 0
##$PSCAL= 0
##$PSIGN= 0
##$REVERSE= no
##$SF= 200.130013532006
##$SI= 16384
##$SIGF1= 3
##$SIGF2= 2
##$SINO= 400
##$SIOLD= 16384
##$SREGLST= <1H.CDCl3>
##$SSB= 0
##$STSI= 0
##$STSR= 0
##$SW_p= 3612.71676300578
##$SYMM= 0
##$S_DEV= 0
##$TDeff= 0
##$TDoff= 0
##$TI= <>
##$TILT= no
##$TM1= 0
##$TM2= 0
##$TOPLEV= 0
##$USERP1= <user>
##$USERP2= <user>
##$USERP3= <user>
##$USERP4= <user>
##$USERP5= <user>
##$WDW= 1
##$XDIM= 8192
##$YMAX_p= 0
##$YMIN_p= 0
$$ End of Bruker specific parameters
$$ ---------------------------------
##NTUPLES= NMR FID
##VAR_NAME=  TIME,          FID/REAL,        FID/IMAG
##SYMBOL=    X,             R,               I
##VAR_TYPE=  INDEPENDENT,   DEPENDENT,       DEPENDENT
##VAR_FORM=  AFFN,          ASDF,            ASDF
##VAR_DIM=   8192,          8192,            8192
##UNITS=     SECONDS,       ARBITRARY UNITS, ARBITRARY UNITS
##FACTOR=    0.0002944,     1,               1
##FIRST=     0,             0,               0
##LAST=      2.4114304,     0,               0
##MIN=       0,             -71767,          0
##MAX=       2.4114304,     618349,          0
$$ Real data points
##PAGE= N=1
##DATA TABLE= (X++(R..R)), XYDATA
$$ [...]
2469A7Q55j73N50l24k41N41p74N93l22l1K8k06J7m39J275q93O5n45P88m27J30
2490D84l82o02J224j078Q01n16L05j33J59m18p12J070j032N07r1Q2n3P6L1k2j03
2511d03q38J018J54l48km88N10o91J056n89j16R26r85P37n55O14r60J204R3J48
2531D85r39P82L19k87M3l25N4N81J1m68L23L82o68R33j053R8J06J38O13p58M68
2552H38l93J126j544P29o36M06n6n4M11p10k07M58r86R54l61J98n77K68o96P81
2572e1r3M9P07n39J5J2N56j686Q49j35l18M70k41m86J23J411j906O31L23l06L59
2593b56l39P70r4L4m14j29q7O68q61N06J339k187J202J17r64K66M77K85p7k66
2613a0J79k83j22J614m75K54k44n67K22L57o15j87J062j53p11P37k03k73p63O22
$$ y = [17, 872, 699, 1249, 925, 684, 1225, 451, 1044, 722, 691, 719, 513, 530, 91, 1366, 473, 538, -7, 781, 354, 484, 102, -500, 724, -354, 447, -69, 236, 103, 262, -156, -868, 202, -830, -323, -414, -332, -385, -309, -278, -300, -403, -1241, -223, -69, -417, -419, -907, -397, -1088, -32, -621, -737, 189, -796, -59, -614, 0, -960, 244, 337, 485, -454, 328, 647, 360, 403, 78, 132, 713, 724, 256, 579, 961, 293, 1226, 173, 271, 377, 515, 1128, 370, 838, 445, 1571, 27, 756, 120, 526, 470, 416, 827, 117, -90, 368, -618, 336, -25, 173, -404, -136, -832, -51, -144, -95, 612, 73, 88, 100, 656, -1030, -181, -316, -634, -164, -405, -891, -768, 643, -1263, -632, -309, -615, -256, -595, 175, 81, 115, -299, -428, -515, 153, -708, -202, 1137, -1050, 152, 269, -695, -429, 48, 333, 256, -10, 169, -114, -236, 1378, 903, 1157, 913, 346, 568, 925, 310, 123, 1185, 1032, 321, 1058, 855, 582, -181, 441]
2633D41l12N16O3m80Q72j256K32j69P72p40K50j63j97L78j209J262p28O82n44
2652c30O02k37n57O55n70k57M41n28J35M9K34l87j98q6M34j90j10P0N15J008j494
2673h01P85K90P5o26r0M50M4O45j220J161o83k5P40m60K72k60l25J14P18r16O31
2694E19L05k57k9l29R97m55N20q39Q1L52N1J8r67P20j80m9L8q5l21m9M83r61M55
2717A8l47L78J35o22J005p76n62K61N80o75n50N17k24Q31j234Q92p19J479j479
2736a092O09o20P56m62J94Pj18J293q52q6O76j96k7l20N57l30L40m5r5L28m23
2757I4M57q35R92p35L26m14J49O38q55Q24q26J142p28K06L59k54K85o89O38k34
2777E40j87K90J12q4j87J87l99L73o45J378j669N21K44p57N59q69K01k88J413
$$ y = [441, 129, 645, 708, 228, 1100, -156, 76, -93, 679, -61, 189, 26, -171, 207, -1002, 260, -468, 214, -330, 272, 35, -522, 133, -437, -694, -253, -781, -646, -597, -363, -750, -948, -1034, -600, -790, -900, -830, -315, 693, -801, -16, 274, 349, -277, -367, 83, 127, 772, -448, 713, 30, 5, 745, 285, 557, 297, -28, 86, 804, -112, 519, 824, 567, 538, 209, 1206, 751, 1271, 432, 513, 865, 916, 934, -33, 687, 507, 458, 496, 411, 90, 41, 524, -437, 18, -329, 49, 184, -438, 567, -209, -771, -510, 70, -605, -1155, -638, -862, -31, -1265, -373, -1092, 387, -1092, -483, -1103, -347, -809, -615, -608, -726, 567, -285, -371, 305, 109, 82, -238, 319, -11, 329, 284, 189, 517, 94, 551, -284, 708, -27, 299, -115, 34, 672, -183, 641, -185, 957, 229, 435, 794, 540, 825, 136, 774, 540, 353, 643, 755, 671, 484, 671, 272, 645, 0, 1378, -291, 230, 474, -283, 276, -593, -392, -680, 733]
2796G33r96M32j83o78J004j162P10j72n7n13K91j5m81P40m09L68o88Q67k01K03
2816b07J84k75O9jO07j093P93k09J52j45k02J88J00K92q29J078k74p22J154q51
2836a91Q98k54j89l26Q00j62l49J012j143N84m49O55l05M8J30k48L89o44M88o52
2856I2N47l09L02k9n17J023j059K69j76M72m15j12r1k67M12p59N99j87J06l18
2876d17J4J77n55Q39m98Ok67L96K01q89P09l84N67k87L05l11R35p61J06J57J46
2897A89N2q38N03L3L33M82q15O04q44M63L02Ok01M2K91j186J276k67K35n45k71
2918a56P60q7Q7J22mL1J80n28k27N53l90O33q42L45n2l4j77O61o34J24n77m64
2940f76J242j027Q61l40l37J21M19j91n77N17m89M48m5o44P55q47O41o05p9O19
$$ y = [733, -263, 169, -14, -692, 312, -850, -140, -312, -369, -882, -591, -606, -1087, -347, -756, -388, -1076, -209, -410, -207, -23, -298, -229, -230, 377, -716, 77, -132, 20, -125, -327, -139, -39, 253, -576, 502, 228, -494, 660, -191, 707, 453, 264, -62, 738, 576, 227, 1239, 96, 680, 231, 886, 581, 629, 759, 511, 900, 256, 744, 92, 639, 330, 632, 603, 86, 1109, 50, 319, 143, 615, 200, 88, -3, -270, 142, -617, -18, -205, -99, -417, -403, -226, -781, 58, -440, -434, -701, -305, -104, -993, -284, -668, -101, -388, -83, -394, 541, -220, -114, 43, 189, 241, -597, -94, -61, 272, 754, -61, 543, -301, 162, 464, 470, 269, 311, 602, -584, 692, 425, 660, 115, -156, 604, 517, 604, 726, 722, 753, 933, 405, 178, 731, 341, 974, 132, 477, 425, 391, 214, 875, 241, 365, -212, -676, 566, -461, 400, 60, -277, -156, 263, 72, -505, 12, -477, -29, -74, -718, 37, -810, -169, -774, -853, -234]
2960b34k61K41m3L98p86O72n28N86o32K37K2M83J1k71J49J64j2J81o52O19j08
2981B36J8M88k50K47j004R52r18J25L9P44O86j397M34O72n48M0n27P08K4o75p8
3002A6N23m58L58o47P36k64m16k34J038j165M94L16n89Q73j280P53n36Q58o94
3021c18O64o22q03J522j456J16k17Q53j43P9P89q07j22j85L09N13r89j22K77N06
3041a56k49J2k12j2J012o97M37j533L405k109N11o75K61K70n75L49l65R66j564
3060i24M21MN80j9M25k56o7L58j29Q84j487J066l16O84j113O75O23o79J56m10
3080D76M81j020k83M96k19N80k60m3l07l11O26o95M53n5O90o59P71o55n22N49
3100I3k09K37n36L56J40j47o09P61k34j042R81l85N06o83M56o1q0J40r1O00j25
$$ y = [-234, -495, -254, -297, 101, -685, -13, -541, 45, -587, -350, -328, 155, 166, -105, 44, 208, 196, 377, -275, 344, 236, 254, 742, 492, 739, -265, 687, -231, -106, -67, 677, 1363, -34, 400, 1072, 524, 564, 37, 745, 769, 94, 16, 539, 81, 439, -208, 528, 264, -152, -386, 652, -513, -19, 297, -292, 581, -699, 54, -482, 376, -318, 346, -276, -1079, 443, -1013, -897, -1114, -261, -404, -325, 464, -343, -465, -650, -341, 172, -817, -939, -662, -156, -405, -393, -605, -617, 395, -302, 135, -1398, 2007, -102, 409, -266, -5, 265, -310, 39, -326, 640, -924, -503, -499, 81, 62, 487, 231, 164, 522, 393, 1277, -210, 856, 540, 1224, 111, 786, 1409, 730, 886, 476, 957, -63, -346, 150, -69, 511, 251, 208, -99, -410, 216, -479, -26, -81, 609, -50, 721, 66, -456, 93, -116, 121, -415, -59, 81, -66, -675, 86, -148, -1190, -209, -594, -88, -771, -315, -376, -456, -316, -407, 193, 68]
3121F8J81j052L61j91j78R71j053J119k17J62q20J68J75N96L8j031Q51j007O06
3140b53R22p68K51M11O3o76J015l76k13l78k84P14l82O04k03L17o14K65l42l43
3160b70J304m54K17o74J26j34j057Q26m68J064j99J36j720J403J33j505M08L29
3178e35l2J94N3q85K022j697Q26m39K55j64K29Q6l42O68m65l85O39p67P88o19
3198e70J648j860K89M03m45L94k63L17j29L69o85P6Q59j028J230j80k57m61k57
3217e50N08l2P31k74J109j463K58K23j85j6k35L2J8j05r42J054J81q48J050j763
3237a249J019k41K46n4N22j51K56o16m60O57p31M00L19M18k50k66J19m59J01J07
3257c13K16j126J048k17o33R27l71k7l89M74n01J123j49o95J37j14Q26o31J14
$$ y = [68, 249, -803, -442, -633, -811, 160, -893, 226, 9, 171, -649, -481, -306, 290, 328, -703, 148, -859, -253, 669, -99, 152, 563, 626, -50, 965, 589, 376, -2, -286, 428, 46, 650, 447, 764, 150, 415, 73, -270, 1034, 580, 797, 123, 249, 115, -942, -116, -584, 480, 281, 417, -1303, 100, 233, -1272, -864, -535, -567, -373, -320, -1205, 817, -880, -54, -493, -238, -402, -173, -87, -429, 239, -226, -611, 28, -739, 49, -570, 1078, -782, -493, -90, -535, -141, -404, -87, -216, 153, -532, -456, 403, -625, 605, 425, 168, -293, -550, -42, -74, 657, 383, 1492, 29, 287, 510, 325, 309, 74, 106, 124, 19, -923, 131, 312, -536, 514, -1249, -230, -471, -225, -279, 243, 92, 348, -268, -728, -71, -802, -402, -83, 335, 85, -181, -62, -521, -420, -313, -97, -1223, -175, -392, -1025, -98, -469, -496, -885, -411, -912, 211, 62, -633, -496, -610, 216, -415, -301]
3276c01l81Q08Q18j055N33k37L31m60m13L95J22j5n55N79l3M76p31M06k13jM36
3297E09n76R37j417R98o78N18j56l56N66m71Q41q81R71j174P88j009L81R82m43
3316C30l45k4Kl12J37L15p73K74N68J60r11L53l0n1P13q74K17l42N86o99J20J489
3338I03j507j88L67M29j031R98J6N53l43l58m83J34L72m13J025r94J41L66j23
3357a36L02J16J70J82m01k8K03lN0k88L46M28j254R49L12qk98p43K15j10N59l66
3379A97O5M86m99k62M09J33p41N22k32m46P25L29o10J50j12p84O77M63m76k61
3399b67k44P02l93M4m60L72L75j120R46l89O49j42o2n96N26M65o67J02o83J084
3419B42o09L65n79N30n3j1J66m56M96m63M04O7l53L87l56L05l17P46n67J95K01
$$ y = [-301, -682, 126, 944, -111, 422, 185, 516, 56, -357, 38, 160, 145, -410, 169, 136, 612, -119, 287, 74, 73, 509, -67, 870, -547, 451, -227, 291, 135, -221, 345, -126, 715, -166, 805, -369, 419, -590, -209, 773, 330, -15, -39, -37, -349, -212, 103, -670, -396, 172, 332, -579, -226, -256, -307, 406, -468, -251, -593, -7, -706, -586, 903, -604, -792, -425, 4, -1027, -29, -13, 540, 197, -161, -644, -510, -138, -551, 474, -520, -379, -13, -136, 166, 282, 452, 634, 233, 205, 408, 405, 455, 167, 513, 941, -313, 636, 948, 940, 642, -101, 114, 4, 563, 197, 262, 748, 249, -13, 396, 529, -212, 310, 78, -368, 357, 686, 76, 226, 114, -670, 7, 470, -6, -267, -511, 191, -202, -158, -618, -246, 129, -991, -45, -434, 215, 73, 11, -585, -59, 406, -261, -159, -842, 242, -367, -2, -581, -51, -104, -115, 51, -405, 91, -372, 32, 99, -254, 133, -223, 82, -235, 511, -56, 139, 340]
3440C40l02j46l06J163q5j53p76O27nk53m49L33j74N92k67J50l26m10M92P97j355
3461e13O70O16j330M99o12O49m20M79J28k37N09k39j241Q70N26p33l89j61J039
3480A10o99L30q60J324j102O12j30m24Q81n0l95O72o79K31j37J11M61k00j14L16
3500B58n47n4Q28n73N57n38M47l57rL9n34J061n45j32K44OL36O19n97k63M80l1
3522F95l39j14N82p50P51m06l61N72n27O15q23J19P41o87M60l73M44l19n65pK95
3543CJ81l80J96j61L07m44L89k0j94K9o90M52k75N93l22j24J46L37j06L08r5q67
3565g37L00J95m2J26l49K57j84M33n6N4J90j64k86L10M14m66K90j21j59L25r3
3586B37j02K43j36J34K21p14L36K10M89m76J25k77k01K09l15K30l17L14J50j41
$$ y = [340, 38, -108, -414, 749, 664, 511, -265, 362, 357, 104, -345, -12, -186, 406, 139, 289, -37, -447, 45, 842, -513, 157, 773, -557, -58, -670, -21, -441, 38, 166, -71, 438, 199, -1042, -172, 354, -379, -768, -929, 110, -589, -259, -1119, 205, -897, -285, -415, -839, 42, -8, -403, 269, -410, -179, -316, -205, 256, 56, -58, 258, -289, -343, 485, -88, 469, -69, 378, 21, 12, 51, -483, 578, 33, -99, 145, 151, 487, 1106, 509, 246, 726, 695, 356, 242, 824, 74, 825, 419, 58, 630, 103, 718, -105, 14, 755, 68, 528, 155, 599, 280, -285, -292, 3, 184, -196, 0, -161, 146, -298, 91, 71, -123, -94, -784, -332, -607, -14, -336, -460, -314, 23, -83, 225, 130, -737, -437, -242, -284, -158, -507, -250, -434, -1, -57, -3, 187, 23, -263, 47, 461, -5, 285, 164, 5, 330, 237, 135, 378, 242, 376, 597, -117, 219, 429, 918, 442, 567, 290, 89, 298, -17, 213, -104, 210, 360, 219]
3606B19k46j82L95J39J2m72M86J90q06N42k69M66q29J93Q5j82K73n71L89n1J81
3627c8q52P74n32P42K3q67R13q00N36m94M47J14o31R50q50O78m99L05k59O5Lk02
3649d74M85n30N57J43l98M17j37n02K1O08Q9N51m98J19q03M93l34M51J6P7k04
3670A47K30J27K40j2j51l87k9K12n46M21j34k40N7M35P7r00M55P14o42n71M90
3691gl41J68o35P73p88N77p30Q87J96l04M0k90J85j9K19j19j81J84P3m56L0L18
3713b20k21J41j15J95j98o3N22n0k5J2M87j53k4j88n76M99K7J9M1l10K62k40O98
3736E20o87M42n11J31L19J61j83O9M1L15m33M12l57p1M4ok09N95j46JK44p28N27
3759D90n02l77P94l84J12O53q81N65m56N49p57l05J86M91J65o37J95J98l99N37
$$ y = [219, -27, -209, 186, 325, 337, -135, 351, 541, -265, 277, 8, 474, -355, -162, -77, -259, 14, -557, -168, -219, -38, -890, -116, -648, 94, 117, -750, 163, -637, -101, -595, -148, -34, -665, 285, -565, 113, -386, -81, -340, -275, -272, -474, 11, -519, 38, 181, -217, 200, 63, -439, -418, 190, 279, 830, 332, 451, -352, 141, -193, 258, 274, 351, 147, 377, 504, 744, 732, 581, 194, 165, 377, -169, 252, 118, -122, -65, 370, 447, -453, 2, 716, 74, -497, -7, -348, -180, -815, -42, -830, -253, -983, -96, 100, -204, -164, -454, -269, -288, -69, -188, -369, -185, -112, -568, -538, -220, -441, -300, -415, -220, -418, -481, 41, -9, -34, -22, 465, 312, 288, 100, -476, 23, 50, 69, 110, -200, 62, -178, 520, -167, 275, -236, -105, 214, 375, 192, 261, 302, 617, 184, 596, 239, 168, 212, 206, -3, 592, 446, 447, 691, -37, 490, -12, -389, 405, 21, 133, 786, -95, 470, 14, 563, -194, -499, -313, 178, 343, -294, -99, 99, -300, 237]
3779B37j042Q31o0j13r26O08J06K79k08L7K89L70j368J515o89m3o14L17O76l70
3799a68M37j065M65N61J8n75O50l1j16m29k1O51q8L71l97j63R42o39K35o73K27
3820A92k02M62l02M38J19K15j129Q41o08o63J201q34J49L69J21K00m85l28K96
3839E2p3n54L71q4M16m07N43O83j327M59k92J056m12j221R5P81m66p4M97m78K84
3860a51k09M74o62Kk13J93L22J027j679m7J205n22K26l5k90j04K99P51j799J652
3880D40m49Q0M82p72M35l03K47k72M35L88M10p04j93q96M36O31M50q64k2M24j56
3901B27r73J08l56L54J178M99o73P37j084J72r77O58N43N44p65l80K60J078k104
3920i54Q23q7k9p63Q05m86k24J097j342K484k056J045P05j974J059l50K88N45
$$ y = [237, -805, 26, -34, -147, -1073, -465, -359, -80, -288, -251, 38, 408, -960, 555, -134, -177, -791, -474, 202, -168, 269, -796, -331, 230, 248, -327, 323, 292, 176, -253, -274, 377, 289, 660, 263, 100, 1042, 403, 638, -35, 192, -10, 452, 150, 588, 707, 922, -207, 634, 26, -637, 564, -270, -121, 248, 369, 569, 84, -244, 52, -21, -575, -204, -288, 128, -279, 264, 947, -380, 79, -213, 843, 431, -790, -695, 86, -380, -454, 43, -435, -151, -360, 114, -548, -546, -759, -566, -244, 783, -896, -943, 262, -260, -34, -69, -359, -463, -164, 587, -1212, 440, -9, 71, 553, -219, 216, -87, 160, -112, 323, 711, 1121, 417, 224, -672, -236, 395, 845, -19, -41, 383, 227, -746, -638, -994, -640, 538, 1037, 364, 1101, 17, 189, -788, -130, 413, 957, 192, -188, 72, 1150, -954, -131, -218, -247, -1010, -205, -691, -915, 182, -1160, 1324, -732, 313, 1018, -956, 103, -247, 41, 586]
3938E86k62M88p75n62j34J654j811j81k49K057L4j172N42q23O36J466j896k09
3956f11J94K55n79R91o04J07J70N4m59l64J767k206Q43J26R23K91l44M89p08m44
3976a09M11N76j606J85K277k264J194n81J092j277n8K97R1j50J45Q69r94n79K83
3995a98J196j616Q79j320Q03q34J035L75j585P48R03p73Q60N74j383n83J729l61
4013D49n05M19K7O3o95l13Q19n55J341q07p98N4K93j86J164n86L45j494J066O
4033A07n60J254j383M96q14J312n0L61k60q78J21J355n53m87J069r87o46N42O35
4052F34j107L05J519j612Q02P70j555L03o80Q26l28Q06R8j519P0O68j84n06Q05
4071A15J14k99q54Q68l78M94P75p07O6m7r12Q35N2j51m01K71o48Q07o38M05O87
$$ y = [586, 324, 812, 37, -525, -659, 995, -816, -997, -1246, 811, 845, -327, 215, -608, 28, 1494, -402, -611, -417, -162, -741, 250, -354, -247, -77, -23, -482, -846, 921, -1285, -442, -316, 607, 898, 554, 1043, 335, -109, 302, 878, -728, -543, 1734, -530, 664, 83, 1175, -102, -160, 137, 228, 78, 223, 1092, 98, -481, -198, 998, -618, 261, -1059, -256, -1090, -55, 320, -1265, -517, 386, -387, 473, 1047, -336, -919, 810, 449, -56, 363, 390, 453, -242, -555, 264, -291, 1050, 243, -555, -501, -208, -394, 770, 184, 529, -965, 101, 107, -453, 801, -582, -86, -900, 412, 362, 723, 463, -415, -294, 1061, 508, 21, 1090, 103, -543, -1, 634, -473, -168, 1351, -261, 541, 1311, -244, 59, -621, 205, -123, 683, 781, -738, -668, 0, -184, -690, 115, 229, -70, -924, -56, -434, 60, 835, 128, 194, 147, -765, 70, 122, -29, -430, -159, -807, 0, -638, -233, 454]
4092D54J73n96j112J728j47j48o88M07J13j02p1Q40o37j88R48n85r5J69J54K81
4112H98j701J249m50pM04q88Q09k58J37l16J156j565N45K17K03J00m95l66Q41
4131E13l56K37j2o30p3L13J31k20N44j42k57j79R38q87l06L77q18J004k31K12
4151A58N73j578Q54m60R01j51p94M08j95R30p43p71J066n76L44j114O97l19N6
4170g14J250j378N06J234n40N75n49J76n87L82K91m4l02Lj288N63n4J126l58m86
4190a94P61l69m84J9j39K64j01L6j28R71q80N60L16m22o39M34J17J80j39o90L83
4211a44J273j232N6O91j05m86k69R74j349N92N5l14n49N07O9M31j318J163L19
4230C64p7j102O52P39q97L10M0l5l4n90L32j91L28j3k08R22l0o59m26J165q40
$$ y = [454, 627, 31, -1081, 647, 500, 352, -336, 71, 184, 82, 11, 851, 214, 26, 974, 389, 294, 463, 617, 898, -803, 446, -4, -11, 393, -495, 314, 56, 193, -123, 1033, -532, 13, 230, 433, 533, 38, -328, 513, 157, 394, 382, -248, -321, -8, 123, -97, 447, 305, 48, -131, 807, -80, -386, -9, -827, 177, -54, 158, 731, -847, 7, -453, 448, 297, -497, -89, -284, 646, -97, -868, 198, -378, -34, -1148, -451, -770, -714, 536, -842, -336, 898, 358, 933, 384, 560, -27, 355, 646, 602, 300, 303, -985, -422, -476, 650, 292, -194, 567, 198, -286, -267, -406, -142, -243, -207, -335, 636, -244, 316, 632, 210, -429, 5, 122, 302, 163, -527, -144, 1129, -103, -47, 644, 539, 53, -216, 758, -591, 1, 56, -258, -807, -300, -231, 200, -1118, 45, 364, 287, -815, -163, 576, -321, -11, 29, -6, -40, -630, -298, -489, -161, -174, -382, 540, 510, -149, -575, 590, -250]
4251b50J22k22M55n81J118j82j78o6k69l61kJ020o40j33K13O61J177j973l58J001
4271E52j96O35j200J012j098O18m8K54o49q5Q3K02J5L43K60l82K57p00P11J05
4291F89p40K36p81J337k35q40N46k46n9l37J021q98N05l73L42K39m8p61N50j20
4311B7P04q39j93K04mJ41rk57M0J09m66M57J31j96QK18m6q8m20L33L13L21q29
4334c41K88K07j91M14m00M01m70Q96m08m55P99o06K5j40n86R06j026O63J70K43
4354C89k42K76R3m09L52J96m83m5K9j19O6n6j91K48m56j04P56l14m59L98O2J4
4376Ak12l8k15n8K49J38J92k44K83l96k97M75k60M35k28k69P76l48J94j30m73
4397d25P17M5o26K05q0m01O70p08Q65n02K26K56k61L65m38J12m77Q00m50K25R4
$$ y = [-250, -128, -350, 105, -476, 642, 460, 282, 216, -53, -414, -416, 604, -36, -169, 44, 705, 1882, -91, -449, 552, 356, 991, -209, 803, -295, 323, 275, 529, -120, -205, -122, 80, 95, 438, 698, 316, 573, -127, 584, 689, -51, 185, -596, 741, 506, -334, 212, -34, -93, -430, 591, -307, 198, -175, 167, 406, 358, -403, 147, 27, 731, -108, -301, -97, -101, 40, 31, -226, -186, -77, -543, -86, 45, -151, -143, 75, 29, -59, -479, -146, 167, 488, -341, -53, 154, -37, 377, -23, 378, -92, 804, 396, -59, 740, 134, 159, 19, -567, 339, -687, -24, 146, 389, 147, 423, 516, 107, 459, 655, 172, 127, 156, 37, 103, 47, -144, 104, -352, -456, 300, -14, -473, -75, -13, 1, -211, -249, -464, -522, -273, -135, 57, -187, 96, -300, -597, -122, -382, 53, -175, -444, 332, -16, 178, 48, -425, 292, 337, -289, -84, -164, -565, 105, -603, 262, -240, -14, 242, -19, 346, -92, 20, -457, 343, -107, 118, 212]
4418B12K77J50m39p7l74O07o28PJ43J36M43o46L46P6l72L70k36K64M75m57K19
4439D96n34K5k01N0J49k7M66M08q66P6o24J08O23j80k29N68k2l65m6j18L21r8
4461b0P5K9m02L8K42r8m18R14p47k11O13k88M94m31k19O62l45k42J07K2J53l73
4483d45K64M91j78O60p88n31P48j1n2j69K74Q7j59Qq43r8O59k50N70k36m6K44
4505A99q4J95l0n91O31K6n57j1N5l57OQ92l07o69N84J76o61M0L83l84J2K35K15
4528bj94K93n33j32O2m2O83n55K89m24j16k82J132M87p15j9r8K97l52M38j016
4549g99N77J30N9l4k08K36O1MK25m95n61P46J5Q46J53q60N10q04Q15q17P48k63
4571B84J90J07m68m97L06J11m9J61M3j07K03K31n09L00L05m37k16p54R03M28m60
$$ y = [212, 489, 639, 200, 123, -251, 356, -272, -265, -122, 14, 457, -189, 157, 233, -139, 231, -5, 259, 734, 277, 496, -38, -13, -214, -164, -15, -42, 424, 832, -34, 42, -582, -474, 149, -31, -260, 308, 286, -79, -125, -243, 78, -20, 55, 84, -318, -280, -38, -136, -554, 360, -387, -598, 15, -273, 221, -210, -429, 233, -112, -354, -247, -225, -72, -445, -181, 310, 132, 792, 4, -527, 221, 210, 158, -11, 263, 350, 191, 199, -644, -742, -83, -333, 237, 1, -45, 199, 115, 310, 280, -311, 320, 346, -211, -222, -167, -524, -518, 374, 67, -602, -18, 158, -503, -463, -80, -464, -452, -217, -2, -196, 97, -436, -568, -506, -548, 135, -420, -131, -555, -671, -953, 179, 666, -49, -68, -166, 131, -221, 217, -799, -222, -92, -33, -67, -275, -39, 22, 26, 251, -244, -805, -59, -44, 802, 955, 95, 605, -199, 616, -201, 547, 284, 474, 581, 113, -384, -78, 33, -16, 145, 188, 81, 284, 515, 6, 306, 611, 174, -42, -796, 107, 535, 75]
4592G5M07l4n65J68m48L71j98j7P19n03k17j64l33O07j18J32k6K38l84L44m12
4613c58K20Jj24L26j5o94Q34k60po42N92L1K33j08K32M7o2p56M23J88q47P99M4
4636I7N8K29o11K32L90j2l86L29l29M84o87J77m7M48k17o64P18k86l31N69k20
4657e9J44j97n5J021o30r52P92L21l84N2j66J004r00L42N0l14J20O7l8k37J16
4678I7p43J002l85K59k86k26m39L77Q39k61j60r34O76r7q6k70J72M60m29M13P1
4699E0O4m98N20J34j62k88Q3M43p00P23m00O66l96m54J24N6K81k41N70m27K96
4720D44K42m27J61L49o48Q40r59N26l32l98K96k53Q7r1R5j15o2M62o6j40O1J46
4742B18Qo49J53J127r91K80l0N45p57K45j16L53j82q68L76L72P9l10P02n17K9
$$ y = [75, 482, 448, -117, 51, -397, -26, -224, -241, 478, -25, -242, -406, -739, -132, -250, -118, -144, 94, -290, 54, -358, -138, -137, -261, 65, 50, -644, 190, -70, -77, -719, -127, -96, 137, 29, 261, 308, 246, -510, -87, 101, -746, 53, 97, 155, 384, -227, 5, 395, 383, -3, 326, -3, 481, -206, -29, -76, 372, 155, -509, 209, -77, -408, 161, -59, 85, -112, -167, 854, 224, -728, 64, 385, 1, 53, -113, 891, -9, 333, 383, 69, 189, 256, 218, -19, 97, -646, 356, -29, 230, -56, -282, -721, -344, 495, 234, 74, -860, -184, -281, -367, -637, -465, -5, -434, -21, 50, 114, -384, 136, 270, 108, -180, -97, 346, -354, 369, -31, 635, 239, -215, -91, -35, 246, 5, 575, 148, 444, 686, 259, 420, 769, 121, 961, 2, 528, 196, -202, 94, -159, -72, -163, -68, -183, -245, 217, 151, 11, 72, 218, 226, -423, -270, 857, -134, 146, 116, 661, -96, 149, 33, 386, 204, -664, -288, 84, 163, -147, 555, 38, 67]
4763F7J03M20m08J56q03J763j509M81q98Q65l77K47K24n93k64j97J567o79k22
4782e7l67M05J57k4n75R15k19o19J067n78L92n30m6M8k36N75P95q14j49o27J035
4803E48o22J67K74mj45j255J634j216J75O94j230R53N28k92M89j04q66R1k04J162
4823G77o75n87o4M08k95L09O90j142Q42j211J618j18L7k37n76M78j98p57p1J095
4843C23l54K33p09M99p83J182p99Q1J019j036J88N49m63N22j18Q4k53m33L55K06
4863B93n45M42l03J32J004r13r25J243l82l50O44k63N00M0o06JK40n95J228j554
4883f69N21O92k22r5o02k00L94R5p3M02K54r23O29O8j80K30N9m18l28N33m45o2
4905c40K64j58Q30p69k56O18p92K48K08J63K87j14k49m71Q06j003M57K8o27J032
$$ y = [67, 170, 590, 182, 338, -465, 1298, -211, 270, -628, 237, -140, 107, 331, -262, -526, -723, 844, 165, -57, -424, -19, 138, 114, -461, 454, 235, -384, 683, 105, 497, -33, -79, -31, -267, 308, 1103, 289, 140, -487, 548, -74, 93, 367, 363, 218, -1037, 597, -619, -444, 250, -980, -27, 501, 209, 698, 594, -272, -181, -385, 777, 102, -485, -549, -141, -436, -127, 563, -579, 263, -948, 670, 552, 589, 352, -224, 254, 56, -701, -772, 323, -31, 202, -507, -8, -791, 391, -408, -327, 692, -344, -156, 393, -70, 452, 334, 418, 165, -268, 87, 293, -252, 190, -113, 19, 1023, 110, -815, 428, 46, -304, 340, 77, 577, 617, 11, 12, 252, -343, 885, -669, -148, 544, 322, 227, -375, -575, -181, -86, -159, 243, 497, -426, 203, 271, 91, 321, 380, -38, -366, 167, -278, -340, -76, -234, 596, -173, -429, 189, -603, -355, -147, 16, 303, 189, -60, -531, 275, -728, -271, -243, -870, 162]
4925A62j65m8M9L1l52L88L21m87J116o92K15l42j00q4k53M7K26o0M41MJ08l11
4947B14m45K62P9m83N45M4l81M69N3k89m99J261r70Q9J19O4K47n24j02M05k07
4968d9j32o35N51R86j015lK48K56n44J38J14r9J6M07O5l24k52L91o92P53l68K81
4990I3K91l53M49n39K18J97j11k34K79m92j22m03N71J77R7r94J176q02k23R40
5010B15J43k93J44k57N68m09m67J59J37j83L96o09J39j03M30m9L40q27P35L83
5030E92J42j308N37l27j47Q53n05L79K39k50m52M04O6Q2j64m3l28j28J069n17
5050A94l43J21m17M26J58k39lM3%k66K90J34n16P04P20r66J70j43j74j68K15l13
5072c73M93J24k39j39K67K18k76o63J38M98j42L07r22R68n42O76Ll78k89J53L34
$$ y = [162, -3, -51, -2, 29, -323, 65, 386, -101, 1015, 323, 538, 196, 96, 12, -241, -194, 32, -28, 413, 417, 525, 214, -231, 31, 110, -373, 172, 216, -165, 304, 357, 68, -431, 830, -140, -51, 68, 132, 379, -145, -247, 158, -49, -181, -816, -265, 721, -294, -297, -49, 207, -337, -199, -85, -184, -168, 239, 304, -20, -272, 119, -573, 180, -188, 93, 384, 31, 480, -59, 159, 356, 245, 11, 290, -202, -324, -727, -156, 21, 118, -876, 300, -502, -725, 215, 358, 65, 209, -48, 520, 111, -356, -197, -60, -243, 153, -456, -317, -420, 10, -39, 301, -526, 209, 592, 734, -574, -37, -364, -511, 342, -163, 216, 455, 205, -247, 157, 223, 305, 141, 98, -230, -358, 711, 194, -149, -28, -445, -19, 139, -100, -103, -60, -60, -326, -36, 98, -418, 286, 1006, 40, 210, 67, -107, -275, -60, -373, 120, 244, 5, -134, 133, 351, 75, -588, -450, 48, -94, 213, -709, 259, -283, 393, 396, 18, -271, -118, 216]
5093B16l7j92M63l13P4K19l33L89n53p6N73q9k94m8r7Q2L8j60rJ89J5J45k41K56
5117B17l3l64K93k86L03J2J17j8r4l58l30N09K19p5k94O69Nj092o7L41J91k47
5139c82J36L14pK46k29n6J7M0m40J64P72n97J13l47J76J64r0k96K7m98L78J50
5161b45M66m93k12N80l28L39o54J034p09O48r15K06J47n15R15l19N7n09N54l38
5181b91L9L13k48R06k98q80M63K85l77j17M65l35m76L33K12m38n7N35OM7l84L1
5203b66J70Q6K37j89m41J94M78j91K30n62N33o14M44J94K3k07l50L39k96P8R1
5224a9l01qQ5q9N39o51L67K38k40L22k71k24L68n31R06r6p40K70J97J35k1l62
5246a26M14o30N80m61l48Q59Q1n61J84L00l10J25O8m88N20m14RJ81N65q80M68
$$ y = [216, 179, -13, 450, 137, 211, 430, 97, 486, -67, -143, 430, 341, 47, -1, -98, -16, 22, -138, -147, 42, 57, 202, -39, 217, 184, -180, 113, -173, 130, 142, 259, 241, 147, -211, -541, -32, 187, 112, -182, 487, 492, -600, -667, -326, -135, -382, -246, 68, 61, 307, 78, 22, 39, 79, -361, -197, 575, -22, 91, -256, -80, 84, -6, -302, -275, -773, -395, -245, 221, -272, -484, 96, -232, 107, -547, 487, -222, 426, -489, -283, -136, -651, 264, -55, 2, -507, 47, -291, -252, 61, -187, 719, 421, -459, 4, 289, -88, -205, 260, -75, -551, -218, -6, -444, -501, 34, 40, 87, -297, -266, -96, -10, 227, 38, -403, -209, 269, 78, 308, -254, 279, -335, 109, 303, 326, 119, -231, 108, -188, -110, -19, -320, -328, -243, -332, 207, -444, -77, 161, -79, 243, -28, -252, 116, -415, 491, 395, -345, -75, 122, 257, 236, -126, 288, -342, 238, -223, -571, 288, 369, -192, -8, 292, -18, 107, 175, -313, 207, -207, -198, -17, 548, -332, 136]
5267A36p57J195p29Q23p00j95L84n91L76N02n87M4k41K39O4j29j47Q42r73J40
5287c04K60P94j380L73P60m93P95p39L06J39Q1l72J37r59O5O54j01l36R04j027
5307d43N32m75R52p98M73J02j000J325r74N20J63k50j67l6L33m62M61j324P47
5326c21Q4L47o75N38R0m6P3p36Q49k18K94n00J53k27K68M46n07j70J97J51j95
5347a05j16K75J061j272q3N2j7M63n39J83N15m53k01J96r5j20O14l33RR2m86l0
5369c90O01P0n94o6M71K32j84q14N16j61N12p03Q04k49o7k53N43q9p15L34K26
5390B4J30K24l32J22N80m81j03q1K45k58M11l0j051R10n22K01K0O1P6K04o95O43
5412B98j95M11k66l86n9N15m01O7rp28J193p47m93Q89j88K13o33M85q1N65j206
$$ y = [136, -621, 574, -155, 668, -32, -227, 157, -434, -58, 444, -143, -99, -340, -101, -37, -166, -313, 529, -444, -304, -44, 750, -630, -257, 503, 10, 805, 66, 372, 511, 592, 220, 357, -602, -537, 117, 16, -320, 584, -443, 89, -386, 566, -232, 241, 343, -657, 668, -306, 214, 377, 127, -40, -76, 257, -205, 256, -1068, -321, -237, 110, -565, -27, 63, 17, 90, -646, 203, -15, 279, -221, -68, -295, -27, 419, -88, -258, -61, 90, -105, -221, 54, 1115, -157, -240, -188, -205, 258, -281, -98, 417, -36, -237, -41, -136, -256, 358, 25, 34, 126, -360, -390, 211, 281, -313, -379, 92, 324, 140, -674, -158, -319, 193, -510, 294, 45, -22, -275, 268, 179, -536, -202, 24, 154, 378, 46, 168, 748, 267, 164, 83, 328, 70, 481, 451, -600, 310, -212, -11, 9, 70, 146, 350, -345, 298, 103, 514, 248, -138, -197, 318, -83, -16, -25, -753, 440, -307, -800, 89, -99, 114, -519, -34, -115, 450, -756]
5433g56R74k42L11r2o55L76n25P68k07P7l54Q16M5l63n05N97l62L81N66o43q37
5454f30J494j001n97J284j548J112nr0k74O67m46P8n33K58J32n03J120m4K20o62
5474C2O62J67K11j218l02K71L45q97N28M29l78j26J179j510R78j69J98j00j93
5493A07n59P82k41O89l12k7l09N98L24q43n70J394j330Q90q34J086l76l69L04
5512D04j008k1l12J277k69p04O65J30J09q6m92O77M49r51j56R52K95r40m92J360
5532H87o5o99r61K81j65K99m39L88l38O37N49j154N06M02K57k92K62l08n30j10
5552e93J077n82L51m40R60n52K6j96L47m56k19O11r7L2m01K75j51N14m05J43N43
5573G87r00k71K03j24Q55q15J78K72k70K2L56n64J04N54q68P29j95n68M22o6O8
$$ y = [-756, 218, -24, 287, 195, -460, -84, -609, 159, -48, 29, -325, 491, 536, 173, -332, 265, -97, 284, 850, 207, -630, 864, -137, -734, 550, -998, 114, 109, 19, -255, 412, -34, 44, -489, -231, -99, -602, 518, 474, 694, 32, 694, 861, 1072, -146, -448, -177, 168, -729, -201, 228, -150, -276, 903, -607, 371, 202, 400, 300, 107, -452, 330, 89, 778, 466, 439, 130, 728, 1052, 209, -361, 1033, -297, 593, -241, 845, 469, 100, 404, -604, -625, -937, 340, 71, -633, 32, 162, 271, 185, -307, 370, 819, -132, -288, 664, 959, 19, -473, 887, 822, 123, -838, -557, -722, -423, -862, -474, -812, -175, 374, -780, -274, 128, 385, 93, 355, 47, -483, -593, 484, -98, 253, -187, 773, 221, 247, 51, 398, -58, -277, 334, 237, 269, -132, 143, -8, 506, 101, 244, 787, -113, -384, -181, -305, 550, -265, -87, 185, -85, -63, 293, -271, -167, 387, -481, 248, 53, -515, -93, -159, -91]
5594i1l1o2l87P74m81Q51r89k90M70L43k90N49j04p51m24R23Q16r31l54J089m63
5615A67k3n42Q34q96P99p58J163q67j27N04m79M61p16L80r0M00J02l80J060j559
5635e67Q76j52K6J36m06L54o1p41O59K93p03R65q32L55n47J78l94N89l8L83n34
5656a61J02J25O5J84o23L77l55MQ5K48m76P10j103M60K83L5l89L77j76K20N46
5677E38q97J84j4K25o9R0J08N72k91o1L5j60m20O27n96P36k12p1k29O3n00J05
5699b37Q57q91K0QN30n93O64l34j35Q9j85l92M84N06l39m14q6J09M15j88L28j04
5721A12n0jJ36M2n27O43K89q43J5o0M95k00R6n12R5j97k7J29J10K20L7k40K46
5744HJ68l16r7K30j56n1m16N13n5l28J442q78j87P9R4O7J91m42K70K28k15p32
$$ y = [-91, -122, -184, -571, 203, -278, 573, -416, -706, -236, 107, -183, 366, 262, -489, -913, 10, 826, -105, -459, 630, 167, 144, -398, 436, -460, 339, -419, 744, -123, -250, 254, -225, 236, -480, -100, -190, 210, 312, -68, 992, -567, 309, 157, 183, 319, -87, 267, 206, -535, 124, 417, -286, 679, -153, 202, -345, -167, -561, 28, -10, 373, -161, -59, 66, 131, 315, -308, 69, -286, -282, -197, 51, -425, 285, -818, -358, -75, -40, -429, -52, -228, -8, 538, -359, -175, -189, 36, -33, 57, 165, 737, 446, 385, 420, 260, -160, 467, -129, 607, 395, 324, 95, 158, -342, -237, 620, -271, -251, -243, 287, -306, 358, 24, -111, -22, -207, -599, -115, 391, 52, -362, -448, -339, 76, -112, 216, 112, 62, 61, 197, 239, -288, 355, 644, -199, -184, -244, 251, 51, 147, -365, -270, -467, -494, -365, -255, -35, 2, -238, 8, 176, -140, -237, -7, -163, -214, -630, -117, -172, -500, 942, 64, -123, -44, 50, 117, 308, -134, 136, 364, 149, -583]
5766e83J115l54J7n14l49L56M7O87o19Q1M48L4k43K03k27q50Q17P7R81m24l46
5787C54q63R35n77J379k050O21l63L10Q42n52n08L53M12j7m03k39M7R91r06L23
5807H9M29o99k44O79o28J267p57L36l28M4n51M89m01o44M37R71o71j40K18R2K77
5828B65n85J59L72m87J70j4P98q10O03n53j0K3j92J07J09K19j15L75l97j76N73
5849D34K44M3p85R64l28j113P38j76n77J025l52p85J172p09j56P53n68k24K83
5868a17l4O30m05m77L61J54k56P4O92q75L05o31O59O13p08L22n6p36J84K28J33
5889F0l49k10l03R47l91K46o17J02M25j087J432l39L06p04r69L16J838j373P15
5908D5k90PJ117O14j527l23J261j323K46J003m28o18r39J394M89j473O72j42k22
$$ y = [-583, 532, 178, 195, -319, -668, -312, -265, 422, -197, -116, 332, 366, 123, 326, 99, -751, 66, 143, 1124, 700, 354, -509, 426, -151, 1228, -822, -201, -564, -254, 588, 36, -472, -119, 293, 276, -127, -366, -319, 672, -234, 89, 518, -181, -425, 254, -374, 893, 136, 472, 144, 188, -363, 126, -275, -919, -482, 489, -182, -322, -104, -12, 265, -320, -161, 211, -276, -106, -120, 678, -132, 471, -82, -92, -69, -261, -154, -45, 174, 59, 434, 37, -139, 434, 678, 721, -64, 900, 572, -541, 197, 21, -556, 469, 117, -668, 504, -205, -361, 392, -176, -400, -117, -151, 479, 74, -403, -42, 112, -144, -70, 622, -253, 52, -579, 80, 693, -15, 307, 251, -485, -301, -73, 60, -289, -499, -802, 145, -246, 0, -617, -515, -90, -1177, 255, -84, 222, -482, -1451, -1135, 703, -670, 45, -245, -238, 879, 1493, -34, -357, 904, -419, -173, 830, 402, -216, -1155, 239, 728, -745, -73, -215, -437]
5927d37J863j971N77N27m46j74N10K96k11l38k27Q9K6k38P4L27m23N87m50o6r8
5948b03M12n66Q27q02R76k90m3N0p67J01P18j057K82J40k46N75M32M7j033J072
5968F25r44M1M60O43J83j835J202p56m5J97R6L72j75N66j326Q51K03K39j332L66
5988c69l2M13P6m88P16p10J137n85n57k17J504n82k93N38j066P05k03j2j48K62
6008H9P44l37l29P5l95K03k55P7l67M0L22M47J95m61n08k2J132q27k88N13n1N9
6030E6j22L38K40n39Q2J36N3P62p05j005M06O67n69N34p37K20k02j47P43O87j333
6051d35j41J551q24j93L55m28K04k92P74q81j33K97J68k44M67m74L81l57K1J570
6071A386j337j18q93NL12k62R39n40j82M90k60Q4L42p31J232n22l1O77q33L11
$$ y = [-437, 1426, -545, 32, 559, 113, -61, 449, 745, 534, 196, -31, 58, 84, -154, -80, 247, -176, 411, -39, -105, -203, 209, -357, 470, -332, 644, 354, 311, 361, -406, -305, 413, -644, -362, -222, -468, 107, 539, 586, -447, 625, -319, -278, 182, 825, 1008, -827, 375, -381, -426, -229, -133, 239, 64, 630, -696, 155, 358, 597, -735, -369, -401, 12, 88, -400, 316, -394, 743, 158, -399, -616, 888, 306, 13, 551, -515, 190, -13, -25, -173, 89, 833, 496, 167, 242, -153, 50, -205, -128, -495, -455, -133, 314, 509, 48, -460, -482, 650, -177, -465, 48, -3, 56, -66, 272, 512, -27, 55, 191, 244, 1006, 301, -704, -298, 369, -200, 334, -403, -183, -385, -532, 211, 898, -435, -576, 975, 151, -42, 313, -115, 89, -203, 571, -310, -443, -146, 22, -222, 245, -229, 152, -205, -184, 1386, 49, -69, -962, -957, -645, -907, 32, -508, -690, -200, -460, -376, -34, -765, 467, -55, -86, 591, -242, 69]
6091F9j311J233L8L97j148k57J444l48m81K38r9M6N75k88o54J247p77oN28o00
6111a54J67Q1O3K13p10k25M10l23Q87j18j53j810J124O56r31P87k85O36j232M92
6131d25J691q41k01N4L39m46o8N40q33L2l66M97l47l54J254m7n58o0Q81q55J71
6152E8k0J83q6k14Q3k46J89l4J53P4M28l15l24KM4j65P82o30O54r34O51q50J054
6175E37n25q82R75m46R2K6O52m05k0P65r73L22N95j425P19m29M08R8o09P64K65
6196E04j360P63l04l5k26O36M9j29N48q61J04M41m97M67O00j088l91J050o16M46
6216A01q17L10N6M67r8k46K23l36J251r27K09l4l81k84J082q55M53k56k97P90
6236D11R4k92l35L41nL90n64M9j47J36J73J36m63j77N95l84j72R0o23K96O86l91
$$ y = [69, -1242, -9, 29, 426, -722, -979, 465, 117, -364, -126, -225, -179, 396, 108, -546, 701, -76, -82, 446, -154, 13, 94, 157, 370, -340, -565, -155, -478, 409, 291, 138, -1672, -548, 108, -823, -36, -321, 315, -917, -425, 1266, 425, 224, 278, 617, 171, 103, 643, -190, -158, -524, -27, -374, -728, 526, 479, -79, -139, 742, -113, 58, 38, 221, 135, -79, 4, -242, -53, -87, 66, 140, 568, 253, -71, -69, -25, -190, 592, -38, 616, -318, 333, -517, 537, 12, -870, 105, -341, -249, -223, 429, 24, 4, 769, -204, 118, 713, -712, 7, -422, -14, 84, -525, 239, 504, -856, -93, -397, -432, -658, -22, 27, -102, 446, -415, -311, 130, -367, 100, 700, -388, -779, 271, -345, 101, -716, -406, -350, 117, 19, -227, -4, -340, 911, -16, 193, 159, -222, -506, 576, -279, 174, -82, -379, 411, 505, 213, -122, 219, 214, 604, 40, 89, -58, 78, 251, 387, -76, -253, 342, -42, -214, -124, -747, -451, 235, -156]
6258a56L08J50L03p84o3L62l32M81l68l27O84n82K46N31r70J007r58Q87m03Q42
6278H58n78j92L77o1k56l05J2K40l1N62j035P97L77p65L96n19j84N67P8m27J42
6299E3j86L77l03J19K52j71J7N11j99j7j56M18m42o9l9n47j93M84J33L55n05l28
6321d36J171l22o58K36K03J08j49j88q09P20J483j136k56M99J34j247P17N69o74
6340c5K14K65j340R95j117J062Q66q26P07j164l17K01J62K68n39L87L3j47O40
6359C15j04J27K26K4n08N00l81q58J132k06p9o49P29N7P2j31P78m92j90R3K8j31
6381C52r12N30K19r00J112l1j11p18L41O09N26j157n94J368o03M6K44m2p27p0
6401e18J244p86J07Q73p20M98n81J11j116M40r0Q93N40n88j42J07o67M15O17q16
$$ y = [-156, 152, 302, 605, -179, -242, 120, -212, 269, -99, -426, 258, -324, -78, 453, -517, 490, -468, 419, 16, 858, 280, 88, 465, 404, 148, -157, -145, 95, 64, 626, -409, 388, 765, 0, 396, -123, -307, 260, 338, -89, 53, -133, 244, -59, 60, 312, 141, 158, 669, 470, 453, 297, 715, 273, 204, 165, -382, -575, -91, 42, 397, -108, -436, 735, 413, -245, -9, 194, 302, 153, -35, -844, -124, 1359, 223, -33, 466, 600, -647, 70, 639, -35, 179, 444, -896, 99, -1018, 44, 910, 84, 791, -373, -690, -489, -327, -59, -598, -211, -178, -325, 315, 211, 338, 564, 588, 80, 580, 199, -659, 473, 267, 188, -461, 268, 325, 397, 266, 1044, 552, 362, 455, 483, 352, -560, -30, 189, -711, 401, 370, 259, -459, -118, 491, 1017, -140, -734, 634, 31, 77, 321, 279, -448, -518, 726, -60, 47, 920, 200, 698, 117, 228, -888, -448, -538, 355, 895, 307, 165, 272, -395, 20, 637, -179]
6421a79L90K27l26q35M18N90j082J239K21l91m00O29j53k46oo88P67J67N43j556
6441f71L82j0P98m05l87M75K65m7M43r46J16l31M97k48j67M84N29j086O50m17
6461g6qP55n05k24l9p28N05P86n03q6n1N77k32J55Nn93L98K00j47o80J270k25
6483E54l87m43J41L27J96P12j799N66l85J328r37j63N6L2L7J10N5lk43L23m36
6504c59N88K24n41J26m28K38J70J74j91l67P39n77L00M42m22M05m46m57K25K48
6524I1P18n94q18J56K83L10p50O00K4k51N01l33K09k22P90n86o14J34L37k26N54
6545C13o72K09O52j98K88n30Q8J24j47k3k2j26j00R15m56Jm88J63l30j23k9N98
6567A07m29N94k48j58J44K03L6o0o51L00K36m46N83o56K47m98K60P5K75K09J02
$$ y = [-179, 211, 438, 112, -723, -305, 285, -797, 442, 663, 272, -128, 501, 348, 102, 96, -592, 175, 342, 885, -671, -289, -299, 499, 94, -293, 182, 447, 400, 843, -103, 13, -318, 179, -69, -236, 248, 777, -309, 341, -76, -84, 671, 166, -58, -97, -825, -320, 466, -37, -123, -174, 403, 171, 326, 331, -262, 136, 336, 189, -491, 779, 554, 167, -276, -135, 192, 388, 1100, -699, -133, -518, 810, -127, -290, -234, -202, -165, -55, 0, -3, -246, 77, -359, 229, 453, -88, 38, -390, -152, 18, 192, 1, -366, 373, -204, 96, 538, 116, 521, 75, -382, -157, 91, 809, 215, -603, -447, -164, 146, -604, -4, 20, -231, 270, -63, 146, -76, 714, 128, -486, -352, -15, -241, 313, -359, -150, 502, 304, 592, 62, 150, 274, 127, 104, 82, -44, -144, 771, 315, 316, -172, -9, -339, -462, -491, 107, -322, 272, 24, -134, 10, 213, 249, 189, -462, -162, 74, -372, 211, -445, -198, -696, -436, -361, -86, 123, 225]
6588B25j9j89l06M74m70J11q9L17M03J86l03o77J12J36k60P05L27K21o20o89N45
6609A40L38k71l16R5N01k62k27O60r30J101j066Q36m96k17J040j011j12M20L16
6628E39L14m78k79L67r57O76Q9j366J231p4n00J030o70J02o10R54j55p47N5Q94
6648D15q96P8J84n3L04k8k80Q27n54k87P55o61K72j51l93N12K90m00j5K26K9m39
6670b65K10M59j75j95K6m38M95K22j94K26j12m28K92J81l72l45O28k71L33l46
6690f9N2N5K57R2o03N56k00m54O53k94K15k80m00N40K67m39j89K6O91n08N91n36
6712B3K41q1M1q71J19P87R7m64R0l52K52P9K46J33m68K03j06J44k6q83J000Q9
6734B93l08R56J4q75l60M40N14p18K39n33j45K31K67k31J3M53k41L15M6l19J3
$$ y = [225, 206, 17, -289, 185, -285, -174, -263, 54, 457, 643, 340, -337, -225, -89, -349, 356, 683, 904, 284, -405, 140, 478, 207, -109, -14, 487, 225, -2, 658, -272, 829, -237, 599, 103, -114, 926, -85, -197, 223, 539, 853, 375, 96, 463, -494, 182, 271, -1095, 136, 62, -438, 592, -78, 24, -586, 368, 213, -534, -479, 415, -481, -403, -219, -272, 32, 4, -276, 551, -3, -290, 465, -196, 76, -75, -468, 44, 334, -66, -81, 145, 174, -265, -55, 404, 229, 34, 60, -378, 117, 339, 145, 371, 259, -169, 123, 304, -68, -413, 215, -56, 277, -69, -17, 38, 295, 387, -216, 340, 140, -314, 339, 45, 260, -20, -420, 120, 387, -52, -241, -215, 476, -32, 559, 23, 264, 183, 224, -647, -528, 259, 356, -108, -18, -370, -118, -39, 207, 340, -128, 75, -31, 113, 87, -796, 204, 293, -15, 941, 955, 80, -280, 160, 674, -44, 195, -338, -483, -252, 15, -216, -203, 250, 9, 324, 370, 51, 64]
6755F4j90K2l93N86l07l31O03k23K30k06K11q3J59L10l60Q9l98J13o61Q40L28
6776D03n92M30l64L73m37O1j09M24l47K70n30R45p32k30R32n88Rm3j35L30k30
6797a60l65N06q2K25l65kJ23k18N91n73M38n16P04N7q23N14n78M66M60k78n59
6818d35P15n04M98K51r08J3K64k87J62L82j37k21O49n77k3L17j32K42j91K08J23
6839D09r86Q05M3J59l33m67K89L86J79n93l7K60L8o74K09N43m41J06j14R2L14
6860A87l82MJ95m9k39L65L90n96r8L15l67L84q63J276j208J49Q8J209J2j382O72
6881F2o26K87K82n09J8k49O39n65J197o72L10J2q68M54n82P79J37m30O2R74l37
6902C75m45j46m88K16O12j93N1n55N69P6Q0l29J106p16K58o24J22O5j75J93j42
$$ y = [64, -126, -104, -497, 89, -218, -549, 54, -169, 61, -145, 66, -17, 142, 452, 92, 181, -217, -104, -765, 75, 403, -189, 241, -123, 250, -187, -126, -235, 189, -158, 112, -418, 527, -205, -435, 497, -91, -82, -125, -260, 70, -160, -525, -19, -101, 124, -241, -243, -120, -338, 253, -320, 118, -398, 306, 363, -460, 54, -524, -58, 402, 124, -435, 280, -224, 274, 525, -383, -370, -106, -393, -231, 151, 14, -207, 442, -135, -158, 159, 27, 269, 78, 286, 409, -577, 228, 271, 430, 97, -370, -81, 305, 484, -109, -146, 114, 152, -522, -313, 230, -211, -105, -219, -127, 187, -195, -191, 4, -45, -284, 81, 471, -125, -223, 92, -275, 109, -754, 522, -686, -537, -449, 760, 772, -610, 62, -564, -277, 5, -504, -486, -735, -96, -661, 536, -136, 174, 186, -682, -228, -810, -31, 106, -324, -262, 712, 375, -70, -216, -704, -488, 124, -69, -18, -573, -4, 72, 152, -177, 929, 213, 471, -153, -31, 34, -141, 52, -90]
6923i0L49l4m12N17k84j41j54N53k28j20n4K83K13j27M4q7j52PL09j076P67n07
6945d24k16J180n18Q0q03J086k40l34J66N24o73L03l72J40k38L37O0R3K53k11
6965A93l33J49M3J3j16j01Q15r57k04P86J95o82M99l47j25l95R77q15J69K18m95
6986e13O29N91q68k94M09r7Q05k49k28M12n57K66l94o1Q35l68m8K22q72O44k88
7007b4q5J042j482N2P36P66j042j63q7J091q43p4j55P81q63K61j99j41M63J73
7027B07q1J00j86K05j161J072k80M49o62M26m07j94N65n63J153o01p21M98J39
7046d2q2l3K17j92N71j44j28j63l98M47j33L21j27M5L6J252j503k20N09L05q53
7067c15O57k97q7K12k49m85Q21r18O32N42j90j89j92j50M45o28l96O28K06J89
$$ y = [-90, 259, 225, -187, 330, 46, -95, -249, 304, 76, -44, -98, 185, 398, 271, 315, 228, 76, 83, 392, -684, 83, -424, -640, 540, 22, 102, -701, 385, 145, -189, -23, 501, -172, 131, -241, -101, -339, -2, 58, 151, 404, 193, -140, 9, 52, 65, -51, -152, 663, -294, -498, 288, 483, -199, 300, -47, -172, -567, 410, -405, -236, -18, -513, 116, 707, -161, -455, -46, -143, 662, 413, 185, 597, 40, 306, -88, -149, 686, 318, 270, 492, -380, 264, -24, -109, 933, -549, -497, 239, 1005, -37, -200, -287, 804, -39, -113, -268, 513, -350, -89, -288, -429, 34, 207, 126, 226, 40, 245, -916, 156, -124, 325, -337, 89, -318, -512, 53, -510, 643, 42, -679, -181, -42, -124, -157, 60, -132, 439, 295, 167, 4, -394, 53, -80, 241, 114, 159, 195, 1447, -56, -276, 233, 538, -315, 342, 45, -42, 170, -79, -564, 257, -661, -29, 513, 323, 134, -58, -208, 237, -391, -787, -159, 47, 236]
7087B36j114Q61J72m17O12m07k9O15p28L10J51l91M69o06j6Q24o49k86L59P2k95
7108b57m39R41M7j37k70Q0pj17J02M27k67L4J32p23L56K34k47K73l41K88o6J6
7130E9m42L72k43J75m10J18L47K41q3l58L40M23p71K07M05l3m50p9M54j0m06N0
7152i4j5O26p71J07Q42p42J63K40j95l07l0J13M90o55N13l86R0l30K87j26N0J31
7174AL44rp77M76j63O2K34k77M13o2j12j03k92MM56p89L76k32O84l66J02k26K4
7197b32O19n02m91N98M19j46M8q1l99K05L15Qk25p7J71l30L61m11J28M41o34Q28
7219F13q58M65J9l43j24L11l87J50R3J08K28l04J91L44k17J96k06m10j65q9k22
7240f07O96l73k89N27L37r71O45j5J4m6k19J31K15j14r3O4L57l80l58M38j35K02
$$ y = [236, -878, -17, 155, -262, 350, -57, -86, 529, -199, 111, 262, -129, 340, -266, -282, 542, -107, -393, -34, 38, -257, -696, 245, 292, 155, -115, -35, -42, -159, -57, 370, 103, 137, 269, -454, -98, 136, -111, 162, -179, 109, 43, 59, -383, -11, -254, -79, -489, -371, -24, 217, 134, -224, 116, 539, -232, -25, 380, 347, -103, -182, 272, 262, -144, -94, -109, 517, -254, -147, 695, -47, 116, 356, 161, -146, -176, -63, 427, -228, 285, -101, -11, -341, -54, -180, -130, 1, 345, 336, -441, 35, -128, -66, 168, -109, 304, 242, 130, 27, -265, -261, 195, -594, -218, -450, 234, -132, -30, -256, -232, 387, -115, -606, -8, 411, 265, 313, 232, -167, 38, 353, 361, 136, 59, 230, -100, 261, -150, -22, 419, -215, 613, -245, 220, 239, -104, -228, 83, -304, -154, -61, 47, 275, -29, 162, 506, 289, 485, 279, -131, -296, -385, -607, 89, -284, -573, -46, 291, -680, -35, -50, -36, -82, -301, -170, 45, -69, -162, -98, 259, -121, -479, -41, -176, 26]
7262B6o88J540j040Q9N05p89P92o14P1k48O22n75Q96o74m81R62N40n53j32l5k85
7283g1L31l57J63M2p8M10k88K30L4M20j59p72P03k01p90P78k72J20R6m62l63P92
7305C06r76L27O43q20M14K5l92j18J239q83M39j63K36m65p47N86rO66M5ro20l14
7327e90P26l51K60K27k37R81j044l5J60n39p2L78L43n16J19l75J018l94j85m27
7347e53R8K99P00k98o67R26j339J499p39k93Q96m5j105K043j332l68P53j645J317
7366A47q29J049m59l28M4J135n18j282J683L2j040M17l76j43M01k69N08n88J22
7385b94M48Nl28n04Q33r93M36Q42n72l75M74N82j333J222q95N09n43l4J283p40
7405B3m69J275q08o3M18m0K5j156M02K66K9k80J39J69k87N68n1J7J81J79m05m40
$$ y = [26, -662, 878, -162, -73, 432, -357, 435, -179, -108, -356, 266, -309, 587, -87, -568, 394, 934, 381, 249, 214, -71, 260, -97, 66, 108, 30, 440, 152, 382, 416, 836, 677, -95, 608, 407, -383, 395, 123, 243, 339, -123, -486, 306, -670, -343, 300, -520, -106, -81, -473, -591, 648, -235, 204, 41, 277, -188, -935, -349, -358, 308, 353, 344, -276, -590, 136, -215, 45, 272, 35, 1016, -28, -63, 97, -442, -514, -136, 207, -309, -190, -565, 453, 59, -126, -553, -455, -156, 544, 246, -421, 505, -834, 665, -74, -367, 529, 484, -621, 1422, 90, -278, 475, -1170, 147, -682, 367, -92, -420, -376, 759, 241, -1041, 642, 674, -366, 51, -325, -468, -67, -336, 172, -416, -294, 154, 159, -169, -673, 160, -833, -397, 445, -127, -502, -28, 554, -779, 443, -452, 57, -486, -520, 763, 23, -446, 829, 21, -42, 376, 336, 361, -795, -393, -127, -98, -378, -239, -70, -357, 211, 160, 177, 358, 537, 132, -308]
7427c08O9j17P13k70L7m84N59j06l99N97m66L37n65O44l53K41k08L42J12j077
7447g02O39jJ84p74M22n47R88m41q43R10k67N57l85M04m51O88l68K38k69K45N7
7468B84k69n42N18J5k87j48M59j04m29L79K64J86j36o95M85k1m59L41p1P49n06
7489A3j23m33O93K85n25M56p25r8M33m60j75L22J074o83m34O97l77L85r58J342
7509G09p46j583J661l6M75o9o59J068p85L60p46r3J245l54m13j098J914m15n02
7528f7k80n9L4On2J74l56M09L44k80K17N8m48j01N84K0p99L01M67M94K8q33J250
7551A111j324J028j150O23l81L18j24j035J151l35O64j51j032J050p09N97j42
7568A59o60L68j86K5K55L5m83J441j042k12n4L84J40o75j54Q43r68J098q0q50
$$ y = [-308, -239, -356, 357, 87, 124, -360, 199, 93, -306, 291, -175, 162, -403, 241, -112, 129, -79, 263, 375, -702, -63, -64, 120, -654, -232, -779, 209, -232, -1075, -165, -432, 125, -260, 144, -307, 381, 13, 251, -18, 227, 284, 15, -527, -9, 6, -281, -429, 30, -74, -503, -124, 140, 326, 190, -505, -20, -41, -500, -159, -230, 519, 13, -110, -543, 150, 435, -90, 366, -359, -457, -24, -484, -659, -337, 737, 54, -380, 317, -60, 325, -633, 709, -37, -1620, 41, 5, 480, 411, -248, 820, 35, 395, -351, -444, 801, 447, 34, -1064, 850, 435, -67, -347, -406, -372, -366, -418, -244, -600, -191, 153, -127, 90, 148, -300, -401, 183, 203, -596, -295, 172, 666, 694, -139, 1111, -213, 815, -335, 288, -93, 225, 101, -934, 217, -118, 546, 395, -637, 413, -296, 301, 159, -501, -133, -319, -294, -39, -4, -487, 954, -88, -300, -354, 30, 170, -505, -659, 184, -784, 314, 234, -616]
7588f16M09j44M62L64m86k66p1P17n46J65N4qj9l6m5M90m29m66L05m36Q65p4n66
7611c77N11N0j011Q39k01K83o96P7J265j180q55J315M43p19J18P72r65k30M43
7630a18j41O70n3K28K06q00K23Q2m01K01k37l0P5j93M48K36q75K12M02j70m48
7651d83K56K36o30L33j28N4M48n24L96L52o00L64l91K76j055J411N60m86o97Q76
7671E68j20o95L06k41m13P37m38J15O73n70J54O0l77P93q70J309j028K76P34n97
7691C76j003M74K3M3K82k69L94j09p19J40Q33o14J60J32k85q18pJ079m80l71M07
7712c32M92o73K60L73k26L4J00K09k15o61j12P04P97r26L49J10j68j58j035L68
7732g10O63j77k05N64j31K6j23j75N99l14M07n86j56nj93J87J26j04M50N9n13
$$ y = [-616, -207, -351, 111, 475, -11, -277, -348, 369, -177, -12, 42, 34, 15, -21, -66, 424, -5, -471, -166, -602, 263, 189, -377, 134, 184, -827, 12, -189, 94, -602, -525, 740, -440, -1295, 20, 463, -256, -138, 634, -331, -561, -118, -259, 411, 358, 586, 792, -8, 215, 297, -104, 97, -140, -170, -95, -288, 160, 396, -479, -267, 135, -35, -483, -227, 9, -621, -288, -416, -362, 86, -438, -42, 310, -290, 74, -317, -41, -1096, 315, 875, 389, -308, 568, 448, -247, 59, -182, -595, 142, -296, -181, 492, -78, 76, 136, -241, 552, -318, 991, -37, 239, 973, 376, -627, -153, -130, -87, 195, -74, 320, 211, -508, -368, 465, -149, 11, 143, -142, -960, -967, 112, -368, -739, -332, 160, -513, -253, 120, -106, -72, 28, 237, 22, -639, -751, -47, 750, -176, 173, 283, 115, -43, -1078, -710, -47, -224, -429, 135, 4, 30, -93, -268, 331, 17, 424, -162, -318, -323, -516, -329, -203, -307, 143, 202, -311]
7753c11J61J26J277j265n99Q66l7L12r57J75rj18O2Q63j908J461m85l32q7N10
7773b95M19p55N97N77k74m41N15l29r2K74J87j249J306n45l10M34j0o0J212j133
7793B8J06n7m49l85J029l29N45n99M51m78l67j97L84Q74l61K34K95n0j325L45
7813c06K76n30J82L83m74Q23j128J017q18O49m9k52O61o87L44L97l25l50K62m4
7833C1R29n96j75J12l52K21J97K72r53J139j044K80M82q29M98k62K86n52J93K03
7853H0m40J615r88p94J747k418J171L8P32j438P85N55j507J168K56m55p82K68
7871d07k84J185m1n56j09L59j94n31P38O0m82K05r6J61n18j78M65K81k76L08k76
7892a86R15p36m26M87n62J048p20M03q5m7r7J52l50L57J26K11J5m02O6j6k66P89
$$ y = [-311, -150, -24, 1253, -12, -611, 255, 218, 530, -427, -252, -261, -379, -317, 546, -1362, 99, -386, -718, -805, -295, 124, -631, -34, 543, 269, -172, 343, 14, -78, 196, 383, -866, 440, -105, -415, 19, 9, -51, 1161, 28, 134, 77, -372, -757, 272, -57, 488, -111, 340, -138, -505, -702, -318, 556, 195, 429, 724, 674, -651, -306, -30, -560, -378, 5, -469, 354, -774, 243, -575, 74, 25, -227, 434, -253, 91, 488, 163, -187, 75, 31, 960, 364, 189, 301, -51, 170, 367, 639, -314, 825, -219, 61, 543, -286, 212, -50, 236, -316, -123, 80, -360, 1255, 267, -527, 1220, -1198, -27, 11, 743, -695, 90, 645, -862, 306, 562, 107, -675, -407, -691, 494, 453, -103, -212, 147, -47, -578, 160, 220, -262, -57, -153, 8, -510, -688, -223, 58, -218, 90, -186, 729, -7, -433, 54, -508, 540, -180, 223, 138, 91, -6, 146, -204, 153, 279, 490, 505, 103, 169, 153, -113, 676]
7914F76q32k14O08j82J78l70l76O91q5J74j21Q8j043N9R48k26M30N9R9r18M17
7935F0l4o79N97J021j952Q34R2k92o45O96Q72p00J38L49l60o12L36L22N83m60
7955A66J39p31OJ243m23o11M3J224j089P32r45J64k1m24O94n72N61k6K89j85m11
7976a77M95r60M99N67q34K74k88OL11l0J85n0J50L09n71O7r6N57n41k0j05l1N10
7999B27k28q4J04P6M46r86K49L31q75P87n40N39L03q8n47K24n32L25J7K69k72
8020b55j39Q91n55J4j28R53p33L1L40o97L55O16j87o25Q4K56K83k80j13j63k5
8041g7J88M75j237J215j47l45K11q46k07R79k70l8R30r36r0K00O94m87L01o56
8061a43k10K78j1qn31j83R7J098L90j171L90J36r25Q14L36o61r1q9J478j494n42
$$ y = [676, -156, -370, 238, 56, 234, -136, -512, 179, 94, 268, 147, 235, -808, -749, 199, -27, 403, 462, 561, -357, 60, 26, -653, -56, 965, -987, -153, -61, -353, -998, -302, 570, -130, 8, 357, -3, -615, -279, 43, 626, 166, 305, -426, -420, 823, 400, -211, -168, 1056, -33, 699, -246, -82, -103, -527, 167, -405, 156, 130, 419, 234, -177, 318, -642, -143, 424, -410, -136, -424, -418, -107, -137, 48, -2, 148, 457, -114, -47, -143, 414, -127, -147, -252, -283, 227, -1, -85, 19, 95, 541, -445, -196, 135, -740, 47, -493, 46, 349, 261, -286, -62, -594, -269, -252, 17, -255, -394, 497, -58, -44, -172, 781, 48, 79, 419, -278, 77, 693, 506, -119, -35, 221, 504, 224, 111, -52, -77, 111, 586, -651, 564, 417, 72, 283, -563, -770, 209, -61, -99, 831, -105, -195, 5, 699, 212, 513, -143, -353, -75, -86, -94, -625, -808, -711, 387, 777, -394, -4, 132, -793, 21, 357, -304, -395, -484, 994, -500, -1042]
8082a042J908j077N43j350J440k73L04k7j10q16P01p41R02N61j448Q52r26J731
8100A132o04m31l92O31j56o81P10k4n01L07J60J40J56P1q92M84Q52j84k13n01
8120F4L45r46N47L09o69J75M37n35M55p78P14J068j180k13j54J098j273p1O4K56
8140b87K40n05J014k13K9n18qn62Q24k00n0j24m16J104m76j05P40r4m26N5J71
8161A93j123J414m82Q67k98m91N90q24l67M97L53k78J9l88P70m72n36l0J016J4
8181D44q54O00M17r56m42L48P38j05k68P60
$$ y = [-1042, 866, -211, 332, -1018, 422, 149, 453, 426, 316, -500, 201, -540, 362, 923, -525, 327, -599, 1132, 528, 97, -295, 336, 180, -501, 209, 185, -316, -9, 151, 291, 447, 518, -374, 110, 962, 778, 565, 64, 409, -537, 10, 319, -350, -175, 262, -273, 182, -596, 118, 1186, 6, -207, -361, 737, -536, -607, -543, -287, -47, -552, 462, 249, 278, -240, -248, -810, 14, -186, -236, -360, -776, 328, -148, -253, 487, 393, -33, 22, 193, -930, 484, 2, 869, 571, 80, 670, -154, -521, -24, 329, 51, 70, -318, 452, -20, -556, -586, 430, 444, -410, 190, 607, -349, -791, -443, 295, 190, -78, 682]
8191F82
$$ Imaginary data points
##PAGE= N=2
##DATA TABLE= (X++(I..I)), XYDATA
0@%%%%%%%%%%%%%%m0Q0q0Q0q0J20j60J60k00K40k80L21l61M40n20O00o80P61q73
33d72R94j121J273j430J600j789K000k231K479k755L061l385L744m138M558n021
49b633N534o093O710p397Q160r010R965j1041J2272j3690J5344j7311J9690k2648
63a2148K6427l1467L8583m9477O8564j12249M24075K23816j01503N0616j73528
74C51709L1326j48594j4077p594o0628k6726M0988n0154Q9162q2967j4212N0637
86A58870p7957j3599p621l2118R469q602l1554J5121m540k5596L8972n0284M3526
99A4087R35k3219L4719j1727j1370K6867p171k9242K5517n3890J6706j190l9283
112e8261O0026k1834K7348K4971j1617K7081K6904k7797R563N925l9508K0700
$$ y = [0, 0, 0, 0, 0, 0, 0, 0, 0, 0, 0, 0, 0, 0, 0, -40, 40, -40, 40, -40, 80, -80, 80, -120, 120, -160, 161, -200, 240, -280, 320, -360, 401, -472, 522, -599, 674, -756, 844, -945, 1055, -1176, 1303, -1452, 1609, -1776, 1968, -2170, 2388, -2633, 2901, -3192, 3518, -3879, 4281, -4729, 5236, -5805, 6467, -7223, 8121, -9190, 10500, -12148, 14279, -17188, 21395, -28082, 40482, -71767, 352308, 576124, 474621, 525237, 351709, 383035, 234441, 220364, 212770, 152142, 125416, 166404, 116250, 205412, 122445, 108233, 158870, 80913, 67314, 59693, 27575, 37044, 28442, -3112, 12009, 7469, -18127, 20845, -29439, 14087, 15022, -8197, 26522, 14795, 3425, 30292, 23121, -6121, 19396, -34494, -17788, -18978, -58261, 1765, -20069, 7279, 32250, 20633, 47714, 74618, 46821, 56384, 62309, 22801, 43501]
124D3501m8653R265J0621k1693K5714k314J7249J0639O591j2006L1737j4729o920
137D9002J1058l7154J9690k7705o720J3821n087p011J0930q046m270K4564l8960
150e888L0272j1523j9803J1984l1871J2882p806j8874L150J1610k2264J8317l060
163c2874l476L7598k7884K6781n14p102O502k2129m789J940r426j6524K2972j9106
177d8031J8844N805m655L4120j3315Q206n744p354q911j64j6204Q449R361j9799
191c9392L5926q264J6171J1253n607J5450q160n323p785L485j4014J5487j3282
204d055J1402K1288j7687K0173o478R903r48o028j996M076n686r873J3399j5526
218A1964J9457j3111o421O651j3625p20q759K910n298J0865j3747J4093M063j0016
$$ y = [43501, -5152, 4113, 14734, -6959, 18755, 16441, 33690, 44329, 50920, 38914, 70651, 55922, 49002, 60060, 22906, 42596, 14891, 8171, 21992, 16905, 9894, 20824, 12778, 8508, 33072, -5888, 24384, 12861, -6942, 5042, -26829, -13947, -21753, -40627, -37477, -25867, -48131, -29814, -32874, -36350, 1248, -26636, 145, -369, -7471, -969, -23098, -27887, -25947, -35373, -51897, -28925, -48031, -29187, -23382, -28037, 6083, -7232, 974, -4770, -12124, -21035, -21199, -37403, -28954, -19593, -39392, -3466, -11730, 4441, 15694, 10087, 25537, 17377, 12054, 4269, 7754, -6260, 9227, -4055, 7347, 28635, 10948, 31121, 24643, 34546, 33598, 27570, 25574, 29650, 23964, 14091, 27490, 11964, 31421, 18310, 11889, 18540, 4915, 4195, -4564, -1654, -6952, 3913, -9834, 4259, 8322, -1694]
232a694J6664j9229P803j0135j0951k399l19n183N274J2821m140K6526j7568J3888
246A1358M774j9609O048j4119k766p313m168p116J9927j741Q483J1106q185K5488
260B2167k2719J32N220j1446j790k191l588L614J2406j6230K1993l544K114O730
274A2868j7268J7964j1116k868M313M107l188R946o295j173J5899k2475J4762
287A5476r444j393L900j0663J0314K576O68j037J1262j3477R685j1599p440J1742
301A0570k2356R434n822L636L728j290J333J0257j8j2300J3086k0101P336q300
315a0807r900J1561n585M377o74Q085k216R335r517L262L102j6126Q410j3386
329b0079R290l062k295O887M379k60k08Q157j0762J4124j2420J348Q636r151R088
$$ y = [-1694, 14970, -4259, 3544, -6591, -17542, -19941, -20260, -25443, -20169, -7348, -11488, 15038, -2530, 11358, 16132, -3477, 2571, -11548, -14314, -21627, -25795, -32911, -12984, -14725, -6242, 4864, -3321, 22167, -552, -420, 4800, -6646, -8436, -10627, -14215, -10601, 1805, -14425, 7568, 4024, 6138, 12868, -4400, 13564, 2448, -420, 3893, 8000, 4812, 14758, 8463, 7290, 23189, 714, 15476, 6032, 4639, 8539, -2124, 8190, 10766, 11434, 10397, 21659, 8182, 17867, 6268, -1172, 10570, -11786, -2352, -8174, -4538, -810, -2100, -767, 9490, 9472, -2828, 10258, -9843, -2507, -10807, -20707, -9146, -14731, -10354, -11028, -2943, -5159, 4176, -5341, -2079, 1023, -15103, -6693, -20079, -10789, -13851, -16146, -9259, -4880, -5140, -5348, 2809, -7953, 6171, -6249, -4901, 3735, -5416, 3672]
344C672o389R140J806J957o617J1717n643p705Q254j3175J3940q554J192O969
358A0564k20K558k182K378k683N436j7272Q078k411m386P544p422J3424l740K360
373A2026k53J422m953k079n797o135Q643j8411J0859m58O3O775m535O059j708
388A518j158q898O223p744K647j694m048J4258j1085P678j366J341k418n267q69
403a0882k118L064q132J1209l166R779J31k329J0325o583K047p150M080m824K510
418b039l386K641Q685p502J0331n425M913l053m893j028q55N06p099P991o847
433g060Q806m242r2Q480o583M713m710L467m340M417o718L269L992o948P457q020
449d112P972o030k533J136l354o37l055K361n148J1025q174O231O783n149O695
$$ y = [3672, -2717, 6423, 8229, 10186, 3569, 15286, 9643, 1938, 10192, -2983, 10957, 2403, 3595, 10564, 10344, 12902, 10720, 13098, 10415, 15851, -1421, 6657, 4246, -140, 7404, -18, 13406, 9666, 12026, 11773, 13195, 8242, 6163, 366, -5769, 2874, -15537, -4678, -5136, -5073, 1702, -2833, 3226, 1518, 360, -8538, -2315, -10059, -7412, -9106, -13154, 1104, -9981, -2303, -3669, -2328, -4746, -10013, -10882, -13000, -9936, -18068, -6859, -10025, -246, -115, -2444, 7881, 1298, 3345, -3805, 275, -4549, -2039, -5425, -2784, 5901, -1601, 8730, 3305, 8218, 5165, 272, -756, -1611, -1105, -8204, -213, -7060, 1746, -2496, -2588, 5892, -691, 4022, -688, 2779, -1561, 2856, -3862, -593, 3399, -3549, 3908, -4112, 3860, -2170, -4703, -3567, -6921, -7558, -10613, -8252, -13400, -2375, -10549, -4318, 2465, -2684, 4011]
464D011q451N891l620l842k495K815l469M21M349o151J5029j0121L653J934n155
479e201L454q475K565r2L062n309R615j435L777L531q312J2848q379j44k96j00
495A109J086K6J444R08P155r547P979o050M99J422r873P732j973N68j095P989
511I379k837N676k916k185O853j2351K729o585J754j12n533J993K221N58m561
526e917P910p956O238m136n731P505n791L990l791N509J155K916l845K537L369
541C962r728N889p918M855l655m625M814r26K321l800M279k933O318q620O77M144
557d946o993P236p121O273J443N74q56M035j364k184K996p776Q646q501L137L215
573b186l750O116m361L487q45K681o737N036k419k27L426o060J1901o486J832
$$ y = [4011, -4440, 1451, -2169, -6011, -8506, -5691, -9160, -8739, -4390, -10541, 4488, -5633, -1980, -46, -5201, -1747, -10222, -7657, -7749, -4687, -9996, -381, -1816, 1961, 5492, -2820, 10028, 1649, 1505, 1209, 1109, 2195, 2221, 3665, 4573, 11728, 2181, 10160, 4110, 4609, 6031, -3842, 3890, 1917, 2485, 1390, 9379, 6542, 12218, 9302, 7117, 13970, 1619, 4348, -2237, -483, -595, -6128, -4135, -1914, -1356, -5917, 1993, -5963, 275, -3861, -9592, -2087, -7878, -3888, -7679, -2170, -1015, 1901, -1944, 593, 3962, -5766, 123, -7795, -2940, -6595, -11220, -6406, -7332, -5011, -8811, -4532, -7465, -1147, -9767, -9090, -4946, -11939, -4703, -11824, -5551, -4108, -3534, -4390, -355, -1719, -3903, -907, -8683, -37, -8538, -5401, -2186, -5936, 180, -4181, -694, -1539, 1142, -5595, -559, -2978, -3205, 221, -5839, 6062, -424, 1408]
588A408J427j934M64l676q92l752M451r320N783o0K516L402n452Q317k849J596
604A429l273J496j536L58j423j692P860o371P233l928J934K222o140J733k789
619b887K103n047L865k861N576k699j689P386n501L458m933K054j444k29J417
634a431q62N362k196M985k784O121k921k810K520n125J918n250M811k552M574
649D360r93J572M848l438L976n368L566l250j986j103m8J948l446M607m185P427
665H487m078j582M215n841K232m869L476j725L151l486L331K489k872L313n952
680B89N800m062j945j179k34K003k148L232k347P029n825J498j140k770K434q026
696g391L142k228J304j867L574K47K997J567n416O778n733J086k168n25J936k950
$$ y = [1408, 2835, 901, 1365, -2311, -3203, -6955, -2504, -11824, -6041, -6101, -3585, -183, -5635, 2682, -167, 1429, -1844, -348, -1884, -1526, -2949, -4641, 3219, -3152, 4081, 153, 2087, 4309, -1831, -98, -2887, -784, -5831, -1966, -4827, 749, -1950, -3639, 3747, -1754, 1704, -3229, -1175, -2619, -2848, -1431, -2293, 3069, 873, 5858, 3074, 9195, 6274, 3464, 5984, 859, 2777, -2473, 2338, -214, 4360, 3367, 4939, 9787, 6349, 10325, 4957, 8523, 5273, 3287, 2184, 2136, 4084, 638, 5245, 1060, 8487, 4409, 2827, 7042, 1201, 3433, -1436, 2040, 315, 3466, -20, 3311, 5800, 2928, 6241, 289, 6089, 2027, 82, -1097, -1331, 672, -1476, 1756, -591, 6438, 613, 2111, 971, -1799, 635, -7391, -4249, -6477, -5173, -7040, -3466, -3219, -222, 1345, -4071, 2707, -3026, -1940, -4108, -4633, -2697, -5647]
712e647L632j173N053k375M736j799J705k44m903N008m198K553l488L851R50L02
728C963J892j838M592n316L314l660J428P14l886L215q12L276m257L404k282K617
744F364l233l376M808n961L717m018L099m94L46q4q39L269o555M814o474L429
760a188k427k479K881j712L585l313L876j643K594l991K44L006o153M229o251
775h742N252j138l97J346J636J829k246K120l291O167m866L97K290j884M019l800
791a308L576l58M23j884J324r5r92J489m496P260l827J921J382j047M028m187
807C209J794k866L146l855J379o78J634K218n311O949l853J222k452n53k93j324
823C66j477k772M717m223K967k315K083K255m481L711l414K243l110J484j435
$$ y = [-5647, -2015, -3188, 1865, -510, 4226, 2427, 4132, 3888, -1015, 3993, -205, 2348, -1140, 2711, 3661, 3963, 5855, 4017, 8609, 3293, 6607, 2947, 4375, 5089, 1203, 4418, 3606, 6882, 2625, 6029, 3747, 6364, 3131, -245, 4563, -1398, 2319, -1699, 1400, 906, 1252, 1168, 329, 3598, -2957, 1857, -4617, -1188, -3615, -6094, -3213, -4925, -1340, -4653, -777, -2420, 174, -3817, -3573, -567, -6720, -2491, -8742, -3490, -4628, -5025, -3679, -2043, -214, -2460, -340, -3631, 2536, -2330, -1933, 357, -1527, 2492, -1308, 2268, 1910, 2333, 449, 1773, 1678, 686, 2175, -2321, 4939, 1112, 3033, 4415, 3368, 7396, 3209, 5003, 2137, 5283, 1428, 2807, 2129, 3763, 5981, 670, 7619, 3766, 4988, 2536, 1983, 1690, 366, -1111, -3883, 834, -3389, -422, -2737, -654, 1601, -2880, 831, -2583, -340, -3450, -1966, -3401]
838c401J038M50k639N342l787K809l810K902l41k205J75j059L865m326L926k307
854c368L220l40j149K440k648K893m069J750o90K152k017L51L173k713N268m842
870e89K707k73j183N20j141L981k627K927k133M035j178n91L126l433K988m532
886B604K271k332R41j448N38J524j934L095n345M277l273j717j3k108J559l366
902d727K716j156L016l148J523J695j104K082n248L737k019Q95j807O50K009j191
918b077J327k714N711l645N57n16p42K514l390L422j022K838l068J425r44J132
934H08L18m133M898m029K239j876Q03J902MR26r99M204n042L059l116J850N47
951B363l195L742j690L409k654K422j89J845r51k479M269n470K686l118R32P51
$$ y = [-3401, -2363, -1913, -4552, 790, -2997, -188, -3998, -1096, -1437, -3642, -3467, -4526, -661, -4987, -1061, -3368, -148, -488, -1637, 803, -1845, 1048, -3021, -1271, -1961, 191, -1826, -1475, 1698, -1015, 4253, -589, 2118, 1845, 662, 1182, 41, 4022, 1395, 4322, 2189, 6224, 5046, 4455, 7581, 4148, 7136, 2604, 4875, 2543, 3484, 2036, 2574, 4098, 2164, 5259, -86, 4191, 918, -799, -812, -2920, -1361, -4727, -2011, -3167, -151, -3299, -1776, -81, -1185, 897, -4351, -614, -2633, -1738, -3545, -2895, -886, -2077, -750, -3464, 2247, -1398, -841, -1357, -2099, 415, -2975, 447, -575, 2263, -805, 620, -324, 808, 1126, -3007, 1891, -2138, 101, -1775, -972, 930, 934, 1860, 861, 5065, 23, 3082, -34, 1816, 2363, -832, 2910, 1220, 4629, 1975, 4397, 4208, 6053, 5102, 2623, 6892, 1422, 4108, 990, 1922, 2673]
967B673j920J021o18K017k631J806l537L420k038k090L119l338M031l153J448
982B10J20P17k373p55J635l233K564m353L870r93j474K114o91K201j879J348k254
999c226L403l745J69M59j719M194n099N223k50n52L95k91M56p79R80l309N020
1016A329l824J277Q83n24M171l632K386o49R65j400Q64j158R46K622m413N372
1032E215j943J465j343q12J458k426K59k619K988k985K055m65K14K261l710L471
1048C083k869J870k223m90K98o0k26j913M220l478L293k940O22P22k982J793k014
1065c294J498k169J901j775K713Qk204L145l481L011m139P57R21K32p45M32K295
1082h94j993L355l828L432r86p25J424j912J647k329J939p74K988o97M92J775
$$ y = [2673, 753, 1774, 1156, 3173, 542, 2348, -1189, 2231, 193, -1897, 1222, -2116, 1915, -1238, 210, 330, 1047, -1326, -2081, -446, -3679, -1115, -5468, -1598, -2591, -4065, -1951, -2642, -441, -2320, -972, -3226, 177, -3568, -3399, -2940, -4659, -465, -5564, -341, -591, -1143, -748, -1039, -583, -1362, -382, -3691, 1329, -2495, -1218, -335, -859, 3312, -320, 2066, 1417, 2382, 982, 1846, 688, 1634, 4256, -157, 5215, 3272, 4737, 3394, 2582, 4040, 1614, 1873, -746, 2242, -743, 1312, 847, 1061, 3322, -388, 3083, 214, 2084, -139, -629, -331, -391, -617, -2530, 1690, -1788, 1505, -1435, -813, -91, -3073, -1280, -3294, -1796, -3965, -2064, -3839, -1126, -1118, -3322, -177, -3658, -647, -4786, -4029, -3108, -2876, -3621, -3189, -894, -2887, 468, -3360, 72, -914, -1639, -215, -2127, -480, -2809, -870, -1644, 1344, 647, 1139, 2914]
1098B914k844L567l432K391L22j768N68m9J786p67P62j311J846j953R06L09k420
1115H27K550k001l6k6K061k911M70O57j062K302l969L162k126Q8j426p7R33j567
1133b151Q19j373L626j702P80l084q61L448n998L666k14J289p63n8O14o83J620
1150a025k120K240k907J254r76J80K623j127N54q40L401k630J531j010N09Q99
1166E56k979K776k072K843j209J368J54J143k80j745L188l001J545j373Q68J066
1182B848j770J483n24K073l017K493j867J183j124j982K725k379K253k268J299
1197A426M18m42R8p75O74k306J690l211K502q92j242J134p72K480k979J717r76
1214a456J83j114n42J403k224K965l782K460J82n12M14m27J593j673J180k463
$$ y = [2914, 70, 3637, 205, 2596, 2918, 1150, 1718, 1669, 3455, 2688, 3450, 2139, 3985, 2032, 2938, 3247, 827, 3377, 1376, 1340, 1314, 3375, 464, 934, 1591, 529, 2831, -1138, 2024, -102, -14, -1440, -1517, -584, -2151, -1332, -2705, 921, -781, -1, -3085, -3946, -498, -6496, -2830, -3044, -1755, -2518, -2576, -1962, -2645, -1025, -3145, -905, -3812, -2558, -3534, -3354, -731, -1858, -1304, -2144, 1257, -1373, 158, -852, -343, 556, -2423, 353, -1719, 1124, -85, 1283, 1437, 2580, 2300, 555, 3743, 742, 2287, 914, 1782, 2848, 1078, 2561, 2037, 4110, 1093, 3586, 1719, 2902, 1778, -204, 2521, 142, 2395, 127, 1426, 1844, 1402, 1500, 725, 1399, -907, 783, -2428, 74, -818, -2060, -926, -1698, 782, -2197, -480, -1456, -1273, -2387, -2929, -1526, -3750, -785, -4567, -2107, -1925, -2437, -2023, -2450, -857, -2530, -1350, -3813]
1230c813L243j547L1J281j185L280l195K350q07J196j497k00N84O8J180k763M674
1247B880k140J792p24p8J103j156k34j449L394l105J302l19j54K283k728K933
1263C600j945J221j381o2N32J80j5l084L888k705K223j538P7J092r90p1k170K772
1281A624k462J522j541n48J584k360K665k024J862j555O31L5j185n16o77J744
1297a201j908K005j805J157J066j590J402j657K244j723N55K08R55k00r92J800
1313C16j549K376k573J843k14j79k71n54K501j038J774k343K898m86n88j74j345
1330C94K383k885J615m67N50j71l32J410j180K172l251K148j907J15l15j272K108
1347A115k014J501k240K629j546Q36n39p29K011l247J756j812J052o75k56Q90
$$ y = [-3813, -570, -2117, -2086, -805, -1990, 1290, -1905, 445, -362, 834, -663, -863, -279, -211, 969, -1794, 2880, 740, 2532, 1808, 1730, 2833, 1677, 1443, -6, 3388, 283, 1585, 1266, 1112, 3395, 667, 3600, 1655, 2876, 1495, 1433, 1965, 2145, 2130, -954, 2934, 229, 2452, 914, 991, 2083, 1093, 1022, -1148, 1624, -838, 684, -857, -1405, 179, -2181, 484, -1540, 322, -1233, -602, -567, -1752, -2268, -2945, -1201, -3109, -1104, -2909, -1752, -686, -2276, -874, -2531, -287, -2010, -1455, -1247, -292, -492, -1484, 316, -1233, 1143, -1430, 413, 199, 20, -251, -805, 1696, 658, 2432, 89, 2987, 2501, 1913, 1739, 394, 2777, -108, 1507, 1040, 1590, 1419, 1087, 2497, 1317, 3489, 238, 2386, 479, 594, 279, -993, 1115, -899, 602, -1638, 991, -555, 281, -258, -987, 1024, -2223, -467, -2279, -1227, -1902, -2158, -1268]
1363a268j123J382k565K904k261J116P7q44J831j050R94j095J837j832J58j64
1379a903J36R04k741K700j605J808j310J410R77KL94j724K216k178J673k147N91
1396g97J106j207J640j455K130n48J425r38P07L72j599J128q50J506j968Q44O52
1413B148j77m4k94K056j889J051j479J530l70r64J194j804J921j189L45q93L45
1430A487J48j552J550j615J995k643Q93m6L05j0j646J501j806Q34j721J601j005
1447a730l73J16l91K341k354J871o99P09N6n29J045j944R70j041K487o39N47J356
1465A798j199K198k626J487r32J513k013l08L07Q64J351k022J768j256K499j480
1481A949m31R59j258L18j498K068j273Q80q57J21R70j232J056j704J413r79L98
$$ y = [-1268, -2391, -1009, -3574, -670, -2931, -1815, -1738, -2582, -751, -1801, -807, -1902, -65, -1897, -1739, -1903, -1767, -863, -3604, -904, -2509, -701, -2011, -601, 376, 378, 772, -952, 1264, -914, 759, -1388, -797, 309, -898, 742, -713, 1417, 869, 2294, 1356, 2063, 2435, 836, 1964, 1114, 2620, 652, 1496, 2148, 1971, 1927, 1633, 3689, 1800, 2851, 1372, 2902, 2532, 1568, 2762, 958, 2879, 1690, 2035, 1142, 1487, 1635, 83, 1633, 18, 2013, -630, 263, 217, 522, 512, -1134, 367, -1439, -605, -2326, -725, -1730, -2103, -1987, -2378, -37, -2391, -520, -1219, -510, -454, -983, 62, -1882, -912, -1953, 534, -105, 442, 1798, 599, 2797, 171, 1658, 726, 2239, 226, -82, 225, 1089, 2440, 418, 2186, 930, 3429, 1949, 1518, 2477, 1219, 1537, 39, 2107, 834, 1714, 857, 978, 1948, 716, 1772, 68, 1481, 502, 900]
1498I00o28J65L64j456K452k106N86r11J63M87j489P52r50J756j952J569j388
1515a686J306o37j016J191j374J924k617Q52M86j12j13k43R76j096K340k053J229
1532f43J0p31Q69j436J712j261R45j180J721j36Q7R99j304J794j579J230j418
1549c21J480o21r35J891p21J481k139J828j189Q14K52j561J987j130P36p18M23
1566A557k37m20Q37j518J577k242J736o03N49j673J209m17n68J686j786J236j083
1583a60L34o60j082J470j723R06j087J544q11n7P40n63N27j324J083j560J204
1600a219j295N08J451p09P37j497J396l43N13o03o20J474r23Q28m10J800k102
1617a014J141J179o99R77j543J266j237J420j232O81l35M09J099j431J302j217
$$ y = [900, 272, 437, 801, -655, 1797, -309, 277, -634, -471, 16, -1473, -721, -1671, 85, -1867, -298, -1686, -380, -1017, -2033, -842, -2216, -292, -2909, -2057, -1571, -1683, -1796, -2039, -1063, -2159, 181, -1872, -643, -633, -1364, -495, -1931, -219, -1480, -535, -1715, 6, -130, -43, 956, -348, 1446, -133, 1097, -321, 1159, 538, -397, 1494, 773, 2254, 115, 1943, 754, 1568, 1820, 259, 2246, 1116, 1852, 1134, 1557, 1320, 900, 1737, 219, 1796, -446, 1290, 687, 1236, -437, 772, 355, -213, 1473, -313, 923, -160, 174, -486, -1568, -98, -1821, -915, -2002, -458, -1269, -1326, -586, -1149, -622, -1946, -863, -2423, -1219, -2514, -2006, -555, -1264, -527, -2024, -628, -971, -458, -1061, -1681, -207, -1130, -302, -712, 1088, -1014, 127, 1306, 607, 1584, 41, 1307, 70, 1490, 258, 939, 604, 1013, 2112, 681, 1983, 766]
1633G66J197q69N47n72j66Q12j253K056j655Q10n19L37l68j224J187r22J220j383
1651AN61j278M78P86j374J584j347P68p68O28p27j090J151j333J689j753J060
1668i64q72O69m78m16J239j242P99j246J579k23k36N3m05J759j487P47q19J372
1686a71q76M54l6k46J170j241J582j301J624q71M6R95o63R54q69M79M53j69j21
1705A193k38J568j664Q48q40J540r93o6L03m60R15j602J283q91J181j564n62J309
1723A260j317Q57r86L37J71m55o31P53M3n42O54j301N67j251M75M43j96o28k89
1742b036J076o3k7o26N6J203p32j03n07J536r40J09l34J105j09k87J216j064J377
1761H50j463N85j14j58L38j308J807m17O64q79O05k91q42J134q89J025j356J483
$$ y = [766, 1963, 1094, 1641, 1069, 903, 1715, 462, 2518, 863, 1673, 1154, 1491, 1123, -101, 1086, 164, 1384, 1, 562, -716, -238, 548, -826, 758, -589, 179, -589, 39, -688, -1778, -627, -1960, -271, -2024, -964, -1836, -1167, -1645, -2061, -822, -2064, -1265, -2511, -932, -1155, -1391, -1338, -1743, 16, -1471, -724, -1543, -171, -1047, -593, -629, -875, 295, -946, 636, -665, 959, 88, 134, 1129, 466, 1420, 551, 1030, 1483, 1314, 1193, 955, 2523, 859, 1707, 867, 2407, 1414, 1348, 1651, 1191, 2106, 504, 1787, 896, 2077, 513, -49, 1260, -57, 800, -186, 151, 322, -133, -764, -11, 32, -510, 144, -1157, -590, -1841, -1366, -923, -1119, -1747, -2036, -960, -1023, -1050, -1676, -1620, -417, -1149, -1252, -1759, -223, -1163, -1054, -1388, -283, -392, -679, 537, -527, 850, -613, -28, -142, -300, 38, -1270, 537, 120, 784, -95, 510, 219, -623, 511, -378, 647, -709, 774]
1779G74j364J060l16l64N57k28Q65r09J84k60L74L60j096J078r94J107j208J291
1797I11n10o2k16j171J387j561J735j817K028j156m14m31L21J024j711J133j329
1814a839R24r40l57J459j094K05n15J632p91k19M0P38r75k39P30q17J893j367
1832a532J8P59l96O01l3l09o2J155j117L44N79l93J556j823K244l62Q57j403R35
1851A618J16j334J587j392J245n21J10M35j02P36j662J019p57K3q51N28P3J88
1869A059L35j284J382j117j65J55L3j52m87K93m07J764j657j2J127j383P58j742
1887a500J679j604N85k24R0k53O65k60p21K469k307Q98j197J123j63j81M29q07
1905a279J276j455J315j92O23j046o02K026j032L77k88P89m13Q55j227O29J143
$$ y = [774, -590, 470, 154, -210, 347, 119, 984, 75, 259, -1, 373, 733, -363, 715, -279, 828, -380, 911, 401, 339, 123, -1048, 339, -1222, 513, -1304, 724, -432, -846, -1277, -956, 68, -1643, -510, -1839, -915, -1855, -2212, -753, -1847, -1642, -2157, -525, -1316, -1535, -1495, -757, -1732, -1971, -1241, -2058, -165, -1532, -1514, -755, -1151, -550, -583, -892, -954, 201, -916, -572, 7, -386, 1170, -653, 1591, 1229, 2086, 683, 1618, 1734, 400, 1987, 595, 1840, 1319, 1429, 1864, 1762, 2498, 836, 1855, 1098, 1121, 270, 798, 871, 1059, 1394, 110, 1492, 375, 210, 365, 398, 246, -241, 52, -355, 1409, -248, -260, 867, -516, 242, -1500, 179, -1425, -840, -1064, -974, -1227, -562, -822, -1543, 926, -1381, -483, -1680, -557, -720, -901, -472, -1279, -3, -1458, -143, -335, 288, -758, -1360, 666, -366, 11, -277, 512, 99, 954, -273, 356, 1499]
1922A499j609J741j962K518j234m4P96j639J490j778J547j2M38j493R96k83k09
1939G62J832k440N72j226J855k37j105P57j085J413l63M86j248j11P22j11Q57
1956A330j781K971k932m11J017j264J20O65M16j091J091k453J191k24M25R9N2
1973g79O49j113J249k95J36l10L79K86r3O46j244O15n93m75J774l08N73m97O54
1992A254q19J06L5K33P55n0K37o12K86l15L26j0l22j72q1L85r18P04n56J207j91
2013A482k06l55k54P51r06Q13j201J014m3p14P89n40P45j167J516j905m39P56
2031A36o35J058r91Q95j298L17K75q65J184o51O21j810J072p36N74r2J51K36k47
2050h06J14o5Q93j873J706j002Q59O97j146J230k063K756j040M94j171J168N16
$$ y = [1499, -110, 1631, -331, 2187, 953, 909, 1705, 66, 1556, -222, 1325, 1313, 1751, 258, 1254, 971, 762, 2594, 154, 726, -500, 1355, 1118, 13, 770, -315, 1098, 735, 1221, -27, -138, 584, 473, 1330, -451, 2520, -412, -823, 194, -1070, -950, -285, 131, -960, 131, -2322, -1131, -1355, -930, -831, -779, -130, -1243, 6, -289, -153, -463, -84, 202, 109, 755, -489, 126, -467, -942, 832, 524, 1097, 600, 1254, 435, 541, 576, 809, 1564, 1514, 1751, 1139, 1425, 1110, 1436, 1426, 1104, 932, 851, 1236, 318, 1022, 466, 1673, 1482, 1276, 921, 667, 1418, 512, 1325, 124, 1138, 1095, 381, 1170, 630, 1375, 208, 1724, -181, -620, 136, -499, 559, -432, 463, -835, -518, -243, -1108, 76, -575, 46, -1764, -692, -1428, -854, -946, -795, -559, -806, -692, -757, 136, -1737, -31, -1033, -174, 523, -623, 607, -1456, 1300, 260, 754, -417, 751, 1267]
2067A267j137J139j196J082j087L61N99J66L26j244J251l29M07j089K86j29j45
2084E28M69r50J601j190L74l72J13Q14j236P07l35L02j179R23N2n29L43m18P1
2103H8l01J042j739R93n67j76Q66j123J123j828J808j160P03K44j299N14j034
2120a846J971j376P34k93L72k01l53R30j037Q54j143Q37J07o5N63j021J312j182
2138h37J103m47J290p51k29O94n93O91j182J094j10j61O41q57J616j294N48j667
2156d51K029m47p84N45l58R56j118J391j729O87k06J9nK35K40r31L84p0k0k2j49
2177A96N72j006K69p70J069q39j17O46n86J365j822J825j288M06m64J35J14k39
2195e34o0q11J351j522N00l2O10M33r44O63q58P49o22N78n46K50O29p88O75l93
$$ y = [1267, 130, 1269, 73, 1155, 68, 429, 1028, 1194, 1520, 276, 1527, 1198, 1605, 516, 802, 673, 528, 997, 47, 1648, 458, 832, 460, 573, 1387, 151, 858, 523, 825, -354, 569, 621, 92, 435, 17, 88, -213, 829, -910, 83, -484, -660, 206, -917, 206, -1622, 186, -974, -271, -27, -1326, -812, -1846, 125, -1251, -517, -810, -438, -639, -992, -62, -1099, -245, -1388, -551, -444, -509, 54, -967, 345, -837, 266, -181, 1109, 358, 129, 823, 230, 921, -261, 833, 723, 562, 1203, 346, 1962, 668, 1216, -451, 1578, 1131, 347, 892, 534, 1490, 372, 1763, 34, 721, 515, 534, 529, 764, 1004, 73, 457, 387, 367, 345, 196, 768, -238, 31, -739, 330, -509, -626, 20, -566, 799, -1023, 802, -486, -80, -544, -409, -295, -534, -594, -1405, -54, -1576, -1076, -1108, -498, -65, -1009, -346, -1204, -455, -1077, -499, -1045, -795, -166, -954, -279, -672]
2215f72P59n56O66j66j87O11n93J527j492N82r8M70J16k55L98k18L93r34O39m79
2235E11Q03Jm41K79p13J89k94Q62o52j81L23q75P34r83O23o76J366r46O3l38M2
2256c03J006j676J370j247J237l22k89J82L88m6j222O49l86P10n35J38K60q67
2274i53P50m55R49M2r36J133j030N79k46L90r05Q06N7M86L17p46L00m16P66q15
2294G3O67r44P64j15m2Q97p89P95o06M61n36kJ086j122N21j034J042q32L70k83
2314C71O66L81j579J371o64M11l41n08J98o6j30j38o1m75O36j59m14J307r51K48
2334A03o76M14r23J63J74p38R65n34J100j222J615j881L69O00p68O26p0n4m82
2353a219L66m99N01J96o10Q75r59R45r30P53O40n65O24k05R17m80J85j110J034
$$ y = [-672, 87, -469, 197, 31, -156, 455, -138, 1389, -103, 479, 381, 851, 967, 712, 1110, 892, 1285, 351, 990, 511, 1314, 1315, 874, 1153, 440, 629, 335, 1197, 545, 364, 687, -188, 546, -437, 186, -490, 876, -70, -7, -345, -303, 703, -973, 397, -850, 387, 65, -224, -42, 346, 300, -922, -273, -659, 51, -484, -346, -86, -953, -203, -658, 291, 333, -603, 530, -500, 79, -167, 223, -682, 124, 181, 667, 984, 238, 538, 122, 888, 73, 740, -204, 560, 445, 403, 1300, 511, 1306, 700, 1161, 625, 623, 1709, 587, 1108, 74, 1116, 284, 654, 371, 1037, 1418, -161, 1210, 546, 957, 616, 108, 306, 240, 110, -28, -89, -564, 72, -87, -501, 806, -145, 103, -573, -159, -1082, -919, -745, -1483, -518, -1052, 48, -1174, 441, -1440, -1071, -471, -1239, -613, -683, -737, -1219, -853, -1352, -851, -655, -1265, -390, -1349, -404, -1334, -581, 59, -506, 118, -87, 830, 350, 535, -575, 459]
2372D59k62J52M10n75M74J87M49j480R96n27O9N65p88N86m60N27o67M59J06j004
2392c24l84L05M89l63N26n81M96l7q20O50l81Q23j454J111j027P58m67l01Q33
2411a48j029R72r10J39j12l00J435j095O9l59J94k65Q40j88O9l12q40J253n29
2430a116P59j75L32l87N17j49q82R79n92R37PJ14J02j398J444n64N76p56M22J18
2450B88r1N05r76J255p81R39q60M27J14q08K66j6K77l22N27j054J255r73N52k84
2470B40l88J94k28M01j168J264m87l93P74j084J361j210R51o12j60k97J77L93
2488b72m12M66o15P60q16O19p18K73N43j175J384m39k79K32l76P24m52O87p46
2507f12L27j50J53k07L36J132j110L79k60N66j90N20m61m38R90p54J324j048O8
$$ y = [459, 197, 349, 759, 184, 658, 845, 1294, -186, 810, 283, 352, 917, 129, 715, 255, 782, 115, 574, 680, -324, -708, -403, 86, -277, 249, -332, 164, 127, -693, -43, -424, 399, -1055, 56, -971, -213, -680, -981, -148, -1177, -205, -1115, -976, -1088, -1388, 47, -1048, -979, -1338, -1144, -1409, -569, -757, -688, -1000, -1840, -587, -1116, -357, -532, -200, -587, -70, -219, -1101, -122, -714, 223, 230, 344, 446, -952, 492, -72, 504, -252, 170, 288, 197, 702, -274, 981, 200, 1139, 279, 706, 820, 12, 278, 262, 539, 217, 744, -310, 945, -28, 524, 240, -148, 46, -182, 219, -949, 315, -172, -565, 209, -875, 486, -724, 227, -385, -545, -842, -665, -272, -684, -218, -833, -73, -889, -270, -988, -715, -172, -1347, 37, -402, -681, -449, -825, -101, -553, 134, -612, -285, -435, -282, -489, -153, 979, -131, 248, -12, 554, 364, 884, 423, -15, 975, 221, 1545, 497, 565]
2526E65p11O00M40p25M07k68N77m79N71k22J84k41j78J258k295J358o80L75j27
2545D09l1j04j240J673j370J092m34j12J29p34L69j79J031k029J350J42r75M67
2563e46m33O82m67K97j092N16N16P38l1j717J074l14J463j378k88J257l82O00
2581D95q37O90j044P36k73l32L14R1N95j341J813j282k86J51O96P56j269P83q3
2600C73l03P14l99n1m31M01M27J61o36Q05l75r4j16J38j21p82J080j176J158p03
2620G0K82Ok92l8q25M62m31O72m29M23p58k56L70K23N05j225J300j101L69K17
2640d56o54P28o61J175j223N82K52j006N39K88L45m48Q54j203O14k53L77M9m52
2659e53J051p42O11k00k55L04j42j64K29L91p38R47p77L26q0J0L33r25Q89n38
$$ y = [565, -146, 454, 894, 169, 576, 308, 885, 406, 977, 755, 939, 698, 520, 1778, -517, 841, 161, 536, 409, 378, 274, -966, 707, -663, 429, -5, -117, 12, -722, -353, -532, 499, -1530, -180, -38, -1013, -546, -979, -297, -764, -467, -1559, -1043, -527, 211, 180, -1537, -463, -777, 686, -692, -980, 277, -105, 495, -342, 348, -696, 40, -233, -565, -251, -160, 435, -906, 907, -375, -661, -510, 186, 942, -327, 456, 373, 70, 784, 385, 334, -97, 304, 731, 892, 256, 1061, 686, 592, 476, 614, 493, -289, 791, -385, 773, 70, 352, 358, 66, 28, -797, -335, -766, -94, -523, -100, -858, -1114, -744, -521, -16, -1241, 59, -1042, -673, -456, -1110, -382, -1043, 132, -1091, -509, -257, -1263, -724, -436, -91, -539, 315, -888, -274, -527, -150, -101, -553, 498, -244, 367, 167, -88, 216, 74, -90, 139, 530, -208, 739, -38, 288, 208, 218, 551, -374, 515, -23]
2679b3N68m53K88l90k41R43p31L77p95Q86p06P39l95P4k43o3R20r10K36K48n30
2700b01j33L5P48j258R01n26m9j00m55J116n08K68n28L95k80QM5p06J86K30O07
2721b05p59R51j080M75k6N34K8j359J313o46J36J57O91p85Q76j30k82N69p27R22
2741F53O9l84L17o14N75r81J029n30N71o42k54Q66j97l6m57R4n3M68k33M7L62
2762F70j175J114p03J61k26J23N65q30L55j11L89m16k38J30M8R82j053J45l93
2781d63q1j96P30j29k59O3q50J120r48J073j324L8J089n41K22k23J28m83N59j97
2801f72J44L26n25J089r02Q13m50M48q1m96O09o55P01l51O01o88N06k31j53K72
2821C05J72M5n95P81j018O04J02M25j87l43J99l92J4N40l9k63M3N8m68O89n45
$$ y = [-23, 545, 92, 380, -10, -251, 692, -39, 338, -457, 429, -277, 462, 67, 141, -102, -165, 755, -155, 81, 329, -201, -334, -299, 449, -809, 92, -434, -483, -583, -1038, 78, -430, -162, -690, -295, -575, -567, -522, -1228, -1042, -812, -205, -964, -13, -1093, -618, -644, -110, -82, -1441, -128, -774, -638, -481, 210, -575, 301, 171, -111, 458, -269, 653, 722, 338, 655, 41, 616, -365, 664, 134, 705, 63, -191, 675, 478, 442, -15, 79, 26, 494, 261, 308, 670, -505, 609, -94, 67, -159, -36, 529, -301, 54, -57, 332, -84, -322, -192, -144, 838, -215, -70, -463, -544, -740, -10, -139, -398, -335, -1185, -65, -1013, 60, -1264, -1226, -137, -678, -456, -679, -551, -1034, -475, -672, -528, -202, -727, 362, -540, 273, -177, 271, 190, -306, 303, -352, 349, -2, 599, -89, 417, 186, 33, 305, 477, 522, -73, 708, -310, 294, 396, 821, 634, 291, 490, 98, 112, 652, 613, 350, 393, 451, -17, 672, 127]
2842A27Q22l87l44K56Q6M48q40l7RL62l58o85O20j44K64r99P86n75K40k64j68
2863g81N79o88Q38r02P36r32J276m69j8j25J16K19o84O91K14P2o19L91N41m93
2883c8M45n10P58m47P6j10m19P11n87L76L52K38j028M79L53p57K35J01N12j016
2903b76Q06K26j095R22o91J87M32M13r03O85j96n98Q57o66P88j355J208m47O7
2922C64k15l18J52l81J096j194N28m0m13O80r19N81q35J114p18K10k43j21N81
2941i1j020R64n91R84l43j14m17r8J83N35J28q09P20j22K02l30R7O11J74o23L5
2962G5R64n54l56j35k98P24k68P0o97J257p18J96k40K26L23n13O68r69J152j62
2982G45k00pL4j54m79L13p29P06Q82o63K00k26j28p6N87j230O96J17j96J33r32
$$ y = [127, 949, 562, 218, 474, 560, 1008, 168, 131, 140, 502, 144, -541, 79, -65, 199, -800, -14, -589, -349, -613, -781, -202, -890, -52, -954, -218, -1150, 126, -343, -361, -486, -370, -151, -835, -144, 70, 142, -477, -86, 455, -38, 407, -103, 655, 208, 284, 174, -245, 466, -121, 255, 607, 845, -183, 296, 649, -108, 127, 228, 740, -276, 530, 756, -339, 583, -108, 79, 511, 924, 21, 706, 510, -88, 769, 103, 891, -464, 744, 297, 364, 149, -169, -17, -398, 698, -496, 32, -8, -421, 259, -660, -79, -914, 200, -518, -308, -551, -672, -91, -1111, -147, -738, 246, -97, -211, -628, -726, -543, -8, 120, -689, 31, -91, 111, -219, -122, 489, 663, 40, 75, 1039, 485, 129, -6, -304, 420, 152, 222, -475, 782, 64, 260, 20, 246, 569, 56, 724, -245, 907, 745, 545, 538, 572, 418, -61, 252, -477, 229, 1111, 448, 648, 422, 294, 218, 805, -425, 271, 388, 192, 325, -607]
3003f07L95J91K07l46P94m43o63J239r42N84r66P25j37m07L68j181L04J35N87
3022a63m73R62q53O44k03q03J396o44J040j053j01Q09j142Q43k43K46p6l11n00
3041f25J356p25l23R19k66P8n76R31n1K99L86m2L32j694J239j465Q69m74K4J262
3061A454k375K330j346O65p44L32o09k44L78k31J685j708J290j456J014p83l99
3078g47J013q24O71m36P84n70ML84o16J42r95J173k17J7K15K16n82L80J4l08j55
3099d37o89Q95l25J63O46j44n51J42Q79j066O26k43j72KL59k83K19J14L05q04
3119c64N02j37O43l6L45j623J212l96J61j31n06R90k14J09p30M54j83l11Q80j539
3139h74J208k28J36N42r77L34J19L46M5Q6q16n62r6R41k7m24K03L23L60p46lN0
$$ y = [-607, -212, -21, 186, -160, 634, 191, -472, 767, -175, 409, -557, 168, 31, -376, -8, -1189, -885, -750, -163, -636, 326, -527, 117, -86, -889, 507, -137, 903, -150, -251, 558, -584, 259, 16, 262, 186, -125, -625, 731, 6, -317, 602, 336, 414, -162, 769, 718, 1017, 1403, 1361, 1693, -1, 1238, -227, 642, 168, 192, 1454, -921, 1409, 63, 728, -16, 316, -293, -537, -159, -390, 1295, -413, 877, -579, 435, -348, -747, 266, -558, 113, -323, 461, -109, -105, 279, -337, -195, -1190, -17, -234, -217, -2, 214, -368, 12, 26, -282, -437, -1126, -231, -556, -393, 253, 109, -442, -300, 579, -487, 139, -104, -276, -274, 85, -198, 21, 135, 440, -364, 138, 1, 644, 608, 953, -670, 542, 146, 307, 176, -330, 660, 446, 555, -175, 279, 96, -215, 665, -874, 334, 106, 242, 784, -193, 141, 260, 606, 651, 737, -79, -641, -737, 204, 177, -247, -44, 279, 639, -107, -110, -60]
3161f0O08j314j39J355p42O93M3j128M71k32j20L43q38O13O10J48o18r22P93l51
3181g87J60Q65m70K6K72L8o7r61J697q34M07p71P24q4K71P30J6p73o40O66l80
3202A05L7O45m5l13l86P1K33j34M41n45r62J990o50n27M34p04Q15j070M39J66
3222D0k40n9J30K98n39O19m85J39k77o07R37o55L41k49O39m02l13L46l53M50N32
3243B92p95j105K365j669J7R62l47L58j399R43J64M86k06j91n5P04m11k22L74
3262B65r06L95J59L7k81M35N6K92k7p09P31l76J5o1L81L09k92L76p62q7K78L61
3284E89o19m62Q03m00M89j39j24J90m30M38J6pj169J181q51O46l3m18P70j360
3304h90J166m28L01n78l63O24k58M3o25O21r5L65L68j50q7o68N37j51M25k25o21
$$ y = [-60, 548, -766, -905, 450, -292, 401, 444, -684, -213, -445, -565, -222, -1060, -447, 163, 311, -307, -1229, -436, -787, -627, 238, -232, -206, 66, 104, 37, -924, 773, -61, 346, -425, 299, 215, 486, 1216, 1232, 459, -181, 485, 105, 142, 787, 742, 429, 43, 114, 347, 213, 654, 109, -853, 1137, 487, -40, 394, -310, 505, -565, -126, 40, -200, -259, -129, 169, -370, 249, -236, -97, -374, -981, -44, -699, -358, -607, 32, -370, -683, -337, -690, -240, 292, -503, -1608, 757, -912, -895, 67, -280, 78, -1321, -378, -214, 272, 66, -125, -180, 524, 113, -109, 265, -641, -246, -87, -50, -331, 104, 160, 452, 425, -284, 447, 71, 86, 25, 406, 715, 423, 799, 37, -50, 228, 589, -30, -492, 311, -89, 400, 261, 137, 327, -103, 335, 351, 344, -825, 356, -495, 151, 118, -300, 470, -890, 276, -152, 149, -429, -792, -168, -426, -383, -1008, -387, -482, -117, 251, 101, 14, -654, -117, -268, 157, -68, -689]
3325f89K16JN0o76J287n07Q95q19L8L12PpQ2J30m68P59o85Q69n49P2j78o21J132
3348F51j56J87l72k69M83l55j66L13L33l88L61o08l35J493j240O75p41L68l74
3367a40L52j0l31M34j133O08L8j10K63l45J40J93l51l11K67QL91n83J59N3MQ17
3389D13j266N06j7K59p39K82K97l31N82j23M43k95n02M7K2K80j24l14o5J025o10
3410b30P1J74k72Q45j229Q16n29P80q96K37J049p35R5j98j93N85J60l19L5L65
3430F11k47K26j085R87j65l10K42r11J216j193J177q60R2P3K47p0n13L05L80k44
3450d2p45P85K59p78k7j38R82r03O77j54K1J89q29m9K74J290p61l41p3J05k81
3471e39O75o78M86J70r10J214k02K60r46L71J23l50J497j740J097m4J15m4j97
$$ y = [-689, -473, -472, -422, -1098, 189, -318, 577, -242, -204, 108, 115, 108, 190, 320, -148, 611, -74, 795, 246, 318, 140, -481, 651, 495, 682, 310, 41, 524, 169, 3, 316, 649, 261, 622, 14, -321, 1172, -68, 607, -134, 234, -140, 212, 202, -129, 305, -828, -220, -182, -292, -29, -374, -234, -41, -392, -703, -436, -428, -37, -620, -461, -408, -404, 413, -853, -347, -364, -105, -844, -562, -265, -596, -14, -137, 306, 11, -491, -444, -422, -142, -266, -580, -645, 380, -230, -159, 15, -257, 588, -641, 175, -354, 426, -470, -233, 816, 81, 176, -22, -215, 370, 530, 211, 246, 611, 364, 590, -495, 492, 327, 17, 259, -652, 564, -629, 548, -312, -220, -147, 100, 30, -483, -178, 202, -42, -787, -2, 257, -521, -548, -686, 296, -607, 70, -84, -63, 126, -703, -752, -478, 812, 51, -290, -363, -258, -539, 136, -542, -56, 114, -796, 418, 216, 476, -470, -99, 24, -326, 1171, -569, 528, 484, 599, 555, 358]
3490C58O7l34O04j169O86o42J125o48j20K06l95N63j08m55L0K74O05m81J55k37
3510H4j0R5L27n59k23Q99r30N14j14J1k94j53J012m58j51Q7k21k27M58oK45n89
3532b03j63N90n55L1J4k7k48j54M17m5P4n12O40o72J074n44K23L8n95O05n31L49
3554a94j21L45r5l94O87p18J24j89R87q51O49l40l10j13P88j73K44k49L3k68J08
3575e0p3j0l33L69J82M12j41k11L49m14K94j74L96o62O03m88mJ85r59J108J19
3596D98o21P2L96M5r50N34K61L6r64L77r1j84K73j35L62m16Q18r44N97k16J78
3617g4k23l23Q47q95O35m90P8k87N35m86O55j82o10N66m12J055l04Lj01k55M76
3638B08k30P2M20m60p6R1K6K36n42qM77j7lk50L75k13L03j84p8l8K93o30M32n01
$$ y = [358, 425, 91, 695, -474, 212, -430, 695, 47, -73, 133, -262, 301, 193, -262, -232, 42, 647, 166, 321, 84, 74, 169, 496, -63, -286, 613, -317, 197, 83, 94, -200, -353, 659, 201, 50, 137, -84, -311, 147, 141, 386, -203, -366, 224, -331, -300, -286, -313, -561, -715, -298, -343, -269, -781, -141, -813, 261, -283, -60, -22, -617, -12, -543, -194, -315, 30, -65, -459, 228, -490, -366, -555, 432, -419, 230, -110, -420, -533, 255, 82, 326, 77, 110, -158, -50, -123, -133, -466, -97, 85, 497, 356, 145, 494, 80, 374, 200, 596, -66, 537, 49, 45, 230, -729, 379, 498, -123, -51, 345, 390, -560, -26, 235, 271, -693, -316, -407, -591, -318, -453, -91, -507, 311, -633, -36, -252, -74, -297, -620, 227, -668, -33, -523, -445, -732, -197, -683, -28, -210, -820, -254, -666, 389, 85, 88, -13, -268, 208, -22, 50, 470, 10, -66, 25, 51, 287, -255, -263, 214, 197, 194, -56, 319, 106, 409, 225, 147, 109, 402, -228, 204, -297]
3662b97Q94j32m90J54L93k69nM02m99P16j297J008m54l49M68j41k74m27N61j96
3682b34P6J77M9k01m68N91m82P53j57m64K20n2K11k39l64J7N44p49L04L23k5P22
3704E52l34m8j32M26n88M18K0n15M23J8L64l19L87o28k36p6Q00Q1j82j03q6o19
3726c77Q44m55P29m00j28k06R5M20k46m19j25J26L42J61j08O7k42K38m42j84L54
3747D4m55K50q49J037k40r9N02r46N70J23j66J00n7p1p7j9l29L45l79N50j9r7
3769b82K53p4j3r3k15M64J73q83k0J05K0p4K13L54M79J19p16N7n69R10q40J121
3791D89r55J079Q40j026k14l62J10J56q07O88k37n10Q07k13K40o2J050r33J38
3810B78Pj30J48k98K92q35R24n46N04p60O15j54J92n38O34j4o80L32n57J019q13
$$ y = [-297, 597, 465, -25, 129, 522, 253, 248, 650, 151, 867, -430, 578, 124, -225, 243, 102, -172, -599, -38, -234, -158, 19, 68, -133, -601, -10, -492, 261, 104, -360, -140, -192, 19, -220, -584, -567, -23, -772, -468, -145, -170, 552, 218, 170, 38, 464, -124, 294, 314, -201, 222, 240, 604, 285, 672, 44, -192, -268, 532, 613, 431, 328, 242, -377, 467, 12, 741, 341, 213, 7, 102, 522, 276, -143, -268, -142, 200, 361, 253, 320, 78, 316, -126, -310, 44, -411, -161, -1010, 27, -213, -312, 190, -756, -186, -63, -229, -129, -186, -257, -334, -353, -682, -337, -716, -166, -185, -282, -29, -103, -116, -209, -424, 40, 213, -670, -690, -585, -565, -639, -426, -72, 407, 526, -190, -133, -702, 208, -632, 489, -466, 613, 1453, 427, 213, -149, -39, 117, -690, -2, -239, -749, 58, -155, 85, 23, 1073, 140, 278, 285, 155, 303, 5, 297, -538, 386, -160, 344, -416, 199, 45, 237, -301, 333, 319, -361, -29, -586, 433, -380]
3831c80n6M18r9m12L2L99k93P12q20J52L47n01J60o72J801j285J023k18K7o13
3851b78l02J000j040L04O02k56Q3k87N49n62K16j073K148p51N59m49m94J76P61
3870I06p20J029q56k4m46M01n52M54JK81l86j23P78j077P35K85r3p11Q47p52L58
3891C35n85R04l28j98k59m18N78Q6o17O23K36L6q15l69O75l4o75l41L97N36m35
3912f68Q25j559L06J71J60k59P53J106j234l28J16J55Q13k49k92J61k95k76J338
3931G44j195J344q82m24m9N80l39K13O12n97k20k42q19K266n54q9J54n88P21j080
3951d44J106p3k0j564j39K335j825R47j325J034O16J5O4q26O36j31J98p09K90
3970A85M05r96O70j382K24J715k12p33N34o60r1J104j131M4l33M79J3j356J152
$$ y = [-380, -436, -18, -117, -529, -497, -98, -391, 321, -499, -347, 0, -501, -341, -1013, 788, -497, 526, 308, 335, -278, -580, 420, -620, -316, 286, 30, 113, -174, 375, -187, 29, -1044, 1104, 353, 912, 463, -31, 145, 906, 186, 1215, 359, 335, -111, 290, -262, 192, 193, 474, 88, -35, 743, -334, 401, 686, 593, -118, 729, -23, 335, -250, 654, 326, 128, -131, -549, 29, 115, -502, 121, 357, 393, -422, -791, -116, -150, -825, -1166, -769, -233, -668, 157, -1402, -1096, -925, -765, -1024, -271, 835, -399, -727, -611, -456, 357, 108, -184, -23, -318, -594, 744, -451, 893, 11, -413, -462, 118, -221, -8, 604, 7, -213, -455, -1274, 992, 438, 349, 503, -85, 636, -444, 662, 589, 569, -995, -1134, 1201, -624, 323, -1002, 32, 648, 663, 727, -99, 537, 406, 604, -105, 185, 590, -406, 264, -1118, -894, 821, 609, -124, 410, -250, -341, 763, -368, -324, -657, -178, -165, -1521, -369]
3989c69o23J288p31n6L72j080J397r77J066r23P33l9l87k00k26M84l49O37M27
4008D44J62j640N46N93m60J400j387R62p59J497k175O15N24j124q6O94J099j678
4026g73J274p04N39m07j55M67n97J29l0m71O27M66m10J11q8k06L02K83N31j239
4046c51N16P32p15n57r86J925q47j09Q0mM23k25J36J94j01m30l00J93n25j42J790
4067F97n59j607J585j81l3K15p1Q85j678Q54L18R60j307n51j75P49j59o07L25
4086c40m49R67p74M22n79L12N82J4K24j60l26N76r22PM96P00q19O65k14j009M36
4107a91L95N30m29k0j44M40l33K88r13O82j283J569n36K07l29m50J083m14K6k13
4127c5n6j5J80n16M43p08K35J66n07J318j000Q67r8k85O11j040L59o98J003J29
$$ y = [-369, -992, 296, -435, -491, -119, -1199, 198, -779, 287, -636, 97, 58, -329, -529, -755, -271, -620, 17, 444, 606, -1034, -488, 105, -355, 1045, -342, 620, -139, 1358, -817, -202, 322, -802, -888, -194, 905, -773, 501, -203, 336, -71, -226, 241, -356, -227, -257, -728, -101, 365, -45, 66, -22, -228, 74, 357, 888, -351, 165, 897, 182, -375, -1361, 564, -283, -392, -312, -316, 107, -118, 18, 212, 111, -319, -619, -426, -951, -1093, 697, 138, -1469, 116, -65, -98, 117, 46, 931, -747, 107, 425, 1385, 78, -473, -648, 101, -58, -665, -340, -789, 178, -596, -174, -753, -441, 141, 155, 379, 219, -107, 469, -453, -446, 50, 750, -69, 596, 382, -627, -191, 204, 734, 305, 285, 141, 581, 248, 536, -377, 305, -978, 591, 55, 262, -67, -517, 566, 152, 178, -35, -91, -106, 74, -442, 1, -707, -472, -306, -813, 505, -495, 372, 274, -11, 600, -440, -81, -779, 224, 353]
4147C53q3J7k21k30P1l34l31M97j51K3Q25O32o14m9o69L36k34o7L19r9L08K4J25
4170D48n79R0n82J705r73o65O47Q2l68P12j4k50K96q9o84P05l62Q64q64l77l60
4191f18R64N15j284J4J96M46j37p50J070l63O41n49o95J223m24j021N43M9Q09
4210F29q91J60l01m68R69L34k15l50p01J077q63L72j42L57j90K97K20o69J14n07
4230g68L68N79n27L14N29l12J36k60l44j0O96j110J494m14p95J334n91p94L43
4249a32L40j9O13j287N82o27J49O32K86k43l27k64P89j5n80k22M70J38M83q91
4269a25l87J379p47m68L50q49Q76K04j8m2l45P77p27K14q11J046K43j376J082
4288B76j11l13L81p12k85P42q2j82m0P6O0k0L20L54j66m37l62m64J030k27P27
$$ y = [353, 270, 287, 66, -164, -93, -427, -758, -261, -412, -389, 436, 1068, 454, 405, -264, 72, -162, -229, 90, -9, 299, 323, 448, -131, -41, -623, 1082, 109, -556, 91, 173, -195, 517, 503, 253, 549, 460, -224, 481, 119, 983, 119, -258, -618, 346, 861, -423, -409, -213, 233, 96, -654, 416, 53, 694, 145, -550, 673, 249, -772, -229, -180, 629, -262, -102, -403, -871, 98, 432, 217, -133, -834, 243, -620, -248, -390, -33, -223, 74, 294, -375, -261, -768, -400, 179, -348, -34, 495, 183, 319, 59, -285, -295, 401, -709, 785, 371, -424, 910, 319, -475, -132, 208, 189, 802, -485, 97, -530, -381, 251, 537, 294, -33, -297, 492, 477, -103, -325, 145, 283, 766, -125, -512, 867, 120, -348, 2, -847, 29, 233, 215, 173, -172, 605, -122, 92, -719, 327, 570, -806, 276, 165, -148, 233, -479, -764, -22, -104, -286, -326, -250, -190, -210, 110, 464, 298, -139, -501, -965, 65, -162, 565]
4309E65j352J050j119M36L82M78o50M33k64j38O18j034K22M36L65k15m4O4m98
4328b65M41M4L73j241O10J92qK65j34n22L25M27p45L78l8j60J16k68j22k88P48
4349A28m2j93l39j13J014q70J33J3K47j34k92J45K78q2K80m94L12l84r8J27MJ9
4371c41N31m12O37p49l04M97L44q55O33k71N35l35K48j32J6N62o22Lj27J84K53
4392B95o3n18KN35N55l43m38j0K06l31k70N37j70j18K55j34J50J78m23J14m24
4413d15M91L32p78M73K85m20j26J12K55l48P22p09K06L97P9n56O85o90k86K82
4433im37O67k40N45q98N53K8r23M42M65p74O90l03P06n85k4m36l52L99j44N53
4454g7k70N32j64o09R62j55q66J156o62M29q53J330j143J80L59l93O44k27R9j78
$$ y = [565, -787, 263, -856, -420, -38, 440, -210, 223, -41, -179, 439, -595, -373, 63, 428, 213, 169, 233, -265, 176, 220, 593, -648, -38, 154, 146, 411, 277, -245, 80, 507, -238, 140, 102, -58, 58, -210, -332, -620, 128, 86, -107, -446, -559, 455, -415, -282, -269, -22, -156, -448, -303, -25, -107, 173, -321, -9, -393, -491, -364, -360, -341, 190, -222, 415, -334, -638, -141, 203, -652, -19, -290, 245, -90, 158, 26, 42, 604, -18, -15, -142, 42, 295, 232, -286, -284, 251, 806, 463, 25, 15, 221, -110, -380, 157, -13, -131, 124, -10, 140, 318, -105, 9, -415, 76, 408, -370, 103, 388, -32, -158, -46, 209, -139, 583, -126, 80, 477, 556, 0, 685, -5, -291, -9, -446, 221, -19, 526, -372, 181, 209, -714, -272, 193, -581, 109, -194, 512, -73, -97, -533, -885, -486, -630, -77, -347, 185, 21, -588, 374, 219, -647, 509, -153, 276, -577, 753, -390, -210, 149, -244, 400, 173, 272, 94]
4474I4l31J05kM70l70M28l09m15k58N35N32ol43J67n47n0K86O80l86q92L17J83
4496a12j07l9K02m35m7O78J60m94K15L36j004J219k91r33P21o89J193j020O28
4515A81j68jk96j29M59K30K24j71n46J17m30L69m82Q26k72K08l08O45k85m8J57
4536B80m06K9j43m17K71M96n42M46k41L38K12Q8o32N38Q8l34j6j19J72J41K0j54
4558A15L80l08K9o33R65k95n35L95m61P33r07O27j53m53J47Q24m03m09R9j70j22
4579e35j46M41J75J33K6q11J169l99J34L14l78n42M14J34J14O54k28n20K94o68
4599b25P03j157O28Q0l63J21j13K43n65J170l71l57O88q80O99l98M56n44P37n64
4619a2q1O0J21l38N83j56k29J89J50L08r25L70L0p3O01n67J26K15l06N72o30j83
$$ y = [94, -237, -132, -134, 336, -34, 394, 85, -330, -588, -53, 479, 473, 130, 297, -250, -300, -14, 666, 280, -612, -295, -112, -219, -258, -56, -491, -538, 140, 300, -194, 21, 357, -647, 572, 281, -652, 69, -620, 573, -447, 181, 13, 12, -284, -413, 46, 276, 500, 329, -217, -100, -530, -161, -643, 183, -89, 119, -189, 456, 171, 123, 280, -126, -97, -240, -657, -386, 110, -432, 14, -227, 111, 323, 411, -221, 317, 405, 71, 55, -64, 108, 249, 269, 115, 495, 187, 216, -417, 548, 253, -282, 113, -348, 385, -522, 105, -48, -501, -354, 470, 67, -342, -243, -413, -535, -681, -240, -65, 68, 94, -717, 452, 53, 187, 501, 123, -419, -5, 129, 243, 897, 669, 149, 443, -225, 478, -679, -51, 29, -334, -213, -326, -83, -648, 522, 151, -206, 482, -398, 301, -97, 359, -185, 552, -12, -93, -33, 88, -250, 333, 177, -52, 137, 287, 595, -330, 40, 70, -3, 598, 31, 157, 372, 66, 638, 8, -175]
4641a75L66Qm9P6j49j4K01P5l78j49L57m92K10M25n12K4L56J96r27K41N34j26
4663I8J78j248L83R02n82o0j72N63j41q8O1L25m76M22l45m02l20J350n11j71K68
4684C4p6J3K79k73n04P08q1j63j96J65J95K71j03o30M57l77R79q96o09R22k22
4705a07L84J78q65J84K94J03k64l04J065j355J243j25k67M8M9K24j45J7n85K09
4725a9J58M74k41j218N51L6L16k69K59p72N06P5K84k64K77k31N00p03k09L59l19
4746d50M89M82j312J31Q61j32r7o65Q41r77P06K23m04L71m35L40N88r62Q06n67
4766a63Q7L00r77R02l16L61n10R92q34m91O55N62q6q55M09j16l13l74M80J25R69
4787H07j92m44l01j08q7l48R47j68o40P14m52N38P36o78m91M72r7J8r34j41K96
$$ y = [-175, 191, 199, 150, 226, 77, 63, 264, 339, -39, -188, 169, -323, -113, 312, -200, -176, 180, 376, -551, -310, 224, 98, 276, -972, -589, 313, -269, -329, -501, 62, -79, -167, -106, 219, -257, 165, -180, -582, -902, 448, -63, -234, 34, -42, -29, 250, -23, -527, 181, 100, -63, -259, -94, 101, 372, 269, -361, 96, -281, 698, -198, -807, 115, -107, 277, 455, -410, -226, 68, 171, -93, -397, 668, -687, 556, 431, 164, 212, 261, 485, 340, 357, -228, -19, 139, 613, 372, -846, -295, -259, 57, -212, 47, -725, -219, -144, 140, -124, 153, -78, 422, -281, -490, -131, -450, 39, 521, -791, -660, 201, 69, -28, -693, 148, -829, -123, 100, -304, 67, -368, -28, 560, -402, 404, -163, -76, 224, -753, 149, -167, 194, -316, 676, -158, -649, 6, 568, 482, -373, 36, -80, -393, -767, -287, -162, 807, 615, 171, -130, -238, -325, -673, 274, 106, -534, 180, -272, 266, 1002, 324, -167, 305, 208, 226, -708, -849, -553]
4808e53J683j151M4Q27j415P26j060O09K00n33J319j23j140J728j469m7P9K45
4826c1M71m67N46k07p55Q0P10m69L73M23l38k43O36j508R38n61j44K38K56p26
4846g78M59J49mJ129Oj692J204o66j27K99j62R49K92q18p3Q96q19m84J5J11n7
4867a71m16K80L05P2k02R4l47J02K36L61m03J94l13J90K36m11R3m77O20j45m50
4888e52M97m24J73l91j82J277l06J14n9l17M21j75J24n31L05m18K33l54L31M07
4908A73J11k5j04P6k33N90q46L39L75k40j72L51m3k35m35j59K62m23J095n55K19
4929A21K59k08k26k43L86Kj9J44L43j037Q75m1n9n57M11k39j11L28R5j60Q4o41
4951d93N87n14Q20l84J007r78m3j23O9j90k03R39n12m63L37N04q37M93k14M7n31
$$ y = [-553, 1130, -21, 23, 850, -565, 161, -899, -290, -90, -623, 696, 573, -567, 1161, -308, -355, -276, -31, 440, -27, 519, 312, -443, -363, 347, -122, 251, 674, 336, 93, 729, -779, 159, -402, -546, -308, -52, -778, -319, -170, -174, 955, 961, -731, 473, -193, -320, -21, -183, 766, 1058, 240, 167, 1063, 244, -240, -225, -114, -171, -587, -307, -2, 70, -132, -38, -385, -283, -47, 314, -89, 105, -208, -18, 218, -193, -100, -577, 43, -102, -552, -55, -479, -306, -697, -879, 398, 92, 206, 147, -170, 251, 76, 200, -331, -26, -444, -211, -565, -234, 173, 284, 259, 155, 231, -2, 588, -258, 81, 456, 216, 44, 395, 352, 117, -318, -477, -215, -638, 457, -98, 121, 380, 172, -54, -297, 89, 91, 72, 216, 559, -478, 397, 356, 297, -260, 151, -88, -199, 129, 224, 64, 148, -493, 94, -420, 400, 16, 1023, 45, 2, -121, -52, -242, -445, 494, -18, -481, -144, 360, -477, 16, -198, -151, -682]
4972f82P80l30R7LK53k10K67l60J89o30k0M76N67On14M89j81J18m43L37j08N2
4994A56m62M64r7L82j00p24M17n18J75O54r9M13l43j66o97R20j69N43o57J69J34
5015C95l46O53q31M92j206J146j90j71L36k91K07l43l74J093j413J338j321P94
5033c2J5K25n31N33l23l28M62q77R29j47L13j4k52o9k3M30m65K58j89J4l82M07
5055d6l64Q64q15J3N71j45n05K15N54%K80q34N5N50l05L93l72l18R2L06J70o59
5077c00O27p70j30O99l04P11m65Q50q87k03K41k11L08l49L91k53r9j04Q04j037
5097d81R53m88J52q4Q7J84m03J77n75Q08k58J6k25Q6j07j88j44K81O77m42j48
5118a22l79O65k57K3J52J30n0K4o17O00k03k67N77m07J43K3j41r3J25J70N3m54
$$ y = [-682, 98, -232, -135, -132, 121, -89, 178, -182, 7, -623, -643, -167, 400, 406, -108, 381, 200, 318, -125, 212, 104, 156, -306, 158, 61, 443, 343, -381, 36, -482, -307, 347, 248, 661, 318, 152, -545, 375, 206, 749, 92, 261, 395, 49, 702, -129, 363, -843, 303, 113, -58, 278, -13, 194, -149, -523, 570, -843, 495, -826, -32, -17, 208, -323, 210, -113, -441, 21, -856, 73, -74, 239, 225, -27, -96, -119, 311, -154, 104, -85, -71, -453, -46, -410, 454, -361, -348, 223, 78, -427, -212, 342, 342, 622, -212, -157, 393, 88, 481, 109, -209, -117, 189, 359, -300, 327, -443, -573, 126, -178, 533, 68, 918, 31, -172, 69, -142, 166, -183, 208, -45, -144, -248, 556, -481, 472, -16, 136, 52, 139, 323, -80, 97, -478, 330, 72, 88, -137, -51, -158, -346, -490, -209, 468, 26, -122, -501, 164, -93, -70, 82, 212, 162, 186, -431, 169, -34, -301, 276, -131, 12, 35, -106, -199, -74, 96, 149, -305]
5140c05K14k0M67m58j97k11N37K37n05P7O39K0J8k45o48N60m9l06L85J00k32J29
5162B07n35P73m8N5l36o6k8L7J82j08l8K63n10M67q9O1n45j50O11l84p60N23N54
5185A36l66J52L72M1q26J01L50j75L12j0j81p4N2L02n53Q22n93O4n5L1n51R02
5207B53k75L58J37j361J098k68J37K71l25l20q5N04j62j62J71K52j11J77j77P5
5227A87l79K31J05J80l00ml44L79o7N35k24o23M1L72q3m09N26K58o37j01M69J74
5249B86k03L4l66n98Q68n3m53M30j04N3K89K4N1n40K09l9J54p28J112p55J27p3
5271b75K91l57j69j77L87O41p26M88n21r0O70r2l14J17j60j08J146o30r79J113
5291B55j046N87Q33k34q65J124j015K97n04J58J301q73M01p66M8K37K3N65n81
$$ y = [-305, -91, -111, 356, -102, -299, -510, 27, 264, -241, -164, 475, 495, 513, 268, -380, 180, 131, -175, 210, 310, 78, 207, -328, 445, 397, 452, 116, 50, 22, 59, 241, 133, 95, 358, -152, 315, 226, 287, -258, -408, 203, -181, -941, -418, 136, -230, -78, 294, 335, -491, -390, -40, -215, 97, 87, -94, -168, -116, 186, -367, 455, -138, -74, -129, -98, -649, 253, -22, 336, 473, -888, 210, -58, 79, 350, 25, -295, -380, 124, -38, -200, -29, 223, 112, 289, 112, 187, -192, 39, 144, 324, 24, 20, -324, 55, -12, 523, 299, -324, -283, 89, 6, -403, 123, 381, -256, -357, 112, 286, 83, 117, -249, -847, 21, -32, -485, -55, -159, -106, 183, 207, 258, -282, -73, -112, 42, -686, 426, -329, -202, -275, 16, -341, -510, -687, -300, 341, -385, 103, -418, -508, 162, 70, -244, -127, -287, -395, 751, 121, -858, 255, -791, -204, 629, 395, -470, 654, -361, -64, -568, -410, 891, 18, 419, -347, -299, -62, -39, 526, -55]
5310e5m35L22k20Q31K67j08l97K89n42O17P2n30l85j88R44r24m86N77N15J50n40
5331b26J117q17n58O56k07J12k0l84N29m4j20J44m07J8O4l95M18L10l81O87p10
5352b14j22M34k39K97l33K08l38Q8j42N04m6l85J51m05O36m56K67J05n08L32J15
$$ y = [-55, -490, -168, -388, 443, 710, 602, 205, 494, -48, 569, 641, 111, -274, -462, 482, -442, -928, -351, 164, 314, -226, 891, 74, -484, 172, -35, 77, 57, -327, 202, 158, 38, 182, -225, -207, -143, -538, -120, 190, -191, 496, -214, -336, 98, -141, 156, -177, 31, -307, -219, -361, 143, 97, -288, -137, -542, 94, -362, -95, 10, -498, -166, -51]
$$ [...]
8191B03
##END NTUPLES=NMR FID
##END=
