##TITLE=1H_K-317
 CDCl3,8 sc, 
 10.02.2021
##JCAMPDX= 6.0         $$ Bruker NMR JCAMP-DX V2.0
##DATA TYPE= NMR FID
##DATA CLASS= NTUPLES
##ORIGIN= UXNMR, Bruker Analytische Messtechnik GmbH
##OWNER= root
$$ XWIN-NMR		Version 3.5
$$ Wed Feb 10 10:08:15 2021 Russian Standard Time (UT+4h)  she@DPX200
##.OBSERVE FREQUENCY= 200.1315066352
##.OBSERVE NUCLEUS= ^1H
##.DELAY= (6, 6)
##.ACQUISITION MODE= SIMULTANEOUS
##.ACQUISITION SCHEME= undefined
##.AVERAGES= 8
##.DIGITISER RES= 18
##SPECTROMETER/DATA SYSTEM= spect
##.PULSE SEQUENCE= zg30
##.SOLVENT NAME= CD3CN
##.SHIFT REFERENCE= (INTERNAL, CD3CN, 0, 15.7039)
##AUDIT TRAIL= $$ (NUMBER, WHEN, WHO, WHERE, WHAT)
$$ ##TITLE= Audit trail, XWIN-NMR		Version 3.5
$$ ##JCAMPDX= 5.01
$$ ##ORIGIN= Bruker BioSpin GmbH
$$ ##OWNER= she
$$ F:/spectra/data/she/nmr/H-F/1/audita.txt
$$ ##AUDIT TRAIL=  $$ (NUMBER, WHEN, WHO, WHERE, WHAT)
(   1,<2021-02-10 10:07:00.78 +0400>,<she>,<DPX200>,
      <created by zg, POWCHK disabled, PULCHK disabled
       configuration hash MD5:
       00 E9 B6 7A A2 85 ED C7 34 08 36 98 17 FE 4E 26
       data hash MD5: 16K
       A2 8C B7 96 FC 5F F9 31 D1 C9 D5 37 42 1D 73 38>)
$$ ##END=
$$ 
$$ hash MD5
$$ 51 C8 78 28 91 64 5F 1D A6 0A 66 52 7C 33 49 AF
##$RELAX= 
##$RELAX= 
##$RELAX= 
##$RELAX= 
##$RELAX= 
##$RELAX= 
$$ Bruker specific parameters
$$ --------------------------
##$DU= <F:/spectra>
##$EXPNO= 1
##$NAME= <H-F>
##$PROCNO= 1
##$TYPE= <nmr>
##$USER= <she>
##$AMP= (0..31)
100 100 100 100 100 100 100 100 100 100 100 100 100 100 100 100 100 100 
100 100 100 100 100 100 100 100 100 100 100 100 100 100 
##$AQSEQ= 0
##$AQ_mod= 1
##$AUNM= <au_zg>
##$AUTOPOS= <>
##$BF1= 200.13
##$BF2= 200.13
##$BF3= 200.13
##$BF4= 200.13
##$BF5= 200.13
##$BF6= 200.13
##$BF7= 200.13
##$BF8= 200.13
##$BYTORDA= 1
##$CFDGTYP= 0
##$CFRGTYP= 5
##$CHEMSTR= <none>
##$CNST= (0..31)
1 1 145 1 1 1 1 1 1 1 1 1 1 1 1 1 1 1 1 1 1 1 1 1 1 1 1 1 1 1 1 1 
##$CPDPRG= <>
##$CPDPRG1= <>
##$CPDPRG2= <>
##$CPDPRG3= <>
##$CPDPRG4= <mlev>
##$CPDPRG5= <mlev>
##$CPDPRG6= <mlev>
##$CPDPRG7= <mlev>
##$CPDPRG8= <mlev>
##$CPDPRGB= <>
##$CPDPRGT= <>
##$D= (0..31)
0 1.2 0 0 0 0 0 0 0 0.06 0 0.03 0 0 0 0 0.0002 0 0 0 0 0 0 0 0 0 0 0 0 
0 0 0 
##$DATE= 1612937220
##$DBL= (0..7)
120 120 120 120 120 120 120 120 
##$DBP= (0..7)
150 150 150 150 150 150 150 150 
##$DBP07= 0
##$DBPNAM0= <>
##$DBPNAM1= <>
##$DBPNAM2= <>
##$DBPNAM3= <>
##$DBPNAM4= <>
##$DBPNAM5= <>
##$DBPNAM6= <>
##$DBPNAM7= <>
##$DBPOAL= (0..7)
0.5 0.5 0.5 0.5 0.5 0.5 0.5 0.5 
##$DBPOFFS= (0..7)
0 0 0 0 0 0 0 0 
##$DE= 6
##$DECBNUC= <off>
##$DECIM= 32
##$DECNUC= <off>
##$DECSTAT= 4
##$DIGMOD= 1
##$DIGTYP= 9
##$DL= (0..7)
0 120 120 120 120 120 120 120 
##$DP= (0..7)
150 150 150 150 150 150 150 150 
##$DP07= 0
##$DPNAME0= <>
##$DPNAME1= <>
##$DPNAME2= <>
##$DPNAME3= <>
##$DPNAME4= <>
##$DPNAME5= <>
##$DPNAME6= <>
##$DPNAME7= <>
##$DPOAL= (0..7)
0.5 0.5 0.5 0.5 0.5 0.5 0.5 0.5 
##$DPOFFS= (0..7)
0 0 0 0 0 0 0 0 
##$DQDMODE= 0
##$DR= 18
##$DS= 0
##$DSLIST= <SSSSSSSSSSSSSSS>
$$ [...]
##$SUBNAM2= <"">
##$SUBNAM3= <"">
##$SUBNAM4= <"">
##$SUBNAM5= <"">
##$SUBNAM6= <"">
##$SUBNAM7= <"">
##$SUBNAM8= <"">
##$SUBNAM9= <"">
##$SW= 16.9725356469052
##$SWIBOX= (0..15)
0 0 2 0 0 0 0 0 0 0 0 0 0 0 0 0 
##$SW_h= 3396.73913043478
##$TD= 16384
##$TD0= 1
##$TE= 0
##$TE2= 300
##$TE3= 300
##$TEG= 300
##$TL= (0..7)
0 120 120 120 120 120 120 120 
##$TP= (0..7)
150 150 150 150 150 150 150 150 
##$TP07= 0
##$TPNAME0= <>
##$TPNAME1= <>
##$TPNAME2= <>
##$TPNAME3= <>
##$TPNAME4= <>
##$TPNAME5= <>
##$TPNAME6= <>
##$TPNAME7= <>
##$TPOAL= (0..7)
0.5 0.5 0.5 0.5 0.5 0.5 0.5 0.5 
##$TPOFFS= (0..7)
0 0 0 0 0 0 0 0 
##$TUNHIN= 0
##$TUNHOUT= 0
##$TUNXOUT= 0
##$USERA1= <user>
##$USERA2= <user>
##$USERA3= <user>
##$USERA4= <user>
##$USERA5= <user>
##$V9= 5
##$VALIST= <valist>
##$VCLIST= <CCCCCCCCCCCCCCC>
##$VD= 0
##$VDLIST= <DDDDDDDDDDDDDDD>
##$VPLIST= <PPPPPPPPPPPPPPP>
##$VTLIST= <TTTTTTTTTTTTTTT>
##$WBST= 1024
##$WBSW= 4
##$XGAIN= (0..3)
0 0 0 0 
##$XL= 0
##$YL= 0
##$YMAX_a= 125510
##$YMIN_a= -16315
##$ZGOPTNS= <>
##$ZL1= 120
##$ZL2= 120
##$ZL3= 120
##$ZL4= 120
##$ABSF1= 10
##$ABSF2= 0
##$ABSG= 5
##$ABSL= 3
##$ALPHA= 0
##$AQORDER= 0
##$ASSFAC= 0
##$ASSFACI= 0
##$ASSFACX= 0
##$ASSWID= 0
##$AUNMP= <proc_1d>
##$AZFE= 0.1
##$AZFW= 0.1
##$BCFW= 1
##$BC_mod= 2
##$BYTORDP= 1
##$COROFFS= 0
##$CY= 11.3945322036743
##$DATMOD= 1
##$DC= 2
##$DFILT= <>
##$DTYPP= 0
##$F1P= 15.9154993809931
##$F2P= -4.1035820241983
##$FCOR= 0.5
##$FTSIZE= 0
##$FT_mod= 4
##$GAMMA= 1
##$GB= 0.15
##$INTBC= 1
##$INTSCL= 1
##$ISEN= 128
##$LB= 0.24
##$LEV0= 0
##$LPBIN= 0
##$MAXI= 10000
##$MC2= 0
##$MEAN= 0
##$ME_mod= 0
##$MI= 1.114404
##$NCOEF= 0
##$NC_proc= 0
##$NLEV= 6
##$NOISF1= 3.799351
##$NOISF2= 2.8
##$NSP= 1
##$NTH_PI= 0
##$NZP= 0
##$OFFSET= 15.70392
##$PC= 1
##$PHC0= -10760.5
##$PHC1= 16.20094
##$PH_mod= 1
##$PKNL= yes
##$PPARMOD= 0
##$PSCAL= 0
##$PSIGN= 0
##$REVERSE= no
##$SF= 200.130013532006
##$SI= 16384
##$SIGF1= 3
##$SIGF2= 2
##$SINO= 400
##$SIOLD= 16384
##$SREGLST= <1H.CDCl3>
##$SSB= 0
##$STSI= 0
##$STSR= 0
##$SW_p= 3612.71676300578
##$SYMM= 0
##$S_DEV= 0
##$TDeff= 0
##$TDoff= 0
##$TI= <>
##$TILT= no
##$TM1= 0
##$TM2= 0
##$TOPLEV= 0
##$USERP1= <user>
##$USERP2= <user>
##$USERP3= <user>
##$USERP4= <user>
##$USERP5= <user>
##$WDW= 1
##$XDIM= 8192
##$YMAX_p= 0
##$YMIN_p= 0
$$ End of Bruker specific parameters
$$ ---------------------------------
##NTUPLES= NMR FID
##VAR_NAME=  TIME,          FID/REAL,        FID/IMAG
##SYMBOL=    X,             R,               I
##VAR_TYPE=  INDEPENDENT,   DEPENDENT,       DEPENDENT
##VAR_FORM=  AFFN,          ASDF,            ASDF
##VAR_DIM=   8192,          8192,            8192
##UNITS=     SECONDS,       ARBITRARY UNITS, ARBITRARY UNITS
##FACTOR=    0.0002944,     1,               1
##FIRST=     0,             0,               0
##LAST=      2.4114304,     0,               0
##MIN=       0,             -16315,          0
##MAX=       2.4114304,     125510,          0
$$ Real data points
##PAGE= N=1
##DATA TABLE= (X++(R..R)), XYDATA
0 0 0 0 0 0 0 0 0 0 0 0 0 0 0 0 0 8 -8 8 -8 8 -10 16 -16 16 -24 24 -32 36 -40 48 -55 63 -71 79 -88 101 -112
37 -112 127 -141 157 -174 194 -214 237 -262 291 -320 353 -389 428 -471 519 -574 632 -698 774
56 774 -859 959 -1072 1208 -1370 1573 -1827 2163 -2623 3294 -4387 6433 -11666 54148 104031
71 104031 49867 70519 44645 41987 38491 31274 32573 41396 32009 44307 38103 34122 39556 17773
85 17773 17694 12973 -3695 -2746 -8476 -10815 -10212 -7291 -9992 42 -5764 -1525 -381 -9432 -2906 -10506
101 -10506 -13490 -10659 -14127 -16315 -8540 -11623 -8177 -1568 -8521 3374 -3900 -3287 1166 -7636 -3672
116 -3672 -4889 -8609 -5311 -3288 -9045 -974 -5225 -5422 -1386 -9359 -2172 -5814 -5324 -1658 -1702 72
132 72 4106 3716 2507 7003 -849 3220 -842 -3953 -238 -4450 -626 2875 4752 6785 12655 7961
148 7961 10910 9053 1511 5023 -4700 -3424 -4557 -6696 -1173 -134 1196 5981 6630 3022 7954
163 7954 -476 -279 -2979 -9848 -5865 -10736 -8157 -6026 -5039 -3707 120 -1809 -731 1382 -4055 385
179 385 -4835 -3725 -2999 -5074 -2511 -2701 -2913 -3067 -1078 -5028 -611 -3930 -3627 350 -3881 1089 -366
196 -366 217 1033 -357 -1997 -802 -3596 -5424 -1781 -6358 -1047 -1290 -782 3771 2202 4924 4109 3817
213 3817 2274 3172 -1546 899 -170 -2559 2826 -152 3921 4352 4796 5892 5519 4243 3628 2906 -936
230 -936 2107 -2585 109 846 -1327 2252 481 1629 1130 1067 -913 768 -2271 -1881 -255 -3941 1336
247 1336 -2211 -967 59 -1790 -1749 -2420 -3042 -4090 -2286 -4800 -852 -2791 -1660 888 -2543 32
263 32 -2326 -3163 -4430 -5150 -7153 -5547 -5561 -5745 -1287 -3920 1006 -225 -396 563 -2257 -2491 -4118 -4558
281 -4558 -5687 -2568 -4886 -479 596 387 4385 1304 3816 2088 416 -23 -249 -1297 -615 946
297 946 -350 4149 1739 4887 4573 2184 4371 1433 2224 1922 1348 300 3765 2318 3504 5016
313 5016 2093 4854 1083 1348 787 -734 -792 -279 388 -309 2272 85 2982 162 -586 -443 -4118
330 -4118 -2757 -4959 -4227 -4161 -2536 -3226 -586 -608 -1298 654 -3398 -1415 -4317 -4428 -4321 -5400 -4117
347 -4117 -3671 -2929 -3355 -184 -2086 -650 -1038 -2925 -1207 -4452 -2072 -3306 -2268 -1121 264 -124
363 -124 968 2197 225 2820 -164 1630 1099 495 2057 1339 3145 3396 4796 3282 5331 3456
379 3456 3518 3569 509 3105 851 2122 2264 2544 3407 3511 2469 2558 2923 -925 1124 -2376 -1824 -1232
397 -1232 -2590 -353 -1891 -297 -802 -739 -2197 -1586 -3618 -4487 -3650 -6330 -3565 -5530 -4261 -3351 -3619
414 -3619 -2808 -3023 -2781 -4572 -3967 -6078 -4650 -5361 -5418 -2873 -4259 -1773 -1275 -556 -547 -256 -1053 -978 -1350
433 -1350 -2188 436 -1044 2180 2306 2649 4409 4246 4629 3801 4233 2332 3676 2195 2995 4024 3216
450 3216 5860 4564 5935 5001 4738 3995 3904 2810 2284 3556 1901 4557 2960 4348 4676 3567 4220
467 4220 2760 2500 1114 1395 -556 971 495 520 2263 671 2774 451 256 -179 -1282 -2285 -2729
484 -2729 -2817 -3444 -1597 -2942 -730 -1535 -1933 -801 -2827 -1916 -3256 -3317 -3879 -3069 -3375 -1906 -1027 -869
502 -869 1412 189 2233 1148 968 1301 591 725 222 1524 836 3466 2349 4010 4519 3389 4552
519 4552 2208 3116 2129 1664 1256 2055 1699 1815 3215 1880 3796 2017 2196 1784 664 1165 -54 655
537 655 431 1702 510 2409 1438 1164 1903 -552 693 -1522 -813 -998 -627 -481 65 770 625 1729
555 1729 -383 717 -1065 -2068 -2047 -3675 -2759 -3001 -1916 -2056 -568 -802 345 -71 -847 388 -1988
572 -1988 -983 -1648 -1488 -642 -4 270 1288 1991 1618 3261 1855 2977 2604 1588 3199 1808 2778
589 2778 3277 3249 3744 4029 3336 3338 3243 1767 2834 2046 3021 3101 2847 3896 3287 3918 3139 3900 2285 2824
609 2824 1520 1461 1755 1029 2497 1752 2886 2847 3207 2840 2926 2037 794 1318 -800 492 -1061 -593 295
628 295 -258 643 411 1296 12 567 -1065 -692 -1707 -2638 -1384 -2794 -1022 -1923 -1171 -670 -362 -557
646 -557 -936 -308 -1689 -230 -1734 -317 -359 -265 893 386 1450 549 1021 432 902 -17 323 1002 445
665 445 2255 1257 2907 2422 1925 2109 1277 1127 244 835 -126 1254 572 1796 2359 2046 3100 2102 2603
684 2603 1395 1223 212 583 -38 -60 1179 379 2223 1444 1879 1883 734 1059 -179 -374 -1319 -628 -1876
703 -1876 -624 -800 -1092 -112 -1247 -217 -1395 -1067 -1868 -2164 -2108 -2146 -1962 -2297 -1076 -2111 -1005 -1305
721 -1305 -1637 -1340 -1733 -1335 -1999 -1406 -1834 -709 -715 -111 259 -173 857 -567 -16 -596 -616 -632 -434 110
741 110 225 1315 1057 2108 1446 1962 1732 955 1482 298 957 252 961 818 1714 2012 1837 2571 1334
760 1334 2189 696 1074 315 -143 74 78 798 125 1053 4 758 270 -78 232 -1010 -327 -1335 -830
779 -830 -1139 -703 -866 -592 -116 -1195 -501 -1973 -1166 -1782 -2085 -1660 -2197 -1298 -1439 -634 -1339 -151 -1207
798 -1207 -1022 -1291 -1971 -1309 -2821 -1251 -1641 -699 -216 -191 326 107 751 -394 702 -721 191 166 -154
817 -154 962 566 1566 1585 2267 1632 2044 1327 1174 1390 379 1159 318 1154 1333 1247 1584 1424 1577 751
837 751 1031 115 622 -142 -65 364 -455 955 486 870 354 352 18 3 -356 -1005 -50 -1049 89 -403 176
858 176 454 -173 494 -454 -302 -1304 -815 -1935 -1123 -1126 -1350 -100 -1025 -28 -587 -202 -781 -630 -994 -1574
878 -1574 -829 -1608 -143 -1112 268 400 323 1345 514 1230 415 774 299 954 395 760 1445 704 2026
897 2026 1304 2093 1613 1597 1467 1000 1307 612 1621 620 1649 1114 1127 1515 717 1395 342 622 59
916 59 136 -292 150 416 113 936 206 1332 306 500 413 -260 -97 -711 -386 -865 346 -567 372 263
936 263 -203 398 -938 -86 -1036 -919 -1372 -1090 -1024 -1159 -448 -770 348 -859 -70 -776 -891 -795 -1296 -681
956 -681 -1351 -331 -248 248 11 519 544 82 592 -285 329 10 262 290 546 825 812 1631 1142 1742 631
977 631 901 1010 83 939 270 847 431 1165 959 1470 982 820 1361 22 899 4 28 418 420 604 551
998 551 987 365 971 293 428 -28 -366 -205 -1086 158 -329 120 -305 -69 -286 -190 -159 -1222 -680 -1510
1018 -1510 -953 -1371 -1238 -799 -1032 -283 -499 -452 -1117 -484 -1125 -947 -683 -1268 -442 -1301 -3 -602 220 228
1038 228 240 101 139 386 -190 431 -220 119 348 413 1353 871 1625 914 1008 624 940 397 377 824 124 1261
1060 1261 634 1171 1249 1006 1014 723 952 293 373 -386 616 179 140 890 149 845 312 620 45 37 -649 -409
1082 -409 -728 -960 -186 -777 85 -542 -289 -375 -418 -298 -1018 -729 -1326 -634 -1353 -635 -538 -760 -44 -516 78
1103 78 -452 -199 -622 -593 -824 -892 -491 -717 421 -191 688 209 168 553 -206 490 90 563 -230 894 543
1124 543 682 993 671 1440 573 1313 584 444 619 471 480 454 1152 627 1516 857 1110 977 159 672 52
1145 52 292 -68 286 -99 135 445 -86 722 -360 323 -526 -414 -510 -670 -535 -647 -507 -899 -40 -605
1165 -605 -139 -473 -613 -508 -1109 -528 -1135 -719 -784 -601 -430 -397 131 -430 352 -773 -410 -645 -775 -342
1185 -342 -497 -89 -172 426 -176 547 308 316 442 -12 203 -319 540 301 361 749 1071 914 885 1484 371
1206 371 1150 518 558 488 393 780 150 857 499 958 436 901 525 191 588 -395 494 -335 313 102 -110
1227 -110 59 -25 374 -326 -49 -708 -524 -742 -938 -474 -806 -201 -647 -94 -387 -305 -677 -748 -535 -1151 -382
1248 -382 -1290 -503 -494 -323 -209 -322 -37 -392 33 -416 -210 -538 -338 -233 -465 230 -12 740 299 712 375
1269 375 512 375 209 402 -35 634 221 709 649 588 912 629 773 437 621 89 472 317 209 980 80
1290 80 1069 560 754 426 582 330 26 22 -645 91 -296 246 -36 -90 90 -452 -134 -499 -273 -920 -657
1311 -657 -1065 -895 -554 -726 -428 -580 -73 -796 -380 -623 -681 -820 -1007 -684 -1263 -516 -620 -513 -184 -263 45
1332 45 -202 -65 -641 -143 -435 -291 -106 -87 464 -47 457 92 657 265 151 629 244 624 279 589 587
1353 587 1037 864 785 770 558 700 462 673 402 379 425 757 898 742 1156 742 761 562 706 384 -219 284
1375 284 -117 55 -158 281 -99 292 212 -36 163 -359 -17 -571 -705 -721 -633 -543 -707 -267 -574 -78 -526
1396 -526 -161 -247 -654 -388 -502 23 -638 7 -386 250 77 -148 -24 -87 229 -304 281 -33 418 417 271
1417 271 562 292 559 159 525 305 414 417 67 558 138 784 561 686 684 504 505 455 424 171 437 -51 -53
1440 -53 127 43 261 41 549 -202 441 -132 -24 -518 -453 -279 -861 -279 -951 -513 -357 -503 -487 -815 -515
1461 -515 -890 -679 -1098 -935 -1157 -948 -673 -737 -470 -1042 -457 -707 -345 -825 -989 -389 -1002 -287 -766 86
1481 86 -82 -117 -122 -159 -24 -241 5 -523 105 -313 140 269 474 678 408 604 392 473 269 271 79 72 427
1504 427 26 657 433 416 455 620 599 403 515 50 182 -168 364 244 122 319 143 498 -79 370 -23
1525 -23 -85 -219 -298 -223 -507 210 -339 56 -195 -391 -236 -677 -361 -694 -539 -939 -36 -574 -563 -569 -719 -344
1547 -344 -534 -143 -687 -617 -592 -685 -179 -490 -245 -336 80 -359 -36 165 -62 94 -211 311 -183 -2 -39 392
1569 392 165 285 679 323 819 507 425 247 391 203 225 555 314 677 314 763 631 464 287 139 597
1590 597 195 207 -129 181 40 354 167 -22 423 -338 68 -172 -300 -207 -372 -214 -416 -98 -491 -73 -383
1611 -383 -221 -312 -618 -231 -728 -87 -581 -455 -352 -474 -362 -337 -300 -462 14 -273 -279 -377 -511 -283 -150 77
1633 77 -236 289 -45 218 107 -20 530 -145 121 -52 552 13 247 511 152 720 112 587 -1 449
1653 449 40 316 544 392 454 508 328 303 674 247 506 248 75 229 58 244 -238 155 270 -45 269
1674 269 -83 -110 -379 158 -442 -227 -251 -319 -210 -296 63 -629 -94 -269 -288 -543 -456 -413 -570 -238 -501 -127
1696 -127 -241 -388 -236 -172 -195 -185 -227 -539 60 -571 -188 -284 -66 -92 -359 141 -61 53 11 80 325 21 484
1719 484 -121 324 171 168 350 82 543 141 459 73 298 160 305 130 205 493 425 333 303 317 174 -142
1741 -142 229 24 209 35 122 49 76 -325 271 23 123 -93 -448 -339 -617 -494 -501 -289 -414 -517 -38 -447
1763 -447 -11 -405 -631 -533 -726 -361 -574 -250 -625 -121 -473 -187 -414 -544 -74 -553 -248 -608 -183 -115 -108
1784 -108 42 -11 366 54 570 85 90 268 141 280 330 305 166 615 328 682 881 253 624 346 905 586
1806 586 455 315 698 474 481 893 405 637 232 524 413 470 278 332 413 71 516 97 389 161 -22 519
1828 519 123 510 -73 -131 -202 -164 -113 -235 -95 -217 70 -496 -134 -494 -282 -389 -655 -240 -377 -191 -229 -304
1850 -304 -185 -135 -141 -128 -90 -445 135 -222 -88 -293 36 -104 -11 148 130 328 262 336 86 -102 196 47 87
1873 87 -5 303 404 503 280 208 310 369 485 55 525 165 187 339 90 484 153 120 182 159 360 -44 -30
1896 -30 -133 279 -147 339 -99 386 -6 -14 84 -346 -25 -315 -339 -512 -336 -547 -278 -169 -363 -235 -520 -258
1918 -258 -307 -270 -470 -364 -219 -451 -36 -410 174 -44 -179 -78 -181 -70 -39 249 154 192 100 140 397 67
1940 67 333 8 479 86 330 154 307 259 42 260 334 392 311 606 189 287 517 502 314 109 73 203 504
1963 504 287 207 564 51 412 -40 192 214 103 -150 152 -55 -165 -59 -134 -206 -303 -126 -132 -591 -321 -594
1985 -594 -487 -368 -532 -468 -449 -458 -521 -187 -591 -252 -515 -491 -507 -485 -386 -391 -134 -124 -177 -427 -10 13 -248 -396 -259
2010 -259 -211 -364 77 61 279 98 204 393 64 84 -175 -23 165 154 375 34 228 223 322 232 398 -14 217
2033 217 211 13 361 87 337 53 102 239 131 286 -52 104 -439 201 -243 -87 42 -397 189 -261 -69
2054 -69 -208 -243 -559 -186 -175 -420 -94 -914 -294 -430 -360 -566 -173 -167 -604 -274 -414 -319 -422 -336 -249 -240 -304 -188
2078 -188 -497 -71 -144 -268 -252 -196 44 109 -228 233 -50 109 -42 242 434 37 117 -171 291 72 228 223
2100 223 188 113 189 53 255 307 129 347 275 100 260 239 320 -146 362 -20 245 81 144 215 -191 233 -245
2123 -245 -53 -148 -215 28 -398 -233 -116 -69 -118 -350 -466 -476 -11 -332 -343 -483 -326 -346 -25 -313 -171 -232 -367
2146 -367 -216 -414 -5 -395 -322 -271 -289 -57 -199 61 -153 -228 -52 -248 -50 -155 142 -115 288 -26 357
2167 357 57 366 292 159 557 85 247 82 148 210 294 271 111 410 467 596 -114 69 155 106 331 42 -23
2190 -23 -183 312 -290 226 -142 -139 97 -217 -18 -382 -72 -152 -56 -292 -259 111 -12 139 -423 -111 -240 -332
2212 -332 -47 -587 -146 -253 -192 -332 -122 -114 -525 1 -292 13 -382 -326 -401 -268 -70 -118 211 191 87 13 169
2235 169 -110 223 131 -137 280 322 232 224 383 401 403 446 537 627 13 514 197 392 381 319 219 340 313 177 445
2260 445 92 285 305 43 94 -96 14 -144 73 -253 -165 12 -220 24 -96 110 -169 -3 -256 -309 -169
2281 -169 -126 -62 -249 -222 -586 -194 -207 -413 -236 -702 -256 -468 -480 -529 -609 -425 -43 -422 -466 -295 -511 -358 -456
2304 -456 112 -114 -110 138 -174 -21 65 -16 -109 0 238 -9 98 -80 348 -102 440 214 156 226 115 186 26
2327 26 204 -137 218 163 -18 114 172 -28 152 267 32 65 -180 -48 221 -113 135 -283 157 -192 -135 -125
2349 -125 -207 5 -254 -1 -392 -11 -223 51 -466 -125 68 -132 -280 -465 -255 -443 -350 -371 -208 -218 -474
2370 -474 -179 -206 -228 18 -155 -233 -294 -57 -163 31 -237 37 64 -79 178 -102 271 115 218 -18 294 312
2392 312 130 177 115 333 -12 593 185 210 181 18 109 214 247 191 193 210 473 299 361 294 -88 278 73 3
2416 3 123 39 120 -108 143 -93 237 120 78 376 -214 -257 -5 -228 -323 -398 -176 66 109 -297 -27 -188 -80
2439 -80 -299 -37 -395 -215 -305 -159 -16 -33 -53 -80 27 31 13 8 -105 20 -172 147 -99 278 -35 240 208 -6
2463 -6 381 138 195 116 306 152 85 417 241 75 3 256 353 246 385 308 426 16 303 -204 357 467 432
2486 432 334 190 171 -88 168 206 280 36 -81 -50 -206 285 -66 73 -65 5 47 -13 -160 -13 -279 -106 -193
2509 -193 -75 -193 -3 -193 -224 -202 -153 -199 -223 -474 -313 -117 -447 -106 -216 65 -219 4 16 -27 111 39 12
2532 12 -154 102 134 -22 227 114 36 77 207 64 36 18 -19 148 204 385 131 507 282 134 98 281 126
2555 126 346 392 119 177 -72 364 249 263 137 126 181 -50 108 93 -34 -40 37 98 -39 -139 47 40 -353 -75
2579 -75 166 -371 -191 -392 -176 -344 -383 -243 -199 -252 -337 -111 -418 -112 -367 -56 -286 -17 -389 -350 -327 -370 -175
2602 -175 -29 196 -151 -82 -65 -164 18 -197 37 5 -27 -137 3 410 254 327 138 406 298 185 151 378
2624 378 332 394 219 -75 467 82 142 56 -198 80 77 458 -10 60 -140 60 45 213 244 -224 -21 46 -66
2647 -66 67 -118 48 214 -108 -269 -106 -278 -121 -358 -378 -203 -374 -101 -161 64 -113 -150 -290 -42 -187
2668 -187 -279 -70 -249 -66 -324 -15 -250 -158 -2 -275 89 187 153 -149 -293 179 197 485 -34 206 77 -82
2690 -82 21 23 -59 -1 253 -65 193 -18 200 319 219 189 207 338 -18 2 148 278 277 255 230 9 362 131
2714 131 342 79 125 202 -78 399 179 69 -63 162 -34 82 261 7 185 -93 16 -85 -75 -114 -165 -151
2736 -151 -345 -142 -295 -69 -155 -177 -124 -227 -141 -258 -163 -375 163 -172 -92 14 165 -17 -21 143 -114 158 340
2759 340 -18 -88 177 258 0 279 47 316 242 239 220 117 244 -113 145 1 134 109 338 68 40 415 -89
2782 -89 131 381 190 320 169 144 59 321 146 319 488 378 -78 147 118 0 11 37 277 70 106 -29
2804 -29 -120 -177 -292 -47 -138 -169 -417 -307 -193 -539 150 -464 -161 -301 -203 93 -53 -164 -256 -231 -209 115 -195
2827 -195 -100 83 -64 150 -20 99 -227 330 -17 476 52 80 294 60 100 237 32 169 224 318 326 654
2849 654 335 440 51 105 -13 194 -24 243 141 435 782 188 727 386 794 652 -92 209 305 125 -52
2870 -52 89 118 638 474 92 -545 -449 -160 -493 -148 -114 -355 -137 -22 -162 -353 -158 -42 -188 -291 -310 -33
2892 -33 4 -30 -138 -28 -36 -7 66 -372 -247 -20 -148 41 10 -21 38 180 13 106 -63 237 36 -36 173 176 99
2917 99 48 215 33 54 373 171 198 409 505 -14 286 44 68 71 46 237 53 -134 91 265 -37 -5 123
2940 123 145 177 -156 184 -206 -61 201 -129 -193 -216 42 6 -174 -105 -214 -231 -305 -151 -274 -300 -13 -129 -118
2963 -118 -197 -22 25 -104 -93 19 -221 -335 -55 -16 -90 -388 -17 -109 -31 -99 112 203 1 306 64 39 -90
2986 -90 269 190 155 -268 74 318 29 100 -69 156 -19 145 349 268 269 215 91 -2 279 31 280 -224 575
3009 575 -765 275 14 -47 63 67 116 538 134 583 -145 285 277 828 -167 -86 318 372 -93 566 591 -354
3031 -354 -75 -261 -60 -270 -380 599 86 41 -568 -268 -171 -47 -305 -116 -407 -89 -319 -246 317 367 235
3052 235 -45 285 198 -70 -231 -655 -94 274 -209 259 38 -381 27 41 218 316 26 -257 87 -67 361
3073 361 358 430 131 132 -240 -27 18 -40 472 -218 -59 -13 22 368 176 368 96 126 46 -63 281 -21 147 -210
3097 -210 76 -142 15 -130 -165 -142 -166 -144 -307 -42 -130 -71 -121 -146 -230 -337 -45 -253 -135 -210 -268 -230 101 -52
3121 -52 -115 -200 -86 -33 -243 -26 62 -150 -62 -15 133 50 104 86 -94 -78 87 50 -156 147 165 258 136 -62 -12
3146 -12 78 333 28 145 -103 81 -202 -17 -95 74 258 140 298 110 141 5 179 91 30 309 47 -53
3168 -53 -117 158 -353 -246 33 57 160 -226 63 -199 108 -16 -178 -92 -211 -17 -109 -176 -12 -26 -140 -331
3190 -331 28 -369 -28 -194 -157 -94 -67 -33 -115 49 -56 70 -160 -139 14 -262 -46 79 128 -77 111 -35
3212 -35 -37 -16 227 38 9 -1 -31 120 -113 224 70 191 169 67 224 -160 139 286 178 -83 -14 225 76
3235 76 1 114 273 83 159 95 77 -157 -65 30 -417 146 -44 196 -82 -5 -26 -307 -315 -133 -56 -45 -149 -54 -201
3260 -201 -144 -200 -287 -46 -229 97 -254 -176 -255 -165 -20 172 -94 -9 29 -107 28 -89 107 -161 28 -169 -133
3283 -133 -109 145 175 25 -51 -10 309 381 24 137 60 242 -25 269 179 144 100 256 117 111 120 -34 260 87
3307 87 -32 181 73 -192 -147 13 39 -19 63 86 265 75 -141 -4 120 152 -21 -81 -131 41 46 -336 157 3
3331 3 -279 -95 10 -79 4 -206 -32 -59 -57 -159 -66 -146 -84 -367 -201 35 -137 -326 -52 -39 -122 10 -240 -213
3355 -213 99 37 106 -169 74 328 326 281 118 136 17 258 267 247 206 77 248 -206 46 40 233 201 -143 35
3379 35 -113 88 79 -21 18 -31 -72 38 83 -317 280 125 -50 13 16 -197 282 86 -67 -93 -67 -44 41 -137 -131
3404 -131 -133 248 22 -76 -141 74 -161 -374 106 -241 -123 -34 -31 -209 10 -167 97 29 -89 -265 -158 92 100
3427 100 118 147 68 38 -444 -208 -60 -11 -57 35 197 240 164 103 91 -9 238 158 142 157 -25 -23 225 58 128 -87
3453 -87 144 -10 98 -28 157 51 118 -41 -29 106 114 149 146 144 -126 151 -117 -50 1 -23 -97 18 -224 25 -130
3478 -130 -73 7 20 -107 -304 -330 -163 8 -108 -183 -74 -85 -209 -57 -34 43 -22 8 -94 -177 -103 -108 -224 -106 55
3503 55 -28 18 18 120 159 -42 46 -192 138 -45 58 -193 167 14 58 239 184 175 116 85 125 50 199 -43 136
3528 136 136 127 2 142 149 53 228 -260 112 -53 136 163 56 1 -89 202 -60 54 -179 -63 80 -131 116
3551 116 -100 -145 -21 13 -129 -78 -51 55 -48 -299 137 9 -70 -187 -52 76 -10 79 -58 202 -188 -101 2
3574 2 -80 84 -32 173 69 -33 265 -134 -144 -54 -155 -56 87 11 -16 174 297 149 60 -28 200 199 149 202 128
3599 128 215 43 -71 280 -65 220 159 146 103 174 90 31 208 119 -9 -30 7 53 -361 -80 -56 -108 -72 -210 33
3624 33 41 -31 -141 -68 -122 -21 -282 -25 -67 -19 -141 -186 -42 -39 3 -140 -22 -44 -161 -39 -97 -44 -191 -42 15
3649 15 -22 -138 168 22 55 -26 -110 3 22 -6 168 148 169 -86 187 -210 158 23 -64 115 -75 -112 129 53
3673 53 2 134 119 -8 134 78 145 -69 62 82 177 -15 -21 -24 22 -31 -170 117 -158 -120 -5 -65 54 182 -210
3698 -210 33 94 -226 40 81 16 -26 35 -140 -108 -57 -191 -94 -47 -184 17 -131 -145 -46 -184 -136 -17 -75 -131 17
3723 17 -90 127 -145 -240 -351 -121 185 41 230 -312 150 27 -28 47 -145 183 224 43 -62 214 40 -137
3745 -137 239 -3 230 54 34 -135 34 6 -73 185 -156 224 224 -137 -245 -123 137 -60 73 106 60 -17 148
3768 148 30 72 26 154 71 -3 72 -46 162 -44 -349 -52 -105 109 88 -69 -46 -98 82 -80 -184 -52 -145
3791 -145 -32 182 -205 49 -190 79 95 -34 -113 -159 -34 -161 224 64 -17 320 -19 26 173 391 -156 136
3813 136 129 -38 262 -33 -28 163 222 -19 -30 -16 24 428 -124 183 -202 174 118 219 -183 -36 118 -78 371
3836 371 144 138 161 -141 19 -48 -264 -96 -12 -36 61 -510 -125 151 -410 -31 34 117 16 11 -17 25 -267 -193 18
3861 18 208 -135 -369 -179 -157 228 -95 -148 -154 -10 -35 37 -318 27 318 -99 -54 424 -176 -65 -60 132 -70
3884 -70 -159 -69 -292 -148 -139 -24 1 162 121 156 -3 13 -101 23 45 112 172 29 -58 242 163 161 -90 -47 -137 78
3910 78 436 58 217 310 441 146 -186 -196 -44 134 12 -51 -41 -29 122 -45 404 -447 -194 -178 -208 549 -128
3933 -128 -251 160 200 254 -87 -31 -270 -56 -488 128 -220 446 448 155 -506 171 586 34 -85 294 170 -59
3955 -59 -83 -424 -385 485 -269 -117 -24 -250 223 -119 280 204 21 -54 753 205 528 108 106 102 225 105 -112
3978 -112 -90 280 286 -386 -207 -20 -102 174 290 115 206 -307 -12 149 -125 16 -26 -1 65 45 50 295 -183 -226
4002 -226 79 -307 -63 -90 -189 218 -303 -228 -229 -6 43 107 -3 -228 28 -106 -158 -398 -3 -39 -52 -83 -174 -32
4026 -32 -60 133 70 -153 177 94 307 110 -235 -117 -161 -45 257 33 -171 35 -200 105 163 -76 21 183
4048 183 147 54 74 -39 288 -2 376 122 34 12 141 381 19 252 -57 119 -3 -79 140 -107 -72 -319
4070 -319 -229 -105 83 -207 -96 -187 -24 107 -17 -219 -184 -246 116 -155 78 -61 -93 -78 -90 -2 61 105 -82
4093 -82 141 -207 -32 -118 -64 64 -48 -293 -27 127 68 -48 61 175 351 -66 99 275 50 -186 -55
4114 -55 -107 160 105 164 222 -20 103 12 287 96 -36 -32 -10 255 154 -104 81 -68 -120 -30 103 -73 3 -315
4138 -315 214 -100 164 273 53 -140 -324 -15 -29 59 -74 -193 9 -110 -44 -204 167 176 -208 -164 52 76
4160 76 -60 95 -97 -412 -24 33 -126 -316 -33 -330 27 85 -114 -161 98 -48 -205 -10 -47 -16 10 -120
4182 -120 -20 33 74 141 261 -1 -103 83 175 107 89 24 -199 20 -124 67 10 56 70 -55 -62 138 25 -79
4206 -79 265 -106 -7 113 147 231 -14 159 47 230 -128 28 -79 -5 134 55 56 -41 -217 -1 -295 255 22
4229 22 -217 -10 -66 -112 -61 -160 -110 -103 8 -47 -37 -140 72 -249 -177 161 -241 118 68 -19 -90 -88 187 -72 106
4254 106 235 49 252 -148 -100 106 152 114 191 135 147 242 14 -22 117 177 -75 -24 260 -258 195 -19 251
4277 251 -540 262 458 -394 407 -283 587 96 -179 -308 340 334 39 275 295 -563 -34 -44 -40 167 351 -46
4299 -46 -61 -88 -33 -225 151 158 180 -172 95 41 -28 -118 -105 -119 -112 21 52 4 -291 36 -107 31 92 64 52 2 37
4326 37 -140 11 -18 -72 -22 -19 52 116 58 -277 -55 46 159 -85 160 56 61 140 97 -71 -10 -129 52 97 -23
4351 -23 95 -315 -26 47 129 250 -168 16 250 -98 -13 184 102 -72 -149 -86 40 77 81 42 65 103 -26 -278
4375 -278 -5 -249 -31 -88 73 -85 -229 -116 -108 6 16 -17 -37 74 45 -257 -129 -101 -216 218 182 123 20
4398 20 -14 41 -93 81 230 -39 110 100 -40 -30 -69 -114 227 -41 -274 -56 85 -29 196 293 127 43 84
4421 84 -22 -22 -6 138 -28 23 20 -24 63 -6 355 53 148 51 41 157 -122 -198 213 366 171 -34 14 -119 -222
4446 -222 -246 -135 -240 -97 -147 80 37 -257 -33 -82 128 -159 -102 -212 55 -175 19 -14 18 -2 -254 -64 -55
4469 -55 -34 -270 -19 -88 11 -75 -2 -85 -90 -12 152 -37 37 -88 100 -2 -141 62 75 21 216 193 130 263 -82
4494 -82 -58 -140 97 104 92 243 83 286 166 1 -7 143 100 -48 -4 -212 25 -181 -38 92 -27 82 229
4517 229 -253 194 52 -220 22 -119 128 -42 -103 -352 -140 -151 -308 -179 6 58 -69 -68 -30 -29 -25 -110 31 -60
4541 -60 -66 -8 -55 -48 -97 30 234 -93 -40 41 -96 -221 75 50 -201 236 74 58 223 8 147 53 -237 91
4565 91 -17 -215 182 158 150 -203 -139 238 54 87 -222 279 211 119 -29 110 -24 -260 130 48 -142 120 34
4588 34 -714 -87 373 90 -235 -176 39 -43 -143 386 111 44 401 -125 257 -422 381 -128 34 363 156
4609 156 -122 303 -252 -93 -38 259 328 97 3 134 75 76 334 -629 -309 -117 946 252 340 128 -88 152
4631 152 -51 196 -368 212 -214 -142 442 100 314 35 -351 -111 -390 -67 -95 -140 40 236 -233 4 133
4652 133 -105 -494 -388 119 -47 429 368 406 131 -40 63 -149 167 -119 -120 -369 242 -230 138 -257 -53
4673 -53 -30 -75 22 110 -42 56 55 -75 115 46 -106 -209 -178 34 -53 -125 -32 9 77 43 -30 -141 -51 -51 -116 38 -29
4700 -29 -188 37 301 240 35 -113 41 51 35 -100 21 265 65 273 -43 88 99 32 -98 86 5 143
4722 143 -305 -2 196 -58 -17 -243 63 -79 -148 -48 186 27 191 -121 -29 -190 31 -73 202 -46 73
4743 73 288 74 41 -213 -137 129 -168 49 281 -2 116 148 87 -70 -56 -319 25 103 -78 -132 -426 -114 -153
4766 -153 -191 273 -404 189 -16 -91 -114 96 355 181 249 -95 88 691 197 229 -274 -540 328 571 299 -114
4788 -114 255 306 -120 123 425 293 -398 -7 373 276 -425 -452 284 397 155 -199 113 -319 127 -40 -146
4809 -146 -25 254 -40 -113 0 86 -132 123 -91 -31 20 136 75 -105 246 7 -114 -220 110 -66 -85 -9
4831 -9 -106 7 54 -119 96 -51 -57 11 -75 -411 -49 112 -22 -193 -180 -123 118 6 -183 16 73 -66 -45 96
4855 96 -170 10 68 -143 -62 90 -43 435 273 53 -89 22 103 52 34 0 -28 77 43 162 -131 -17 246
4878 246 -82 215 -342 -113 -62 -87 184 150 208 -9 -178 7 166 -105 -97 -72 -25 -4 -75 245 -119 19 -202
4901 -202 -130 -256 -144 -24 12 13 -123 65 12 -36 76 -243 -165 -70 -181 108 -222 29 -184 -133 200 -25 -212
4924 -212 215 97 -195 139 96 7 82 -230 -27 60 45 -15 -61 102 -66 22 171 88 29 54 97 -21 2 89 45
4949 45 263 -108 1 4 20 94 -179 -118 38 -86 -48 -171 95 51 99 -168 -45 35 120 -94 -17 53 -186 10
4973 10 28 -90 -51 -17 -161 -7 -64 -94 44 -57 -131 39 100 -11 80 -69 41 52 21 -24 6 -79 48 62 -34
4998 -34 -176 5 -19 -72 -36 -105 94 -161 -34 53 -10 285 -76 30 -32 98 209 110 -49 -1 25 38 153 125
5022 125 -132 -109 73 -45 -89 -270 -13 -84 -96 -165 126 14 -220 -26 -54 -29 -304 -202 118 156 -199 -89 209
5045 209 7 -54 -67 -62 -37 61 -25 0 38 5 -57 128 -131 -105 -48 -413 51 -36 104 72 -101 1 24 2 158 -270
5071 -270 -8 -288 199 109 39 6 203 273 -47 -6 -179 266 -121 138 -56 291 64 259 19 -246 22 -129
5093 -129 -190 -81 3 197 210 -116 -123 -108 -76 23 64 -88 158 85 -126 21 -30 142 61 174 79 -116 12 -154
5117 -154 -35 104 -185 78 46 -115 6 -172 -156 -321 211 -79 -164 238 -109 10 -209 -58 -330 -162 -103
5138 -103 274 -33 153 -128 -119 -87 98 -81 -249 39 293 -104 -82 38 25 106 -27 76 -8 120 -21 -93 -21
5161 -21 -194 -23 52 -22 -66 196 137 58 137 38 93 129 -39 -213 480 -500 -185 2 -155 164 137 -163 -410 63
5185 63 16 -83 27 -96 8 -66 -112 90 215 123 -49 55 61 -19 -263 253 -3 -306 -289 -142 209 313 -251
5208 -251 -383 -323 -9 160 -44 -172 169 -304 120 -56 67 127 141 -306 -289 271 -60 217 19 -202 -80
5229 -80 260 52 511 288 -8 -329 217 -300 477 -231 72 31 -159 393 115 -88 -344 -181 327 370 85
5250 85 -55 -18 610 32 111 -61 150 182 105 339 23 -103 217 -26 -50 -169 -285 4 -95 136 -359 -301 -341
5273 -341 53 22 -71 -206 398 26 44 -184 -223 -451 -487 -290 -12 266 -3 291 210 -167 262 -316 322 438
5295 438 48 -144 394 -528 -230 80 -649 -188 -78 219 -416 -185 178 331 210 31 -387 69 -120 -195
5315 -195 215 24 17 -513 -189 247 374 171 744 284 -252 -70 -139 85 167 313 365 -141 331 629 -123 658
5337 658 -171 315 201 163 183 -112 165 -14 64 -201 399 116 11 483 -303 -166 -493 -464 15 -510 244
5358 244 -466 -262 45 -81 594 -427 274 -68 -85 2 -458 -92 521 293 -352 94 336 -4 345 -120
5378 -120 -275 142 -99 511 426 96 1 244 -472 167 -620 -1 357 137 -154 -494 44 267 -87 203 197
5399 197 -251 21 -115 592 420 263 -88 45 -469 30 371 406 -119 -131 558 356 218 -52 -215 194 286
5420 286 546 -303 -81 317 -263 841 69 307 64 -83 64 17 138 248 -132 -95 -115 -281 331 4 380
5441 380 406 -257 -240 264 336 -192 -80 572 219 -7 209 -340 250 245 -84 -244 -682 132 -324 249 1483
5462 1483 -918 433 -661 157 -25 778 176 -92 533 -406 -58 -246 274 -183 63 -152 468 -255 34
5481 34 -421 180 506 317 252 6 -173 -90 -250 -158 224 216 -429 76 -122 39 336 25 248 75 -5 -149
5503 -149 113 -163 -221 356 209 430 -27 143 199 236 420 238 -420 9 -26 -326 378 -170 -58 -438 -26
5524 -26 55 -265 -465 -19 -129 183 -28 -255 67 -134 130 183 120 -138 -31 52 -240 197 340 332 141 35
5546 35 -127 -107 -72 -15 -95 -72 -103 -246 114 30 164 1 -187 -209 -103 -152 66 -217 -134 101 85 49 -63 32 -49
5571 -49 -76 150 14 159 -85 -153 -71 -92 44 128 -123 -30 -86 41 -15 238 -102 -2 213 44 -131 -36 -185
5594 -185 90 217 -286 146 6 -90 -241 133 3 -68 -44 -149 132 221 90 -84 220 0 -129 121 45 -39
5616 -39 59 1 5 -131 123 153 73 155 -3 173 -50 -211 -170 161 180 119 -87 189 -158 18 -282 -278 -85 -63 15
5641 15 -12 51 -96 -151 0 -59 16 15 -181 -87 39 -9 -94 -149 -55 54 -49 205 145 -11 56 -239 109 3 -108
5666 -108 64 -55 -101 136 127 -58 114 -34 33 303 -16 65 -53 -92 -60 -320 -94 149 -3 130 -1 86 133
5689 133 86 -243 -250 -141 -200 28 -200 112 -141 207 263 -25 -129 -228 46 -127 46 49 171 -23 289 -5 -44
5712 -44 91 -425 170 -89 -238 26 -216 -138 33 49 48 26 -149 -126 -231 -59 23 152 -238 41 -100 -86 -11
5735 -11 -202 183 -15 45 -277 -158 22 2 -25 -106 338 136 15 115 77 -42 -208 -33 -194 339 -129 151
5757 151 45 42 214 61 193 74 -137 74 -140 -340 -246 147 183 -13 -113 187 -186 2 117 -26 -122 96
5779 96 46 183 117 -7 68 -21 -176 -116 164 104 71 -134 108 102 -244 -349 20 -27 167 -63 30 212 33 -81
5803 -81 -133 -140 94 -54 70 -162 68 113 86 -9 -174 56 354 -204 -134 -71 -8 -43 36 -331 -12 -138 -121 -53 -98
5828 -98 -30 118 -124 52 55 135 222 -171 -138 119 171 29 -40 164 -97 -128 209 -138 -204 1 -45 -146 -6 -52
5852 -52 98 -36 -33 44 121 38 -97 -177 -5 76 -207 -149 82 36 55 -98 -152 -212 17 -113 -107 -144 -23 -114 101 -91
5878 -91 81 -28 24 -176 72 71 -152 -6 30 49 66 109 -87 -164 99 89 -79 -26 218 -196 -37 18 -116 -1
5902 -1 -4 -70 -135 15 -77 7 -87 -236 -16 -106 -130 38 -6 150 171 57 -64 -189 107 27 -8 79 16 30 -85 -157
5928 -157 26 -181 84 -118 -27 115 -137 76 37 77 -119 276 148 140 161 -100 -223 -63 -14 -34 -145 -124 -179
5951 -179 31 118 87 57 168 266 129 16 -12 -117 37 71 160 -98 -27 -24 -540 22 43 -89 170 -216 -71 -176
5975 -176 -229 209 -117 -64 -51 46 27 -190 -181 -139 170 149 -37 324 162 -108 -24 -73 75 -23 -7 -165 -38 145
5999 145 86 141 -61 84 -17 -60 -2 158 -72 -269 108 190 -37 77 68 51 265 -3 -44 12 1 202 -198 40
6023 40 -75 -6 83 110 109 127 109 21 89 85 100 187 -239 -75 56 -50 66 63 -46 -18 114 77 -122 -140 -214 -4 -60
6050 -60 -7 -22 -26 -84 48 -60 52 48 -190 -74 -92 -154 -96 148 46 -95 -254 -21 -19 -388 -85 21 -107 -312
6074 -312 -103 403 185 -27 237 -65 -129 -141 144 43 -178 83 -140 -49 -4 -154 232 133 -78 224 428 -261
6096 -261 113 148 217 216 -32 -17 11 156 -186 10 -169 -77 280 147 -113 74 -416 -62 95 160 -38 -68 -25
6119 -25 75 -64 182 -412 -185 -266 -217 -105 112 104 113 -163 -23 75 -34 14 -263 -7 -161 -206 163 232 15 174
6143 174 46 -165 -72 512 254 -22 150 107 10 -137 -372 -73 111 78 -11 176 -179 -156 387 -127 -88 -49 100
6166 100 148 -275 -154 -165 159 133 120 -1 128 -130 -96 254 36 34 33 61 -25 -220 50 195 190 87 -17 -80 -74
6191 -74 -125 -48 21 31 -213 289 -127 10 24 -288 264 -231 59 83 157 -5 -118 -156 29 -47 -126 65 -186 118
6215 118 -1 121 176 89 -72 -22 53 -16 65 72 -159 -3 -61 50 -54 -109 -3 21 153 156 38 -227 14 88 -159
6240 -159 269 -64 -95 -92 108 -46 -252 -104 127 38 35 -74 83 -76 71 5 -397 -132 -60 323 -113 102 -142
6263 -142 18 193 93 -43 -145 279 -17 -18 -61 67 63 164 144 128 4 133 -53 34 80 38 113 -12 -54 -152
6287 -152 -83 52 11 182 -111 36 56 57 -101 154 -11 13 106 -168 -145 -71 -104 57 111 206 -94 -14 -184 -73
6311 -73 48 -148 -17 -24 130 102 81 74 58 -17 190 32 -89 34 195 -41 82 -193 45 -94 -72 13 -22 68
6335 68 91 75 71 357 176 -120 -117 -94 80 67 -51 148 97 -165 -89 -53 -44 -180 138 10 114 -216 125 -36 -262
6360 -262 -97 -69 -68 -191 111 -69 -135 97 96 -71 247 -82 143 99 -236 150 -3 -3 -102 -190 103 -206 68 -256
6384 -256 -108 -75 18 158 -6 -43 34 34 179 82 78 -98 21 159 -98 69 -73 -114 -120 -189 -370 -214 -164 40 -48
6409 -48 -80 531 -211 274 97 -150 158 -141 -42 -46 47 -355 -395 -173 -663 -64 -467 166 -667 -480 155 -26
6431 -26 155 -49 121 -20 -574 401 -866 79 366 -333 -611 -656 560 -181 1 162 -138 -259 -521 66
6451 66 -40 389 -822 -146 -16 -2 128 25 272 -144 236 471 81 298 -180 -32 95 -83 -531 -263
6471 -263 2 166 275 -198 -177 251 145 -51 -37 41 -217 60 -5 -4 180 -77 51 66 -198 -322 148 -66
6493 -66 -57 -152 -104 109 9 -78 225 148 77 -34 -31 113 -149 -83 112 -131 167 96 140 -32 -69 23 -77 -87 -74 -249
6519 -249 -194 209 -56 163 133 -279 -71 226 -136 95 241 -18 -48 -53 -128 -59 2 -105 131 -10 265 -90 25
6542 25 -289 18 -196 30 -147 -79 46 -27 -109 -184 111 -262 81 206 -90 23 -105 -11 19 124 -72 74
6564 74 -36 171 -188 -18 67 -152 131 42 59 -233 -23 -206 60 97 157 -159 -20 68 -53 92 -110 -62 -14
6587 -14 252 -152 -99 -27 276 -101 -182 -59 -63 68 187 -129 -62 -44 -55 256 -85 -88 -55 -53 36 -120 -5 101 0
6612 0 -128 -7 34 18 15 0 -95 -26 -136 -127 -421 107 -87 -163 29 3 -51 3 13 -60 209 -179 5 75 -79 20
6638 20 -69 29 -80 129 -10 113 -64 -15 -34 -65 85 -295 -75 11 43 -250 -120 -114 -5 -175 356 95 174 49
6662 49 -128 -23 -59 225 143 42 34 -196 98 -27 -43 332 -136 127 64 -20 117 80 112 329 0 -88 20 215
6686 215 -92 0 -32 -207 17 -69 -194 46 -145 447 95 118 -141 183 34 222 -169 -99 116 176 80 -150
6708 -150 195 -261 -46 13 52 -348 147 -2 -45 266 -94 -114 -109 129 -107 -83 58 -106 -78 -29 2 43 -73 106
6732 106 -9 -233 -152 107 -230 102 -253 -232 246 -230 164 82 61 -117 -44 185 136 -76 199 18 -92 15
6754 15 157 2 -104 287 -87 -87 309 -34 -83 8 -30 17 48 71 -233 -349 -32 16 -342 -23 8 -106 -40 -2
6778 -2 -27 109 131 -51 141 -9 -143 -88 37 -352 -55 -50 137 4 9 234 121 -58 -144 -132 9 -56 -191 -40
6802 -40 23 -96 167 -277 35 87 92 52 -66 173 -175 -6 -196 -30 150 22 -40 35 20 64 -36 135 52 -25
6826 -25 331 -137 -22 -109 0 48 52 -141 -2 -51 -110 39 8 -43 -194 314 -42 -111 -218 115 209 -39 17 -88
6850 -88 51 4 39 108 46 38 -138 110 204 -122 -104 314 126 -253 -238 -144 -271 81 146 137 -87 149 -67 197 -190
6875 -190 2 175 -81 66 -176 104 -35 -48 -55 -49 40 -63 83 -12 -1 -182 171 -29 10 39 115 -3 -322 -3
6899 -3 -93 84 -80 123 -168 -92 -208 -89 -82 27 -8 -93 -230 24 -21 -185 145 22 -23 -65 63 -206 124 -201
6923 -201 51 -24 -93 -243 -196 180 130 92 -127 205 -176 97 120 99 -110 -187 61 -81 43 40 98 -34 118 23
6947 23 -227 -221 164 -19 28 18 14 175 35 -37 36 159 86 89 109 5 -73 -49 -209 119 233 50 -201 18 7
6972 7 -105 90 36 97 102 62 -17 113 27 73 270 238 -84 -86 268 25 368 -198 -97 -120 -52 20 -80 21 137
6997 137 -91 154 -3 -62 20 10 -108 134 30 -196 -70 -172 142 -129 133 -219 35 53 -132 -4 -60 -92
7019 -92 -116 29 -73 -53 54 -55 -98 148 -106 128 135 6 37 82 44 220 -134 -215 -91 174 -25 -221 189
7042 189 -36 -202 -82 10 -125 14 9 14 15 -48 -1 22 -159 -134 6 193 -165 -98 -144 -121 66 96 29 -53 -56 262
7068 262 -198 128 -23 -171 -98 -78 -324 83 241 -144 57 -35 -22 -247 137 200 -41 136 163 74 49 -48 96
7091 96 77 148 -59 -46 55 40 -3 140 -153 157 32 -68 -59 -94 -148 80 -32 234 69 -318 9 -50 7 20
7115 20 26 107 212 148 -161 -126 5 251 -70 -15 214 210 -102 -63 71 -41 -94 -210 -27 102 18 134 31 249
7139 249 80 11 -3 182 -79 -109 -271 -144 -137 1 156 -114 -82 38 63 25 36 -86 79 83 138 8 178 48
7163 48 -22 -86 343 -89 -93 -88 -107 -79 -13 -68 -206 -3 -137 -183 198 35 -122 -24 -6 3 37 -27 110 -117 159 -142
7189 -142 66 -177 263 20 60 -96 -110 -22 60 -78 37 225 85 291 -16 -50 102 130 10 -131 -10 -32
7211 -32 -118 130 154 266 0 97 -28 69 129 -63 -206 -269 8 -163 17 54 -143 83 -232 302 66 -203 -232
7234 -232 182 359 335 502 201 85 -272 186 -120 231 196 29 227 -363 -185 278 -167 -417 -14 384 325
7255 325 46 335 358 -750 166 -244 145 -353 -62 -23 210 325 -122 -234 188 97 115 88 219 232 128 -220
7277 -220 -16 -149 218 51 -56 94 184 -15 -17 31 -145 -68 -134 458 -54 213 -288 98 -104 109 -29 -201
7299 -201 102 -189 -90 274 -185 168 142 180 73 -87 -123 -125 -28 -47 80 -9 15 20 -241 22 -203 114 -314 410
7323 410 -183 66 -749 -57 -307 -1052 -81 501 684 -542 405 654 -546 195 142 -84 -176 31 443 206
7343 206 -238 25 -477 -15 -70 16 58 213 137 -232 28 109 3 75 16 47 143 17 -70 162 120 95 308 34
7367 34 -12 77 33 126 16 -7 -213 -136 8 -21 -34 -80 107 51 34 -253 -6 -8 251 -62 -25 137 272 5 -115
7392 -115 1 -93 182 -24 119 -50 -6 -24 -83 33 -49 59 -69 108 10 17 2 -129 196 -151 176 -178 -349
7415 -349 -65 -228 -106 193 157 -117 -135 -208 -99 141 188 157 179 -142 -141 3 93 -129 5 24 13 -30 164 -128
7439 -128 -39 129 -197 -139 -20 30 -68 -10 -362 -370 198 -128 227 -107 86 77 -176 354 -251 69 -302 -87 34
7462 34 465 70 -82 194 -262 181 -22 -57 299 50 -373 -133 -226 -151 103 5 -421 124 154 -181 -409 -549
7484 -549 -129 191 379 117 -119 -49 -527 15 -130 9 -84 -380 33 148 335 239 396 -9 156 -279 -180
7505 -180 3 -821 520 -104 -121 -212 510 -227 60 5 -54 -63 -231 -271 -43 202 -39 21 57 -203 -139 5 -26
7528 -26 -147 -400 -83 -209 113 -82 34 -29 154 -50 143 180 -78 120 -220 107 -79 137 -48 143 2
7549 2 13 -338 298 53 -36 -210 -64 -116 162 -10 -79 -64 18 -293 -278 130 61 36 -233 88 69 -26 -94 41 -171
7574 -171 -28 -56 -97 -26 -193 50 107 -109 -14 9 132 72 -167 17 94 92 35 -43 11 79 58 -54 -85 -104 94 -70
7600 -70 205 69 12 76 45 -171 -112 -99 -80 66 18 -118 -61 -39 194 -76 1 18 34 149 22 -113 14 -134
7624 -134 101 57 73 92 -172 13 221 405 -54 145 -67 -23 -73 181 140 -270 -225 -28 34 10 -13 10 -146 199
7648 199 6 -269 -110 -371 326 3 235 -158 -300 179 -78 550 -221 -6 -472 203 331 305 152 312
7668 312 -288 -434 1099 -383 136 -420 -145 -444 -55 1059 140 407 -73 249 -580 -113 -112 487 -594
7687 -594 -514 -470 164 190 -555 -371 -233 -386 214 -280 14 -191 -746 659 536 253 -235 -732 -114 -811 -363
7708 -363 427 193 43 -314 577 -306 -445 -60 329 -138 167 101 492 -179 58 39 -201 -203 23 89 6 -5
7730 -5 39 91 51 404 -39 15 -98 -146 345 309 289 170 346 105 -56 155 129 162 41 -1 -54 133 -323 385
7754 385 324 -630 184 286 73 193 786 -159 57 193 23 221 755 237 270 217 317 118 -361 333 271
7775 271 295 41 -300 -284 -480 -519 -130 180 -467 -479 326 -381 0 -79 169 11 -238 568 783 -291 -224 937
7797 937 850 -78 844 492 363 -161 -417 112 -199 644 -212 -196 -69 -359 -408 45 -339 -396 391 19 -475
7818 -475 17 -322 -103 310 -182 259 -119 -427 -304 -104 221 -63 233 -177 353 -620 294 7 -6 -32 523
7839 523 -457 450 -315 4 145 -34 -146 -465 433 -62 307 -233 65 -250 -220 286 92 -89 628 -272
7859 -272 267 -22 -357 91 540 1196 42 288 50 102 180 67 668 377 -283 220 -177 125 -425 -115
7879 -115 -345 -305 301 174 173 -325 -583 -288 -522 433 -388 532 24 -639 -173 -148 24 182 -61 -107 367 -799
7901 -799 -265 -218 -6 -237 -220 -728 230 293 19 326 83 -336 -806 60 330 -444 438 -367 41 -261 396
7922 396 70 -32 141 -41 245 -53 -213 389 -85 -358 -18 -235 61 -181 -261 104 275 130 -193 152
7942 152 399 -374 248 -513 -5 -71 152 378 23 507 474 40 124 68 -16 201 147 -512 381 -268 -429 -106
7964 -106 131 -379 -313 -565 -88 336 521 359 -293 14 287 -315 38 127 -736 -599 439 -166 -458 293
7984 293 -125 463 302 -491 104 326 -271 447 -105 448 366 540 6 -116 399 -529 -261 -539 -153 -858
8004 -858 122 199 111 133 -520 862 -105 424 250 -49 60 -4 45 988 -377 196 337 -346 -72 202 126
8025 126 -546 -39 -272 -97 -424 -437 162 196 942 545 -482 -556 296 -23 126 -1227 81 29 539 297
8045 297 -66 305 -1065 -591 -22 -155 -225 13 612 -207 70 -137 422 432 -332 808 342 435 460 115 83
8066 83 155 459 -388 269 -227 -160 -616 -140 -504 -997 322 -322 -600 -220 -333 -188 165 592 -244 -580 297
8087 297 -280 -486 -821 390 10 -44 173 139 -684 353 -74 -592 -23 -356 2 424 141 623 -829 280
8107 280 162 -273 -318 -252 -58 33 -273 -749 -252 -494 92 -952 -575 -269 -388 -94 -153 -215 18 856 354
8128 354 -717 652 123 111 819 -723 376 180 479 428 317 160 -747 698 164 -426 -56 -42 196
8147 196 -267 295 -295 -29 394 -98 -398 267 -194 512 177 -793 599 -114 451 142 516 -177 -171 79
8167 79 251 -39 -303 -87 428 -615 -759 -24 -411 9 377 430 249 538 -130 221 -142 -2 384 416 485
8188 485 370 172 86
8191H6
$$ Imaginary data points
##PAGE= N=2
##DATA TABLE= (X++(I..I)), XYDATA
0 0 0 0 0 0 0 0 0 0 0 0 0 0 0 0 -8 8 -8 8 -8 16 -16 16 -24 24 -32 34 -40 48 -56 64 -72 82 -96 106 -120 136
36 136 -153 172 -192 213 -237 265 -293 326 -359 398 -439 484 -534 587 -647 715 -787 868 -959
55 -959 1059 -1177 1311 -1465 1646 -1864 2130 -2465 2902 -3494 4356 -5729 8284 -14763 72719
70 72719 125510 100311 106193 70289 76207 49120 44070 38419 30421 27859 35470 21839 37675 25093
84 25093 21684 28356 12998 12074 10978 3991 3286 3065 -130 3256 2868 -2491 6403 -4834 1153 1350
100 1350 -3335 3261 2777 403 5262 5546 -346 5366 -5299 -3485 -4133 -13330 -2415 -8822 -3732
115 -3732 3029 2074 6986 12247 7011 9212 9316 335 6676 -1803 967 4268 905 9225 10055 12958
131 12958 16533 19229 15778 20803 16960 15422 19172 11435 16305 12386 12133 14201 11819 10813 12553
146 12553 9367 6956 11654 3491 8375 5367 2066 5924 -617 1260 -464 -4620 -5076 -4932 -10476
161 -10476 -6286 -7508 -9678 -2359 -7864 -1668 -2144 -3767 -886 -4408 -5881 -6907 -8792 -11708 -6848
176 -6848 -11353 -6865 -4304 -5392 1845 -676 1945 1475 -348 -2828 -2535 -6685 -6827 -4956 -8721 -758
192 -758 -2827 1733 5178 3932 7303 5648 4739 3960 3860 82 4283 1940 3468 8045 5088 11213
208 11213 9040 9830 10149 8176 7048 7044 5339 4216 7446 3354 7679 5996 5025 6898 2687 3180 674
225 674 -525 -2057 -296 -2690 535 882 -321 4193 -947 1243 -1462 -3816 -4420 -6068 -6546 -6155
241 -6155 -4343 -5121 722 -1709 1657 1666 -1698 709 -3701 -4286 -5748 -5931 -7172 -4651 -5137 -2624 -396
258 -396 -2695 2897 -889 93 -51 -2571 -1873 -2974 -2775 -2695 326 -1929 2229 783 1763 3672 75
275 75 3415 968 1170 1829 2176 2008 3786 3562 3172 5791 1723 4656 1617 1351 2633 261 2119
292 2119 2476 3022 2736 5486 2891 4576 3032 901 2707 -1849 -329 -1569 -1427 -351 241 213 1132
309 1132 1634 -325 2295 -2559 -1429 -2685 -4730 -2983 -5143 -3325 -3349 -1881 -2303 -248 -2031 -1663
325 -1663 -1445 -5000 -2358 -5632 -3965 -3983 -4081 -2227 -1634 -1309 -1240 675 -2453 649 -2118 -1865 -1006 -2645
343 -2645 545 -681 610 1941 2554 1996 3522 2024 1417 2427 -598 1718 924 2111 3872 2791
359 2791 5135 4954 5071 3978 4612 1541 2667 1034 -48 2434 557 3403 3052 3653 4546 4126 2539
376 2539 2096 605 -1436 653 -2539 -381 -644 -930 1562 728 978 26 -112 -1998 -2031 -3887 -3489 -3002
394 -3002 -4590 -1709 -3126 -781 -1123 -2112 -1421 -2492 -2647 -3593 -3202 -4654 -1709 -2969 -1373 223 -886
411 -886 1951 -179 596 -880 -736 -2010 -1079 -1706 -840 917 -969 3066 1509 2252 2752 1503 1233
428 1233 232 380 -1198 1089 -1332 1250 1027 1131 2673 739 2207 952 462 -401 183 -1058 -904
445 -904 -66 -1146 1494 -639 1499 595 -446 432 -1982 -1743 -2836 -2439 -3654 -1443 -2520 -1313 -646
462 -646 -1530 414 -1646 -982 -1909 -2836 -3006 -3175 -3088 -2762 -988 -2239 968 -459 724 344 -1319 -218
480 -218 -2009 -1660 -2365 -972 -1690 516 175 1080 2354 649 2433 709 946 774 256 505 704 1657
498 1657 1586 3249 1613 3272 1912 1591 2167 518 2011 948 1865 1758 2856 2706 3381 3220 1480
515 1480 2695 108 674 -310 -863 -324 -864 86 562 1425 325 1922 -44 162 -441 -2338 -972 -2618
533 -2618 -1407 -1827 -890 -321 414 544 763 1350 -434 770 -1165 -638 -1163 -1900 -706 -1459 -642 -1116
551 -1116 -329 -1140 -459 -1295 -1745 -1048 -2893 -1292 -2195 -1284 -1412 -991 -885 -950 -913 -1618 -338 -2331 -608
570 -608 -1620 -1348 630 137 1567 1267 1877 1351 1516 330 890 123 -701 908 -1412 1043 504 1561
588 1561 1933 1734 870 727 544 -1111 -771 -2233 -1232 -1686 -2266 390 -593 1310 970 1094 436 642
606 642 -180 -909 -684 -1689 457 -1181 701 876 474 1423 609 806 -266 268 -1413 -259 -895 -411
624 -411 73 -804 976 -532 307 -639 -754 -1123 -1192 -853 -1264 41 -832 948 300 1416 1656 500 1195
643 1195 -10 376 -493 601 -187 1242 1216 1536 3074 1724 3341 2250 2257 1363 765 946 633 809 300
662 300 1608 696 2063 2001 1764 2733 1079 1887 829 665 248 805 250 521 905 489 1979 480 1595
681 1595 903 536 498 -89 78 -358 595 -644 839 -77 247 202 -1272 -145 -1640 -1199 -1667 -1550 -1489
700 -1489 -930 -864 -712 308 -1224 -87 -1454 -1383 -1473 -2335 -1194 -2000 -764 -651 658 320 1419 781
718 781 763 1294 -629 513 -444 268 -349 322 1045 1296 2140 1847 2699 1209 2268 1183 901 1407 536
737 536 1173 764 1709 1584 2242 1311 1695 1557 664 1574 -181 1047 143 264 644 490 1000 279 915 -216
757 -216 287 -1276 -711 -1009 -1504 -488 -1329 -332 -649 -46 -656 -677 -863 -1468 -1256 -2734 -1197 -2348 -1465
776 -1465 -1157 -1196 -416 -511 370 -453 177 -959 -527 -1170 -1243 -645 -1508 35 -581 387 845 989 854 738
796 738 622 71 956 -472 814 339 671 1267 1195 2104 1500 1753 1358 1776 937 1250 1132 955 1915 774
816 774 2104 1338 1428 1241 870 841 266 489 -712 -6 -714 -90 -5 -319 402 -532 -14 -883 -972 -1558 -1624
837 -1624 -1874 -1917 -1349 -2145 -430 -1199 -378 -893 -704 -546 -1300 -986 -1600 -785 -1876 -605 -1095 -538 22
856 22 -886 406 -629 76 -785 -716 -978 -802 -564 -950 527 -397 475 -129 376 399 -114 503 -364 378
876 378 -240 798 698 1358 1623 1358 2493 1454 2147 1124 1374 762 746 846 1284 1489 959 2366 1163
895 1163 1636 854 444 470 -679 -158 -905 -419 -628 -67 -283 -119 391 -876 212 -1179 -650 -1282 -1395
914 -1395 -1218 -1387 -840 -922 79 -769 317 -197 -367 40 -1118 -205 -1136 -705 -934 -142 -209 187 356 -336
934 -336 709 -576 136 -892 -388 -378 -428 127 60 529 324 879 297 861 298 70 956 160 860 658
954 658 1363 1088 1642 1517 1470 1833 1160 1783 605 1055 423 568 1086 614 961 679 1260 599 1154 530
974 530 395 349 -366 343 -1003 100 -247 240 386 222 322 -100 373 -802 -272 -1278 -724 -876 -1169
993 -1169 -140 -865 53 -396 21 -589 -342 -588 -1312 -845 -1775 -205 -1220 -564 -239 -475 -198 -710 -217
1012 -217 -659 -449 -1140 -396 -587 -519 42 -393 740 430 754 598 731 513 182 480 160 933 331 1148
1032 1148 1008 1464 1703 1031 1649 1070 1172 278 806 381 739 1051 693 1297 623 1317 772 694 116 88
1052 88 133 -457 113 -736 483 -230 134 258 -47 18 -662 -340 -935 -784 -1547 -1032 -1134 -968 -438 -1046 -245
1073 -245 -947 -415 -917 -973 -1108 -1591 -1034 -1366 -864 -1214 -319 -779 -306 -29 -755 31 -625 -522 -759 -267
1093 -267 -321 -214 144 122 915 282 959 433 733 193 138 506 127 656 449 1422 836 1219 1205 941 1523
1114 1523 592 983 497 653 338 571 570 904 1150 328 1240 464 633 -161 -483 72 -580 -165 -427 70
1134 70 -243 5 -246 -575 -282 -1022 -386 -1228 -769 -1112 -1296 -756 -732 -591 -791 -240 -987 -503 -1251 -1055 -924
1155 -924 -1407 -953 -1060 -413 -597 66 -147 -203 42 -330 224 -722 146 -456 -243 344 78 484 535 1135 359
1176 359 1073 283 524 505 280 945 105 1081 521 1180 1097 1119 895 722 886 461 686 201 472 421 437 738
1198 738 400 921 513 579 21 384 -327 -131 -120 -663 182 -518 -119 -355 -240 -309 -667 -490 -1023 -563 -1181
1219 -1181 -749 -1069 -847 -608 -704 -396 -736 -236 -987 -450 -1126 -695 -1165 -1143 -743 -969 -284 -719 -26 86
1239 86 -171 60 -402 -101 -496 51 -101 160 -74 499 768 436 813 630 942 649 732 564 550 660 273
1260 273 1231 716 1343 953 979 1103 642 877 62 449 -64 900 314 777 666 226 754 297 448 -145
1280 -145 33 -183 -348 -224 -139 -48 -446 316 -193 -106 -301 -647 -248 -901 -529 -1127 -734 -1238 -386 -545 -749
1301 -749 -334 -843 -563 -998 -632 -784 -772 -769 -577 -196 -611 -7 -228 229 -137 -33 162 -393 9 -71 255
1322 255 50 611 382 690 678 494 685 379 748 187 521 520 423 782 282 982 870 736 344 816 268
1343 268 185 342 -391 166 -42 174 21 312 232 212 457 -92 299 -244 -272 -335 -541 -390 -514 -349 -469 83
1365 83 -618 -411 -595 -368 -324 -1008 -494 -921 -529 -640 -574 -434 -476 -463 -817 -115 -1242 -214 -1008 -680 -711
1386 -711 -615 -314 -274 150 -98 139 28 151 323 -129 361 81 297 362 793 876 783 1317 804 1027 647 887
1408 887 431 736 474 672 919 621 1114 802 1165 854 866 716 621 734 388 603 244 708 486 587 969
1429 969 335 722 176 402 193 311 19 -212 164 -194 153 -302 215 -299 -271 -517 -670 -133 -588 -206
1449 -206 -1069 -419 -641 -276 -327 -609 -416 -424 -565 -989 -693 -746 -250 -165 -406 48 27 317 149 237 -135 -8
1471 -8 120 28 191 -402 510 138 230 361 480 690 538 946 466 493 265 313 485 412 640 539 1195 395
1493 395 754 567 542 414 255 435 130 243 -74 593 -92 416 271 111 399 -359 293 -328 -273 -439 -224
1514 -224 -442 -537 -267 -593 -258 -752 -701 -601 -1047 -714 -840 -642 -853 -301 -709 -177 -338 -310 -360 -844 -435
1535 -435 -814 -698 -728 -615 -459 -390 -75 -136 614 113 282 -2 -42 41 104 417 -51 379 203 726 515 694
1557 694 662 364 604 108 717 597 612 616 385 610 529 837 500 668 217 306 193 60 356 -302 206 347
1579 347 535 245 139 -139 -273 -87 -708 -96 -594 -410 -579 -655 -312 -679 108 -369 -206 -583 -573 -779 -721
1600 -721 -719 -692 -573 -594 -272 -530 -327 -514 -713 -177 -579 -131 -480 -255 -211 -167 -219 -170 98 -29 129 -196 597
1623 597 200 498 423 147 492 174 680 707 513 510 681 613 492 535 75 582 194 696 709 452 776 473
1645 473 779 506 542 234 62 344 71 234 -203 74 -170 -14 44 52 -81 100 -147 -359 -261 -767 -271 -619
1667 -619 -378 -126 -564 -87 -704 -399 -756 -556 -772 -618 -754 -780 -386 -704 -131 -333 -148 -380 -453 -213 -569
1688 -569 -230 -452 -67 -392 103 -2 164 450 -133 575 136 293 239 328 232 87 674 528 879 415 723
1709 723 538 688 790 515 725 482 580 308 803 644 519 592 346 772 31 171 28 154 37 13 294
1730 294 -206 64 -340 215 -270 -441 -117 -377 -199 -535 -271 -545 -418 -462 -369 -511 -689 -433 -656 -393 -906
1751 -906 -618 -573 -536 -365 -688 -290 -719 -269 -791 -305 -375 -236 -245 -569 -84 -539 -26 -9 0 -85 103 427 -64
1774 -64 131 347 368 31 82 325 211 376 254 501 110 366 414 192 390 -45 534 236 417 42 266
1795 266 208 234 157 -19 238 -3 156 -400 -161 -263 -246 -162 -89 -53 -162 -27 -266 -319 -646 -364 -261 -643 -471
1818 -471 -594 -369 -475 -272 -269 -482 -416 -623 -305 -667 -260 -447 -507 -156 -202 -122 -206 29 -363 -16 -107 151 -228
1841 -228 -214 458 4 382 86 741 427 373 556 333 538 175 808 450 564 377 337 691 339 747 244
1862 244 774 352 375 477 242 761 191 687 411 48 621 532 596 200 430 -19 205 -11 94 -98 85
1883 85 -40 -423 286 -329 75 42 -332 -339 -228 -89 -439 -155 -542 -67 -406 -436 69 -409 -35 -442 -327 -290
1905 -290 -325 -463 -340 -241 -337 -9 -366 99 -102 155 -81 -101 362 123 55 -202 575 389 310 438 441 570 508
1928 508 563 344 293 481 486 471 553 616 437 629 487 657 357 407 370 335 385 251 603 508 647 331 584 575 42
1953 42 372 27 253 -21 350 -15 41 132 -251 262 -325 217 74 -28 -24 -322 -50 -185 62 -253 -47 -293
1975 -293 -60 -217 -218 -87 -359 -202 -354 -297 -452 -8 105 -170 22 -183 251 36 280 -13 22 -90 -108 425
1997 425 530 401 120 650 809 254 444 335 542 309 618 239 417 560 228 616 500 672 51 285
2017 285 41 402 327 238 355 220 526 -127 310 96 412 128 166 81 52 88 -293 -94 -248 -97 100 -173
2039 -173 -73 -20 29 -362 -261 -413 -446 -174 -505 -231 -525 174 -231 -282 -123 -415 -193 -574 -192 -326 -48
2060 -48 -121 -63 -89 -271 161 -76 -43 27 378 -20 -79 102 -70 338 204 529 304 310 436 285 422 273 422
2083 422 184 572 148 383 483 354 643 290 521 -32 583 205 219 101 180 383 -196 291 13 331 67
2104 67 -55 -1 -105 -42 -289 -159 -49 -151 -348 -436 10 -252 84 -355 -396 -326 -107 -557 -396 -345 -415 -261 -339
2127 -339 -263 -403 -217 -206 -221 -257 -249 -242 -309 -45 -179 -183 63 -213 103 -50 198 85 96 43 71 106 123 241 167 375
2153 375 34 379 279 286 269 288 605 41 393 333 323 668 108 358 357 731 28 368 74 182 196 -124 74
2176 74 -19 115 -133 438 -158 -224 86 -46 -26 -291 16 -449 -93 -127 -268 -34 -517 -122 -451 -205 -286 -424
2198 -424 -383 -289 -290 -321 -149 -505 -233 -415 -414 -209 -335 -200 -464 -92 -277 -83 -191 -51 -7 -243 70 193 22
2221 22 -84 193 41 77 273 112 481 129 556 448 732 503 497 289 260 524 240 428 121 607 498 295
2243 295 403 159 368 -42 365 327 356 165 97 268 18 51 -160 -84 -132 -115 -128 29 -250 1 -254 -312 95
2266 95 -248 -10 -105 -263 -18 -233 -25 -343 -126 -334 -185 -82 -332 94 -349 235 -66 -15 -83 -127 -14 -275
2288 -275 156 -253 -45 73 276 -16 61 254 -117 41 148 271 196 292 521 346 417 597 783 501 574 313
2310 313 441 560 281 471 415 499 351 418 305 93 206 63 267 153 67 82 160 41 -29 -70 -284 189 -138
2333 -138 -237 -205 -127 -163 -485 -472 -620 -205 -408 -198 -98 -382 -390 -623 -34 -489 -250 -429 -227 -383 -263 -217 -787
2356 -787 243 231 328 -86 -528 -703 -158 -73 -142 -114 -176 334 24 211 109 36 211 -147 167 -14 248 47
2378 47 130 209 39 460 -162 398 -90 93 349 130 478 322 502 85 402 -22 266 -58 452 162 -18
2399 -18 23 -212 127 73 31 79 -133 47 -48 -71 -3 166 -204 -166 -71 -192 -81 -576 -318 -324 -284 -266 -23 -324 -411
2424 -411 269 -323 -53 -297 -351 197 -272 -198 -577 -89 -349 -557 -24 -173 -15 -130 119 -100 -15 437 106
2445 106 -127 173 205 74 311 143 367 75 118 230 251 427 368 492 134 342 210 545 409 188 -104
2466 -104 311 270 72 594 298 217 221 257 160 96 157 -193 401 -96 -102 -92 -293 181 -14 64 -246 -6 -105 -246
2490 -246 -428 -172 -191 -192 42 -221 -249 -237 -119 -3 -338 -170 -364 -141 -250 27 -359 -260 -86 -260 -12 -166
2512 -166 145 262 262 108 179 102 185 145 40 313 74 271 230 284 374 197 367 -26 318 271 286 442 276 477
2536 477 188 332 237 166 -51 87 181 -135 262 84 4 -117 153 146 104 261 -49 221 123 -86 4 -30 105
2559 105 70 -46 -78 -176 -117 -47 -298 -192 -123 -427 -275 -305 -135 -299 -425 -220 -270 37 -291 -297 -496 -111 -293
2582 -293 32 -166 -171 -34 -63 -79 -231 85 5 61 188 151 269 145 376 154 60 174 331 128 34 385 36
2605 36 76 131 178 33 97 119 93 365 -21 248 146 317 76 -145 -136 122 188 -34 14 -67 152 -2 3 97 -23
2630 -23 160 -151 -19 -294 -134 54 -230 -56 -374 -324 -6 -284 -230 -129 -152 -427 -231 -330 -111 -179 -408 -147
2652 -147 -213 -78 116 -10 -235 48 -185 -182 -127 -74 -137 -256 33 -147 169 -365 -3 201 -21 128 150 464
2674 464 306 234 194 256 233 410 115 295 477 66 56 221 180 339 157 123 170 83 87 61 -1 169 302 195
2698 195 123 -45 125 -181 -32 201 4 82 -268 212 -177 -82 -360 42 55 -72 -313 -351 64 -308 -220 -144
2720 -144 -169 -243 4 -29 -166 -224 -368 -318 -481 -262 221 -197 -203 -256 -227 -116 1 -126 39 238 -285 63 12
2743 12 -79 17 164 289 272 206 -53 -44 142 201 387 223 251 126 58 -104 265 138 84 -196 36 274 -25 18
2767 18 -18 219 -121 279 -7 179 91 -141 161 -113 203 144 302 -42 -80 -19 -150 94 -139 -24 -243 -83
2789 -83 -51 -207 -208 -333 -189 -140 -118 -232 -130 -251 -114 -73 -10 171 -238 19 -184 -284 -182 -141 28 -49 88
2812 88 -198 -69 3 178 -13 167 293 14 381 297 42 44 188 291 166 108 276 293 -32 212 539 140
2834 140 157 215 454 325 192 13 288 195 57 207 197 -3 -301 -149 6 -23 326 34 12 -699 -236 -246
2856 -246 -176 203 -129 87 175 62 296 472 870 -390 -492 -449 -40 -810 -814 -61 44 156 -176 -164 20 300
2878 300 -440 -460 -426 37 -188 173 -87 -110 -153 -47 65 -30 74 87 53 10 71 224 64 37 235 38 170
2901 170 162 37 188 129 119 302 -153 123 267 411 78 -72 180 18 202 139 152 89 -81 183 14 391
2923 391 25 275 128 87 228 19 70 56 118 -83 -157 -38 -21 -23 89 74 -445 4 -144 -291 -191 -341 -118
2946 -118 -376 -82 -143 -79 -231 -77 149 -64 -147 -371 50 10 -256 -6 -104 108 -128 161 125 178 6 228
2968 228 -39 -10 97 -59 270 42 141 -44 143 -189 203 182 6 186 -26 411 99 208 352 280 103
2989 103 -71 204 191 63 1 182 41 -11 214 -47 30 -99 -39 -75 -107 -73 193 51 227 186 -335 434 274
3012 274 680 -321 27 -161 -945 -367 -405 -344 231 413 -334 -20 331 -443 385 -410 -635 -1125 228 371
3032 371 -612 -359 -192 165 248 89 -182 -649 -374 39 706 -317 222 32 -34 204 -368 502 -167 286
3052 286 146 715 46 108 -237 194 -230 -387 281 417 19 373 247 19 -179 33 -212 169 474 -85
3072 -85 193 196 -161 37 176 -237 -202 -36 -467 61 -301 -64 49 -5 -230 -113 -220 46 84 -194 -364 -158
3094 -158 -111 -178 -139 -250 -137 -119 -145 -194 -284 62 -213 -302 -163 -131 -35 -376 -16 -23 -165 -328 -81 -269 -79 220
3118 220 -102 53 -33 241 14 -26 149 -15 232 150 224 27 107 39 234 22 400 188 102 94 -188 126 33
3141 33 290 -17 0 343 -186 17 125 185 134 -266 126 -117 -28 -146 60 -242 -14 38 -169 -230 -193 -14 -394
3164 -394 -188 -70 -319 198 -273 -166 -243 -122 -300 -88 -55 -248 -78 -276 -162 -183 51 -188 247 -295 -56
3185 -56 150 -34 167 -161 93 -143 344 -38 29 188 -146 151 -99 382 36 -154 267 295 393 26 386
3206 386 104 215 127 20 215 -37 198 -32 84 -96 157 116 122 18 40 205 -24 -3 -146 146 146 -150 -50
3229 -50 -83 -184 -161 -17 -393 -50 -116 -143 -216 -70 -290 -263 -83 -250 -163 -17 -102 -53 -117 -214 -69 -162 -151 -55 -47 -142
3255 -142 100 -120 -150 -158 -191 -60 -11 -52 -5 161 105 49 -98 115 39 -93 -127 247 18 200 -64 273 18 3
3279 3 10 291 18 116 -140 226 8 -41 220 58 253 -144 255 106 -78 -79 51 -131 13 259 -213 288 -137
3302 -137 55 37 -92 57 -55 -37 -58 -189 -16 -77 -55 3 -150 -230 45 -171 46 -168 -67 -173 -114 -40 -400
3325 -400 20 -177 -85 -450 -332 -113 -166 112 32 -5 -2 391 93 -59 100 -48 100 -24 185 94 133 211 -4
3348 -4 -118 -134 43 -15 205 311 -57 189 75 189 83 133 33 59 37 56 52 110 -59 -174 38 -168 127 169
3372 169 21 -186 -204 74 32 -82 -112 -168 -49 -145 -173 -8 30 -280 5 -134 -14 -289 -185 -172 -150 129 -216
3395 -216 -130 -28 -15 193 162 49 -154 65 -155 -98 -100 -127 87 -92 47 -165 174 90 21 123 -107 366 82
3418 82 29 58 118 -65 198 -95 269 -19 89 -1 -72 42 17 101 10 -114 251 137 116 95 386 -83 328 270
3442 270 -97 179 -27 344 38 -97 -61 -226 47 101 8 -63 -152 -190 -250 -99 -251 -84 -64 12 -157 -319 -198
3465 -198 1 86 36 49 -110 -57 -17 -138 -66 3 -92 -56 -140 -122 40 69 -64 -143 -41 -243 -98 -11 -6 -12 31 -206
3491 -206 123 -20 14 230 -79 31 80 203 67 153 59 404 140 23 -120 -160 -114 -6 -35 126 165 -60 228
3514 228 -11 202 89 298 -10 -32 -15 -76 -45 -86 -62 72 -101 164 -57 111 -69 -158 -249 -45 -187 -204 -91
3537 -91 91 -250 -54 187 -90 -325 -176 -96 -189 -91 77 -79 -189 -273 -277 -71 -188 -26 -304 236 -194 -88
3559 -88 -123 4 -120 -156 -128 -57 279 -95 -84 89 166 191 -9 149 131 58 180 -152 70 121 277 133 113 -66
3583 -66 117 178 115 92 188 -59 -58 25 32 229 58 19 6 -105 -137 -1 243 -154 79 -153 143 -35 -190 384
3607 384 79 38 -141 -49 -144 35 -312 -113 8 -420 -137 -143 -57 -94 -113 -167 -227 -63 87 164 -30 -141 41 -120
3631 -120 -60 77 135 -273 71 -89 -201 -192 152 42 -245 143 -14 77 188 193 153 185 38 -104 -15 41 -27 109
3655 109 84 92 296 -22 65 122 217 214 48 151 6 237 -215 -187 53 38 -309 -129 -171 -71 -77 -59 0 -57 -273
3680 -273 -28 -81 116 -131 -211 -331 -299 -212 -59 115 -70 -68 126 73 43 -43 -161 -149 -224 -202 -198 -115 44 284 -191
3705 -191 165 -158 -170 -29 -36 -145 16 -69 104 213 185 -104 218 12 299 246 164 133 -20 195 -62 33 25 4
3729 4 45 99 -58 81 101 157 285 151 -50 -111 -104 32 -49 62 191 -187 -3 29 -56 2 49 -92 278 -12 176
3754 176 -17 -196 47 -190 -95 60 -93 -369 -155 -77 -174 -112 79 -69 -162 34 -120 -198 -189 36 -210 -150 50
3777 50 -160 28 -21 144 -41 -201 0 87 128 -91 176 86 -189 -104 47 -129 -46 84 405 135 -276 251
3799 251 118 -71 255 -122 172 0 137 50 128 335 -95 -51 49 342 -156 100 139 75 -50 13 209 32
3821 32 112 207 -38 -41 -29 165 59 52 42 -37 10 -376 -67 -310 -185 70 -176 -191 68 -140 44 130 7 -8 -156
3846 -156 29 -130 30 -216 -107 -5 81 92 -120 -56 -7 11 -46 -48 74 -95 -252 -55 84 217 -50 -47 155
3869 155 34 213 -540 280 634 145 440 16 -33 -63 218 -119 6 494 158 -37 -258 82 -41 -172 109
3890 109 -153 133 -347 85 20 373 100 173 177 -144 -219 58 -265 -281 -167 -163 107 -291 194 244 18 -35 -85 58
3914 58 -337 -11 -179 -170 -247 -380 -48 -95 -488 -24 -115 -65 235 101 -418 115 -81 258 -40 -110 -263 -117 118
3937 118 -598 -148 -277 -379 -19 187 -265 250 -53 151 -23 486 -141 -410 -125 306 -2 -729 201 -48
3957 -48 -55 51 -27 -458 199 -499 -55 89 -3 467 -256 -79 219 -436 -140 -467 -135 229 400 -260 82 -12
3979 -12 -219 -173 -249 -310 -53 183 12 51 -57 228 -369 136 -31 -296 -140 -498 -212 -164 -41 -159 -276 63
4001 63 64 106 -285 -205 -15 27 182 123 31 68 85 -8 83 160 -143 205 -79 232 245 71 153 316 -22 -127 17
4026 17 -78 266 234 12 -100 -208 10 127 77 -7 222 -172 54 88 250 167 -243 180 -135 75 -13 119 19
4049 19 -190 252 32 124 -3 -9 -27 -24 -180 117 -147 -241 43 -168 -212 -206 -38 -29 -151 24 -53 144 -208 -124 44
4074 44 -18 -58 108 70 71 -205 15 -311 -60 -36 -41 -4 -102 8 222 8 -121 43 28 123 -105 143 -73 34
4098 34 333 422 -147 12 49 47 46 83 134 -45 -51 132 179 -163 132 13 -142 109 -78 -178 -11 95 2 -227
4122 -227 30 184 147 -78 -186 -123 -249 -93 55 129 -75 82 -160 61 123 -83 -85 114 -89 58 -23 -32 -190
4145 -190 88 113 -204 -109 22 77 95 -177 -67 -174 -96 3 -205 210 -150 -127 -193 -34 114 23 158 56 -4
4168 -4 49 115 -65 75 231 -107 77 247 70 -152 158 128 -61 -130 4 52 175 274 -58 111 6 42 -128
4191 -128 186 13 -83 39 92 266 -111 -16 -54 -47 35 101 -288 -37 -161 48 -92 -252 115 -31 -16 -53 73
4214 73 -31 18 25 -25 -324 -22 -5 -128 -108 -129 130 5 -4 -56 67 -175 -21 -85 -262 153 -148 256 15 -146
4238 -146 100 -124 117 169 237 167 4 -71 -120 -110 -4 53 29 105 0 -75 -4 -21 -194 14 125 -163 -51 -56 249
4263 249 39 -170 15 85 208 -190 -58 83 -428 198 197 -225 -193 -224 353 -448 -288 -716 814 286 82
4284 82 183 -84 127 634 40 182 708 116 374 -239 -172 -88 38 -92 39 -298 -73 145 -90 -73 -23 -130
4306 -130 -27 -86 -94 -265 -123 67 -50 214 158 -13 -166 212 336 71 107 149 51 -121 153 24 124 69 -17
4329 -17 118 163 -133 41 75 171 110 154 44 191 58 -97 101 114 -32 -227 -105 156 175 28 -23 25 66 93
4353 93 -229 -149 -45 -40 -10 -46 -31 -122 -112 102 -53 136 -345 -72 13 -90 -72 -41 -144 -55 -198 -24 68 -308 56
4378 56 28 -104 89 196 102 41 -11 -37 -145 -77 26 -111 99 25 -156 117 125 10 67 316 90 -107 -91 252
4402 252 18 -97 -3 138 -113 359 -200 178 78 164 -20 182 -58 -44 62 -168 38 149 35 212 -14
4423 -14 -13 -85 172 -311 4 24 -150 -81 -192 -9 -54 59 -35 -99 133 -81 99 -190 -277 63 -187 168 -60
4446 -60 -61 80 48 -205 -50 -117 -4 -18 -34 -180 -100 184 -322 151 -18 -115 6 -168 30 -199 71 -121 -144
4469 -144 138 -95 75 58 -121 -6 38 194 35 -129 -48 142 -6 119 7 -41 -90 125 -6 118 129 -110
4491 -110 -40 -74 74 -47 -163 206 -27 -6 28 10 55 -107 -72 118 186 28 14 28 -86 -167 -80 -55 -87 -3 20
4516 20 12 -96 -252 -7 0 164 -103 -280 -153 60 -276 -112 -44 193 206 -131 88 63 119 48 -67 -234 84
4539 84 -2 -213 150 154 -273 130 80 -36 -221 231 -72 -28 -5 -197 31 170 98 -87 108 37 -110 137 25
4562 25 185 156 -110 13 -155 -46 147 -112 237 -111 -57 -163 36 -118 -100 -74 -9 49 -7 98 -101 4 108
4585 108 -249 -234 -64 -479 -37 76 94 57 43 -139 -76 238 -496 -70 -44 218 49 -127 160 -132 330 -129
4607 -129 -519 224 85 303 -201 -658 207 309 -150 6 56 -563 352 90 251 509 -35 216 201 -48 346
4628 346 -317 -22 99 67 58 -205 -141 -150 -121 460 291 -25 73 109 -18 86 260 -496 316 -49 343 -497 49
4651 49 169 177 -182 117 -336 137 -252 -64 222 -63 96 -104 -464 74 73 -318 2 146 99 71 128 173 -131
4674 -131 -197 -97 -128 -178 -19 17 -37 29 125 -119 70 -115 -114 -98 -254 144 56 123 -203 37 -23 95 56 -14 120
4699 120 241 45 -114 160 -21 -108 -315 -25 2 -157 140 118 -60 199 -17 88 -246 -18 100 -15 -104
4720 -104 -103 -132 -16 -215 -315 -125 -73 -111 -25 -157 -134 -7 48 9 70 -8 22 -169 -144 49 -136 -9 -6 -155 -70
4745 -70 -26 6 -17 -192 -54 183 -293 -64 -262 278 76 285 134 43 -40 150 -92 54 145 29 -73 -52 217
4768 217 -281 637 -190 -95 -60 -318 393 -186 34 285 -196 734 -393 481 127 -248 -674 194 965 -327
4788 -327 66 76 57 122 -494 -83 115 183 -471 164 123 325 -155 -229 359 -106 78 224 -203 120 -16 -54
4810 -54 -81 -250 -135 -108 60 -147 -247 -75 43 6 -5 -106 -199 38 -155 20 101 -42 -55 -162 -185 -5 82
4833 82 -83 181 66 19 91 -64 -3 103 24 84 -144 -164 91 79 79 -1 3 -56 178 175 70 94 -143 71 155 -137
4859 -137 91 110 31 -40 62 75 62 -33 0 -10 -122 -32 54 -60 -22 46 -76 -116 -17 -85 -113 -138 -109 1 60 -74
4885 -74 236 62 -128 118 14 250 -71 104 -78 -10 -57 -250 -136 -36 204 -206 164 -106 29 13 -78 -223
4907 -223 -34 143 -176 -71 90 -153 122 331 149 362 -14 101 23 -36 -127 -156 174 87 -412 132 -98 95
4929 95 74 333 -36 60 169 -23 -56 -166 -40 133 -86 298 70 158 155 -306 125 -82 -120 -21 -166 -182 74
4952 74 -95 -251 -153 -31 233 10 -75 -61 43 -47 -82 -10 -107 -72 161 -324 -8 -21 12 -27 292 -89 52 -6
4976 -6 73 -157 -35 69 -236 -32 -2 -23 113 170 206 93 101 21 168 203 125 -72 -247 77 -136 -77 -146 -80 -180
5001 -180 -13 -196 318 -4 -161 101 -156 155 181 54 232 46 72 78 -9 88 128 45 66 -203 -56 -154 -74 -247
5025 -247 86 -82 -10 -153 -140 101 -240 -122 -102 -282 -14 18 -151 -256 138 160 14 -16 5 -233 186 220 149
5048 149 -173 -76 143 15 -49 -3 145 -53 -128 -176 189 -13 -182 261 -43 7 127 49 190 -81 -167 -101 115
5071 115 -121 48 -93 -83 262 -25 104 -178 -113 315 87 -22 5 78 7 -127 219 -231 136 166 -160 90
5093 90 -132 68 33 -4 -33 -126 -124 -39 284 134 -112 15 -40 -84 -23 -140 -39 -67 28 83 17 -96 -73 -51 -24 -18 -69
5120 -69 -31 -78 23 -35 -92 22 -87 29 -44 189 -3 127 -97 30 153 -96 42 223 -117 -69 44 95 -153
5143 -153 239 -41 -95 -118 -166 123 150 203 79 -54 -72 -183 -308 -323 348 195 -52 -115 -11 108 253 34 40
5166 40 -117 -4 82 247 323 -132 264 -180 -51 -152 -702 64 127 139 -599 -396 -212 -17 55 62 130 -29 225
5189 225 -81 -167 -21 -12 168 -199 -322 -154 -49 -141 -167 192 -380 -324 36 135 240 -25 -17 136 -95 -57 141
5212 141 -140 -79 244 144 -168 170 210 -71 190 332 183 -276 -148 249 184 373 107 -139 -505 -213 43
5233 43 3 295 14 302 237 -146 -199 -55 48 -8 -410 -50 -54 -355 86 148 277 -28 -320 -256 167 -173 -74
5256 -74 -450 -207 21 -149 46 10 329 244 290 17 -1 -186 79 -231 211 -165 -133 175 153 546 -8 261
5278 261 -341 -352 132 -323 -113 -534 -76 -48 -280 -94 -5 505 -137 -233 -369 -25 501 86 437 593 165
5299 165 -122 610 183 240 -24 391 -20 83 -538 -29 33 91 29 -335 200 -46 49 -368 -728 -290 -707 -223
5321 -223 65 -751 -71 -265 197 223 -122 318 -41 -336 -326 -190 -587 -387 -374 385 23 -167 -169 62 39 48 -254
5344 -254 9 65 -47 25 77 363 -150 -325 69 -72 45 -116 -196 -506 -200 -259 -161 -204 -172 76 -694 -117 35
5367 35 -255 -87 -163 19 155 229 -82 9 353 -342 -309 -302 154 14 -418 413 424 -183 213 265 7 -163 -285
5390 -285 335 -36 -523 109 -165 -91 145 -80 -127 -340 238 -284 -405 -488 243 62 269 21 -74 313 92
5411 92 -544 -169 -463 -113 135 112 -68 289 -113 437 140 -367 40 -121 99 39 462 -31 304 435 -147
5432 -147 -473 29 393 -430 472 -102 -112 67 200 199 -187 -854 -271 155 182 64 90 495 -301 146 88 -5
5454 -5 -296 78 787 288 -669 -56 -270 332 245 29 -346 406 203 170 426 -188 -40 -458 242 -129 14
5475 14 -195 41 -173 -171 322 82 -66 -186 83 -318 -258 -2 -90 210 -54 254 -401 -75 -168 139 -131 122
5497 122 229 128 154 -134 69 0 -350 207 21 -417 -154 -306 116 -380 -310 -660 278 -164 14 -103 -482
5518 -482 -56 -253 178 -18 91 -147 -268 -58 137 261 222 99 -204 82 2 -170 337 119 21 257 -174
5539 -174 281 118 71 -75 24 -345 -3 -164 139 44 94 16 62 -507 36 109 -72 -104 -300 201 -212 81 -68
5562 -68 209 -106 -149 -226 -114 -8 41 -41 -104 154 -9 22 -97 211 30 164 -59 148 -336 -137 -150 187 248
5585 248 21 -153 37 -152 -132 -135 27 -140 -99 -101 -7 48 -10 7 36 -81 -108 66 -130 -165 -9 -152 31 50 -44
5610 -44 -236 -101 153 -187 16 -35 203 -103 109 100 -192 236 -50 91 62 -37 0 -113 167 -157 -188 -267 -160
5633 -160 -38 -195 40 49 -75 11 -83 48 31 2 87 -183 74 14 26 -10 167 0 179 81 133 -149 72 -17
5657 -17 -136 -221 125 8 -63 119 -86 15 -14 -41 155 66 -176 330 -140 -36 34 -197 92 -35 84 50 -65
5680 -65 177 -82 -37 -159 -144 -112 130 13 -164 59 -153 52 -259 -175 -132 69 86 -153 79 231 -32 20 -258
5703 -258 254 -177 -119 120 -151 33 -436 92 -190 -115 219 166 84 127 -11 174 48 -137 -79 -34 371 -132
5725 -132 -172 -275 0 202 -181 -52 219 359 46 -124 -251 120 -85 175 41 -163 -104 147 151 184 -52 200
5747 200 -131 172 -242 -190 41 -75 112 140 73 299 -151 -103 108 -53 7 -462 6 126 -45 299 -152 -118
5769 -118 46 -60 59 -18 398 90 -33 123 -76 -70 -25 -240 -288 140 -214 -194 -124 -135 110 -186 -189 -55 -29 117
5793 117 -19 119 217 -124 172 118 32 -161 72 -345 -90 -49 -11 -1 289 -1 -150 197 130 59 30 326 -55
5816 -55 -144 -223 112 12 -76 -190 -257 -28 97 7 -197 7 -183 261 -35 -8 -268 -2 -121 21 -95 -19 60
5839 60 1 -58 -10 202 -213 105 -166 146 141 176 -205 95 58 -55 212 -7 32 6 104 88 -43 -83 55 10 3
5864 3 -137 -77 123 127 -195 -166 -11 -48 -122 69 -92 102 -107 22 -37 -8 95 19 -72 -99 -116 -55 11 -263 -80
5889 -80 -311 117 23 -137 -2 78 -40 182 168 82 -43 124 125 -4 -37 -95 48 78 -9 37 162 104 -44 147
5913 147 -104 4 -80 67 146 -127 -82 62 -228 -68 221 -59 -197 -68 -36 -76 65 -7 -121 -109 -53 70 27
5936 27 52 -60 63 -304 -61 -33 16 -19 -3 -109 -189 73 36 -61 -190 -21 98 25 -94 -92 128 -154 56 134
5960 134 124 -15 -164 -16 -116 76 -121 -6 156 -146 -31 -16 -31 -49 36 116 131 -85 48 -7 114 -76 -17
5983 -17 128 33 -22 142 6 -59 17 128 -73 9 -123 -197 40 213 -11 -44 -8 61 58 -119 -159 -163 -104 -4 83 -92
6009 -92 47 -24 -147 52 -43 25 -206 70 -33 -5 99 -248 139 108 -40 -142 81 -22 66 -148 179 158 113
6032 113 199 12 189 -76 -30 8 179 -54 -172 -49 -324 -8 -2 104 171 -91 192 -75 -23 -64 -118 122 -124
6055 -124 -243 69 13 95 -127 114 16 223 -15 -52 -117 -165 -74 -193 200 113 -79 -84 -10 209 91 21 -71 267
6079 267 -29 -42 33 118 211 -279 -394 82 -62 159 -177 80 160 -88 -251 -60 -177 -8 -133 40 31 16 43
6102 43 -189 36 105 21 197 -288 -84 12 116 359 -192 -139 311 -134 -422 85 -122 203 -48 59 90 51
6124 51 -78 -180 -95 20 -180 -222 -308 -5 113 39 147 -178 229 272 -171 268 -27 216 7 91 155 -41 -29
6147 -29 -233 -76 -30 83 145 -31 151 -190 132 26 176 -90 -65 -146 -22 69 -63 -310 95 12 -229 182
6169 182 -340 -335 45 32 -424 178 213 183 136 187 245 94 169 134 -171 -165 27 -102 -46 210 177 175 -196 -26 121
6194 121 217 -1 -10 147 66 131 -9 -59 -309 117 333 -124 -273 -166 -152 -152 214 -63 -18 -186 -24 29 -184 20
6218 20 -12 68 -115 -47 -119 6 -95 2 34 14 -307 89 -56 222 -61 -146 -43 -57 15 -316 -24 93 -332 -36
6242 -36 37 -128 37 46 -168 87 248 -183 -172 74 -124 -103 -70 21 -37 109 -113 130 -174 -231 132 -73 278
6265 278 -180 -103 -62 -149 -37 -209 116 -194 4 101 80 225 -299 -299 -32 -147 -169 134 -157 -24 51 -63 -239
6288 -239 -131 -165 -13 -49 15 -96 -182 166 -256 -3 7 250 -10 216 142 -40 -1 -21 -126 -91 23 -189 126
6311 126 195 317 -79 46 143 -136 92 198 191 80 9 0 -52 184 -72 -141 -120 319 229 -188 -95 -276 -29 197
6335 197 276 -52 65 109 129 -135 -43 -130 -18 55 141 255 -151 -4 -59 15 -204 54 27 -280 -45 16 -248 13
6359 13 0 83 -107 -53 -213 91 -153 -162 -52 -123 -23 -38 24 -69 -90 140 11 -181 -82 -49 207 43 -139 -97 10
6384 10 19 -204 -2 162 -51 359 -131 31 -235 -134 84 -81 285 109 -26 174 74 -85 33 -223 118
6405 118 98 -242 -228 -16 -120 266 -85 312 262 64 183 387 74 -118 483 40 127 134 399 -62 316 -141
6427 -141 -481 214 1 -44 -376 12 206 -198 470 -502 -97 -13 -284 80 143 -861 248 -401 -739 -86
6447 -86 51 232 653 801 366 172 -236 -48 -419 282 -108 -34 89 -159 -493 2 390 -493 -303 -176 -305
6468 -305 -141 -63 67 104 -85 153 164 -67 -133 168 86 -130 32 187 -129 9 -310 37 -240 -213 -1 83
6490 83 -95 28 47 250 12 -94 121 137 -108 73 185 -33 30 262 60 -29 -87 223 -136 178 75 47
6512 47 -107 203 62 -51 -32 -86 90 93 110 65 -142 126 -49 63 52 -50 -71 204 23 149 -20 -84 19
6535 19 86 140 -163 179 76 21 -35 195 178 99 44 11 -332 18 -53 202 50 -158 168 -71 -33 -165 69 -36
6559 -36 -1 -13 -125 79 14 -146 1 96 -138 -136 -37 178 99 7 155 128 4 11 -133 242 84 64 133 -177 -81
6584 -81 17 -59 -69 91 -239 -150 134 3 -309 -5 -62 -41 -168 33 17 -124 271 94 -72 7 -2 21 83 -226
6608 -226 149 155 80 42 -72 -5 10 -72 -95 151 -17 98 -77 -1 133 145 -141 -70 178 200 -350 -205 2 -185
6632 -185 153 169 -7 -188 -24 68 -107 -19 36 -158 -460 287 -215 100 -338 -87 -58 144 -52 84 -38 72
6654 72 185 -56 67 -206 192 387 231 -103 48 -74 -298 89 -122 63 70 242 -191 -249 -127 -36 75 323
6676 323 -143 -312 -77 -228 96 160 -298 -378 -122 -195 146 13 244 69 76 -294 121 197 -524 -234 278 44
6698 44 -94 3 209 47 -341 -297 -180 -260 -185 -284 -28 -5 62 -193 -307 -10 104 206 -136 -224 139 132 -250 -9
6722 -9 320 348 182 -22 137 -230 -129 -77 79 -162 -371 -38 -20 71 147 -37 -170 -231 -75 -93 211 44 38 333
6746 333 -137 -97 12 265 178 -114 -129 -102 109 -29 161 -62 37 -161 -120 11 -197 63 -20 -166 -24 6 -49
6769 -49 263 21 -160 -10 -25 -255 107 -168 -98 -17 122 190 -98 -20 73 81 -131 -56 -26 -7 -82 -76 -79 -133 -118 -201 34
6796 34 113 53 -49 255 -45 -138 -132 -46 -194 3 52 -152 -184 71 44 -55 68 126 -39 -21 142 -272 -152 -25
6820 -25 -7 -233 -183 -25 50 114 -154 223 -60 -27 -155 -242 -94 73 -155 200 53 -207 15 -143 -31 -34 -121
6843 -121 184 9 168 45 -77 142 -70 11 204 -46 -97 297 134 14 210 41 18 -178 -65 55 80
6864 80 189 -84 -7 57 3 -190 82 19 -119 -158 -63 -190 77 -187 -36 -287 -134 -17 60 -65 -152 89 -39
6887 -39 85 -26 80 123 11 -13 227 -94 125 9 376 -21 -19 -18 -174 -27 -108 2 142 -81 -14 -5 87 183
6911 183 -217 81 174 149 -195 5 36 -63 107 91 220 204 27 83 164 35 75 140 -144 65 -133 55 51 -65
6935 -65 57 40 71 208 106 214 -23 -49 -182 -101 77 -7 -134 86 115 75 17 216 63 114 9 -136 -46 -43
6959 -43 90 5 -49 76 301 169 -61 214 -232 123 28 -79 -19 127 38 13 188 86 -138 84 40 -243 -64
6982 -64 26 -24 -81 -75 -47 156 -151 -342 -99 56 -40 82 -228 66 -17 -68 41 -274 -64 -35 172 -37 163 146
7006 146 -55 -192 72 56 57 117 86 62 83 38 106 -24 -204 -33 45 -70 -73 22 -29 21 -152 21 -33 -93 85 185
7032 185 -50 23 -6 25 65 115 -194 -103 -159 70 -35 3 -84 27 -8 140 -75 154 227 26 21 -25 -23 180 3
7057 3 -29 23 89 66 13 -204 -107 251 22 35 42 7 -64 84 -88 -54 23 113 -89 72 -157 -150 190 -138 1 0 113
7084 113 -78 -102 132 205 152 120 35 80 171 -64 99 5 -262 -91 -10 16 -109 31 101 169 70 -164 -51 -103 -5
7109 -5 4 234 -129 -39 -25 50 -69 -35 -5 30 -71 -70 -42 -15 -8 -86 -62 263 -88 -87 -77 -27 318 83 26 -65 -204 -132
7137 -132 202 178 -76 -9 -101 82 213 102 122 -298 100 -105 155 26 -95 8 -5 -185 -8 35 -118 -249
7159 -249 116 -45 -190 -176 -39 109 -24 -200 53 50 -164 -84 -153 -2 -28 -130 -54 18 -136 -30 -23 -41 -83 -58
7183 -58 -109 44 33 -18 0 -130 -3 -206 -7 111 -20 52 -23 -101 -29 -90 -76 -30 91 55 139 -236 76 -70 -118
7208 -118 33 -157 171 -238 -231 -93 50 -22 34 44 -80 -112 -101 -13 131 -74 -275 -130 144 -36 -131 -226 96
7231 96 7 66 -87 260 -198 -360 -3 159 -79 -37 -234 -491 29 -27 -15 107 391 68 104 -101 -263 -36
7253 -36 -487 153 -45 -198 -143 -159 47 -294 460 -153 -155 -78 -352 518 177 -285 -121 -138 66 -153 -251 384 -434
7276 -434 330 -314 -380 35 -86 -118 -117 -68 -471 -21 -152 107 -278 -108 64 73 221 187 -3 -146 116 -107 -222
7299 -222 -332 35 -274 65 -6 12 -129 -71 37 -142 -348 -91 -195 107 109 47 -80 38 -306 -10 -257 -58
7321 -58 -498 -44 475 327 -614 -223 349 109 -702 -97 372 533 176 -213 116 -201 295 44 -308 -166
7341 -166 -167 526 120 15 -138 4 -336 156 491 -65 152 -273 -63 -289 96 103 -115 13 -163 8 38 -67
7363 -67 70 186 -54 135 53 44 -27 32 -89 -62 16 103 -84 -115 -131 128 53 -237 165 122 159 -2 -238 -29 -53
7388 -53 -91 -31 -57 -136 17 101 87 -40 7 -60 266 -76 215 131 -306 131 -196 144 11 152 -151 27 -100
7411 -100 59 -14 40 -60 -250 -210 -15 -150 127 -61 156 -39 69 -117 -61 -79 148 2 -72 -1 -16 126 -195
7434 -195 -41 -179 31 103 -3 -114 -237 44 150 77 -67 50 -135 49 129 -38 -329 86 99 -95 33
7455 33 8 -349 -166 228 -259 83 301 -374 -484 -49 43 334 124 257 72 60 223 -176 -91 -275 -388 285
7477 285 1 390 -77 -205 293 77 -148 -247 320 283 -16 -248 101 518 -54 -38 109 -59 -70 -148 318 297
7499 297 -122 -509 -210 119 83 -281 195 221 483 -2 -241 -18 89 -58 -493 257 -115 -196 -161 -427 -54
7520 -54 -76 -319 33 113 -286 249 -76 55 13 2 -124 -54 141 -99 -1 -103 -188 -65 97 -72 -144 -102 85
7543 85 145 -44 0 -42 -206 32 84 -93 -139 -33 -308 250 10 -211 25 60 184 -99 -4 60 21 70 117 40
7567 40 83 97 -134 4 -134 -262 166 52 178 107 -259 -13 -265 115 -80 32 69 74 -188 -115 5 242 144
7590 144 -25 69 -39 259 -35 -169 -35 -185 -126 135 -235 109 -36 -151 96 -148 0 -147 -132 -80 -3 30
7612 30 -49 -228 199 -139 -137 255 233 113 -183 -111 -104 -51 -59 44 -113 -121 17 -193 -64 -103 -81 -171 -124 -256 -78 211
7638 211 -179 -55 -248 78 -267 140 -103 -342 158 -61 76 303 11 360 -7 -489 278 104 -5 -107
7658 -107 230 212 57 -156 -225 -73 -345 -258 -226 73 -125 848 132 42 377 -106 972 98 541 -837 -795
7679 -795 211 645 -106 -84 -908 230 -20 -271 -394 -459 -947 -105 -201 154 -323 -220 -252 204 -300 173 80
7700 80 236 26 209 -250 -644 160 -214 12 -555 -310 -378 -383 444 324 -285 179 96 550 -253 -161 163 -43
7722 -43 -140 -4 -402 -100 -131 297 39 -378 138 237 17 354 -29 215 -100 157 87 -141 249 -204 -36 84
7744 84 -285 -127 251 -268 -514 -51 -17 -44 285 -270 -346 -50 -66 254 184 10 512 -3 -9 -577 511 -694
7766 -694 -110 222 185 94 -52 -227 135 -333 -405 143 -258 312 -373 180 -263 -422 392 433 164 71 -258 -791
7788 -791 -1143 -452 609 184 -609 -976 668 -804 -466 -5 -587 597 -307 653 78 -514 341 -604 1000
7807 1000 86 -299 -165 308 -138 395 -169 447 154 -597 58 -228 -379 -105 188 131 -64 499 -688 101
7827 101 170 168 -105 47 -293 58 -104 -503 383 92 -145 842 -195 -99 -621 209 -255 520 71 470 305
7848 305 -517 190 221 288 -182 -176 -94 504 -487 826 -137 -319 162 -67 -151 -299 -381 124 -256 500 131 -77
7870 -77 -161 -6 63 -344 -271 -224 266 -683 77 -24 5 -499 -336 345 38 37 -367 173 -93 -18 -150 -279 -505
7893 -505 -184 -53 16 335 -385 390 -25 -52 -307 173 -94 -266 -451 282 -366 -616 -881 199 -161 514
7913 514 129 -126 -200 710 -9 274 -360 253 162 -320 55 378 -454 -31 -375 -386 298 -38 152 291 -257
7934 -257 3 344 -19 -170 -153 22 -116 -36 -39 -342 348 172 73 -435 -329 -344 -201 122 -238 -242 -455 270 -139
7957 -139 510 124 -23 230 39 -32 -270 -349 270 -27 34 493 -92 -29 59 -264 -142 -207 -315 -455 149 -111
7979 -111 -37 161 282 339 -37 -50 -259 -91 30 -82 339 145 603 500 -79 62 318 220 135 475 -375 111
8001 111 444 139 278 -470 127 270 -195 -951 205 511 249 265 67 782 383 365 -266 -1037 -679 -96
8021 -96 -584 -319 410 532 -712 -441 1140 -589 -417 673 -575 198 41 -554 134 304 116 68 135
8040 135 -76 -361 -318 -570 -499 283 -123 -245 -114 -474 -32 252 167 -424 35 436 -241 -138 -746 -460 27
8061 27 -357 -177 -280 226 79 -340 184 258 -225 -112 -480 -53 361 -113 -960 -146 100 753 -124 351 -3
8082 -3 -415 -429 197 612 491 -280 -731 815 -401 -314 -698 139 -513 340 67 -479 -581 703 116 92 -426
8103 -426 567 -313 -92 -1251 732 -137 -703 430 284 452 -532 25 -196 -408 314 304 -930 897 943
8122 943 -87 -461 -424 -2028 -89 153 -465 -122 -478 -660 -1208 -135 -166 -82 581 610 303 343 -235 -136 -384
8143 -384 -404 265 493 283 -620 -130 -428 -158 -324 -829 195 100 -226 -57 -18 308 -847 -949 -184 318
8163 318 -194 823 -40 26 -504 -9 75 -324 91 -1075 145 -87 -267 393 102 201 1 101 -863 245
8183 245 -117 -250 -371 21 244 83 -478 171
8191A71
##END NTUPLES=NMR FID
##END=
