##TITLE=1H_K-309
 DMSO, 8 sc, 
 23.10.2019
##JCAMPDX= 6.0         $$ Bruker NMR JCAMP-DX V2.0
##DATA TYPE= NMR FID
##DATA CLASS= NTUPLES
##ORIGIN= UXNMR, Bruker Analytische Messtechnik GmbH
##OWNER= root
$$ XWIN-NMR		Version 3.5
$$ Wed Oct 23 16:38:12 2019 Russian Standard Time (UT+4h)  she@DPX200
##.OBSERVE FREQUENCY= 200.1315
##.OBSERVE NUCLEUS= ^1H
##.DELAY= (6, 6)
##.ACQUISITION MODE= SIMULTANEOUS
##.ACQUISITION SCHEME= undefined
##.AVERAGES= 8
##.DIGITISER RES= 18
##SPECTROMETER/DATA SYSTEM= spect
##.PULSE SEQUENCE= zg30
##.SOLVENT NAME= DMSO
##.SHIFT REFERENCE= (INTERNAL, DMSO, 0, 15.7039)
##AUDIT TRAIL= $$ (NUMBER, WHEN, WHO, WHERE, WHAT)
$$ ##TITLE= Audit trail, XWIN-NMR		Version 3.5
$$ ##JCAMPDX= 5.01
$$ ##ORIGIN= Bruker BioSpin GmbH
$$ ##OWNER= she
$$ F:/spectra/data/she/nmr/H-F/1/audita.txt
$$ ##AUDIT TRAIL=  $$ (NUMBER, WHEN, WHO, WHERE, WHAT)
(   1,<2019-10-23 16:37:07.31 +0400>,<she>,<DPX200>,
      <created by zg, POWCHK disabled, PULCHK disabled
       configuration hash MD5:
       00 E9 B6 7A A2 85 ED C7 34 08 36 98 17 FE 4E 26
       data hash MD5: 16K
       35 E4 E7 C8 B8 44 7C 55 E9 B9 B0 7C E9 7B 3A 9D>)
$$ ##END=
$$ 
$$ hash MD5
$$ A3 DC 1E 28 6F 35 DC 41 15 DD 64 E2 87 99 DE 5A
##$RELAX= 
##$RELAX= 
##$RELAX= 
##$RELAX= 
##$RELAX= 
##$RELAX= 
$$ Bruker specific parameters
$$ --------------------------
##$DU= <F:/spectra>
##$EXPNO= 1
##$NAME= <H-F>
##$PROCNO= 1
##$TYPE= <nmr>
##$USER= <she>
##$AMP= (0..31)
100 100 100 100 100 100 100 100 100 100 100 100 100 100 100 100 100 100 
100 100 100 100 100 100 100 100 100 100 100 100 100 100 
##$AQSEQ= 0
##$AQ_mod= 1
##$AUNM= <au_zg>
##$AUTOPOS= <>
##$BF1= 200.13
##$BF2= 200.13
##$BF3= 200.13
##$BF4= 200.13
##$BF5= 200.13
##$BF6= 200.13
##$BF7= 200.13
##$BF8= 200.13
##$BYTORDA= 1
##$CFDGTYP= 0
##$CFRGTYP= 5
##$CHEMSTR= <none>
##$CNST= (0..31)
1 1 145 1 1 1 1 1 1 1 1 1 1 1 1 1 1 1 1 1 1 1 1 1 1 1 1 1 1 1 1 1 
##$CPDPRG= <>
##$CPDPRG1= <>
##$CPDPRG2= <>
##$CPDPRG3= <>
##$CPDPRG4= <mlev>
##$CPDPRG5= <mlev>
##$CPDPRG6= <mlev>
##$CPDPRG7= <mlev>
##$CPDPRG8= <mlev>
##$CPDPRGB= <>
##$CPDPRGT= <>
##$D= (0..31)
0 1.2 0 0 0 0 0 0 0 0.06 0 0.03 0 0 0 0 0.0002 0 0 0 0 0 0 0 0 0 0 0 0 
0 0 0 
##$DATE= 1571834226
##$DBL= (0..7)
120 120 120 120 120 120 120 120 
##$DBP= (0..7)
150 150 150 150 150 150 150 150 
##$DBP07= 0
##$DBPNAM0= <>
##$DBPNAM1= <>
##$DBPNAM2= <>
##$DBPNAM3= <>
##$DBPNAM4= <>
##$DBPNAM5= <>
##$DBPNAM6= <>
##$DBPNAM7= <>
##$DBPOAL= (0..7)
0.5 0.5 0.5 0.5 0.5 0.5 0.5 0.5 
##$DBPOFFS= (0..7)
0 0 0 0 0 0 0 0 
##$DE= 6
##$DECBNUC= <off>
##$DECIM= 24
##$DECNUC= <off>
##$DECSTAT= 4
##$DIGMOD= 1
##$DIGTYP= 9
##$DL= (0..7)
0 120 120 120 120 120 120 120 
##$DP= (0..7)
150 150 150 150 150 150 150 150 
##$DP07= 0
##$DPNAME0= <>
##$DPNAME1= <>
##$DPNAME2= <>
##$DPNAME3= <>
##$DPNAME4= <>
##$DPNAME5= <>
##$DPNAME6= <>
##$DPNAME7= <>
##$DPOAL= (0..7)
0.5 0.5 0.5 0.5 0.5 0.5 0.5 0.5 
##$DPOFFS= (0..7)
0 0 0 0 0 0 0 0 
##$DQDMODE= 0
##$DR= 18
##$DS= 0
##$DSLIST= <SSSSSSSSSSSSSSS>
##$DSPFIRM= 0
$$ [...]
##$SUBNAM2= <"">
##$SUBNAM3= <"">
##$SUBNAM4= <"">
##$SUBNAM5= <"">
##$SUBNAM6= <"">
##$SUBNAM7= <"">
##$SUBNAM8= <"">
##$SUBNAM9= <"">
##$SW= 24.0689530833862
##$SWIBOX= (0..15)
0 0 2 0 0 0 0 0 0 0 0 0 0 0 0 0 
##$SW_h= 4816.95568400771
##$TD= 16384
##$TD0= 1
##$TE= 0
##$TE2= 300
##$TE3= 300
##$TEG= 300
##$TL= (0..7)
0 120 120 120 120 120 120 120 
##$TP= (0..7)
150 150 150 150 150 150 150 150 
##$TP07= 0
##$TPNAME0= <>
##$TPNAME1= <>
##$TPNAME2= <>
##$TPNAME3= <>
##$TPNAME4= <>
##$TPNAME5= <>
##$TPNAME6= <>
##$TPNAME7= <>
##$TPOAL= (0..7)
0.5 0.5 0.5 0.5 0.5 0.5 0.5 0.5 
##$TPOFFS= (0..7)
0 0 0 0 0 0 0 0 
##$TUNHIN= 0
##$TUNHOUT= 0
##$TUNXOUT= 0
##$USERA1= <user>
##$USERA2= <user>
##$USERA3= <user>
##$USERA4= <user>
##$USERA5= <user>
##$V9= 5
##$VALIST= <valist>
##$VCLIST= <CCCCCCCCCCCCCCC>
##$VD= 0
##$VDLIST= <DDDDDDDDDDDDDDD>
##$VPLIST= <PPPPPPPPPPPPPPP>
##$VTLIST= <TTTTTTTTTTTTTTT>
##$WBST= 1024
##$WBSW= 4
##$XGAIN= (0..3)
0 0 0 0 
##$XL= 0
##$YL= 0
##$YMAX_a= 62073
##$YMIN_a= -39357
##$ZGOPTNS= <>
##$ZL1= 120
##$ZL2= 120
##$ZL3= 120
##$ZL4= 120
##$ABSF1= 10
##$ABSF2= 0
##$ABSG= 5
##$ABSL= 3
##$ALPHA= 0
##$AQORDER= 0
##$ASSFAC= 0
##$ASSFACI= 0
##$ASSFACX= 0
##$ASSWID= 0
##$AUNMP= <proc_1d>
##$AZFE= 0.1
##$AZFW= 0.1
##$BCFW= 1
##$BC_mod= 2
##$BYTORDP= 1
##$COROFFS= 0
##$CY= 11.3945322036743
##$DATMOD= 1
##$DC= 2
##$DFILT= <>
##$DTYPP= 0
##$F1P= 20.1720416913024
##$F2P= 0.152960286110954
##$FCOR= 0.5
##$FTSIZE= 0
##$FT_mod= 4
##$GAMMA= 1
##$GB= 0.15
##$INTBC= 1
##$INTSCL= 1
##$ISEN= 128
##$LB= 0.24
##$LEV0= 0
##$LPBIN= 0
##$MAXI= 10000
##$MC2= 0
##$MEAN= 0
##$ME_mod= 0
##$MI= 1.114404
##$NCOEF= 0
##$NC_proc= 0
##$NLEV= 6
##$NOISF1= 3.799351
##$NOISF2= 2.8
##$NSP= 1
##$NTH_PI= 0
##$NZP= 0
##$OFFSET= 15.70392
##$PC= 1
##$PHC0= -9565.572
##$PHC1= 9.800803
##$PH_mod= 1
##$PKNL= yes
##$PPARMOD= 0
##$PSCAL= 0
##$PSIGN= 0
##$REVERSE= no
##$SF= 200.130013532006
##$SI= 16384
##$SIGF1= 3
##$SIGF2= 2
##$SINO= 400
##$SIOLD= 16384
##$SREGLST= <1H.CDCl3>
##$SSB= 0
##$STSI= 0
##$STSR= 0
##$SW_p= 3612.71676300578
##$SYMM= 0
##$S_DEV= 0
##$TDeff= 0
##$TDoff= 0
##$TI= <>
##$TILT= no
##$TM1= 0
##$TM2= 0
##$TOPLEV= 0
##$USERP1= <user>
##$USERP2= <user>
##$USERP3= <user>
##$USERP4= <user>
##$USERP5= <user>
##$WDW= 1
##$XDIM= 8192
##$YMAX_p= 0
##$YMIN_p= 0
$$ End of Bruker specific parameters
$$ ---------------------------------
##NTUPLES= NMR FID
##VAR_NAME=  TIME,          FID/REAL,        FID/IMAG
##SYMBOL=    X,             R,               I
##VAR_TYPE=  INDEPENDENT,   DEPENDENT,       DEPENDENT
##VAR_FORM=  AFFN,          ASDF,            ASDF
##VAR_DIM=   8192,          8192,            8192
##UNITS=     SECONDS,       ARBITRARY UNITS, ARBITRARY UNITS
##FACTOR=    0.0002076,     1,               1
##FIRST=     0,             0,               0
##LAST=      1.7004516,     0,               0
##MIN=       0,             -39357,          0
##MAX=       1.7004516,     62073,           0
$$ Real data points
##PAGE= N=1
##DATA TABLE= (X++(R..R)), XYDATA
0@%%%%%%%%%%Nj3J6j6J6j7K5l2L3m1M9n7O5p4Q7j00J15j31J49j66J85k10K39k65
34a38K92l27L66m07M53n03N56o16O82p56Q38r27J030j147J278j431J609j823K085
53A114k407K822l379M171n402P585j2671M9896K0344m3960L688J3174J9593j1804
67D2764j7934j1308J5328J6133J821k0950j8246l709J2223P887k586j1478o476
80C469K799Q639L037o909j2036m125P653J2252J803j1003j1296K081J4331J0172
94B0867o946j5088m382J3074J5034j329j5922q757J0001J7711N048j2871j4194
107B246P96J3718R077n812j1491l890R065R709j018j1060r956p91P558O793j216
122A3728p647p038J011O183L452o138j1071m311P183J0995J903j0467j0618J249
$$ plain form
0 0 0 0 0 0 0 0 0 0 0 0 5 -8 8 -8 8 -9 16 -16 17 -24 25 -32 33 -41 46 -54 61 -70 79 -87 98 -112 127 -138
34 -138 154 -173 193 -214 239 -264 292 -324 358 -398 440 -487 543 -604 674 -757 852 -971 1114
53 1114 -1293 1529 -1850 2321 -3081 4504 -8167 41729 62073 18113 21801 34975 54568 42764
67 42764 24830 13522 28850 44983 46804 25854 7608 3899 16122 24009 21423 9945 3469
80 3469 6268 14907 17944 11035 -1001 -5126 2527 14779 16582 5579 -5717 -3636 10695 20867
94 20867 13921 -1167 -5549 7525 22559 21230 5308 -3449 6552 24263 29311 16440 2246
107 2246 3042 16760 25837 20025 8534 4644 13709 23418 22400 11340 1384 593 8151 14944 13728
122 13728 6081 -957 54 6237 9689 3551 -7520 -11831 -4648 6347 8250 -2217 -12835 -11586
136a1586J1438O913p431j2109j881J1679J1161j913j2310o945P067J2449K894
149I426q542q723K120R850O799l508q092k817M980O799J618m817o641j061N292
164B683N796N36o206o465l81O971M351l933r545m055O471R223O45r867r710K262
180a1224R936M823n960r870r92R060Q152k720r834n371N259Q693K842n915n938
195i059J240O723M102j677n039l127K928N545K957k358n144k179L430N793J210
210E345m821o181J22O471N197l070q028m136N808P629J58q242o886K073Q344L901
226C684n831p792o27O690N451j947p301l394L194O002J962l490m862J55L799M053
242b54k29l974l264J573M574L456j203n036k348K828N618J749m366n358M23N919
$$ plain form
136 -11586 -148 6765 -666 -12775 -14656 -2977 8184 6271 -6039 -12984 -5917 6532 9426
149 9426 884 -7839 -5719 4131 10930 7422 -670 -3487 1493 8292 9910 5093 -1548 -2609 2683
164 2683 8479 9015 2809 -3656 -4037 2934 7285 3352 -6193 -10248 -3777 5446 6091 -3776 -13486 -11224
180 -11224 -1288 3535 -2425 -12295 -13287 -4227 3925 1205 -8629 -14000 -8741 -48 2794 -3121 -9059
195 -9059 -7819 -1096 3006 1329 -3710 -6837 -3909 1636 4593 2235 -2909 -5088 -1658 4135 5345
210 5345 524 -5657 -5535 936 6133 3063 -4965 -9101 -3293 4336 4494 -3748 -10634 -8561 -217 3684
226 3684 -2147 -9939 -10566 -3876 1575 -372 -7673 -11067 -7873 -1871 91 -3399 -8261 -8106 -4307 -254
242 -254 -483 -4457 -7721 -6148 -1574 1882 679 -4357 -6705 -3877 1741 3490 -876 -6234 -5811 108
258A08N013k650p107k880M782O360K51o403n219K689O387K458m629n645j99M897
274a787M052j572m529k790K454M046J552k483l778l81K266L545N47l316k634r2
290d900M491L312j063m506k801K791N404J638m543m517R76N437L735k898n554
305b998j623M312M901J08n305l278K175M762J453l683l833J2L739K481o23k964
321c64k624J470L026J631j665k983j240J852L588L83k392l195k88L513L315j491
337B536m393j742K789M532N61m020l722R99M895K410k668m688m82L862L440q21
353C488l668k425J933L372J042k059l053l33K467K230k18k797j749Q51K384J515
369B980q34k778j507J807L062N34k550k869J14L291K315j072m249j118K805L545
$$ plain form
258 108 5121 2471 -4636 -7516 -2734 3626 3877 -2526 -7745 -5056 1331 3789 -840 -6485 -6684 -1787
274 -1787 2265 693 -3836 -6626 -4172 -126 1426 -1057 -4835 -5216 -2950 595 1142 -2174 -4808 -4900
290 -4900 -409 2903 1840 -2666 -5467 -2676 2728 4366 -177 -4694 -3718 1719 5454 2556 -2998
305 -2998 -4621 -309 4592 4700 -605 -3883 -1708 3054 4507 824 -3009 -2997 742 3223 2600 -364
321 -364 -2988 -1518 1508 3139 1474 -1509 -2749 -897 2691 3074 682 -2513 -2801 712 4027 2536
337 2536 -1857 -3599 -810 3722 4283 263 -3459 -2460 2435 4845 2177 -2511 -2993 869 4309 3488
353 3488 -180 -2605 -672 2700 3742 1683 -1370 -1703 764 2994 2776 -21 -1770 -919 1465 2980
369 2980 2146 -632 -2139 -332 2730 3264 714 -2155 -2041 1250 3565 2493 -1756 -2874 -69 3476
385C476r9l776k695J535L779J225k100l205n69L107K466p14k980j724J389K526
401A641R11j608k005m52J576K256k91j943j712J64K585J677j087k652j237J520
417f57K754Q03k785k454M30L100K041j961k760j105K533K724n58k614j868R17
433a460L383P94j969k628l20K142K172n61k402j194Q82K108P36j111j791n89J197
450f11J822M60j578j791P9K242J493p93k483j144J489K995O2k215k183R23K778
467A545P20j212k570k42K246J819l26k301j663J246J844R81j719j896q4J787R44
484A119P1j907j001M62J492J152q39j975q57J611J777K21j529k004L69K057J503
501A722o12k286j001J573K045K99j990j743Q35K286Q95j210k104l81K036J372
$$ plain form
385 3476 3377 -399 -3094 -1559 2220 3445 1345 -1860 -2429 678 3144 2430 -550 -2274 -885 1641
401 1641 2552 944 -1061 -1513 63 2319 2028 85 -1627 -1463 1122 2799 1712 -940 -2177 -657
417 -657 2097 2900 115 -2339 -1909 1191 3232 1271 -1489 -2594 -61 2663 2105 -509 -2377 -1460
433 -1460 1923 2717 748 -1880 -2200 -58 2114 1553 -849 -2043 -1161 947 1683 572 -1219 -1808 -611
450 -611 1211 1671 93 -1698 -1619 623 2116 1323 -1160 -2304 -815 2180 2242 27 -2156 -1233 1545
467 1545 2265 1053 -1517 -1759 487 2306 1980 -321 -1984 -738 1106 2087 368 -1528 -1612 175 1119
484 1119 1190 -717 -1718 -1256 236 1388 549 -1426 -2283 -672 1105 1326 -203 -2207 -1838 219 1722
501 1722 1110 -1176 -2177 -604 1441 1740 -250 -1993 -1158 1128 2023 813 -1291 -1672 364 1736
517A736k38j635j462O24J937P93j178j611m48J393J570l53j287j250j80J907Q76
534A194n09j880q77J165J361N47j386j646N02J539J345p52k282q22J517K487k01
551A302j540j406M87J819R04q84j647m65J467J415j21j337j369N81J822N86p69
568H45j246o55N35J770P0j140j355j5J664P23m57j840n06Q99J537L93j449j624
586a851O57J216R52r31j514q17J465J465K79j087j475N54J494N93o91j058q4O55
604a78J114L12j180j111M79J506N96o27j288n50J002J299qj023j134J39J170J081
622A599o13j524m21M99J631J59j634j030J92J391P20m20j352p58Q97J262K52j291
640d41p08O6J253P71o69j195J8L84J447j3r78m93j0J212N79m45j174m22P25J278
$$ plain form
517 1736 1498 -137 -1599 -975 962 1755 577 -1034 -1482 -89 1481 1128 -159 -1409 -1589 318 1194
534 1194 685 -1195 -2072 -907 454 1001 -385 -2031 -1529 10 1355 603 -1679 -2501 -984 1503 1302
551 1302 -238 -1644 -1157 662 1566 682 -965 -1430 37 1452 1331 -6 -1375 -794 1028 1614 845
568 845 -401 -1056 -521 1249 1319 179 -1176 -1191 473 1196 739 -1101 -1607 -708 829 1222 -227 -1851
586 -1851 -1194 22 974 43 -1471 -2288 -823 642 921 -166 -1641 -1087 407 1000 309 -749 -833 -178
604 -178 936 1248 68 -1043 -564 942 1538 911 -377 -927 75 1374 1366 343 -791 -652 518 1599
622 1599 986 -538 -959 -460 1171 1330 -304 -1334 -1142 249 969 549 -803 -1561 -664 598 850 -441
640 -441 -1149 -1083 170 941 272 -923 -905 -521 926 913 -65 -558 -568 644 1223 778 -396 -818 -93 1185
660A185L40j041j252L72R74R29n51p79p83M24J115K44q26j397O65P58N81n08j131
679f81k8L34P12J64o23j046J26R20Q24k58q93q00P55J003K31p54o46o1Q75R83
699A137l72j143m65P82J084J05o97r76J77P88R91n34r01l59M81J085j37p31o10
718b95k65J118M03k12j030o15L45J184J34o19r71p6R46O22j16j118o84P49P53
737B53O08q73r27J65J094M37n98l60n78K24J209L77r73n81k45Q15R06l11q09m79
757f46Q44L12N45o79r30J34Q59K93k7j169o5J03J283Mp64m31l74P57O92j60j100
778e19k82M9J195J74p76p46L7Q23K65J24p62o22N66P88L38p57m92o3Q80Q24o50
799C94l89o79N54O27M01o41n67j71N54N00K24r38l41K36M28L13rr13k09Q62J93
$$ plain form
660 1185 1525 484 -768 -396 578 1507 956 177 -606 -182 933 1177 351 -1046 -381 377 958 450 -681
679 -681 -709 -375 337 501 -122 -1168 -1042 -122 702 444 -449 -1249 -494 509 740 -14 -660 -721 154 1137
699 1137 765 -378 -843 -61 1023 1128 431 -545 -368 420 1411 877 -24 -383 98 1183 1046 315 -295
718 -295 -560 558 961 749 -281 -896 -551 633 767 148 -823 -899 47 669 553 -565 -1249 -500 253
737 253 861 -12 -939 -774 320 757 159 -201 -779 -555 654 1031 58 -523 -768 47 953 642 -167 -646
757 -646 198 510 1055 376 -554 -420 439 732 705 -464 -529 -426 857 861 97 -334 -708 49 741 581 -519
778 -519 -801 -752 443 617 -159 -905 -868 -45 220 344 -418 -1040 -474 314 652 -105 -597 -660 220 1044 394
799 394 5 -674 -120 507 908 267 -300 -471 83 583 807 -131 -472 -236 192 505 496 -417 -626 236 429
820D29P9o83q17O94N60J09n01m12k18O49Q02m55m99m66M5J093J71n18p58J28K92
841b76Q91o8o89p93Q19M96J47r7q51J34L04M99R3o31o49M36P10M15o81q18K1N19
863f9L69R4n31n64J31P29N19q13m01N4M26O13N5j007n67J77J154n9j13q30l9P54
885H2K04K96n23p27J32P96N6j11n71l04N23M91J98n36m39K64M10J97j30q40O5
906d67K19O18r4o08l70M91M31K62o28n10J33M01N57Q3n60n66J31O62J23k30k96
927b18l08K88R05l28l84n05K32N72P9J4q21K31M07M81j38n02m57J31N62J72m06
948Go33K49L45L10K3j65o35m1O08J43p2o10k44M70M45M75p89M8n76P36M90l81
970B03o92N0L06M40L57n06n22K5M38N29r0q98k84K63N93M12o49m27J42K26O15
$$ plain form
820 429 508 -175 -992 -298 262 371 -130 -542 -760 -111 691 236 -263 -729 -684 409 580 62 -696 -568 -276
841 -276 615 547 -142 -935 -116 380 527 430 -421 -287 17 516 609 -22 -671 -235 475 890 209 -609 -588 -69
863 -69 300 394 -137 -701 -570 159 678 -135 -536 -482 -56 557 612 -395 -962 -785 369 310 197 -633 -672 82
885 82 286 582 59 -668 -536 260 316 205 -366 -670 -147 344 542 6 -433 -169 241 438 308 -532 -467
906 -467 -248 370 276 -332 -702 -211 220 482 -146 -656 -523 -122 435 518 -42 -608 -477 185 308 78 -218
927 -218 -526 -238 667 339 -45 -550 -318 254 333 347 -474 -243 164 645 507 5 -452 -321 241 413 7
948 7 -626 -377 -32 278 301 136 -499 -540 68 211 139 -471 -715 -245 200 675 -114 -66 -642 94 584 203
970 203 -489 -439 -133 307 664 158 -364 -339 99 628 538 -360 -644 -381 212 624 -25 -452 -310 -84 531
991E31l46k73l08K79M84K01k33o64J7L17M30j85m24m25J29Q70K06o86j41p2L73
1012H0J61j19k96l5J5M66p5k62k63M9L42K89m11l9l53J50M62J42j60l18k46L72
1034d9O67k60o04K18l25P77q9j74n09J73N25J6P8p18k04M08J92K8j84k59k43O72
1056A36L30l63j58k30K94M92Q5o29m63O1R81k43j02n41R9K69M69o1j85o93J75
1077b77K82M05n4l63m82J11N35J4O2q92R1J002j10o9m28n84R73j73K31k39l07
1098b72m1K81M28l6n11j95P7P32l85J15k22l3kK69J17o36J92j23N60M1l31l57
1120c32J0M27K69r5o12K46J87l3K61j26n65L11R5K70N4o94m4O7L72J84Lm64J9
1143a90L44k39J74j71k73J81J99L56k23m71Q5J80Q4K91o44j46R5M92J99q5l57
$$ plain form
991 531 185 -88 -396 -117 367 568 335 -329 -312 5 435 250 -174 -599 -470 400 606 -80 -221 -293 80
1012 80 241 122 -174 -209 -194 272 197 -65 -328 -279 63 352 -59 -98 -451 -301 161 303 143 -175 -421 -49
1034 -49 618 358 -246 -28 -353 424 335 161 -348 -175 350 366 444 -274 -478 -70 122 150 -34 -293 -536 136
1056 136 466 103 -55 -285 9 501 586 -43 -506 -445 536 293 191 -350 -251 18 487 426 241 -452 -277
1077 -277 5 410 356 -7 -489 -378 157 171 233 -659 -568 434 324 255 -173 -757 216 43 274 35 -272
1098 -272 -313 -32 396 360 -151 -346 -269 463 78 193 -29 -62 -64 205 322 -314 -122 -245 315 356 25 -332
1120 -332 -322 105 374 279 -333 -87 100 67 328 202 -363 -52 43 313 367 -327 -371 -304 68 252 255 -209 -190
1143 -190 154 -85 89 -82 -355 -174 25 381 158 -313 -228 -48 36 327 -317 -463 -368 124 323 238 -119
1164a19j07M58K76j90m27J00j31K06M03n32k32l02O99N16m07k80m04J6O90K2j84
1185G1k18k28L40J90R2l89R2m83P24K5J37n68j16M37M21n37j8l96K36M05J66r1
1207B92p19J75M85N5J4l27k11J64K24J41J06p92Q8J36L04K47n43l41K94M02R4
1228B88j99n1j34r8K75K36l69k38q1M03M64o37J9r1K49l0J77r9l83J20K83J93
1250B97k47l22J13N8M22m50l04K15J71K50m7j35k41o7L69J87l4j05l29p4L17K68
1272C12k37l47K08K5l7J48o9l71j1O00J63l05l30k8M34j18J60j78m28O4P23J33
1294E11m89j99k11N33K63k81j14k39K31K31o7j22k10K6K31K36J31n17k61j66N92
1315A09M77n41j83k19M97Q5k11K8l85J89J01L03q8m33N6L66K78m92j8L11o25O16
$$ plain form
1164 -119 -226 232 508 318 -109 -9 -140 66 469 -63 -295 -597 102 618 211 -69 -473 -457 233 255 71
1185 71 -147 -375 -35 155 247 -142 -50 -533 191 216 353 -215 -331 106 527 -10 -28 -424 -188 217 383 292
1207 292 -427 -252 233 288 302 -25 -236 -72 152 293 399 -393 -305 -169 135 382 -161 -502 -208 194 288
1228 288 89 38 -96 -194 81 317 -52 -290 -371 32 496 -141 -122 -213 36 6 183 84 -299 -179 104 297
1250 297 50 -272 -159 -101 321 -129 -433 -218 -47 203 156 21 -220 -287 82 269 235 130 -199 -273 44 312
1272 312 75 -272 -64 -39 -76 72 3 -368 -379 221 384 79 -251 -279 155 37 197 19 -409 -345 378 511
1294 511 22 -177 -388 145 408 127 13 -226 5 236 169 47 -163 -137 94 330 461 -56 -317 -483 109
1315 109 586 45 -138 -357 140 225 14 42 -343 -154 -53 250 162 -271 -215 151 429 -63 -81 230 -395 221
1337B21N6k09j85kQ6K53j72j91J29n09P15J38r8m35J23Q9J96rm76L9o7K67J68
1360A27l32J7r1M41K84p0m53q0k3J0L00L55o89o2J72M6l3q2N3O3j48K95j1k20
1384a31j30J29L48J08j99m65K20K58k04J36k17k8M71pj95r2l43K25j17M83l58
1405a08k32J93J85K51j23m29pJ34P6K93j42j09j96L64N9k07R6k78Q6K04J75j5
1427B70l65m9p7J79K34k02po2K43K19j88k83k92K87L42k39oo9Q5L7K47l51k06
1450b53J54j03K76Mj75l36K01J78j36K68k24O5n0Q8K21l23J35j8J0p3J36k6m22
1473d03M16K21N7m59r1K73o2m5K38k79o5J17J56l75N30m60R3L29o6j6j83mj29
1496b07M09k47m5Rp5J78K73l89j46k60N40L73l36k24K51l56L17l0j84q1K68N3
$$ plain form
1337 221 277 68 -117 -119 -33 220 48 -143 -14 -523 192 330 232 -203 -80 9 205 196 -280 -241 -308 -41 127
1360 127 -205 -188 -279 162 446 376 -77 -157 -180 -170 130 485 -204 -266 -94 -48 -81 -163 -110 -47 -195 100 89 -131
1384 -131 -261 -132 216 324 125 -340 -120 138 -66 70 -147 -175 296 289 94 2 -341 -116 -233 250 -108
1405 -108 -340 -147 38 289 166 -263 -270 -136 -60 233 91 -18 -214 150 209 2 98 -180 -94 110 285 270
1427 270 -95 -144 -221 -42 192 -10 -17 -79 164 383 195 -88 -380 -93 249 10 4 -65 20 57 304 -47 -253
1450 -253 -99 -202 74 78 -97 -433 -232 -54 -190 78 -146 -81 -131 -43 178 -145 -10 -28 -18 -91 45 19 -403
1473 -403 13 234 291 -168 -259 14 -48 -93 145 -134 -199 -82 74 -301 229 -231 -138 191 125 109 -74 -78 -207
1496 -207 202 -45 -90 -81 -156 22 295 -94 -240 -500 40 413 77 -147 104 -252 65 35 -149 -230 38 91
1518I1P5K0m78K09N5J73r0pl77M27j23K30Q9n37M6O4m7J94j87m4K26p0J41n1j36
1543a07k35L16K95k94K37j10m48L66J84j41m05K24l5Q3K45m78J75j04K28J9J23
1564A38j52l21M2K25L71j45n7l17K74P4M8m19J41J71J64k9m5l55p4K87K18j15
1586A24j54k58L3K79J9l07L47j66J96j73J18k55K30%Pj33j55K29n17N07k42J68
1608a03j43K24J09j19M6j25Rj8J41r5L21j24j11oJ19Nm0j56J45M8j09J89j76q0
1632d9l1K99k21L9j01n0L0J18j81K5o9L13r1K3j22L1p2J09J54j36Pl94K89K29
1656A49m1j98j6N9k28L38K85n52K82j99p2M8P8p2j9L71K35m90kJ0j67J79J66j37
1680Gl10K51O1j36M11k11O8n7K7K73j01k69l4j00K25J12k13l8J71L2j36r7m61
$$ plain form
1518 91 166 186 -292 -83 -28 145 55 48 -329 98 -25 205 294 -243 -197 -133 -180 14 -173 -217 9 -61 80 29 -107
1543 -107 -342 -26 269 -25 212 102 -346 20 204 63 -342 -118 -153 -70 175 -303 -128 -232 -4 15 138
1564 138 -14 -335 -293 -68 303 158 101 -216 58 132 180 -239 -98 73 237 208 163 -192 -266 21 239 124
1586 124 -30 -288 -255 24 43 -264 83 -83 113 -60 58 -197 33 33 40 -93 -248 -19 -536 -29 -271 -103
1608 -103 -246 -22 87 -32 14 -111 -102 -120 21 -74 247 123 12 6 125 130 90 -66 79 127 18 207 31 -49
1632 -49 -80 219 -2 37 -64 -114 -84 34 -147 -122 -191 122 31 54 -68 -37 -109 0 154 18 25 -369 -80 149
1656 149 108 -90 -106 -47 -275 63 348 -204 78 -121 -193 -145 -67 -139 -158 213 448 -42 -44 -34 -201 -22 144 7
1680 7 -303 -52 9 -127 284 73 141 84 111 384 283 14 -20 -120 105 217 4 -34 137 169 33 -64 -525
1703e25K94j66N68n2k57r5J89K06R7l7n76K54K64j57q4l2J06k01J62J75j23p4
1725f4q9K19k25J51k16K84Q4k79J62J10m14M43q6LJ43l81k7j46O47j90M0m21r
1748b61K64J53N0l09J51k41K95pj6k47j77L98K9M6J8k33K66n9l56N4L80k92J32
1771C8J81k70n9L8M7r9L28j76j97J60P1P1k00Q2j94o9N51k25m4j96J78q9J8K44
1795A89r1l13M09l99J54K04k13j38P2J69j84O6p8p7K67J3K2j89K85l43L75L5j34
1818A01j41p6K49M7n4k6K4JK0l39MN8N34n18K18Q3m87M66j10J90o3j20j02J56
1842A15K76m13K9J9Q2p1O62q28O9j23J75J26J31j22l82J04P8K73o7k28L3L02j19
1865A21J4j41R2l51O12j39P8k29j05J77J15o5j7q7j01J57K69n90K55L6l3l12J72
$$ plain form
1703 -525 -231 -397 171 119 -138 -233 -44 162 259 222 -354 -100 164 7 -77 -109 -3 -204 -42 133 10 -64
1725 -64 -153 66 -159 -8 -224 60 144 -135 27 137 -277 166 80 83 226 -155 -182 -328 319 129 169 -252 -261
1748 -261 3 156 206 -103 48 -193 102 95 79 -168 -345 53 82 128 146 -87 179 120 -236 -182 198 -94 38
1771 38 219 -51 -110 -72 -25 -124 204 28 -169 -9 62 133 -67 15 -179 -248 303 78 34 -162 16 -73 -55 189
1795 189 98 -215 194 -205 -51 153 -60 -198 -126 43 -141 -75 -153 -230 37 50 72 -117 168 -175 200 235 101
1818 101 -40 -116 133 180 126 100 124 125 145 -194 -190 -132 402 -116 102 185 -302 164 54 244 181 61 -41 115
1842 115 391 -22 7 26 108 37 699 -129 -60 -183 -8 118 249 127 -255 -151 -73 200 133 -95 -62 240 121
1865 121 135 -6 86 -265 347 208 286 57 -48 129 244 179 162 75 -26 131 400 -190 65 101 68 -244 -72
1888g2J82j90j18M22k96J26J20j24q0L68k17J5o5l34M20J0P1n35J21L59k96p3
1910a86J58k86L19j06J85Pk15J17j17L34k3l24J30j53O94o00R2kj95P2J34J47
1932A82j55k38P0K45oj34j08k24N11k87K91k10Q7k30K53J66l85j98R6K41O1J87
1954B15j57l26L03P7l5j16o5l2Q2J05m9J69k91jK51J71j69J05j64l54N01Q4o7
1977B37ro19K34L05j05j50n9j69N08j44q2L7j00J18q9L16j58l79M33j14k39K25
1999cj61MK13JM7j8j61J02o0K48l2m9k28K78j81K22%p8j70j7J60o3nj0j82L05
2025A62K6k69L44m06J62K30k65n2rk82K74K75j01k96P9K63j62J20l70M11n3j86
2047a05N4K7QL6J56q2Ql09K28k04K62O0k87r6J60J06m7J66j00l32M43r4O5k80
$$ plain form
1888 -72 110 -80 -198 224 -72 54 174 50 -30 338 121 136 71 -263 157 167 238 -297 -176 183 -113 -186
1910 -186 -28 -314 5 -101 84 91 -124 -7 -124 210 187 -137 -7 -160 534 -66 26 24 -171 -99 35 182
1932 182 27 -211 -141 104 98 -36 -144 -368 143 -144 147 -63 24 -206 47 213 -172 -370 -274 -33 28 215
1954 215 58 -268 35 112 77 -39 -104 -136 -54 51 2 171 -120 -121 130 301 132 237 73 -281 220 304 237
1977 237 228 -391 -157 148 43 -107 -166 -335 173 29 -53 -16 -116 2 -87 229 71 -308 125 11 -228 -3
1999 -3 -164 -160 53 54 101 83 -78 24 -36 212 180 131 -97 181 0 222 222 144 -26 -43 117 54 49 39 -143 162
2025 162 188 -81 263 -143 19 249 -16 -68 -77 -359 -85 190 89 -207 -128 135 -27 93 -277 134 81 -105
2047 -105 -51 -24 -16 20 176 94 102 -207 21 -183 79 139 -148 -244 -84 22 -25 141 41 -291 152 58 123 -157
2071a57J26R1J49J22m31J86N5j3j38J90n2l67K87K48j62k48n4J1K00M8M7k80j32
2094b74J66J70k23N1j61L34M0J30l07k1J08R4j90Q2J17k00L3K48K8j42j03K8m1
2117c3K62k11L2k96K48j46K12m0k46j0L10oj12j36J20N9jL15p8k02j28o4J34R2
2141G5n13K61O1o4J80L53n29K48k3J28k86L6n7l01M88K9J24n9j19l78K65J28J40
2164A87j90l18J90O6Mnn8J96j85K25j52n5J37k83L35l0k50K81n5q1j19K67P2m52
2188b73L37R1n63M16q8k32K44j32J60J09Q9m97L15r2j41J83j40K79N5j39pk43
2210b69M99j01k54k7p3l3L17p8j22J4K92p6P7l19J97J76k80M36n00l8j06K6J62
2233h0J28M9o9j08J66J3k37J82J34k46M5j20J95j20L61m47K22J34p4j76j01K03
$$ plain form
2071 -157 -31 60 209 331 -100 86 141 128 -10 180 128 -239 48 296 134 -114 -168 -157 43 91 138 -142 -274
2094 -274 -108 62 -161 -110 -271 63 103 233 -74 -95 13 107 -83 -1 116 -84 -51 197 225 83 -20 8 -33
2117 -33 229 18 50 -246 2 -144 68 28 -218 -228 82 76 -36 -172 -52 7 6 321 243 41 -87 -151 -17 75
2141 75 -438 -177 -116 -180 0 353 -176 72 49 177 -109 -73 -130 -431 57 86 210 151 32 -346 -81 47 187
2164 187 -3 -321 -131 -65 -61 -66 -124 72 -113 112 -40 -95 42 -241 94 64 -186 95 40 -41 -160 107 179 -273
2188 -273 64 155 -408 8 -80 -312 -68 -200 -40 69 158 -339 -24 -116 -257 -74 -214 65 120 -19 -26 -269
2210 -269 230 129 -125 -152 -225 -258 59 -19 -141 -127 165 89 166 -153 44 220 -60 376 -124 -162 -268 -242 -80
2233 -80 48 97 28 -80 86 99 -138 44 178 -68 -23 -143 52 -68 293 -154 68 202 128 -48 -149 54
2255E4r9K15m36J65O3M33J17m94k6m04P97l80J40m1N4k78K39O1k34K16j50K9O9
2278A10j24j22n7J59J93m28M29m82K70K27j72J14j85J9j06N1K57N1m01J66k47
2299b78J12Q8K48r5j58O0J31j5o5o3L03Qk98P0j6K23k31J09o0k06L5K4m0J49Q8
2324A23j86j73J97l13M00OP9n51N83j13r5lk40K22p5k1J37j41P9j5R4k7J0jj63
2349a87L42l6l81K83K78j95J60l70j3nJ65j55K78O2n34Q2L41k14J46l4Lj38Q4
2372c8p6o7l6K93Qk88J85j11J14k1K43k53J60p6K87n6j36j91q8L44k47M5j41P0
2396g6P6k49M30L17l89N1k46O9L5k8j2k01J1K19K28l40j23M7K45P6k20JjL6o4
2421a08L74k45M8j18J02N1J3j58mK33k96M70k68K96l21j60L4p9MLQ5J02O7j25
$$ plain form
2255 54 -45 170 -266 -101 -38 395 512 18 -8 -412 385 5 145 104 158 -120 119 180 -54 162 12 41 110
2278 110 -14 -136 -193 -34 159 -269 160 -322 -52 175 3 117 -68 -49 -155 -104 153 204 -197 -31 -278
2299 -278 -166 -78 170 75 -83 -23 108 93 28 -35 268 276 -22 48 32 255 24 133 73 -133 -98 -74 -114 35 123
2324 123 -63 -236 -39 -352 48 54 133 -418 165 52 -43 -46 -286 -64 -139 -160 -23 -164 -85 -100 -6 -33 -23 -24 -187
2349 -187 155 119 -262 21 299 104 264 -106 -119 -124 41 -114 164 226 -308 -226 115 -99 47 13 16 -122 -38
2372 -38 -114 -181 -217 76 84 -204 -19 -130 -16 -37 206 -47 113 37 324 268 132 -59 -147 197 -50 -5 -146 -76
2396 -76 0 -249 181 498 109 160 -86 -17 18 -10 -22 -223 -212 7 235 -105 -228 -181 64 140 -80 -79 -80 -44 -108
2421 -108 266 21 69 -49 53 104 117 -41 -45 188 -108 362 94 390 69 -91 -57 -136 -132 -129 -44 58 125 0
2445@Q4j91p2J65p1K05O7m05l2M47j05l54K68k29J49k93O26j99p0J36k80K38j91
2468a07J13k73M04j41M7j57L1o4J21J4j04J25J60j7K19m06k7k4J08L18rk71j15
2491e5N4J65l72O4K3O1K50m08j39K31j51L72P5l5rk41J04J96k92R8j28JK49l43
2515b30M89j01l98K88k14j79O85k33l5Pk12J75o4k59R0J59Q7J17m6j69R2J3p1
2538iO2rJ31j79N1l4r9R2j6J83r4O9Pl93K71j28J86N2j45k02K53J09n44J94L99
2563B07j45j07k06J52L07l15M2K13p3q3L07m22J26k20J09o2K73N6m4l18K42j01
2585f2K06k18j25J23j43L96l9L3j35j33J39K37n0k27o9J3k2Jj33J71J81j26K8
2608D6k77K26J09l00K24P4J23k87l01J66K18O6j27K9O0j84J56k46K60j47J19k7
$$ plain form
2445 0 84 -107 -179 -14 -85 120 187 -218 -250 197 92 -262 6 -223 -74 -367 259 60 -10 126 -154 84 -107
2468 -107 6 -267 137 -4 43 -114 -83 -147 -26 -12 -116 9 169 152 371 -35 -62 -86 22 340 331 60 -55
2491 -55 -1 164 -208 -144 -121 -60 190 -218 -357 -126 -277 95 170 135 126 -115 -11 185 -107 -9 -137 -136 113 -230
2515 -230 259 158 -240 48 -166 -345 340 107 72 79 -133 42 -22 -281 -191 -32 55 172 126 -43 49 62 -9
2538 -9 53 44 175 -4 47 13 -86 6 -10 173 79 148 155 -238 33 -95 91 143 -2 -204 49 158 -386 -192 207
2563 207 62 -45 -251 -99 208 -107 -65 148 75 -8 299 -123 3 -217 -108 -170 103 159 115 -203 39 -62
2585 -62 144 -74 -199 -76 -219 177 138 171 36 -97 42 279 229 2 -67 -54 -76 -75 -208 -37 144 18 46
2608 46 -231 -5 104 -196 28 102 225 -62 -363 -197 21 87 -40 -11 49 -135 21 -225 35 -112 7 -20
2630b0j90J39J59o8J93q7N8Kk14r1M03k50J0j66P8J83k80J82j06N1o9J5L31k76
2654a3R7j48N4o4J61J04k92J89M7J67k82l9L8j26L40k74j53L28k16N1J53j8J03
2677B07k06J5j77K48K17l43K23K5j20l2k56M16j53P0k85J76O2j34n1J6K75j55
2699C8k28K46R0j15k02L43j42M6l1j00M2J64j17k08J45L85j64J25k35J15r9j75
2721g7NK67j44q1m8m9K15J0K6k43J55l34j19P33l06j09K47k8q0m0N4l91j93O51
2745A21j20j70K37j91L01k90K38o6j30n3q9J66k2j93J18K0K69J37m17J83o3j41
2767a55L39j22l19K11Q9J2l47L57j88m7K11J32k42Q0N9l03L11K05k03j55Q4j61
2789a52L35n62N70l20L1J82l73L29r3o4J8J00J65p6j34R4M7rL2l32r4L49l52L80
$$ plain form
2630 -20 -210 -71 88 20 213 126 184 186 -28 -119 284 34 44 -122 -44 139 -141 41 -65 -14 -83 -68 263 -13
2654 -13 84 -64 -10 -74 87 191 -101 88 135 302 20 -19 19 -107 233 -41 -194 134 -82 -31 122 104 207
2677 207 1 16 -161 87 304 -39 184 209 89 57 -199 217 64 134 -151 25 87 -47 -98 -82 193 38
2699 38 -190 56 146 31 -171 172 30 76 45 -55 -13 151 34 -174 -29 356 192 317 82 197 98 -77
2721 -77 -72 195 51 -30 -78 -127 88 98 124 -119 36 -298 -417 316 10 -99 148 120 40 0 54 -337 -530 121
2745 121 1 -169 68 -123 178 -112 126 60 -70 -123 -212 -46 -68 -261 -143 -123 146 283 -134 49 -14 -155
2767 -155 184 62 -257 -46 43 55 -292 65 -123 -170 41 173 -69 11 70 -233 78 283 80 -75 9 -152
2789 -152 183 -379 191 -129 -98 84 -289 40 -53 -117 -99 1 166 90 -44 50 97 88 120 -212 -306 43 -309 71
2813G1k17J79k98K30M6k03O47m87MJ89J27m09K00j81K0J44R5j24J8K4R2j07k79
2836b19J03K34L3j87K65j17j56N9j87J76j7k1J79q4j87J73LP9l21J86K94l70K48
2859A66j60L28j76j06j2k23J69K4J01j1l21K67N1OR9l44P0K70l25O5L25j80o8
2882A5J59q1l60Q8L01M6k19J26j37m7K33O4k82Q1k6M63j75M7m06J29j53M5O5K39
2906B15p4k87r7l5K87L8J90j1k42k01M46j05l65L04J12j20o7P5l85K46J99r4J86
2929B15k58P3J53M9k31j84j4J08j6j06LK73L3q5k42L04j94J01j58m2L18j78kK91
2953B11l29K59R9l07qPL14l57k16M14j40r1m6L25j26k54k7J74K5k0J84L6J9l61
2977b15J02J92o8J14m09K18L61l30L3L6L3r8K85Pn73L55j02J68j53M11k41l34
$$ plain form
2813 71 -146 33 -265 -35 11 -192 455 -32 -28 161 288 -121 79 -102 -82 62 157 33 51 75 167 60 -219
2836 -219 -116 118 151 -36 229 112 -44 15 -172 4 -13 -34 145 61 -126 47 50 129 -192 -6 288 -82 166
2859 166 6 334 158 52 40 -183 -14 10 111 100 -221 46 97 103 202 -142 -72 198 -127 -62 263 83 15
2882 15 174 93 -267 -179 122 168 -51 75 -62 -109 124 188 -94 -13 -39 424 249 296 -110 19 -134 -89 -24 215
2906 215 141 -146 -243 -278 9 47 237 226 -16 -217 229 124 -241 63 175 55 -12 63 -322 -76 123 29 215
2929 215 -43 30 183 232 1 -183 -197 -89 -105 -211 -208 65 98 13 -229 75 -119 -18 -176 -218 100 -78 -80 211
2953 211 -118 141 240 -67 -75 -68 246 -111 -327 87 -53 -144 -190 135 9 -245 -272 -98 -73 -93 91 127 146 -215
2977 -215 -113 79 11 125 -284 -66 295 -35 -2 34 67 -31 254 261 -312 43 -59 109 -44 367 126 -208
2999b08Q0nJ14l3j29L69l85M01j36Q7l0j97Q5r6l6R1j43O7K53k85J28l0R9l3j34
3024a06j02J14K98j71J64n07r5L74q2J80l01K19j77M34ok65j79M48m72M73l4l53
3046a46J66J53j30j07K18j60L04l92Q5m1N3RJ57M7o55J54K13J10m0J80p8j57Q5
3069B8Pk5k59Q1J55K5j94J30Q9M3k72L69r4l3K81l51j56N6J99qJ70k13j58J24
3093fm8M5j99M24k38J10J51j64j29M2J39k74K05N7m27K93J25PJ12k81J70N5k02
3116c3N4P2j57K50k1p7l07M44l13L03m69L75k14N5M6j63K95j96K68k71M0k05Q6
3139a38l0k53N35j60m5L51n55K04J37R2j54J02l17p6M11Q7j92J0k81L20j72J7
3161a07J99J66k24m7J2J6K11n39K62J48j42J05k91J55L06n9jm55L81j5L8K24k31
$$ plain form
2999 -208 -128 -133 -19 -52 -181 188 -197 204 68 155 125 -72 13 -83 -119 -28 -171 -104 149 -136 -8 -38 61 28 -106
3024 -106 -208 -94 204 33 197 -310 -405 -31 -113 67 -234 -15 -192 242 236 -29 -208 240 -232 241 207 -146
3046 -146 20 173 43 -64 154 -6 298 -94 -9 -50 3 12 169 216 -439 -285 -72 38 -2 178 100 -57 28
3069 28 35 10 -249 -168 -13 12 -182 -52 37 80 -192 177 83 50 331 -20 -176 -120 79 71 241 28 -130 -6
3093 -6 -54 -9 -208 216 -22 88 239 75 -54 -12 127 -147 58 115 -312 -19 106 113 225 -56 114 169 -33
3116 -33 21 93 -64 186 165 88 -219 225 -88 215 -254 121 -93 -38 8 -155 140 -56 212 -59 -19 -224 -138
3139 -138 -168 -421 114 -46 -91 260 -295 -91 46 138 -16 86 -231 -307 104 191 -1 9 -272 48 -124 -107
3161 -107 92 258 34 -13 -1 15 226 -313 -51 97 -45 60 -231 -76 230 171 170 -285 96 81 119 343 112
3184A12k71O1K21O3M8l00L01j13J4p4j15k62J24K43k53L01l08L35K00l91j34K37
3206C9j01J88J62m18J08M33l20j25O1k2J62m11K14p5M37m22l0J97p0j81j70M56
3228A12k16J67M6q3k84M39j71J28k34K06j65j89J15L52l9j59p7K20K09k26M5M8
3250B44j16L3j14k14L8k36M68j69j43L19p6j49J03K06P2k73j5m8nO3J22K9l41
3273b02J94L4r8j23J04O1J03j90j3L99l26P8J83k30J23j10J34L3l36N6J79j3j12
3296g2J88J81k01k91L94j12N1m43L83J08k96R2N9j01j46O5K9L13q8l08J36K55
3318A96j82R1p0R2k26k14L05J6K15M7l99L2m4N0K86j56J88j43m8q7O1K15k14j16
3342a05J28J4j32J42j97K97m14K63k1J73p7j45J59j82M1J21o6l20M83k75K06l1
$$ plain form
3184 112 -159 -98 123 186 234 -66 235 122 136 62 -53 -315 -191 52 -201 100 -208 127 327 -64 -198 39
3206 39 -62 126 288 -130 -22 411 91 -34 27 5 167 -244 -30 -105 332 -90 -120 77 7 -174 -344 112
3228 112 -104 63 109 26 -258 181 10 138 -96 110 -55 -244 -129 223 184 25 -52 168 377 151 196 244
3250 244 128 161 47 -167 -129 -365 103 -66 -209 110 34 -115 -12 194 266 -7 -22 -70 -75 -12 110 139 -202
3273 -202 -8 26 -72 -195 -91 -30 73 -117 -130 269 -57 21 204 -26 97 -13 121 154 -182 -126 53 40 -72
3296 -72 116 297 96 -195 199 87 138 -305 78 186 -110 -18 41 -60 -206 -141 -112 201 113 -195 -59 196
3318 196 14 105 35 127 -99 -313 -8 8 223 270 -129 -97 -141 -91 195 39 227 84 36 -51 10 225 11 -105
3342 -105 23 37 -95 47 -150 147 -267 -4 -25 148 71 -74 85 -97 -56 65 -1 -321 162 -113 93 62
3364F2l30K87n0K42k09j4K71k81o5J28L63o24K32j41q6R8j48O9K14j07O1l1j41
3387b00K39mJ63j44j3q3j47J70K00k09J01o2R7j89L05j82j34J56Pk81qL12r8J07
3411A03j3r5J15J56j20j34j16K16p7j13K16Lj83l3k21R2M5p4J52L17j55L8Nk75
3435a51J51Q2m61L02l4K4O3m1l1j1p2L21l05L16p7N6j64P4K4n0j00M7J69P9m98
3460b87L30k6j6J02k4k49K38o5Q5k82PM11j56j61P9J05k89J91M6j72J52j67J94
3483D6L28l37j40J27J53l11K49j48L97o37K21M22l08J28k95p3J35N3Q0k66L55
3504A79k34j0J21j18J7J33k53K58o7MJ58l15M68j84r2q2R1J48k12r7J16K53l53
3527g1L41j78j82k8RK94k83K07j74R1k89K75K44l28N18l26N5j07R7q7j20O1r2
$$ plain form
3364 62 -268 19 -31 211 2 -12 259 -22 -87 41 404 -220 12 -129 -215 -117 -265 -196 18 -89 -28 -59 -200
3387 -200 39 35 198 54 41 -42 -189 -19 181 -28 73 11 108 -81 224 42 -92 64 71 -210 -218 94 -4 103
3411 103 90 -5 110 266 146 12 -104 112 35 -78 138 141 -42 -75 -296 -204 -159 -233 -81 236 81 119 124 -151
3435 -151 0 82 -379 -77 -111 -87 -24 -65 -96 -107 -179 142 -163 153 76 132 -32 42 66 16 -84 -37 132 211 -287
3460 -287 43 17 1 103 79 -170 68 3 88 -194 -187 224 68 -93 -14 91 -198 -7 39 -133 19 -148 46
3483 46 374 37 -103 24 177 -134 115 -33 364 -273 -52 370 62 190 -105 -178 -43 10 90 -176 179
3504 179 -55 -65 56 -62 -45 88 -165 93 26 30 188 -127 341 157 65 -17 74 222 10 -87 29 282 -71
3527 -71 270 92 -90 -118 -109 185 -98 109 -65 26 -263 12 256 -72 446 120 175 68 165 78 -42 19 -73
3550g3R9l57M2J15L18Pk33m3J67k68K50N1o5k0l90K79OJ67j35J4L24k8K7j49n26
3575d21N38k4J3L0n3j60M5K14l1k62o7K69j45j6J75J38m11Q8K68j76j66M3M6r1
3599a56K08j32L8K4m95N29l75K11J13j32J42J78k57J02o2l02L18J77q4l4m0j67
3621a96K60RJ83M3k79r1J90k88N0K23k75K90j35K49j45L2L1L5l82K35K61k45o6
3644a1k07L20l07K8M65m80K04P4k12K78j74l43J79L14p1r3j61K94r1q3J65j75
3666h7O0M9j58N8J05m9j7l85P36j43j56lJ44j49q6L39j09r7P8l32J41k34K53n5
3690i7j21N37l86K68k53J09Kk4Q6j05k47L12J31k10m8k35L63m0n4K6J98l56J32
3713a2J01kj28k44J68j11K24J75N8r5l18N0J13j64J47k6j73N9k2mL7J02J26k80
$$ plain form
3550 -73 26 -331 -289 -174 144 151 -82 -125 42 -226 24 75 10 -10 -400 -121 -115 52 -83 -69 255 227 254 105 -421
3575 -421 117 93 106 136 83 -77 -32 182 151 -111 -178 91 -54 -70 105 243 -168 -80 188 12 -154 -111 -65 -156
3599 -156 52 -80 -42 -18 -513 16 -359 -148 -35 -167 -25 153 -104 -2 -64 -366 -48 129 45 11 -29 -196
3621 -196 64 73 256 299 20 -71 119 -169 -119 104 -171 119 -16 233 88 120 151 186 -196 39 300 55 -11
3644 -11 -218 102 -205 -177 288 -192 12 86 -126 152 -22 -365 -186 128 57 -36 -197 97 6 -77 88 -87
3666 -87 -27 22 -136 -78 27 -22 -39 -424 312 169 13 10 154 5 -81 258 149 52 130 -202 -61 -295 -42 -97
3690 -97 -218 319 -67 201 -52 57 59 35 121 16 -231 81 212 2 -46 -281 82 42 -12 14 212 -144 -12
3713 -12 89 87 -41 -285 -117 -228 -4 171 229 134 -184 -134 -21 -185 -38 -64 -237 -178 -200 -204 -167 -65 61 -219
3737b19K07P0j40L72k21l32J92L29j15k03p2j82K26k96J78K6K59k12P8K66l74
3758a63P3j43M00l12R9m3J5K10k68K00j31n2K91j78l98M27K43m61m2K56KR6J69
3781B90p5m01J07R3k7J17j04j45QP2j08L30q2k7O1k26Q1n9O8pj57K31K8l31L55
3806I2j24k6n1j8K02j61q2J7J89l1J59k5l84K46L2j5J00r2j75j10K68j0p6K19
3830A44o9k95K5J49M84m64J15O4j94n1J46q0J1Rk43K14n0j09P6KK21L8j28p9m
3855f8P2k8L7J42j3r9j24k3K54m0j9j09r6M2O2jk29J69K05j63L9k1k55J87J56
3880G7j65L09j04k72J73J15O9j44j97K71j27K63m00J87J50k30m17L96J81m86J68
3901a83K00j71J64kk0j73L21l6r5K93j37M3o9l21K55k08l0L80j96J84m41M10k85
$$ plain form
3737 -219 -12 58 -82 290 69 -263 -71 258 143 -60 -132 -314 -88 -384 -206 -180 79 -133 -55 211 -163
3758 -163 -90 -233 167 -145 -46 -89 -74 136 -132 68 -63 -115 176 -2 -400 27 270 -191 -233 23 25 121 290
3781 290 215 -186 -79 14 -13 104 0 -145 -137 -65 -173 157 75 48 109 -117 -36 -95 -27 -34 -191 40 68 -263 92
3806 92 -32 -58 -109 -127 75 -86 -168 -151 38 7 166 141 -243 3 35 20 120 28 -147 -257 11 1 -75 144
3830 144 75 -220 -195 -46 438 -26 89 153 -41 -92 54 -26 -15 -6 -249 -35 -85 -194 -118 -116 105 143 15 -64 -68
3855 -68 4 -24 13 155 142 43 -81 -104 150 110 91 -18 -114 -72 -10 -11 -240 -71 134 -29 10 -11 -266 -79 77
3880 77 -88 221 117 -155 18 133 202 58 -139 132 5 268 -132 55 205 -25 -442 -46 135 -351 -183
3901 -183 17 -154 10 8 -12 -185 136 100 5 298 161 204 135 -186 69 -139 -169 211 15 199 -242 168 -117
3924a17l1L3J98j53j63N61n97L64j58O4M5K1j65M1K3j77K30k69K23L31l91N5J67
3947A35k72J76l0K4j61q3J46K16j58L6k7m7P5K41l60j36L44oj79J82J35o27L72
3970dQ4n5J89J57j60j56oM4j04k73L0K02R7q0L9n6k60J60N03k54k57J71J06O5
3994A82J31m16K54j89m9q5K10J46l60J37K17m3j96NJ72l9r9K97m67l1K46j7J22
4017A28k31j96M88m12N63k91J67k2o73N55P2k79R9o2J57n2J57J72j68o5l88Q6
4039a95K57n8r0L05n1k14K00k40n1K41k95L60l03k25K24j7n4K19k17J14J41L16
4061C67k89Q3k36J22nk00M66l51R2r0K27j77L9P0k05J9J96Qq1J6J19M9j35P6k87
4086a07J31k26L9k88M97J53k52j29L46J02m90N5L85j14k24L30j0j08R4M3m08P9
$$ plain form
3924 -117 -148 -115 83 -70 -233 328 -269 95 -63 1 46 67 -98 -57 -34 -211 19 -250 -27 304 -87 -32 135
3947 135 -137 39 9 33 -128 -211 -65 151 -7 29 2 -45 30 271 -89 -225 119 113 -66 116 251 -376 -4
3970 -4 80 25 214 371 211 55 49 93 -11 -284 -254 -52 45 -35 4 -52 -312 -152 351 97 -160 11 117 182
3994 182 313 -103 151 -38 -87 -172 38 184 -176 -39 178 135 -61 -56 116 77 -22 275 -192 -223 23 6 128
4017 128 -103 -299 189 -223 340 49 216 194 -479 76 148 -131 -32 -94 63 11 168 340 172 107 -281 -195
4039 -195 62 4 -86 219 168 -46 154 -86 -137 104 -191 169 -134 -359 -135 -152 -206 13 -204 -90 51 367
4061 367 78 161 -75 47 42 -158 308 -43 49 -41 186 9 48 118 -87 -68 128 136 55 71 190 239 104 180 -107
4086 -107 24 -202 -163 -451 46 199 -53 -182 164 266 -224 -169 216 102 -122 208 198 90 184 227 -181 -102
4108a02r1L54Pj24J8k03R8M2R0k37m3k06L96j94J17J8N7j01M32k76k25J75Q3k33
4132a48Q1j1k95L82o5P9J53j51j58K73k28K33R6k77K5j43M8J49j55J06R6j93L42
4155B39j7j66j49J25j42L42k48J89k98J47m3K3K9k8k8n5Jl9L58l32J14o3R3q4
4179c2K20k76Q0K17k5k84J25p3L41j62r4j73J20k48L49J4K6p7j7k0o0l4j00j04
4203b87M8K05mK6n6j78K94o8n4M2P2k66K50J06J23l69R6q1j8n2J62J19k74Q9L
4228g2K47k32q5N1P6j41J44j84J67J78k27j84M27k77L2J34j05q7J73K84j81j49
4250a1J22J82j14p9j15O4o9Q2k17l8p0L67l07J93J38j38J98j88k35L41M6m5J97
4273C04n91L57j43K05j47m9O1K33l01M7q9j70N18k22j6J28RJ1k58R0l4n1kM68
$$ plain form
4108 -102 -193 161 168 44 62 -141 -43 -1 89 -148 -191 -397 -1 -195 -78 -60 -3 -104 328 52 -173 2 85 -148
4132 -148 -67 -78 -373 9 -56 23 176 25 -133 140 -88 145 241 -36 -11 -154 -106 43 -112 -6 90 -103 239
4155 239 222 56 -93 32 -110 232 -16 173 -125 22 -21 2 31 3 -25 -80 -79 -118 240 -92 22 -41 52 -32
4179 -32 188 -88 -8 209 184 -100 25 -48 293 131 37 -136 -16 -264 85 99 125 48 31 11 -49 -83 -183 -287
4203 -287 -239 -34 -38 -12 -68 -246 48 -20 -74 -32 40 -226 24 130 253 -116 -20 -101 -119 -171 -9 110 -164 -75 -72
4228 -72 175 -57 -142 -91 -15 -156 -12 -196 -29 149 -78 -262 165 -112 -80 54 -51 -138 35 319 138 -11
4250 -11 111 293 179 100 -15 49 -20 62 -155 -193 -263 104 -203 -10 128 -10 188 0 -235 106 152 107 304
4273 304 -287 70 -73 132 -15 -64 -3 230 -71 -24 -113 -283 235 13 -3 125 134 145 -113 -23 -57 -108 -110 358
4297C58k48J5j76j8J63p7J47j68M04k45R8k73l4Q1K3j1J9J54k06j16J73K3j1j35
4321f0m4J40P0m0J61k99K71k2k76L89l53k36L19N8j1r0k13N40o01J61J63k14K78
4344I1J6j35K14l68K53J18k97P9k8n6J27q1k9J24o0J67l1j96J19L36l09j57L32
4367B29k50KK13k08N1j73L82k76k05L11L1o2N8j71J46k49J82J21j8j90K08n0k18
4390a36j3K46m8J6k74oj16L3K16R0q8O1j82M31k78l3R8R1P1l89K21J06k65N02
4414C54k41J47j89k93K35N6P3k23K63k09J58J17n24J47K63p5j18J51j0L4L5j51
4436@j84M25Kl77J80j12N4J55k33J66L2k68L4J31j36J18Rk5J1K73m82K47J3K4
4460E7l95N56j93j66N4oK69j98n4K09j46K59j27J73k24J50l03L5Q5n3K04k16K85
$$ plain form
4297 358 110 125 -51 -69 94 17 164 -4 400 155 253 -20 -54 27 50 39 58 212 6 -110 63 86 75 -60
4321 -60 -104 36 106 66 227 -72 199 177 -99 290 -63 -299 20 78 67 -23 -236 304 -297 -136 27 -187 91
4344 91 107 -28 186 -182 71 189 -108 -29 -57 -113 14 -67 -96 28 -32 135 104 -92 27 363 54 -103 229
4367 229 -21 -19 194 -14 37 -136 246 -30 -235 76 107 45 103 -68 78 -171 11 132 114 -76 132 82 -136
4390 -136 -149 97 49 65 -209 -215 -331 -298 -82 8 -80 -19 -201 230 -48 -81 17 108 179 -210 11 117 -148 354
4414 354 113 260 71 -222 13 69 142 -81 182 -27 131 248 -276 -129 134 59 -59 92 82 116 151 0
4436 0 -184 241 243 -134 46 -66 -12 143 -90 76 108 -160 -126 5 -131 -13 -4 -29 -18 255 -227 20 33 57
4460 57 -338 218 25 -141 -87 -93 176 -22 -76 133 -13 246 119 292 68 218 -85 -50 35 -18 186 -30 255
4483B55p0l15n1J57j81J2L14j46J57Kk75R6J18m7j69m5OK65k3j20k01L50k44L25
4507A70j39j97J21j14K49ql17kP5Q8K40Rn39J35K67O8J2j84M21k29O2l40L65j32
4531H1j63K7J45l04O3M3J3M97m15k4K49k86j6l0K06J2j23k63O04l07k20M14l56
4554a53L47p8m69N14j09k5J8j61K47p0j00L82k67nL5L6j07J1Rk20K11M1J07o2
4578A32l55K41l5Q5l05L65k34j12L78J13m29L8L93k32m8r8l1K49j49Q5j19j3J67
4601H6L9o9o0Q6n2rj04j50P2J11p4K6M4K77m64M87m03j2K26l3J89j46J3j58R8
4626B0l45N06k69k22N31k20l5j55L84l04O0L33m43L19j40k19K50k08K36j85J4
4647i2J90oJ11j11Lr6j49N3J5K43p9k37J19J6kj77K74J74j73m16J26L63k20OO3
$$ plain form
4483 255 185 -130 -181 -24 -205 -193 121 -25 132 134 -141 -45 73 26 -143 -188 -182 83 60 -60 -261 89 -155 170
4507 170 31 -166 -45 -159 90 82 -235 -237 -162 -74 166 175 -364 -229 38 106 118 -66 355 126 188 -152 213 81
4531 81 -82 -55 90 -214 -151 -108 -95 402 -13 -37 212 -74 -90 -120 86 98 -25 -288 316 9 -211 203 -153
4554 -153 194 116 -353 161 52 27 45 -116 131 61 -39 343 76 71 106 142 35 46 55 -165 46 87 194 132
4578 132 -223 18 -17 68 -237 128 -106 -218 160 273 -156 -118 275 43 -5 -103 -134 115 -34 51 -68 -81 86
4601 86 125 56 -4 82 30 21 -83 -233 -161 -50 -124 -98 -54 223 -241 246 -157 -169 57 24 213 67 80 -78 20
4626 20 -325 181 -88 -310 221 1 -34 -189 195 -109 -49 284 -159 160 20 -199 51 -157 79 -106 -92
4647 -92 98 92 203 92 95 -1 -150 -97 -82 161 82 -155 -36 -20 -22 -199 75 249 76 -340 -214 149 -71 -65 -2
4672bJ73n86K20N4L36m65K11M3J03j4K11k80j20J25r7L73j55k73J24k58J35J81
4694C9n1j00K89k20q7J66j46j72J90j39M17q1j32L42j65j2N6j68N5j01K1M1j53
4717a11J35j2k10M31k14J11j95N6J68j51J12O2k64k19J48J9K25j52L15m22L03
4738A35k66J4j3L80k49j03L63l98j4J04P9l09M60j01J09J13k08K38j79j52J67
4759A70K0J51n19J84M5j84K00j78L93l91J62rL6q7j31L35o0j32J88l3k31J35j88
4782a24L04n31L84n2O5M7n83P77l40j7k89K68R6J8j03J84m89M62J38j04j32R3
4804G2J57k31J63m71J47L26k16J9J19k94P9J26m2k38M77m9j93K22l38L46lL2j20
4827I0q3k8M8j20po5l75P38%ok09J73k60M81k84j55J51k32q9J03lJ22l4J23m4
$$ plain form
4672 -2 171 -415 -195 -141 195 -270 -59 -16 87 73 284 4 -116 9 -88 285 130 -143 -19 -277 -142 39
4694 39 -12 -112 177 -43 -130 36 -110 -282 -92 -231 186 105 -27 315 150 138 194 26 81 -20 1 42 -111
4717 -111 24 12 -198 233 19 130 -65 -9 159 8 120 182 -82 -301 -153 -134 91 -61 254 -168 135
4738 135 -131 -117 -130 250 1 -102 261 -137 -151 -47 32 -277 183 82 191 304 96 334 155 3 170
4759 170 190 341 -178 6 51 -133 67 -111 282 -109 53 44 80 -7 -138 197 137 5 193 160 -71 64 -124
4782 -124 180 -351 33 -19 46 93 -490 287 -53 -70 -359 -91 5 23 -80 104 -385 77 215 111 -21 72
4804 72 229 -2 161 -310 -163 163 -53 -34 85 -209 -130 -4 -46 -284 193 144 -49 173 -165 181 178 210 90
4827 90 7 -21 27 -93 -100 -165 -540 198 198 192 -17 156 -104 377 93 -62 89 -143 -232 -129 -132 -10 -44 79 35
4852C5J28k92J81J5m3k14J85j58J21P7K5j61K30k84P7l3L8P2O5O5j5o4r5K01k72
4877a16J91J62o4j09J74j05k34J5Q5p8l1M0K55j05kL61n34q9K60k93J54K59k25
4900b9k7n4k7K85k9j46j63j43M61k55j78L38p1j24R6j6l0m7k23J23K22j19Q2N5
4924a9Oj56K86k89P0J46k9J48j38J32O2M7j45K4l06O3n7L01l03J99k67L29j60
4947e6n2J31oK00l32j63Q4M52l46m3J05Q4j43J14J86m69K06K45j52m10K92J94
4969A21j24L4j47L5M2L18j30m62K54K6m2J45m62N51k00O5J60j87K05j09rj0j00
4992b6NrK3o1K34P8l06J31J30p8j10L9K35m99J64K02n1Lo5m4k27J17jK13m88M27
5018C6j61j5k9o1J40K08l60J33J3mK53J55m64K12J03j51L02l38L3K02l11r3K30
$$ plain form
4852 35 163 -129 52 67 24 -190 -5 -163 -42 35 60 -101 129 -155 -78 -111 -73 -1 64 129 114 50 -45 156 -116
4877 -116 75 237 173 64 238 133 -101 -86 -1 -79 -110 -70 185 80 78 439 -95 -184 76 -217 -63 196 -29
4900 -29 -56 -110 -137 148 119 -27 -190 -333 128 -127 -305 33 -38 -162 -66 -82 -112 -159 -382 -259 -37 -156 -74 -19
4924 -19 -13 -169 117 -172 -102 44 15 163 25 157 219 266 121 145 -161 -98 -155 146 -157 42 -225 104 -56
4947 -56 -108 23 17 217 -115 -278 -194 258 -88 -131 -26 58 -85 29 215 -254 -48 197 45 -365 -73 121
4969 121 -3 31 -116 -81 -39 279 149 -313 -59 -33 -75 70 -392 159 -41 24 184 -3 202 93 84 74 -26
4992 -26 -21 -30 -7 -68 166 244 -62 69 199 121 11 50 285 -214 -50 152 101 104 39 -5 -232 -115 -116 97 -391 36
5018 36 -125 -140 -169 -230 -90 118 -242 -109 -96 -100 153 308 -156 56 159 8 310 -28 5 207 -104 -197 33
5041C3j57K88j33j73J22Q0R2l01L36k15o4L26k62k2J20Mp1J87j74N2K12%k50j78
5065a48J31r4O9J33r0J29j05j34j8L57l07P4K5j29J04n9m5p0n1M72m04K58K30
5088C28k08qN4k00j17K15N5l49L64j88J17J37k15j7k3L5R1l10M35l21M79m81J54
5111B7Q3k48M26m14M06r7J50l27J25k2r4j13J04j80R9o6R8p2L31j06l34K10M7
5134C3J91j20j8P6k07j9M2J77l15K61R9k52J09m3l23N30j95N9j40K30j79j27L86
5157B55P7k26l25L60j81J48j9k06K15K01l59J66j62K34l7q3N6Q6Q6M3m96M55l62
5180g4J2j09M04k96J34k6k89K04J84J2k37k8n0K60l18l0L32j46Q9n1R4j65O5r1
5204a20n9K49J00k10K37j8n25P8K50J39K0k25K08p1k8J04j65lm8L5K21p4m5L2
$$ plain form
5041 33 -124 164 31 -142 -20 60 152 -149 187 -28 -92 234 -28 -50 70 74 3 190 16 68 280 280 30 -148
5065 -148 -17 -111 -42 91 1 130 25 -109 -127 230 -77 -3 22 -107 -3 -62 -107 -177 -228 244 -160 98 328
5088 328 120 112 166 -34 -151 64 119 -230 134 -54 63 200 -15 -32 -55 -20 71 -239 196 -125 354 -127 27
5111 27 110 -138 288 -126 280 183 333 6 131 109 15 -98 6 -174 -75 -141 -43 -115 216 110 -224 -14 33
5134 33 224 104 86 162 -45 -64 -22 155 -160 101 200 -52 57 14 -309 221 26 85 -55 175 -4 -131 255
5157 255 332 106 -219 141 -40 108 89 -117 98 299 -60 106 -56 178 141 58 114 200 286 329 -167 288 -74
5180 -74 -62 -171 233 -63 71 45 -244 -40 144 156 -81 -109 -159 101 -217 -247 85 -61 28 -23 71 -94 -29 -120
5204 -120 -179 70 170 -40 197 179 -346 -268 -18 121 141 -84 124 53 25 129 -36 -39 -87 -52 169 95 50 82
5228H2k86M48o6K7k8k73j08J93K28l02K03j75L69m25oJ6n5K08n9J16l80l87P06
5251D6K6K3l63L67j91K53K8n24M39J25k38K60j58j22M4r4K32o1k98q0Q2K44j49
5274a09K37l27P6N0J17k86J49Q8P6j3k62K08j37K61K93n21K62j33K9j75M7R0M4
5297F4J40J7j24j82j02J25N7J35l19k43L11K42j89K20j43o3pj13l1L35j05k26
5319b01J18Q4l25L47j55K01m4j44M9j19K64j82K75j28q3K84l49O4K11o0L0j49
5341a2k25K63j92K93o9K3j19j44J05ol3m3N49o10R4M04n44K77k0k41L70k23o7
5364a70J45J53k71K87k80J23k12K98j05o6J50l41K99J80l12N0K22L2r4l97N72
5385B63k75P2q2J75j53k00k1J49j64L13l92K31J64l07K25j10j46K05J58o6j48
$$ plain form
5228 82 -204 244 178 205 177 -96 -204 -11 217 -85 118 -57 312 -113 -119 -103 -158 50 -9 107 -273 -660 46
5251 46 72 95 -268 99 -92 161 189 -335 104 229 -9 251 93 -29 15 -79 153 92 -206 -286 -204 40 -109
5274 -109 128 -199 -123 -73 44 -242 -93 -5 71 58 -204 4 -133 128 421 -100 162 29 58 -117 -70 20 64
5297 64 204 221 97 -85 -187 -62 -5 130 -189 -432 -121 121 -68 152 9 -54 -61 -174 -205 130 25 -201
5319 -201 -83 1 -324 23 -132 69 25 -119 -70 -189 75 -107 168 40 -43 241 -108 -44 167 107 137 -12
5341 -12 -237 26 -166 127 58 81 -38 -182 -77 -83 -116 -159 390 -220 -126 278 -266 11 -9 -250 120 -103 -170
5364 -170 -25 128 -143 144 -136 -13 -225 73 -32 -98 52 -289 10 190 -122 -72 150 182 88 -309 263
5385 263 -12 60 -22 153 0 -200 -221 -72 -236 77 -315 -84 80 -227 -2 -112 -258 -53 105 39 -109
5406a09p7M09m0j64j6k44M74n2l29J67q5Q8j24M11m30N5J41l28N06k23k51K2L59
5429A60j27Q1j48J5l5K4k2j42L76k76k61L32q3K85n9j92j36L54m0l60K28k1j14
5452a61J85o2J72O5k93L36k54K11j04p5l88M39J0l06J03K16L12j11n18M87j01
5473A63M7n08N40l87l7R0K58k07n0K41j08l36Q2J67Q3l8L1K05o0l5lk02J00k22
5497a86J0L55k23J19R0m13L21K3l13O34m57K11l59N25n03K79j75j5J50k53j89
5518c69M06p4n5R1j19J12j38M16J5k45J36l33J03J61n3M1R8k86L1j49K60j88K47
5541A08J85n21L60k98K44j31q1R7P0j40j39L59k70M40k25P4k72J21N3K6J29n23
5563c34M85j08MN9k28K30O0k81k09M13j13m8K00j03j85JJ07J79j88J11J24M3j10
$$ plain form
5406 -109 -186 223 183 19 3 -241 233 181 -148 19 -66 22 -102 309 -121 -66 75 -253 253 30 -221 -199 160
5429 160 33 114 -34 -19 -54 -30 -52 -194 182 -94 -355 -23 -106 179 120 -72 -208 146 106 -254 -26 -47 -161
5452 -161 24 -38 134 199 -94 242 -12 199 95 20 -368 71 81 -225 -122 94 406 295 -223 264 163
5473 163 210 -298 242 -145 -182 -92 166 -41 -91 150 42 -294 -212 -45 38 0 31 236 176 141 138 -64 36 -186
5497 -186 -176 179 -44 75 165 -248 73 96 -217 417 -40 171 -188 337 -166 113 -62 -77 73 -180 -369
5518 -369 37 -37 -92 -1 -120 -8 -146 270 285 40 176 -157 -54 107 54 95 193 -93 -62 -211 49 -139 108
5541 108 293 -228 132 -166 78 -53 -134 -37 33 -107 -246 113 -157 283 58 132 -140 -19 34 60 189 -334
5563 -334 151 43 47 106 -122 108 168 -113 -322 91 -22 -70 130 27 -158 -157 -50 129 -59 52 176 219 109
5586A09k06K59p5m43N46M4r1k48R0L41l51j14M8J48n1J54k31m2L6q7M6K3l0o1
5610a86K18l01L33l1K24m87P8J44n8n7K49J79l64k9J25J13l37L30k59J04L5j2
5632A1L2j54J48R0q8j53K26j68k2j10L16l85K63L1k07j33J86m9p1J32J52K57j
5655C03k89P8R8k96k4L69o25K76L5K59j83l2N3j63j6L38k80K48k38O1N3K46l95
5678a24J87j82oK60k11L10j62J81k77J40N5l12L52j55k29J71L19k4k40m4q9M1
5700c9J06M8j39j94J22q8K51J64k18k35M14j91l8K5r8r2J52K46o5J35l55J54j91
5723a26K61l36K34J16l5K7k01R0j49J88Q3J21k94M6p0nl2J2J03J55O7j90j64L1
5747f8J26J28l06n8M17m16J98J25l77L99j82p4j9J95j43O5k6q4j53K12m8p9R8
$$ plain form
5586 109 -97 162 87 -356 190 234 143 -105 -15 326 -25 -139 -91 57 6 160 -71 -113 -77 -164 -118 -95 -125 -186
5610 -186 32 -269 64 33 257 -230 -152 -8 -66 -123 126 305 -59 -88 37 150 -187 143 -116 -12 23 11
5632 11 43 -111 37 127 39 -114 112 -56 -78 -188 128 -257 6 37 -170 -303 -117 -166 -237 -105 47 304 303
5655 303 14 92 190 -106 -130 239 -386 -110 -75 184 1 -31 22 -141 -157 181 -99 149 -89 -28 25 271 -124
5678 -124 63 -119 -125 135 -76 234 72 253 -24 116 171 -141 211 56 -173 -2 317 293 53 9 -80 -39
5700 -39 67 115 -24 -218 -96 -184 67 231 13 -222 192 1 -37 -12 -110 -202 -50 196 131 266 -89 65 -126
5723 -126 135 -201 33 149 114 141 -60 30 -119 69 152 273 -21 25 -45 -50 -82 -70 33 188 255 65 -99 -68
5747 -68 58 186 -120 -178 239 -177 21 146 -231 168 -14 -88 -107 88 -55 10 -16 -100 -253 -41 -89 -168 -70
5770g0M0k18N01k77j64K29j97N4pO7j3O6j85Q0R5m1qk6r7J56J59k64p5kK86J29
5796B18m32J66R9P1N8j36LK07k44J05kj30j13j01J46L60k98l5j6o3R5l4O3K85
5820B72l17N4q0p7J97m4j43R5M93m70l6M0P2M9k59L85l18J2L0K34l32L60k50J25
5844I2nR9m59K36J09n8%J11pK07q3j30n0j60R2J24n9Qj87J36J48j67k58J81N3
5869b7J47q5R1k11Q4m2m37O42j92k6l1J22Nr0K68N2k44j56JO1l8l56N49k3Mj17
5895d9K00l37j3L2J06J54J30m66J87R3J3J02l8K5j24K36l23R7Lk31L3J54j96K83
5919G1J5k28RJ99k11j57K45Q2J45n11M24L2o8j88J19J34Lj38n2M3r0N5M0J66p9
5944F0n2j88Q6K45k02L49k46j94N78l19m4o4M5l66L74R6j47q7k25J93J72r3K84
$$ plain form
5770 -70 -30 -248 253 -24 -188 41 -156 -102 -109 -42 -55 11 -174 -94 1 -40 -48 -74 -171 -15 144 -120 -195 -197 89 218
5796 218 -214 -48 51 122 180 44 47 254 10 115 113 -17 -130 -231 -85 275 -23 -58 -74 -137 -42 -76 -13 272
5820 272 -45 9 -71 -148 49 5 -138 -43 450 -20 -56 -16 56 105 -154 231 -87 -75 -45 189 -143 217 -33 92
5844 92 87 186 -273 -37 72 14 14 125 118 325 242 112 62 -98 -6 118 59 67 -120 16 164 -3 -261 -80 -27
5869 -27 120 35 126 -85 -1 -43 -480 162 -30 -56 -87 35 40 -50 218 270 26 -130 -129 -68 -106 -462 87 64 68 -49
5895 -49 151 -186 -199 -167 -61 93 223 -243 -56 37 50 152 114 139 15 251 -72 25 28 -203 -170 -16 -212 71
5919 71 86 -142 -133 66 -145 -302 -57 25 170 -341 83 115 47 -141 -22 112 115 -23 -75 -32 -122 -67 -27 139 60
5944 60 8 -180 -94 151 -51 298 52 -142 436 117 73 9 54 -312 62 158 11 -76 -301 -108 64 -29 255
5967B55r1j25l50N03j7j4r2j61J09O1O6k56j80L39p0LJ04K5k54K91K2P4k42J46
5991A46k43P6J75k26O3K37l9N2m31J77o6J64k42L38k12j36J66K31k08k46PM39
6013B22j68k95J51K6p6J73j50J46J17m62L60K4k01lL17l00N7K46M3q8k5l16K36
6036C4q0m3L99l74Q5L3P4k13L94k63N4J26k8j04q4p2j09L93j28n0p3k37O4J33
6060f9J4K55m57K57L5J41l0k86K41QK75k09m2K19j32p9n6k07N0M01Pl42L0K0J29
6085A73k28J17J15k97k57J93p0R8J07J98k88K00m6o2K98l83J55J22m13M21m5n1
6107E7k18J36J5j66L68j89K07j98K18l21L6j10J82j00n1J74J57j59k02L4L46j92
6129B4n9R9R6k71j37K00klM9l1j63L10m1p4J00k0m13J55L73Ml09K58l27J75j3
$$ plain form
5967 255 164 39 -311 192 175 161 69 -92 17 78 144 -112 -292 47 -23 -20 84 109 -145 146 168 242 0 146
5991 146 -97 -21 154 -72 -9 228 189 241 -190 -13 -79 85 -157 181 -31 -167 -1 230 22 -224 -217 222
6013 222 54 -241 -90 -64 -140 33 -117 29 146 -316 44 68 -133 -136 181 -119 -62 184 227 139 114 -202 34
6036 34 -46 -89 310 -64 21 54 128 -85 309 46 100 226 198 94 10 -62 -171 222 94 44 -29 -266 -202 -69
6060 -69 -55 200 -257 0 35 176 146 -140 101 109 384 175 133 352 220 141 85 -122 -72 329 336 -6 24 44 173
6085 173 -55 62 177 -120 -377 -184 -254 -156 -49 149 -139 61 15 -47 251 -132 23 145 -268 153 108 57
6107 57 -161 -25 -10 -176 192 3 210 12 230 -91 -55 -165 17 -83 -134 40 197 38 -164 -130 216 24
6129 24 -35 64 160 -111 -248 -48 -50 -53 -4 -35 -198 112 71 -3 97 77 -336 -181 192 196 -113 145 -182 -7 -20
6154b0l6k81J91J7L56l19R6j25O9R4l23K30J74k96K59m03L66o1j55R3J47l13M33
6177A93J23l40M9m68Q10l11n7q7j4K18J06k79j05N1J2K43k78n0Q1r7J63k6J35
6200G2j33L77k47j08q3K19l59R9J56K12k24J00j22j1J06M1j82R8j38N4M03o18
6222b88L73l20L35k50j1l1L89k13J03J0k1k86J3J93K5K87l10J58j46K89n20K18
6244cM7m81L75K21k12J39k14J49J03k65J12Q6J87l66p3J90k6J50j11J70m2m1j71
6267g6n9K90k66R8K10j86n0J92l66J94k2j6q1Q4J8J28m1l01M14O3j52j84K27J24
6291B42j68L1J06l20J87K30k33j9K9j05q8P5k5m9Q3L07m05L7J77j41k69L32J66
6314A80l24o4RL00RmJ42l27p7P7L7j27J0K81l92L21m02L40J15L0Mk41R0K64k38
$$ plain form
6154 -20 -56 -337 -146 -129 227 -92 4 -121 -52 42 -281 -51 123 -173 86 -317 49 -12 -167 -74 73 -240 193
6177 193 316 -24 25 -443 367 56 -1 -88 -102 116 222 -57 -162 -111 -99 144 -134 -184 -103 -200 -37 -63 72
6200 72 -61 316 69 -39 -122 97 -262 -163 -7 205 -19 81 -41 -52 54 95 -87 11 -127 -73 330 -288
6222 -288 85 -235 100 -150 -161 -192 197 -16 87 97 76 -210 -197 -4 21 308 -2 156 10 299 -221 -3
6244 -3 44 -437 -62 159 -53 86 -128 21 124 -141 -29 57 244 -122 -195 -5 -31 119 8 178 136 95 -76
6267 -76 -135 155 -111 -13 197 11 -39 153 -213 -19 -41 -57 -138 -54 -36 92 51 -250 164 227 75 -109 118 242
6291 242 74 105 211 -109 78 308 75 56 85 -20 -108 -33 -58 -107 -24 283 -122 -85 92 -49 -318 14 180
6314 180 -144 -208 -199 101 110 106 248 -79 -156 -79 -42 -169 -159 122 -270 51 -351 -11 104 134 138 -103 -13 251 13
6339A3K6J39q1oj66J65k61L25N1k04L0j4L1J36l47M03j72j52J73R4k99M9Jk1K50
6364A63r8K82l28k99K33k02L04K2N6j88r9K9J35J88k32j97K98J6Q7j08O7K6j42
6387A3N6l77M27m6k42J51J9j54J55J00P2r6J55l53J3L5K95m56J52J87j77pq4J48
6411a4k54M27j81q8L11l54J14L52l78j52M5J40J08J74k12k69L07m23L93Kk26K42
6433F4k56q9M82jl18J15p3P1K58k32l09L64j52P9l7l53K24P5Km5J88j5j08J69
6457A03k85L67l42L70j08J40n85R2P4J30J13j63l08L98J91k68L52m73K09K07j74
6478D0rJ06k44J29J15l6M84o80K44j9j11O0j83q2J76j89P5J8j04J35k0J12j6J48
6502A49l26oN2J7l7K01j72L37n18L06m1j75K56k48L18ql0k15K80k67J45K16l87
$$ plain form
6339 13 39 178 97 91 -75 90 -171 154 205 1 31 17 48 184 -163 240 68 -84 89 183 -116 -67 -66 -87 163
6364 163 65 347 19 -280 -47 -249 55 77 133 -55 -154 -125 10 198 -34 -231 67 83 170 62 129 155 13
6387 13 69 -308 119 73 -169 -18 1 -153 2 102 174 78 233 -120 -107 -72 223 -233 -81 106 -71 -78 -162 -14
6411 -14 -268 159 -22 -110 201 -153 -39 313 -65 -217 -172 -32 76 250 38 -231 76 -347 46 48 -178 64
6433 64 -192 -281 201 200 -118 -3 -76 -5 253 21 -288 76 -76 3 -34 -387 -163 -88 -86 -131 57 42 -66 103
6457 103 -182 185 -157 213 105 245 -340 -248 -174 -44 69 -94 -402 -4 187 -81 271 -202 7 214 40
6478 40 31 137 -107 22 137 101 585 -95 149 130 19 79 -104 -186 -10 -199 -124 -106 -210 -75 -95 17 1 149
6502 149 -177 -183 -131 -114 -151 50 -122 215 -303 3 -38 -213 43 -205 113 105 75 -140 140 -127 18 234 -153
6525a53J13N0m5k56K86mm5J31o1j87O8k01M47q2K2r0j62J69q9Q6MrR7QN6j98q9
6552a34K74l90K85k78K07m1J51k25j58N56k04j96J59L36k90L00j10k49K9P1k01
6573a08K55k1j70K57o14L98J30k86k4J90J7P3k9J93j58q9J7R4j04M2j30P1K58
6596B62k95j16L18l12J27J41k5j81M2O0j29o9J68j59K44J8q9j15J58l0Nl6J39
6619A26m3k95J96R2k0k40M23l24j4l4J27Mk36p7K51M1L14k71k50J93J27m2l57
6642c09N81j95j64k96L91K08n41J11R7L65l79J94o3m5J14p0J61r0o6J80j49l5
6664@m5k9K6kj73M18k46K90j58ML06m05K32j74q4l10L90R2k23k31L96j37K55j65
6688B7K9J65o1K8l94M47l70J24m40O51j62j6k28J79n0K28j92K53O4k42j5J30l41
$$ plain form
6525 -153 -40 10 -35 -291 -5 -9 -54 77 16 -171 -103 -304 143 61 83 -7 -169 0 -89 -3 1 -8 89 97 153 -45 -134
6552 -134 140 -250 35 -243 -36 -77 74 -151 -309 247 43 -153 6 342 52 352 242 -7 22 93 -108
6573 -108 147 126 -44 213 -401 -3 127 -159 -183 7 24 97 68 261 103 14 31 125 21 63 -67 4 262
6596 262 -33 -149 169 -143 -16 125 100 -81 -39 21 -108 -177 -9 -168 76 94 5 -110 48 18 23 -13 126
6619 126 83 -212 -16 76 56 -184 239 -85 -99 -133 -6 -2 -238 -315 -64 -23 291 20 -230 -37 90 48 -309
6642 -309 272 77 -87 -383 8 216 -325 -214 -117 248 -131 63 0 -45 69 -1 160 70 4 184 35 0
6664 0 -45 -74 -48 -50 -223 195 -51 239 81 85 391 -14 218 44 -40 -350 40 132 -91 -322 74 -63 192 27
6688 27 56 221 160 188 -206 241 -129 -5 -445 206 44 28 -200 -21 -71 157 -35 218 282 40 25 155 -186
6711a86J12O7q5J98j92L26k64j7r3n9K04Qj79L24r2Q3r5Jj63J49j63N1O0P1m59
6736c93L96j43J87%k02M3M01m04J39N7j04J38P7r7j85M0j5L1R9o1O1j35o0K08
6760G8k03K86j65J01m6m6Q9p8l3r1P7M%J1J83k61J06n5J19n3j64L85k28J2l7k3
6786c2K37j94J29p2op2j11Lj9j4K38m12L10Q5K75j27j29j53Q2K2k1jmk11oqJ97
6813a4k67O84p22K86M6J81l31J18j16J03j86j04K63lj60J09K50o2J5k59J38J0
6835b1o5J99M1j44R0Jj04O6M8j69j8j81M26k6l67L24j8Lj65J9J09M3j53K44k19
6860c7J04Q8j47lj72K65j38j23K26J39j39p5LJ16M4l3m79O39k28j59J09j2K63
6883B51n50K13J09nK4K3J72j57j01j65J17QM4J24o5j56J37k99O8K20j50P0Q6l9
$$ plain form
6711 -186 -74 -7 -92 106 -86 240 -24 -41 -134 -193 11 19 -160 164 72 155 60 61 -102 47 -116 -65 -5 66 -393
6736 -393 3 -140 47 47 -155 -112 289 -115 24 81 -23 115 192 95 -90 -50 -65 -34 65 4 65 -70 -130 78
6760 78 -125 161 -4 97 51 5 94 16 -17 -108 -31 -27 -27 -16 167 -94 12 -43 76 23 -141 244 16 28 -9 -32
6786 -32 205 11 140 68 62 -10 -121 -118 -137 -151 87 -325 -15 70 345 218 89 -64 18 40 19 18 14 -197 -203 -211 -14
6813 -14 -281 403 -319 -33 13 194 -137 -19 -135 -32 -218 -322 -59 -62 -222 -113 137 75 90 -169 -31 -21
6835 -21 -86 113 154 10 100 101 -3 63 111 -58 -76 -257 169 143 -224 100 82 85 -80 -61 48 91 -62 182 -37
6860 -37 67 155 8 5 -167 98 -40 -163 63 202 63 -12 -9 107 151 118 -361 278 50 -109 0 -12 251
6883 251 -299 -86 23 18 42 65 237 80 -21 -186 -69 -61 -17 107 42 -114 23 -276 -208 12 -138 -68 18 -21
6907b1J51k02J42k00j65J98J21o6J1J59k42R8J16L45m07Q3j38m1K03k44j56L02
6929D7n24N16Mk37J48k14J84j67L89m59M27m14J48R5K51k54opR1k10P4L10k10
6952a8P9j60q9Om9M17l67L45n0k67O8J41p6q5O5p2J60j40p8K10Lp2r9k83L37K75
6978B01l05N5j3K68o5j75km7L07j91l2ml3j04K51mj15J56r5J7k30L80l40K03O8
7003A51mk67J36j45K06j90L32l96K4M79k67j08P6K54k78K77l00J73j95nK04r0
7025F7j74r7M10j75PK86n59J92J6N9n2L88l30PR8j93r0N4l7LJ13L39j58Q2l38
7050h2j87J82k9K79k64O1k08L61Q8r8k92K55r3k01K25J6J34j94j43L44j19k32
7072a97K24n2j79L31k05L45k22p5P2k22J18M7K29l69M81k12L0l04r6K87J59q1
$$ plain form
6907 -21 130 -72 70 -130 -295 -97 24 -42 -31 128 -114 -16 100 445 38 121 -17 -58 145 -99 -255 47
6929 47 -477 39 43 -194 -46 -260 -76 -243 146 -313 114 -300 -152 -57 194 -60 -66 -73 18 -192 -118 192 -18
6952 -18 61 -99 -188 -182 -231 186 -181 164 114 -153 -85 56 -20 -105 -40 -112 48 -92 -170 40 43 -29 -128 -411 -74 201
6978 201 -104 -49 -62 206 141 -34 -36 -83 224 33 1 -3 -36 -140 111 107 -8 148 53 70 -160 220 -120 83 151
7003 151 147 -120 16 -129 77 -113 219 -177 -153 326 59 -49 27 281 3 280 -20 153 -42 -47 157 67
7025 67 -107 -204 206 31 38 324 -235 -43 -27 32 -20 368 38 45 143 -50 -140 -86 -123 -120 -7 332 174 256 -82
7050 -82 -269 -87 -116 163 -101 -40 -248 113 201 103 -189 66 -27 -228 -3 13 147 -47 -190 154 35 -197
7072 -197 27 -25 -204 127 -78 267 45 -30 42 -180 -62 -15 214 -155 326 114 144 -160 -256 31 190 109
7094A09P0r4k04q7K90l64K66k8j38J97p2K89m16K83k75M67p8k98K96j44j0k81
7116b22M7L95j04j24Q2j4j35j46L13Lk70L02J3k57Q9L09j84k69L77j28m3n6L2
7139A0k0k25J32M7J34n8k24L59k20K05k73M27m81LK40J76m24J34m5K8J13K50l83
7162i5K87J9m28J93J04J82j66j48j46L44m38L70j17j02J03n9K53j99k6L49k24
7183E6j34j20J65r7N8J8M4K46j99j9M2k19K31J25k2j80p4j95K80k17L98k85r5
7206a93M7L55Pm64M09j63j73P5J8M34l53l3m5j64M25k71L12j31o9k08K88j4J33
7229B22k32j70K81r6K8K30m88L72j21m3J12J4k02L7pM16l23P4l46M3R9K28l53
7252b25J92k3J83j88l2Q4J29k37J57K97l60J52p6J44l37Q8L01j36M1l64J70L58
$$ plain form
7094 109 179 85 -119 -206 84 -280 -14 -42 -180 17 -55 234 -182 101 -174 293 215 -83 213 69 59 -222
7116 -222 -175 220 116 -8 74 60 -75 -221 92 95 -175 127 140 -117 -28 281 97 -172 205 77 34 -22 10
7139 10 -10 -235 -103 -56 78 20 -204 155 -65 140 -133 294 -187 -184 56 232 -192 -58 -103 -75 38 288 -95
7162 -95 192 211 -217 -24 80 262 96 -52 -198 146 -292 78 -39 -141 -38 -97 156 -43 -69 280 56
7183 56 -78 -198 -33 -130 -72 -54 -10 236 37 18 60 -159 72 197 175 -5 -79 -274 6 -211 187 -98 -193
7206 -193 -146 209 216 -248 161 -2 -175 -100 -82 352 -1 -34 -79 -243 182 -89 223 92 23 -185 103 89 222
7229 222 -10 -180 101 5 33 263 -225 147 26 -17 95 109 -93 -56 -63 353 30 104 -242 -199 -100 128 -225
7252 -225 -33 -56 127 -61 -93 -9 120 -117 40 337 -23 129 53 197 -140 -52 249 113 154 -210 -40 318
7274C18n84K81j81J76j00Q0J00k92J20R3N7m12L10N6L01k38j05j58K13K37J5m84
7296a97M80k34k04J19Q1J50l8J10n0rl00P7j6P9r2j50k9K88J1k00j54K63M20m14
7320ij56K4J59k2r1j06O5K71l2k21j7K01j2J74k6o2r3k5K41o1j66J8qj27N5J84
7346A58m1j66j03J12R6j48R5k31J10O1K31l38J13J24m2Mj07l19J63J39o2j0L03
7369A42k51j4K77j67j43O5N0P7o9j18p2J96J31P1p5l44K11j81J50Q5k5m6o2k6
7393a38K91K4r6k12j58J45J84r5l7R3j23L86l30J69j77J01J18j40J97k06J1K03
7415B10m04K37J04j8k05P6j22K35n13K82J48J02o3j09j76M59j08K6K3k96J71l12
7437b53K68o6J62R9j01k48P3P2l1o3J29r7K16J6pl94M48l36K00k5K9J1k17J87
$$ plain form
7274 318 -266 15 -166 10 -90 -10 90 -202 -82 11 68 -344 -34 22 323 85 -20 -178 35 272 287 -197
7296 -197 283 49 -155 -36 45 195 157 267 217 208 -92 -15 -31 48 -44 -194 -223 65 76 -124 -278 -15 405 -9
7320 -9 -165 -141 18 -4 -95 -201 -136 135 103 -118 -135 66 54 228 202 140 47 22 263 202 36 54 46 -81 -26 158
7346 158 117 -49 -152 -40 56 -92 3 -228 -118 -57 174 -164 -51 73 31 35 -72 -391 -228 -89 -151 -161 142
7369 142 -109 -123 154 -13 -156 -91 -41 36 -33 -151 -223 -27 104 175 100 -244 -33 -214 -64 21 -4 -50 -112 -138
7393 -138 153 177 81 -131 -289 -144 40 -55 -92 1 -122 264 -66 103 -74 27 145 5 202 -4 7 210
7415 210 -194 43 147 129 -76 0 -122 113 -400 -118 30 132 69 -40 -216 243 135 161 184 -112 59 -253
7437 -253 15 -51 111 210 109 -139 -66 6 -25 -88 41 -56 160 176 169 -225 223 -113 87 62 91 102 -115 72
7461G2j01J3Q4J20k67j41J21P1q7k2K16J59j86j51JL9K93j73j55K3J82O5j1j67
7485bl07K84O6k61M3J61k94J54n7P6K85k92J7P2JJ80j92J70J44l41M10l37K51
7508B31l45K18k65J88l1J27j76q0J62k44N22j54R2j75K21k98k5K44J4n83L58j76
7530a75J69K7k5K23k56Q9K55l07K94q6k93k03K71j90j54M70n7K23j37k29j16K54
7552D7k10M13j73p9l1K19j27J78l14L27j79j00P2p9N3k42M31j08k44l2J30K83
7574B35l9k59j4l2M3K23o09L86J29N4M2k73L1K75j65j33J95k35q5M87l15J31k14
7597a42J06L7J05k19J98j11J18k5J10l38K25k42J23q3q7K81j94J75L7m4J44l40
7619a66q2J99J10M5m2J17k80J13J94m1j72j2J04J77k00j91L11j17lm7N2l3J70
$$ plain form
7461 72 -29 -16 68 188 -79 -220 -99 -28 -115 -137 79 238 52 -99 -98 -59 234 61 -94 -71 111 176 165 -2
7485 -2 -309 -25 41 -220 -177 -16 -310 -156 -213 -137 148 -144 -127 -55 -54 126 -66 104 248 -93 317 -20 231
7508 231 -114 104 -161 27 -4 123 -53 -133 29 -215 307 153 245 70 291 -7 -32 212 226 -357 1 -175
7530 -175 -6 21 -4 219 -37 52 307 0 294 208 -85 -288 -17 -207 -361 109 52 275 138 -91 -207 47
7552 47 -163 250 77 -2 -33 186 59 237 -77 250 71 -29 43 -36 17 -225 206 98 -146 -178 -48 235
7574 235 196 -63 -77 -109 -66 157 -452 -66 63 117 159 -114 -83 192 27 -106 89 -146 -231 256 -59 72 -142
7597 -142 -36 1 106 -113 85 -26 92 67 177 -161 64 -178 -55 -138 -225 56 -138 37 74 30 174 -166
7619 -166 -248 -49 61 106 64 181 -99 14 208 167 -5 -17 87 264 64 -127 184 67 64 17 69 36 206
7642B06l04p1L17j44p1M0q8M99k64j52J94k25J42l0J21j86m9J04Q5k04L47j27
7664A40k88L12j75q6K97j44j64N0K79r7j02J43n5k63M98m16K63j83j20n8O9M83
7686C83k74l0j36q9J66J2j11Q7K7k55N05j69m1m13L31PJ03k60L53m26O14m10J07
7709H1K52j9m32j57J29J54N1j88KJ30Q1j62K59j64j41L39k61P2L6j99L94j72j71
7732h6L78l10Ro2P2k08L25j1r2J08O5n04K61J42k71J66K13m37J68Pk43M48K16
7755C54l03l06K86L4K80l51n9n0j9q8J12J26k3J00q6k93K78K71k76K35k82J00
7777D0j04K97P3m90J0OR0L56k66j95Q1J10Qr0pK7l6K89l72N9r5J25L26p8j43r2
7803g1J94k09J40r4N9l1rK17l13N7L02m66J96r0J39lJ38r3j68O0J9n4L77j58m6
$$ plain form
7642 206 -98 -169 148 4 -67 -27 -115 384 120 -32 162 -63 79 49 170 -16 -65 39 124 -80 267 140
7664 140 -148 164 -11 -97 200 56 -108 -58 221 124 22 165 110 -153 345 -71 192 9 -111 -169 -100 383
7686 383 109 79 -57 -146 20 32 -79 8 35 -220 285 116 75 -338 -7 0 103 -157 196 -230 384 -26 81
7709 81 333 314 -118 -275 -146 8 59 -129 -127 3 84 -78 181 17 -124 215 -46 26 62 -137 257 85 -86
7732 -86 292 -18 -9 -71 1 -207 118 107 15 123 188 -316 -55 87 -184 -18 195 -242 -74 -67 -310 138 354
7755 354 51 -255 31 65 345 -6 -65 -115 -134 -222 -110 16 -7 93 7 -286 -8 263 -13 222 -60 40
7777 40 -64 233 306 -184 -174 -168 -78 278 12 -183 -102 8 16 -74 -81 -54 -90 199 -173 -114 -209 -84 242 164 21 -71
7803 -71 123 -86 54 -40 19 -12 -21 196 -117 -60 242 -224 -28 -118 21 18 156 63 -105 -45 -26 -80 297 139 93
7828I3j84K64k26j15K78M2l76K11J0KJ9J34J63l56N3J09k74M10k12K0q3J95l0
7851A47j10l7r6J66L2n8j30L29m7k78L10k35j58J29j03K50N4j60Q8Qn7k50o4J87
7875h3J82j51J27k98M24j39o3J09j32k83M02K20Pn15J74L1k62N60n10J72m7J38
7897F3Q5j86N7ok85J25J33K61o06L04K07k98J93k4j51m2jK93m44K55K4M0k6J26
7921I7k58J19J7Q2J5L1j83J26k24j93M02r7J80k96K04kR3j27J16J35l88n0J10
7944i1j1L0K81k55k75M88m8q0O4N0j51J28l00O2K3N6l8r5J29kj1K19k39k5J88
7969I7k2J05j33j82K24O6r0NR6l64M94k24k26K82j16J46k10J73l45P4K96J2l0
7992A28j59K8J66l66J04J50l6j52K7J69l01L10lJ42m9o4k44J46K06r0k00j17J97
$$ plain form
7828 93 -91 173 -53 -168 110 152 -224 -13 -3 -1 18 152 315 -41 12 121 -153 257 45 65 -18 177 147
7851 147 37 0 -96 70 102 44 -86 243 196 -82 228 -7 -165 -36 -139 111 165 5 93 101 44 -206 -270 -83
7875 -83 99 -52 75 -223 201 62 -1 108 -24 -307 95 315 322 -193 -19 12 -250 310 -200 -28 -75 63
7897 63 148 -38 19 13 -272 -147 -14 247 -359 -55 152 -146 47 23 -128 -170 -171 122 -322 -67 -43 -3 -29 97
7921 97 -161 -42 -25 57 72 103 -80 46 -178 -371 31 -66 114 -182 22 20 113 -14 102 237 -151 -201 -91
7944 -91 -102 -72 209 -46 -321 167 119 39 103 153 2 130 -170 -108 -85 -29 -67 -162 -33 -35 -46 173 -66 -91 97
7969 97 75 180 47 -135 89 155 65 70 166 -198 296 72 -154 128 12 158 -52 121 -224 -150 146 158 128
7992 128 -31 -3 163 -203 -99 51 15 -137 -110 59 -242 68 65 207 158 94 -150 -4 202 112 -88 -205 -8
8015hJ89J39l98q8J34O0j9J26q5j19mJ14j3k1l9J0j30J25J55O6J28j13j93J15
8039A31j65M9L5K1l2J34k05P7J63J91n85L06P8q3k03J90l2J9j82O0J8J80k03J99
8063A61j79J32J90j97J59k46j27l1j50J78m3J79k74K31P9k16J39j15M81o82L55
8084B4j73K57L4k99J66N3N5J76k00M3m4Q3m51N92j31k31K60m32J79J27q5J79q1
8107A01q6R1j43K25j36q6j4l1Q2k74M10J46l27N8k28K48k17K6K24j72J06k6o5
8130h8Q3J50k78N0K78k52K14k21J96Q6k65J03n3m62L30R0N3K71l26J61P5j72j02
8153g9o5R4o8J31L30q9j19k35k50J24K56K40k00k25M14j17k91K64j02P4j62L9
8175c6J52o16L41J80J28j71j0Jj51J18J69lk01L4k0K12
$$ plain form
8015 -8 181 320 -78 -166 -32 28 9 135 50 -69 -73 41 28 7 -32 -22 -152 -27 128 194 322 209 16 131
8039 131 -34 15 50 71 39 173 -32 45 208 399 -186 120 198 115 -88 102 70 89 -93 -33 -15 165 -38 161
8063 161 -18 114 304 107 266 20 -107 -138 -288 -110 -153 26 -248 -17 62 -154 -15 -130 351 -331 24
8084 24 -149 108 142 -157 9 62 117 293 93 136 92 175 -276 316 185 -46 214 -218 -39 88 3 182 101
8107 101 15 106 -37 188 52 -34 -48 -79 3 -271 139 285 -42 16 -212 36 -181 -155 69 -103 3 -23 -88
8130 -88 -5 145 -133 -83 195 -57 157 -64 132 218 -47 56 3 -459 -129 -39 14 285 -41 120 195 23 -79
8153 -79 -144 -50 -118 13 343 254 135 -100 -350 -226 30 270 70 -155 259 142 -149 115 13 87 -75 -36
8175 -36 116 -500 -159 21 149 -22 -32 -31 -182 -64 105 102 -99 -65 -85 127
8191A27
$$ Imaginary data points
##PAGE= N=2
##DATA TABLE= (X++(I..I)), XYDATA
0@%%%%%%%%%%%%%%%Qj6J6j6J6j6J8k6L2l3L7m4M9n7O5p4Q3r1J03j14J28j44J60
38H4j77J94k15K39k65K96l29L63m02M47n00N62o30P13q15R42j106J326j637K124
58A214l001N062j6397k6235K8688K9738J1770k1244k4030k862K2889K0568J063
71B7223j5383p779P404J4577J922j1471j3016k238R007J0760J025q971j0786j272
85A002Q067P819l823j2805p713O589J2952K628j2572j3726J993J5833R952q853
99G343j7135n101J3403J5232r19j4397q191Q733J5860M301j1291j2530J000J3445
113I753J0918j519q607m086M916P559K193n534p762j188O848R753K148p955r786
128G651j940P676O956l521j1396n896O812J2288J114j2539j2393J352J1720P225
$$ plain form
0 0 0 0 0 0 0 0 0 0 0 0 0 0 0 0 0 8 -8 8 -8 8 -8 10 -16 16 -17 20 -24 25 -32 33 -41 42 -49 54 -60 68 -76 84
38 84 -93 101 -114 125 -140 156 -173 190 -212 235 -265 297 -333 380 -435 507 -599 727 -910 1214
58 1214 -1787 3275 -13122 -39357 -10669 19069 30839 9595 -14435 -17297 5592 26160 27223
71 27223 11840 4061 11465 26042 27964 16493 3477 1239 10246 21006 22031 13060 2274 1002
85 1002 9069 16888 13065 260 -7453 -864 12088 14716 2144 -11582 -9589 6244 16196 7343
99 7343 -9792 -14893 -1490 13742 12823 -1574 -9765 -1032 14828 19129 7838 -4692 -3692 9753
113 9753 20671 19152 10545 6459 11375 18934 21127 15593 7831 6643 13491 23244 25392 17437 7651
128 7651 5711 13387 20343 16822 5426 -470 6342 18630 19744 7205 -5188 -3836 7884 15109
142A5109p339j2745k767R844J0135k838j1228p159N881J0918K509p427p747O16
156d238P937O252j102n803l763K188O620L972k671n831k691M913P990K702o249
171A0226q362r43Q296P212k538j0179m756O225J0169J56j0624r041J548J0402
185G791N065n933r796j605P050O537k547q595n070L806P213K414m018n992j058
200d738M184M927L59m626m164R70N399M310n44n810l619L096P371K750n186p147
216b468m1P450O307k631q344l654N476P727M31p872o701K260P820L707m640p586
232b759j305N288M218j078o268l221J522N073K270k461m939j884K395L966J567
247B384l822l903m04M309M877o14o086l592K568O557K546m664n871L31O401N084
$$ plain form
142 15109 7770 -4975 -7742 2102 12237 9399 -1829 -8988 -3107 7811 10320 2893 -4854 -4238
156 -4238 3699 9951 8849 3046 -717 1471 8091 12063 9392 3561 870 5783 13773 16475 10226
171 10226 1864 921 9217 16429 13891 3712 -1044 5181 15350 15506 4882 -4159 -2611 7791
185 7791 12856 6923 -2873 -4478 2572 9109 6562 -2033 -7103 -3297 3916 6330 2312 -3680 -4738
200 -4738 -554 4373 4732 106 -4058 -3088 2311 6621 6077 267 -3352 -256 7115 9865 4679 -2468
216 -2468 -2509 4941 11248 8617 273 -3381 2095 9822 10253 2381 -4320 -2060 5760 9467 4827 -2759
232 -2759 -4064 1224 5442 4364 -1904 -5125 -3603 1470 3740 1279 -3660 -5544 -3149 817 2384
247 2384 -1438 -5341 -5745 -1436 3441 2827 -3259 -6851 -4283 2274 4820 156 -5715 -5384 1017 6101
263F101k904o980k625M833O326o6n636m697K027N663K571l438m926j288M038L642
279B641o71l897k821Q81L312K190j609l626k282J786L928J669k911m310o24M065
295b279M402q65n490l254K969N846J349m170m998O62N215M052k613n702j551M368
311b059M835l47m212l198J691M025J648k291l288p30K703K781L13k423k951K74
327c229K438K762r30l184k235J744L850J515l097m028k31M099L549j230m558k738
343e503L481M218Q93m072l756J109M629K249k370l993p85L256L044k23l144k528
359c495J459K908J587j500k957o97J780K639Q06k104k681m71K709K808p07l200
375a116j885J539L464J123k685l313k6L481K458p79l965j528K322L781J46l394
$$ plain form
263 6101 3197 -3783 -6408 -1575 4751 4685 -951 -5648 -3621 2042 4613 1175 -3751 -5039 -1001 2641
279 2641 1970 -1927 -4748 -3867 -555 1635 26 -3600 -5882 -4096 -168 1501 -1410 -5720 -6344 -2279
295 -2279 2123 1258 -4232 -7486 -4517 1329 2678 -1492 -6490 -5828 -613 3439 826 -4876 -6427 -2059
311 -2059 2776 2429 -1783 -4981 -3290 735 2383 92 -3196 -3926 -1223 1558 1871 -552 -3503 -3229
327 -3229 -791 1971 1041 -2143 -4378 -2634 1216 2731 -366 -4394 -4625 -526 3023 1793 -2765 -5503
343 -5503 -2022 2196 3089 -983 -4739 -3630 999 3248 878 -3115 -3900 -644 2400 2177 -967 -3495
359 -3495 -2036 872 2459 959 -1998 -2695 -915 1724 2530 426 -2255 -2726 -17 2791 2084 -1116
375 -1116 -3001 -1462 2002 3125 440 -2873 -2899 582 3040 2261 -1704 -3232 -910 2871 3017 -377
391c77k930J181L426J281j650k873n34K308K367p1k449j748N04K421J179q90k153
408a008j087J379K504N62j995k219l76K609K087n09l060j453J485L156J006k403
424F78l196O64K861K101j631k996n03K253K315l00k215k167J105K906Q51j439
440A287k627k11J953J540N6k101j266J38J602J200l35j984j098Q25K453N93j678
457C47k391l3K483J983p50k708j535J786K823J91j923k132O81K123J651j538k088
474a030o72J970K067k83k085j278O47J854J096j082j929p76J390J718L02j583
490C26j528K20J632J079j68k182j138R49K003R01k132j699j49K130J446n16k372
507a198j197J709K212J37k150j473O33K049J250j208j754q20J810J570K21j689
$$ plain form
391 -377 -3307 -2126 1300 2581 931 -1942 -2476 -168 2199 2128 -321 -2069 -1565 856 2035 1145 -1008
408 -1008 -2095 -716 1788 2350 355 -1864 -2240 369 2456 1947 -1113 -2566 -1081 2075 3081 678
424 678 -2518 -1854 1007 3108 1477 -1519 -2022 231 2546 2246 31 -2136 -1031 1875 2726 1287
440 1287 -1340 -1551 402 1942 1998 -103 -1369 -1231 371 1571 1236 -748 -1846 -1021 1432 2025 347
457 347 -2044 -2077 406 2389 1639 -1069 -2604 -818 2005 2196 273 -1859 -1178 945 2596 1058 -1030
474 -1030 -1702 268 2335 2052 -33 -1311 -664 1190 2286 1204 -725 -1501 -111 1607 1909 326
490 326 -1202 -982 650 1729 1561 -621 -1759 -810 1193 2094 -38 -1737 -1886 244 1690 1174 -1198
507 -1198 -2395 -686 1526 1663 -487 -1960 -1327 722 1972 764 -990 -1810 0 1570 1791 102
523A02j217K19J606Q89k12j777q00J119J191N52j111j199o12J552J223k94j854
540f23j120J166J676M98j333j831oJ773J453q17k199q57J263K001L76j817j447
557a844N81J242J095p49j565m42Q97J682J05j218j073j09J650J011k1j429r78
574a165O31J723M68j200j407k90J608J374n35j627j111J116J299K98j162j322
590a302p8J653R25o69j580p26J014J475J58j355j077l9J388J027n94j256l32L38
608a030J430K98p73j083k33J283Q07M1j256q52P83J489K99p83j170k65J329J056
626A370l88j317r66J031J483O6j245j096Q0R72J324o83j227m84N09J278M6r73
644b20j122K39P44J053n06j472n5M76J183K45o46j208J92R42R36P2j228r25N79
$$ plain form
523 102 -1115 -896 710 1599 1387 -390 -1190 -71 1120 1672 561 -638 -1250 302 1525 1231 -623
540 -623 -1743 -577 1099 1597 264 -1567 -1573 200 1653 836 -1363 -2220 -957 1044 1420 -397 -1844
557 -1844 -1263 -21 1074 325 -1240 -1682 -785 897 1002 -216 -1289 -1398 252 1263 1242 -187 -1165
574 -1165 -534 1189 1657 457 -950 -1240 368 1742 1207 -420 -1531 -415 884 1182 20 -1302
590 -1302 -1380 273 1198 529 -1051 -1777 -763 712 870 -485 -1562 -1601 -213 814 220 -1036 -1368 -1030
608 -1030 400 698 -75 -1158 -1391 -108 699 740 -516 -1368 -585 904 1203 420 -750 -1015 314 1370
626 1370 982 -335 -1301 -270 1213 1279 34 -1062 -982 -10 1314 631 -596 -1080 -571 707 753 -220
644 -220 -1342 -1103 -359 694 188 -1284 -1339 -863 320 565 -81 -1289 -1097 -155 781 853 -375 -1300 -721
663g21J571M71j058r40j3R93P57L6j433n40O50R98O62j132q50m9P31R12k79q77
683a11l57M36O72J38m88j179K4P36P79j12j164o73Q86Q86K81p14p22j67L73J288
703H12n60p41q93O04J175L24m91r26j26R35Q76j05j123n48L89R39K54m41r71J33
723d84N23J063q2j217k51q9J395J24m82j097R3K98J000j51q81o41L5J341L7j60
743C74q56n87R46P52j95p91p65O02R78K82n62j034p4P82Q51k8p75m41J73J018
763F50K33n78o57l46J039N10r8n48q92O42N32P53r38o00K2N25L23M1n80n99K58
784c08Q99J27n43p19o6O16Q11m76m85o49M48R61p2k66q34j60R25P11m93n59n89
805g21K98P30O43o29m91l90M86J052j97q30p03O81N67K00k79r23L16L47L80O9
$$ plain form
663 -721 850 1321 263 -677 -690 303 1060 1096 -337 -877 -227 771 1433 301 -549 -598 133 1045 766 -111
683 -111 -468 -32 640 778 290 -889 -865 -129 650 538 -626 -1299 -413 473 754 40 -682 -849 -476 812
703 812 252 -489 -1382 -778 397 721 230 -696 -822 113 989 884 -239 -787 -398 541 795 354 -617 -484
723 -484 39 1102 1020 -197 -448 -537 858 982 500 -597 -504 -206 794 643 -238 -879 -844 497 534 374
743 374 -482 -1069 -123 629 434 -357 -1122 -520 458 740 178 -856 -930 -148 703 675 -100 -541 -368 650
763 650 883 305 -352 -698 341 851 753 205 -687 -45 487 1240 302 -298 -276 249 572 613 33 -566 -308
784 -308 591 718 175 -544 -610 6 817 341 -144 -793 -345 616 544 278 -556 -716 209 920 427 -132 -721
805 -721 -423 307 950 321 -170 -560 -74 978 781 -49 -752 -71 496 696 417 -506 -190 157 537 606
825F06r29l40L43O75L54l59m92m22P85K87L30j153j70J09N38Q48p50q32O2L45
845a65O93l4o45k76l5Q45L39l56r12j33M70J078j39o36p91L59O77K95j4j115r2
866e87R20K76k1m26n37K05K02L88J8o47k98M30O44J96r12n00J25R94K47n39m52
887b74k92O15K61J41n68n34K11M52N11m6r70j54L05P02L50q31n93L66O18J73p9
908C64p62k75L68R47p6n74j83k84N91L94l07m00l23L72N88N4n98n10J20O53M23
929E82k67n11l66K21Q10N8n09p57L56M18P75o78m90j5Q9M73J85j83m44k59M07
950a05Q55l65o59l14L19N35J50k31p96L53K67N48p5q28l96O73L14L89m65p89K08
971d12L63N81j80n63j66J35N52K00n73j93j47L17L82N2n96j89K59L86o6l3m99
$$ plain form
825 606 -323 -663 -320 355 709 350 -142 -564 221 508 838 -315 -485 -376 162 1010 260 -572 -510 -165
845 -165 528 494 -151 -427 -462 383 722 366 -546 -679 -209 869 730 94 -697 -338 339 634 620 -495 -587
866 -587 333 609 588 162 -375 -170 32 420 438 -209 -507 -77 567 763 -149 -649 -524 470 717 178 -274
887 -274 -566 49 310 451 -117 -651 -440 12 523 477 -493 -647 -342 360 710 -121 -714 -348 270 443 364
908 364 -398 -673 -305 642 566 -8 -191 -475 116 510 203 -197 -520 -148 440 494 -104 -614 -494 159 582
929 582 315 -196 -562 -341 469 527 18 -739 -383 35 810 132 -358 -373 -284 189 374 191 -253 -512 -105
950 -105 750 385 -274 -588 -269 266 416 185 -611 -258 9 557 482 -346 -742 -69 245 634 169 -620 -412
971 -412 -49 532 352 -211 -377 -242 310 510 -63 -256 -403 -86 296 348 -248 -437 -178 208 142 109 -390
992c90P7L83M88j41n60n02M59N88P6k87o72k05P76M81j77o87k50N17K05O8j44
1013A03m59k88N31K90M25j012k4O9M41K79m31j35j93M21L01J52o29k72k25Q25
1033A69K04o25j49NL40K36J99n50j65Q9M18K97k01n31J11L14L43l64k61m37L18
1054b40O57R9k91m94p1N36K24k33m16r7j62N77K06n41M7k26M10N55L5q48p5j28
1076d76M55N52m03l52j01J03L95K04o94l45K94N50J00j62m24m4L91J59o2k44j79
1097b83J68J93L94l06R0p81O24K7K05l03k71m2O49k54J87m16o0K85K83r4m05k90
1119d00M86p0J81O3o21J8L92L35j64l18k69L08L95J8m52k31j4O7O47n0m85j53
1141c17Q2K52N38m02m32r2L37N59j49j94m12j31N02M75m27k68l37J46P50j03k14
$$ plain form
992 -390 -313 70 558 417 -143 -645 -186 402 478 191 -481 -686 90 571 394 -293 -543 -26 179 247 103
1013 103 -356 -644 -113 177 602 -410 -434 -365 76 355 -76 -211 -404 17 318 470 -159 -431 -656 169
1033 169 373 -252 -401 -396 -56 180 379 -171 -336 -247 171 468 267 -264 -153 161 504 140 -121 -558 -240
1054 -240 417 516 225 -269 -340 196 420 187 -229 -326 -488 89 295 -246 -199 -425 -15 540 575 -273 -348 -476
1076 -476 -21 531 128 -224 -325 -222 173 377 -317 -662 -368 182 282 120 -304 -348 43 202 140 -104 -283
1097 -283 -115 78 472 166 256 -525 99 126 331 28 -243 -285 364 110 297 -119 -179 106 389 295 -110 -400
1119 -400 86 16 197 260 -361 -343 49 384 220 -98 -367 -59 336 354 -98 -329 -343 -276 371 321 -164 -317
1141 -317 -235 17 555 153 -279 -371 -34 525 376 182 -230 -361 141 616 189 -79 -416 -270 480 377 163
1162A63n76J96M67Q1k96l68j52O77K41m14L1m26j74R98P2l39k08k38K05M05j63
1183A82j16m33K12L91J30k25o19j1N61Q0J11m52l00M24k7J45j66j11J16M5L27
1204B64j15L3p02M32K50M3Q7n35o7K01L51J66n65L2R8J87J26k13l50K73j60O04
1226D40l01K38q21O3O32n7n3m93M4K81M91k2m79k13J7M68P7l70J11l83P6N45R
1249C00k22m53n6M46M2j91o4m6N82k23n4N2l80J84J69K47l94K4k36K77L66k09
1271A61j14l74j82O97n0j33l46j46K75M58j0k17l48L3M18P8M4m44j19K93K17J32
1293C23n70j86M25M3J16K08n38L5K58K85j53m78j12J69J59L88j21m31J20J40k13
1314a33M28j21n00J46N53K13l65l12k18L91L30j14l13k75P4L7N30J38m81%j93
$$ plain form
1162 163 -413 -217 250 331 35 -333 -485 192 433 19 50 -376 -550 448 520 181 -27 -265 -60 345 182
1183 182 66 -367 -155 236 366 141 -478 -489 72 152 263 -189 -489 -65 -92 53 -113 -224 -108 -63 264
1204 264 149 182 -520 -88 162 205 292 -243 -310 -109 242 408 -157 -125 -27 160 286 73 -277 -4 -164 440
1226 440 139 377 -444 -381 251 194 141 -352 -308 -27 464 442 -37 -250 -233 235 312 -58 53 -330 -254 291 300
1249 300 78 -375 -431 15 57 -134 -198 -244 338 115 61 113 -267 -83 86 333 -61 -37 -273 4 370 161
1271 161 47 -327 -509 188 138 5 -341 -487 -212 246 236 19 -329 -296 122 200 244 -200 -319 -26 191 323
1293 323 -247 -433 -8 35 151 359 -179 -144 114 399 246 -232 -344 -175 -16 372 251 -180 -60 80 -133
1314 -133 295 174 -326 -180 373 586 221 -91 -309 82 412 298 -15 -290 -216 -179 351 489 8 8 -185
1335a85L41M2p7l88J14n6N16j58m27K43P8J46J19o32J0J70L4N75m00l93K85J43
1357A00j28J08j96O2k46K05M81K1o97J48OO08m11K3J87m02K63L9k16p5l4J18M53
1380D17L4k68m05j53O69q4j18j22l03O07j34R0m37l0R3L59j37L50p09q8L57J36
1402A24J19k47l43N6N48O8j83m36K21J26r3K78m03P8N2K27PQ7n09j06K13M6O9
1425aJ10m1m34K89J95J25n01K59N9J27M19p37l3K08j77N65l19o17L91K39J28o9
1447A85k60P4k69K87K24j26m10L0M09j73M0Ll44J83P4l8K80k88k38L53K49q8J16
1470B73m98L30k04L12j73l54qJ11K56K12p3l78J50M26k58Nr3k16L92k89Q6q9J56
1493G6k39M08j87L8o20K97K61Q5q8J63l77m8M69k50L92l83j62J59J21j26l4k20
$$ plain form
1335 -185 156 198 121 -267 -153 -209 307 149 -278 -35 43 189 308 -324 -314 -144 -110 465 65 -328 -43 100
1357 100 -28 80 -116 -54 -300 -95 386 407 -290 -142 -136 472 61 84 271 -131 132 171 -45 -120 -154 -36 417
1380 417 451 183 -222 -375 294 210 92 -30 -333 274 140 230 -207 -237 -144 215 78 428 -281 -369 -12 124
1402 124 243 -4 -347 -291 257 325 142 -294 -73 53 -40 238 -165 -87 -35 192 199 286 -223 -329 -116 -70 -1
1425 -1 109 68 -366 -77 118 243 -258 1 60 187 606 -131 -164 44 -133 432 113 -504 -113 126 254 185
1447 185 -75 -1 -270 17 241 115 -295 -265 144 -29 11 14 -330 -147 -73 -111 169 -119 -357 -4 245 157 273
1470 273 -225 105 -99 213 40 -314 -322 -211 45 257 184 -194 -44 382 124 129 36 -180 212 -77 9 -80 76
1493 76 -163 245 58 96 -524 -227 34 119 31 194 -183 -231 238 -12 380 -3 -165 -6 115 -11 -45 -265
1515b65K05N5J92k52M3m65L84K02K6o0l75L73Q0j72j56R4J01J14k86K12J69k42
1537b3k51M20L3j87l35L68k33L14J27j52l46J00J68j53J30k3J11q7K4K70m26j92
1559c43M75l71J73J38m73K56L67l22K12r3k46L18j71L44l42j10K0m2N3M39l73
1580i1K06q9j38K98l30M1k65K77K31l2m0k42K17J32J11j03l78l6P4L27J06k23
1602E3R3l83J5M32k02J10j81j29J65K47j82j94J43m2M70m35k42J2J69L71J0k05
1624I5k91P2M3L01J07m98j33J71N10j58k41k25L49K89j2m38j32j77L38J40K10
1645C20n15J46J34J67O4l55j59q2L30K47k27k16O8N5N1J78j2l12L5P6R3l1Oj07
1669d6j03M04j59m48L46j73K30j70K62j9l81m8N41J9k30k03J67k5L2jj4N5oJ31
$$ plain form
1515 -265 -60 -5 187 -65 -22 -487 -103 99 125 65 -310 63 143 -29 -185 -91 10 124 -162 50 219 -23
1537 -23 -274 146 179 -8 -343 25 -208 106 233 81 -265 -165 3 -150 -20 -43 68 -19 5 275 -151 -343
1559 -343 132 -239 -66 72 -401 -145 222 -100 112 19 -227 91 -80 264 -78 -188 -168 -210 -157 282 -91
1580 -91 115 26 -112 186 -144 -103 -368 -91 140 108 68 -174 43 175 286 183 -195 -231 -157 170 276 53
1602 53 146 -237 -222 210 8 118 -63 -192 -27 220 38 -156 -13 -55 415 -20 -262 -250 -81 290 300 95
1624 95 -196 -124 -81 220 327 -171 -304 -133 377 219 -22 -247 102 391 379 -59 -191 -368 -30 110 320
1645 320 -195 -49 85 252 316 -39 -198 -280 50 297 70 -146 -78 -23 28 206 194 -118 -83 -7 86 55 61 -46
1669 -46 -149 255 96 -352 -6 -179 51 -119 143 124 -257 -305 236 255 25 -178 -11 -36 -4 -5 -19 36 30 161
1693A61Ok52k18L93ML03j52o51M16j59L15Q5k19n06M98j65K56j37K29m79M13l50
1715b09L18j44j00J33j2K40l12q0K0j45K9L19j36k73P7K78J79m71j1J10K28Q5
1737A23%k65m9jr7O04k09J62k69P8j0j73K96l06M7P8J56k11L24l02j29J01K98
1760B46k37j13P1nJ78n2Rk47j52K88M5j42k2r4M7K19n2k32L8L70p6J32r5k90J25
1785d1O4J31k41j33J89k65L76J50j00r4k62L49k41M10k48L25k03l32L73j89j98
1806a80J04n7K31o4rM8j50J72j98K71l41k49N14n8K44o35M45l7j71K62k56K4Q4
1829fJ34O8j34l48K15P3J34j29o1l31J66L39r9L82o31M27k72K93j90O8p1J6O4
1852A07J08j46k51J17l04K73L73l76K69n2l01K41M74n30p3n4J16k80K65m5k39
$$ plain form
1693 161 167 -85 -303 90 94 397 245 -406 10 -149 166 251 32 -474 24 -141 115 -22 207 -272 141 -209
1715 -209 109 -35 -135 -2 -14 226 -86 -166 -146 -291 -262 57 -79 -352 -275 3 182 -289 -300 -190 38 123
1737 123 123 -142 -191 -192 -289 315 106 268 -1 77 67 -106 190 -116 -69 9 165 -46 278 -24 -153 -52 246
1760 246 9 -104 -33 -38 140 88 97 -150 -302 -14 31 -111 -133 -227 -180 39 -13 -245 -207 163 87 219 124 -166 -41
1785 -41 23 154 -87 -220 -31 -296 80 230 130 36 -226 123 -118 292 44 369 166 -166 207 18 -180
1806 -180 -76 -133 98 34 25 73 -77 95 -103 168 -173 -422 92 34 278 -357 88 51 -120 142 -114 -90 -6
1829 -6 128 196 62 -286 -71 2 136 7 -54 -385 -219 120 21 403 -228 199 -73 220 30 98 27 43 107
1852 107 215 69 -182 -65 -369 -96 277 -99 170 118 -183 58 532 2 -71 -125 -9 -289 -24 -69 -308
1873c08L31l7J12k74k28N37P0p0o6k34K80Q8J58k71J42l70J21l2O3L6j3l18O7
1896b16M52j31j39J6P2j50Q0J53l00L21k21J92j38M50m14J3M0J84l42l54N03K63
1918C34k41q2J07l43K82o0P5k99J57o8L9l17N34k68j65J00L01J8l29J24m08O37
1940A28J92j57r5k33K62J25j0l36l4k3L48j18k1K55n78N16j78J23p5N9k76J07
1962a9J54j79o1N2m8K58o5j0k81J94J89r5O3j48J12l12K15M2j00j25K20J7J97
1985B70n5n47J51R8R5J10L4j24l3l4K27k11N2m1j58MJ49j08L6j65N13j97J14j9
2009A61k12k8K9R1p2j13N2nl6M59j24l76P2l5J06kk5Q9j01K41J74l84O4J38j51
2034A2K78l23j73J11N01n4k95r6j98l2r1O71j76j99l20L16K86J5j54k58M13k03
$$ plain form
1873 -308 23 -14 98 -176 -404 133 203 133 67 -167 113 201 359 88 230 -140 -19 -51 12 48 35 -283 -216
1896 -216 236 105 -34 -18 54 -96 -16 137 -163 158 -63 129 -9 441 27 40 80 264 -78 -432 71 334
1918 334 93 11 118 -225 57 -3 72 -227 -70 -138 -99 -416 118 -150 -315 -215 86 104 -225 -101 -509 128
1940 128 320 163 68 -165 97 222 212 -124 -158 -181 167 49 28 283 -295 221 43 166 91 150 -126 -19
1962 -19 135 -44 -105 -53 -101 157 92 82 -199 -5 184 89 152 4 116 -196 19 61 -39 -164 56 73 270
1985 270 215 -332 -181 -83 12 122 156 32 -1 -35 192 -19 33 -8 -166 -162 -13 -121 -85 -250 263 66 180 161
2009 161 -51 -79 -50 41 -31 -144 -92 -97 -133 326 202 -174 -102 -137 -31 -33 -58 31 -70 171 345 -39 25 163 12
2034 12 290 -33 -206 -95 406 352 57 -39 -237 -269 -360 311 135 -64 -384 -68 218 233 79 -179 234 31
2056C1nQ3j87k79M96l09K64kj27J7l04K49K41j59k25J76j86J59J96k73q3L41p2
2079D2J37k98N1P5O6k44K11p8o4M6K3j0K8K52j32k64K53Jk16m0J84j07K32m4m35
2104c31M22PKk37R7K54j11j8Ok08j78K83P2O6l76K66k06M2K41j16N1j83N33j73
2128B05l07J98k14m4L67k09l8j39K95pm85M57l0k38j13L97K65o12L8K30p3r5L28
2151A76n1j72K77l5j05Q1j26J23q2o7J14n2j71k9j09M35j43k28j0J16J24K39k31
2174G4j65j49J72O5J45N6j51j15J7K95j05j59j44M43k01j6K8j35J48k20L30P9
2196B92l75J21J40j81J79k30j38J13N5J54k24k9L39j53O3J2j45J01j65q1K53R8
2218A99m09M04l33M66k55O4l05L03j5P9R6l68l08L78N9k28J51k85L68K22m60Q1
$$ plain form
2056 31 26 109 -78 -357 139 -170 94 92 -35 -18 -322 -73 168 9 -216 -40 -226 -67 129 -144 -227 114 42
2079 42 179 -119 -68 7 73 -171 40 -38 -102 -56 -33 -43 -15 237 105 -159 94 95 -121 -161 23 -84 148 104 -331
2104 -331 91 98 100 -137 -40 214 103 85 91 -117 -295 -12 60 126 -250 16 -190 -148 93 -23 28 -155 378 205
2128 205 -102 96 -118 -162 205 -4 -42 -181 114 107 -378 79 49 -189 -302 95 360 -252 -214 16 -57 -152 176
2151 176 125 -47 230 195 90 171 45 168 86 19 133 81 -90 -119 -228 207 64 -164 -174 -58 66 305 74
2174 74 -91 -240 -68 -3 142 198 47 -68 -51 244 139 -20 -164 279 78 62 90 -45 103 -117 213 292
2196 292 -83 38 178 -3 176 -54 -192 -79 -24 130 -94 -123 216 63 126 138 -7 94 -71 -152 101 199
2218 199 -210 194 -139 327 72 136 -169 134 119 198 294 -74 -382 -4 55 -173 -22 -307 61 283 -177 -96
2240i6J16K9l76J61K22j65rk5J26J46k91K38J56n07K91K30k53j90K81J46rm16
2262a95K67L3L8j23K57k28k28K77J13M7k80K8K7J7j54J40l6O3j53K61j11j39j78
2285b57K30j3p6J66k73M00L3k48R6mj43Q4j00K98j41k07J75m7m1J02N2j74o8J03
2309e3j11J90k48J14l8J79m5j10J13R6j42j7Q3j30K72l00jJ75K3Q3l87Q0k6j45
2333c45K35J02j50J68k06J01j97K83o1K23m1J86k46k3Q1k92K57k3j71J81J51j07
2355A06k78M6l19M68q0j55J65l2p7n9K77K64m54K17pJ69j06k96J57k84L50K5k16
2378a19j88L44j85R3j75L70j0k40J7K26k27j27K12m6J04J4l21Q9K40k61L67k26
2400d9n6M9j38L02r7k8k21q4N03m15m0j12M28j73L05l9j79j4L71J32k81k55k8
$$ plain form
2240 -96 20 49 -327 -166 56 -109 -118 -143 -17 129 -162 76 232 -275 16 246 -7 -197 84 230 221 -195
2262 -195 72 105 143 20 277 49 -179 98 211 258 -22 6 33 50 -104 36 0 63 -90 171 60 -79 -257
2285 -257 -27 -40 -116 50 -223 177 210 -38 58 54 -89 -5 -105 193 52 -155 20 -27 -68 34 86 -88 -156 -53
2309 -53 -164 26 -222 -108 -146 33 -12 -122 -9 87 -55 -72 11 -119 153 -147 -148 27 50 133 -254 -174 -200 -345
2333 -345 -110 -8 -158 10 -196 -95 -292 -9 -70 153 112 298 52 29 110 -182 75 52 -119 62 213 106
2355 106 -172 -126 -445 23 -57 -212 -47 -79 -156 -215 62 326 -128 89 82 251 145 -151 6 -278 72 97 -119
2378 -119 -307 37 -148 -55 -230 140 130 -110 -93 133 -94 -221 -9 -55 49 63 -258 -169 71 -190 177 -49
2400 -49 -105 -56 -194 108 11 -17 -238 -322 181 -234 -274 -386 42 -131 174 135 -44 -58 313 445 164 -91 -119
2423a19o8J63p6J10j19R1o5L74k50jjQ1j62p0J6P2n1j19M00l00J2J89n8j62K76
2448A63l2j43j55J58J9m7J96k88Q5J14P4k57J54j34K0L38l63R8K92k74q1K03k0
2471A20k15J44j73j52N8M38m53L88k36j53O7L66k82q5L89K6N6m16J9l9K2j0M6
2494g5J33J72m97L81p0l52J77J63l84l6K19L53m9rp2k2R0j5K7k0k25n5J48J59
2518A41k30R4l1r9km8J45K4j02l6L03j06R8kq6m6j20m7K90k13R7J77K2j47n4k79
2544b57J68j9K69j30j38J92L00k65k54M95k77j12L1k72K51j00J27j01K4K58k26
2565c6j99L9Q0LK50m9J8j94J26l3j10N6j08M76m80M8J93j62O1q0oJ20M0k6O1J0
2591I8J96l78k63J81L95k43p4J95p6j47K80J81m39J70J36l6p7o3l01M61j39j52
$$ plain form
2423 -119 -187 -24 -100 10 -109 -18 -83 291 41 40 39 120 -42 -112 -96 -24 -75 -194 206 -94 -82 107 49 -113 163
2448 163 131 -12 -167 -9 10 -37 159 -129 -44 70 144 -113 41 -93 -73 265 -98 0 292 18 -63 140 120
2471 120 -95 49 -124 -276 -218 220 -233 155 -81 -234 -167 199 -83 -168 221 247 303 -113 -94 -133 -111 -121 -75
2494 -75 58 230 -267 114 44 -308 -131 32 -352 -388 -169 184 135 126 54 32 122 107 134 114 -111 -166 -18 141
2518 141 -89 5 -26 -125 -127 -175 -30 -6 -108 -144 159 53 151 149 63 17 -103 -150 140 -73 24 201 223 76 22 -257
2544 -257 -89 -108 161 31 -107 85 385 120 -134 361 84 -28 3 -269 -18 -118 9 -92 -68 190 -36
2565 -36 -235 -196 -116 -113 137 88 106 -88 38 5 -105 -49 -157 319 -161 -113 80 -82 -21 -101 -107 13 53 27 88 98
2591 98 294 -84 -347 -166 229 -14 -88 107 31 -116 164 345 -94 76 212 176 99 36 -265 196 57 -95
2613i5j72L05j78l6K58l5l14J94o8M8J25j24K74j18l3L31j76l96K13l43M85j05
2635D0j36K48j3j29J16j72L01o80M28j68K86j95j39L87k27M3K0k30Q6J73J29l7
2657A31l84K29p9K30j74j9J73M5l94J67K91n33K56J74j4J42k28j7k38J68R0N8
2679G4j35M4J35k85J64k9J78Kk04j01L59p8j91K46J89k80J72m34R6L9K09L7n8
2702A49j05k7O9L7k42R4K30r5q9k29L46j60L4n5L8Q0l00P0Q7L29l39Q2R4l74K19
2727e7J14P1n9j1l01L39Q4j78p4j74L27J76k96o3K59M6l6k96Q5m5q6J4K59l47
2751b49J85j15l6J37o9M7j86K90p0J91q8j1J7L4J5k89L76o32P02k80o6K01j25
2774b1J10k45J20R3j88k01J04l4J23M0K1o6R5j72K25L4j27K44j31k5j92o5L45
$$ plain form
2613 -95 -267 38 -140 -176 82 47 -267 -73 -141 -93 32 -92 182 64 31 362 186 -210 3 -340 145 40
2635 40 -96 152 139 10 126 -46 255 -425 3 -165 121 -74 -213 174 -53 -10 10 -220 -134 39 168 131
2657 131 -253 -24 -103 127 -47 -66 107 152 -242 -75 216 -317 -61 113 99 241 13 -4 -242 -74 16 74
2679 74 -61 -17 118 -167 -3 -32 146 148 -56 -157 202 124 -67 179 368 88 260 -174 -78 -39 170 207 149
2702 149 44 17 86 123 -119 -25 205 110 21 -208 138 -22 12 -43 -5 75 -225 -155 -68 261 -78 4 98 -276 -57
2727 -57 57 128 69 58 -243 96 180 2 -72 -246 81 257 -39 -102 157 203 167 -129 -44 -89 -175 -161 98 -249
2751 -249 -64 -179 -215 -78 -147 -100 -286 4 -66 125 37 26 43 77 92 -197 179 -453 249 -31 -97 104 -21
2774 -21 89 -156 -36 57 -131 -332 -228 -262 -139 -99 -78 -144 -49 -221 4 38 -89 155 24 -1 -193 -258 87
2797H7k34K29m4k36K91k80J84j76L27r8j11J14k6m0k8K21l05J16k5J84J52k39
2819F3k01K61k9J97l26J29p9O4ok3j82L61j12M1l46L23o2J46k10j22P5R3j81O1
2843f5M5j28N3O8k62M54l50J03k98K25L70k82J28k16J56L3N6L4J44K0l80j29M2
2866a79Qj5J71l38N51k29j2k50L23J11m29K37J27K3o0j02L00j22J12l33j79K07
2888g8k67M54r2n6Ok8R1kj66J44k53N95p3l41J54J15j37K86k83rk05L07o1m4j50
2913i3L32o9J0p0Pj00J86j58kj74j18J64Q1M5J30q0k46J87k76K34J76j62p7o8
2937a41K37j37N1NKk7j31K58q3O5n4k34K37j48K39j07K6l5k1j0o9J53n7L7O7j08
2963A5j15N0j6k19L16k00K13j7m0P2k52K41J71j30M1j9K82o42J60J78m71M81Q9
$$ plain form
2797 87 -147 82 38 -198 93 -187 -3 -179 148 50 -61 53 27 -13 -41 180 -125 -9 -34 150 302 63
2819 63 -138 123 94 291 -35 94 15 79 73 50 -132 229 117 158 -188 135 73 219 9 -113 -38 55 -126 -65
2843 -65 -20 -148 -95 -27 -289 165 -185 -82 -380 -155 215 -67 61 -155 1 34 90 124 268 288 -92 -221 -179
2866 -179 -171 -186 -15 -353 198 -31 -43 -293 30 141 -288 -51 76 99 39 -63 237 115 227 -106 -285 -78
2888 -78 -345 109 17 -39 -33 -61 30 28 -138 6 -247 348 275 -66 88 203 66 352 69 60 -145 162 101 57 -93
2913 -93 239 170 180 110 117 17 203 45 43 -131 -249 -85 -4 41 171 91 -155 32 -244 -10 166 4 -73 -141
2937 -141 96 -41 10 15 17 -10 -141 117 34 99 45 -189 48 -100 139 32 58 23 2 -8 -77 76 19 56 123 15
2963 15 -100 -50 -66 -285 31 -169 44 27 -13 59 -193 48 219 89 130 111 393 -249 -89 89 -382 99 188
2986A88j60l16J57j1K26p4j2n3n8R3p7Q4N2J13k64K92n7J15m37lK91o6j13q1J33
3011c8K30q3j62n6J40j53J17n8l13L38j89k0K65J19J45l27l5K14l4j08%k2k08
3034b38P3n9K31qK27k0M2l90K10j82J64j96J17q7N1j83R2M4K94q6j58o4L54m36
3058b08J83o4q3K48q2j45J31R6k2PJ08j11j00J63l39n1L45o2J76j34o2j8L5l00
3082b89J62J52j87j35N13k00P7j9o4K17k11M22n91L8J6k2K33j93J45J56j46L3
3104A07r9j43J64k6j55M25k27n8J1J40j64J87j61J14K4n0k73K90k27K8J77j61
3126g7J90l89K71m59L63n2j27M60j52J69k96j5P8R8j44J49p4k5p3J35P6j38j6
3149d8j1L14l52K24j34j50J43j32J57j55P6m4L42k92L03j99l33L02k77L9Rn4K01
$$ plain form
2986 188 28 -288 -131 -142 84 10 -2 -55 -113 -20 -97 -13 39 152 -112 180 123 238 -199 -202 89 23 -90 -171 -38
3011 -38 192 109 -53 -109 31 -122 -5 -63 -376 -38 -227 -247 18 137 282 -45 -80 134 100 -8 -8 -30 -238
3034 -238 -165 -224 7 -1 226 206 248 -142 68 -114 50 -146 -29 -116 -65 -248 -156 -112 182 96 -62 -126 228 -208
3058 -208 -25 -89 -172 76 -6 -151 -20 76 54 61 169 58 -42 121 -218 -269 76 14 190 56 -6 -24 11 -289
3082 -289 -127 25 -162 -297 216 16 93 74 10 227 16 438 -153 -115 -99 -121 112 -81 64 220 74 107
3104 107 8 -135 29 3 -152 273 46 -12 -1 139 -25 162 1 115 139 89 -184 106 -121 -93 84 -77
3126 -77 113 -276 -5 -464 -101 -153 -280 180 28 197 -99 -114 -36 62 -82 67 -7 -32 -105 30 106 -32 -48
3149 -48 -59 255 -97 127 -7 -157 -14 -146 11 -144 -68 -112 230 -62 241 42 -291 11 -266 -227 -218 -272 -71
3172g1Q6l0J4J61j49P5l9R0k70Q7J04j26L52k07p3L3l2k33J26J19pk47O1L32j37
3197A9n7j55K42R0k63J85m4k49K06r8pJ3j79L17j36P6J73k62Q4K9k7J74j99O6
3221bK33l67N1oj80O3M16l06R5M5K19l44L68k36j44q4K33k51P3K53j74K58q4j92
3245f3Q8j55K89j70K42m2r2m21M89m85M65j41J18k01j59L92k84K40R2k35j01M64
3267C30k43J63k67J9j03J4P7J17r6J87P8l6k67m5N8o9L87k83k07j23K70o4o3M13
3291B47l41K76o3j38r6K29m48L57j4o5j44M54m24k4N53l65k09K30k05J54P7m41
3313d00M56J1p3k26N38k91r0J68q8Q0n3J90j08j40K6r1K75j61o0j98L5J05N2Q7
3337D4l09J68K05J05k11j51M0K80l03L03l15M22k27M1k54Q4jl9J85J31l39m0L31
$$ plain form
3172 -71 15 -15 -1 160 11 86 47 137 -133 -46 58 -68 284 77 4 37 5 -228 -102 17 10 -237 -176 156 19
3197 19 -38 -193 49 139 -124 61 17 -232 -26 -124 -131 -118 -297 20 -116 -40 133 -129 -45 -16 -43 131 -68 -2
3221 -2 231 -136 -85 -91 -271 -208 208 -98 -3 42 261 -83 285 49 -95 -179 54 -197 -124 129 -45 213 129 -63
3245 -63 25 -130 159 -11 231 189 97 -324 165 -320 145 4 122 -79 -238 154 -130 110 202 -33 -134 330
3267 330 87 250 -17 2 -101 -87 -10 107 11 198 276 240 -27 -72 -14 -83 304 21 -186 -309 -39 -103 -166 247
3291 247 -94 182 119 -19 -115 114 -334 23 9 -56 -200 254 -170 -194 359 -6 -215 15 -190 -36 41 -400
3313 -400 56 67 -6 -232 306 15 -75 93 5 85 32 222 114 -26 0 -91 184 23 -37 -235 -200 -95 -43 44
3337 44 -265 -97 108 213 2 -149 -109 171 -132 171 -144 278 51 92 -162 -78 -79 -118 67 198 -141 -181 150
3360A50k02l3l3r1q0M66j44L38j71j47j43K06j62O1j13J32j43K19r6K95k24j45
3382f0l3J04j53J39K3k3k28K65J99l59k7j10L81l96J34k6L96k30K59j99rj57J57
3405D7l05L11k64J70M8K30k96P5r7m1K45Qk27k8J31N4K21L9m94K91r1m20K33L40
3429A80n04M56k56L50k20j50k1K39k28Q1j58J10m1K47k2J02k58O7j34J64K35k56
3451a7q7M36k99K88j91m60M60m1m9p2O4kj71J26J27p6k3n4L58k92Q3J14p6k75
3475a29k46M11q9R2j0k31J26J49k39M9L6J23R6k23N5j2K16p9k26L91l50q2L42
3498A70l34K13m4j20P2m74P35k93K24J09l85M53n56L84j51j0j39J45j92K28J77
3519B12k12M5K89k16K2l88N9N2l4K07j75K11l97O12l73Q8j19R9L34m78j60J82
$$ plain form
3360 150 -52 -85 -118 -209 -289 177 33 371 200 53 -90 116 -46 15 -98 34 -109 110 14 309 85 -60
3382 -60 -93 11 -142 -3 20 -3 -231 34 233 -126 -153 -263 118 -278 -144 -170 226 -4 255 56 47 -110 47
3405 47 -258 53 -211 -41 7 237 -59 16 -81 -122 123 131 -96 -124 7 61 282 321 -173 118 27 -393 -160 180
3429 180 -324 132 -124 226 6 -144 -165 74 -154 -73 -231 -121 -162 85 63 165 -93 -26 -160 4 239 -17
3451 -17 -104 332 33 321 130 -330 130 89 40 -32 32 30 -141 -15 112 36 13 -41 317 25 108 222 146 -129
3475 -129 -375 36 -53 39 29 -202 -76 73 -166 -117 -81 42 138 -85 -30 -42 174 95 -131 260 -90 -172 170
3498 170 -164 49 5 -115 -43 -517 218 -75 149 258 -127 326 -230 154 3 -7 -146 -1 -193 35 212
3519 212 0 45 334 118 140 -248 -189 -137 -171 36 -139 72 -325 287 -86 2 -117 -18 316 -162 -322 -140
3541a40j66M94J2q8j91j69J44M5J02J46k24J75k00j4J97k66L36j16l9j51K27j21
3563gj63K10K03j59J39l66M37k10k02K53l90L15n09P04l9k41j19K19k43R9nJ43
3585F9J32k55J52k4O1k26J2j50L31p8J5k79N96l58M40l81rj35J74r2L6J4l36L67
3609G6K34l47k15O5L11k54l8J72p8R3m10M58n8n2j03L35l87Q7K93k1j65l8j81
3632b23K67J83m01L79k45o4J20J20k62N0j5K07l76L45L4n8k5j12k10M33k11j05
3654a69K06j85RK10k43O4o3L07j74K01k5j77O9J77l47M3K51k52Q1L05n05P5L07
3677A65k83j7J20J29j18J53m36K7L47P5j25l3n8J8L98m12L49k03k16K80j59j93
3699a92L21j90o9J61J60k00j02J42j58J46q7l4NJ82r9J49k90K28j6j9m8J73k69
$$ plain form
3541 -140 -306 188 200 112 -79 -248 -104 -59 43 189 -35 140 -60 -74 123 -143 193 77 38 -113 114 -7
3563 -7 -170 40 243 84 223 -143 294 84 -118 135 -255 60 -449 255 216 -25 -144 75 -168 -69 -74 69
3585 69 201 -54 98 74 135 -91 -79 -229 102 24 39 -240 356 -2 438 57 48 -87 87 -5 31 45 -291 76
3609 76 310 -37 -252 -187 124 -130 -168 4 -74 19 -391 67 9 -43 -146 189 -198 -111 182 161 -4 -42 -223
3632 -223 44 227 -174 205 -40 -104 16 136 -126 -76 -91 116 -260 85 119 61 36 -76 -286 147 -64 -169
3654 -169 37 -148 -139 71 -172 -108 -171 136 -38 163 138 -39 30 207 -140 -97 154 -98 -17 288 -217 -142 165
3677 165 -118 -135 -15 114 -4 149 -287 -260 87 162 37 4 -54 -36 362 -50 299 96 -120 160 1 -192
3699 -192 129 -61 -130 31 191 -9 -111 31 -127 19 -68 -102 -97 85 -14 135 -155 73 57 38 -10 163 -106
3722a06J12J92j14p3m9o3M34l16j53r4M46k80j14Q1k3K44Q0k14K39l97K8J97j69
3745a12J48k79J33J97j77K37%k5r8M6j78J97J43j92k04J43R3l5l3J41j38q6j77
3768b56M13l02J57J56j50K32l06o4J84mm3J40q5N4o6q9j72K72J32n1j25j08L85
3791C04m34R2L48o23M86J68p6k11L54o67J11J17K4j62K78k38K12j54j4k14K76
3812b3k63J93K12k14R6K6j60K19j25N6Mo7R7j85J88qj70o0J75Rj47M10k20l3M6
3837E6K4p2J28k76k0L11j76k7M3K13j42j39J07p6R8j05K15m12L13O9k53M5K22
3860A46j8J75l59K01p4k68J62j77K57m3K07q9j75J23k44J59k1L7J62r3n6j56J6
3883a28j2L77l83J73J77j66Q4l54J82K21l59J84Q4j25J10J30p5k28j96N51j00
$$ plain form
3722 -106 6 198 84 11 -38 -101 333 17 -136 -230 216 -64 -178 -97 -120 124 204 -10 229 -168 -140 57 -112
3745 -112 36 -243 -110 87 -90 147 147 122 24 70 -108 89 232 40 -164 -21 72 37 4 145 7 -79 -256
3768 -256 157 -145 12 168 18 250 -56 -120 64 60 17 157 72 126 60 -29 -201 71 203 152 27 -81 304
3791 304 -130 -38 310 -313 173 341 265 54 408 -259 -148 -31 -7 -169 109 -129 83 -71 -85 -299 -23
3812 -23 -286 -93 119 -95 1 27 -133 86 -39 17 21 -46 51 -134 54 46 -124 -184 -9 0 -147 263 43 10 56
3837 56 80 8 136 -140 -160 151 -25 -52 -9 204 62 -77 30 -46 52 -53 162 -250 63 132 -121 -76 146
3860 146 128 303 -56 145 71 -197 -35 -212 45 2 209 120 -55 68 -176 -17 -38 -1 161 68 12 -144 -128
3883 -128 -140 237 -146 27 204 38 122 -232 -50 171 -188 -4 80 -45 65 195 120 -108 -304 247 147
3904A47J6Kj23k28N5K55j14N0Q3l77K84M31l59j41J54m4k44J27J07l9j31k58N72
3927B25q3k34o5P0j13Q5N8j44P0J09K74r4j89j77R5j77O37m59K84k20j20J42j36
3950a62P5O4K01o24P02n18J30K22j8N2j7j15k84L36k63M53Q9n17K7K49r5K23j83
3973B7j25K38l09j1K3r8K1K86p4J28j24J42K20m00q3K3K58j89k07M38k26J25K60
3996C43l39m0L51k37k39j95o9O99Kr6k71kJ70j70Q0L3l39L33J47j64m2K9j05M3
4020g8k69J52M24l13J36k83J35J70N9p5p8L6Q5K6l2ql03M61k22R2j24L5k0k03
4044a97R5j40P7J63J14k74R4L11j50k47K46l93K08L2p9L07P8k08j94K12PJ72r0
4067A44k01j05r1K65k37L19K7k46mK75k28L5J9R2l5r5j17K44j45J89n1k13O1p8
$$ plain form
3904 147 163 165 42 -186 -131 124 10 60 143 -234 50 481 122 -19 135 91 -153 -26 81 42 -89 -347 225
3927 225 142 -92 -157 -87 -200 -115 -57 -201 -131 -22 252 158 -31 -208 -113 -290 347 -112 172 -48 -168 -26 -162
3950 -162 -87 -23 178 -446 256 -262 -132 90 72 124 107 -8 -292 44 -219 234 323 -194 -167 82 -13 210 27
3973 27 -98 140 -169 -180 -157 -255 -234 52 -22 106 -18 124 344 -56 -139 -116 142 -47 -254 184 -42 83 343
3996 343 4 -36 315 78 -161 -356 -425 274 276 180 -91 -93 77 -93 -13 20 -319 14 161 -3 -45 -16 -121 -78
4020 -78 -347 -195 229 -84 52 -231 -96 74 133 58 -20 16 101 127 95 87 -216 245 23 115 -9 26 6 -197
4044 -197 -102 -242 -165 -2 112 -162 -68 243 93 -154 92 -301 -93 -61 -140 167 245 37 -157 55 62 234 144
4067 144 -57 -162 -253 12 -225 94 121 -125 -129 146 -82 -47 -28 64 29 -66 -183 61 -84 105 54 -159 -98 -176
$$ [...]
8191a01
##END NTUPLES=NMR FID
##END=
