##TITLE=1H_K-1314
 CDCl3, 8 sc, 
 31.05.2021
##JCAMPDX= 6.0         $$ Bruker NMR JCAMP-DX V2.0
##DATA TYPE= NMR FID
##DATA CLASS= NTUPLES
##ORIGIN= UXNMR, Bruker Analytische Messtechnik GmbH
##OWNER= root
$$ XWIN-NMR		Version 3.5
$$ Mon May 31 12:06:41 2021 Russian Standard Time (UT+4h)  she@DPX200
##.OBSERVE FREQUENCY= 200.131506
##.OBSERVE NUCLEUS= ^1H
##.DELAY= (6, 6)
##.ACQUISITION MODE= SIMULTANEOUS
##.ACQUISITION SCHEME= undefined
##.AVERAGES= 8
##.DIGITISER RES= 18
##SPECTROMETER/DATA SYSTEM= spect
##.PULSE SEQUENCE= zg30
##.SOLVENT NAME= CDCl3
##.SHIFT REFERENCE= (INTERNAL, CDCl3, 0, 15.7039)
##AUDIT TRAIL= $$ (NUMBER, WHEN, WHO, WHERE, WHAT)
$$ ##TITLE= Audit trail, XWIN-NMR		Version 3.5
$$ ##JCAMPDX= 5.01
$$ ##ORIGIN= Bruker BioSpin GmbH
$$ ##OWNER= she
$$ F:/spectra/data/she/nmr/H-F/1/audita.txt
$$ ##AUDIT TRAIL=  $$ (NUMBER, WHEN, WHO, WHERE, WHAT)
(   1,<2021-05-31 12:04:12.14 +0400>,<she>,<DPX200>,
      <created by zg, POWCHK disabled, PULCHK disabled
       configuration hash MD5:
       00 E9 B6 7A A2 85 ED C7 34 08 36 98 17 FE 4E 26
       data hash MD5: 16K
       B7 89 C5 AF C9 F3 7C DE D7 31 88 9C B4 7E 12 8C>)
$$ ##END=
$$ 
$$ hash MD5
$$ E3 D9 3F 26 5C 97 65 A2 B6 E2 9B 0F F4 F3 3C 2D
##$RELAX= 
##$RELAX= 
##$RELAX= 
##$RELAX= 
##$RELAX= 
##$RELAX= 
$$ Bruker specific parameters
$$ --------------------------
##$DU= <F:/spectra>
##$EXPNO= 1
##$NAME= <H-F>
##$PROCNO= 1
##$TYPE= <nmr>
##$USER= <she>
##$AMP= (0..31)
100 100 100 100 100 100 100 100 100 100 100 100 100 100 100 100 100 100 
100 100 100 100 100 100 100 100 100 100 100 100 100 100 
##$AQSEQ= 0
##$AQ_mod= 1
##$AUNM= <au_zg>
##$AUTOPOS= <>
##$BF1= 200.13
##$BF2= 200.13
##$BF3= 200.13
##$BF4= 200.13
##$BF5= 200.13
##$BF6= 200.13
##$BF7= 200.13
##$BF8= 200.13
##$BYTORDA= 1
##$CFDGTYP= 0
##$CFRGTYP= 5
##$CHEMSTR= <none>
##$CNST= (0..31)
1 1 145 1 1 1 1 1 1 1 1 1 1 1 1 1 1 1 1 1 1 1 1 1 1 1 1 1 1 1 1 1 
##$CPDPRG= <>
##$CPDPRG1= <>
##$CPDPRG2= <>
##$CPDPRG3= <>
##$CPDPRG4= <mlev>
##$CPDPRG5= <mlev>
##$CPDPRG6= <mlev>
##$CPDPRG7= <mlev>
##$CPDPRG8= <mlev>
##$CPDPRGB= <>
##$CPDPRGT= <>
##$D= (0..31)
0 1.2 0 0 0 0 0 0 0 0.06 0 0.03 0 0 0 0 0.0002 0 0 0 0 0 0 0 0 0 0 0 0 
0 0 0 
##$DATE= 1622448251
##$DBL= (0..7)
120 120 120 120 120 120 120 120 
##$DBP= (0..7)
150 150 150 150 150 150 150 150 
##$DBP07= 0
##$DBPNAM0= <>
##$DBPNAM1= <>
##$DBPNAM2= <>
##$DBPNAM3= <>
##$DBPNAM4= <>
##$DBPNAM5= <>
##$DBPNAM6= <>
##$DBPNAM7= <>
##$DBPOAL= (0..7)
0.5 0.5 0.5 0.5 0.5 0.5 0.5 0.5 
##$DBPOFFS= (0..7)
0 0 0 0 0 0 0 0 
##$DE= 6
##$DECBNUC= <off>
##$DECIM= 32
##$DECNUC= <off>
##$DECSTAT= 4
##$DIGMOD= 1
##$DIGTYP= 9
##$DL= (0..7)
0 120 120 120 120 120 120 120 
##$DP= (0..7)
150 150 150 150 150 150 150 150 
##$DP07= 0
##$DPNAME0= <>
##$DPNAME1= <>
##$DPNAME2= <>
##$DPNAME3= <>
##$DPNAME4= <>
##$DPNAME5= <>
##$DPNAME6= <>
##$DPNAME7= <>
##$DPOAL= (0..7)
0.5 0.5 0.5 0.5 0.5 0.5 0.5 0.5 
##$DPOFFS= (0..7)
0 0 0 0 0 0 0 0 
##$DQDMODE= 0
##$DR= 18
##$DS= 0
##$DSLIST= <SSSSSSSSSSSSSSS>
$$ [...]
##$SUBNAM2= <"">
##$SUBNAM3= <"">
##$SUBNAM4= <"">
##$SUBNAM5= <"">
##$SUBNAM6= <"">
##$SUBNAM7= <"">
##$SUBNAM8= <"">
##$SUBNAM9= <"">
##$SW= 16.9725357007746
##$SWIBOX= (0..15)
0 0 2 0 0 0 0 0 0 0 0 0 0 0 0 0 
##$SW_h= 3396.73913043478
##$TD= 16384
##$TD0= 1
##$TE= 0
##$TE2= 300
##$TE3= 300
##$TEG= 300
##$TL= (0..7)
0 120 120 120 120 120 120 120 
##$TP= (0..7)
150 150 150 150 150 150 150 150 
##$TP07= 0
##$TPNAME0= <>
##$TPNAME1= <>
##$TPNAME2= <>
##$TPNAME3= <>
##$TPNAME4= <>
##$TPNAME5= <>
##$TPNAME6= <>
##$TPNAME7= <>
##$TPOAL= (0..7)
0.5 0.5 0.5 0.5 0.5 0.5 0.5 0.5 
##$TPOFFS= (0..7)
0 0 0 0 0 0 0 0 
##$TUNHIN= 0
##$TUNHOUT= 0
##$TUNXOUT= 0
##$USERA1= <user>
##$USERA2= <user>
##$USERA3= <user>
##$USERA4= <user>
##$USERA5= <user>
##$V9= 5
##$VALIST= <valist>
##$VCLIST= <CCCCCCCCCCCCCCC>
##$VD= 0
##$VDLIST= <DDDDDDDDDDDDDDD>
##$VPLIST= <PPPPPPPPPPPPPPP>
##$VTLIST= <TTTTTTTTTTTTTTT>
##$WBST= 1024
##$WBSW= 4
##$XGAIN= (0..3)
0 0 0 0 
##$XL= 0
##$YL= 0
##$YMAX_a= 370409
##$YMIN_a= -513945
##$ZGOPTNS= <>
##$ZL1= 120
##$ZL2= 120
##$ZL3= 120
##$ZL4= 120
##$ABSF1= 10
##$ABSF2= 0
##$ABSG= 5
##$ABSL= 3
##$ALPHA= 0
##$AQORDER= 0
##$ASSFAC= 0
##$ASSFACI= 0
##$ASSFACX= 0
##$ASSWID= 0
##$AUNMP= <proc_1d>
##$AZFE= 0.1
##$AZFW= 0.1
##$BCFW= 1
##$BC_mod= 2
##$BYTORDP= 1
##$COROFFS= 0
##$CY= 11.3945322036743
##$DATMOD= 1
##$DC= 2
##$DFILT= <>
##$DTYPP= 0
##$F1P= 15.9154993809931
##$F2P= -4.1035820241983
##$FCOR= 0.5
##$FTSIZE= 0
##$FT_mod= 4
##$GAMMA= 1
##$GB= 0.15
##$INTBC= 1
##$INTSCL= 1
##$ISEN= 128
##$LB= 0.24
##$LEV0= 0
##$LPBIN= 0
##$MAXI= 10000
##$MC2= 0
##$MEAN= 0
##$ME_mod= 0
##$MI= 1.114404
##$NCOEF= 0
##$NC_proc= 0
##$NLEV= 6
##$NOISF1= 3.799351
##$NOISF2= 2.8
##$NSP= 1
##$NTH_PI= 0
##$NZP= 0
##$OFFSET= 15.70392
##$PC= 1
##$PHC0= -11117.66
##$PHC1= 7.800992
##$PH_mod= 1
##$PKNL= yes
##$PPARMOD= 0
##$PSCAL= 0
##$PSIGN= 0
##$REVERSE= no
##$SF= 200.130013532006
##$SI= 16384
##$SIGF1= 3
##$SIGF2= 2
##$SINO= 400
##$SIOLD= 16384
##$SREGLST= <1H.CDCl3>
##$SSB= 0
##$STSI= 0
##$STSR= 0
##$SW_p= 3612.71676300578
##$SYMM= 0
##$S_DEV= 0
##$TDeff= 0
##$TDoff= 0
##$TI= <>
##$TILT= no
##$TM1= 0
##$TM2= 0
##$TOPLEV= 0
##$USERP1= <user>
##$USERP2= <user>
##$USERP3= <user>
##$USERP4= <user>
##$USERP5= <user>
##$WDW= 1
##$XDIM= 8192
##$YMAX_p= 0
##$YMIN_p= 0
$$ End of Bruker specific parameters
$$ ---------------------------------
##NTUPLES= NMR FID
##VAR_NAME=  TIME,          FID/REAL,        FID/IMAG
##SYMBOL=    X,             R,               I
##VAR_TYPE=  INDEPENDENT,   DEPENDENT,       DEPENDENT
##VAR_FORM=  AFFN,          ASDF,            ASDF
##VAR_DIM=   8192,          8192,            8192
##UNITS=     SECONDS,       ARBITRARY UNITS, ARBITRARY UNITS
##FACTOR=    0.0002944,     1,               1
##FIRST=     0,             0,               0
##LAST=      2.4114304,     0,               0
##MIN=       0,             -513945,         0
##MAX=       2.4114304,     370409,          0
$$ Real data points
##PAGE= N=1
##DATA TABLE= (X++(R..R)), XYDATA
$$ [...]
1979H41l371M105q19j274Q83j189J288q43l5K475l272J163K655o004L976K470
1995C049o286N172Q6o039N918j419l603N991k546k227M126l802L53K932k558J165
2011C12L43j871J657j531R78J302k409L118j645l474N526l016j533N993n039o32
2027a921N446o555J473N201n906K647J993n319L055R64k983K990j08j358P57j891
2043a515J748n12j56K842l614M39K888m896K487L455n668M075O72o469O138j175
2059G39l667O028k821k708M667l299p84M223k558N76N47k187J150l60M97J322
2075A365k606K040m29l091N369k942j706N794l877k262N467m819m80N799n001
2090a379J045K687n016K446J248k436K529j140o89J452j938R78L96j098K981k394
$$ plain form
1979 841 -2530 1575 756 -518 365 -824 464 -379 -414 2061 -1211 -48 2607 -3397 579 3049
1995 3049 -3237 1935 2021 -4018 1900 481 -3122 2869 323 -1904 2222 -1580 -1227 1705 -853 312
2011 312 655 -1216 441 -1090 -112 1190 -1219 1899 254 -3220 2306 -710 -2243 3750 -1289 -1921
2027 -1921 3525 -3030 -1557 3644 -2262 385 2378 -2941 114 1078 -1905 1085 977 -381 376 -1515
2043 -1515 233 -279 -435 2407 -1207 -768 2120 -2776 -289 3166 -2502 1573 2245 -4224 1914 739
2059 739 -2928 3100 279 -2429 2238 -1061 -1845 2378 -180 396 943 -1244 -94 -454 43 1365
2075 1365 -1241 799 370 -2721 2648 -294 -2000 3794 -83 -2345 3122 -1697 -2177 3622 -1379
2090 -1379 -334 2353 -2663 -217 1031 -1405 1124 -16 -705 747 -1191 -213 183 -915 2066 -328
2106c28j227L157l561J562L143n154L092J618o215M609R82m782N667j647l991
2121c075M605j510k063L852j900o6Q22k030J410l89O5K218k990J502N81l674L852
2138A210j64l258M968k668l157N656l316j029N138m277J73L396m926J797K229
2153A772l202K441k64k156J732o83K40R55j256J424j167j508L486l176M87L967
2169C092n234J594L009n662L310K278m989M069L26m968M083l69k226L304j418
2184A99j012J526j630Q65M62r01J961j986q8J602k754K376O63l144L763j212l341
2201b651M636k125j774N362m195j078M547m683P91L491l612J638J169k747R72
2216b59L34l11J071j263J154m62j845K732j299r79L921l479p54L398l961J736
$$ plain form
2106 -328 -1555 1602 -1959 -397 2746 -2408 684 2302 -3913 696 1678 -3104 2563 916 -3075
2121 -3075 1530 20 -2043 1809 -91 -157 665 -1365 45 -344 -279 1939 -1051 451 1032 -2642 1210
2138 1210 1046 -2212 2756 88 -3069 2587 -729 -1758 3380 -897 -724 2672 -2254 -457 1772
2153 1772 -1430 1011 747 -1409 323 -360 -120 835 -421 1003 -164 -1672 1814 -1362 -875 3092
2169 3092 -2142 -548 2461 -3201 109 2387 -2602 1467 1793 -3175 908 539 -1687 1617 199
2184 199 -813 713 -917 -52 410 -491 1470 -516 -604 998 -1756 620 1283 -1861 1902 690 -2651
2201 -2651 1985 -140 -1914 3448 -747 -1825 2722 -1961 -1170 2321 -1291 347 1516 -1231 -259
2216 -259 75 -236 835 -428 726 264 -1581 1151 -148 -1127 2794 -685 -1439 1959 -2002 -266
2232b66K737m227K364R62m095K952O46k753L508j285k172K415j553L2J318m33
2248A50N43j093K6P78j904J854J303l067K290k1l291L778q59k603M406k113k412
2265b235M019k494p92L450k382j68J579j831L67Q01o73J249q67k10K18j188J964
2282H07p70p33K453k053o51K229k471O99K819l619J315J627l581K101J188k627
2298a267K121N25k545J470m0j064J355j41l82l41K01N20j096P74J546k493J108
2315B51R14l414K702O69k832K928j24k936K675r52j344L114j608j043K153j961
2331h08L36J174j070N68K04m15n22K46M51n3o69J612j524n74K106j913N8K568
2349A775k381m08K700l241R70K214k798J299J253k696J228L80q89J232k38n23
$$ plain form
2232 -266 2471 -1756 608 1570 -2525 427 1073 -1680 1828 543 -1629 786 -767 -735 583 150
2248 150 693 -400 -374 404 -1500 354 1657 -1410 880 859 -2432 1346 487 -2116 2290 177 -2235
2265 -2235 1784 -710 -1502 1948 -434 -602 977 -854 -487 314 -359 890 23 -187 31 -1157 807
2282 807 37 -696 1757 -296 -947 1282 -1189 -490 2329 -1290 25 1652 -1929 172 1360 -1267
2298 -1267 854 1379 -1166 304 264 -800 555 414 32 -309 -108 412 -684 90 1636 -857 251
2315 251 1165 -2249 453 1122 -1710 1218 1094 -1842 833 -119 -1463 1651 43 -1000 1153 -808
2331 -808 -472 702 -368 200 404 -11 -533 -287 164 111 -558 1054 -470 -1044 1062 -851 -793 1775
2349 1775 -606 -1014 1686 -1555 -585 1629 -1169 130 1383 -1313 -85 295 -594 638 400 -123
2365a23R8O9K89m04k37J299j360J32J072k036J500J125k500J749K33k711K699
2382H94r7k392L157j061k028K471j363m71J986j459j74R48q88J74Q9M89j00q97
2400g22J163m18j361K401r29j490K820j755j057K923k587L46K584k692L85J689
2416A300k858J443Q93j780J631L7j490J142o25L8O33p91R54p00l13J116j672J212
2434A70J546k970J737N02k965K384P27k501K515k39k444K673j346j008K308j093
2450dj70N25r71O20j76j83J298j355N00N08k089K010K04j857K472j482j477K980
2468A353k015m25K898k568K60J941k953J445J384k288J485r5j076Q24n27K35P31
2485F09r42P64p90o81J916j746N22J989k604O74J668l144J655J406k758K315L
$$ plain form
2365 -123 -25 44 333 -71 -308 991 -369 -237 835 -1201 299 1424 -1076 673 906 -1805 894
2382 894 797 -1595 1562 501 -1527 944 -419 -890 1096 -363 -537 411 -477 -303 -214 275 175 -722
2400 -722 441 23 -1338 1063 134 -1356 1464 -291 -1348 1575 -1012 -666 1918 -774 -389 1300
2416 1300 -1558 -115 778 -1002 629 666 -824 318 -307 -269 364 -427 527 -173 -486 630 -1042 170
2434 170 1716 -1254 483 985 -1980 404 1131 -1370 1145 906 -1538 1135 -211 -1219 1089 -4
2450 -4 -174 351 -620 0 -176 -359 939 -416 84 592 -1497 513 717 -1140 1332 -150 -1627 1353
2468 1353 -662 -1087 1811 -757 -497 1444 -1509 -64 1320 -968 517 422 -654 170 -357 -122 609
2485 609 -333 431 -359 -1040 876 -870 -348 1641 -963 -289 1379 -1765 -110 1296 -1462 853 856
2502H56k408K421r03j116K369j127o03R55j320Q94K74q48J496j057k23Q17j811
2519a334J400O47j765J714k62j770K206j203p52K860k081l55J921k303L90K169
2535A482k480J141O0o54M77k18m12O30l35Q60K57j618J849j107r66K137j949M42
2553d04J351k020P33K102l118K006j07k076K215J35j833J994r72p37J217r20L31
2570a03M11m23O79r89j17J062j373J204N38k047J624Q1k077K218k72j493K232
2587A155j388n47J656j256M2J236j513P47L81r77O71j58r8Q33q10J92J59p92J018
2606E51n55l50J168j303k17J488j595N43J526k150R18P06k110J682M47j377J206
2623E78k35j095J042o4o32O02j85Q9k70k78O80o14M98O18r74M35L27j564J300
$$ plain form
2502 856 -1552 869 -34 -1150 1219 92 -511 444 -876 18 292 -556 940 -117 -340 477 -1334
2519 -1334 66 713 -1052 662 400 -1370 836 -367 -1119 1741 -340 -695 1226 -1077 -687 1482
2535 1482 -998 143 203 -451 26 -192 -604 26 -309 551 808 -810 1039 -68 -1034 1103 -846 -404
2553 -404 947 -1073 -340 1762 -1356 650 543 -1533 682 817 -1016 978 6 -731 486 -434 -103
2570 -103 308 -115 564 -425 -542 520 -853 351 889 -1158 466 547 -1530 688 416 -1077 1155
2587 1155 -233 -780 876 -380 -338 898 -615 132 513 -464 207 49 -49 784 -26 166 325 -467 551
2606 551 -4 -354 814 -489 -706 782 -813 -270 1256 -894 24 730 -1380 302 749 -628 578
2623 578 343 -752 290 226 -406 196 11 100 -170 -448 232 -382 116 734 -240 195 522 -1042 258
2642B58Oj040J467o95p72J395o04n37J426j086OQ66j224R0Q14l40J92j27n5l69
2662c29R1P06l50l97J017p34n37J263r45q2J305j364O3J113j400M29O63r10M68
2681G0N56j059N55K45n02M03j11n3p8j72r9J76%N7j23N2K23q72Q90N20j195P15
2703A98j15r84J312k54p39J542q63n99J222j046k63Q05n42K57P1j61K06l75K57
2722g1M40m74L40r1l40Q19p95l23J607j571j99R97o49l31J222q47l84J410j196
2741d36j39P77r65J617m35k46K65j087P08J38k95O61o75R7O68j162P09Q50j874
2760h24R51L31j596J834m09o98N29J40n98M75M22l24M19j089J76Q72j282J46R59
2779D34m77K14j201J153j19j78K08N88j096J295r09l27J140j267K45Q86j080M02
$$ plain form
2642 258 264 -776 691 -4 -776 619 15 -522 904 -182 -176 690 -534 -444 370 30 222 95 40 -329
2662 -329 -238 468 118 -279 738 4 -533 730 -215 -297 1008 -356 -293 820 -580 -151 512 -398 70
2681 70 626 -433 122 367 -135 268 157 104 26 -146 -245 -69 -69 -12 -135 -83 140 -732 158 678 -517 198
2703 198 83 -901 411 157 -582 960 97 -502 720 -326 -589 216 -326 -69 2 -159 47 -328 -71
2722 -71 369 -105 235 144 -196 623 -172 -495 1112 -459 -658 339 -310 -641 581 -266 -650 760 -436
2741 -436 -575 202 -763 854 419 173 438 -649 59 197 -98 563 -112 -15 653 -509 200 1050 -824
2760 -824 127 458 -1138 696 287 -411 118 258 -340 135 557 233 652 -437 -261 611 -671 -525 434
2779 434 -43 171 -1030 123 4 -174 34 622 -474 821 -88 -415 725 -542 -297 589 -491 -89
2797h9N77j012M80L59o48M91p1l38L54l56K80J13p36Q06l00l47O85n67Q1R56q34
2818a16P4M72j090R04J84r05Q86l33p37J182m13n05Q24m43o6O43j022M47R2k34
2838a56O00n40p3L10l89N08K8q42R72m04q12J532p75k78J186r20l29R30q87K86
2858e3M91o83L42j68j94N03k63J9M16p59J05L31n96Q97k79n29J137q54J5M41o36
2879c17K16N05q92P81n6p16P78l13k60O51l28l29N22o58M86J41j68K98l95J1L92
2900C49r20P84J28o80L08K32p35Q86j34p81J073m45m15P20q00L74O39p40Q8L46
2920B77o74N03j01j77M25l15K72o9l08J34K57l82P56n99p7O91j073M17N78j019
2940d84O40J46q35N88M2l88O36m52j43N73k88r4M8j04K99k05j50O50m56o56R76
$$ plain form
2797 -89 488 -524 -44 315 -333 158 87 -251 103 -253 27 140 -596 210 -90 -437 248 -319 -238 718 -116
2818 -116 -42 430 -660 244 428 -477 409 76 -661 521 108 -397 427 -16 -82 561 -461 -14 78 -156
2838 -156 444 -96 -169 141 -248 260 288 -554 418 14 -798 734 -41 -319 867 -53 -382 548 -339 -53
2858 -53 438 -245 97 -71 -265 238 -25 -6 410 -349 -244 87 -509 388 109 -420 717 -137 -122 319 -317
2879 -317 -101 404 -488 293 237 -479 299 -14 -274 377 49 -280 242 -416 70 211 43 341 -54 -43 349
2900 349 -571 213 341 -339 -31 201 -534 352 218 -563 510 65 -350 370 -430 -56 583 -157 -69 277
2920 277 -397 106 5 -172 253 -62 210 141 -167 -33 224 -158 598 -1 -78 613 -460 -43 535 -484
2940 -484 156 302 -533 55 97 -291 345 -107 -250 323 35 -59 -11 -115 184 -21 -171 479 23 -633 343
2961C43q45O23K9o68Q75m84J46J94n3o18Q36m28k56M89l78J41K94l48J55J61l38
2982a30K55j45J88j40l30M55j6k76K61q0l98N73o2m24P12m37n1L15l71L42l6m37
3004b32K94Q7n39N51J24l66K81l70R0L37m05K52Q9k42L72p37L23Q0q0K90P3o43
3026c71P16l53p6K75k22p3M58l03k40L15k61L20K32o35L72o23M3M61j03J26L45
3047D03l32j226J372p32P66n9m06L76k02L5L68n93N30j20m40M23qn07K81J35j49
3068h5J80Kj27K64n49M44n9p9J66m40K74m0R3K59j30m05O3N66p57M86Q8l72Q3
3091g5J52j84L68k71M5Q4k63L02J90m91K01j58J01J5p0l30K89K5q6K22j51P3l52
3114c64O03m5m72K3L06k22P8M23m75M9J09o6J52p3L64p4l55K9j04r4K19J10r5
$$ plain form
2961 343 -502 121 150 -518 357 -127 19 213 160 -458 378 -50 -306 183 -195 -54 240 -108 47 208 -130
2982 -130 125 -20 168 28 -302 153 137 -139 122 42 -356 217 155 -269 443 6 -45 270 -101 241 205 -232
3004 -232 62 149 -390 161 285 -81 200 -170 -80 257 -148 104 193 -49 323 -414 -91 -11 -91 199 272 -371
3026 -371 345 -8 -84 191 -31 -104 354 51 -189 126 -135 185 417 -218 154 -469 -426 35 -68 58 403
3047 403 71 -1155 217 -515 251 192 -214 162 -40 -5 363 -230 300 180 -260 163 155 -352 -71 64 -85
3068 -85 95 97 -30 234 -315 129 70 -9 157 -283 -9 -49 44 303 173 -232 -169 397 -360 126 214 -158 -75
3091 -75 77 -107 261 -10 35 119 -144 158 348 -143 58 -100 1 16 -54 -384 -95 -70 -156 66 -85 -12 -364
3114 -364 239 194 -278 -255 51 -171 -93 330 -145 -96 13 -53 99 26 390 316 -39 -10 -114 -208 11 121 26
3137B6K69j59l06K42j09N7J79j62KP5l34K97j45r2K48r7j41J30j21O2J18R4k11
3160g8L4MJ48k00J3J14l90N13l4l30K37j66K6K9J11j70L99k31n5Q7m7P6J6k69
3184a63O3L31n38L90k55J53Q0mk7Nl62M53%j10k5l7M7K08k99j21L26m67J57L04
3208A09j25O0j75p0K93j2K12l95j00L45j19k76M37m33J11K41j40j77J72k15K67
3229A0J60l73K61O2k71M55j94j94N8j74L95j74j47pK31m99M91j92o1M21k47k78
3251b67N55m75Q9N0p6J75N3l61M18k08M1J92j69J19O4k59R0L6p5J96l40q2L48
3274A14k52J88ml13K24J05p9L09l43J23L45p57L62K61l49K87k65l22M60J04k31
3295c3K34k93J78J64k10NK36l80R9j37K35J59j89p8J37l13K65J24m56L81j7m16
$$ plain form
3137 26 295 136 -170 72 -37 20 199 37 39 114 -220 77 -68 -160 88 -9 -150 -20 -141 -79 39 133 -78
3160 -78 -44 -40 108 -92 -79 35 -355 158 124 -206 31 -135 -109 -80 31 -139 260 29 -26 61 14 90 106 -163
3184 -163 -100 231 -307 83 -172 -19 61 57 30 35 -327 126 126 16 -9 -46 1 209 -90 -211 115 -352 -195 109
3208 109 -16 44 -131 -201 92 80 292 -103 -203 142 23 -253 184 -249 -138 103 -37 -214 -42 -257 10
3229 10 170 -203 58 120 -151 304 110 -84 -26 -200 195 21 -126 -133 98 -401 90 -102 -163 258 11 -267
3251 -267 288 -187 -98 -48 -124 51 104 -257 161 -47 -6 186 17 136 200 -59 31 67 -8 188 -152 -234 114
3274 114 -138 50 46 -267 -43 62 -17 292 -51 72 417 -340 22 283 -66 221 -44 -366 94 198 -33
3295 -33 201 -92 86 250 40 45 281 -99 0 -137 98 257 68 -10 127 -186 79 203 -253 128 111 -305
3317c05N65m5r7j41j58K42L3l41K83L5k60L15l7l38M67l51n7L60k38q2J81o0K6
3340cJ33l61K89j27k7R2r0qj43K64k0j16j1J46Q6k20J74j0o1J00j33J60k01RK43
3365A65Nj01J40m27J75J89k41M8j17J99K1J7q3J14k63J9J57oMR4j33k2q2J3J88
3390G3k38R9L06m36K67j18J27k76K23J54j24Nk06J75j07J18K7n2m4j2L7j68J32
3413c8k6K6M9n3J8m6P6K05m53K82j94J61pk39K38n3o8K44j51k3L2j08R4J37j29
3438b6o0J02J34l09Q5J67r0j29p4O5K66k08L06m73M95k64Q9m9q0O6K13j15j05
3461FJ60l88L16k95K98r1Q9k01M9J14k55K93Q9J54k19k64j04M63l55M08J74n29
3483h8L72n48K29J27J9j24K29p38M18Q7M6q3K57j39J10k29P5L02l79N9N1O5l45
$$ plain form
3317 -305 260 215 118 -23 -181 61 94 -247 36 71 -189 126 89 -249 218 -133 -190 170 -68 -150 31 -29 -3
3340 -3 130 -231 58 -69 -96 -4 -94 -102 -245 19 -1 -117 -128 18 104 -116 58 48 -13 87 -46 114 -87 -78 165
3365 165 170 69 209 -218 -43 146 -95 -47 -164 35 56 73 -10 104 -159 -140 17 11 15 109 -24 -46 -128 -115 73
3390 73 -165 -66 240 -196 71 -47 80 -196 27 181 57 62 -144 31 -76 42 69 17 -27 -39 -2 -170 -38
3413 -38 -64 -38 11 -42 -24 -70 6 211 -242 40 -154 7 0 -239 -1 -54 -122 122 -29 -52 -20 -128 -34 103 -26
3438 -26 -86 16 150 -159 -74 93 3 -126 -200 -135 131 -77 229 -244 251 -13 76 27 -53 13 226 111 6
3461 6 166 -222 94 -201 97 6 95 -106 -57 57 -198 95 184 338 119 -145 -249 214 -141 267 441 -88
3483 -88 284 -264 -35 92 111 -13 216 -522 -104 -17 29 -54 203 64 174 -55 20 322 -57 2 53 118 -227
3506b27K77j08K46m28K91K10l23K4L16m58L85j23l39J00L07m9p4J08k51K53L55
3527D92m26J33j23R1j61m7j22p2K67K36n10L56q9j91J20K24k82M2J69n96O89J86
3549C86k10k20O6j20R4J72R1n40Q3J01M3J40L01l80r0R2m3M4k96P1L91k0m81J79
3573a46L19k52m32M46Q2L38m08N33l90M7k58L94j3j37k55R5n37O79l83P13o45
3594b10M42l85L55n61N05l58N09j43J39q90k81J504q73J019j167J041j144O17
3612A19n86J412j133M81q93J82L2K22L42p03j1N32j72n45K62K12j43L60p59N93
3632a96p87L36NM67O71K92j278Q6J22R2m2N0j76K58j10n3R15j057N85o3n77L82
3654g8j2l14K26J12n8K78N9n41K26M6J65K0l04L55m36L84J3j75o3nJ17P8k78K0
$$ plain form
3506 -227 50 -58 188 -240 51 261 -62 -38 278 -180 205 82 -257 -157 150 101 27 135 -116 137 492
3527 492 66 199 76 167 6 -41 -163 -235 32 268 -242 114 25 -166 -46 178 -104 -62 107 -489 200 386
3549 386 176 -44 22 -98 -4 168 259 -281 -198 -97 -54 86 387 7 -83 9 -34 10 -286 -215 176 156 -325 -146
3573 -146 173 -79 -511 -65 17 355 -53 480 90 137 -121 273 260 123 -132 -37 -574 105 -278 435 -210
3594 -210 232 -153 202 -359 146 -212 297 154 293 -597 -878 626 -247 772 -395 646 -498 119
3612 119 -467 945 -188 293 -600 -418 -386 -164 178 -525 -536 -4 -176 -721 -459 -247 -390 -30 -789 -196
3632 -196 -983 -647 -642 -175 496 788 -490 -404 -282 -190 -232 -182 -358 -100 -210 -263 652 -405 180 117 -460 -78
3654 -78 -90 -404 -178 -66 -124 154 213 -328 -102 -56 109 129 -175 180 -256 128 141 -34 -97 -102 15 93 -185 -165
3678a65J99k19J79j01J13q1J72O7m11N86J10o06l0L64j24mj94j61N60n59P59n12
3700e8J18N8l0k30o35R65o64N69q1m06j69N0M67k33q0J83N07p02o16R48M9m51
3722d41P51m54O63n14K6J56k30J37l27K82k60L84j14m03Q88l70n72J57R10o08
3742F1k49n3K59N73p77n15O77L27m09l54R1O8L13M6k79k01M1P8K86J6J96J74m73
3765a04m1l28O40l79L65k04l00Q20m32m69M98J43k41K25k67L73m75k8K68j38n2
3786a26K68k37j24O48o9j83l20R8j09L03o5j06j28M7j04j30M72m79L91j21n9K0
3808a13j77N03k93j73J51J87J02j22k10L80N3j48L8k54K54j01l77K52J60l52K11
3829b9j67J30N8j66Q7R0k73l8R1R5L30k58M30n13L18K14k52J03r2n91L35J86j27
$$ plain form
3678 -165 34 -185 -6 -107 6 -75 97 164 -247 339 449 -157 -187 177 53 49 -145 -306 254 -305 454 -58
3700 -58 60 118 88 -142 -777 188 -476 93 12 -394 -563 -513 -46 -279 -359 -176 331 -371 -987 -39 10 -441
3722 -441 310 -144 519 5 31 187 -43 94 -233 49 -211 173 59 -344 544 174 -398 -241 669 61
3742 61 -188 -241 18 591 -186 -701 -24 303 -106 -460 -369 -301 12 58 -221 -422 -381 -303 -17 -1 195 369 -104
3765 -104 -145 -473 167 -212 153 -51 -351 469 37 -432 66 209 -32 193 -74 299 -176 -204 64 -74 -126
3786 -126 142 -95 -219 429 360 177 -143 -45 -154 149 84 -22 -150 -103 -207 -337 135 -344 47 -74 -133 -113
3808 -113 -290 213 -80 -253 -102 85 187 65 -145 235 288 140 178 -76 178 77 -300 -48 112 -240 -29
3829 -29 -196 -66 -8 -174 -87 3 -270 -308 -217 -122 208 -50 380 -133 185 399 147 250 158 -433 -98 88 -39
3852c9r9R3q5O0M93q29M90L14j98p63O50m5K91o26j7Q71l49k07J43m1l92J59n12
3875f38Q87J08j38k45M6l0P8K5l08K61k85L07ON2j67O4j05L1joJ42j94L87j85
3899I2j85n5R0Q6q8J37J01m43L33j00n0m1O5J71j74lK56m2K45l53O7j48J68j88
3923e9K36k88M5K05o73M54J04J64M09p44M88j360M78J24J63P16l74K36j246J670
3943G48j227M05N71m54J14J31J3P9k49R4L12m63n13L86k61q4N02j25j12L81n17
3964b69l04N02J08m69R62j96K45q97N09n81J67R1JM9K09j88L41k53r9l9K08k33
3986a36J82k17L09J91l35J5m01K65J43J82k04j90J10R8p0q6M05l32N5K9K1j24
4008i0Q8k4J42l22j26M72j16j12j49J99J20P2kk12k8K8R1R0j50L76m47Q2l1L31
$$ plain form
3852 -39 -138 -45 -130 -70 423 -406 84 398 200 -563 87 42 333 -293 -310 561 212 5 148 107 -285 -126 -638
3875 -638 249 357 219 -26 20 -10 68 93 -215 46 -239 68 74 126 -41 23 -82 -51 -52 -58 84 -110 277 92
3899 92 -93 -148 -58 28 -60 77 178 -265 68 -32 -82 -123 -58 113 -61 -64 192 150 395 42 109 -39 129 -59
3923 -59 177 -111 -66 139 -534 -80 24 188 597 -147 341 -1019 -541 -417 -254 462 88 324 -922 748
3943 748 -479 -74 497 43 157 288 301 380 131 225 537 74 -439 -53 -314 -398 104 -21 -133 248 -269
3964 -269 -573 -71 37 -432 530 334 579 -318 191 -390 -223 -132 -131 -82 127 -61 280 27 -72 -111 97 -136
3986 -136 46 -171 138 329 -6 9 -392 -127 16 198 -6 -196 -86 12 -58 -144 261 -71 -16 13 34 -90
4008 -90 -2 -26 116 -206 -332 140 24 -88 -237 -38 82 154 152 -60 -88 -60 31 121 -29 347 -100 -18 -49 282
4032B82k40Q5k16q5J0K53l4m2R2n6j52J19K6k0j10J32k35J15K40M8k47N7L1k27
4056a74N57m91N2R3j66N4J10j14m9K61l14M11k21m4j0j22J42K60j3j60j56K4K57
4079A87k76q1K57o5p2J81j25K5k48J67N9J39k0k61K91j9l4O4j09J7l3o4k70O79
4103C89l66n0m4j1L20k00j86K18k61O0L81j70l7j23M1K10k2j02j46K52k89J8J80
4126F2kO2n0k98J16k6R4J68l63J85RO2J17Nj79p9J43j4q0L00k34mn0L7J64o7J96
4153B74k77Q4j41K09j93Q7j05kN5n3J98j67L5R7k66o0K40k07J00J53k32N0K11
4176I0k80K99j13j70P9p0L07qJ1J8q4k91L23k24P0%R3q4J29J20m01J65Q2k23M24
4201B62l43l2J98m6j51Q0O0p2J27j98M0Q9M3O8j44K5J1J75k89P8K03l33O2J06
$$ plain form
4032 282 42 127 -89 -174 -164 89 55 13 105 49 -103 16 42 22 -88 44 -191 -76 164 212 -35 22 53 -174
4056 -174 383 -108 -56 37 -129 -75 35 -79 -128 133 -181 230 9 -35 -45 -167 -25 235 222 62 -94 -70 187
4079 187 -89 -170 87 22 -50 131 6 31 -217 -50 9 148 128 -133 158 139 105 169 60 77 44 -20 -290 389
4103 389 23 -27 -71 -82 238 38 -148 70 -191 -131 250 80 43 -80 -39 171 149 47 -99 153 -136 -118 62
4126 62 60 122 72 -226 -110 -136 -42 126 -237 -52 -43 19 136 141 -38 -117 26 12 -68 232 -2 -6 -56 -19 145 78 274
4153 274 -3 81 -60 149 -44 43 -62 -64 -9 -62 136 -31 4 101 -165 -225 15 -192 -92 61 -171 -121 90
4176 90 -190 109 -4 -174 -95 -165 142 134 145 163 79 -212 111 -113 -43 -43 50 -34 95 215 -186 -21 61 -162 262
4201 262 -81 -113 85 39 -112 -32 28 -44 83 -115 -75 14 57 125 -19 6 17 192 -97 -19 184 -149 -87 19
4225A9N4K9m4k05j16L05N2r0K06j94J91k25J34k33L18k12L2j71L81j43k70K04
4247B2k68J64Q0M7r6q4R4r6O0J42j7k19O1K13O0j55J73l9k06J9j16L12l42K17
4271B6jn0RJ29k62M1L25n57L49m6j63J23K09k06J29j04j30J01j41J21J23k35l3
4294b43n4L24M3j18J67k1r4j69R1K1j12J25n1J04l7q5K7L3j97L88n5J03j3j6N3
4319B14Nl57J20j4O1o8J96l78n9K57l9R3q3j4L1K5j0j5PJ42M3j00M5j98K99j46
4345E7P9j27l9p0K61n5nJ40m78L92o5j78j2J32j83K11j17k9K28k6qk60L69j64
4369E3k36J70p1k0j40J62k01J58J03j52J74m65M00m8L15l86p0L19N9k34Q7R8l0
4392D5O3n9l12K98N4j91k37O57m85r1J83L31k15o2J7k97J02O37j022M75j31M2
$$ plain form
4225 19 73 102 58 -147 -263 42 94 4 210 16 207 -18 116 -117 201 -11 21 -150 231 88 -182 22
4247 22 -246 -82 -2 45 -51 -135 -41 -137 -77 65 48 -171 -110 103 163 8 181 142 -64 -45 -161 151 -191 26
4271 26 25 -25 -16 113 -149 -108 217 -340 9 -37 -200 -77 132 -74 55 -49 -179 -78 -219 -98 25 -210 -243
4294 -243 -297 27 70 -48 119 98 4 -165 -74 -53 -165 -40 -91 13 -24 -109 -82 -49 -246 142 87 190 177 161 214
4319 214 219 -138 -18 -32 29 -39 157 -221 -280 -23 -62 31 -52 -66 -35 -10 -20 -35 -28 114 157 57 102 -96 203 57
4345 57 136 9 -30 -100 161 106 101 241 -237 155 90 -88 -100 32 -151 60 -57 -86 142 116 108 -152 217 53
4369 53 -183 -13 -84 -104 -244 -82 -283 -125 -22 -174 0 -465 -65 -113 202 -184 -254 65 124 -110 -23 75 45
4392 45 108 49 -263 35 89 -102 -339 318 -167 -258 -75 256 41 -21 -4 -301 -199 438 -584 -109 -240 -198
4414a98M26k86j32L17J39m14J67p5k86L24L1l2m52O03j84p9O8k02L93n39L02M55
4436C46j45m34O47m17j47K24m33L56J9l6Mk14M59J8j9k10m5l8J6K04l58J96mq0
4460i1j05J13J98j90J60J18k40%O0r8J81j45J82j72l3J75k61J63j4jk00K28j20
4483i2J23m8J78q8m8P7j42O1k06l7K29L6p6L9J59r3j66L0J05j77K34kM5j72l5
4508f6j05K43m6r7L02j90p0L03j39j53j3j4J97l90K92k56K91N9l38M21l88L84
4530B27l07j62M13M2k07q0l1K08J8k29J65j57L29k63l7N11n99K92k06J67o41R08
4552C61j42k65k38L56J72k8k56J53m70J77L25k60j63K42M23J23p64Q3P74l30l6
4573B37o30L22j50N71n67N3N45o72M91l11M92j450J320j68n6n26P67j35k98J99
$$ plain form
4414 -198 228 -58 -190 127 266 -148 19 -56 -342 -18 13 -19 -471 132 -52 -131 -63 -265 128 -411 -109 346
4436 346 201 -233 414 -3 -150 74 -359 -3 16 -20 -16 -230 229 247 228 18 -27 -65 -49 155 -203 -7 -11 -91
4460 -91 -196 -83 115 -75 85 203 -37 -37 23 -75 106 -39 143 -29 -62 113 -148 15 1 0 -200 28 -92
4483 -92 31 -17 161 73 25 102 -40 21 -185 -222 7 43 -33 6 165 72 -94 -64 41 -136 98 96 141 -31 -66
4508 -66 -171 72 26 -71 231 41 -29 274 135 -18 -31 -45 152 -238 54 -202 89 148 -190 231 -157 227
4530 227 -80 -242 171 213 6 -74 -105 103 121 -108 57 -100 229 -34 -71 440 -159 133 -73 94 -547 361
4552 361 219 -46 -284 72 244 216 -40 113 -357 -180 145 -115 -278 -36 387 510 -254 -171 603 273 237
4573 237 -393 -71 -221 350 -217 -164 381 -291 200 -111 381 -1069 251 83 27 -499 268 133 -165 34
4593C4n17M66J55o02J07K68J32Mj19k5K69j31Q9l02J39j12mL37k46j33q0J53l
4616a21K17j91q1K72j66J29j61M5p6L04j65J13j49M1k00K75N5k23j31RP7M17j30
4639A60k22J78j12K09j98j02K3J30j5Pn3O8q9K73o7j47J49k08j55mL13L1k41L2
4663d0N8j67K9K42r2j3qK69k11j19q3k2J25j1J66l4n8j33L0J94%j16J82j58K8
4688E8j99J93l13j5M15j49p3J13J43l49J11K6M9q0j7M5K5K59n04K13j89M7O8O7
4712e6J41k2mk17L36j80J93j45O2j71N7k3K20m01L30l02K66q3j51J95l5K25m73
4735b38o7R7K92n4m7m1j52J71N7j2L7k51M59k05L5k4q5l6J64j90K35K03m98j39
4759b89L54j09j87J59O5N1k25K99j25k44L65l0j54K92l47o1K03j01N7K01J8Kl14
$$ plain form
4593 34 -483 -17 138 -464 -357 -89 43 47 -72 -97 172 41 130 -172 -33 -145 -149 188 -58 -191 -271 -118 -121
4616 -121 96 -95 -176 96 -70 59 -102 -57 -133 171 6 119 -30 11 -189 86 141 -82 -213 -204 -127 290 160
4639 160 -62 116 4 213 15 -87 -64 66 51 58 5 73 -16 257 190 43 192 -16 -171 -175 138 169 -72 -40
4663 -40 18 -149 -120 122 30 17 9 278 67 -52 -135 -157 -32 -43 123 89 31 -102 -72 122 122 6 188 30 58
4688 58 -141 52 -261 -276 139 -10 -83 30 173 -176 -65 -39 10 -70 -87 -42 -17 242 -262 -49 -238 -191 -123 -56
4712 -56 85 63 59 -158 178 -2 191 46 108 -63 -6 -29 191 -210 120 -182 84 1 -150 45 10 235 -238
4735 -238 -305 -208 84 30 -17 -58 -210 -39 18 6 43 -208 251 46 81 57 -28 -64 100 -90 145 348 -150 -289
4759 -289 65 -44 -231 -72 -7 44 -181 118 -7 -251 114 84 -70 222 -125 -186 17 -84 -27 174 192 194 -120
4782a20O9K54j90J41j65n1j72L81j45oq9K76k08K16j30j90K12M3k08Q8L3k58L84
4805A65j36R1N8j55N8l06K86J17k49J76q2k4j64K15J16j67N7N8k34L24k58K22
4827A68j72J1j65L6j29K27J31j93K2R5PML42m10m2j99N04l14K93k56J63k30M2
4850f5J31J4j3j80K86m31J00K11k8o6J33k57K5J99M01m52P8M26m89k25K60p5K4
4873Gp8L00l55K69j06J4j63L08m2k44Q1p1J84M6k76J79J72j42k00k8K18j36r%
4897g2J33k45J06O7j49R0J62n4R7j90J15j86N3K5k23K91Q2q4K4k60J55J89k84
4920a58J49k2j96L17o1rPk3LJ38k02J62m7q5Q9P5j88j34K1J37J79l25M88l07J38
4945A46Lj76j24L66j46K6j50K69q9j18J60k64J00M7P1j99J60p9J56r3n3J15P2
$$ plain form
4782 -120 -51 203 13 154 -11 -62 -234 147 2 -4 -93 183 -25 191 61 -129 83 126 -82 6 39 -219 165
4805 165 29 120 178 23 81 -225 61 178 -71 105 23 -1 -165 50 166 -1 56 114 -120 204 -54 168
4827 168 -4 7 -158 -122 -251 -24 107 -86 -64 31 38 42 384 -26 -68 -267 237 -77 216 -40 123 -107 -65
4850 -65 66 80 67 -113 173 -258 -158 53 25 -41 92 -165 -140 59 460 8 86 512 23 -202 58 -17 7
4873 7 -71 229 -126 143 37 51 -112 196 154 -90 -9 -80 104 150 -126 53 225 83 -117 -145 73 -63 -72 -72
4897 -72 61 -184 -78 -11 -160 -70 92 38 135 -55 60 -126 -73 -48 -271 20 102 18 42 -218 -63 126 -158
4920 -158 -9 -31 -227 90 29 20 27 4 7 145 -57 105 58 -27 62 137 -51 -185 -164 -27 152 -173 315 8 146
4945 146 149 -27 -151 215 69 95 -55 214 125 7 167 -97 3 50 121 -78 82 3 159 66 13 128 200
4968B00k80j31L7r4L40m4Pj12J32m2j41P2J22j92nK88k53J61q6N1o3R7k34K47
4992G7n9l70L65j97J33LL12j78l07Q4J64j66J60J84k66J16Q5l07P2K92k39nJ82
5015A35j28oj0k43L82l38M04p5l25J3K05QQ1P3p2p8J87l03P9M8M9n0P5r0j53K6
5041a06J01Q6j07O4r1j37L98k5m04M50l00r4J76q5j35K11J62l05L55j68Mj29J52
5064G3J58j36j21K54k49J04k21J42k00J87j52K48R5j28J93k66R2j9M1J52j70r1
5086a4O9R5k1j78k8M0k77L36J38l05P1M0m3L9j69K86K8l05K07j34n6k02M11J4
5110D2L2j33J42J5k44K49l0R5l77L06mn4j1j68K18k57L18j06K05p9j11j74J55
5133B9k5j73L48k62N8k4k1No2J61J4k7j38J25P5k67K88p9J3K5K6J40k62j46J94
$$ plain form
4968 200 -80 -211 -174 -268 72 28 35 -77 55 13 -128 -56 66 -126 -131 157 -96 65 -21 30 -33 64 -170 77
4992 77 18 -352 13 -184 -51 -48 264 86 -221 -137 27 -139 21 205 -61 55 140 -167 -95 197 -42 -47 135
5015 135 7 1 -9 -252 130 -208 196 121 -204 -191 14 22 103 176 104 26 213 -90 -11 37 86 36 111 21 -132 -106
5041 -106 -5 81 -26 38 -53 -190 208 183 -221 229 -71 -165 11 -74 -209 2 164 -141 214 46 50 -79 73
5064 73 231 95 -26 228 -21 83 -138 4 -196 -9 -161 87 182 54 247 -19 73 54 95 247 77 -14
5086 -14 55 150 129 -49 -77 -37 -314 22 160 -145 -74 -34 -77 -38 -207 79 107 -198 9 -125 -181 -383 28 42
5110 42 74 -59 83 98 -146 103 73 168 -209 97 93 39 28 -140 78 -179 139 33 238 159 48 -126 29
5133 29 4 -169 179 -83 -25 -49 -70 -65 -127 34 48 21 -117 8 83 -184 104 25 38 63 89 229 -33 -179 15
5158A5N5o0M1j11J43J8k04m9K47q5m7m3n8J38Q9j61J12j11P6J62j09j16O3K01
5182B06l16qO1J7P8k02J59lL16l34K00J86n23K06N3l59K20j6n7K95k58j30J93
5205a6J41j78p4L9K5o9J56N3j13N2p6P1j1J88n0j68m5P6OK2J16q8O0k16j04J1
5231a92K38m0J29k3q9p0L42l43J21J08J7m0l79J83r1M12j87J25j02j32J05k03
5253a11Q4K18j91N2rj4J12j46j13J05qrj36L4J97k7Q4p4lj54J21M43m24Rq9k03
5279b52J87M9r3L2J23K9j15K52j03J5j28K1k4p3L00k56L62l83j23J60k7J66j56
5302c7N5N6j63Q5J21q6j65K31K7L6l17K1j82L16O3j3qj83K77l66K89k71N5J50
5326iM6M7l84L35L1j03J8j77J77Q9k64J60M1M3r6j15J38K01j82J4J01n4n8j16
$$ plain form
5158 15 70 10 51 -60 83 101 -103 -152 95 10 -37 -80 -138 0 89 -72 40 -71 5 167 58 -58 5 206
5182 206 -110 -118 -57 -40 38 -164 -5 -8 308 -26 174 360 -163 43 96 -263 -43 -59 -116 179 -79 -209 -16
5205 -16 125 -53 -127 -88 -63 -132 24 77 -36 16 -60 11 0 188 138 -30 -75 1 7 29 145 57 117 -99 -203 -192
5231 -192 46 6 135 112 23 -47 295 -48 73 181 198 158 -221 -38 -129 283 96 221 119 -13 92 -111
5253 -111 -27 191 0 52 43 29 141 -5 -118 -13 -21 -30 -166 -132 65 38 122 48 45 -109 12 455 31 40 -49 -252
5279 -252 -65 -16 -109 -77 46 75 -40 212 109 124 -4 17 -7 -80 220 -36 326 -57 -180 -20 -47 119 -37
5302 -37 18 74 -89 -4 117 31 -134 97 124 160 -157 -136 -318 -2 61 48 40 -143 134 -232 57 -214 -159 -9
5326 -9 37 84 -300 35 66 -37 -19 -196 -19 70 -194 -34 7 50 -46 -161 -23 178 -4 10 111 57 -1 -117
5350a17N7j31J80L9n2q6J49J37r2n1j04PrpJ83Lj11J70m08M29o2m3qq9K18j88
5376A4p2N8j32M8n1K18Mj4l36R5j29K82K19n50R81r38J74l9M99l98J70k59l37
5399d93R15o34O33j63j13m1m93N71k80J89K10n07K96Q9n22M96n3j51k2J1J83j1
5421A10j11O3o6k31M72l67J43M4k94J1L70l69O5K09j39n1L23j89J64j6k58K05
5443H8k8p2k84K13K90q3k05L0jrR0k73M03l17N0J77q1J82k41j4J84j84N0k7m3
5468a05O7j15L53m07j8J80K46j99J9j34pJ99j37K30j18o3J03j58J20L2j87O5o9
5491a03J02o2lJ8k27M45j05L2j02J78k51j26J19j01m0L51k69K70J17l72J65J40
5513A76k61K47k69j1R0J8k40K39K0J24l30J10L7Q1j37J15K39l70R3k03K34j28
$$ plain form
5350 -117 -60 -191 -11 28 -24 -110 39 176 84 33 -71 -64 -73 -80 103 106 -5 165 -243 186 124 81 73 -16 202 14
5376 14 -58 0 -132 -84 -135 83 87 73 -263 -168 -297 -15 204 -346 635 -303 -129 -168 331 -67 103 -156 -493
5399 -493 422 -212 421 258 145 104 -389 182 -98 91 301 -206 90 179 -343 153 100 -51 -73 -62 121 110
5421 110 -1 62 -4 -235 237 -130 13 57 -237 -226 144 -225 -160 49 -90 -141 182 -7 157 141 -117 88
5443 88 60 -12 -296 -83 207 124 -81 -51 -52 -61 29 -244 159 -158 -108 69 -12 170 -71 -85 99 -85 -35 -62 -105
5468 -105 -38 -153 200 -207 -225 -45 201 2 21 -113 -120 79 -58 172 54 -9 94 -64 56 88 -99 -34 -103
5491 -103 -1 -63 -66 -48 -275 170 65 97 -5 173 -78 -204 -85 -186 -226 125 -144 126 243 -129 36 176
5513 176 -85 162 -107 -118 -28 -10 -250 -11 9 133 -197 -87 -50 31 -106 9 248 -122 -29 -232 2 -126
5535a26J2J99J02m01K4J32M8N7m3M8j16N0q9J48k27J31qM1j62J13RK67j8k48Q5
5560B8m8N3P5k02j8K44L8l37K38j72M7N7oM7r3J00p7J14P3j87L8R7l0P5n49M99
5586A04r0j82K37q2m4J2J44k71K37N2k39J21K6r2O2j56N5j1l0K62j61J17m1j01
5610g1k5O0Q8k2R9j82N3l9R9j23J83k56K89q7j82J69P6l42o9K30K8N4O8j71L3
5635d0j04J16J35k02J90k25N6J38j6j41l7j2N4m1PK49j34M2J49l7j12N5j01R7
5659H6J9l15J89L9L4rk66K25k34L97l33J24r7J19J67K6k82K15k05p9J54m7L01
5682B28l23J13p5j43K47J52k45L6o3P7o3J16K49n02K18k6O7K0j35j05L30k52L
5705g6J10p2K06j50j31O2K73l55J55J10mk38KK40j14l6J4J46k20j6m3K39m9l4
$$ plain form
5535 -126 -114 85 187 -214 -190 -58 -10 47 4 52 -64 -14 -103 45 -182 -51 -59 -18 -180 -67 -58 209 191 -57 28
5560 28 -20 33 108 -94 -112 132 170 -167 71 -101 -54 3 -3 44 -49 51 -26 88 161 -26 12 109 79 154 -395 104
5586 104 14 -168 69 -13 -57 -45 99 -172 65 117 -122 -1 25 -67 -5 -161 -106 -117 -147 115 -46 71 30 -71
5610 -71 -96 -36 52 30 129 -53 0 -39 60 -63 120 -136 153 66 -116 53 129 -213 -282 -52 -24 30 98 -73 -40
5635 -40 -144 -28 107 -95 95 -130 -74 64 48 -93 -130 -142 -88 -129 -122 127 -7 35 184 147 35 90 -11 86
5659 86 105 -210 -21 18 52 43 -223 2 -232 165 -168 -44 -141 -22 145 171 -111 104 -101 -180 -26 -73 228
5682 228 -95 18 -57 -200 47 199 -46 -10 -73 4 -59 57 306 -196 22 -4 63 83 -52 -157 173 -79 -76
5705 -76 34 -38 168 18 -113 -51 222 -133 22 132 128 -110 -108 132 18 -18 -4 142 -78 -94 -137 102 53 19
5729A9j97K07j32J71J04Lj11k53K77j73L67l78J17J4j15J89j08j31J64K09l15
5750g2J27K3k63J53K9Pm8L2j42J64n5q5P0J04Q6k18K33k35J30P6J3j47Q2L7k30
5775a29J01L05m09K09mqj41J3J52k35J47L44l08J61l0k62K19n8l4Q7m5k71K69
5798G3m1J07N0k89J40K03m50L17RJ58k87M7P8m19L81Q3k8j99N0j65J35J26j73
5821i4K90k91o9L96l35k4R4J46j47k0M2k04L41j73O2N0o1J35k31j14l8L28R7k92
5845a12P5k2P2j69J55J25j51j6J09k0j51J88k55K09J22p7j87J60P1l10J56Q5k7
5868C0J61l38L9L14j30OJ58l76o2p6K37L1j57KM4j0J09j74PQ5R0J50j11n8j46
5893a75J30n0J15j98K28J4p2P2J28k40K92k14J40j46j86JJ86j50K66p5K1N3o4
$$ plain form
5729 19 -178 29 -103 68 172 175 64 -189 88 -85 282 -96 21 35 -80 109 1 -130 34 243 -72
5750 -72 55 78 -185 -32 -3 4 -44 -12 -154 10 -45 -130 -60 44 130 -88 145 -90 40 116 129 -18 64 101 -129
5775 -129 -28 277 -132 77 73 65 -76 -63 89 -146 1 345 37 198 168 -94 125 67 33 120 75 -196 73
5798 73 32 139 189 -100 40 243 -207 110 119 277 -10 37 115 -304 77 160 132 -67 -17 -182 -47 79 -94
5821 -94 196 -95 -164 232 -103 -127 -33 113 -34 -54 -12 -216 125 -48 14 64 3 138 -93 -207 -245 83 180 -112
5845 -112 -37 -59 13 -156 -1 124 -27 -43 66 46 -105 83 -172 37 159 82 -105 55 126 -184 -28 57 30
5868 30 191 -147 -108 206 76 82 240 -136 -198 -274 -37 -6 -163 -161 -117 -127 -18 -192 -185 -100 -10 140 29 -29 -175
5893 -175 -45 -95 20 -178 50 64 -8 64 192 -48 244 30 170 24 -162 -161 25 -125 141 66 87 140 76
5916G6l4k3k9j10K90l35K90k05k2l7K76k96K41q5J67m8%O8o1j6q6M0r0J41k78
5941a66Q5j23J23P4J16j70J66l79J46R7J23j85K7P7j12K72j30j83J54N1J03k88
5963a22L20q8j04rj26M7p5J23K8K37l45J69j62q4K46m3j54m5J77jj40N7P9j01
5987a16Q6J82j32k54K91p0k17R8Q4oj50K75Kj6r9J00j3j7j40K7J9J79j46l2Pj18
6013a76J73r4J96l29J39L21l30J85k50P7O5M4J13j98R1M4J13j79j9J14p5k44L30
6036A11k40P3J08l6j4o4N2N8L1l91M93k49J68j91k8J43P4j68O5j11J54M4j20j80
6060b18K86p0j11L09k32J46R2o1k94J42pm7r8L12l3j04n7p6kJ87q1j03K95j92
6084a7K03q4r2K02j7j82j04N0j09L33j86K26m94J38R5J00P4j72j3n0P4LJ56j54
$$ plain form
5916 76 42 19 -10 -120 170 -165 125 -80 -102 -139 137 -159 82 -3 164 116 116 184 123 107 21 61 -29 112 -166
5941 -166 -81 -204 -81 -7 109 -61 105 -274 -128 -31 92 -93 -66 11 -101 171 41 -142 12 63 166 -122
5963 -122 198 110 6 -3 -129 -82 -157 -34 -6 231 -114 55 -107 -191 55 12 -142 -187 -10 -11 -151 -94 -15 -116
5987 -116 -30 152 20 -234 57 -13 -230 -132 -48 -54 -204 71 73 57 -42 58 45 28 -112 -85 -66 113 -33 -65 -58 -176
6013 -176 -3 -97 99 -230 -91 230 -100 85 -165 -88 -23 21 134 -64 27 71 184 5 -14 100 25 -219 111
6036 111 -129 -56 52 16 2 -62 -10 48 79 -312 181 -68 100 -91 -119 24 98 -70 -5 -116 38 82 -38 -218
6060 -218 68 -2 -113 196 -36 110 202 141 -153 -11 -18 -65 -163 149 116 12 -45 -121 -123 64 -17 -120 175 -17
6084 -17 186 102 10 212 195 13 -91 -41 -150 183 -3 223 -271 -133 -38 62 136 -36 -49 -99 -25 -22 134 -20
6108b0L7n9j3j48L23J3l52L56j50j43L81l28P0j71K25R1j57No5J43o7K8N9R6j23
6133C1M5n9j76J68j5K35j97q5J19j94L35j64k41K97M1r0k47P4K59k87J87l1q3
6156g8J08L2p0R9L6j16k44K80r5J92j30j1k58K54lk31K13J43k36l3N1J70j61L92
6180C04k47J0P8j86J14j49K37l03j16j69O71m21Q6K41m47O80k56M4l09q8k07P65
6202C32o67O75j333J399q21L08M13l3n00K07j68J76R5m35M65m0j04Q5k66J91K0
6223ap5j30K6K54l12L37r8O6j27l0%r1L93k86K28k94k4J84N0l79K66j25J08J19
6247E9j22J63KL4k28Q8J75p3k29mK30P1j81L7J39n1j36l1J94l92K28L6R4k01K21
6272A23k68L31j66j09M18l46J46k53NMP8j42OK0N0J91j89J80O0j85J61n5k48K01
$$ plain form
6108 -20 17 -42 -55 -203 120 133 -219 137 -13 -156 225 -103 -33 -204 21 112 -45 -40 -105 38 -29 -1 58 154 31
6133 31 76 17 -159 9 -6 229 32 -53 66 -128 207 43 -198 99 140 50 -197 -123 136 -151 36 5 -78
6156 -78 30 62 -8 91 127 11 -233 47 -48 144 14 3 -255 -1 -4 -235 -22 121 -115 -148 -97 73 -88 304
6180 304 57 67 145 -41 73 -76 161 -142 -258 -427 244 -177 -91 150 -297 383 127 171 -138 -226 -433 332
6202 332 -335 340 -993 406 -415 -107 306 273 -227 -20 -188 -12 83 -352 113 73 -31 54 -212 -21 -1
6223 -1 -76 -206 -180 74 -238 99 1 67 -60 -90 -90 -181 212 -74 154 -140 -164 20 70 -309 -43 -168 -60 59
6247 59 -63 100 102 136 -92 -4 171 98 -131 -135 95 166 -15 22 161 110 -26 -57 137 -255 -27 9 103 -98 123
6272 123 -145 186 20 -89 329 -17 129 -124 -119 -115 -37 -179 -173 -153 -103 88 -101 79 139 -46 115 60 -188 13
6296A3qQ9j13k97J92P6J26j9k35R0J48J1O4l39M66m48L49k01O5o0o4J89k40J94
6320D8p0o5j51L86j32K7oM9j48P7N2k0N7m7k23L18l92M89l45J22j10J34P1l09
6344a88O9j2R8O8J21l45K28L0j22j05K17o2j6j96K98k43J57J90j63j32K18n7m25
6367c72N36r0L5k42M14m48N6O7J36l08J30K44k54J18L8j51J64K03k92P9k82J54
6389f5J33J6Jk29K6Pj27K72Q4l5p0O1j10n2J71j04o6J88k07J36j95J96j98N2K95
6414A80j32J54q44J362n88n21N41m49O2K98j05K58l42J59J05Nr5j08J47j13q5
6435a11J05J40k27k79L81qN8j06K30k53K3n8J17j9k7O5k53J17j14K96q9m1K02
6458A49m3M9k36J12k35L61l6q6L8N0j19P8o8l1J63j73L12l71J48j13J83K4k12
$$ plain form
6296 13 5 94 -19 -316 -124 -48 78 59 -176 -86 62 73 137 -202 264 -184 165 -36 29 -31 -95 94 -146 48
6320 48 -22 -87 -238 148 16 43 37 86 -62 15 67 47 104 57 -166 152 -240 249 -96 26 -84 50 121 -188
6344 -188 -119 -131 -33 35 156 -189 39 69 -53 -158 59 -3 -19 -215 83 -160 -3 187 24 -108 110 53 -372
6367 -372 164 74 109 -133 281 -167 -111 -44 92 -216 -86 158 -96 22 60 -91 73 276 -16 63 -219 -65
6389 -65 68 84 85 -144 -118 -111 -238 34 118 83 13 74 -36 -88 83 -21 -87 101 -106 30 -165 31 -167 -115 180
6414 180 48 202 -642 720 132 -389 152 -297 -235 63 -42 216 -126 33 138 143 48 -60 87 -26 -111
6435 -111 -6 134 -93 -372 9 1 59 -47 183 -70 -47 -105 12 -7 -34 31 -222 -105 -219 77 -12 -53 149
6458 149 106 155 -81 31 -204 157 121 35 73 123 4 82 14 -17 146 -27 285 -86 62 -51 132 156 -56
6481e6O5m0l3K54k35J7K3k3j1j49L88j90n4k21J86J45P9j36J28p8j31O5M4o7M6
6506A6L3l19K05M5K7k5Q3j40R4r2M8L19k38J22l53J54l0j51M6K76k50K43Nl06
6530a88L30l55K35j72Q5m2O7J82j59p5J95N1k95J57j5N2Q4k33R5r2K39j10R3j00
6554B9j08J31j48J48J53k23k17L06P0r6n6J18j72K40k46K46k83Q9q8p9R3J23O7
6577I7k31k5J38m5Mr0L30q6l1mm19L39j78J43J44n9q8K96k46J66r4K42k18j68
6601h3R0j13M8K2k4j49K77Q0m6k10J38j53J36J45l99J01J32Qj5R4p2l07K47N4
6625AJ4J53J9Jj10j03J15k96K12Q6k73K94J1O0k91J0m8J3K22j13j19J20R8k58
6649a82J22N5J31j08K1Q2j46k9pJ67Kq3R0RL9N0l15L03j3l24K39J41K5j83q5K55
$$ plain form
6481 -56 9 -31 -64 190 -45 -28 -5 -28 -39 -188 200 10 -44 -265 -79 66 145 9 137 59 -72 -7 37 -30 16
6506 16 49 -270 -65 -20 7 -18 65 -75 19 -73 -25 294 56 178 -175 -21 -51 -202 -156 120 -130 113 118 -188
6530 -188 142 -213 22 -150 -65 -107 -40 142 -17 -92 103 154 -141 16 1 53 137 -96 -1 -93 146 36 129 29
6554 29 -79 52 -96 52 205 -18 -235 71 141 45 -11 107 -65 175 -71 175 -108 -19 -107 -186 -93 30 97
6577 97 -134 -159 -21 -66 -62 -152 178 92 61 57 -362 -23 -201 -58 86 27 -61 235 -11 155 61 303 85 -83
6601 -83 7 -106 -58 -36 -60 -209 68 148 102 -108 30 -123 13 158 -241 -140 -8 0 -15 79 7 -300 -53 1
6625 1 15 168 187 188 78 -25 90 -206 6 92 -181 113 124 184 -107 -97 -145 -132 90 -23 -142 -22 76 -182
6649 -182 -60 -5 126 18 39 121 -25 -54 -61 106 108 25 115 124 163 213 -102 201 188 -136 103 244 269 86 1 256
6675B56l93K52l02J24rk40L10J39R1j15l28K89m1l3l6J13k56M2j23K03J3J07P9
6698A42k10PKJ97J68m70L09j33k02K15j23R0n8J94o2m9l08R1LL39J2n7J7m22M95
6723A87k57M4N8M9j45K19L5l55J90j40j13L80m3K1L6k40k4Q0J09N6k08L5l6O3
6747AL2l32L62j49l7J11k4l1k9l7J62n0J55j39J04k48J38L24k06p7l0N5l38N27
6771B44k68K18r7m97M91k48J68j29m7Q0J60k25M7Q9j81j27K52J76k49j10K62r7
6793h8J83j70Q1Jq3j02K97k90K05p5j17K64o7J51j87J48m19J21K50r7J49j11j49
6816a05m8M45j11j83j49j79k26N94m48k83R95r83P15q8m98K07N67k44k52J82J28
6837C6r5L30m2k49J13k78J1K54j71p9J13J36p2k37J33J71j36k8j03Q6J99q9j05
$$ plain form
6675 256 -137 115 -187 -63 -72 -312 -2 137 228 113 -215 74 33 0 -36 77 -179 -137 -260 -57 -44 63 142
6698 142 -68 -61 -59 138 306 -164 145 12 -190 25 -98 -8 -66 128 66 17 -291 -200 -197 142 154 97 114 -308 187
6723 187 -70 -26 32 81 -64 155 190 -165 25 -115 -228 152 109 130 166 -74 -98 -18 91 147 -61 -26 -62 1
6747 1 33 -299 63 -86 -123 -12 -36 -67 -96 -133 29 -21 134 -5 99 -149 -11 313 107 30 0 55 -283 244
6771 244 -24 194 97 -400 91 -157 11 -118 -165 -85 75 -150 -103 -14 -195 -322 -70 106 -143 -253 9 -88
6793 -88 95 -75 6 7 -76 -178 119 -171 34 -41 -158 106 39 190 3 151 -268 -147 103 6 155 44 -105
6816 -105 -153 292 181 -2 -151 -330 -556 38 -410 -693 302 -681 34 -54 -552 -345 222 -22 -274 -92 36
6837 36 -59 271 229 -20 93 -185 -174 80 -91 -170 -57 79 7 -230 -97 74 -62 -90 -193 -107 92 3 -102
6860a02r1K01o5K20k0k93J34j04L08r2Jk63K75k0r9n1J02l28L07J31l10J65Q2
6883H8n1J73k52J30k35K9O8p2R6R2j46J82Mk13J97k40K56k0L5P8m12K06j20Q6
6907d1q0J70P8k72O0J02J30l54J36J44j31m5L13k12o0J19L0l08J78j67K02k8j8
6930e4K50j37Rl16L45j98P0K23j32k62L86o1j34j48k3J24q3J87J3Kj92m2L41k80
6954a12J99n7j32P8J21j28J04p2j9R0j16O5k90L78j47m4N7j99K53j32L15m18j24
6977c30J66p2O37o13K96j13j66q7J13K45o8Ql40J86K44j04o6J53J60j30n21N37
6999A35J8R7l66Q3K3K52j84k00L06l89O7J50j33K76k04m9K48l19K60j70K58k82
7021a23J02j38M4J72J60l0l60KL5MJ37K75l29j55M1J05J67o1O3j00j9p5RK44k66
$$ plain form
6860 -102 -193 8 -57 163 143 -150 -16 -120 188 96 97 -166 109 89 -10 -61 41 -287 20 151 -159 6 88
6883 88 37 210 -42 88 -147 -118 -50 -122 -26 66 -80 102 106 -107 90 -150 106 86 121 199 -213 -7 -127 -41
6907 -41 -121 49 127 -145 -85 17 147 -207 -71 73 -58 -103 210 -2 -62 57 87 -221 -43 -210 -8 -36 -54
6930 -54 196 59 68 -248 97 -101 -31 192 60 -202 184 123 -11 -159 -182 -58 -141 46 59 61 -131 -173 168 -112
6954 -112 87 30 -102 -24 97 -31 73 1 -18 72 -44 21 -269 109 -38 -82 -25 -224 29 -103 212 -206 -330
6977 -330 -164 -236 401 -212 84 -29 -195 -282 -169 76 8 16 -324 -138 106 2 -64 89 249 119 -402 135
6999 135 153 250 -116 -33 -10 242 58 -142 164 -225 -158 -8 -141 135 -69 -118 130 -189 71 -99 159 -123
7021 -123 -21 -159 -115 57 217 187 -173 -171 -136 -132 5 280 -49 -204 -163 -58 109 48 111 11 -8 -83 -74 170 -96
7046i6O9m3j14J64J92k94R6k10L77p6n4J94l06M06k68j19PK7K0O3j97%L23j43
7070A8J61r3J9j35j29J2P2Q9J03k44o2K82k34k3QJ38J71k12PK36k29J80j31N9
7094F3q2m4r7N0R1J05q2K46j33q7j52K3O2P1K99l70q4R7k4l0Q8p6o2K93k4p0n3
7121A8m2J70j90J87K7k88L25rn6m35J66k0L66l01K0j4Q8l3lj75J31K48k85K54
7145A49k38J58q8J43l00K11R0k33r5J85l04M6M35l30J2L1k0J62K5k7n6J81j72
7168c5m5R5j1M5k4j76J15J6l8k35K98l3J19j01Q8J9j35l5K5j14L2l61M36J71j27
7193a1k05K05Q0k99J97j41l4K75n9j09L23j05L5k01J38J7N7j04K10L92j139L41
7215a37K26k02J85m08K69J16p9J7q0k2K21l4P9k09k5R6J41j0k61J0J54R5k26l5
$$ plain form
7046 -96 -27 -70 -184 -20 172 -122 -26 -236 141 65 11 205 -101 305 37 -82 -75 -48 -28 35 -162 -162 161 18
7070 18 179 86 105 -30 -159 -147 -75 14 117 -127 -189 93 -141 -164 -156 -18 153 -59 -52 184 -45 135 4 63
7094 63 -19 -63 -160 -110 -19 86 4 250 117 30 -122 -99 -37 34 333 -37 -121 -24 -48 -78 10 -66 -128 165 141 71 18
7121 18 -24 146 -44 143 170 -118 207 198 142 -293 -127 -147 219 -82 -62 -76 12 -21 -24 -199 -68 180 -105 149
7145 149 -89 69 -19 124 -176 35 125 -108 -203 -18 -322 -276 159 -171 -159 -128 -148 14 39 12 -44 137 -35
7168 -35 -80 15 4 49 25 -151 -36 -20 -58 -293 5 -28 91 -10 78 97 -38 -73 -48 -162 -130 -491 -55 116 -11
7193 -11 -216 -11 69 -230 -33 -174 -208 67 8 -101 222 117 152 -49 89 106 163 59 269 661 -478 -137
7215 -137 89 -113 72 -336 -67 49 -30 -13 -93 -115 106 72 151 -58 -83 13 154 144 -117 -107 47 142 -84 -119
7239a19M21l04R0j38n7J47p9O7k2j45K01J85j26J8l9Kj6j28n0KJ29no0p9j32K05
7265c2P8O6l37K56k27J94R7k00L15o8q2Q3l80L45j1j09l8K46k68k15K75P6o6O7
7289F5R1j76J23j64k6J62K42n07J97j50L3J5p9j26M66j73j50N88o37M22l79O33
7311D70m41o8k28o3M3R16m53n38J079m97k35J46P60p86O9Q2l22r1l12O50l57J1
7333a65j21r0Q42n09j04m13j03Q64j53j39J30L81l84l53L11M1J98n41M16k24K73
7354A57O04j290N25n40J223p4o54j34N58o38J51M93o4r2j44k82K0J08N17L63l72
7375D35n72J11Q2O27q24l48J43M47l1N96o01P84o31j15l22J12L79j058Q07N00
7395E21n30O86m01N7k73j46J45m46O08m83P68k88Q75p61K34m63k93Q8L25N0l15
$$ plain form
7239 -119 302 -2 88 -50 -107 40 -39 28 6 -139 62 247 121 139 100 102 86 -42 -92 -90 39 34 -26 -105 -237 -32
7265 -32 46 112 -225 31 -196 -2 95 -105 210 142 60 143 -237 108 97 -12 -50 196 -72 -287 -12 64 -2 65
7289 65 156 -20 103 -61 -87 75 317 -190 7 -143 -110 -95 -174 -300 166 -7 -157 431 -206 216 -163 470
7311 470 29 -39 -267 -330 -287 629 176 -362 717 220 -15 131 891 105 174 256 -66 -157 -469 181 -176 -165
7333 -165 -286 -376 466 -43 -147 -560 -663 201 48 -91 39 420 36 -317 -6 35 233 -308 108 -116 157
7354 157 761 -529 -4 -544 679 605 -49 -183 375 -263 -112 381 317 225 81 -201 -181 -73 444 807 435
7375 435 -137 -26 56 683 -141 -489 -346 101 70 666 65 849 218 103 -219 -107 272 -786 21 521
7395 521 -9 677 276 333 60 -86 59 -387 221 -262 506 218 1093 332 566 103 -190 -102 223 273 -42
7416d2O40l51N46o63K4R65j055O7L68m14p29P41K01j77l41J65N3N0J83j24n1r0
7438c4j12K81r5M2J82m82O9l9R9L6j75J44k65K08L67l52k4J16J59m42M80p23O36
7461G6J1p6J77n58Q6Q0O00k83J46q9n67L63k5j58q4J07L09l50L67L9k81K42P13
7484H45j418R86l74J96k02k08M36k75m28N33j43J91l36K9o9L85K68l54K25l60
7504g3K74j22J5l7j21j1K11k94M0L2J57J33nm32J83N6l8J61k18k00M01N7k65J64
7528F8J10r1l1j01J33j01j40K82j46K57p6j68M2j25mK93j37Q0P5l79j14L41j04
7551c6J79k09K80k65l3kN5K4j42K13k02m2L08j66J84j33j75K86j87L6m2J49K06
7574B86l08n2R5J53k85oJ72Jq9l1K42P5l30O6Q8n4N5j37K58l86K34kJ03O5m1j73
$$ plain form
7416 -42 598 247 793 130 154 1119 64 131 499 85 -644 97 298 121 -220 -55 -2 48 231 107 56 -34
7438 -34 -146 135 40 82 264 -218 -149 -188 -89 -53 -228 -84 -349 -141 226 -126 -150 -34 125 -317 163 -560 76
7461 76 87 11 188 -370 -284 -204 396 113 259 170 -397 -34 -59 -217 -301 -194 115 -235 132 171 -110 132 845
7484 845 -573 413 39 235 33 -175 261 -14 -442 91 -52 139 -197 -168 -237 148 416 62 287 -73
7504 -73 201 79 94 57 -64 -75 136 -158 -118 -86 71 204 199 -233 -50 6 -32 129 -89 -289 112 169 -96 68
7528 68 178 87 56 -45 88 -13 -153 129 -17 240 164 -4 38 -87 -91 202 65 145 220 -159 -273 68 -36
7551 -36 143 -66 214 -51 -84 -86 -31 -7 -149 64 -138 -180 128 -38 146 13 -162 124 -63 -27 -69 80 286
7574 286 -22 -74 21 174 -111 -117 55 56 -33 -64 178 253 -77 -11 77 23 78 -59 199 -187 47 45 148 213 172 -1
7600aK24k43J89j30K24k73m7J32j05j36l1M43k55N7r1M4n1K4L7O9q4j79O4p6L69
7625A74j85nl5r3m2K44l9j52K0l0K54Q4j24k1k62j2J48K10l03J01N6MMQ0p2k9
7651b5n0J67k33N7j21L69m1Nj7l34K69j40J67nj96j14K00J29k24QL60l55K95j83
7675a2L3j81L06p8L8j44J11j73K25j68K4l1K6M6Q4j01o6J10l44J06L9J41J05O
7699A02j5m8l05L70l45K73j96J39K83k56J1J44j27r6R3r3l4K33Ml46J42K8l0n
7723g4k3K53l07L44J4k81J24J70j05L7j22j46J29j17q8L20O7o25M79j33N6j3J48
7746A07P5p5o9J80k95l2j8P6j4m6J44Q2j24j16m5L74k08k35J31QL51n02L20o9
7770@N3J61j54j14J53j95N5J3j27J57k41J28K2r4L1j4K48P4j51j97K14J80j73
$$ plain form
7600 -1 223 -20 169 39 263 -10 -57 75 -30 -166 -197 246 -9 48 -43 1 -50 -26 11 80 -4 -183 -119 -195 174
7625 174 -11 -16 -51 -144 -186 58 19 -133 -113 -143 111 195 71 50 -212 -224 -76 134 -169 -68 -12 -8 -4 76 4 -25
7651 -25 -75 92 -141 -84 -205 164 123 128 111 -223 46 -94 73 68 -128 -242 -42 87 -137 -129 231 -124 171 -12
7675 -12 21 -160 146 68 106 -38 73 -100 125 -43 -19 -50 -24 22 106 5 -61 49 -295 -189 -150 -9 96 102
7699 102 87 39 -266 104 -241 32 -164 -25 258 2 13 157 30 -66 27 -66 -100 133 137 -209 -67 -39 -69 -74
7723 -74 -97 156 -151 193 207 -74 50 220 115 152 30 -116 13 -104 -192 128 195 -430 49 -84 -28 -41 107
7746 107 182 107 38 218 -77 -109 -127 -51 -65 -111 33 115 -9 -125 -170 204 -4 -239 -108 -100 251 -251 69 0
7770 0 53 214 60 -54 99 -96 -41 -28 -155 2 -239 -111 -89 -183 -152 -166 82 156 5 -192 22 202 29
7793B9Q4J25q3l25K21j23J11r0J85K5j26p4L22l63j1M9L56k81Q6J23k00j36J09
7816A3j90M3r7L11j06P3Qk25J53N3nj30K02j23L5M3l4M1j44p6J51r7J30m3r6K10
7842A00O3l17K14J37j89pmj37j3J1K47L1l8k02J25QRj22oQ6O5k75J13K19j40K
7868b0J47j69J84j02j42J73q8k23L94n2j51K7J5l7r0J25Mk6J24N7j41J68k37J09
7892D9O4J53l44K12J37r3j12m8k10j37L07rl0k36M99j63p4J42j81P0L1l8m6j58
7916b15K16n4n6N7J47k58M43l08R7j90N14j65l43j40M33k23k0J36J21j68J57m51
7938b70K91K74m98L34J11m70L37k07o0P9k24O6L06M4l22n1O19j16n79J20J37m3
7960a22p5K83P8k25j1j70J60q0L04j82J19J23j04k06j62L86k70P3l2K04o7r7L5
$$ plain form
7793 29 113 238 155 -170 51 -72 39 -51 134 159 33 -41 281 -82 -93 -44 312 31 117 240 40 -96 13
7816 13 -177 -134 -231 80 -26 47 55 -170 -17 36 31 -99 103 -20 15 58 24 65 -79 -155 -4 -101 29 -14 -110 100
7842 100 163 -154 60 197 8 1 -3 -140 -153 -142 105 136 98 -104 21 29 38 -84 -90 -4 61 -214 -101 118 -22 -20
7868 -20 127 -42 142 40 -102 71 -17 -240 154 102 -49 -22 -7 -44 -134 -9 -5 -31 93 150 9 177 -60 49
7892 49 113 266 -78 134 271 178 66 18 -192 -329 -22 -31 -61 -297 202 39 -35 107 -74 -4 27 -11 -57 -215
7916 -215 1 -53 -109 -52 95 -163 280 -28 69 -121 393 228 -115 -255 178 -45 -65 71 192 24 181 -270
7938 -270 21 295 -203 131 242 -228 109 -98 -158 -79 -303 -237 69 113 -209 -260 359 243 -336 -216 -79 -122
7960 -122 -197 86 164 -61 -72 -242 -82 -162 142 -40 79 202 98 -108 -270 116 -154 -81 -113 91 24 -73 -38
7983c8l48J81J14k9J75k26j20J82j3K65j57J48k18k23L81p9P0L09n43k05J33L42
8005A01r4P2l22R9R6L65j88m8j78p8L8j10P3J1l9L81k48j30K82%j9k70J70K76
8029B40k29p0K45m15J41L82l21R4k00l3J48N1JK8k73R6J3K10%k61M34n13M33l30
8053a29K59r8j06m1J68q1J06o6P9n2k47K50RJKr4J52M1j85J2J95m63P0K59j87
8078a46K29Q0k50L9j35J81j04j43J87R9k5k87K92l6k67L16J1j7J67j44j53J83
8100G7j40l2J0l0P2M1L4J7j69J22k4R4n3M0O1Qk68pJ63j97JJ80j63Q0j08K83j14
8127b2m4n4Nq5L01l3N5j57K5p2K31j17jjj26L35j91j9r3J77j10j58K07j36Q9J04
8153A10j63k75L41J84k65J60j03Pj63K01rK15m77N40k51j51L06l57J36j34L2K88
$$ plain form
7983 -38 -386 -205 -91 -120 55 -171 -291 -109 -122 143 -14 134 -84 -307 74 -5 65 374 -169 -374 -241 101
8005 101 7 79 -243 -144 -48 317 129 81 -97 -175 -137 -247 -174 -163 -202 179 -69 -199 83 83 64 -206 -36 240
8029 240 11 -59 186 -229 -88 294 -27 67 -133 -166 -18 33 34 62 -211 -115 -102 108 108 -153 281 -232 201 -129
8053 -129 130 32 -74 -115 53 -28 78 12 91 39 -208 42 51 52 54 -40 112 153 -32 -20 175 -288 -218 41 -146
8078 -146 83 163 -87 -48 -183 -2 -106 -249 -62 37 12 -275 17 -19 -286 30 41 24 191 47 -106 77
8100 77 -63 -95 -85 -115 -43 -2 32 49 -120 2 -22 72 19 59 120 128 -140 -147 16 -181 -180 0 -163 -83 -191 92 -22
8127 -22 -66 -120 -115 -200 101 68 123 -34 -9 -81 150 33 32 31 -95 240 49 30 -63 114 4 -154 53 -83 6 110
8153 110 -53 -328 13 197 -68 92 -11 -4 -167 34 25 240 -237 303 52 -99 207 -150 -14 -148 -116 172
8175A72j50J61k8q5j96J48j37Lm5N3K0J57J01j97j82L38
$$ plain form
8175 172 22 183 155 70 -126 22 -115 -112 -157 -104 -84 73 174 -23 -205 133
8191A33
$$ Imaginary data points
##PAGE= N=2
##DATA TABLE= (X++(I..I)), XYDATA
0@%%%%%%%%%Qj6J6j6K4l2M0n6P1q5J01j19J43j74K06k42K84l31L84m44N13n93
31c18O79p73Q78r94J122j264J424j596J784j990K213k461K732l028L350l701M083
48B140m501M960n463O017o628P305q057Q899r843J0914j2143J3568j5238J7229
62I159j9654K2679k6578L1823l9301N0963p2585J80139m85836L55458J54989o75201
74e13945P33960j00186k78820M88184l82923r0778K95431m22600L35457N9956
84A23736l23216M12692k14620j53237L89172m09717J39572K31235m78389L89433
94A06661J7813m11218N84719k67668l16249N75059m29355q3714N30526m58821
104a52247J28627K92729m78466K16333N1451k60043L32778j25633n2805K31229
$$ plain form
0 0 0 0 0 0 0 0 0 0 0 8 -8 8 -8 16 -16 24 -32 39 -46 55 -64 79 -95 111 -131 153 -178 206 -238 275 -318
31 -318 361 -412 466 -528 594 -670 754 -842 942 -1048 1165 -1296 1436 -1592 1758 -1943 2140
48 2140 -2361 2599 -2864 3153 -3475 3830 -4227 4672 -5171 5743 -6400 7168 -8070 9159
62 9159 -10495 12184 -14394 17429 -21872 29091 -43494 136645 -349191 6267 161256 -513945
74 -513945 220015 119829 -158991 329193 -53730 -144508 150923 -271677 63780 123736
84 123736 -199480 213212 -1408 -154645 234527 -175190 -35618 195617 -282772 106661
94 106661 124474 -286744 297975 30307 -285942 289117 -140238 -223952 306574 -152247
104 -152247 -23620 269109 -209357 6976 58427 -201616 131162 5529 -47276 183953
114A83953k98985J07684O9157k80632L42263q0929j85376L89214l12860n4042
124a20553L47824m39398J42012K95030m44193K78634J38774l97272L24550m7859
134G7549k86460K95089j21232n9098K34217j61533O7684M5463k04779J32754p7736
145e8082m1128K30566j60843O0006J07698k76800J56945J5940k24698L26098p3438
156F2264k07410L21874k07510j25864L23412k23702l5640K39011k12133J6574
166d9124J19951j22907Q4345r059n4056N8159j00250P3732N4163j17539J35222
177G2637l3456j35233J45482j02572k1516K02353j62941L1260J22739k42391R3143
188c0495J05695k05718J70603P8715j99735J22734k61j34995J04033m921l9710
$$ plain form
114 183953 -115032 -7348 61809 -218823 123440 42511 -142865 246349 -66511 -120553
124 -120553 227271 -212127 -70115 224915 -219278 59356 198130 -199142 125408 77549
134 77549 -208911 86178 -35054 -94152 140065 -21468 46216 91679 -113100 19654 -58082
145 -58082 -99210 131356 -29487 30519 138217 -138583 18362 34302 -190396 135702 62264
156 62264 -145146 176728 -30782 -156646 166766 -56936 -92576 146435 -65698 -49124
166 -49124 70827 -52080 32265 23206 -30850 27309 -72941 791 54954 -62585 72637
177 72637 39181 -96052 49430 -53142 -74658 127695 -35246 -3986 118753 -123638 -30495
188 -30495 75200 -130518 40085 118800 -80935 41799 41538 -93457 10576 5655 -34055
199c4055N7421o045R025k9547j0021N1020q6702K5666O8191j14063R8599N3400
211H2889j50704J15084k493j58476J50994k3499j07997J92584o0668j01741J37331
222G3304r3504n2176J17757o4627J434P6245o1526l789L916j2185K2066k0974
234a4059L4693j0537m5214P0270m5381l9639J21316q3300l5570J19777j31603
245e9247J5969J40056j45261L5783R8696j63635M7319P7345j09850Q9765M3012
256F9952r5635K6206j6670k3820K7847P312N1019k2449k9783M1032r5976J1113
268d9852J02608r4827O1372N9063j44182Q6592J2078j31071J49828j5884j14564
279g8839J50652p4174p1849J54093q4685l4409R6793q2979k795M1759l1227M1613
$$ plain form
199 -34055 23366 17321 26346 -3201 -13222 37798 -48904 -23238 44953 -69110 29489 82889
211 82889 -67815 47269 44776 -113700 37294 13795 -94202 98382 37714 -64027 73304
222 73304 -20200 -72376 45381 -19246 -17812 58433 -3093 -6882 -2966 -15151 6915 -14059
234 -14059 20634 10097 -35117 35153 -10228 -49867 71449 -11851 -47421 72356 -59247
245 -59247 -43278 96778 -48483 -12700 85996 -77639 -30320 47025 -62825 26940 69952
256 69952 -25683 523 -16147 -39967 -12120 -4808 46211 23762 -6021 35011 -60965 -49852
268 -49852 52756 -42071 19301 78364 -65818 20774 32852 -98219 51609 35725 -78839
279 -78839 71813 -2361 -74210 79883 -4802 -39211 57582 -25397 -28192 13567 -17660 23953
291B3953j5831O389J1150q5829P5630J702q6440J36892m3361q8291J44611j09212
303b8637m9103J69336j32636P928J30296j59460N1987P3999j41319R1540K9193
314D3124r3736Q8700l9208l2256P1961o6840L2684J4288o2928Q2912n0355k6642
326c8296J10717j11047K3378Q6456j69150J01216O9143j69186J55338O409j64859
337i9881J57015n4363j04480J71718o7309l3563J01432j03869K1126L0958o9256
348e0472Q0737k6475k2172P3670j03256L9069O2245j20094J08136m131j24259
359h7002J52206o8318p8647J81666j16507l0652J46178j70568L5034J17682j50623
370f9551Q9873M3645j26748R4638k6907o0607R8221n4551J4737L7136q8723P6584
$$ plain form
291 23953 8122 14511 25661 -60168 15462 17164 -69276 67616 24255 -64036 80575 -28637
303 -28637 -77740 91596 -41040 -33112 97184 -62276 -10289 63710 -77609 13931 43124
314 43124 -50612 38088 -1120 -33376 38585 -28255 4429 18717 -44211 38701 -11654 -38296
326 -38296 72421 -38626 -15248 71208 -97942 3274 72417 -96769 58569 64978 -99881
337 -99881 57134 2771 -101709 70009 2700 -30863 70569 -33300 -12174 18784 -50472
348 -50472 30265 3790 -18382 55288 -47968 -8899 53346 -66748 41388 37257 -87002
359 -87002 65204 -3114 -81761 99905 -16602 -47254 98924 -71644 -36610 81072 -69551
370 -69551 20322 63967 -62781 31857 4950 -55657 42564 -11987 2750 39886 -48837 27747
382B7747k6209n9664J25069q8683j2114J22970j53683M1805J04832j69486J03769
393A6353M9176j59446J42945j1845j20315J43779n9623n7854J13976r0543J2789
404b0608P0684q5629N6738p371n7868Q1264o2708j188Q0412r4940N6517L1481
416D6784j21417J11070j7751r6463J49449p5689n8882J51811j24404j6715J37855
427H5648j32018K8787Q3559j23659O0415K9617p1994P0002k5748j7948M5078p4000
439d2261M3158K8271p2474R0073l2481o5826J03767p9920j4269J11296j05101
450c5767L5565O9618j45173P8649M3578j21253J17304j671r9402J03881m5773
461d44n5542R3475m7000K686M2460o3291L8019q543l3352O6397n1425M771N7996
$$ plain form
382 27747 1538 -58126 66943 -21740 -33854 89116 -64567 -22762 82070 -87416 16353
393 16353 65529 -93917 49028 37183 -83132 60647 1024 -56830 57146 -33397 -20608
404 -20608 50076 -35553 21185 13814 -44054 37210 -25498 -26686 53726 -41214 15303 46784
416 46784 -74633 36437 18686 -77777 71672 -4017 -62899 88912 -35492 -52207 85648
427 85648 -46370 -17583 65976 -57683 2732 32349 -39645 30357 4609 -13339 31739 -42261
439 -42261 897 29168 -43306 46767 14286 -51540 52227 -27693 -41962 69334 -35767
450 -35767 -202 69416 -75757 2892 46470 -74783 42521 40850 -58552 45329 -444
461 -444 -55986 37489 -9511 -6825 35635 -27656 10363 1820 -31532 34865 -16560 -11789 46207
474D6207r3496M5215M2928r6628R0438n639r6895J14136m6527o2121J23876p1504
486a0010k4072R7778r8469Q570O7271p8795M4168J7211m9814N1221l1605j2287
498a8833M2850n1008L7463J3816o6285P1812k3874m7077Q9543o5624j0588Q6586
510E8781r8664K4778P0247j06854O3515L4907j06021Q1809K728p4070P9706k1670
522I192l2596N1707m2814O202J9198l0702M7821k8933j8174N7769o8387J2132
534a7585N5482p5144N1071K5234q7704P1542j1541o2555R5061m7823l0763Q8235
546E3510p6923n918P1606p0090K5006L5488o1526L4142k312k0062L4833l1120
558a3366K1462J3277n6737M9648q369m5818Q0153m0743l1022P8268p0458l04O5356
$$ plain form
474 46207 -47289 -2074 40854 -55774 34664 29025 -67870 46266 -261 -62382 61494 -10010
486 -10010 -34082 63696 -34773 -26203 41068 -37727 6441 23652 -26162 25059 -6546 -18833
498 -18833 24017 -26991 10472 24288 -41997 29815 5941 -41136 48407 -17217 -27805 58781
510 58781 -39883 -15105 55142 -51712 11803 46710 -59311 22498 25226 -48844 30862 9192
522 9192 -23404 28303 -14511 -8309 10889 -19813 28008 -925 -19099 38670 -29717 -17585
534 -17585 37897 -37247 13824 39058 -48646 22896 11355 -51200 43861 -3962 -34725 53510
546 53510 -23413 -29331 42275 -27815 -2809 32679 -28847 5295 2983 -17079 17754 -13366
558 -13366 8096 21373 -35364 14284 5915 -39903 40250 -493 -31515 46753 -23705 -24009 41347
571D1347p6845L5673M1273q2455N1819J1254o0170N9794j5557k9175M6883l0907
583g066K156J6088k8801L4003j7015j8417M8979m5220O676M3659o9088L6922K7892
596C0768o9800N8127q22n6543P3876l3403l8037P3267m9755q955N5849n4143J6178
609c393K8325m4473K4246j352j3582K6260k9448J4532J5640m4598M6245r804m1149
622c2551O5505l3660l1852O5909m9459j692N5499o2818K3369K8991o0819L9533
634E955O218m0327N2453j8710k5726L7211k8023M038J7167k4282K9096j4410j4584
647a3924L4676m2703J3412M3074o2349L1135K6997o9197M9917O266n3728O3084
659B6660j6340l8356N3887l3604j0306M5801m1912J0173K3171l6111K1819p65
$$ plain form
571 41347 -35498 175 41448 -41007 10812 22066 -38104 21690 6133 -23042 23841 -7066
583 -7066 -4910 11178 -17623 16380 -635 -19052 29927 -15293 -8617 35042 -34046 2876 30768
596 30768 -39032 19095 18273 -38270 35606 2203 -35834 37433 -12322 -21277 34572 -19571 -3393
609 -3393 24932 -19541 4705 3353 -10229 16031 -13417 1115 16755 -27843 18402 8598 -32551
622 -32551 32954 -706 -32558 33351 -16108 -17800 37699 -25119 -1750 27241 -33578 5955
634 5955 12173 -28154 24299 5589 -20137 17074 -10949 -6911 10256 -14026 15070 660 -13924
647 -13924 20752 -21951 -8539 34535 -27814 3321 30318 -38879 11038 17304 -36424 26660
659 26660 10320 -28036 25851 -7753 -18059 27742 -14170 -3997 19174 -16937 4882 4117
671D117j5605K7916k1964K866J6235l5110L1643J962l8152M9918j8780l0328N2596
684B7314l6646j2042N3973m9048O976L8557n2591K5250J7949m7071L8022O00l1378
697b0135L2454j3582q299K3560k4198J2422L624k1249L0560k0980r496M1347l8233
710a2205J042L7355n0645K1186K9729n4505L5794J1863m7715M1633q551k9261
722b4280M5991k1694j4994L4555l1606N202K0826k8772K1279K231j8994K0332
734A0076j8686J995K3304l1957K0899J0528m0879L9895p613l6857N5320k2002
746D023k7941N1767l8021q117M7698m5659J1262L0074m5019K4401N479l1248L4912
759A3611r848j5022K8055k6812Q139J4762l2946L0537l251k6468M1191k7359j3313
$$ plain form
671 4117 -11488 16428 -5536 -2670 13565 -21545 10098 12060 -26092 23826 5046 -25282 27314
684 27314 -9332 -21374 32599 -16449 -9473 29084 -23507 1743 19692 -27379 10643 11243 -20135
697 -20135 12319 -1263 -9562 13998 -10200 2222 5846 -15403 15157 -5823 -15319 26028 -12205
710 -12205 -11163 26192 -24453 -3267 26462 -28043 7751 19614 -28101 13532 4981 -24280
722 -24280 21711 17 -14977 19578 -12028 -6826 14000 -14772 6507 8738 -10256 10076
734 10076 -8610 -6615 16689 -15268 5631 16159 -24720 15175 7562 -29295 26025 4023
746 4023 -23918 27849 -10172 -18289 29409 -16250 -4988 25086 -19933 4468 9947 -21301 13611
759 13611 3763 -11259 16796 -10016 -1877 12885 -20061 10476 7225 -19243 21948 -5411 -18724
772a8724M6782m3929M800L9248n2300K6824J9285n2763M3103J92l9737M7471k0315
785f3j9634M3383l4991J132K7801l3889K2853O78k5291L5249k3353o671L5690
798B2894m2966J8722K7147n5877L9814P838m9462N3659j6804l3041N7381l6237
810f932j1830M7569m8164J5728K8396m9906L4098L802l5231L9108j9216j1172
822a3750L6318l5370J2550J6930m0075L7298q286l0599N1783l1001j3169M7678
834C0307n0465J1363L8810n7367L2626J6355n0432M5464j0366l1854M8357k6727
846c929q264L3456l8408J7923J3587l6437L6567j1966k0443M1725l7119J705L7554
859B5951m8304K3825J9033m9298M3929n579l8257N2294k6549j6269M5457m1817
$$ plain form
772 -18724 28058 -15871 -11071 28177 -24123 2701 21986 -30777 12326 12518 -27219 20252 -63
785 -63 -19697 23686 -11305 -10173 17628 -16261 6592 7270 -18021 17228 -6125 -12796 22894
798 22894 -20072 -1350 25797 -30080 9734 17572 -31890 21769 4965 -28076 29305 -6932
810 -6932 -18762 28807 -19357 -3629 24767 -25139 8959 12761 -22470 16638 -2578 -13750
822 -13750 22568 -12802 -252 16678 -23397 13901 5615 -24984 26799 -4202 -17371 30307
834 30307 -20158 -8795 30015 -27352 5274 21629 -28803 16661 6295 -25559 22798 -3929
846 -3929 -12193 21263 -17145 778 14365 -22072 14495 2529 -17914 23811 -13308 -11603 25951
859 25951 -22353 1472 20505 -28793 15136 9557 -28700 23594 -2955 -19224 26233 -15584
871a5584P132L2339m5088K4481J0417l4429L4754j3229j5400L2037k7939Q256
883b253J7033l5020L1323j005l3526M3356k2042j7425M6246l8604Q77L6754m3561
896a7847J8091J6745l9913L4903l881k7628L8051k2144p030K9662l2482J1642
908a831J6654k9936K3792m535j8866L1589k4091j497K8130l5023J8006J3696l8849
921b2761L2205M05l1206L8210j6289j5597L4564k9615J740K4200k8594J5896N828
934H986k3768K4040r617j0489K3639k2052Q380J3791k9667K2109J801k4064L0883
947A3972j3551j5245L2854k6010j186K4789k9232J5391J0547k8150K3989l178
959D990j9317K6038j4544n529K2780k2165O268R749j8425J6751n660j0078K1640
$$ plain form
871 -15584 -8452 23887 -21201 3280 13697 -20732 14022 793 -14607 17430 -10509 -2253
883 -2253 14780 -20240 11083 10078 -23448 19908 -2134 -19559 26687 -11917 -11040 25714 -17847
896 -17847 244 16989 -22924 11979 8098 -19530 18521 -3623 -10653 19009 -13473 -1831
908 -1831 14823 -15113 8679 4144 -14722 16867 -7224 -8721 19409 -15614 2392 16088 -22761
921 -22761 9444 9849 -21357 16853 564 -15033 19531 -10084 -8344 15856 -12738 3158 8986
934 8986 -14782 9258 -359 -10848 12791 -9261 -881 12910 -16757 5352 7153 -16911 13972
947 13972 421 -14824 18030 -7980 -9166 15623 -13609 1782 12329 -15821 8168 4990
959 4990 -14327 11711 -2833 -8362 14418 -7747 -1479 8270 -10155 6596 936 -9142 12498
972A2498j7359j56J8433k6765J4786J2004k9558K3112J502k2894K5041r997j1720
985a1073K4095j6659n86J4578k0551J3201L527j7930J9339o256r819J8507j5675
998e302L23J5774j9720J0626M447j7448J9985q090j2324K3665j5526l738K0471
1011A3143k2510O004J5351k3957J3709M972j6645J7432p086r184J7087j2510M65
1024c729J1488j6242J1756K255j6094J7188p022p188J8428j5966j10J7329k0746
1037h653P721J0190k0625J7092K04j6789J8717p581p821J8525j6372J839J4732
1050A1179k0034J0180N861j7045J5957l478j0700J6646j0425j849J2385j7605
1062h928J0928O128j9955J8996l821j4643K2407j2584q334K2120j6851rJ4860
$$ plain form
972 12498 -4861 -5017 13416 -13349 1437 13441 -16117 6995 8497 -14397 10644 647 -11073
985 -11073 13022 -3637 -4223 10355 -10196 3005 6532 -11398 7941 1685 -8134 10373 -5302
998 -5302 -4979 10795 -8925 1701 6148 -11300 8685 595 -11729 11936 -3590 -7328 13143
1011 13143 -9367 -3363 11988 -11969 1740 6712 -9933 7499 413 -8771 8316 -4194 -3729
1024 -3729 7759 -8483 3273 5528 -10566 6622 -400 -7588 10840 -5126 -5236 12093 -8653
1037 -8653 -932 9258 -11367 5725 5929 -10860 7857 276 -7545 10980 -5392 -3553 11179
1050 11179 -8855 1325 7186 -9859 6098 2620 -8080 8566 -1859 -3708 8677 -8928
1062 -8928 2000 8128 -11827 7169 3348 -11295 11112 -1472 -9806 12314 -4537 -4546 10314
1075A0314j9644J1258M321j6894J7871o008r273J8985j6618m30J8144k1144R075
1088d3Q767k0256J7087k490j4299K0189j1405m040J8342k1136P155J3537k4462
1101a3054J6843K950j9745K2723q219j3019K2876j5352j806J6789k0923J1449
1113A512O956k0883J9321m776j2563K2668j5915l489K0734k2752Q289J1255k3209
1126a2852J9553k50j9041K3038j1440p532K1376k0366M511J5600k4281J5561L167
1139G044k0679K4428r168j2983K4308j7376j609J8653k3443J1556R151k2046J9656
1152G492n270j3703K3775j6650m010K2607k3370P360J3046k4710J7748J539j8105
1165a2251K1773j0930o022J9240k1066O032J4761k4139J6796K739k1366K4070
$$ plain form
1075 10314 -9330 1928 6249 -10645 7226 1218 -8055 10930 -5688 -6118 12026 -9118 -43
1088 -43 8724 -11532 5555 3065 -11234 8955 -2450 -6490 11852 -9284 -2129 11408 -13054
1101 -13054 3789 6739 -13006 9717 1498 -11521 11355 -3997 -5803 10986 -9937 1512
1113 1512 8468 -12415 6906 2130 -10433 12235 -3680 -7169 13565 -9187 -898 10357 -12852
1126 -12852 6701 6451 -12590 10448 -992 -8524 12852 -7514 -3003 12597 -11684 3877 7044
1139 7044 -13635 10793 1625 -11358 12950 -4426 -6035 12618 -10825 731 9882 -12164 7492
1152 7492 2222 -11481 12294 -4356 -8366 14241 -9129 -1769 11277 -13433 4315 5854 -12251
1165 -12251 9522 -1408 -7430 11810 -9256 -3224 11537 -12602 4194 6933 -14433 9637
1177I637q437j3151K3498j5733m85J6170k1999J1581O743j9961K0088o124j2463
1190a0636K3027j6395l374J9647k0645P802J1021k2526J7436J4j6466K1121j1638
1203a612n528J9518j9747M318J4015k1742J4116L550j8517K0248o550j1209J8633
1216I493j3559K67J3588j8042R765N071j6001J6591o942r173K0223j5963m97J6012
1230A0833j9744Q970Q929k0694J6132Q21j5249J8054r732m847J6209j5899L981
1243b236J0249j6615J1846J183j4710J7170o642p276J5338j2782K162R608j5583
1256h288J0055K831j3465J6464p261r177J9135j4256j726J4978j5637N958P959
1269G570j5905J0721P78r438J2970q781j057J0958j3762O036N478j3227J2888
$$ plain form
1177 9637 1200 -11951 11547 -4186 -4671 11499 -10500 1081 7824 -12137 7951 1827 -10636
1190 -10636 12391 -4004 -7378 12269 -8376 -574 10447 -12079 5357 5371 -11095 10026 -1612
1203 -1612 -7140 12378 -7369 -3051 10964 -10778 3338 6888 -11629 8619 2069 -9140 9493
1216 9493 -4066 -3799 9789 -8253 1512 6583 -9418 7173 231 -8942 11281 -4682 -5179 10833
1230 10833 -8911 59 8988 -11706 4426 5247 -10002 8052 -1680 -6527 9682 -6217 -2236
1243 -2236 8013 -8602 3244 4427 -10283 6887 245 -7031 8307 -4475 -2313 7295 -8288
1256 -8288 1767 4598 -8867 7597 336 -8841 10294 -3962 -5688 9290 -6347 -389 7570
1269 7570 -8335 2386 3164 -6274 6696 -2085 -3142 7816 -5946 90 5568 -7659 5229
1282E229j862j1574J5480q525m326J4395j4509M757R310j6370J0485K288j3497
1295h719J5224n171r258J6371j0750k055J1369j2660N894M774j1176R331k040
1308A134o206J1181r958J768R193j3858Q250L444j3832J4256k869j1763J6724
1321G464q237n440J4282j3125K616R417j3553Q044J814r851J2001o260n088J2738
1335F822j0905K612P830j3093R043J336j0665J2389n712m529J3641j3688K298
1348b621J1535j7085R041N928j5786J4113n30j2836J4015n630n357J2051j0251
1361c413K857N690j0438Q362k248o124J2565r338k086J2006j4168N800P827j5815
1375h523J2605M09j3239J5203p018o257J6028j2985J29J2492j5864O824N941j3682
$$ plain form
1282 5229 3367 -8207 7273 -1252 -5578 8817 -5692 -935 8375 -7995 2490 4778 -8719
1295 -8719 6505 1334 -7924 8447 -2303 -4358 7011 -5649 245 5019 -6157 3174 1134
1308 1134 -5072 6109 -3849 -2081 7112 -6746 1504 4948 -8884 5372 2503 -9260 7464
1321 7464 -773 -6213 8069 -5056 -2440 6977 -6576 1468 3282 -6569 5432 -828 -5916 6822
1335 6822 -4083 -1471 6359 -6734 2309 3645 -7020 5369 -343 -4872 8769 -4919 -2621
1348 -2621 8914 -8171 870 6798 -8988 5125 4595 -8241 5774 144 -5213 6838 -3413
1361 -3413 -556 5134 -5304 3058 810 -5314 7251 -2087 -4173 7833 -6335 -535 7292 -8523
1375 -8523 4082 4491 -8748 6455 -563 -6820 9208 -3777 -3648 8844 -7020 -196 5745 -7937
1389g937J2055j415r163J1748p268j018Q798j1599O904L032j1523J2961n617p472
1403g514J6236j1459k726J4790j5822M590J0354j7424J0509M014j3574J2460l248
1416A186p094J2428r235J11Q446j1439P443J592j0313J2283m951n665J1863j0532
1430c877J831R694j4795R003L941j4815J5052l799j1185J8104r579o648J5879
1443H806j2716L50J1431j3038N641L802r433Q363l771k589Q964r249L083N188
1457D832j1664R810J74j1138J4387n528p440J3887j1390j3J2190j3951N323P130
1471F609j4091R982O10j0608J2415l874o106R823p521M87O414q277N749M54o634
1486d568Q886o877q97J0108j1309L788P124j3574R069L815j4356J3358j353j1008
$$ plain form
1389 -7937 4118 2703 -6460 5288 -1980 -2998 5800 -5799 1105 4137 -7386 5575 -42 -7514
1403 -7514 8722 -2737 -5463 9327 -6495 -1905 8449 -8975 1534 5548 -8026 4434 1186
1416 1186 -5908 6520 -2715 -2604 5842 -5597 1846 3438 -6875 5408 457 -5208 6655 -3877
1430 -3877 -2046 7648 -7147 1856 5797 -9018 6034 2235 -8950 9154 -425 -7073 8806
1443 8806 -3910 -3560 7871 -5167 474 4276 -5157 3206 -565 -3154 5810 -3439 -356 4832
1457 4832 -6832 2978 3152 -7986 6401 873 -6567 7320 -4070 -4083 8107 -5844 -521 6609
1471 6609 -7482 2500 3110 -7498 4917 1043 -5063 4760 -2761 -2274 4140 -4137 1612 2066 -4568
1486 -4568 4318 -2559 -3456 6652 -4657 -869 6255 -7319 1750 5565 -8791 4567 3214 -7794
1500g794J3488n674n225J1459q035q14P472q260M095J621o379P221l252k534O738
1515D127p223K851M600r122O959L41q046J0527n602m574J2665j0052r32J0597
1529G116j2538L736Q794j3020O588M188j0431P637r65m745O810l537p01L557n973
1544c484N238p30n526R266n456k967R225r757J780Q529j1107N145M654j1500R122
1559B432K39r343J1647l888n773R565p153j230Q365p594K376L518o255M990k598
1574g02j389N726n784K841K545q804Q271R3r423J2257m446p028J2606q601l334
1589e172J2672j0324L21Q534j0477M490L657q232O969j276l669N492n336J956
1603c95L490o317N439p43n368Q247n965j874R314r502K719O308j1937P545L986
$$ plain form
1500 -7794 5694 20 -5205 6254 -1781 -2595 4877 -3383 712 2333 -4046 3175 -77 -2611 4127
1515 4127 -3096 -245 4355 -4767 2192 2533 -5513 5014 -588 -5162 7503 -2549 -3481 7116
1529 7116 -5422 -1686 7108 -5912 676 4864 -5567 2070 1105 -3640 3170 -367 -1068 2489 -3484
1544 -3484 1754 1024 -4502 4764 -692 -3659 5566 -4191 -2411 6118 -4989 156 4810 -6690 2432
1559 2432 2671 -6672 4975 1087 -4686 4879 -2274 -3504 4861 -2733 -357 3161 -3094 1896 -702
1574 -702 -2091 3635 -2149 692 3237 -5567 2704 2797 -6626 5631 1185 -5843 6763 -1838 -5172
1589 -5172 7500 -2824 -2503 6031 -4446 44 3701 -4531 2438 1162 -2507 2985 -2351 -395
1603 -395 3095 -3222 2217 1474 -3894 4353 -1612 -3486 5828 -3674 -955 5353 -6584 961 4947
1618D947j2106J0912q00r214J0782m779m812R724n769n91M346n826M167o81l115
1633b815O495o107J523N389r921N878L910j0694J0052q53r151J2033o995m067
1647e323J2164q600O5P304j0745M152N583q990P208m91n257O033m581K73L928
1662B723m912N049k376m426Q279o012j876J0475j0630K184P786j2684O776N077
1676E433j1323R162L8r459R535l113m361Q037m600L24L433o339M813j374l082
1691b876O663n008p45O817r632N184K926q818R483k788p423J1162n149n157J2349
1706F988r394k85Q847j0696L395M865p451N431k95m651N629l730Q81K682n447
1721c231O394k218n882R376n820k410J0590j0028P15R108j2037M589O330j0567
$$ plain form
1618 4947 -7159 3753 2953 -6261 4521 -258 -5070 4654 -1115 -1706 2640 -3186 981 300 -2815
1633 -2815 3680 -2427 -904 4485 -5436 442 4352 -6342 3710 2857 -6294 5739 -1256 -5323
1647 -5323 6841 -1759 -1694 5610 -5135 -983 4600 -4390 2818 2327 -2930 3103 -1478 -1205 2723
1662 2723 -2189 2860 484 -3942 4337 -1675 -3551 6924 -3706 -1522 6264 -6420 356 5433
1676 5433 -5890 3272 3310 -6149 3386 273 -4088 3949 -651 -327 3106 -3233 1580 206 -2876
1691 -2876 3787 -1221 -1966 4851 -4781 403 3329 -5489 3994 1206 -6217 4945 -204 -5361 6988
1706 6988 -2406 -2691 6156 -4540 -1145 3720 -3731 1700 1405 -3246 2383 -1347 -466 2216 -3231
1721 -3231 3163 945 -4937 4439 -1381 -3791 6799 -3229 -2514 6594 -5443 -854 5476 -5091
1735e091P650P33q798Q514k849l499P616n403K87M065o510L916K88k693N391n041
1751a424L06M477p659N113K823r124R396j505r513J1625m340n378J1568p513k674
1766c822Q710p785R63N394o108L979J39m407M262k621P79L212n345L823M71n868
1782d224O684k325l576Q706p380p69P822q837K714O446r685N337L020r282O627
1797A278N33n415O571k603k570M145k679K38J339j928L512l149r44M570n955L437
1813C80L649p977N402J844q585P551r2o883R117l356n091P651m506j552O384m713
1829g77L11L123n090K221R75j895L036k055m6R24l381L649k46l121N933l574l421
1846c434O953n968K98P249p558R50N862q292K464M682o352M177J281n048K878
$$ plain form
1735 -5091 2559 3292 -5506 3008 159 -3340 4276 -1127 -840 3225 -3285 631 919 -1774 3617 -1424
1751 -1424 -1118 3359 -4300 813 3636 -5488 3908 2403 -7110 4515 175 -5203 6365 -1148 -3822
1766 -3822 4888 -2897 -1934 3460 -2648 1331 1470 -2937 1325 -1296 -517 2695 -2650 1173 1644 -4224
1782 -4224 2460 135 -3441 5265 -2115 -2884 4938 -3899 -1185 5261 -4424 913 3933 -5349 1278
1797 1278 1811 -3604 2967 364 -2206 1939 -740 -502 837 -1091 2421 -728 -1672 2898 -3057 380
1813 380 4029 -3948 1454 3298 -5287 2264 2172 -4711 4406 1050 -4041 3610 -896 -2448 3936 -777
1829 -777 -466 2657 -2433 -212 763 -1132 1904 -151 -197 727 -2654 995 749 -2372 3561 -13 -3434
1846 -3434 3519 -2449 -2151 5098 -2460 -1510 4352 -3940 -1476 3206 -3146 1031 2312 -2736 142
1861A42l10j283K551j124P72l01k402K942j932l4M399m891P21L479o126L298L166
1878C067o654N721N03p085O750j543m397P505l205l644N928l661j336M315k912
1893f48O04J101k048J439j712J541J214l333L504O1n150N707k048l886P932m541
1909b63k615O528n574j40N990o137J793L945o176K548J493l609L640o80j767J800
1925G76j831O49O75j751L685k473j115L607n297K098M681o701L245K929p489N032
1941G20J423o629P172p53n421N246j876k620M852k113n25J372j884R98q87L04
1957f21K783l181J667J089m972M497L78m608O262k697l945O234m267q11O465n843
1973a570K95M458n757J793L233m515K921R89l221J560p31M90O65j489K496k126
$$ plain form
1861 142 -168 -1451 1100 -24 748 447 -1955 987 -945 -979 3420 -1471 -750 2729 -3397 -99 3067
1878 3067 -3587 2134 2637 -4448 2302 759 -3638 3867 662 -2982 2946 -715 -2051 2264 -648
1893 -648 -44 1057 -991 448 -1264 277 1491 -1842 1662 1723 -3427 2280 232 -3654 4278 -263
1909 -263 -2878 3650 -1924 -2064 3926 -2211 -418 3527 -2649 -101 1392 -2217 1423 743 -1024 776
1925 776 -1055 -406 269 -1482 2203 -270 -1385 2222 -3075 -977 3704 -2997 248 3177 -4312 720
1941 720 2143 -4486 2686 1933 -3488 1758 -118 -2738 2114 1 -524 848 -1036 -38 -925 -621
1957 -621 2162 -1019 648 1737 -3235 1262 1640 -2968 3294 597 -3348 2886 -1381 -2192 4273 -1570
1973 -1570 -1275 3183 -2574 -781 2452 -2063 858 1847 -1374 186 -545 -55 610 -879 1617 -509
1989e09j294L998m115L39N738o319J291L939o703L644K732n777M558O55n374M510
2005A313j178k445M543k172r05J727k020P55K14n13K237k178N50J153m342M335
2021A074N42m400N392j764m233N992l266k559P258m433j209M624n381J017L502
2036B156l409J777J082k553J292r19M83J299j636K016j591k106M127l198j56M936
2052C600m679k14M192n945K760L541n590L864M50m870M164r94k285M491k232j379
2068a126K615k562P04O20p18J235j695J373K38l102K595K232n190M152k7m397
2084c053N659k432l433O258k543k998M961m200M05L347k970J054R91k369J513
2099A90o92j23J776j720J271m11k174L202j823r10M461m259j83M305n918K114
$$ plain form
1989 -509 -1803 2195 -1920 -1581 4157 -2162 -871 3068 -3635 9 2741 -3036 1522 2177 -3197 1313
2005 1313 135 -2310 2233 61 -844 883 -1137 -382 -168 -681 1556 -622 -72 1081 -3261 1074
2021 1074 1616 -2784 2608 844 -3389 2603 -663 -3222 4036 -397 -1606 3018 -2363 -1346 2156
2036 2156 -1253 524 1606 -947 345 -574 -91 1208 -428 1588 -3 -2109 2018 -1180 -1336 3600
2052 3600 -1079 -1293 2899 -3046 -286 3255 -2335 1529 1979 -2891 1273 279 -2006 2485 253 -1126
2068 -1126 1489 -1073 -369 251 -467 768 -927 446 684 -2418 177 2409 -2781 1371 1344 -3053
2084 -3053 2606 174 -3259 2999 456 -2542 2419 -1781 -1376 1971 -999 55 1046 -1323 190
2099 190 -502 -625 1151 -569 702 291 -1883 1319 -504 -1414 3047 -1212 -1395 2910 -3008 -894
2115h94M541o228L406J726n876L779J065l746L891n93k457K304j384k51J455q48
2131a10J644j920n73K374l230J659K533m277K795Q36n291M919j1m021N428k287
2147D68l271M823k894r60M347l361O39J661l385K147J45q71J651j632L90L72k121
2164a852K715m10j983L933l068j783N349m524K50M760n094J015L475n581K386
2179d12K639m212K949N7k634K194q57m00J696j226Q32k59j830K461j598K53K206
2196A859l459J884J166m022L263O11l737M678j230m154N306k080j993M641k626
2211A07j271K720k617J27J616q55Q54o20k51P51k195J981P24k403L083j556k867
2228b672M382j976j174M381l562m93L171m152J471K813l445J932N56l492K417
$$ plain form
2115 -894 3647 -2581 825 2551 -3325 454 1519 -2227 1664 1071 -1386 918 -466 -717 738 -110
2131 -110 1534 -386 -959 1415 -1815 -156 2377 -1900 895 1731 -3560 1359 1348 -2673 2755 468
2147 468 -2803 2020 -874 -1834 2513 -848 -209 1452 -1933 214 359 -512 1139 -493 -103 269 -1852
2164 -1852 863 453 -1530 2403 -665 -2448 2901 -1623 -1373 3387 -1707 -692 2783 -2798 -412
2179 -412 2227 -1985 964 1021 -1613 581 -276 -676 1020 -206 626 367 -1463 998 -600 -347 1859
2196 1859 -1600 284 1450 -2572 691 1302 -2435 2243 1013 -3141 2165 85 -1908 2733 107
2211 107 -1164 1556 -1061 -934 682 -173 681 61 -190 561 -1634 347 1071 -1332 1751 195 -2672
2228 -2672 1710 -266 -1440 2941 -621 -1114 2057 -2095 -624 2189 -1256 676 1232 -2260 157
2243A57K48j326J765n97k94n2p35J117p87M75J997l336R54J968l776K336J676
2260A790l768K828N27m293L895j40k898M035j238k280K749j600l89J897j158J22
2276G9K20o36L98q40J100N88j755K001q73j989K610q16j225L466k795q88L199
2293A844k959J64L003l151Q58J934l384J057J745j940J135L86j014KO0L60p27
2310f27K92J765j886m83K070k606Q07K349k934J229J528l658K111J075k309K230
2326I53j25k477K230o09j237K385p45r71J385j072k42K73M39M08p77N51q8j355
2344a074J668o3j622K690j149k227K913j378j007L374k496m78K288k327K03J812
2360A127j440M20O22j404P09r7P8K63p42J015o10q46J414r48n1J888k052J2J792
$$ plain form
2243 157 405 -921 844 247 -47 -99 -834 283 -504 -29 1968 -1368 -414 1554 -2222 114 1790
2260 1790 -1978 850 1377 -2916 979 839 -2059 1976 738 -1542 1207 -393 -782 1115 -43 79
2276 79 299 -337 61 -779 321 909 -846 1155 282 -1707 903 87 -1138 2328 -467 -1355 1844
2293 1844 -1115 -951 2052 -1099 -241 1693 -1691 -634 1111 -829 306 692 -322 -320 -260 100 -627
2310 -627 -335 1430 -456 -939 1131 -1475 -668 1681 -1253 -24 1504 -2154 -43 1032 -1277 953
2326 953 828 -1649 581 -28 -1265 1120 375 -596 789 -283 -525 -252 187 595 -182 369 281 -1074
2344 -1074 594 531 -1091 1599 450 -1777 1136 -242 -1249 2125 -371 -849 1439 -888 -685 1127
2360 1127 -313 107 729 -675 34 -63 15 278 -464 551 -59 -905 509 -439 -490 1398 -654 -642 1150
2379A150k417J417Q87k649K145M82k478J809L25j938J851j10j422J203m67j8Q4
2396a46K49M57r16L01N40j781J815O46k518K203j78k666L027o13j848L126j621
2413G7j281K416k019J06K089j988R89N11j949R17J45m20R88k70j49K4j069J592
2431G09p88m74K301k077m54K212k785J072K453l056J052J360l171K049K90j770
2447a077J821k32j388J022o39N02O32j018J218r26o54J260j472Q40J430k377J333
2464B75L93k253K282K5k339L187j564j457K566j615k65K457k206M3J501j868Q40
2481BK09n53P89o45K62j43j103J848l58j349K488j609r28K683k729N05K621k860
2499h70N40J935k929J581O46k067K011k80j400J491j012j40J306j153M89Jj256
$$ plain form
2379 1150 -1267 150 1037 -1612 533 1015 -1463 346 671 -1267 584 474 -948 255 -212 -230 -146
2396 -146 103 560 -356 -55 485 -1296 519 1165 -1353 850 672 -1994 1033 420 -1428 1698 77
2413 77 -1204 1212 -807 -701 1388 -600 389 900 -1049 -132 13 -407 581 311 162 186 -883 709
2431 709 -79 -553 1748 -329 -783 1429 -1356 -284 2169 -887 165 1525 -1646 403 693 -1077
2447 -1077 744 512 -876 146 -493 9 641 -377 841 -85 -739 521 -951 -111 1319 -1058 275
2464 275 668 -1585 697 722 -1617 1570 6 -1451 1115 -500 -765 1692 -514 -471 1030 -838 2
2481 2 211 -342 447 -198 64 -79 -1182 666 308 -1041 1447 -162 -1090 1593 -1136 -631 1990 -870
2499 -870 -330 1605 -1324 257 903 -1164 847 567 -833 658 -354 -494 812 -341 148 149 -1107
2516a107J798r24L4J415j847N67P67k599K092O20k815L366q85j779K458j360j551
2533a750L092j861k31J951j716N54K09o76J302k068Q74P99j613J226N04k313K832
2550A115q22j351J880j477n40K151j867O84J389k496J070J573k507J823J05j707
2566i77J134j5p95J143m21o1o5k70P90o39p4J331j764O04J155k416J403J193k270
2585a014J566J14j793J878n59j251K045r74n70J167j266K40Q47o19L41l06k16
2602c70P47q11O59K82j009Q88k54j107J457m03n66J420j395k83J789j677J49J626
2620A142j744K99Q81j423Q88K50o01L21J82k64n9m03O46j18l28Q81r23lJ096j684
2640i64J061Q09j450O61M06j563J376P0j151J520o28q50J184m26n96J355j034
$$ plain form
2516 -1107 691 -233 -199 1216 -631 -64 703 -1896 196 816 -1999 1367 482 -1297 1161 -199 -1750
2533 -1750 1342 -519 -750 1201 -515 39 248 -428 874 -1194 -320 479 -1134 92 596 -1717 1115
2550 1115 293 -1058 822 -655 -1195 956 -911 -227 1162 -1334 -264 1309 -1198 625 730 -977
2566 -977 157 142 -653 490 69 8 -57 -327 463 -176 -250 1081 -683 -79 1076 -1340 63 1256 -1014
2585 -1014 552 666 -1127 751 192 -1059 986 12 -558 609 -657 -417 430 -189 152 -154 -370
2602 -370 377 -434 225 507 -502 386 132 -975 482 79 -487 933 -462 -745 1044 -633 -484 1142
2620 1142 -602 -303 578 -845 43 293 -308 13 195 -69 -128 -531 115 -3 -331 550 -373 -376 720 -964
2640 -964 97 906 -544 117 523 -1040 336 406 -745 775 147 -703 481 55 -541 814 -220
2657b20J81J58m72L64J05k3j22m81R54j8j194J013l41m55J160o11r96J684q35
2676a49l69J546j219j74R27q83M27K03m99O02k26q9o2l50L57m9m6L77n61J6M40
2697B19n46J59J019j632P85N99j759J124N97j323J014P5j197J057K60j315J040
2714A76k4l96L97j62p2J37j44L79k16m1K75p55J43Q22j052J093m30r12J179M6
2734D43n52Q19p90m3N01j028R0J113o89k72J296j987R15J36n62J151k12o3q7q47
2754f68J470j216K97P94j017o3O14m63o61J697j070N9M63r30J04J446j530N30
2772a44O00q21j01J1p6O90k96K7l01K50P00q17M20J39o12L00M27r10R82m06o65
2793f03J310q50m03J301j110k8J309j220J85M22o10L23j20kL16m79J99L70n92
$$ plain form
2657 -220 -39 119 -353 11 116 93 -29 -510 444 426 -768 245 -96 -551 609 -2 -998 686 -149
2676 -149 -518 1028 -191 -365 562 -321 106 309 -190 412 186 97 35 -315 42 -7 -53 324 -237 -221 219
2697 219 -327 -168 851 -781 4 603 -1156 -32 565 -758 256 331 -866 191 451 -864 176
2714 176 152 -244 153 -9 -81 56 -88 291 75 34 309 -446 -303 519 -533 560 130 -782 397 443
2734 443 -109 710 -80 -123 378 -650 -560 553 -136 -408 888 -1099 -184 -48 -610 541 329 266 179 -668
2754 -668 802 -414 -117 677 -340 -403 211 -252 -913 784 -286 -227 236 -694 -590 856 -674 -144
2772 -144 456 -365 -466 -455 -531 159 -137 -110 -411 -161 539 -278 142 281 -331 -31 396 -514 468 62 -603
2793 -603 707 -143 -546 755 -355 -383 926 -294 -109 313 -297 26 -94 -96 220 -259 -60 310 -282
2812b82L12j8n33J128n01o90J037p85K67O97r38J14P80j265P65L28p56P60k67
2831A53n57Q94o34J26K40l18K17l4m48N91l95o6P58j052O58Q3o64R06l39q02J184
2852E01m37n47R91l87l29Q14q37%P59j012N16J15n61R24n91k35N02m45K57K72
2872B70n91N87j09o30Q06m90j55J070j253N02M90r62P33n1p21Q48l33o01Q28l06
2892f8R0J80k24R7K57o38O93l77m14R94r33k7N41p68O07O09j069P73l25o13J006
2913C91m39k95P23o31K60K94o41M48K36o23N93l28l13M73l71J83M03q97Q66k81
2933E1o24Q75m48l14P84n05j54Q74r83J61N72o01K49L52m44N56k19k06M36p14
2953c02N36pn07M61k6l61K97k22j71O65m74J09K90p06L22M06m89K25J14m70P46
$$ plain form
2812 -282 30 12 -521 607 106 -584 453 -332 -65 632 -306 -192 588 -677 88 416 -340 420 153
2831 153 -404 490 -144 -18 222 -96 121 87 -361 230 -165 -231 527 -525 133 216 -448 458 119 -683 501
2852 501 64 -483 508 121 -208 606 -231 -231 528 -484 32 147 -414 510 -81 -316 186 -259 -2 270
2872 270 -321 266 157 -473 333 -157 -312 758 -495 7 497 -465 268 217 -504 344 11 -590 238 -68
2892 -68 22 202 -22 75 332 -306 387 10 -404 590 -343 -370 171 -597 10 619 -450 323 -2 -615 391
2913 391 -48 -343 380 -251 9 303 -338 110 346 -277 316 -12 -325 148 -223 -40 363 -534 332 51
2933 51 -573 302 -146 -460 324 -181 -335 539 -444 -283 289 -312 -63 289 -155 401 182 -24 412 -302
2953 -302 234 227 -280 181 155 -206 91 -131 -302 363 -111 -2 288 -418 -96 310 -179 46 160 -310 436
2974D36n11k67O71m66O9K50m59M00K36n66L54l84K81l4j75M67j89o08N35J66n94
2995c88P06j13m87O66n29K37L2l00K57J85l79K28K19n38L52j51j44K77j48J7K40
3016B39k78jk8k6M07l70k22N61m97O1L68o70N77K28o42M09L4m71M50j63j46M85
3038C05l16K00j92k57M94l83J66J29m63O17J2j35J2J8n52O80k75j66K26m9j65
3059i4L21n13K05J25m3O9M3j09J02pj17j26J58N0ONk1q4q5K57k31j27O43n41j16
3084b30K97m14L89P0k22J74l7j00J01J19k28J50k47k4J92q1o8K03j49J93p5j01
3106h8m1P8J83J84l65J66n9j52J17J3m81O94m81o5M80o8m2J37k55lP5J14K24j50
3130B15k24J10j75J6J24k77M87j93k17N89k83j06J96k48k32K21j1j15L69n38K68
$$ plain form
2974 436 -75 -342 329 -137 -68 182 -277 123 359 -207 147 -237 44 10 -165 302 113 -495 40 206 -388
2995 -388 318 205 -282 384 -145 92 124 -176 81 266 -113 115 334 -204 148 -3 -147 130 -18 -1 239
3016 239 -39 -40 -68 -94 313 -57 -279 282 -215 -154 214 -456 121 349 -293 116 150 -321 129 -34 -180 305
3038 305 -11 189 -3 -260 234 -149 17 146 -317 300 312 177 189 207 -345 335 60 -106 120 71 -94
3059 -94 227 -286 -81 44 1 70 113 4 106 99 -18 -144 14 64 70 75 54 -30 -115 142 -89 -216 427 -114 -230
3084 -230 67 -347 42 112 -110 64 27 -73 28 147 -81 69 -178 -202 -10 -91 -159 44 -105 88 13 -88
3106 -88 -129 -51 132 316 -49 117 58 -94 23 36 -445 249 -232 -297 183 115 73 210 -45 -48 27 141 365 215
3130 215 -9 101 -74 -58 66 -211 276 83 -134 455 172 66 262 14 -218 3 -8 -123 246 -292 -24
3151b4J51l84L05k67K09J98l99J70J84l15K18N7k70K12k16R9M2r4J53L35n49K87
3173A02k29q2K35k1l21L12p4k87L84l33K07L15m51M94j76m5R7k90K10P9k11J17
3195C2J82n07J03M47l6jl22l45O31k07J1R6n7k76L30k03K93l7j17K22j88j0J02
3218A43m89L18K8j04L35r6j52K6k61J00L66k31P2k7j65J90J02k24J89n6j67L21
3240B18k81J09J27k42L4J62k95L37j39j23J54l63L90J02m16J11K53k28M57j88
3260A79k82L23l23O3K1K03j55J53l08J06Pj94M99m08J16L03m10P6L30n20L69j11
3282C7k69K95L9l20K64L6j1J0n1m4K23m32J58K26k12J09j27r5O14l95j60L8k63
3305c30L77Q4j60J96j43j01O5k3Nk4k20L08K57l82K8M9j59N40m37K36k95J09K16
$$ plain form
3151 -24 127 -257 48 -219 -10 188 -211 -41 143 -172 46 103 -167 45 -171 -72 -30 -124 29 364 -185 102
3173 102 -127 -209 26 5 -316 -4 -78 -365 19 -314 -107 208 -243 251 75 30 127 -163 47 126 -85 32
3195 32 214 -293 -190 257 221 220 -102 -447 184 -23 -12 84 27 -249 81 -122 171 134 17 239 51 41 143
3218 143 -346 -28 0 -104 231 135 -17 9 -252 -152 214 -17 55 28 -137 53 155 -69 120 64 -103 218
3240 218 -63 46 173 -69 -35 127 -168 169 30 -93 61 -302 88 190 -226 -115 138 -90 367 179
3260 179 -103 220 -103 -40 -19 184 29 182 -126 -20 -13 -207 292 -116 0 303 -107 -31 299 -221 148 37
3282 37 -232 63 102 -218 46 82 71 81 30 -14 209 -223 -65 161 -51 58 -69 -164 450 55 -105 -67 -330
3305 -330 47 131 -29 167 24 -77 -12 -35 -30 -54 -274 34 291 -91 -63 -14 -173 367 -70 166 -129 -20 196
3328A96m31K42O4m3j4M13o19J3K92j99lK41j56r5j1J71J43m52K21K65j70k79O17
3351D06m20k04M05l97M03j35j40J76p5J1m2j38L35j06l61J08J07L8Q9p5J9R4r4
3374DJ18n3j18R9j24j01K16M2q2J5j14M4J70m70M44r3k65O61p07j9M37m25K81
3397d0K40k08N4K4k36K71k89J51K7m5R8K9J20m16P2J55k17M8L80nl40K19K35j74
3421A53q5l6j97K26j17J7L47r8j82J4r8J45J06k57m9L03l31J96q2O7J22l16J06
3444d6M9r4N5J4J24pk21J37j42J24M1R9k52K62J21j91J01r6q9K3j52K7J1J27m7
3469b2K53k02K30j95j98J75j60k8j24M21P8m93M1K80k46M1j03J026m85j04r13
3490g28O61L5j13K44m71L91k09M77k26J11j62J51o1Q1j61k12Q9m0J19r9K54k13
$$ plain form
3328 196 -235 7 71 28 14 427 -192 -179 113 -86 -89 152 -4 -99 -110 61 204 -248 -27 238 68 -211 406
3351 406 -14 -218 187 -210 193 58 -82 94 19 30 -12 -150 185 79 -282 -174 -67 -29 60 -15 4 98 4
3374 4 122 69 -49 50 -74 -175 41 83 1 16 -98 -54 116 -354 90 -3 -268 393 -314 -333 104 -321 -40
3397 -40 200 -8 46 70 -166 105 -184 -33 -6 -51 47 76 196 -220 -148 7 -210 -162 218 213 -127 92 327 153
3421 153 68 32 -165 61 -56 -39 308 210 28 42 -56 89 195 -62 -111 192 -139 57 -25 42 164 -152 -46
3444 -46 3 -91 -36 -22 102 95 -126 11 -131 -7 34 133 -119 143 264 73 174 78 -11 12 -140 -113 -102 25 -22
3469 -22 231 29 259 64 -134 41 -119 -147 -271 150 228 -265 -224 56 -190 -149 -252 774 289 185 -728
3490 -728 -67 -32 -145 99 -372 19 -190 287 61 172 10 161 100 181 20 -192 -103 -143 -24 -123 131 -82
3512h2j2K78j08l73K70K53l68K39j89K16r3j56J30K1r1J84K6m30L10K65k34p7
3534b1n5K87m22J36J40j4r7K59P1l61L6L1M8Ql48J12j43O08n5k98j40M59n48J
3558c06J58M34l31L89QM9o38J96K37j51R6J35n70L27J40n86N66m35O72j44l86
3579a40M09J15k40l19N39k66l19L2L24K29l37M4q3p93Q78N6J55m36k20R6N47l76
3601a05J5K44q5m62P94q91J100j118J75L87k52K7K63r0n97J35M61M91k37j170
3621i15N78P45o00K09l91Q87p97q03J009o60P62n29J94J47K73l8q25O82O9j31
3641a34j52M48j54l54N45K07p24Q6P3j70n9J70k86O96q8J16Q5l73K56r4j07OJ52
3664A45k04M5j2pj16k9M23o6j46j55K26k23K41N8j74O0k82J9K03J44m67K87k15
$$ plain form
3512 -82 -94 184 76 -297 -27 226 -142 97 -92 124 31 -125 5 26 -65 119 145 -285 25 290 56 -21
3534 -21 -76 211 -211 -75 65 51 -46 213 284 -77 -41 -10 38 46 -302 -190 -333 275 220 -78 -218 241 -307 -306
3558 -306 -148 286 -45 344 352 401 -237 -41 196 45 141 276 -294 33 173 -413 153 -282 390 246 -140
3579 -140 269 384 144 -175 364 98 -221 -189 135 364 27 71 -12 -805 73 129 284 -152 -372 -276 271 -105
3601 -105 -90 154 69 -393 401 -490 610 -508 -333 54 -198 -171 92 2 -595 -460 1 492 255 -915
3621 -915 -337 408 -192 17 -374 513 -284 -1087 -78 -738 24 -505 -311 -164 109 71 -754 -72 -3 -134
3641 -134 -286 162 8 -346 199 406 -318 -232 -159 -329 -388 -218 -504 192 104 220 305 -68 188 94 -13 -7 145
3664 145 -59 -14 -26 -33 -149 -178 245 179 33 -122 104 -119 122 180 6 66 -216 -197 6 150 -317 -30 -245
3687b45N02j89J8m8k57m3l9J47k35M25J77m96K41k16L81k26j0k07jQ06o80Q80
3709F85r46Q03l21k83K74j6O03r60k2j55J099l75n52m53P28m71k25N50j87K00
3729b4M99m05o60J295j857J093M46n11NK04J2j77J04k96L67m06o11O08j09K80
3749a43p5L33n55L1K8R56p33N11k18J64m81q90J009n63J62O88J81n68J15j34L
3770a79L78j154P91J15o1K43o83Q96k46JN84j079N99j47k83Q2K71k88k76O66o61
3791d31M69n1J84o1J45q3j94p4Q9N1K43l15K67k03k26Q8J44P5j39p5J56M0l35
3814b36N8J03K34o9j54N4O0k09L9K89k65K06R0J04o8k00K03K1p2j70J87K29o61
3837b27L34n0l21O23k28k09qn61Q46l10O2K06j55k68n71N79k2K84k08L32m49l13
$$ plain form
3687 -245 257 68 86 38 -219 -262 -301 -154 -389 36 213 -283 -42 -258 123 -103 -113 -320 -321 485 -195 685
3709 685 -261 542 221 -62 212 196 799 -161 -183 -338 761 386 -166 -619 109 -362 -587 -37 -224 -24
3729 -24 475 70 -590 705 -1152 -59 387 -124 -119 85 97 -80 24 -272 95 -311 -922 -314 -423 -143
3749 -143 -218 115 -440 -409 -381 575 -158 353 135 299 -182 -1072 -63 -626 -464 224 405 -163 -48 -182 -179
3770 -179 199 -955 -164 -49 -110 133 -550 346 100 101 685 -394 205 58 -225 -143 128 -160 -436 230 -431
3791 -431 38 -13 171 110 255 172 -22 -96 -7 44 287 -28 239 36 -190 -102 42 117 -22 -97 59 99 -236
3814 -236 -178 -75 159 90 -64 -10 50 -159 -120 169 -96 110 200 304 236 36 239 260 188 18 205 434 -227
3837 -227 107 57 -264 359 131 -78 -86 -647 199 -111 -49 157 2 -266 -837 -258 -280 4 -204 128 -321 -634
3859f34J172m77q6j29J80L6j22O9L32o3m09l83N12o83M97M59j49q9J03k50M5K01
3881A32k07J12J25k07J09j55k5p7L07K0j29P2j50K83L5k45j10P9j35L40l85Q3
3903a28P6K2l9k8N7j56J11k24M04r4MK97j43j07k47J67K95m50j62N23m14J45J2
3926g9P42p27J63J99m59L35m34j0L20K6k39l25k2j06M59k14M4J51J38m24L67p6
3948a71k61J89K69p04L53p0L48q3L05K09l87j61J58l71J93K13J8j12N7j78J39
3969d7K07m01k3N16l48J85j92K48j12j83R8Q2j40J29J78k53K87pm02J48k6k6Q8
3992FJ66j49q3n1pm5P0jr0J60L2J24P2j14N0J90m28rJ37j36K0R1k16jK29o8Q6
4019C5J00j10n7K08j55r9K78k32m7J15j21O7J26k99J59nJ04j29r1J82o5L3n6K41
$$ plain form
3859 -634 538 61 -25 -154 26 62 -60 9 341 278 -131 -514 -2 -685 -188 271 122 33 136 -114 -69 132
3881 132 -75 37 162 -45 64 -91 -116 -193 114 134 5 77 -73 210 245 0 -110 -31 -166 174 -211 -128
3903 -128 -52 -30 -69 -97 -40 -196 -85 -309 95 1 5 302 159 52 -195 -28 267 -183 -345 178 -236 -91 -79
3926 -79 663 -64 99 298 -161 174 -260 -270 50 76 -163 -488 -510 -616 -157 -371 -327 -176 -38 -462 -95 -171
3948 -171 -432 -243 26 -678 -325 -395 -47 -130 175 384 -3 -164 -6 -377 -184 29 47 -65 -8 -186 -47
3969 -47 160 -241 -264 252 -96 89 -103 145 33 -150 -52 30 -110 19 197 -56 231 224 -178 -30 -56 -82 6
3992 6 172 23 -60 -111 -118 -163 -93 -94 -184 -24 8 132 204 90 140 330 -98 -107 30 -106 -86 5 -211 -212 17 -51 35
4019 35 135 25 -32 176 21 -78 200 -32 -79 36 -85 -18 108 -191 -32 -37 67 -62 -153 29 -36 -3 -59 182
4043A82k31J03l44K41R2j73J80K1k95K85k4J30M7l30J63j07J48k8k52K0L09k19
4065h2j85L44j72J00j23O9q4K01jnj58J09p1N7j38K07M2N9j43m1R5l9K2l8j77
4090a52kL11l70L72k32M0O8q7Q7o9J16J13l92J10L26k05K08k51Rq3L53k23R6j01
4114D2p7j7O5j26K67m4l0n1k54j04L03L33J6m54j6K5r9L78l69J80j7K14Q6l34
4138h3o5K41j54j50r6K95J24l56K40k85K75O0L16l81p5Q1O1p9q7J50l8J42j19
4161A7O9r2j84J81L44j74j43J17Kr7q0J32j87L32l23j09L42j56J89m79P6K64j30
4184h9n3M2Q0p1j04L45k57J75j72J50m9J24M3k54R8R0n1j88K35j27N2R4j33r7
4208a17K35j41J18p8p2R8J5l8j49J41R0k59N9K03j81J20O4j55J02J22m00L89r2
$$ plain form
4043 182 -49 54 -290 -49 43 -130 50 71 -224 61 37 167 214 -116 47 -60 88 60 -192 -172 137 -82
4065 -82 -267 77 -95 5 -118 -49 -133 68 67 62 -96 13 -58 -1 -139 68 110 169 26 -15 80 41 63 25 -152
4090 -152 -154 157 -213 159 -73 -33 35 -52 35 -34 82 195 -197 -87 239 34 242 -9 0 -83 270 47 143 42
4114 42 -35 -52 13 -113 154 110 80 29 -225 -329 -26 307 323 -131 -147 -122 -221 157 -212 -32 -49 165 251 -83
4138 -83 -148 93 -61 -211 -307 -12 112 -244 -4 -289 -14 46 362 -19 -94 -13 48 -31 -118 32 -6 136 17
4161 17 86 -6 -190 -9 335 161 18 135 137 40 -40 92 -95 237 -86 -195 147 -9 180 -299 -223 41 -89
4184 -89 -142 -100 -20 -91 -195 150 -107 68 -104 46 -3 121 164 -90 8 98 47 -141 94 -33 19 113 -20 -117
4208 -117 118 -23 95 17 -55 43 58 20 -129 12 102 -157 -98 105 -76 44 108 -47 55 177 -223 166 74
4231G4j43rJ57l0j12K74J6j29j28J60l45K72q2O9q6K45l22o6l0L2M9m3K13Kk23
4256a85K76J62k75K98j32k01O2jo7n8p2J48P4p3R2l37J59J50o5j42L43j87rn4
4280i4J5J67l33L30M9l3o0m05M28l13K0L46J17k29K32p3k30K7L2L9o7K54k90j61
4304b32K16Q6k65K44M0K8p6J43j68j80J20nj47L47J02k22J19k26R2J73k69m2l67
4327d89K20L42l60L55qO3l3j81J04l56N29k59M9j14K11m0k34J80J13r8j10L34
4349B18O1n05J92Q0Q2j08j66Q6l5J21k74M29j47n8j51J45J46k91K05J73j28J23
4371A98m5j22k05M08k90O6m3k7J81j96k9Q3j9L90n50J06JK5L10j42l15L34K6k16
4395g1M7k75J87K65n64K99L41k06l2lj5R4k35o5J64l17R4L14L04n50k8L97o5j31
$$ plain form
4231 74 -69 -78 79 49 -63 211 227 98 -30 130 -215 57 -25 44 -42 203 -119 -185 -215 -183 -134 -177 36 38 -185
4256 -185 91 253 -22 276 144 -57 5 4 -63 -121 -193 -45 29 -44 48 -289 -130 20 -45 -187 156 -31 -40 -94
4280 -94 -79 88 -245 85 134 101 41 -364 64 -249 -229 117 234 5 237 164 -66 -39 -7 32 -35 219 -71 -232
4304 -232 -16 70 -195 49 89 117 41 184 16 -164 -44 -49 -196 151 253 31 150 -76 16 189 -80 -122 -489
4327 -489 -269 73 -287 68 60 123 90 -91 13 -343 186 -73 -24 -138 73 33 -201 -21 92 -6 -116 218
4349 218 279 -226 -34 46 128 20 -146 -60 -95 26 -248 181 34 -24 -175 -30 116 -175 30 203 75 198
4371 198 153 31 -174 234 -56 10 -33 -60 121 -75 -104 -21 -40 350 -200 -94 -93 -68 242 100 -215 119 145 -71
4395 -71 -24 -299 -112 153 -411 -112 229 23 -9 -12 -27 67 -168 -233 -69 -386 -292 22 326 -224 -252 145 80 -51
4419e1J26p2m95J73K79M3L37k69m23L23rJ50m0m8k6K1oK29Q3m96R6L4J4R1O2o3
4445F3NJ78k10P4R5q6k46N4j5L28k90M8j20m1K09l63M84J16k59r9K10j87J42l30
4469b40N6J72J13LJ3j04q3J0l3l8J36r9q7K67p1j6J29j77J57k79K0J53K7n1L3
4494A1K9L0O6l48J37J1K15k25L9j75L37k73J08J30o0j85J26K2K96m49L16j49k09
4517b00K55l09L72n98P12k48r0L52k79j55q0K17j57K76J34m33M39l82L71m29O0
4538a72M50k25N8m0l02M11k86Jm3m2N98m23L87n00K2j31N81Mk39L98m91P4n52
4561d62P79j97k90k30oL02m0L70l26L39m11K04j01J42n8j42M53j1p39j03qJ127
4583E92q55q2N69n11L33j8k6j08P12m41j95j09M10J08l05k98L98L18j77l21L11
$$ plain form
4419 -51 75 3 -492 -319 -40 3 340 71 -352 -29 -38 112 72 24 -2 19 13 242 325 -171 -75 -41 -27 64 126 63
4445 63 68 246 36 110 205 119 -127 -73 -88 240 -50 -2 -122 -163 46 -317 167 283 24 -75 135 -52 90 -240
4469 -240 -184 -12 101 104 117 13 -70 -60 -93 -131 5 -94 -181 86 15 -1 128 -49 108 -171 -151 2 29 -22 11
4494 11 40 70 136 -212 -75 -64 151 -74 -35 -210 127 -146 -38 92 32 -153 -27 -5 291 -158 158 9 -200
4517 -200 55 -254 118 -480 232 -16 -106 246 -33 -188 -268 -51 -208 68 202 -231 208 -174 197 -232 -172
4538 -172 278 53 111 71 -231 180 -106 -105 -148 -190 408 -15 372 -128 -106 -237 344 348 109 507 16 90 -462
4561 -462 317 120 -170 -400 -406 -104 -144 226 -100 239 -172 32 -69 73 15 -127 326 315 -424 -527 -535 592
4583 592 -263 -345 224 -287 46 28 2 -106 606 165 -30 -139 271 379 74 -224 174 492 315 -6 305
4604C05n9m4lK2j97j22R4K73l76N9K98k05qn2L8K3J01Q9l46k4R0Om0k3L05l05
4630a01J17J72l67M10j36l20K15j33J47k12J56P1K49l25J41j9K71k36k45Q2M0
4651b3l6J6K5RJ22j09l4P6l6j70K28j74K98m02K53K32l20O0J94k87K86R2k91J60
4675A69q0k71N06k07k84J79jj81K83J08o2M9k38K39j45j02K40j95J21n7l08o5
4697c02K33l7Q9K28l50m4K30L2p0NK15l46m8K03K96l95o6J99k70M64k75r5J86
4720H2k01K45j81r9J27j67M17p5j66K25J31l77j50K99k95K21k73L64J54k33k35
4741a87J80J1j94M21j27l12K21j82J18j5L9J30Or0Ok53M55k86K6Q3r0o5J53p5
4765b7K29j61j55J3n1M85j88q7k37J03J27j18L51l87pL16n1k26r0K43q8J4Qr2
$$ plain form
4604 305 246 202 199 221 24 -98 -4 269 -107 -48 250 45 37 -15 23 46 147 236 -110 -134 -44 -38 -78 -101 204 -101
4630 -101 16 188 -179 231 95 -225 -10 -143 4 -208 -52 19 268 -57 84 65 336 100 -145 -63 -23
4651 -23 -59 -43 -18 -9 113 4 -30 46 10 -160 68 -106 192 -210 43 275 -45 15 209 -78 208 300 9 169
4675 169 89 -182 324 117 -167 12 11 -170 113 221 159 208 -30 209 64 -38 202 7 128 71 -237 -302
4697 -302 -69 -106 -17 211 -139 -183 47 79 9 14 229 -117 -165 38 334 -61 -127 72 -198 266 -9 -104 82
4720 82 -119 126 -55 -154 -27 -194 223 148 -18 207 338 -39 -189 110 -185 36 -237 127 281 48 -187
4741 -187 -7 4 -190 231 104 -208 13 -169 -51 -66 -27 103 109 19 25 -228 227 -59 -33 50 -40 -105 48 -27
4765 -27 202 41 -114 -101 -152 333 145 58 -179 -76 51 -67 284 -103 -110 206 155 -71 -161 82 -6 8 16 -76
4789g6K7k0J7j40O8K08Q5k21J53P4o5p1k09K48j79K29j18j7j19R7j36J01J75j73
4813f2L1l1J50j44J65j29j00J34l7P3j26J80k27Q0mJ23kQ2j09Q5j07k3L0J6j44
4838i6J91m1k50K02j85L90j99J07l21J63J74k53J85J9l20M24k88K51l11J80K38
4859B60l35J33j6oJ29k35q8L03j45q3K06j4j42J12j49N3K85O8j77k29J91J27m06
4882a58K97r2l36K79k34J39K92k20J98j84MLk04L64j03n5L0p2J13n0J04k03r6
4905a84L69k79Q4J13q6j73J94j13q1J72j67K04p7J36m5J09q1j55J47k22M4J35
$$ plain form
4789 -76 -49 -69 -52 -192 -124 84 169 -52 101 175 110 39 -170 78 -101 128 10 -7 -126 -29 -165 -64 111 -62
4813 -62 -31 -62 88 -56 109 -20 -120 14 -23 50 -76 104 -123 -43 -47 76 74 156 47 132 25 2 32 48 -96
4838 -96 95 54 -196 6 -179 211 12 119 -202 -39 135 -118 67 86 -234 190 -98 153 -158 22 260
4859 260 -75 58 42 36 165 -70 -158 145 0 -83 123 109 -33 79 -70 -17 268 336 159 -70 121 248 -158
4882 -158 139 47 -289 -10 -244 -105 187 -33 165 -19 -15 -12 -216 148 45 -10 20 -52 61 11 115 -88 -184
4905 -184 185 -94 -10 103 17 -156 38 -75 -156 16 -151 53 -24 112 67 176 95 -60 87 -135 -91 44
$$ [...]
8191e6
##END NTUPLES=NMR FID
##END=
