##TITLE=1H_K-1250
 CDCl3
 8 sc, 
 9.03.2022
##JCAMPDX= 6.0         $$ Bruker NMR JCAMP-DX V2.0
##DATA TYPE= NMR FID
##DATA CLASS= NTUPLES
##ORIGIN= UXNMR, Bruker Analytische Messtechnik GmbH
##OWNER= root
$$ XWIN-NMR		Version 3.5
$$ Wed Mar  9 11:22:21 2022 Russian Standard Time (UT+4h)  she@DPX200
##.OBSERVE FREQUENCY= 200.131346
##.OBSERVE NUCLEUS= ^1H
##.DELAY= (6, 6)
##.ACQUISITION MODE= SIMULTANEOUS
##.ACQUISITION SCHEME= undefined
##.AVERAGES= 8
##.DIGITISER RES= 18
##SPECTROMETER/DATA SYSTEM= spect
##.PULSE SEQUENCE= zg30
##.SOLVENT NAME= CDCl3
##.SHIFT REFERENCE= (INTERNAL, CDCl3, 0, 15.7039)
##AUDIT TRAIL= $$ (NUMBER, WHEN, WHO, WHERE, WHAT)
$$ ##TITLE= Audit trail, XWIN-NMR		Version 3.5
$$ ##JCAMPDX= 5.01
$$ ##ORIGIN= Bruker BioSpin GmbH
$$ ##OWNER= she
$$ F:/spectra/data/she/nmr/H-F/1/audita.txt
$$ ##AUDIT TRAIL=  $$ (NUMBER, WHEN, WHO, WHERE, WHAT)
(   1,<2022-03-09 11:20:58.28 +0400>,<she>,<DPX200>,
      <created by zg, POWCHK disabled, PULCHK disabled
       configuration hash MD5:
       00 E9 B6 7A A2 85 ED C7 34 08 36 98 17 FE 4E 26
       data hash MD5: 16K
       57 BC 90 EB 19 40 89 DB 84 E8 BC A2 41 C5 72 8C>)
$$ ##END=
$$ 
$$ hash MD5
$$ 3B 70 DA 2B EB A8 E4 21 1C 33 E2 0A 41 C4 98 00
##$RELAX= 
##$RELAX= 
##$RELAX= 
##$RELAX= 
##$RELAX= 
##$RELAX= 
$$ Bruker specific parameters
$$ --------------------------
##$DU= <F:/spectra>
##$EXPNO= 1
##$NAME= <H-F>
##$PROCNO= 1
##$TYPE= <nmr>
##$USER= <she>
##$AMP= (0..31)
100 100 100 100 100 100 100 100 100 100 100 100 100 100 100 100 100 100 
100 100 100 100 100 100 100 100 100 100 100 100 100 100 
##$AQSEQ= 0
##$AQ_mod= 1
##$AUNM= <au_zg>
##$AUTOPOS= <>
##$BF1= 200.13
##$BF2= 200.13
##$BF3= 200.13
##$BF4= 200.13
##$BF5= 200.13
##$BF6= 200.13
##$BF7= 200.13
##$BF8= 200.13
##$BYTORDA= 1
##$CFDGTYP= 0
##$CFRGTYP= 5
##$CHEMSTR= <none>
##$CNST= (0..31)
1 1 145 1 1 1 1 1 1 1 1 1 1 1 1 1 1 1 1 1 1 1 1 1 1 1 1 1 1 1 1 1 
##$CPDPRG= <>
##$CPDPRG1= <>
##$CPDPRG2= <>
##$CPDPRG3= <>
##$CPDPRG4= <mlev>
##$CPDPRG5= <mlev>
##$CPDPRG6= <mlev>
##$CPDPRG7= <mlev>
##$CPDPRG8= <mlev>
##$CPDPRGB= <>
##$CPDPRGT= <>
##$D= (0..31)
0 1.2 0 0 0 0 0 0 0 0.06 0 0.03 0 0 0 0 0.0002 0 0 0 0 0 0 0 0 0 0 0 0 
0 0 0 
##$DATE= 1646810457
##$DBL= (0..7)
120 120 120 120 120 120 120 120 
##$DBP= (0..7)
150 150 150 150 150 150 150 150 
##$DBP07= 0
##$DBPNAM0= <>
##$DBPNAM1= <>
##$DBPNAM2= <>
##$DBPNAM3= <>
##$DBPNAM4= <>
##$DBPNAM5= <>
##$DBPNAM6= <>
##$DBPNAM7= <>
##$DBPOAL= (0..7)
0.5 0.5 0.5 0.5 0.5 0.5 0.5 0.5 
##$DBPOFFS= (0..7)
0 0 0 0 0 0 0 0 
##$DE= 6
##$DECBNUC= <off>
##$DECIM= 32
##$DECNUC= <off>
##$DECSTAT= 4
##$DIGMOD= 1
##$DIGTYP= 9
##$DL= (0..7)
0 120 120 120 120 120 120 120 
##$DP= (0..7)
150 150 150 150 150 150 150 150 
##$DP07= 0
##$DPNAME0= <>
##$DPNAME1= <>
##$DPNAME2= <>
##$DPNAME3= <>
##$DPNAME4= <>
##$DPNAME5= <>
##$DPNAME6= <>
##$DPNAME7= <>
##$DPOAL= (0..7)
0.5 0.5 0.5 0.5 0.5 0.5 0.5 0.5 
##$DPOFFS= (0..7)
0 0 0 0 0 0 0 0 
##$DQDMODE= 0
##$DR= 18
##$DS= 0
##$DSLIST= <SSSSSSSSSSSSSSS>
$$ [...]
##$SUBNAM2= <"">
##$SUBNAM3= <"">
##$SUBNAM4= <"">
##$SUBNAM5= <"">
##$SUBNAM6= <"">
##$SUBNAM7= <"">
##$SUBNAM8= <"">
##$SUBNAM9= <"">
##$SW= 18.0517287032376
##$SWIBOX= (0..15)
0 0 2 0 0 0 0 0 0 0 0 0 0 0 0 0 
##$SW_h= 3612.71676300578
##$TD= 16384
##$TD0= 1
##$TE= 0
##$TE2= 300
##$TE3= 300
##$TEG= 300
##$TL= (0..7)
0 120 120 120 120 120 120 120 
##$TP= (0..7)
150 150 150 150 150 150 150 150 
##$TP07= 0
##$TPNAME0= <>
##$TPNAME1= <>
##$TPNAME2= <>
##$TPNAME3= <>
##$TPNAME4= <>
##$TPNAME5= <>
##$TPNAME6= <>
##$TPNAME7= <>
##$TPOAL= (0..7)
0.5 0.5 0.5 0.5 0.5 0.5 0.5 0.5 
##$TPOFFS= (0..7)
0 0 0 0 0 0 0 0 
##$TUNHIN= 0
##$TUNHOUT= 0
##$TUNXOUT= 0
##$USERA1= <user>
##$USERA2= <user>
##$USERA3= <user>
##$USERA4= <user>
##$USERA5= <user>
##$V9= 5
##$VALIST= <valist>
##$VCLIST= <CCCCCCCCCCCCCCC>
##$VD= 0
##$VDLIST= <DDDDDDDDDDDDDDD>
##$VPLIST= <PPPPPPPPPPPPPPP>
##$VTLIST= <TTTTTTTTTTTTTTT>
##$WBST= 1024
##$WBSW= 4
##$XGAIN= (0..3)
0 0 0 0 
##$XL= 0
##$YL= 0
##$YMAX_a= 136453
##$YMIN_a= -148236
##$ZGOPTNS= <>
##$ZL1= 120
##$ZL2= 120
##$ZL3= 120
##$ZL4= 120
##$ABSF1= 10
##$ABSF2= 0
##$ABSG= 5
##$ABSL= 3
##$ALPHA= 0
##$AQORDER= 0
##$ASSFAC= 0
##$ASSFACI= 0
##$ASSFACX= 0
##$ASSWID= 0
##$AUNMP= <proc_1d>
##$AZFE= 0.1
##$AZFW= 0.1
##$BCFW= 1
##$BC_mod= 2
##$BYTORDP= 1
##$COROFFS= 0
##$CY= 11.3945322036743
##$DATMOD= 1
##$DC= 2
##$DFILT= <>
##$DTYPP= 0
##$F1P= 2.36226072786647
##$F2P= -0.459571619588291
##$FCOR= 0.5
##$FTSIZE= 0
##$FT_mod= 4
##$GAMMA= 1
##$GB= 0.15
##$INTBC= 1
##$INTSCL= 1
##$ISEN= 128
##$LB= 0.24
##$LEV0= 0
##$LPBIN= 0
##$MAXI= 10000
##$MC2= 0
##$MEAN= 0
##$ME_mod= 0
##$MI= 1.114404
##$NCOEF= 0
##$NC_proc= 0
##$NLEV= 6
##$NOISF1= 3.799351
##$NOISF2= 2.8
##$NSP= 1
##$NTH_PI= 0
##$NZP= 0
##$OFFSET= 15.70392
##$PC= 1
##$PHC0= -16587.57
##$PHC1= 15.40078
##$PH_mod= 1
##$PKNL= yes
##$PPARMOD= 0
##$PSCAL= 0
##$PSIGN= 0
##$REVERSE= no
##$SF= 200.130013532006
##$SI= 16384
##$SIGF1= 3
##$SIGF2= 2
##$SINO= 400
##$SIOLD= 16384
##$SREGLST= <1H.CDCl3>
##$SSB= 0
##$STSI= 0
##$STSR= 0
##$SW_p= 3612.71676300578
##$SYMM= 0
##$S_DEV= 0
##$TDeff= 0
##$TDoff= 0
##$TI= <>
##$TILT= no
##$TM1= 0
##$TM2= 0
##$TOPLEV= 0
##$USERP1= <user>
##$USERP2= <user>
##$USERP3= <user>
##$USERP4= <user>
##$USERP5= <user>
##$WDW= 1
##$XDIM= 8192
##$YMAX_p= 0
##$YMIN_p= 0
$$ End of Bruker specific parameters
$$ ---------------------------------
##NTUPLES= NMR FID
##VAR_NAME=  TIME,          FID/REAL,        FID/IMAG
##SYMBOL=    X,             R,               I
##VAR_TYPE=  INDEPENDENT,   DEPENDENT,       DEPENDENT
##VAR_FORM=  AFFN,          ASDF,            ASDF
##VAR_DIM=   8192,          8192,            8192
##UNITS=     SECONDS,       ARBITRARY UNITS, ARBITRARY UNITS
##FACTOR=    0.0002768,     1,               1
##FIRST=     0,             0,               0
##LAST=      2.2672688,     0,               0
##MIN=       0,             -148236,         0
##MAX=       2.2672688,     136453,          0
$$ Real data points
##PAGE= N=1
##DATA TABLE= (X++(R..R)), XYDATA
$$ plain form
0 0 0 0 0 0 0 0 0 0 0 0 0 0 0 8 -8 8 -8 9 -16 16 -24 24 -32 32 -40 48 -56 64 -73 84 -97 110 -124 142 -161
35 -161 179 -202 227 -253 283 -313 351 -388 430 -475 526 -580 640 -704 777 -855 942 -1039
53 -1039 1146 -1265 1401 -1555 1731 -1937 2177 -2467 2823 -3269 3848 -4638 5781 -7589 10902
68 10902 -18960 84875 30904 -114713 49200 119817 6870 -79336 2328 34265 4492
79 4492 9846 15798 -35400 6697 89887 29125 -98186 -32566 102658 23807 -136814 -63468
91 -63468 83129 26114 -92556 -41135 52619 24095 -27439 -9377 -16013 -35005 12000 17023
103 17023 -74389 -75485 53300 71274 -64799 -75189 73986 87687 -50970 -69462 33219
114 33219 42724 -32012 -36001 4991 2665 11456 43250 7667 -31411 36659 90024 366 -74336
$$ packed form
0@%%%%%%%%%%%%%Qj6J6j6J7k5L2m0M8n6O4p2Q8j04J20j37J57j81K07k34K66l03
35a61L40l81M29m80N36n96O64p39Q18r05J001j106J220j344J481j632J797j981
53a039K185k411K666k956L286l668M114m644N290o092P117q486J0419j3370J8491
68A0902k9862J03835n3971j45617J63913P0617j12947q6206Q1664L1937k9773
79D492N354N952n1198M2097Q3190o0762j27311O5620J35224p8851j60621P3346
91f3468J46597n7015j18670N1421R3754k8524n1534J8062o636j8992M7005N023
103A7023r1412j096J28785J7974j36073j0390J49175J3701j38657j8492J02681
114C3219R505p4736l989M0992k326Q791L1794l5583l9078O8070N3365q9658p4702
$$ plain form
127 -74336 15043 89981 -6191 -80001 8895 75555 13267 -29198 15546 37442 9185 8326
139 8326 6048 -35208 -24867 32913 5805 -69688 -34812 58606 29922 -63916 -35238 49665
151 49665 18650 -55722 -40232 5654 -6220 -27820 -12236 -10180 -17096 19096 34722 -19408
163 -19408 -34500 30768 45295 -33584 -57718 19759 43311 -23795 -35105 24482 39674 7152
175 7152 3179 17346 8040 6117 21735 -2035 -34563 1081 42443 4725 -36255 9129 59488
188 59488 18443 -30172 3119 35646 2961 -24231 -9548 1000 -6401 784 6725 -13474 -9941
201 -9941 26541 15849 -32931 -27491 16900 6384 -44891 -38045 10250 7152 -23857 -14407 9622
214 9622 7287 -1955 167 -6047 -16690 -1399 9671 -17711 -27710 11280 30428 -839 -15074
$$ packed form
127g4336Q9379P4938r6172p3810Q8896O6660o2288m2465M4744K1896k8257q59
139H326k278m1256J0341N7780k7108p5493L4876R3418k8684r3838K8678Q4903
151D9665l1015p4372J5490M5886j1874k1600J5584K056o916L6192J5626n4130
163a9408j5092O5268J4527p8879k4134P7477K3552o7106j1310N9587J5192l2522
175G152l973J4167r306j923J5618k3770l2528L5644M1362l7718m0980M5384N0359
188E9488m1045m8615L3291L2527l2685k7192J4683J0548p401P185N941k0199L533
201i941L6482j0692m8780N440M4391j0516n1275O846M8295l098l1009R450K4029
214I622k335r242K122o214j0643J5291J1070k7382r999L8990J9148l1267j4235
$$ plain form
227 -15074 21559 39253 4460 -12179 9922 14783 -2162 -5306 1561 968 5273 19468 13197
240 13197 -6308 8586 29249 6895 -21420 -7036 16173 440 -24010 -7584 14714 5626
252 5626 -4155 2330 6120 820 -951 -2276 -15181 -19448 -1531 -686 -21521 -17088 9854 12047
266 12047 -10710 -11938 9265 6079 -15043 -15187 -6417 -8856 -10389 -4900 -2815 -3637 7033 16907
280 16907 5584 -3510 10406 16316 -704 -11444 1864 12950 1721 -3390 11027 17122 11133
293 11133 10298 11378 6925 2796 4459 1731 -9905 -6652 7446 2637 -7353 581 12503 7128
307 7128 -6073 -3941 2378 -6268 -13502 -10009 -9119 -9422 -5200 -896 -1846 -2792 4609 5905 -5961 -9101
323 -9101 -2643 -3457 -12605 -14481 -4139 229 -4520 -1213 6014 5347 3762 4302 1883 -2593 -2169 1610
$$ packed form
227a5074L6633J7694l4793j6639K2101M861j6945l144O867n93M305J4195o271
240A3197j9505J4894K0663k2354k8315J4384K3209j5733k4450J6426K2298r088
252E626r781O485L790n300j771j325j2905m267J7917Q45k0835M433K6942K193
266A2047k2757j228K1203l186k1122j44Q770k439j533N489K085q22J0670R874
280A6907j1323r094J3916N910j7020j0740J3308J1086j1229n111J4417O095n989
293A1133q35J080m453m129J663k728j1636L253J4098m809r990P934J1922n375
307G128j3201K132O319q646p234L493Q90l03M222M304r50r46P401J296j1866l140
323i101O458q14r148j876J0342M368m749L307P227o67j585N40k419m476M24L779
$$ plain form
339 1610 -1422 -5608 3110 10639 7321 5312 11033 14769 9323 2872 4808 4511 -172 -134 1103 1614
355 1614 3784 6606 7846 4176 2500 5794 937 -7433 -8694 -5919 -7363 -11487 -9409 -3015 -2034
370 -2034 -2906 -466 -894 -2565 -3197 -5551 -8539 -10579 -8091 -5176 -6833 -5245 1544 4297 3523 2596
386 2596 3694 4444 53 -2720 -1996 -2483 -1103 852 1897 4334 7124 9313 8627 5131 5748 5872 1554
403 1554 -1304 -339 1517 3143 2639 4693 7802 8032 7331 5262 2232 1287 -1517 -4690 -6099 -6656 -3773
420 -3773 -2525 -3646 -1687 554 846 -1214 -4832 -5699 -6554 -9707 -10499 -10314 -8375 -4526 -3361 -2054
436 -2054 702 2551 3064 757 -1381 -191 -1139 -2518 -2028 -1071 2819 5245 5773 6926 8194 8753 6879
453 6879 3388 2366 1991 704 93 -233 1466 5387 5644 5124 6097 5876 4984 1515 -1940 -2296 -3123 -4048
$$ packed form
339A610l032m186Q718P529l318k009N721L736n446o451J936k97m683L8J237N11
355A614K170K822J240l670j676L294m857q370j261K775j444m124K078O394R81
370b034q72K440m28j671o32k354k988k040K488K915j657J588O789K753p74r27
386B596J098P50m391k773P24m87J380J955J045K437K790K189o86l496O17J24m318
403A554k858R65J856J626n04K054L109K30p01k069l030r45k804l173j409n57K883
420c773J248j121J959K241K92k060l618q67q55l153p92J85J939L849J165J307
436b054K756J849N13k307k138J190r48j379M90R57L890K426N28J153J268N59j874
453F879l491j022l75j287o11l26J699L921K57n20R73k21q92l469l455l56q27r25
$$ plain form
471 -4048 -4124 -3932 -613 1921 838 761 952 461 -1704 -5568 -6910 -6990 -8020 -7492 -7475 -5344 -1288 -933
489 -933 -773 -607 -987 -842 -2598 -5030 -4835 -3577 -1892 -1323 -188 4117 6505 5892 6501 6350 5812 4538
507 4538 1861 1406 1177 1670 3845 4087 4497 7241 7780 6419 4289 2517 2108 -1087 -4496 -3944 -3335
524 -3335 -3214 -2260 -1279 800 1090 470 956 -1677 -3620 -3902 -5430 -7209 -6965 -4985 -2671 -3292 -1636
541 -1636 1447 728 -712 -770 -1791 -3138 -4859 -4631 -3107 -3613 -1589 1918 2527 2748 4254 5028 3645
558 3645 967 1502 1669 -815 -314 2492 3322 4007 5744 7797 7764 5211 5425 4989 932 -957 -461 -1279
576 -1279 -2279 -1609 973 1057 -87 1725 2138 -1647 -3068 -3295 -4469 -7257 -7816 -4746 -3855 -5184 -2114
593 -2114 607 -338 -582 -323 -407 -2998 -4245 -2387 -3436 -4357 -991 1541 1423 1790 4015 5388 2718
$$ packed form
471d048p6J92L319K534j083p7J91m91k165l864j342q0j030N28J7K131M056L55
489i33J60J66l80J45j756k432J95J258J685N69J135M305K388o13O09j51n38j274
507D538k677m55k29M93K175K42M10K744N39j361k130j772m09l195l409N52O09
524c335J21R54R81K079K90o20M86k633j943k82j528j779K44J980K314o21J656
541a636L083p19j440n8j021j347j721K28J524n06K024L507O09K21J506P74j383
558C645k678N35J67k484N01K806Q30O85J737K053l3k553K14m36m057j889M96q18
576a279j000O70K582Q4j144J812M13l785j421k27j174k788n59L070Q91j329L070
593b114K721r45k44K59q4k591j247J858j049r21L366K532j18L67K225J373k670
$$ plain form
610 2718 467 2154 591 -1901 -1282 122 984 1357 3403 5958 4412 4434 6247 4027 386 227 1270
627 1270 -27 -2574 -471 2877 1874 1593 3673 3383 1438 121 -761 -2882 -5186 -4107 -3406 -5804
643 -5804 -4717 -1228 -440 -1702 -2424 -241 -343 -4280 -4998 -3686 -4286 -4366 -3113 -1396 44 1137 3769
660 3769 3042 847 2851 3581 91 -2028 -20 1903 858 -380 2934 5338 4438 4429 3944 3020 2306
677 2306 1032 -191 -2214 -1772 878 602 -1199 1484 3782 3622 521 319 1860 83 -3192 -3197 -2687
694 -2687 -2445 -1642 -1274 -843 -474 1140 1293 -2332 -3171 -1501 -2639 -5287 -5937 -3518 -1407 -2277 -1807 730
712 730 1608 1348 899 -358 -527 -422 -567 -1283 -1535 1084 3924 2705 2457 4751 6113 4774 1676 1610
730 1610 2238 571 -315 -746 -141 1837 2142 1759 1734 1956 2724 1085 -2417 -2245 -1250 -2161 -3407 -3519 -971
$$ packed form
610B718k251J687j563k492O19J404Q62L73K046K555j546K2J813k220l641j59J043
627A270j297k547K103L348j003k81K080k90j945j317q82k121k304J079P01k398
643e804J087L489P88j262p22K183j02l937p18J312o00q0J253J717J440J093K632
660C769p27k195K004P30l490k119K008J923j045j238L314K404r00rm85r24p14
677B306j274j223k023M42K650k76j801K683K298j60l101k02J541j777l275nN10
694b687K42Q03L68M31L69J614J53l625q39J670j138k648o50K419K111q70M70K537
712G30Q78k60m49j257j69J05j45p16k52K619K840j219k48K294J362j339l098o6
730A610O28j667q86m31O05J978L05l83k5K22P68j639l502J72R95r11j246j12K548
$$ plain form
749 -971 474 -489 -36 373 484 268 -1701 -3036 -2929 -2728 -2062 -2979 -2777 315 1142 101 -220 214 953
768 953 -628 -2964 -2170 -1528 -1453 -1169 -1221 590 2767 2655 2831 2303 2584 3061 1421 -626 204 1178 1264
787 1264 905 1459 3467 3628 2902 2774 1350 1330 656 -1465 -2074 -2151 -1286 -899 -1826 -1021 616 285 -322
806 -322 -1554 -1751 -1469 -2755 -3876 -3045 -2578 -1715 -899 -830 513 1153 1038 331 -810 -495 -346 -1870 -2181
825 -2181 -1346 -51 739 636 1493 2568 2050 2241 787 161 325 -110 -533 -739 160 1948 2203 1714 2838
844 2838 2900 2917 1705 373 634 239 -850 -572 -346 135 977 1165 722 662 472 3 -1805 -3041 -2024
863 -2024 -2538 -3384 -3102 -2255 -1004 -876 -573 -50 -94 -417 -504 -1810 -2201 -1454 -1065 -614 -631 752 2586 1977
883 1977 1586 2196 2342 1376 42 -82 430 -511 27 869 884 1352 2621 2531 1320 786 1405 647 -1532
$$ packed form
749i71J445r63M53M09J11k16j969j335J07K01O66r17K02L092Q27j041l21M34P39
768I53j581k336P94O42P5K84n2J811K177j12J76n28K81M77j640k047Q30R74Q6
787A264l59N54K008J61p26j28j424k0o74k121o09p7Q65L87r27Q05J637l31o07
806c22j232j97K82j286j121Q31M67Q63Q16O9J343O40j15p07j141L15J49j524l11
825b181Q35J295P90j03Q57J075n18J91j454o26J64m35m23k06Q99J788K55m89J124
844B838O2J7j212j332K61l95j089K78K26M81Q42J88m43o0j90m69j808j236J017
863b024n14q46K82Q47J251J28L03N23m4l23q7j306l91P47L89M51j7J383J834o09
883A977l91O10J46r66j334j24N12r41N38Q42J5M68J269r0j211n34O19p58k179
$$ plain form
902 -1532 -947 253 -267 -517 347 1526 1392 544 1271 672 -800 -317 -589 -2077 -2424 -1639 -198 -1411
920 -1411 -1688 519 842 -1469 -1259 -694 -1164 -2654 -2687 -1750 -1859 -2139 -136 331 -202 1078 2090 1606
938 1606 -279 422 2027 187 -1317 733 1904 1300 1239 2569 3121 1589 1860 2540 221 -827 530
955 530 225 -1438 -1408 1124 1616 -850 82 2060 664 -1387 -575 -385 -1754 -2389 -780 -510 -2057 -319
973 -319 1753 37 -1274 816 1371 -1300 -2982 -649 30 -3147 -2537 239 35 -979 95 1536
989 1536 -123 -1114 936 544 -2438 -1270 1585 193 -1548 246 3944 1904 -273 2340 3553 639
1005 639 -190 1437 1348 -609 41 2473 440 -737 2285 2942 -588 -1414 1535 1246 -3139 -2952 744
1022 744 -1045 -3229 -970 895 -722 -1326 935 636 -2629 -1408 1334 -1710 -3693 -440 1933 -886
$$ packed form
902a532N85J200n20k50Q64J179j34q48P27n99j472M83k72j488l47P85J441j213
920a411k77K207L23k311K10N65m70j490l3R37j09k80K003M67n33J280J012m84
938A606j885P01J605j840j504K050J171o04o1J330N52j532K71O80k319j048J357
955E30l05j663L0K532M92k466R32J978j396k051Q12J90j369o35J609K70j547J738
973c19K072j716j311K090N55k671j682K333O79l177O10K776k04j014J074J441
989A536j659r91K050l92k982J168K855j392j741J794L698k040k177K613J213k914
1005F39q29J627q9j957O50K432k033j177L022O57l530q26K949k89m385J87L696
1022G44j789k184K259J865j617o04K261k99l265J221K742l044j983L253K373k819
$$ plain form
1038 -886 -2392 1538 2945 -796 -1061 1731 482 -2024 -903 883 -850 -1958 1513 2288 -1463 9
1054 9 3583 1661 -2064 -296 3108 393 -2805 601 2806 -221 -326 2585 2208 -49 1181 3037
1070 3037 -174 -2551 1117 1522 -2517 -2560 1625 1559 -2252 -1574 2470 739 -2897 -1281 329 -2270
1086 -2270 -3220 -547 -85 -3130 -1132 2804 333 -2818 940 2942 -934 -3086 731 2217 -1853
1101 -1853 -1780 2412 1752 -680 1213 2763 461 -838 2055 1976 -2539 -1651 2292 422 -3110 -177
1117 -177 3433 1000 -1840 810 3084 -709 -1471 1044 475 -2043 -110 1947 -80 -2028 1691 3195
1133 3195 -1324 -1935 1892 1464 -2722 -2695 1094 -188 -2982 -1015 1142 -924 -1328 1035 443 -2473
1149 -2473 -1489 1624 -525 -3797 -176 2527 -567 -2161 1539 2998 -66 -832 2244 1423 -1170 242
$$ packed form
1038h86j506L930J407l741k65K792j249k506J121J786j733j108L471P75l751J472
1054IL574j922l725J768L404k715l198L406K205l027j05K911l77k257J230J856
1070C037l211k377L668M05m039m3M185o6l811O78M044j731l636J616J610k599
1086b270r50K673M62l045J998L936k471l151L758K002l876k152L817J486m070
1101a853P3M192o60k432J893J550k302j299K893p9m515Q88L943j870l532K933
1117a77L610k433k840K650K274l793p62K515n69k518J933K057k027j948L719J504
1133C195m519o11L827m28m186K7L789j282k794J967K157k066m04K363n92k916
1149b473R84L113k149l272L621K703l094j594L700J459l064p66L076q21k593J412
$$ plain form
1165 242 1598 -498 -950 1778 2342 -1075 -530 3174 1668 -2246 -638 2049 -72 -2677 -928 1419
1181 1419 -1076 -1509 1281 955 -1271 103 1769 -475 -2424 286 1649 -1778 -2366 1294 1363 -1064
1197 -1064 -1273 1589 982 -1483 -299 536 -1328 -1785 201 -13 -2165 -1190 1717 522 -1940 303
1213 303 2407 -510 -1921 407 1335 -562 -1161 1255 1625 -39 931 2279 451 -126 1413 1784 -1110
1230 -1110 -1270 1090 801 -1701 -757 1719 443 -1142 -380 1278 -672 -1441 78 -302 -1563 -810 374
1247 374 -535 -1538 136 1732 -399 -1497 1114 1011 -1264 -1290 257 467 -846 -86 1030 -31 -381
1264 -381 1272 302 -1035 -394 556 184 -1909 -664 1365 -6 -759 766 1171 346 -407 1082 943
1281 943 -467 -103 910 -29 -381 768 1217 205 -151 1417 1659 -731 -490 986 116 -1168 -668
$$ packed form
1165B42J356k096m52K728N64l417N45L704j506l914J608K687k121k605J749K347
1181A419k495m33K790l26k226J374J666k244j949K710J363l427n88L660O9k427
1197a064k09K862o07k465J184Q35j864m57J986k14k152R75K907j195k462K243
1213C03K104k917j411K328R28j897n99K416L70j664R70J348j828n77J539L71k894
1230a110j60K360k89k502R44K476j276j585P62J658j950p69J519l80j261P53J184
1247C74r09j003J674J596k131j098K611j03k275k6J547K10j313P60J116j061l50
1264c81J653r70j337O41R50l72k093J245K029j371p53J525M05q25p53J489j39
1281I43j410L64J013r39l52J149M49j012l56J568K42k390K41J476q70j284N00
$$ plain form
1298 -668 127 -271 -988 -103 270 -897 -353 186 -483 -1233 -484 95 -959 -1356 201 979 -206 -139 944
1317 944 820 99 -63 634 -10 -768 449 390 -449 -26 933 715 -321 -60 1258 -4 -869 87 143
1336 143 -225 -709 214 738 -66 -148 968 348 41 460 393 44 -310 198 653 -518 -293 862 262 -127
1356 -127 -119 350 -174 -569 -274 -109 -1129 -929 -189 -279 -623 -441 253 22 -533 -104 507 -370 -438 98 430
1377 430 -190 11 824 831 173 735 857 129 121 289 125 -228 -313 368 370 -562 330 439 221 -141 -122 32 -206
1400 -206 -717 -110 -207 -519 254 323 4 272 284 397 171 -425 326 106 -273 -186 40 4 -203 98 78 -108
1422 -108 -138 53 -184 -499 -367 -555 -186 -542 -297 77 -248 54 392 114 401 120 153 619 123 399 180
1443 180 106 401 511 673 597 316 444 437 -394 -90 -88 -296 -294 -374 -185 -206 -262 -302 251 -238 -491 -10 -503 -117
$$ packed form
1298f68P95l98p17Q85L73j167N44N39o69p50P49N79j054l97J557P78j185O7J083
1317I44j24p21j62O97o44p58J217n9q39M23R59k18j036K61J318j262q65R56N6
1336A43l68m84R23N24q04q2J116o20l07M19o7l49l54N08M55j171K25J155o00l89
1356a27QM69n24l95K95J65j020K00P40r0l44J82O94k31n55M29O11q77o8N36L32
1377D30o20K01Q13Po58N62J22p28qJ68j64l53q5O81Kr32Q92J09k18l62J9J54k38
1400b06n11O07r7l12P73O9l19K68J2J13k26n96P51k20l79Q7K26l6k07L01k0j86
1422a08l0J91k37l15J32j88L69l56K45L74l25L02L38k78K87k81L3M66m96K76k19
1443A80p4K95J10J62p6k81J28pq31L04Kk08Kq0J89k1n6m0N53m89k53M81m93L86
$$ plain form
1467 -117 -480 -211 -124 -211 184 178 169 150 9 27 8 -281 19 135 -263 -84 -54 -145 -150 36 95 182 -347 10 -157
1492 -157 -575 -241 -295 -107 -21 155 231 573 333 326 150 324 252 265 211 162 -181 683 354 96 343 299 94
1515 94 -23 -422 106 -247 -829 -134 -620 -269 -266 -399 -79 -146 -223 -7 -168 -151 -140 -106 -109 -56 107 522 257 311
1539 311 366 88 81 215 -76 -133 10 -64 -337 -267 -80 81 -212 351 278 -91 -56 25 -112 -212 -274 -201 148 -79
1563 -79 351 -143 160 330 461 67 -109 -314 392 220 -243 71 24 -165 163 -77 139 -173 -299 -104 -468
1584 -468 -324 -331 -421 -351 -11 118 287 -117 -4 247 -153 -203 -28 266 261 84 6 232 184 515 491 25 -16 319
1608 319 -169 -248 -174 356 209 -380 -68 -19 -213 -38 -124 38 -241 -26 90 -474 -307 158 244 -113 132 -44
1630 -44 326 180 -201 366 547 -264 134 -260 -240 -57 136 45 -160 -253 -173 -85 -497 -207 -97 -295 -304 -389 102
$$ packed form
1467a17l63K69Q7q7L95orj9j41J8j9k89L00J16l98J79L0r1nJ86N9Q7n29L57j67
1492a57m18L34n4J88Q6J76P6L42k40pj76J74p2J3n4m9l43Q64l29k58K47m4k05
1515I4j17l99N28l53n82O95m86L51Lj33L20o7p7K16j61J7J1L4lN3J63M15k65N4
1539C11N5k78pJ34k91n7J43p4k73P0J87J61k93N63p3l69L5Q1j37j00o2P3L49k27
1563g9M30m94L03J70J31l94j76k05P06j72m63L14m7j89L28k40K16l12j26J95l64
1584d68J44pr0P0L40J29J69m04J13K51m00n0J75K94nj77p8K26m8L31k4m66m1L35
1608C19m88p9P4N30j47n89L12M9j94J75q6J62k79K15J16n64J67M65Q6l57K45j76
1630d4L70j46l81N67J81q11L98l94K0J83J93r1k05r3Q0Q8m12K90J10j98rq5M91
$$ plain form
1653 102 -289 -485 423 447 225 488 329 366 328 183 291 -14 -74 305 234 31 -168 333 233 -288 -74 184
1675 184 -153 -339 -308 -236 11 -255 82 -177 -297 -102 27 -261 -149 169 313 -42 -234 195 521 159 -122
1696 -122 103 273 174 -27 202 -80 -389 197 -21 -336 -263 27 -248 -209 -254 61 -198 -326 -49 -172 42
1717 42 123 -79 185 297 6 223 309 272 292 149 -57 27 -110 299 -35 -274 132 91 -141 -103 -224 -331 -178
1740 -178 -462 -348 -271 -329 -34 -318 -96 45 31 -82 -25 -204 249 -76 148 136 257 480 276 135 149 185
1762 185 305 52 -287 12 111 -171 -143 -84 -108 -170 -260 -136 -16 -241 226 -38 -227 79 126 53 138 11 414
1785 414 34 63 230 143 267 275 132 139 178 64 -96 -174 -139 166 -279 -366 -180 -208 -173 -254 -492 2 -171 -419
1809 -419 -85 -154 157 -82 37 -32 188 372 253 327 488 -57 34 174 120 137 149 296 58 -176 -346 -122
$$ packed form
1653A02l91j96R08K4k22K63j59L7l8j45J08l05o0L79p1k03j99N01j00n21K14K58
1675A84l37j86L1P2K47k66L37k59j20J95J29k88J12L18J44l55j92M29L26l62k81
1696a22K25J70r9k01K29k82l09N86k18l15P3K90k75L9m5L15k59j28K77j23K14
1717D2Q1k02K64J12k91K17Q6l7K0j43k06Q4j37M09l34k39M06m1k32L8j21j07J53
1740a78k84J14P7n8K95k84K22J41j4j13N7j79M53l25K24j2J21K23k04j41J4L6
1762A85J20k53l39K99R9k82K8N9k4o2r0J24J20k25M67k64j89L06M7p3Q5j27M03
1785D14l80K9J67q7J24Qj43PL9j14j60p8L5L05m45q7J86k8L5q1k38M94j73k48
1809d19L34o9L11k39J19o9K20J84j19P4J61n45R1J40n4J7J2J47k38k34j70K24
$$ plain form
1831 -122 -180 -485 -138 -61 -56 -244 -338 -67 -165 -64 29 -75 -14 206 141 233 44 -110 351 33 10 253 204 224
1855 224 -15 -5 161 -165 32 -396 -239 -175 -200 -519 -123 0 -183 -28 -193 10 -152 -61 -53 162 -49 -40 299
1878 299 76 211 247 211 36 130 298 5 25 119 -41 59 -60 -69 -5 -84 -394 -50 -385 -186 -225 -480 -189
1901 -189 -146 -125 228 -109 -51 44 17 131 93 -69 47 -6 -55 161 119 -143 11 -8 116 176 -84 80 -322 -147
1925 -147 11 20 -530 -199 -12 142 -113 56 240 65 -135 90 107 177 42 264 300 23 546 233 22 12
1947 12 339 285 27 -232 189 -32 -433 -236 -29 -208 -266 -117 -44 -56 -208 9 132 -216 -195 -9 -102 -173 136
1970 136 140 64 -41 206 134 125 148 -9 64 53 107 41 -9 -167 173 -169 -195 -212 -189 -242 -273 -165 -98 -225 -283 -39
1996 -39 -6 7 -41 325 -22 -69 186 364 -43 6 26 -58 41 206 228 77 -84 -78 156 -260 -368 -225 -147 -134 -342
$$ packed form
1831a22n8l05L47P7Nj88r4K71r8J01R3j04O1K20o5R2j89j54M61l18k3K43m9K0
1855B24k39J0J66l26J97m28J57O4k5l19L96J23j83J55j65K03j62R1QK15k11RL39
1878B99k23J35L6l6j75R4J68k93K0R4j60J00j19rO4p9l10L44l35J99l9k55K91
1901a89M3K1L53l37N8R5k7J14l8j62J16n3m9K16m2k62J54j9J24O0k60J64m02J75
1925a47J58Rn50L31J87J54k55J69J84j75k00K25J7P0j35K22L6k77N23l13k11j0
1947A2L27n4k58k59M21k21m01J97K07j79n8J49P3j2j52K17J23l48K1J86r3p1L09
1970A36Mp6j05K47p2rK3j57P3j1N4o6n0j58L40l42k6j7K3n3l1J08O7j27n8K44
1996c9L3J3m8L66l47m7K55J78m07M9K0q4R9J65K2j51j61OK34m16j08J43P8J3k08
$$ plain form
2021 -342 70 -13 -455 -233 8 -21 -123 -136 156 104 -173 141 246 -33 228 423 336 106 -117 363 166 -100
2043 -100 128 -18 -266 8 -118 -68 -384 -239 68 -70 -289 -2 57 -38 -317 104 -90 3 46 89 87 -120 338
2066 338 145 83 164 458 42 34 -74 243 90 -172 -22 94 -177 -133 180 259 -229 -265 274 -246 -214 -186 185
2089 185 -102 -10 265 417 -424 109 169 32 -231 28 327 -45 -49 168 300 -345 253 279 -39 -211 -185 -18
2111 -18 -191 -442 117 -130 -213 -10 234 -137 -217 -224 137 62 -121 159 321 -84 5 312 215 -68 -54 656 -67
2134 -67 -306 99 243 -95 -255 121 166 -281 -143 69 -328 -609 119 -17 -206 -3 22 60 -435 -238 223
2155 223 195 -349 -23 269 182 60 178 132 -74 220 132 -97 -476 165 206 -335 -453 208 298 -634 -9 231
2177 231 87 -531 -212 -44 -261 -160 335 213 -495 39 426 92 -42 129 594 309 -432 360 464 -130
$$ packed form
2021c42M12q3m42K22K41k9j02j3K92n2k77L14J05k79K61J95q7k30k23M80j97k66
2043a00K28j46k48K74j26N0l16J45L07j38k19K87N9r5k79M21j94R3M3M3kk07M58
2066C38j93o2Q1K94m16qj08L17j53k62J50J16k71M4L13P9m88l6N39n20L2K8L71
2089A85k87R2K75J52q41N33O0j37k63K59K99l72mK17J32o45N98K6l18j72K6J67
2111a8j73k51N59k47q3K03K44l71q0pL61p5j83K80J62m05Q9L07r7k83J4P10p23
2134f7k39M05J44l38j60L76M5m47J38K12l97k81P28j36j89K03K5L8m95J97M61
2155B23k8n44L26K92q7j22J18m6k06K94q8k29l79O41M1n41j18O61R0r32O25K40
2177B31j44o18L19J68k17J01M95j22p08N34L87l34j34J71M65k85p41P92J04n94
$$ plain form
2197 -130 -219 177 337 -238 -237 394 -86 -512 7 33 -217 -388 43 149 -367 -296 324 -83 -411 -118 80 -88
2219 -88 -137 72 310 -32 -246 248 200 -225 496 291 87 -359 338 253 -270 -128 243 200 -304 -21 9 -100
2241 -100 -678 28 230 -239 -244 307 -21 -290 -91 605 127 -266 196 478 95 -67 382 112 -160 182 239
2262 239 -49 -367 74 -122 -361 -177 239 -112 -414 -420 127 -85 -431 297 156 -118 -246 92 267 262 -371
2283 -371 206 -17 -235 189 387 317 -132 182 268 -132 -341 220 -73 -152 -23 17 174 -307 -297 231 -399 -169
2305 -169 415 7 -138 43 157 68 -222 214 400 70 -188 173 35 -133 -277 316 53 -394 187 430
2325 430 -146 -98 92 -335 43 -262 -25 -120 -344 -243 82 -301 -406 -75 -147 -254 -230 72 47 -149 246 471
2347 471 -37 -183 -66 119 258 -43 58 294 -450 126 193 109 -116 60 46 26 -301 244 -97 -238 -58
$$ packed form
2197a30q9L96J60n75JO31m80m26N19K6k50j71M31J06n16P1O20m07l28K93J98j68
2219h8m9K09K38l42k14M94m8m25P21k05k04m46O97q5n23J42L71m3n04K83L0j09
2241a00n78P06K02m69nN51l28k69J99O96m78l93M62K82l83j62M49k70k72L42N7
2262B39k88l18M41j96k39J84M16l51l02oN47k12l46P28j41k74j28L38J75no33
2283c71N77k23k18M24J98p0m49L14Q6m00k09N61k93p9J29M0J57m81J0N28o30K30
2305a69N84m08j45J81J14q9k90M36J86l30k58L61j38j68j44N93k63m47N81K43
2325D30n76M8J90m27L78l05K37r5k24J01L25l83j05L31p2j07K4L02k5j96L95K25
2347D71n08j46J17J85J39l01J01K36p44N76O7q4k25J76j4k0l27N45l41j41J80
$$ plain form
2368 -58 -62 33 -356 212 -101 -218 -122 171 161 -113 41 283 53 -33 66 71 125 0 280 191 -263 -106 116 181
2392 181 -170 -227 57 188 -11 -62 -179 -64 -232 160 42 -121 122 68 72 -129 29 192 138 251 122 315
2414 315 -202 206 364 99 235 -37 133 76 -114 -33 129 -147 110 -18 -29 -239 49 -86 -150 -210 116 -68
2436 -68 -180 -46 183 -24 -102 -117 216 -42 -326 96 343 118 -172 -68 29 -62 -14 -114 123 -269 -36 -74
2458 -74 -268 -80 -2 -100 -91 53 -114 -65 -241 41 104 102 104 96 255 133 46 192 -110 213 -21 -120 232 -52 271
2483 271 45 -163 -97 38 -195 -44 -25 14 0 -119 -26 118 -238 -267 -79 31 44 78 163 291 121 52 20 227
2507 227 -10 -44 10 37 103 -204 -117 -136 -141 69 -135 -333 171 84 -329 -239 254 -172 -5 -116 -133 -104 86 3
2531 3 -76 -100 212 223 156 24 69 8 137 -312 277 15 8 258 -44 73 -7 44 -188 237 120 -126 -211 -48
$$ packed form
2368e8mR5l89N68l13j17R6K93j0k74J54K42k30q6R9NN4j25K80q9m54J57K22O5
2392A81l51n7K84J31j99n1j17J15j68L92j18j63K43n4Mk01J58J63n4J13j29J93
2414C15n17M08J58k65J36k72J70n7j90Q1J62k76K57j28j1k10K88j35o4o0L26j84
2436f8j12J34K29k07p8j5L33k58k84M22K47k25k90J04R7r1M8j00K37l92K33l8
2458g4j94J88P8r8RJ44j67M9j76K82O3kKqJ59j22q7J46l02L23k34r9L52k84L23
2483B71k26k08O6J35k33J51J9L9j4j19R3J44l56k9J88J10J3L4Q5J28j70o9l2K07
2507B27k37l4N4K7O6l07Q7j9nK10k04j98N04q7m13R0M93m26J67j11j7K9J90q3
2531Cp9k4L12J1o7j32M5o1J29m49N89k62pK50l02J17q0N1k32M25j17k46q5J63
$$ plain form
2555 -48 -232 -41 85 -129 -93 -60 -3 -33 36 290 -99 0 135 44 131 80 -84 -186 101 -94 109 -123 103
2578 103 -51 -102 -68 -175 -183 -80 -153 129 -217 103 -38 -79 -28 120 -305 28 141 -21 -14 165 261 -205 192
2601 192 270 30 -82 143 -79 55 8 -51 -36 -15 -178 -45 -133 -27 56 -67 -205 -174 -262 -191 128 -84 -130 -117
2625 -117 138 105 63 139 76 236 153 113 146 223 -88 141 -66 130 -211 -60 -34 87 -130 -132 -156 -141 -259 -192 -244
2650 -244 124 -30 200 76 -50 24 3 -27 -164 -216 312 487 58 407 113 18 116 209 143 -87 60 -129 -135
2673 -135 -295 78 -127 -206 -355 -101 64 -3 38 202 49 -120 102 -47 21 2 -79 -48 -122 -59 179 -28 -151
2696 -151 -10 89 2 166 64 105 -87 -71 77 -232 64 -16 -52 -68 27 -28 43 -103 -22 48 154 65 422 137
2720 137 56 39 -227 -31 -31 161 103 -133 28 351 154 90 -277 59 34 -297 117 -157 212 -102 -158 -78 -328
$$ packed form
2555d8j84J91J26k14L6L3N7l0O9K54l89R9J35r1Q7n1j64j02K87j95K03k32K26
2578A03j54n1L4j07qJ03p3K82l46L20j41m1N1J48m25L33J13j62PJ79R6m66L97
2601A92P8k40j12K25k22J34m7n9J5K1j63J33q8J06Q3j23j38L1q8P1L19k12m6J3
2625a17K55l3m2P6o3J60q3m0L3P7l11K29k07J96l41J51K6J21k17kk4J5j18O7n2
2650b44L68j54K30j24j26P4k1l0j37n2N28J75m29L49k94r5R8R3o6k30J47j89o
2673a35j60L73k05p9j49K54J65o7M1J64j53j69K22j49O8j9q1L1p4O3K38k07j23
2696a51J41R9q7J64j02M1j92J6J48l09K96q0l6j6R5n5P1j46Q1P0J06q9L57k85
2720A37q1j7k66J96%J92n8k36J61L23j97o4l67L36k5l31M14k74L69l14n6Q0k50
$$ plain form
2743 -328 -144 -119 -161 -252 -73 -256 136 230 124 -254 375 -64 195 -11 136 155 24 17 48 169 212 -97 -306
2766 -306 126 -168 -134 -32 -140 -101 3 -89 133 117 -151 -4 -88 198 94 -89 164 69 104 116 -52 151 -1
2789 -1 -7 62 0 282 -41 30 -279 23 123 -268 -214 172 -85 -243 117 -220 -95 50 -122 -63 -30 142 154 162
2813 162 21 151 17 201 -14 235 -237 24 15 -224 57 9 104 -34 118 185 3 123 -15 -22 141 -87
2835 -87 -178 -41 -9 -75 -249 -86 123 48 -33 -44 -63 -165 245 106 -132 140 -83 103 282 118 84 -87 46
2858 46 307 -32 50 132 38 -11 -145 -309 -229 46 -184 -29 -100 -131 -327 -29 7 -8 -139 -61 -133 -90 226 172 -26
2883 -26 138 94 145 -108 -100 -18 206 38 -205 35 -28 -86 -137 -107 -47 -59 -97 27 -209 -177 87 200 178 142 196 124
2909 124 -212 116 98 174 69 29 277 -72 19 87 -13 16 76 339 -104 -235 9 -77 -134 142 -140 -127 -15
$$ packed form
2743c28J84K5m2r1J79j83L92R4j06l78O29m39K59k06J47J9j31pL1J21M3l09k09
2766c06M32k94L4J02j08L9J04r2K22j6k68J47q4K86j04j83K53r5L5J2j68K03j52
2789aoO9o2K82l23P1l09L02J00l91N4L86k57j58L60l37J25J45j72N9L3J72J2Q
2813A62j41J30j34J84k15K49m72K61rk39K81m8R5j38J52O7j82J20j38pJ63k28
2835h7r1J37L2o6j74J63K09p5q1j1j9j02M10j39k38K72k23J86J79j64l4j71J33
2858D6K61l39Q2Q2r4m9j34j64Q0K75k30J55p1l1j96K98L6j5j31P8p2M3L16n4j98
2883b6J64m4N1k53QQ2K24j68k43K40o3n8n1L0O0j2l8J24k36L2K64J13k2l6N4p2
2909A24l36L28j8P6j05m0K48l49R1O8j00K9O0K63m43j31K44q6n7K76k82J3J12
$$ plain form
2932 -15 -119 -109 -42 57 -53 40 12 181 307 23 -60 124 -7 24 218 185 349 -145 12 -134 132 132 -325 139
2956 139 -299 -152 -89 -57 -346 -148 -23 -166 190 55 138 -111 60 124 -69 -21 62 159 336 21 125 53 -69
2979 -69 48 40 47 104 18 -186 -136 4 -112 43 133 -56 -149 -57 -55 -134 41 22 -243 -114 22 139 -47 -112 185
3004 185 190 52 328 -48 9 67 21 173 -35 -39 145 -29 -33 168 4 211 -159 -36 -21 166 -49 -262 -82
3027 -82 -25 15 22 -210 148 57 104 -4 -224 211 172 82 -48 -66 165 -49 155 -2 -47 207 -24 51 -136 -30
3051 -30 -200 118 -330 -440 235 87 19 144 -138 -188 -196 123 190 -6 -28 143 110 139 -134 -82 60 -29 -6 -73
3075 -73 144 -9 -47 108 -209 -29 -140 108 -78 -11 -75 -142 32 5 74 -104 106 -108 -52 -118 167 135 21
3098 21 10 33 -13 68 84 134 -139 -205 96 -205 49 140 112 21 -237 -118 -60 -144 -176 -29 288 -31 -253 113 28
$$ packed form
2932a5j04J0O7R9j10R3k8J69J26k84q3J84j31L1J94l3J64m94J57j46K66%m57M64
2956A39m38J47O3L2k89J98J25j43L56j35Q3k49J71O4j93M8Q3R7J77l15J04p2j22
2979f9J17qPN7q6k04N0J40j16J55R0j89r3R2Kp9J75j9k65J29J36J17j86o5K97
3004A85Nj38K76l76N7N8m6J52k08mJ84j74mK01j64K07l70J23J5J87k15k13J80
3027h2N7M0Pk32L58r1M7j08k20M35l9r0j30j8K31k14K04j57m5K54k31P5j87J06
3051c0j70L18m48j10O75j48o8J25k82n0qL19O7j96k2J71l3K9k73N2J42q9K3o7
3075g3K17j53l8J55l17J80j11K48j86O7o4o7J74k7O9j78K10k14N6o6K85l2j14
3098B1j1K3m6Q1J6N0k73o6L01l01K54R1k8r1k58J19N8q4l2J47L17l19k22L66q5
$$ plain form
3123 28 -72 -105 -3 -140 -291 -140 -159 33 -120 255 -6 -37 2 64 47 -157 475 -135 -137 24 97 38 -159 54
3147 54 122 24 -108 13 7 55 -40 103 211 81 15 116 137 45 310 200 -19 64 323 -78 -57 85 -64 -262
3171 -262 -54 -155 104 -92 -89 56 106 -233 -97 12 -69 -181 -96 143 -48 -68 257 263 89 158 -51 167 -211
3194 -211 -99 90 -49 -91 139 357 -142 -11 -27 37 68 123 91 -105 -47 -170 -247 -16 -127 57 -19 -312 -24
3217 -24 213 97 197 152 25 48 -356 16 137 115 116 75 -62 20 -57 -28 30 -151 -35 -121 -325 22 222 138
3241 138 -104 134 33 -153 8 137 161 -85 192 -10 214 50 -139 115 107 -166 12 94 -101 89 -67
3262 -67 25 -102 -117 26 -50 -112 14 -135 -128 -86 -190 -47 -150 69 68 -134 107 -6 135 59 -73 -167 146 -75
3286 -75 56 210 95 45 263 87 175 45 81 170 -70 -244 87 79 24 -99 187 -112 -227 278 -30 -8 158
$$ packed form
3123B8j00l3J02j37j51J51j9J92j53L75k61l1L9O2j7k04O32o10kJ61P3n9j97K13
3147E4O8r8j32J21oM8r5J43J08j30o6J01K1r2K65j10k19Q3K59m01K1J42j49j98
3171b62K08j01K59j96LJ45N0l39J36J09q1j12Q5K39j91k0L25Oj74O9k09K18l78
3194b11J12J89j39m2K30K18m99J31j6O4L1N5l2j96N8j23p7K31j11J84p6k93K88
3217b4K37j16J00m5j27K3m04L72J21k2Jm1j37Q2p7K9N8j81J16q6k04L47K00q4
3241A38k42K38j01j86J61J29K4k46K77k02K24j64j89K54qk73J78Q2j95J90j56
3262f7R2j27j5J43p6o2J26j49PM2j04J43j03K19jk02K41j13J41p6j32r4L13k21
3286g5J31J54j15n0K18j76Q8j30L6Q9k40j74L31qn5j23K86k99j15N05l08K2J66
$$ plain form
3309 158 224 -54 38 79 -26 -46 -158 137 118 -90 -137 -76 -40 -207 56 -56 37 -174 156 -1 -59 -6 40 31 -177
3334 -177 -90 70 -111 38 -26 -3 -12 50 -157 276 -6 14 148 38 -177 -98 159 214 -60 -130 45 -78 22
3357 22 -21 -252 -272 -54 -149 -149 -110 82 148 -214 -58 42 184 245 159 154 160 161 -18 -89 98 49 41 46 324 96 88 37
3385 37 83 134 137 -210 -20 -14 42 -37 -75 -1 -124 27 123 -39 12 11 300 -41 -19 -54 28 -28 -31 169 9 -129 142
3412 142 212 349 76 -137 -55 329 -38 16 155 -88 -51 -102 118 -19 -222 46 210 -43 26 9 111 -129
3434 -129 25 271 145 -99 198 106 17 122 35 -184 90 -124 12 -27 -110 34 67 160 -71 148 -109 -151 -109
3457 -109 -28 -30 34 -85 228 230 68 195 -281 -144 -142 51 -53 -47 -5 174 -43 79 -22 -158 77 83 -131 26
3481 26 -240 13 -55 -58 -116 106 13 -35 47 158 -357 -330 27 42 35 48 254 13 -41 -187 103 14 89 6 144 -106
$$ packed form
3309A58O6k78R2M1j05k0j12K95j9k08m7O1L6j67K63j12R3k11L30j57n8N3M6rk08
3334a77Q7J60j81J49o4K3rO2k07M33k82K0J34j10k15P9K57N5k74p0J75j23J00
3357B2m3k31k0K18r5%L9J92O6l62J56J00J42O1q6nOJj79p1J87m9qNK78k28qn1
3385C7M6N1Ll47J90ON6p9l8P4j23J51R6j62N1jK89l41K2l5Q2n6lK00j60j38K71
3412A42P0J37k73k13Q2L84l67N4J39k43L7n1K20j37k03K68J64k53O9j7J02k40
3434a29J54K46j26k44K97r2q9J05q7k19K74k14J36l9q3J44L3R3k31K19k57m2M2
3457a09Q1kO4j19L13Kj62J27m76J37KJ93j04OM2J79k17J22j01j36K35Ok14J57
3481B6k66K53o8ln8K22r3m8Q2J11n15K7L57J5pJ3K06k41n4j46K90q9P5q3J38k50
$$ plain form
3507 -106 21 116 217 -93 67 149 105 -242 3 244 -38 191 0 -180 -119 -41 65 -19 66 137 237 -193 55
3530 55 -113 191 219 -31 128 150 50 -156 161 -4 -13 -32 123 -39 -56 151 -28 -212 -95 184 -12 -32 32
3553 32 92 15 -47 62 -62 -155 -56 146 -22 -24 -164 90 26 -144 91 -35 79 48 -4 63 -45 -23 81 -11 8
3578 8 -34 -3 -133 -60 36 -166 226 -93 -260 -285 116 32 -23 253 132 54 122 68 81 -10 109 136 268 -29 104
3603 104 125 94 229 254 -103 -150 -71 200 -34 -4 305 -37 -52 66 -112 211 162 65 -141 57 574 2 -9
3626 -9 -24 186 165 286 38 241 -69 -75 -52 -184 -56 -90 -163 -215 -161 147 -1 -199 64 -123 62 -183 26 -26
3650 -26 -21 2 -203 64 6 -141 97 50 85 193 41 60 -53 133 56 226 230 -174 19 -187 23 -83 152 68
3674 68 -54 32 -107 112 18 -44 -137 -86 -238 301 -6 136 -65 -25 277 53 35 61 173 172 174 98 97 -56 -130 -194
$$ packed form
3507a06J27R5J01l10J60Q2m4l47K45K41k82K29j91j80O1P8J06q4Q5P1J00m30K48
3530E5j68L04K8k50J59K2j00k06L17j65rj9J55j62j7K07j79j84J17K79j96k0O4
3553C2O0p7o2J09j24r3R9K02j68kj40K54o4j70K35j26J14l1n2O7j08K2J04r2J9
3578Hm2L1j30P3R6k02L92l19j67k5M01q4n5K76j21p8O8n4J3r1J19K7J32k97J33
3603A04K1l1J35K5l57m7P9K71k34L0L09l42j5J18j78L23m9r7k06J98N17n72j1
3626ij5K10k1J21k48K03l10oK3j32J28l4p3n2N4L08j48j98K63j87J85k45K09n2
3650b6NK3k05K67n8j47K38m7L5J08j52J9j13J86p7J70Mm04J93k06K10j06K35q4
3674F8j22Q6j39K19r4o2r3N1j52N39l07J42k01M0L02k24j8K6J12jKp6jj53p4o4
$$ plain form
3700 -194 157 28 -28 130 -168 -16 -161 -16 27 -39 -227 -25 -14 17 26 -166 41 -13 -25 70 -139 282 -83
3723 -83 29 65 115 -32 215 45 123 -56 -194 155 4 -15 -162 -41 -29 -126 -178 128 -273 -118 -147 -180 -4
3746 -4 -98 -45 -14 159 100 120 208 4 -37 132 236 86 -98 19 -163 -102 254 -121 144 82 -195 3 -14 -137
3770 -137 59 -12 -229 -20 114 -225 -99 25 36 253 169 -92 44 216 151 -32 185 13 -27 -100 -154 -381
3792 -381 -128 1 78 69 -112 177 96 63 163 229 -74 -149 -40 -55 170 -69 -135 -169 -188 89 -98 -7 26 132
3816 132 -171 -108 -24 104 34 88 -77 132 -53 67 -136 -9 -67 52 -104 22 -26 -4 39 -2 -77 -147 -72 -50
3840 -50 60 -36 0 -32 429 104 7 -124 -160 -96 9 -21 -24 -127 162 75 -3 -149 90 -97 -80 55 -200 -48
3864 -48 -230 92 -142 62 -226 34 205 -10 -17 -270 92 -17 -4 85 57 114 92 66 -270 23 15 -79 78 -180
$$ packed form
3700a94L51j29n6J58k98J52j45J45M3o6j88K02J1L1Rj92K07n4j2R5k09M21l65
3723h3J12L6N0j47K47j70P8j79j38L49j51j9j47J21J2r7n2L06m01J55k9l3J76
3746dr4N3L1J73n9K0Q8k04m1J69J04j50j84J17j82O1L56l75K65o2k77J98j7j23
3770a37J96p1k17K09J34l39J26J24J1K17q4k61J36J72o5j83K17j72m0p3n4k27
3792c81K53J29P7rj81K89q1l3J00O6l03p5J09j5K25k39o6l4j9K77j87R1L3J06
3816A32l03O3Q4J28p0N4j65K09j85J20k03J27n8J19j56J26m8K2M3m1p5p0P5K2
3840e0J10r6L6l2M61l25r7j31l6O4J05l0lj03K89q7p8j46K39j87J7J35k55J52
3864d8j82L22k34K04k88K60J71k15pk53L62j09J3Q9k8N7k2k6l36K93qr4J57k58
$$ plain form
3888 -180 71 110 16 69 -143 37 63 -80 -6 57 -265 -230 -277 -131 13 97 245 -84 182 -13 144 102 -65
3911 -65 -124 230 117 -83 207 -48 -12 -358 118 49 106 -283 18 -63 -9 -46 -156 -133 -197 -113 -142 188 -230 288
3935 288 -67 253 -77 -215 161 -68 96 -79 -129 -163 12 -97 70 90 -91 -57 140 73 -157 112 -5 68
3957 68 -141 190 37 134 96 -39 7 -61 187 -259 100 53 190 -74 -77 206 -252 94 45 54 -206 190 74 137
3981 137 -191 106 -190 -210 217 -87 137 29 -62 -35 -142 -105 -46 230 -93 -40 35 -42 -73 324 -189 52 -14
4004 -14 -156 167 -118 140 -129 -245 -22 -353 -11 116 55 1 73 -123 -125 -203 -169 -220 51 -39 67 -57 -23 -73
4028 -73 -231 64 -189 38 -9 -108 40 29 139 211 -14 -154 -182 33 27 -233 132 138 482 19 -146 37 6 190
4052 190 162 84 117 -5 67 161 25 -239 72 -177 99 -185 -23 -202 0 -30 74 83 -148 -30 -110 130 -37
$$ packed form
3888a80K51L9r4N3k12J80K6j43P4O3l22L5m7J46J44Q4J48l29K66j95J57m2j67
3911f5n9L54j13k00K90k55L6l46M76o9N7l89L01q1N4l7j10K3o4Q4k9L30m18N18
3935B88l55L20l30j38L76k29J64j75n0l4J75j09J67K0j81L4J97o7k30K69j17P3
3957F8k09L31j53R7l8j35M6o8K48m46L59m7J37k64lK83m58L46m9Rk60L96j16O3
3981A37l28K97k96k0M27l04K24j08r1K7j07L7N9K76l23N3P5p7l1L97n13K41o6
4004a4j42L23k85K58k69j16K23l31L42J27o1n4P2j96kp8L4n1K71r0J06j24L4n0
4028g3j58K95k53K27m7r9J48j1J10P2k25j40k8K15ok60L65OL44m63j65J83l1J84
4052A90k8p8L3j22P2R4j36k64L11k49K76k84J62j79K02l0J04Rk31J18q0K40j67
$$ plain form
4075 -37 4 -226 88 -575 -299 123 79 -110 248 -307 -233 208 -174 -121 86 -121 44 -113 -248 148 48 -3
4097 -3 37 -138 21 207 257 -80 115 -69 101 -54 -267 71 61 2 -175 -44 -189 -91 110 -51 227 -27
4119 -27 -3 63 -13 1 -109 93 98 108 -152 51 79 236 -189 194 82 -14 13 172 -35 -128 -37 -112 -103 -121 -252 73
4145 73 -125 8 -117 -63 -20 171 95 -163 -37 187 174 -96 404 93 89 -75 170 -46 111 11 313 0
4167 0 244 281 130 23 80 73 -153 -108 -205 94 -27 -19 -268 -209 60 -308 189 -192 -113 55 -147 -6 40 41 115
4192 115 59 -127 -82 -2 234 -118 43 61 -154 -2 -201 -17 -85 16 -69 -120 -155 57 111 -145 -131 79 123 -168
4216 -168 4 -129 -71 35 337 313 -4 -62 -199 172 -121 85 70 24 -153 -174 189 -65 28 -67 -267 -47 61
4239 61 -55 224 -81 -89 -133 36 57 -54 47 50 -101 194 128 234 27 -219 81 11 -139 10 68 129 199 -2
$$ packed form
4075c7M1k30L14o63K76M22m4j89L58n55P4M41l82N3K07k07J65j57j35L96j00n1
4097cM0j75J59J86N0l37J95j84J70j55k13L38j0n9j77J31j45R8K01j61K78k54
4119b7K4O6p6J4j10K02NJ0k60K03K8J57m25L83j12r6K7J59k07r3R1p5Rj8j31L25
4145G3j98J33j25N4M3J91p6k58J26K24j3k70N00l11mj64K45k16J57j00L02l13
4167@K44L7j51j07N7pk26M5r7K99j21Qk49N9K69l68M97l81P9J68k02J41M6JP4
4192A15n6j86M5Q0K36l52J61J8k15J52j99J84o8J01q5n1l5K12N4k56J4K10M4k91
4216a68J72j33N8J06L02k4l17n8j37L71k93K06j5m6j77k1L63k54R3r5k00K20J08
4239F1j16K79l05qm4J69K1j11J01Lj51K95o6J06k07k46L00p0j50J49N8O1P0k01
$$ plain form
4263 -2 24 -184 197 -80 -125 178 -89 72 89 55 -25 254 -46 24 -31 -5 270 169 -81 -174 182 323 48 32
4287 32 44 116 105 123 11 -152 68 51 -25 -128 -256 -160 172 -46 -24 -3 -88 42 -30 192 18 11 -119 -19 -74
4312 -74 94 -6 122 117 129 117 156 -179 245 -21 98 89 8 106 -172 -144 -17 42 212 36 -104 -184 -137 242 -46
4337 -46 5 130 96 31 29 28 11 29 -43 -95 123 129 283 33 -84 -57 -47 198 -196 -196 124 44 -42 -14 -185 43 -117
4364 -117 -211 140 271 86 -140 -252 26 187 -203 197 -60 82 240 -66 7 100 516 -75 224 29 158
4385 158 -144 73 -147 -113 -57 197 3 93 63 233 -35 -207 -30 -278 57 -12 10 -265 144 -22 68 206
4407 206 66 -45 222 -110 -162 -87 127 -97 -66 81 -96 152 -31 93 -61 -349 -164 -139 -154 -112 63 -248
4429 -248 -210 32 -205 110 -116 -54 69 55 -76 143 -3 52 -172 74 41 -131 158 43 -170 270 -7 -24
$$ packed form
4263bK6k08L81k77m5L03k67J61J7l4q0K79l00P0n5K6K75j01k50r3L56J41k75j6
4287C2J2P2j1J8j12j63K20j7p6j03j28R6L32k18K2K1q5J30p2K22j74pj30J00n5
4312g4J68j00J28nJ2j2L9l35M24k66J19rq1R8k78K8J27N9J70j76j40q0M7L79k88
4337d6N1J25l4o5kjj7J8p2n2K18OJ54k50j17K7J0K45l94%L20q0q6K8j71K28j60
4364a17r4L51J31j85k26j12K78J61l90M00k57J42J58l06P3R3M16n91K99j95J29
4385A58l02K17k20L4N6K54j94R0l0J70k68j72J77k48L35o9K2k75M09j66R0J38
4407B06j40j11K67l32n2P5K14k24L1J47j77K48j83J24j54k88J85K5j5M2J75l11
4429b48L8K42k37L15k26O2J23j4j31K19j46N5k24K46l3j72K89j15k13M40k77j7
$$ plain form
4451 -24 -106 -59 128 -1 -8 81 90 -147 -146 12 226 -173 161 0 -67 -208 142 77 -40 -82 -131 157 -102 197 -87
4476 -87 -2 -186 -105 39 -46 301 57 -109 -181 32 -44 -37 46 -138 107 21 -172 -96 8 -161 -178 17 359 -64
4500 -64 127 -231 -135 -60 -261 -7 373 61 117 6 6 -124 20 -86 94 -66 117 -196 10 5 -256 4 205
4523 205 89 176 -241 -153 325 -81 -15 4 85 261 73 58 77 -20 -13 385 -260 24 -12 -188 -284 -96 -20 70 -55
4548 -55 -148 -82 27 45 107 1 -279 -34 -221 -166 13 -76 188 -181 193 132 45 -117 -286 -72 177 -82 234
4571 234 -66 3 212 2 107 -163 -36 -109 235 -55 -169 -133 -196 337 -72 177 131 -79 96 -44 -239 20
4593 20 286 -87 244 67 204 -62 -182 61 -130 -4 79 -165 -68 -44 -100 135 14 51 79 -45 -338 76
4615 76 92 95 103 -107 134 -11 32 14 88 5 72 -183 -147 267 -38 -99 -7 54 85 49 137 124 -188 -161 -106 -246 -170
$$ packed form
4451b4q2M7J87j29pQ9Rk37JJ58K14l99L34j61o7j41L50o5j17m2m9K88k59K99k84
4476h7Q5j84Q1J44q5L47k44j66p2K13p6PQ3j84K45q6j93P6J04j69j7J95L42m23
4500f4J91l58R6P5k01K54L80l12N6j11%j30J44j06J80j60J83l13K06nk61K60K01
4523B05j16Q7m17Q8M78m06O6J9Q1J76j88j5J9r7PL98o45K84l6j76r6J88P6R0j25
4548e5r3O6J09J8O2j06k80K45j87N5J79q9K64l69L74o1q7j62j69K14K49k59L16
4571B34l00O9K09k10J05k70J27p3L44k90j14L6o3N33m09K49m6k10J75j40j95K59
4593B0K66l73L31j77J37k66j20K43j91J26Q3k44R7K4n6K35j21L7K8j24k93M14
4615G6J6LQk10K41j45M3j8P4q3O7k55L6M14l05o1R2O1L1l6Q8j3l12K7N5j40P6
$$ plain form
4642 -170 70 -23 -27 -248 -212 -351 -56 18 -147 -19 102 -45 26 -16 -40 -43 -218 -16 64 142 36 35 -114 163 177
4667 177 21 -123 15 129 -30 -2 -23 -70 -75 -111 -32 -116 6 56 -27 -212 -224 -94 -48 107 108 71 235 73 75 96
4693 96 48 -254 -149 -23 28 59 242 -36 185 -59 -13 92 -126 248 38 -154 -42 -36 -171 -17 44 -110 -301
4716 -301 45 237 159 -70 -32 30 38 47 -221 -79 -136 67 69 355 67 -167 64 142 -68 -95 52 193 -171 154
4740 154 -181 -105 -138 133 -12 -132 -56 254 -147 -87 -162 -184 -24 -127 349 -5 70 86 -104 -187 -83 -13 -148
4763 -148 -53 -190 -94 -324 -26 162 -118 -74 -268 93 234 38 -150 -11 -8 28 95 -180 31 35 55 73 -191 -155
4787 -155 -25 34 -106 185 171 -69 136 -126 -14 -34 -65 -234 -88 29 91 -104 225 183 109 232 -19 82
4809 82 3 -99 -49 -35 66 -193 -5 237 1 -66 101 -22 -88 -105 37 130 102 -215 -10 166 -75 95 4
$$ packed form
4642a70K40r3mk21L6j39K95P4j65J28J21j47P1m2k4lj75K02Q0P8j06jj49K77J4
4667A77j56j44J38J14j59K8k1m7nl6P9q4J22N0q3j85j2J30M6J55Jl7J64j62KK1
4693I6m8l02J05J26N1L1J83k78K21k44M6J05k18L74k10j92J12Oj35J54O1j54j91
4716c01L46J92p8k29L8O2QRk68J42n7K03KK86k88k34K31P8k10k7J47J41l64L25
4740A54l35P6l3K71j45j20P6L10m01O0p5k2J60j03M76l54P5J6j90q3J04P0j35
4763a48R5j37R6k30K98J88k80M4j94L61J41j96j88J39LL6O7k75K11MK0J8k64L6
4787a55J30N9j40K91j4k40K05k62J12k0l1j69J46J17O2j95L29m2p4J23k51J01
4809H2p9j02N0J4J01k59J88K42k36o7J67j23o6j7J42R3k8l17K05J76k41J70r1
$$ plain form
4832 4 -73 115 92 -154 -73 265 -74 -135 -22 25 -51 108 -94 -44 128 -226 -43 6 194 14 -2 104 45 53 -215
4857 -215 81 4 -58 -201 121 -57 -145 14 -125 -45 -2 -23 91 -172 0 -87 213 -98 -270 -244 -244 -90 -31 219
4881 219 -2 9 -152 -254 145 -43 47 12 -133 -173 33 -57 -3 60 -41 -19 63 -35 101 -36 0 168 171 96 -163
4906 -163 91 -5 154 -58 290 -21 57 142 -240 23 114 -94 -34 -66 -26 -140 181 -64 301 -33 27 -126 -121
4929 -121 54 50 -23 21 262 -10 248 -188 68 -6 -177 198 -114 -142 130 140 100 76 199 227 -26 -91 98 -147
4953 -147 -53 0 -68 -142 -107 41 -77 104 84 16 25 17 -191 7 6 -133 -19 112 96 78 233 123 -111 144 90
4978 90 174 -48 -27 108 -16 10 -18 26 10 49 -11 186 34 -76 188 -67 -25 44 222 131 -33 -70 162 58
5002 58 -21 21 -244 146 -81 82 -68 -51 4 -47 101 -358 30 23 298 -25 -30 -104 -247 67 30 125 -50 -136 -102
$$ packed form
4832Dp7J88k3k46Q1L38l39o1J13M7p6J59k02N0J72l54J83M9J88j80j6J06n9Qk68
4857b15K96p7o2j43L22j78q8J59j39Q0M3k1J14k63J72q7L00l11j72K6%J54N9K50
4881B19k21J1j61j02L99j88R0l5j45m0K06r0N4O3j01K2Q2r8J36j37L6J68Lp5k59
4906a63K54r6J59k12L48l11P8Q5l82K63R1k08O0l2M0j14L21k45L65l34O0j53N
4929a21J75mp3M4K41k72K58m36K56p4j71L75l12k8K72J0m0k4J23K8k53o5J89k45
4953a47R4N3o8p4L5J48j18J81k0o8Rqk08J98jj39J14J31j6j8J55j10k34K55n4
4978I0Q4k22K1J35j24K6k8M4j6L9o0J97j52j10K64k55M2O9J78r1j64l7K32j04
5002E8p9M2k65L90k27J63j50J7N5n1J48m59L88pK75l23np4j43L14l7R5j75q6L4
$$ plain form
5027 -102 47 -21 -107 114 178 134 144 253 -138 6 60 124 -33 -52 -39 131 -36 -137 -43 58 286 -1 53 -89
5051 -89 103 100 102 40 -12 -177 126 -345 394 66 110 150 -130 85 47 151 -117 -166 14 98 -75 -81 -23 40 -37 -190
5077 -190 165 56 -22 73 -160 217 209 146 362 62 90 42 138 -75 -115 -7 72 69 -109 73 144 12 -180 6
5101 6 -164 148 221 -1 105 -124 48 123 -260 81 29 102 107 -148 -99 -161 97 -36 323 -133 146 112 214 35
5125 35 -67 193 33 -47 32 -24 -70 -208 -83 29 69 22 -112 -63 -122 87 -52 211 161 258 3 6 15 -133 266
5150 266 -31 263 83 126 53 -45 227 147 -23 -127 -183 142 -115 160 82 20 -122 169 60 -23 -72 -94 -65 -237
5174 -237 55 21 -158 -321 -2 -221 -122 -44 141 86 81 -243 43 129 0 -288 -124 -56 149 251 7 124 25
5197 25 -33 -591 126 20 -221 185 96 -20 37 -55 -42 -51 -298 99 -153 -190 -35 52 46 -89 46 19 -46 175 43
$$ packed form
5027a02J49o8q6K21O4m4J0J09l91J44N4O4j57j9J3J70j67j01R4J01K28k87N4j42
5051h9J92lKo2n2j65L03m71P39l28M4M0k80K15l8J04k68m9J80Q4j73oN8O3p7j53
5077a90L55j09p8R5k33L77qo3K16l00K8m8R6k13m0J08P9lj78J82P1j32j92J86
5101Fj70L12P3k22J06k29J72P5l83L41n2P3Nk55M9o2K58j33L59m56K79l4J02j79
5125C5j02K60j60q0P9n6m6j38J25J12M0m7j34M9n9K09j39K63n0R7k55LRj48L99
5150B66k97K94j80M3p3r8K72q0j70j04n6L25k57K75p8o2j42K91j09q3m9k2K9j72
5174b37K92l4j79j63L19k19R9P8J85n5nl24K86Q6j29k88J64O8K05J02k44J17r9
5197B5n8n58P17j06k41M06q9j16N7r2J3rk47L97k52l7J55Q7oj35J35k7o5K21j32
$$ plain form
5222 43 -31 -43 6 233 -101 137 -157 -38 -20 -113 -47 -116 16 -15 -78 86 3 -117 -85 -257 -53 39 -113 55
5246 55 104 151 119 117 -43 145 -192 181 61 48 191 -204 88 -8 -120 -55 -56 91 -50 -11 -143 -32 -142 -59
5270 -59 -104 55 80 76 -8 43 195 -181 4 52 84 1 -44 21 139 -9 -29 11 23 -48 175 -57 91 222 -5
5295 -5 99 88 120 165 -29 19 -111 147 159 23 -104 -54 69 50 396 44 -35 279 -122 110 5 136 47 281
5319 281 16 -139 -75 101 -20 -119 108 -95 187 -150 98 55 34 83 26 -39 28 100 162 -48 -81 -21 -193 -190 212
5344 212 -1 -174 4 -119 66 -41 141 43 -6 -59 82 58 33 -29 67 59 80 -230 -26 197 -70 -112 125 70
5368 70 -22 -105 73 36 -132 144 89 -10 262 -66 -125 130 -193 -64 -133 69 43 -126 -20 11 17 94 6 35 20
5393 20 -239 -7 67 140 -138 81 4 127 -4 95 -8 -5 -178 160 -17 -216 120 27 -27 65 249 77 54 315
$$ packed form
5222D3p4j2M9K27l34K38k94J19J8r3O6o9J32l1o3J64q3j20L2j72K04R2j52J68
5246E5M9M7l2kj60J88l37L73j20j3J43l95K92r6j12O5jJ47j41L9j32J11j10Q3
5270e9m5J59K5mq4N1J52l76J85M8L2q3m5O5J18j48k0M0J2p1K23k32J48J31k27
5295eJ04j1L2M5j94M8j30K58J2j36j27N0J23j9L46l52p9L14m01K32j05J31q9K34
5319B81k65j55O4J76j21r9K27k03K82l37K48m3k1M9n7o5O7P2O2k10l3O0j72LM02
5344B12k13j73J78j23J85j07J82r8m9n3J41k4k5o2R6qK1l10K04K23k67m2K37n5
5368G0r2q3J78l7j68K76n5r9K72l28n9K55l23J29o9K02k6j69J06L1OP7q8K9j5
5393B0k59K32P4P3k78K19p7J23j31R9j03Lj73L38j77j99L36r3n4R2J84j72k3K61
$$ plain form
5417 315 -76 -9 -99 -187 -19 -243 -94 -302 -56 -65 -79 230 85 39 -76 -119 -44 10 3 29 109 -32 137 86 23
5442 23 199 -112 82 82 -13 86 -368 -76 -7 -161 -204 241 105 -158 -45 -26 -17 143 -64 161 122 35 132 -13
5466 -13 213 35 193 52 34 69 76 145 -4 163 162 -24 159 -16 -112 -61 -199 -42 263 -60 -69 -14 -151 318
5490 318 28 4 -154 30 135 70 17 -10 -85 -132 125 231 231 68 199 74 27 139 1 -199 2 -40 105
5513 105 -204 -231 29 197 -142 113 -157 176 115 233 54 0 203 -9 182 -33 185 -4 -93 -31 -145 75
5535 75 104 30 135 -73 -100 -147 -37 -51 93 8 55 -178 -20 -182 148 128 88 72 37 26 -134 171 93 -194 47
5560 47 0 -309 4 13 -40 36 -66 30 -147 159 184 -304 251 55 151 -53 -44 109 25 -115 -37 -48 -52 57 -144
5585 -144 76 -101 57 -113 -137 174 -138 -141 169 150 354 79 205 4 187 57 -215 59 -6 71 -136 29
$$ packed form
5417C15l91O7r0q8J68k24J49k08K46rj4L09j45m6j15m3P5N4pK6Q0j41J69n1o3
5442B3J76l11J94%r5R9m54K92O9j54m3M45j36k63J13J9RJ60k07K25l9q7R7j45
5466a3K26j78J58j41j8L5PO9j49J67jj86J83j75r6N1j38J57L05l23rN5j37M69
5490C18k90k4j58J84J05o5n3k7p5m7K57J06%j63J31j25m7J12j38k00K01m2J45
5513A05l09k7K60J68l39K55k70L33o1J18j79n4K03k12J91k15K18j89q9O2j14K20
5535G5K9p4J05k08k7m7J10j4J44q5M7k33J58j62L30k0m0j6l5j1j60L05p8k87K41
5560D7m7l09L13Rn3P6j02R6j77L06K5m88N55j96R6k04RJ53q4j40P8j1mJ09k01
5585a44K20j77J58j70k4L11l12lL10j9K04k75J26k01J83j30k72K74o5P7k07J65
$$ plain form
5607 29 -78 -25 12 66 122 67 115 135 -106 167 -274 43 154 -39 -16 16 -146 244 -48 -24 -175 71 -2 93
5631 93 65 18 -139 -131 -71 -35 74 12 -94 -112 31 -156 -317 99 100 65 -111 -165 111 12 51 -93 132 54 168
5656 168 -124 -118 -101 44 156 48 -1 -99 106 137 -70 90 52 -41 -172 -96 -163 259 -105 57 112 141 163 -27
5680 -27 29 298 -72 -101 167 -41 -19 -107 180 114 -88 17 103 -33 181 84 -131 -221 73 -48 -26 -193 148
5703 148 -155 -99 -79 -181 -67 -89 -165 -45 -9 -89 81 116 -37 -39 -132 97 199 51 39 176 41 -6 -163 -97
5727 -97 -23 129 437 -139 -14 -251 -115 297 233 61 -210 -66 -35 108 -38 79 -61 218 -89 38 -6 86
5749 86 124 71 -40 170 91 42 192 119 -104 166 -83 144 35 49 20 -49 -89 159 35 -236 -2 -66 -6 30
5773 30 178 -111 100 32 -15 -68 144 179 33 57 -8 249 71 -26 150 -133 -43 126 -77 -14 -74 -71 86 -97
$$ packed form
5607B9j07N3L7N4N6n5M8K0k41K73m41L17J11j93K3L2j62L90k92K4j51K46p3R5
5631I3k8m7j57QO0L6J09o2j06j8J43j87j61M16Jl5j76n4K76r9L9j44K25p8J14
5656A68k92OJ7J45J12j08m9r8K05L1k07J60l8r3j31P6o7M22l64J62N5K9K2j90
5680b7N6K69l70k9K68k08K2q8K87o6k02J05Q6j36K14r7k15r0K94j21K2j67L41
5703A48l03N6K0j02J14k2p6J20L6q0J70L5j53kr3K29J02j48j2J37j35m7j57O6
5727i7P4J52L08n76J25k37J36M12o4j72k71J44L1J43j46J17j40K79l07J27m4R2
5749H6L8n3j11K10p9m9J50p3k23K70k49K27j09J4k9o9m0K48j24k71K34o4O0L6
5773C0J48k89K11o8m7n3K12L5j46K4o5K57j78r7J76k83R0J69k03O3o0LJ57j83
$$ plain form
5797 -97 -91 79 -32 72 51 161 91 108 62 41 -86 207 101 17 -60 52 -47 -81 114 -367 -187 62 -140 -266
5821 -266 204 183 108 64 -146 -18 -42 -19 188 95 -348 -92 76 93 -31 243 42 -265 -108 82 -116 16
5843 16 -107 -149 -3 73 -9 14 -161 11 -80 -245 -131 -38 73 -217 -211 -166 -126 -1 -204 22 162 23 6 -92
5867 -92 4 144 286 -104 52 -135 -14 -130 127 409 93 106 52 -104 238 -43 -255 111 -10 234 -80
5888 -80 34 41 229 -233 175 -36 97 -120 162 -231 -37 35 -100 -18 125 -180 117 128 130 154 -110 31 153
5911 153 18 209 117 235 39 -150 -13 -67 -82 5 193 60 119 -19 101 -60 -4 62 -95 200 -26 -170
5933 -170 -157 -102 -6 -117 257 -141 -143 110 -82 100 13 95 -22 82 -17 128 -4 -72 -62 -123 24 336 35 -213
5957 -213 74 -208 -108 161 -15 -163 -53 -150 126 -87 218 -10 63 100 12 -27 45 194 -91 226 -118 127
$$ packed form
5797i7OJ70j11J04k1J10p0J7m6k1j27K93j06q4p7J12r9l4J95m81J80K49k02j26
5821b66M70k1p5m4k10J28k4K3K07r3m43K56J68J7j24K74k01l07J57J90j98J32
5843A6j23m2J46P6q2K3j75J72r1j65J14R3J11k90OM5M0J25k03K26J40j39j7r8
5867i2R6J40J42l90J56j87J21j16K57K82l16J3n4j56L42k81k12L66j21K44l14
5888h0J14PJ88m62M08k11J33k17K82l93J94P2j35Q2J43l05K97J1KK4k64J41J22
5911A53j35J91r2J18j96j89J37n4j5Q7J88j33N9j38J20j61N6O6j57K95k26j44
5933a70J3N5R6j11L74l98kK53j92J82q7Q2j17J04r9J45j32o8J0o1J47L12l01k48
5957b13K87k82J00K69j76j48J10r7K76k13L05k28P3L7q8l9P2J49k85L17l44K45
$$ plain form
5979 127 -121 101 307 133 29 156 -51 96 111 -17 10 -124 -19 -115 179 113 -20 67 0 -12 -76 14 -7
6002 -7 51 -220 -69 141 208 6 26 66 -26 29 136 -88 -24 -182 97 83 75 -154 -150 291 -234 144 -103 -128 35
6027 35 -219 101 -158 -380 81 183 25 5 338 155 37 -147 141 265 -136 -208 206 87 271 -145 -104
6048 -104 135 -33 -102 -38 -4 325 -91 -9 178 -39 70 -206 -92 -52 231 34 -292 -62 -79 -134 96 -34
6070 -34 -145 -54 -202 262 -130 -107 5 -171 51 127 -105 -9 70 -48 177 16 40 -86 118 -92 55 135 105
6093 105 250 25 28 83 -183 162 -93 38 -44 -252 -84 -12 38 -7 -11 -103 -48 155 -25 -200 -50 212 -50 86
6117 86 22 31 138 -159 5 102 89 196 42 -102 0 74 89 98 -310 352 39 59 67 298 147 194 -80 158 -60
6142 -60 139 24 -82 -171 -50 -33 -81 54 77 32 -223 255 -265 58 -50 -40 133 -3 145 10 172 1
$$ packed form
5979A27k48K22K06j74j04J27k07J47J5j28K7j34J05r6K94o6j33Q7o7j2o4R0k1
6002gN8k71J51K10O7k02K0M0r2N5J07k24O4j58K79j4qk29MM41n25L78k47k5J63
6027C5k54L20k59k22M61J02j58k0L33j83j18j84K88J24m01p2M14j19J84m16M1
6048a04K39j68o9O4L4L29m16Q2J87k17J09k76J14M0K83j97l26K30j7n5K30j30
6070c4j11R1j48M64l92K3J12j76K22P6k32R6P9j18K25j61K4j26K04k10J47Q0l0
6093A05J45k25LN5k66L45k55J31q2k08J68P2N0m5mr2N5K03j80j75J50K62k62J36
6117H6o4RJ07k97J64R7j3J07j54j44J02P4J5Rm08O62l13K0QK31j51M7k74K38k18
6142f0J99j15j06q9J21J7m8J35K3m5k55M78n20L23j08J0J73j36J48j35J62j71
$$ plain form
6164 1 136 22 92 -31 -61 -101 -34 78 160 162 -280 22 -30 159 100 -169 43 -51 -66 277 57 26 211 -86 -11
6189 -11 39 22 184 12 -191 131 -269 -44 64 -67 -99 195 -49 -8 34 129 166 43 -72 15 3 150 -62
6212 -62 180 -124 90 3 143 32 -25 -101 45 169 333 60 185 207 53 62 -21 -18 -15 -35 144 -110 152 106 -168
6237 -168 0 12 -137 -19 -249 -79 202 6 138 52 140 -28 185 23 -74 -83 160 79 167 6 68 -41 38
6260 38 -39 1 -97 126 136 31 -73 -49 116 63 45 -198 -64 209 96 59 -94 -71 135 101 169 60 -32 -98 180
6285 180 148 64 135 183 -43 22 126 -145 133 -51 14 -79 77 24 -174 273 79 -92 -13 -2 -61 -99 64 241
6309 241 -131 52 -21 5 18 11 -133 140 161 -332 -14 25 248 -36 53 -75 -83 36 183 77 34 63 -27 47 -185
6334 -185 176 27 12 1 -5 212 -21 -43 181 143 -22 187 -111 -11 -88 -58 18 -86 -64 -223 113 -130 13
$$ packed form
6164AJ35j14P0j23l0m0O7J12Q2Km42L02n2J89n9k69K12r4j5L43k20l1J85k97P5
6189a1N0j7J62j72k03L22m00K25J08j31l2K94k44M1M2R5L7j23j15Q7j2J47k12
6212f2K42l04K14q7J40j11n7p6J46J24J64k73J25K2j54Rq3LLk0J79k54K62m6k74
6237a68J68J2j49J18k30J70K81j96J32q6Q8j68K13j62r7rK43q1Q8j61O2j09P9
6260C8p7M0r8K23J0j05j04K4J65n3j8k43J34K73j13l7j53K3K06l4O8j09r2o6K78
6285A80l2q4P1M8k26O5J04k71K78j84O5r3J56n3j98M47j94j71P9J1n9l8J63J77
6309B41l72J83p3K6J3pj44K73K1m93L18L9K23k84Q9j28qJ19J47j06m3K9r0P4k32
6334a85L61j49j5j1oK17k33k2K24l8j65K09k98J00p7L0P6j04K2j59L36k43J43
$$ plain form
6357 13 -89 38 -34 -272 -200 54 -252 -2 58 -47 3 27 101 278 -202 169 96 -68 176 151 95 -85 -129 -72
6381 -72 -236 -26 -35 -101 -72 -144 -130 -110 -200 122 263 24 -55 146 48 -158 -59 95 -94 187 -33 71 -151 126
6405 126 16 -168 229 -66 -34 110 55 26 -114 -222 242 -285 192 187 68 35 136 -19 234 -196 72 -206
6427 -206 67 62 177 -62 85 155 32 -16 340 -68 110 -135 329 182 124 -124 -31 117 32 -66 121 -45 -7
6450 -7 24 -63 383 -31 174 -160 -35 129 83 131 265 134 261 -20 -54 109 14 -43 -100 -116 75 -2 13 32 146
6475 146 -143 186 -62 -175 75 -251 224 149 -114 172 70 247 -135 109 -207 256 147 67 -64 -96 -150
6496 -150 67 331 -43 -28 -30 -95 -75 -25 93 -9 -77 55 157 0 -52 -66 73 63 -164 5 -225 -109 266
6519 266 -57 -173 7 -24 -151 29 100 -11 -212 7 -240 191 86 -2 89 20 -75 -143 -130 -84 -3 -110 138
$$ packed form
6357A3j02J27p2k38P2K54l06K50O0j05N0K4P4J77m80L71p3j64K44k5n6j80m4N7
6381g2j64K10ro6K9p2J4K0r0L22J41k39p9K01r8k06R9J54j89K81k20J04k22K77
6405A26j10j84L97k95L2J44n5k9j40j08M64n27M77nj19l3J01j55K53m30K68k78
6427b06K73nJ15k39J47P0j23m8L56m08J78k45M64j47n8k48R3J48q5r8J87j66L8
6450gL1q7M46m14K05l34J25J64m6M8J34j31J27k81l4J63r5n7n7j6J91p7J5J9J14
6475A46k89L29k48j13K50l26M75p5k63K86j02J77l82K44l16M63j09q0j31l2n4
6496a50K17K64l74J5ko5K0N0J18j02o8J32J02j57n2j4J39j0k27J69k30J16L75
6519B66l23j16J80l1j27J80P1j11k01K19k47M31j05q8R1o9r5o8J3M6Q1j07K48
$$ plain form
6542 138 74 124 -72 1 -117 31 10 -63 23 -27 -11 165 -89 74 115 141 223 31 -214 -49 56 -223 -72 -1
6566 -1 -44 38 -49 -29 -52 -21 -31 142 265 78 -182 -1 -38 27 -264 -6 207 150 128 102 93 -20 193 -11 -23 -9
6592 -9 -198 99 53 94 194 -98 -14 -126 -155 -47 270 206 -148 -35 56 50 122 -143 97 286 -29 -45 86 -22
6616 -22 35 -154 132 -270 229 76 84 -56 164 84 -14 30 -261 -37 30 -103 122 -69 -93 30 134 -185 45
6639 45 -119 91 -251 -213 64 23 -141 -122 27 24 -140 127 -209 13 12 -20 -214 128 56 -51 1 6 63 54 -99
6664 -99 81 -134 210 -5 -170 88 -57 -28 -108 -47 37 -63 88 136 61 -25 57 -27 223 39 123 -41 -50 11 70
6689 70 242 172 -33 135 -32 203 115 223 -75 -64 -175 -9 -175 235 66 -31 -96 77 86 44 172 4 -77
6712 -77 26 -226 74 32 64 97 142 265 214 -33 65 -138 -182 242 132 363 -152 170 66 -81 122 61 51
$$ packed form
6542A38o4N0j96P3j18J48k1p3Q6n0J6J76k54J63M1K6Q2j92k45J65J05k79J51P1
6566am3Q2q7K0k3L1j0J73J23j87k60J81l7O5k91K58K13n7k2k6rj13K13k04j2J4
6592ij89K97m6M1J00k92Q4j12k9J08L17o4l54J13R1oP2k65K40J89l15j6J31j08
6616b2N7j89K86m02M99j53Qj40K20q0r8M4k91K24O7j33K25j91k4J23J04l19K30
6639D5j64K10l42L8K77m1j64J9J49lj64K67l36K22jl2j94L42p2j07N2NN7rj53
6664i9J80k15L44k15j65K58j45K9q0O1Q4j00J51M8p5q6Q2q4K50j84Q4j64rO1N9
6689G0J72p0k05J68j67K35q8J08k98J1j11J66j66M10j69r7o5J73Rm2J28j68q1
6712g7J03k52L00m2L2L3M5J23n1k47R8k03m4M24j10K31n15L22j04j47K03o1j0
$$ plain form
6735 51 80 -196 -29 23 168 -237 100 -159 33 217 -67 102 39 -85 198 -103 202 -185 -183 -124 12 286
6757 286 -218 74 32 25 -86 -89 207 150 -41 -18 -191 -103 -100 187 -70 34 -20 -58 39 -87 -177 -165 88 -211 135
6782 135 25 -31 64 131 36 -223 228 -29 66 -10 -61 141 152 -271 -19 -26 98 62 -196 261 -39 -98 78 -26
6806 -26 -232 279 94 85 152 126 -122 195 23 -70 35 8 -134 16 -17 96 161 -111 97 -215 -98 -297 -125
6829 -125 96 -81 59 151 -206 -146 -42 54 -5 -184 56 -133 -241 24 46 97 -261 -79 64 163 -141 -139 85
6852 85 8 -106 122 -112 -87 62 -122 128 -118 -57 365 -183 171 -114 99 -118 89 -122 -172 -67 -49 138
6874 138 52 46 130 -53 100 -207 66 -70 118 47 11 -109 -35 207 -64 -138 191 36 -105 119 -100 76 -75
6897 -75 -84 -115 -94 40 231 80 47 50 40 -76 91 145 164 43 -225 -17 -11 -37 35 60 -152 56 55 206 175 120 -62
$$ packed form
6735E1K9k76J67N2J45m05L37k59J92J84k84J69o3j24K83l01L05l87KN9J36K74
6757B86n04K92m2pj11lK96n7j91K3j73Q8LK87k57J04n4l8R7j26r0J2K53k99L46
6782A35j10n6R5O7r5k59M51k57R5p6n1K02J1m23K52pJ24l6k58M57l00n9J76j04
6806b6k06N11j85rO7k6k48L17j72r3J05k7j42J50l3J13O5k72K08l12J17j99J72
6829a25K21j77J40R2l57O0J04R6n9j79K40j89j08K65K2N1l58J82J43R9l04KK24
6852H5p7j14K28k34K5J49j84K50k46O1M22n48L54k85K13k17K07k11n0J05J8J87
6874A38q6oQ4j83J53l07K73j36J88p1l6j20P4K42k71p4L29j55j41K24k19J76j51
6897g5rl1K1J34J91j51l3Lj0j16J67N4J9j21k68K08Ok6P2K5k12K08jJ51l1n5j82
$$ plain form
6924 -62 -21 -151 21 155 18 -142 73 -76 -49 38 -180 -88 33 120 82 -27 -69 -197 10 -80 -51 22 -86 25
6948 25 -161 -242 41 -115 -37 83 -69 -39 -128 1 -92 -49 166 103 7 87 -17 55 267 190 -19 115 -16 -26
6972 -26 120 -188 136 -140 -182 156 56 -109 -118 50 -38 -112 -145 -93 -103 144 127 -178 53 -181 135 212 121 47
6996 47 35 25 39 115 40 129 -21 -132 41 205 118 -110 182 70 191 -105 131 -20 138 -55 142 64 14
7019 14 242 78 10 -68 -87 139 131 53 93 -164 124 -50 196 64 -158 84 -201 114 -132 94 124 -222 93
7042 93 42 -3 21 104 22 87 -67 25 159 108 -41 106 -29 -117 -12 -58 33 -46 13 183 -163 -64 -117 -185 -64 84
7068 84 -42 -46 -155 18 107 -127 -185 -62 -90 8 84 -187 205 1 -186 195 225 -234 -157 20 -34 20 9 213
7092 213 109 -137 134 110 101 89 -127 -83 -91 -384 234 -79 -83 -37 -199 -124 5 -30 -18 45 63 -181 -93 -148 -122 43
$$ packed form
6924f2M1j30J72J34j37j60K15j49K7Q7k18R2J21Q7l8j09m2j28K07r0K9P3j08J11
6948B5j86q1K83j56P8J20j52L0q9J29r3M3K15o3r6Q0j04P2K12p7k09J34j31j0
6972b6J46l08L24k76m2L38j00j65rJ68q8p4l3N2j0K47j7l05K31k34L16P7r1p4
6996D7j2j0J4P6p5Q9j50j11J73J64q7k28K92j12J21k96K36j51J58j93J97p8n0
7019A4K28j64o8p8j9K26qp8M0k57K88j74K46j32k22K42k85L15k46K26L0l46L15
7042I3n1m5K4Q3q2O5j54R2J34n1j49J47j35q8J05m6R1p9N9J70l46R9n3o8J21J48
7068H4j26mj09J73Q9k34n8J23k8R8P6k71L92k04j87L81L0m59P7J77n4N4j1K04
7092B13j04k46K71k4rj2k16M4qk93O18l13mM6j62P5J29l5J2O3J8k44Q8n5K6J65
$$ plain form
7118 43 67 -45 44 67 72 168 46 -332 51 -168 -81 130 -33 53 34 261 -89 124 258 27 -230 -50 3 117
7142 117 122 -240 253 -159 -54 -8 224 -85 79 17 78 74 -102 38 47 107 -152 -10 -108 154 46 -81 -116 -37
7166 -37 -80 -104 -268 85 6 -100 -286 52 59 -126 103 -163 -19 -313 -145 -128 -26 96 -88 -22 -181 79 -45
7189 -45 -94 -123 -114 -99 167 -348 -57 199 -315 126 178 85 32 -190 -12 -10 -7 -100 -322 -158 24 -34 88 -71 50
7214 50 462 245 120 44 88 -100 102 47 -220 149 220 22 259 189 -220 65 -55 -260 -137 -176 -305 -57
7236 -57 -53 181 231 182 87 209 59 13 -51 -111 -60 117 -324 -266 -11 154 99 35 38 62 68 17 -160 -124 -72 -80 -20 64
7264 64 418 148 -8 171 -101 -82 276 73 62 -27 -5 327 30 -40 71 -42 -84 52 -114 -207 -78 60 58
7287 58 -58 -15 341 56 -74 78 13 50 -198 -78 -189 192 188 1 151 -248 -71 1 100 42 79 99 -261 -96
$$ packed form
7118D3K4j12Q9K3NR6j22l78L83k19Q7K11j63Q6j9K27l50K13J34k31k57J80N3J14
7142A17Nl62M93m12J05M6K32l09J64o2O1mj76J40RO0k59J42r8K62j08j27l5P9
7166c7m3k4j64L53p9j06j86L38Pj85K29k66J44k94J68J7J02J22j84O6j59K60j24
7189d5m9k9RJ5K66n15K91K56n14M41N2r3n3k22J78KLr3k22J64J82n8J22j59J21
7214E0M12k17j25p6M4j88K02n5k67L69P1j98K37p0m09K85j20k05J23l9j29K48
7236e7MK34N0m9r5J22j50m6o4o0N1J77m41N8K55J65n5o4LK4On1j77L6N2qO0Q4
7264F4L54k70j56J79k72J9L58k03j1q9K2L32k97p0J11j13m2J36j66r3J29J38k
7287E8j16M3L56k85j30J52o5L7k48J20j11L81mj87J50l99J77P2R9n8L7K0l60J65
$$ plain form
7311 -96 -156 -96 41 -167 2 -199 44 79 -145 51 98 45 -42 -180 -229 -93 5 -268 -214 -234 -138 120 -107 54
7335 54 -5 192 79 -46 -12 -26 47 -139 -21 174 -68 176 -201 61 -57 -77 135 -247 33 -40 -107 -69 -47
7358 -47 -146 -158 -156 77 284 -140 -247 96 -20 187 -77 -19 33 182 98 43 394 -112 92 109 87 4 -108 -100 -228
7383 -228 -91 -35 40 205 12 -31 -139 -41 25 -30 163 184 34 104 -118 -105 85 223 169 -26 345 -100 -6 -30
7407 -30 168 124 -4 -65 -95 -12 -4 -137 -194 77 130 308 -197 -89 -50 -181 33 19 -44 84 79 -77 -46 132 135 -30
7433 -30 -170 -98 -70 20 153 47 -42 -327 -90 -50 -17 20 5 -23 -123 43 -17 -133 51 61 -225 -52 58 -147
7457 -147 -25 179 31 79 13 156 108 62 152 128 96 -70 87 27 86 -47 -5 93 97 248 -8 -32 12 7 220 -74
7483 -74 -242 214 -47 -79 -75 -33 -9 -120 210 -27 100 -102 39 -15 -90 5 15 -113 218 23 66 158 209 -9
$$ packed form
7311i6o0O0J37k08J69k01K43L5k24J96M7n3q7j38m9J36R8k73N4k0R6K58k27J61
7335E4n9J97j13j25L4j4P3j86J18J95k42K44l77K62j18k0K12l82K80p3o7L8K2
7358d7r9j2KK33K07m24j07L43j16K07k64N8N2J49q4n5L51n06K04J7k2q3j12Qj28
7383b28J37N6P5J65j93m3j08R8O6n5J93K1j50P0k22J3J90J38n4j95L71m45R4k4
7407c0J98m4j28o1l0Q3Qj33n7K71N3J78n05J08L9j31K14j4o3J28nj56L1J78Lj65
7433c0j40P2K8R0J33j06q9k85K37M0L3L7j5k8j00J66o0j16J84J0k86J73J10k05
7457a47J22K04j48M8o6J43m8m6R0k4l2j66J57o0N9j33M2R8MJ51k56k4M4nK13k94
7483g4j68M56k61l2MM2K4j11L30k37J27k02J41n4p5R5J0j28L31j95M3R2N1k18
$$ plain form
7507 -9 -315 75 -61 145 -31 150 -153 -131 -59 -9 19 -151 23 128 233 -153 234 175 -17 -63 -32 110 -59
7530 -59 -125 -153 20 62 -7 87 -195 -114 -47 -17 -18 100 -9 -95 4 -126 31 -107 79 102 -26 -199 116 -101 -187
7555 -187 9 72 -35 61 115 -73 -75 48 -89 -66 69 -157 -27 74 46 63 93 51 182 94 -141 -153 31 -105
7579 -105 37 -171 -67 -114 -16 -109 5 -112 201 80 92 35 117 51 -123 -6 64 15 180 259 -92 -26 182 133
7603 133 114 -120 -137 27 257 -69 128 103 -13 -103 -31 139 5 -26 -61 -150 -56 6 -80 155 -122 251 -168 -201
7627 -201 22 40 22 65 -153 22 -154 -127 12 15 38 97 274 186 -196 41 0 60 -85 59 -41 -196 -108 -141
7651 -141 -95 -103 -114 -134 59 -133 -88 99 54 -126 -66 -128 118 -111 240 52 155 -77 53 -58 18 -127 54
7674 54 -15 53 -234 17 -139 83 -207 -79 30 115 -30 -133 -110 -288 174 144 84 -156 -70 45 -76 65 -10
$$ packed form
7507il06L90j36K06j76J81l03K2P2N0K8j70J74J05J05l86L87n9j92m6L1J42j69
7530e9o6k8J73M2o9R4k82Q1O7L0jJ18j09q6R9j30J57j38J86K3j28j73L15k17q6
7555a87J96O3j07R6N4j88kJ23j37K3J35k26J30J01k8J7L0m2J31q8k35j2J84j36
7579a05J42k08J04m7R8r3J14j17L13j21J2n7Q2o6j74J17P0m9J65P9l51O6K08m9
7603A33j9k34j7J64K30l26J97k5j16r0P2J70j34l1l5q9R4O2q6K35k77L73m19l3
7627b01K23J8j8M3k18J75j76K7J39LK3N9J77q8l82K37m1O0j45J44j00j55Q8l3
7651a41M6qj1k0J93j92M5J87m5j80O0o2K46k29L51j88J03k32J30j11P6j45J81
7674E4o9O8k87K51j56K22k90J28J09Q5j45j03K3j78M62l0o0k40Q6J15j21J41p5
$$ plain form
7697 -10 -79 -67 -49 -115 -39 106 -194 -40 -101 -2 -173 -138 -128 -136 279 26 -79 -206 -29 30 10 99 76 54 44 65
7723 65 -58 -17 202 161 -86 147 155 -125 28 -99 -64 57 -3 -165 95 -164 89 73 72 138 90 -83 83 -32
7747 -32 279 172 41 -67 -16 -476 126 43 93 114 156 70 -43 -129 45 -29 160 22 96 -43 92 -56 146
7770 146 37 245 -95 -89 -122 -32 -203 -309 108 -12 -104 111 77 -256 -75 55 205 -258 -116 -222 166 106
7792 106 86 -37 -25 62 52 60 18 -78 -57 -84 108 12 -71 70 -113 186 130 -260 100 29 -54 -79 47 -163 -51
7817 -51 -123 -79 -104 -164 67 7 344 -121 32 -133 101 230 -65 -55 -232 12 -110 95 69 -72 -92 122 -76
7840 -76 22 -56 49 21 32 213 157 -191 -217 1 -164 -83 123 289 -53 16 98 -219 31 -113 -78 235 144 -147
7864 -147 24 89 5 -63 18 -182 -287 123 5 0 -104 -43 -44 -117 136 -190 143 174 294 99 -87 75 -146 12
$$ packed form
7697a0o9J2J8o6P6J45l00J54o1R9j71L5J0qM15k53j05j27J77N9k0Q9k3k2j0K1
7723F5j23M1K19m1k47K33Qk80J53j27L5J21o0j62K60k59K53j6jO6m8j73J66j15
7747c2L11j07j31j08N1m60O02q3N0K1M2q6j13q6J74p4J89j38P4j39J35j48K02
7770A46j09K08l40Ol3R0j71j06M17j20r2K15l4l33J81J30J50m63J42j06L88o0
7792A06k0j23J2Q7j0Qm2r6K1k7J92r6q3J41j83K99n6l90L60p1q3k5J26k10J12
7817e1p2M4k5o0K31o0L37m65J53j65K34J29k95J0j77K44j22K05k6j41k0K14j98
7840g6R8p8J05k8J1J81n6l48k6K18j65Q1K06J66l42O9Q2l17K50j44L5L13r1k91
7864a47J71O5q4o8Q1k00j05M10j18nj04O1jp3K53l26L33L1J20j95j86J62k21J58
$$ plain form
7888 12 104 54 -50 -204 -212 -120 -58 155 -3 8 16 236 -67 15 -51 -14 104 72 48 -87 -8 -343 93 165 -51 11
7914 11 160 -73 -38 20 -12 71 67 237 -136 124 15 93 -91 49 110 -133 -135 162 -54 -70 129 100 -142 16
7938 16 36 -89 33 -51 -48 -95 -23 11 100 281 -6 -253 -401 1 -62 40 26 48 -160 22 -136 -82 -249 -11
7962 -11 -56 -79 -21 -159 205 5 203 -108 109 -48 160 -298 133 42 -182 250 -19 41 141 -136 -27 137
7984 137 -8 142 -71 209 87 16 239 17 -89 36 -56 -144 -108 33 -187 -186 -103 9 16 138 3 47 -20 41
8008 41 99 223 -93 -135 237 48 -236 -147 1 -43 204 248 -75 119 131 -14 28 167 -56 -1 205 163 -190
8031 -190 -17 69 70 79 181 42 123 -2 91 186 3 -147 219 114 216 -53 -42 -40 74 106 29 -39 -185 -69 -54
8056 -54 -38 87 -177 134 -151 89 48 76 -176 -148 -159 -158 342 -152 54 -98 -212 -88 -124 196 79 108 -81
$$ packed form
7888A2R2n0j04j54qR2O2K13j58J1QK20l03Q2o6L7J18l2k4j35P9l35M36P2k16O2
7914A1J49k33L5N8l2Q3mJ70l73K60j09P8j84J40O1k43kK97k16j6J99k9k42J58
7938A6K0j25J22q4Lm7P2L4Q9J81k87k47j48M02o3J02j4K2k08J82j58N4j67K38
7962a1m5k3N8j38L64k00J98l11K17j57K08m58M31r1k24M32k69O0J00k77J09J64
7984A37j45J50k13K80j22p1K23k22j06J25r2q8L6J41k20JQ3J12PJ22j35M4o7O1
8008D1N8J24l16m2L72j89k84Q9J48m4K47M4l23J94J2j45M2J39k23N5K06m2l53
8031a90J73Q6JRJ02j39Q1j25R3R5j83j50L66j05J02k69J1KJ14L2p7o8j46J16J5
8056e4J6J25k64L11k85K40m1K8k52K8j1JN00m94K06j52j14J24l6L20j17K9j89
$$ plain form
8079 -81 -139 85 62 131 20 -163 -141 -176 -72 108 -240 58 -231 -181 39 105 -97 -24 64 25 -86 171 -180 -159
8103 -159 -91 -213 -141 -23 116 -4 -17 -17 6 -79 -95 88 -192 -14 3 256 118 50 -59 20 78 -84 -40 -171
8127 -171 300 -161 -5 -147 109 63 -34 86 -137 334 46 -85 189 -156 87 94 -96 256 -128 -46 50 -61
8149 -61 -66 -45 34 -206 222 -135 -173 14 201 4 200 -141 39 -17 57 195 -103 -146 90 21 110 133 90 43 118
8174 118 112 78 188 57 -202 -3 42 105 321 224 11 -120 -45 216 207 151 -82
$$ packed form
8079h1n8K24k3O9j11j83K2l5J04J80l48K98k89N0K20O6k02P3Q8l9j11K57l51K1
8103a59O8j22P2J18J39j20j3%K3q5j6J83k80J78J7K53j38o8j09P9N8j62M4j31
8127a71M71m61J56j42K56m6r7J20k23M71k88j31K74l45K43Pj90L52l84Q2R6j11
8149f1nK1P9k40M28l57l8J87J87j97J96l41J80n6P4J38k98m3K36o9Q9K3m3m7P5
8174A18ol4J10j31k59J99M5O3K16r7k13j31P5K61rn6k33
8191h2
$$ Imaginary data points
##PAGE= N=2
##DATA TABLE= (X++(I..I)), XYDATA
$$ plain form
0 0 0 0 0 0 0 0 0 0 0 0 0 0 0 0 0 0 0 0 7 -8 8 -8 8 -8 15 -16 16 -17 23 -24 30 -32 38 -40 47 -52 56 -64 72 -80
40 -80 89 -98 110 -120 134 -146 162 -177 197 -216 239 -263 289 -320 354 -392 437 -489 551 -624
60 -624 716 -830 977 -1175 1459 -1898 2649 -4180 8484 -43961 -148236 29590 136453 8705
74 8705 -75764 20301 70575 7584 -16113 -901 -30502 -5230 70377 27716 -69503 2089
86 2089 135543 60577 -97085 -29506 115633 41115 -98810 -44861 64527 31687 -35437
97 -35437 -5908 21128 3456 27574 33075 -46522 -57469 46121 50390 -84141 -96152 54813
109 54813 75054 -64024 -74108 49740 61906 -32163 -48140 1711 -3679 -24930 -8313 -27496
121 -27496 -56418 5834 61356 -11200 -70646 20398 94102 -4774 -86747 2046 69916 -6605
$$ packed form
0@%%%%%%%%%%%%%%%%%%Pj5J6j6J6j6K3l1L2l3M0m7N4o2P0p8Q7r9J08j20J36j52
40h0J69j87K08k30K54k80L08l39L74m13M55n02N52o09O74p46Q29r26J040j175
60f24J340j546J807k152K634l357M547o829J2664n2445j04275J77826J06863j27748
74H705q4469R6065N0274o2991k3697J5212k9601K5272P5607m2661r7219P1592
86B089J33454p4966j57662O7579J45139p4518j39925N3949J09388l2840o7124
97c5437K9529K7036j7672K4118N501p9597j0947J03590M269j34531j2011J50965
109E4813K0241j39078j0084J23848J2166r4069j5977M9851n390k1251J6617j9183
121b7496k8922O2252N5522p2556n9446R1044P3704r8876q1973Q8793O7870p6521
$$ plain form
133 -6605 -58420 1141 42386 13929 8412 25973 5762 8984 54186 27520 -47161 -20246 62230
146 62230 30575 -60861 -27304 68947 42057 -36998 -15029 40241 19789 -22156 -16719 -10121
158 -10121 -23457 -5708 9742 -30678 -39438 26756 44475 -28385 -50784 23240 41401 -38284
170 -38284 -60292 2242 17036 -24173 -27972 2029 6634 2947 17153 5102 -23057 1991 34128
183 34128 -7609 -50427 -7414 42950 5427 -38413 5533 51087 19487 -11284 9034 23205
195 23205 7497 1101 5614 -7334 -6318 27199 24484 -14855 -3630 43307 32351 -20986 -19260
208 -19260 24507 14100 -30361 -25001 3889 1433 -10301 -4745 -210 -5947 2879 10164 -16599
221 -16599 -33143 -3917 8049 -27476 -41808 -2446 19895 -10444 -22680 9679 20883 -736
$$ packed form
133f605n1815N9561M1245k8457n517J7561k0211L222M5202k6666p4681K6915Q2476
146F2230l1655r1436L3557R6251k6890p9055K1969N5270k0452m1945N437O598
158a0121j3336J7749J5450m0420q760O6194J7719p2860k2399P4024J8161p9685
170c8284k2008O2534J4794m1209l799L0001M605l687J4206j2051k8159K5048L2137
183C4128m1737m2818M3013N0364l7523m3840M3946M5554l1600l0771K0318J4171
195B3205j5708o396M513j2948J016L3517k715l9339J1225M6937j0956n3337J726
208a9260M3767j0407m4461N360K8890k456j1734N556M535n737Q826P285k6763
221a6599j6544K9226J1966l5525j4332L9362K2341l0339j2236L2359J1204k1619
$$ plain form
233 -736 -7725 -442 -2565 -6011 1746 -1245 -14251 1877 27463 12671 -9572 8960 32465 13985
247 13985 -14964 -3327 17920 4454 -10790 788 11616 10269 10608 13356 7318 2840 14257
260 14257 11625 -13585 -15414 7031 5782 -16551 -14753 11201 13583 -6580 -5780 6563 426 -9964
274 -9964 -11260 -13566 -18196 -13982 -5489 -12551 -17612 160 10924 -3755 -12295 502 8324 -7031
288 -7031 -17752 -5234 2353 -4715 -3453 5228 8389 8969 13327 13372 3976 3751 12922 5799 -8030
303 -8030 -1142 11870 8400 -529 6016 18054 12673 3815 6156 5235 -1199 -3839 -4004 -6606 -8062
318 -8062 -483 4691 -2004 -2296 7742 7155 -3595 -8370 -3200 -3657 -13477 -14518 -7235 -6694 -7195 -2850
334 -2850 -872 -1452 -906 1225 -3090 -10643 -7137 -2640 -9010 -11163 -3521 3402 2739 651 6697 10262
$$ packed form
233g36o989P283k123l446P757k991j3006J6128K5586j4792k2243J8532K3505j8480
247A3985k8949J1637K1247j3466j5244J1578J0828j347L39K748o038m478J1417
260A4257k632k5210j829K2445j249k2333J798K5954K382k0163Q00J2343o137j0390
274i964j296k306m630M214Q493p062n061J7772J0764j4679q540J2797P822j5355
288g031j0721J2518P587p068J262Q681L161N80M358M5r396k25R171p123j3829
303h030O888J3012l470q929O545J2038n381q858K341r21o434k640j65k602j456
318h062P579N174o695k92J0038n87j0750m775N170m57r820j041P283N41n01M345
334b850J978n80N46K131m315p553L506M497o370k153P642O923o63k088O046L565
$$ plain form
350 10262 5718 3996 3765 1433 818 2232 3151 3036 5200 12185 13317 7955 9582 12075 8123 945
366 945 -1714 70 -1633 -5298 -2882 -68 438 2842 3225 1481 -240 -1209 -2550 -8050 -11830 -8211
382 -8211 -7360 -9101 -7861 -3379 732 200 -1450 526 -274 -3551 -4828 -6901 -7396 -5688 -3697 -1881
398 -1881 -1160 2215 6619 4396 2532 3127 2453 538 -2274 -2756 -19 1479 2867 5361 6959 9891
414 9891 10563 8251 6913 4841 3556 1930 -1915 -1747 1174 2140 2537 2799 4964 6280 3227 721
430 721 -1435 -4233 -5296 -7624 -9735 -8047 -6130 -4130 -3431 -3152 -388 -52 -2890 -4072 -5788 -5992
446 -5992 -5942 -7224 -6564 -2626 -212 1539 2136 3639 5591 4006 1814 -170 -1465 -110 -815 -2095
462 -2095 935 4017 5718 6458 5940 7456 7024 4203 1862 -522 -403 276 -1534 -448 2056 4340
$$ packed form
350A0262m544j722k31k332o15J414R19j15K164O985J132n362J627K493l952p178
366I45k659J784j703l665K416K814N06K404L83j744j721r69j341n500l780L619
382h211Q51j741J240M482M111n32j650J976q00l277j277k073m95J708J991J816
398a881P21L375M404k223j864N95o74j915k812m82K737J498J388K494J598K932
414I891O72k312j338k072j285j626l845J68K921R66L97K62K165J316l053k506
430G21k156k798j063k328k111J688J917K000O99K79K764L36k838j182j716k04
446e992N0j282O60L938K414J751N97J503J952j585k192j984j295J355p05j280
462b095L030L082J701P40n18J516m32k821k341k384J19O79j810J086K504K284
$$ plain form
478 4340 5517 4818 4968 5099 2781 -243 -2705 -4605 -3930 -4568 -5285 -3122 -1809 -220 304 -1524 -1482
495 -1482 -2363 -4207 -6481 -8976 -7454 -5668 -6785 -5145 -1537 399 1673 1680 1001 1396 25 -680 -2246
512 -2246 -3240 -881 1219 1697 3381 5694 8118 8215 5853 5420 4614 1525 -337 -1037 -626 108 427 2699
530 2699 3929 3757 5359 4450 1829 418 -664 -1677 -4142 -4938 -1961 -1831 -2140 485 1613 1446 346
547 346 -470 -1181 -4235 -6312 -4871 -6039 -6442 -4327 -1909 -946 -1107 298 1968 -1249 -2910 -1758 -3005
564 -3005 -4782 -4064 -1859 -440 -9 3189 6261 5080 4452 6230 4976 2177 943 1253 1356 -192
580 -192 2029 4743 3681 4313 6452 6098 3381 1386 1742 39 -4272 -3658 -1538 -2877 -2763 -535 1374
597 1374 619 -653 1028 -731 -4582 -4093 -3516 -5607 -5988 -3671 -966 -1340 -1751 1786 2180 -303 -909
$$ packed form
478D340J177o99J50J31k318l024k462j900O75o38p17K163J313J589N24j828M2
495a482q81j844k274k495J522J786j117J640L608J936J274Po79L95j371p05j566
512b246r94K359K100M78J684K313K424R7k362m33q06l089j862p00M11P34L19K272
530B699J230j72J602r09k621j411j082j013k465p96K977J30l09K625J128j67j100
547C46q16p11l054k077J441j168m03K115K418R63j61J405J670l217j661J152j247
564c005j777P18K205J419M31L198L072j181o28J778j254k799j234L10J03j548
580a92K221K714j062O32K139l54k717j995L56j703m311O14K120j339J14K228J909
597A374p55j272J681j759l851M89N77k091l81K317K705l74m11L537L94k483o06
$$ plain form
614 -909 -900 -2629 -4340 -4326 -2417 -2817 -2330 2036 2702 1139 3150 4710 3218 -241 -249 1982 -385 -1754
632 -1754 1080 2962 3145 4392 5961 6020 4614 4386 4199 244 -1138 839 114 -2200 -1544 1475 2752
649 2752 386 -289 1651 42 -2682 -3742 -4537 -5263 -5543 -3941 -3725 -4205 -1094 1644 -794 -2156 -203
666 -203 521 -2293 -4989 -3133 -1376 -2923 -1713 371 1336 2950 3582 3257 2112 1269 2337 436 -2894
683 -2894 -1111 1519 1173 203 1228 5100 5468 2766 3152 3106 1699 878 -262 -995 -610 780 2314
700 2314 935 1010 4217 3694 320 -1133 -412 -811 -3593 -5428 -3510 -2460 -2457 -1802 -1918 -1034 151 -908
718 -908 -2272 -4208 -3600 -2329 -4680 -5239 -2588 339 443 -372 1226 3919 2969 1294 993 579 733
735 733 377 -493 156 1604 3495 3716 1935 3299 4878 2999 887 -435 472 768 -1439 -1475 394
$$ packed form
614i09Rj729j711J4J909m00M87M366O66j563K011J560j492l459qK231k367j369
632a754K834J882J83J247J569N9j406k28j87l955j382J977p25k314O56L019J277
649B752k366o75J940j609k724j060p95p26k80J602K16m80L111K738k438j362J953
666b03P24k814k696J856J757j547J210K084R65J614O32l25j145q43J068j901l330
683b894J783K630l46r70J025L872L68k702L86m6j407q21j140p33L85J390J534
700B314j379P5L207n23l374j453P21l99k782j835J918J050LO55j16Q84J185j059
718i08j364j936O08J271k351n59K651K927J04q15J598K693r50j675l01m14J54
735G33l56q70O49J448J891K21j781J364J579j879k112j322R07K96k207l6J869
$$ plain form
752 394 1192 2358 1574 1328 1915 1906 212 -1904 -3032 -1648 -1286 -3034 -2322 -511 911 784 -713 -24
770 -24 -6 -1386 -2658 -4013 -4001 -2954 -3028 -2963 -2219 -336 1324 560 -435 611 928 -25 -1265 -1577 84
789 84 612 301 1285 2637 3918 4421 3402 2732 2982 2482 1461 -7 -135 1380 1018 705 1370 2066 2606
808 2606 1526 -78 60 -640 -1548 -2527 -3313 -2209 -1362 -1554 -799 -726 490 1351 -529 -1395 -1392 -1707 -2389
827 -2389 -3276 -2724 -1430 -990 -307 155 425 1500 959 -197 -867 -1284 -1025 -1269 -2451 -980 512 1215
845 1215 1512 1624 2834 3057 1752 1325 1162 483 709 638 519 1480 2278 3005 2570 1686 2885 1896 65
864 65 -465 -1233 -1017 -1690 -2049 -773 -595 -689 148 -632 -632 -485 -1420 -2021 -3171 -3032 -1873 -2406 -2601 -620
884 -620 248 559 236 653 886 21 -715 -378 -1390 -1125 -64 245 -67 806 2067 2617 777 847 2142
$$ packed form
752C94P98J166p84k46N87rj694k116j128J384L62j748P12J811J422j27j497O89
770b4J8j380j272j355J2J047p4O5P44J883J660p64r95J046L17r53j240l12J661
789H4N28l11R84J352J281N03j019o70K50n00j021j468j28J515l62l13O65O96N40
808B606j080j604J38p00r08r79p86J104Q47j92P55P3J216Q61j880q66Ll15o82
827b389q87N52J294M40O83M62K70J075n41j156o70m17K59k44j182J471J492P03
845A215K97J12J210K23j305m27j63o79K26p1j19R61P98P27m35q84J199r89j831
864F5n30p68K16o73l59J276J78r4Q37p80%J47r35o01j150J39J159n33j95J981
884f20Q68L11l23M17K33q65p36L37j012K65J061L09l12Q73J261N50j840P0J295
$$ plain form
903 2142 574 -886 -669 7 272 -210 1060 2040 1334 2287 2539 1495 797 914 847 -948 -1806 -9
921 -9 908 -660 -36 1502 1272 493 -445 257 -1028 -2664 -1870 -2403 -3499 -2517 -889 -909 -1918 -500 1280
940 1280 -111 -2053 -568 -148 -1888 -1961 -669 400 -396 358 2458 1724 1067 2623 2305 161 -403
957 -403 1437 1183 -1129 -844 2187 1767 -96 1623 2619 1431 -256 734 643 -1648 -1284 823 -859
974 -859 -1719 757 2296 400 -883 1582 2351 -1045 -1764 325 -322 -2258 -1770 53 -709 -1588 642
991 642 1157 -1737 -1329 925 -1007 -3333 -2324 342 -1018 -3367 -259 2162 -424 -597 1720 2039
1007 2039 -422 -183 1662 -183 -1788 1210 2960 -369 -178 3544 3840 -10 -238 3138 1484 -2303
1023 -2303 -555 1382 -691 -1558 629 1183 -1067 -316 2552 682 -2708 21 1265 -1790 -3750 -419
$$ packed form
903B142j568j460K17O76K65m82J270R80p06R53K52j044o98J17o7j795q58J797
921iR17j568O24J538k30p79r38P02j285j636P94n33j096R82J628k0j009J418J780
940A280j391j942J485M20j740p3J292J069p96P54K100p34o57J556l18k144n64
957d03J840k54k312K85L031m20j863J719R96j188j687R90r1k291L64K107j682
974h59q60K476J539j896j283K465P69l396p19K089o47j936M88J823p62q79K230
991F42N15k894M08K254j932k326J009K666j360k349L108K421k586j73K317L19
1007B039k461K39J845j845j605K998J750l329J91L722K96l850k28L376j654l787
1023b303J748J937k073q67K187N54k250P51K868j870l390K729J244l055j960L331
$$ plain form
1039 -419 1601 -2040 -2392 1931 1444 -1176 59 1452 -422 -2574 -115 726 -2889 -2341 1946 843
1055 843 -2581 -264 3143 689 -2724 -407 2320 -1505 -2644 799 924 -1249 306 2689 1301
1070 1301 -853 2346 3650 -876 -1408 2314 2102 -1615 -1568 2755 2185 -1463 657 3262 420 -1342
1086 -1342 961 613 -2710 -2288 1008 -776 -4143 -315 2740 -826 -3029 730 2684 -1597 -3351
1101 -3351 602 588 -2726 -1257 1208 -602 -1361 1586 2483 -1465 -1334 2870 1203 -3356 -1551 2229
1117 2229 92 -2805 -72 2940 71 -999 2127 1727 -1227 -219 1773 -419 -2295 806 3092
1132 3092 -1083 -1955 3137 3271 -698 -802 2664 1862 -2004 -832 1632 -738 -1773 990 1054 -1377
1148 -1377 -749 2161 278 -3365 -938 1886 -1870 -3972 -405 1250 -1734 -2579 985 1534 -1409 -151
$$ packed form
1039d19K020l641l52M323m87k620J235J393j874k152K459Q41l615N48M287j103
1055H43l424K317L407k454l413K317K727l825j139L443J25k173J555K383j388
1070A301k154L199J304m526n32L722k12l717M7M323n70l648K120K605k842j762
1086a342K303l48l323M22L296j784l367L828L055l566k203L759J954m281j754
1101c351L953j4l314J469K465j810p59K947Q97l948J31M204j667m559J805L780
1117B229k137k897K733L012k869j070L126m00k954J008J992k192j876L101K286
1132C092m175q72N092J34l969j04L466q02l866J172K464k370j035K763O4k431
1148a377O28K910j883l643K427K824l756k102L567J655k984q45L564N49k943J258
$$ plain form
1164 -151 1558 -409 -1503 839 1364 -1381 -1751 2379 1778 -1518 88 3380 1388 -1412 289 2283
1180 2283 -218 -1828 1036 929 -1275 -112 1857 365 -1296 975 2506 -679 -2201 1121 1762
1195 1762 -1914 -1596 1231 1142 -887 -47 2019 357 -1228 811 456 -1722 -1386 682 -76 -2756 -516
1212 -516 2052 -550 -2350 86 1266 -784 -2063 -48 227 -2099 -753 793 -332 -715 1438 1924
1228 1924 -420 -473 2106 1584 -1234 -602 1950 583 -665 554 1786 1190 -428 1108 1315 -652
1244 -652 -326 764 -359 -1602 -424 991 -670 -1700 805 1255 -840 -853 835 456 -1064 -1139 597
1261 597 -152 -1174 541 564 -660 -64 1361 583 -1204 -434 1009 -428 -1811 -466 516 -324 -1199
1278 -1199 230 702 -378 -558 1090 5 -783 194 543 -562 -742 974 1450 -189 71 1787 975
$$ packed form
1164a51J709j967j094K342N25k745l70M130o01l296J606L292j992k800J701J994
1180B283k501j610K864j07k204J163J969j492j661K271J531l185j522L322O41
1195A762l676L18K827q9k029Q40K066j662j585K039l55k178L36K068p58k680K240
1212e16K568k602j800K436J180k050j279K015K75k326J346J546j125l83K153M86
1228A924k344n3K579n22k818O32K552j367j248J219J232n96j618J536K07j967
1244f52L26J090j123j243J178J415j661j030K505M50k095j3J688l79j520p5J736
1261E97p49j022J715K3j224N96J425p78j787P70J443j437j383J345R82q40q75
1278a199J429M72j080j80J648j085p88R77L49j105j80J716M76j639K60J716q12
$$ plain form
1295 975 -63 538 1183 446 -614 289 710 -486 -236 976 114 -544 -42 780 -402 -1688 -339 58
1313 58 -1418 -1293 -257 83 -554 -297 573 397 -561 43 296 -624 -599 530 102 -691 -85 924 656
1332 656 -452 456 980 -208 -618 -375 408 -561 -692 314 -58 -486 202 679 -67 -39 624 847 -244
1351 -244 -605 673 368 -583 421 919 627 234 412 833 62 -149 50 9 -788 -403 -24 -269 -818 -169
1371 -169 395 -455 -639 -13 10 -882 -820 -244 -176 -540 -10 665 -92 143 563 569 218 34 540 531 -416 -54
1393 -54 428 -106 49 412 628 140 26 202 71 -374 -20 -128 -446 -384 -504 51 124 -176 339 502 -325
1414 -325 -172 227 83 -44 -186 391 133 -257 236 539 239 314 41 -5 -393 -604 124 -520 -795 -303 -122
1435 -122 -156 -239 -235 22 -196 -425 29 -318 -396 141 -249 57 29 243 604 323 179 840 512 176 160 49
$$ packed form
1295I75j038O01O45p37j060R03M21j196K50J212q62o58N02Q22j182j286J349L97
1313E8j476J25J036L40o37K57Q70j76r58O04K53r20K5J129m28p93O06J009k68
1332F56j108R08N24j188m10K43P83r69j31J006l72m28O88M77p46K8O63K23j091
1351b44l61J278l05r51J004M98k92l93J78M21p71k11J99m1p97L85L79k45n49O49
1371a69N64q50j84O26K3q92O2N76O8l64N30O75p57K35M20Ol51j84N06rr47L62
1393e4M82n34J55L63K16m88j14J76j31m45L54j08l18O2j20N55P3l00N15J63q27
1414c25J53L99j44j27j42N77k58l90M93L03l00P5k73m6l88k11P28o44k75M92J81
1435a22l4q3MK57k18k29M54l47p8N37l90L06k8K14L61k81j44O61l28l36j6j11
$$ plain form
1457 49 316 64 243 274 149 94 139 -65 147 27 -283 -93 -409 -577 -172 -136 -445 126 101 233 -196 -15
1479 -15 383 121 64 -2 -125 190 185 139 238 -205 370 490 -143 51 -65 -337 -320 -423 -401 -179 -468 -156 202
1502 202 212 79 -279 344 22 -50 121 188 118 268 355 375 594 217 687 470 33 80 490 -281 122 -269
1524 -269 -460 -309 -267 -124 -21 -381 -75 -397 -372 -130 -286 -336 -135 -380 215 -152 -89 614 298 200 286 -93
1546 -93 276 -87 -325 106 -218 -33 284 -103 -120 -158 168 -254 -229 -471 -92 -353 -174 -50 -172 35 177
1567 177 155 79 231 180 363 6 250 246 -65 185 224 260 365 196 525 258 -200 190 -288 -276 129 -362 -321
1590 -321 -378 -223 81 -113 -313 -149 -51 159 -190 -528 -76 -26 -25 110 -67 102 431 286 273 92 471 383
1612 383 -76 -122 330 31 64 76 -219 251 -471 -14 -77 -251 -27 -95 -390 -197 -363 -33 -72 -127 151 137 9
$$ packed form
1457D9K67k52J79L1j25n5M5k04K12j20l10J90l16j68M05L6l09N71k5J32m29J81
1479a5L98k62n7o6j23L15nm6R9m43N75J20o33J94j16k72J7j03K2K22k89L12L58
1502B02J0j33l58O23l22p2J71O7p0J50Q7K0K19l77M70k17m37M7M10p71M03l91
1524b69j91J51M2J43J03l60L06l22K5K42j56n0K01k45N95l67O3P03l16r8Q6l79
1546i3L69l63k38M31l24J85L17l87j7l8L26m22K5k42L79k61J79J24j22K07J42
1567A77k2p6J52n1J83l57K44ml11K50L9L6J05j69L29k67m58L90m78J2M05m91M1
1590c21n7J55L04j94k00J64R8K10l49l38M52N0JJ35j77J69L29j45j3j81L79q8
1612C83m59m6M52k99L3J2k95M70p22M57o3j74K24o8k95J93j66L30l9n5K78j4j28
$$ plain form
1635 9 279 275 418 219 52 31 19 11 258 84 -201 145 -4 -28 -94 -235 66 -336 -714 -178 25 -299 -543
1658 -543 -241 -110 -187 113 173 -215 -42 390 -2 -55 26 274 517 -111 -70 522 377 -20 -15 73 -48 -9 -25
1681 -25 -81 201 -250 214 -158 -352 122 -66 -78 -448 -60 18 -327 -317 232 -28 340 69 150 367 -109 559
1703 559 92 131 171 -41 -79 134 -59 -6 18 -316 -133 3 -314 -291 -52 -305 -173 -84 -199 -265 -341 176 18
1726 18 -145 207 324 201 -52 -93 343 115 93 319 144 230 352 42 -97 158 -90 72 -237 -255 61 6
1748 6 -489 -248 -196 1 -60 -232 -27 -154 154 -6 -163 268 106 138 439 45 248 40 63 254 -64 34
1770 34 284 -100 -105 -203 -20 -204 -354 -121 -251 -106 -395 -151 -32 -122 -224 -247 151 62 -97 244 252 117 256
1793 256 -6 483 -176 378 445 -31 189 55 -51 -61 -97 -288 280 -237 -240 -56 -275 -22 -167 -239 -47 -36
$$ packed form
1635IK70mJ43j99j67k1j2qK47j74k85L46j49k4o6j41L01m02l78N36K03l24k44
1658e43L02J31p7L00O0l88J73M32l92n3Q1K48K43o28M1N92j45l97NQ8j21L9j6
1681b5n6K82m51M64l72j94M74j88j2l70L88P8l45J0N49k60L68k71Q1K17m76O68
1703E59m67L9M0k12l8K13j93N3K4l34J83J36l17K3K39k53J32Q9j15o6p6N17j58
1726A8j63L52J17j23k53m1M36k28k2K26j75Q6J22l10j39K55k48J62l09j8L16n5
1748Fm95K41N2J97o1j72K05j27L08j60j57M31j62L2L01l94K03k08K3J91l18R8
1770C4K50l84nr8J83j84j50K33j30J45k89K44J19r0j02k3L98q9j59L41Qj35J39
1793B56k62M89o59N54O7m76K20j34j06j0l6j91N68n17lJ84k19K53j45p2J92J1
$$ plain form
1815 -36 -3 206 -114 -57 143 -157 107 297 19 494 -14 -279 148 199 504 68 76 48 115 124 -65 89 -43
1838 -43 -165 -119 -294 -145 -75 49 -329 -353 68 1 -246 -450 -112 161 -203 110 323 85 333 166 153 142
1860 142 34 61 282 -196 -42 432 149 -229 -101 -202 -133 -270 -41 -172 -106 -209 -64 -149 49 -199 -100 -27
1882 -27 187 152 225 -17 451 376 79 152 91 396 181 -90 82 -63 -209 284 -163 211 -247 -260 127 11
1904 11 -292 -176 -127 -59 -246 -21 93 45 -61 234 -83 -106 299 91 296 101 290 371 -7 40 276 -92
1926 -92 9 41 -115 158 -109 -91 39 -119 -395 -141 96 38 -26 31 15 14 -78 229 -90 -59 -90 69 -29 197
1950 197 402 444 -106 341 260 -105 -50 -87 166 100 57 165 -64 -155 47 68 -360 -410 -69 91 -67 -92 -95 -47
1974 -47 -281 236 -3 226 168 205 53 310 29 249 243 -53 12 163 125 33 -187 207 -221 -231 138 5 28
$$ packed form
1815c6L3K09l20N7K00l00K64J90k78M75n08k65M27N1L05m36Qk8O7Rj89J54j32
1838d3j22M6j75J49P0J24l78k4M21o7k47k04L38K73l64L13K13k38K48j67j3j1
1860A42j08K7K21m78J54M74k83l78J28j01O9j37K29j31O6j03J45q5J98k48R9P3
1882b7K14l5P3k42M68p5k97P3o1L05k15k71J72j45j46M93m47L74m58j3L87j16
1904A1l03J16M9O8j87K25J14m8j06K95l17k3M05k08K05j95J89Q1l78M7K36l68
1926i2J01L2j56K73k67J8J30j58k76K54K37n8o4N7j6jr2L07l19L1l1J59r8K26
1950A97K05M2n50M47q1l65N5l7K53o6m3J08k29r1K02K1m28n0L41J60j58k5lM8
1974d7k34N17k39K29n8L7j52K57k81K20ok96O5J51l8r2k20L94m28j0L69j33K3
$$ plain form
1997 28 -266 -260 -72 -267 -72 -24 -72 -303 211 93 36 49 184 185 -189 144 482 346 -81 42 148 118 -113
2020 -113 -24 342 -10 -240 109 -307 -169 26 -63 -99 -188 -277 160 -310 136 145 -52 -207 83 273 54 -336
2042 -336 17 210 -290 30 190 -47 53 54 148 147 -135 157 32 -96 -306 24 -341 -466 -228 -114 -210 -272
2064 -272 67 -1 -342 169 237 123 4 84 450 163 -47 204 464 180 -48 271 240 -194 39 203 -53
2085 -53 -68 116 6 -108 -149 151 24 -330 -331 184 -60 -326 -248 -180 213 -222 133 115 -32 -100 274 224 -152
2108 -152 276 322 181 -194 307 360 -299 -271 -62 -167 -260 17 -183 -205 -282 -103 24 -156 -99 125 -167 -219 -172
2131 -172 442 -213 -579 504 399 61 35 160 216 -173 -126 475 200 -197 -56 190 -189 -25 92 -103 -407
2152 -407 -124 204 -81 -501 -178 243 -147 -476 69 382 -44 74 574 57 -247 232 346 12 -103 244
$$ packed form
1997B8k94OJ88j95J95M8m8k31N14j18n7J3J35Jl74L33L38j36m27J23J06l0k31
2020a13Q9L66l52k30L49m16J38J95q9l6q9q9M37m70M46Rj97j55K90J90k19l90
2042c36L53J93n00L20J60k37J00JR4jk82K92j25j28k10L30l65j25K38J14r6o2
2064b72L39o8l41N11O8j14j19Q0L66k87k10K51K60k84k28L19l1m34K33J64k56
2085e3j5J84j10j14m1L00j27l54jN15k44k66P8O8L93m35L55j8j47o8L74n0l76
2108a52M28M6j41l75N01N3o59K8K09j05r3K77k00k2p7J79J27j80N7K24k92n2M7
2131a72O14o55l66J083j05l38k6J25N6l89M7O01k75l97J41K46l79J64J17j95l04
2152d07K83L28k85m20L23M21l90l29N45L13m26J18N00n17l04M79J14l34j15L47
$$ plain form
2172 244 563 -411 -244 244 352 -260 -50 41 -42 -307 -171 214 -207 -181 -6 12 -528 70 304 188 -620
2193 -620 83 619 -211 -29 299 226 -250 17 379 57 -426 350 311 -341 -153 211 124 -306 -459 342 -98
2214 -98 -688 -83 221 -132 -436 12 95 -125 -76 219 -62 -364 168 527 66 -295 303 510 86 -163 188
2235 188 365 139 104 283 119 -37 20 178 -174 -294 308 -216 -587 -214 255 88 -618 -14 272 -51 -468
2256 -468 138 -62 94 -68 248 -25 -288 112 309 -1 93 114 275 78 -337 472 79 -102 -255 473 -223
2277 -223 -186 73 117 -329 -246 72 7 -504 -116 276 -75 -282 -43 365 -106 -205 220 445 -327 166 198 296
2299 296 -127 -112 344 -58 -334 191 199 -444 -4 174 95 -215 -92 373 8 -358 -222 215 -71 24 200 427
2321 427 -91 21 349 -163 -359 262 115 -198 262 109 314 -140 82 271 -21 -6 -24 -61 -63 -153 129 -49
$$ packed form
2172B44L19r74J67M88J08o12K10R1q3k65J36L85m21K6J75J8n40N98K34j16q08
2193f20P03N36q30J82L28p3m76K67L62l22m83P76l9o52J88L64q7m30j53Q01m40
2214i8n90O05L04l53l04M48Q3k20M9K95k81l02N32L59m61l61N98K07m24k49L51
2235A88J77k26l5J79j64j56N7J58l52j20O02n24l71L73M69j67p06O04K86l23m17
2256d68O06k00J56j62L16k73k63M00J97l10R4K1J61j97m15Q09l93j81j53P28o96
2277b23L7K59M4m46Q3L18o5n11L88L92l51k07K39M08m71r9M25K25p72M93L2R8
2299B96m23J5M56m02k76N25Qo43M40J78p9l10J23M65l65l66J36M37k86R5J76K27
2321D27n18J12L28n12j96O21j47l13M60j53K05m54K22J89k92J5j8l7kr0K82j78
$$ plain form
2343 -49 -394 -69 103 -239 -295 86 39 25 -201 70 139 343 146 130 -18 -57 134 37 22 -63 123 322 -340
2366 -340 80 365 -238 -156 -284 12 -11 -547 -59 254 -285 57 256 12 -92 -107 154 288 -80 212 133
2387 133 -71 42 95 61 110 -19 444 136 -126 147 174 102 -121 -198 47 -196 17 60 -169 -344 79 -5 -165
2410 -165 -254 72 192 -29 65 366 142 6 16 -91 168 -192 252 11 196 207 196 278 -163 50 233 -130
2432 -130 57 134 65 -145 -255 -78 -82 -157 -359 147 86 -139 224 143 -70 81 327 128 176 53 284 201 25
2455 25 82 88 72 -179 -252 -3 -368 -198 -132 -62 -339 77 19 -79 -183 68 133 -255 -175 168 -39 -73 106 7 223
2480 223 152 18 292 -206 -36 -61 185 -206 52 60 248 39 -272 8 -19 0 -47 -7 -160 -318 -68 -249 -163
2503 -163 -149 143 -126 166 263 92 12 23 -109 119 -27 -46 279 187 341 80 -188 318 -37 49 -11 -83 -157
$$ packed form
2343d9l45L25J72l42n6L81m7j4k26K71O9K04j97j6j48l9J91r7j5q5J86J99o62
2366c40M20K85o03Q2j28K96k3n36M88L13n39L42J99k44j04j5K61J34l68K92p9
2387A33k04J13N3l4M9j29M63l08k62K73K7p2k23p7K45k43K13M3k29j75M23q4j60
2410a65q9L26J20k21R4L01k24j36J0j07K59l60M44k41J85J1j1Q2m41K13J83l63
2432a30J87P7o9k10j10J77mp5k02N06o1k25L63q1k13J51K46j99M8j23K31q3j76
2455B5N7Oj6k51p3K49l65J70O6P0k77M16n8r8j04K51O5l88Q0L43k07l4J79r9K16
2480B23p1j34K74m98J70k5K46l91K58QJ88k09l11K80k7J9m7M0j53j58K50j81Q6
2503a63J4K92k69K92R7j71q0J1j32K28j46j9L25r2J54k61k68N06l55Q6o0p2p4
$$ plain form
2526 -157 -79 -10 98 -137 33 -229 -242 102 59 -168 89 -136 17 -206 -64 217 60 72 -52 5 -38 35 21
2549 21 -71 -142 -226 130 170 -112 372 133 -154 86 90 344 172 114 56 -47 -148 111 -31 77 -73 -32 7 -142
2573 -142 244 301 50 109 201 -45 5 50 145 200 -64 -150 2 31 63 -18 84 -13 25 -111 -197 -119 138 44 -36 -82
2599 -82 0 245 120 22 110 203 364 96 -40 111 382 64 196 16 60 -109 -276 77 -11 -86 44 55 -87
2622 -87 -54 36 -48 -105 -31 3 11 -146 220 -12 145 128 -103 136 70 158 187 138 -74 50 127 -125 20 -36 -88 127
2648 127 -83 -57 -51 -259 -287 -70 -286 -177 -164 -84 -17 -95 22 127 -40 70 -233 -23 61 62 214 195 270 -7
2672 -7 133 92 74 -62 116 17 -259 -247 34 -47 -135 -219 -109 11 -199 -95 -147 21 3 35 -77 169 -255 17
2696 17 36 36 -133 -35 -70 234 7 6 234 81 181 4 -217 -14 -117 -264 90 -192 124 3 -100 -99 -197 35
$$ packed form
2526a57P8O9J08k35J70k62j3L44m3k27K57k25J53k23J42K81j57J2j24N7m3P3j4
2549B1r2p1q4L56M0k82M84k39k87K40MK54j72n8n8j03j01K59j42J08j50M1L9j49
2573a42L86N7k51N9R2k46N0M5R5N5k64q6J52K9L2q1J02r7L8j36q6P8K57r4q0m6
2599h2Q2K45j25r8Q8R3J61k68j36J51K71l18J32j80M4j69j67L53q8p5J30J1j42
2622h7L3R0q4n7P4L4Qj57L66k32J57j7k31K39o6Q8K9m9k12J24P7k52J45n6n2K15
2648A27k10K6Ok08k8K17k16J09J3Q0O7p8J17J05j67J10l03K10Q4JJ52j9P5k77
2672gJ40m1j8j36J78r9k76J2K81q1q8q4J10J20k10J04n2J68j8L2j12K46m24K72
2696A7J9%j69R8l5L04k27jK28j53J00j77k21K03j03j47L54k82L16j21j03Jr8K32
$$ plain form
2720 35 -112 -27 111 -22 92 288 247 168 24 9 300 198 125 262 -139 -7 272 -39 -118 -129 27 -76 60
2743 60 -97 51 -131 -103 62 -66 202 -154 34 -246 -4 22 -127 103 191 14 135 64 7 68 142 249 24
2766 24 130 -95 90 226 33 -14 -23 68 23 -220 -14 -289 -230 2 -12 -135 -174 -41 261 -132 -98 100 -41
2789 -41 112 251 -5 356 42 -166 92 -43 188 245 -92 -145 202 -137 -125 63 -83 -80 -191 -90 -15 124
2811 124 -177 -236 -71 -28 -37 292 123 -49 38 -14 119 35 93 4 174 -77 -98 149 -237 192 0 78 -120 -33
2835 -33 68 -99 -66 -109 -63 -102 193 191 -152 68 -165 -21 -252 -304 7 99 164 -21 -71 97 110 160 93 -29 23
2860 23 22 -42 -100 282 -65 236 -43 -312 -19 -9 -83 -151 -74 -28 -10 -355 -73 -268 81 194 -72 -106 121 86
2884 86 353 -55 74 95 -33 37 68 -169 -15 19 -77 -89 -268 -162 -97 220 -189 -116 -189 -182 -348 -132 63 111
$$ packed form
2720C5j47Q5J38j33J14J96m1p9j44j5K91j02p3J37m01J32K79l11p9j1J56j03J36
2743F0j57J48j82K8J65j28K68l56J88k80K42K6j49K30Q8j77J21p1n7O1P4J07k25
2766B4J06k25J85J36j93m7rR1m5k43K06k75N9K32j4j23l9J33L02l93L4J98j41
2789d1J53J39k56L61l14k08K58j35K31N7l37n3L47l39J2J88j46Lj11J01P5J39
2811A24l01n9J65M3rL29j69j72Q7n2J33q4N8q9J70k51k1K47l86M29j92P8j98Q7
2835c3J01j67L3m3M6l9K95kl43K20k33J44k31n2L11R2O5j85n0J68J3N0o7j22N2
2860B3jo4n8L82l47L01k79k69K93J0p4o8P7M6J8l45K82j95L49J13k66l4K27l5
2884H6K67m08J29K1j28P0L1k37J54L4r6j2j79J06O5L17m09P3p3Pj66K16J95M8
$$ plain form
2908 111 -116 -316 -26 10 378 -201 53 -166 -94 -15 1 209 315 37 80 -29 220 39 -70 223 29 -14
2930 -14 4 -102 -70 97 43 37 -91 140 28 -70 -24 -21 -155 -17 -83 37 133 41 -41 92 129 303 102 103 246 -81
2956 -81 -53 -160 -122 28 -110 69 113 -206 -36 -56 -195 -20 -15 -67 168 -215 93 260 -119 -108 171 -19 194
2979 194 -40 -32 71 13 101 109 15 29 305 228 -43 -68 276 97 -48 37 14 -263 -115 86 45 5 -93 -185 -76
3004 -76 -307 -56 12 94 14 69 116 196 -84 33 51 -72 -46 -142 -96 -32 -63 130 -96 -172 225 -1 -101 -80 -163
3029 -163 9 28 -9 0 -70 -43 -44 104 36 38 63 -76 -140 60 123 -93 158 53 -133 -34 -2 -33 -83 95 105 -75
3055 -75 -74 -74 -126 -58 -121 22 -42 344 85 -85 -124 -65 36 -93 -38 95 97 167 45 58 223 108 137 15 86 266
3081 266 224 -69 77 -9 -101 -78 27 -159 -134 -30 236 64 -61 -92 67 -330 33 64 43 -232 -148 226 68
$$ packed form
2908A11k27k00K90L6L68n79K54k19P2P9J6K08J06k78M3j09K49j81j09K93j94m3
2930a4J8j06L2J67n4oj28K31j12r8M6Lj34J38o6J20R6r2q2J33L7J74k01JJ43l27
2956h1K8j07L8J50j38J79M4l19J70k0j39J75Nn2K35l83L08J67l79J1K79j90K13
2979A94k34QJ03n8Q8Qr4J4K76p7k71k5L44j79j45Q5k3k77J48K01m1m0r8r2J09
3004g6k31K51O8Q2q0N5M7Q0k80J17J8j23K6r6M6O4l1J93k26p6L97k26j00K1q3
3029a63J72J9l7Rp0K7jJ48o8KK5j39o4K00O3k16K51j05j86R9L2l1n0J78J0j80
3055g5J%n2O8o3J43o4L86k59j70l9N9J01j29N5J33KP0j22J3J65j15K9j22P1J80
3081B66m2k93J46q6r2K3J05j86K5J04K66j72j25l1J59l97L63L1k1k75Q4L74j58
$$ plain form
3104 68 6 -1 189 -21 256 368 -15 25 7 81 272 -274 81 -211 38 3 -37 88 -384 52 117 -84 -212
3127 -212 48 93 63 -112 164 -215 27 152 -108 62 9 106 -23 169 -106 -209 213 107 48 203 -125 -124
3149 -124 20 22 -193 -152 -138 193 -348 -27 -27 -143 -54 25 275 172 -50 235 238 49 -14 -45 145 190 -53 46 -162
3174 -162 -20 122 196 139 -7 -89 -154 -123 91 40 -99 -77 65 14 -190 -170 -1 -210 45 18 -143 -251 0
3197 0 193 126 -66 50 240 173 -20 -32 -5 39 -4 254 -88 -76 -171 -106 -140 -321 -25 150 130 -162 -79 -125 -55
3222 -55 -121 -62 -186 -99 -34 244 -138 63 -85 -155 -32 110 -46 160 -66 50 70 61 -45 -51 0 266 92 164
3246 164 74 -182 -43 -10 -219 69 -100 68 -114 11 9 183 -107 -54 83 -3 54 0 33 35 272 191 229 19
3270 19 -100 88 217 -3 -136 -180 -126 -139 -153 -71 -28 57 -183 -69 -8 -198 258 21 -162 148 271 -162 -133
$$ packed form
3104F8o2pJ90k10K77J12l83M0j8P4J91n46L55k92K49l5m0J25m72M36O5k01j28
3127b12K60M5l0j75K76l79K42J25k60J70n3R7j29J92k75j03M22j06n9J55l28J
3149a24J44Kk15M1J4L31n41L21%j16Q9P9K50j03k22K85Lj89o3l1J90M5k43R9k08
3174a62J42J42P4n7j46q2o5L1K14n1j39K2J42n1k04K0J69k09K55k7j61j08K51
3197@J93o7j92J16J90o7j93j2K7M4m3K58l42J2r5O5l4j81K96J75k0k92Q3m6P0
3222e5o6N9j24Q7O5K78l82K01j48p0J23J42j56K06k26J16K0rj06oN1K66j74P2
3246A64r0k56J39L3k09K88j69J68j82J25kJ74k90N3J37q6N7n4L3KK37q1L8k10
3270A9j19J88J29k20j33m4N4j3j4Q2M3Q5k40J14O1j90M56k37j83L10J23m33K9
$$ plain form
3293 -133 107 184 -14 90 139 -92 138 -240 107 -433 -72 -10 -278 -213 2 -57 -61 -342 75 -93 -56 11 8 157
3317 157 -43 -207 -332 20 10 -2 252 51 -99 138 252 -105 -40 125 279 -91 -8 -70 322 -206 -132 -1
3339 -1 -152 115 -16 -131 -195 -70 -250 -80 240 309 122 210 193 217 -24 -32 12 122 -200 -150 375 84 -223 -49
3363 -49 -122 94 -225 70 209 54 -8 127 302 -122 -101 67 -247 -273 3 267 194 -11 227 -27 -6 -168
3385 -168 -135 131 -21 171 274 188 190 -11 -244 8 -138 57 56 -177 -152 235 116 -102 -117 143 -136 -157 -12
3408 -12 4 102 -127 -174 19 12 -12 -117 24 3 24 -49 40 22 47 -68 -230 -79 60 -160 -322 14 -140 44
3432 44 -177 -135 133 -76 -58 -55 64 -222 -30 -30 168 -174 -152 347 103 13 -181 193 56 -126 27 224 196
3455 196 139 -79 135 -114 63 -111 -87 -165 53 137 -274 34 -79 213 78 36 -61 115 45 201 165 -117 57
$$ packed form
3293a33K40P7j98J04M9k31K30l78L47n40L61O2k68O5K15n9mk81M17j68L7O7lJ49
3317A57k00j64j25L52j0j2K54k01j50K37J14l57O5J65J54l70Q3o2L92n28P4J31
3339aj51K67j31j15o4J25j80J70L20O9j87Q8j7K4k41qM4J10l22N0N25k91l07J74
3363d9p3K16l19K95J39j55o2J35J75m24K1J68l14k6K76K64p3k05K38k54K1j62
3385a68L3K66j52J92J03q6Kk01k33K52j46J95jk33K5L87j19k18j5K60k79k1J45
3408a2J6R8k29m7J93pk4j05J41k1K1p3Q9j8K5j15j62J51J39k20j62L36j54J84
3432D4k21M2K68k09J8LJ19k86J92%J98l42K2M99k44r0j94L74j37j82J53J97k8
3455A96n7k18K14k49J77j74K4p8K18Q4m11L08j13K92j35m2r7J76p0J56l6k82J74
$$ plain form
3478 57 145 -91 -209 -76 72 13 170 -15 269 -441 -76 -44 164 -133 -167 -28 25 -102 182 -203 19 59
3500 59 -163 176 -121 -53 -87 104 -68 26 -156 71 -363 184 43 92 34 -3 33 39 156 206 2 27 -190 -48
3524 -48 129 -9 144 -92 -476 -66 -64 -125 -36 -159 29 -126 -37 145 103 -151 -157 -170 -8 194 -25 -13 -83 59
3548 59 23 -23 -74 90 -115 -2 -217 3 64 -285 -175 -288 45 -14 -303 -28 -79 16 -339 -393 -81 44 -4
3571 -4 -99 46 -96 25 18 -6 100 60 -49 -223 -104 163 138 -14 4 194 -73 -220 -45 30 -154 -308 -90
3594 -90 -236 -18 33 74 13 -107 -201 190 -54 -171 174 84 218 68 49 47 -38 114 161 32 48 62 -136 85
3618 85 -68 -261 23 -114 -54 138 -108 29 186 -130 -103 37 -77 -18 113 28 -142 17 179 76 -60 -106
3640 -106 -98 71 210 -48 14 32 -92 212 -113 -132 145 103 -302 -60 -142 304 -154 -229 174 34 -94 43 -6
$$ packed form
3478E7Q8k36j18J33J48n9J57j85K84p10L65L2K08k97l4J39N3j27K84l85K22M0
3500E9k22L39k97O8l4J91j72R4j82K27m34N47j41M9n8l7L6OJ17N0k04K5k17J42
3524d8J77j38J53k36l84M10Ko1Q9j23J88j55Q9J82m2k54oj3J62K02k19J2p0J42
3548E9l6m6n1J64k05J13k15K20O1l49J10j13L33n9k89K75n1R5l55n4L12J25m8
3571dr5J45j42J21pk4J06m0j09j74J19K67k5j52J8J90k67j47J75P5j84j54K18
3594i0j46K18N1M1o1j20r4L91k44j17L45r0J34j50j9kq5J52M7j29J6J4j98K21
3618H5j53j93K84j37O0J92k46J37J57l16K7J40j14N9J31q5j70J59J62j03j36m6
3640a06QJ69J39k58O2J8j24L04l25j9K77m2m05K42q2M46m58p5M03j40j28J37m9
$$ plain form
3663 -6 255 -83 -49 -136 -55 15 -37 -174 63 149 77 -157 -11 -95 24 -16 -147 89 -184 21 -3 -192 129 -75
3687 -75 -197 79 -149 -98 200 -104 171 -85 101 -12 -8 -11 42 132 -46 -142 -68 194 -32 -70 151 -25 46 -102
3711 -102 -171 -166 -49 -11 -155 -2 -112 -238 -196 -24 -176 -247 3 49 -125 56 -119 -22 -32 -56 17 -120 -46 94
3735 94 -357 -39 99 79 205 -189 -305 19 82 -49 -84 32 -51 -283 -184 -258 26 12 -103 -155 -62 149 -86
3758 -86 189 -85 -35 72 238 -70 -67 205 -20 102 -37 24 90 55 -61 44 50 -154 -153 -26 -4 -65 -55 -152 134
$$ packed form
3663fK61l38L4q7Q1P0n2j37K37Q6p2k34J46q4J19m0j31K36k73K05k4j89L21k04
3687g5j22K76k28N1K98l04K75k56J86j13MlN3R0j78r6P4K62k26l8K21j76P1j48
3711a02o9NJ17L8j44J53j10j26M2J72j52p1K50M6j74J81j75R7j0k4P3j37P4J40
3735I4m51L18J38k0J26l94j16L24O3j31l5J16q3k32R9p4K84j4j15n2R3K11k35
3758h6K75k74N0J07J66l08LK72k25J22j39O1O6l5j16J05Ok04JJ27K2o1J0r7K86
$$ [...]
8191B4
##END NTUPLES=NMR FID
##END=
