##TITLE=1H_K-1142/2_1
 CDCl3
 8 sc, 
 17.11.2021
##JCAMPDX= 6.0         $$ Bruker NMR JCAMP-DX V2.0
##DATA TYPE= NMR FID
##DATA CLASS= NTUPLES
##ORIGIN= UXNMR, Bruker Analytische Messtechnik GmbH
##OWNER= root
$$ XWIN-NMR		Version 3.5
$$ Wed Nov 17 12:36:36 2021 Russian Standard Time (UT+4h)  she@DPX200
##.OBSERVE FREQUENCY= 200.131346
##.OBSERVE NUCLEUS= ^1H
##.DELAY= (6, 6)
##.ACQUISITION MODE= SIMULTANEOUS
##.ACQUISITION SCHEME= undefined
##.AVERAGES= 8
##.DIGITISER RES= 18
##SPECTROMETER/DATA SYSTEM= spect
##.PULSE SEQUENCE= zg30
##.SOLVENT NAME= CDCl3
##.SHIFT REFERENCE= (INTERNAL, CDCl3, 0, 15.7039)
##AUDIT TRAIL= $$ (NUMBER, WHEN, WHO, WHERE, WHAT)
$$ ##TITLE= Audit trail, XWIN-NMR		Version 3.5
$$ ##JCAMPDX= 5.01
$$ ##ORIGIN= Bruker BioSpin GmbH
$$ ##OWNER= she
$$ F:/spectra/data/she/nmr/H-F/1/audita.txt
$$ ##AUDIT TRAIL=  $$ (NUMBER, WHEN, WHO, WHERE, WHAT)
(   1,<2021-11-17 12:35:24.90 +0400>,<she>,<DPX200>,
      <created by zg, POWCHK disabled, PULCHK disabled
       configuration hash MD5:
       00 E9 B6 7A A2 85 ED C7 34 08 36 98 17 FE 4E 26
       data hash MD5: 16K
       DF B9 4D 37 D0 3C 74 F7 D1 20 73 83 7B F9 96 CA>)
$$ ##END=
$$ 
$$ hash MD5
$$ 52 3E 64 F7 D8 1B FE D6 CD A9 8F A2 82 F2 73 73
##$RELAX= 
##$RELAX= 
##$RELAX= 
##$RELAX= 
##$RELAX= 
##$RELAX= 
$$ Bruker specific parameters
$$ --------------------------
##$DU= <F:/spectra>
##$EXPNO= 1
##$NAME= <H-F>
##$PROCNO= 1
##$TYPE= <nmr>
##$USER= <she>
##$AMP= (0..31)
100 100 100 100 100 100 100 100 100 100 100 100 100 100 100 100 100 100 
100 100 100 100 100 100 100 100 100 100 100 100 100 100 
##$AQSEQ= 0
##$AQ_mod= 1
##$AUNM= <au_zg>
##$AUTOPOS= <>
##$BF1= 200.13
##$BF2= 200.13
##$BF3= 200.13
##$BF4= 200.13
##$BF5= 200.13
##$BF6= 200.13
##$BF7= 200.13
##$BF8= 200.13
##$BYTORDA= 1
##$CFDGTYP= 0
##$CFRGTYP= 5
##$CHEMSTR= <none>
##$CNST= (0..31)
1 1 145 1 1 1 1 1 1 1 1 1 1 1 1 1 1 1 1 1 1 1 1 1 1 1 1 1 1 1 1 1 
##$CPDPRG= <>
##$CPDPRG1= <>
##$CPDPRG2= <>
##$CPDPRG3= <>
##$CPDPRG4= <mlev>
##$CPDPRG5= <mlev>
##$CPDPRG6= <mlev>
##$CPDPRG7= <mlev>
##$CPDPRG8= <mlev>
##$CPDPRGB= <>
##$CPDPRGT= <>
##$D= (0..31)
0 1.2 0 0 0 0 0 0 0 0.06 0 0.03 0 0 0 0 0.0002 0 0 0 0 0 0 0 0 0 0 0 0 
0 0 0 
##$DATE= 1637138124
##$DBL= (0..7)
120 120 120 120 120 120 120 120 
##$DBP= (0..7)
150 150 150 150 150 150 150 150 
##$DBP07= 0
##$DBPNAM0= <>
##$DBPNAM1= <>
##$DBPNAM2= <>
##$DBPNAM3= <>
##$DBPNAM4= <>
##$DBPNAM5= <>
##$DBPNAM6= <>
##$DBPNAM7= <>
##$DBPOAL= (0..7)
0.5 0.5 0.5 0.5 0.5 0.5 0.5 0.5 
##$DBPOFFS= (0..7)
0 0 0 0 0 0 0 0 
##$DE= 6
##$DECBNUC= <off>
##$DECIM= 32
##$DECNUC= <off>
##$DECSTAT= 4
##$DIGMOD= 1
##$DIGTYP= 9
##$DL= (0..7)
0 120 120 120 120 120 120 120 
##$DP= (0..7)
150 150 150 150 150 150 150 150 
##$DP07= 0
##$DPNAME0= <>
##$DPNAME1= <>
##$DPNAME2= <>
##$DPNAME3= <>
##$DPNAME4= <>
##$DPNAME5= <>
##$DPNAME6= <>
##$DPNAME7= <>
##$DPOAL= (0..7)
0.5 0.5 0.5 0.5 0.5 0.5 0.5 0.5 
##$DPOFFS= (0..7)
0 0 0 0 0 0 0 0 
##$DQDMODE= 0
##$DR= 18
##$DS= 0
##$DSLIST= <SSSSSSSSSSSSSSS>
$$ [...]
##$SUBNAM2= <"">
##$SUBNAM3= <"">
##$SUBNAM4= <"">
##$SUBNAM5= <"">
##$SUBNAM6= <"">
##$SUBNAM7= <"">
##$SUBNAM8= <"">
##$SUBNAM9= <"">
##$SW= 18.0517287032376
##$SWIBOX= (0..15)
0 0 2 0 0 0 0 0 0 0 0 0 0 0 0 0 
##$SW_h= 3612.71676300578
##$TD= 16384
##$TD0= 1
##$TE= 0
##$TE2= 300
##$TE3= 300
##$TEG= 300
##$TL= (0..7)
0 120 120 120 120 120 120 120 
##$TP= (0..7)
150 150 150 150 150 150 150 150 
##$TP07= 0
##$TPNAME0= <>
##$TPNAME1= <>
##$TPNAME2= <>
##$TPNAME3= <>
##$TPNAME4= <>
##$TPNAME5= <>
##$TPNAME6= <>
##$TPNAME7= <>
##$TPOAL= (0..7)
0.5 0.5 0.5 0.5 0.5 0.5 0.5 0.5 
##$TPOFFS= (0..7)
0 0 0 0 0 0 0 0 
##$TUNHIN= 0
##$TUNHOUT= 0
##$TUNXOUT= 0
##$USERA1= <user>
##$USERA2= <user>
##$USERA3= <user>
##$USERA4= <user>
##$USERA5= <user>
##$V9= 5
##$VALIST= <valist>
##$VCLIST= <CCCCCCCCCCCCCCC>
##$VD= 0
##$VDLIST= <DDDDDDDDDDDDDDD>
##$VPLIST= <PPPPPPPPPPPPPPP>
##$VTLIST= <TTTTTTTTTTTTTTT>
##$WBST= 1024
##$WBSW= 4
##$XGAIN= (0..3)
0 0 0 0 
##$XL= 0
##$YL= 0
##$YMAX_a= 52193
##$YMIN_a= -50842
##$ZGOPTNS= <>
##$ZL1= 120
##$ZL2= 120
##$ZL3= 120
##$ZL4= 120
##$ABSF1= 10
##$ABSF2= 0
##$ABSG= 5
##$ABSL= 3
##$ALPHA= 0
##$AQORDER= 0
##$ASSFAC= 0
##$ASSFACI= 0
##$ASSFACX= 0
##$ASSWID= 0
##$AUNMP= <proc_1d>
##$AZFE= 0.1
##$AZFW= 0.1
##$BCFW= 1
##$BC_mod= 2
##$BYTORDP= 1
##$COROFFS= 0
##$CY= 11.3945322036743
##$DATMOD= 1
##$DC= 2
##$DFILT= <>
##$DTYPP= 0
##$F1P= 2.36226072786647
##$F2P= -0.459571619588291
##$FCOR= 0.5
##$FTSIZE= 0
##$FT_mod= 4
##$GAMMA= 1
##$GB= 0.15
##$INTBC= 1
##$INTSCL= 1
##$ISEN= 128
##$LB= 0.24
##$LEV0= 0
##$LPBIN= 0
##$MAXI= 10000
##$MC2= 0
##$MEAN= 0
##$ME_mod= 0
##$MI= 1.114404
##$NCOEF= 0
##$NC_proc= 0
##$NLEV= 6
##$NOISF1= 3.799351
##$NOISF2= 2.8
##$NSP= 1
##$NTH_PI= 0
##$NZP= 0
##$OFFSET= 15.70392
##$PC= 1
##$PHC0= -15508.97
##$PHC1= 6.200809
##$PH_mod= 1
##$PKNL= yes
##$PPARMOD= 0
##$PSCAL= 0
##$PSIGN= 0
##$REVERSE= no
##$SF= 200.130013532006
##$SI= 16384
##$SIGF1= 3
##$SIGF2= 2
##$SINO= 400
##$SIOLD= 16384
##$SREGLST= <1H.CDCl3>
##$SSB= 0
##$STSI= 0
##$STSR= 0
##$SW_p= 3612.71676300578
##$SYMM= 0
##$S_DEV= 0
##$TDeff= 0
##$TDoff= 0
##$TI= <>
##$TILT= no
##$TM1= 0
##$TM2= 0
##$TOPLEV= 0
##$USERP1= <user>
##$USERP2= <user>
##$USERP3= <user>
##$USERP4= <user>
##$USERP5= <user>
##$WDW= 1
##$XDIM= 8192
##$YMAX_p= 0
##$YMIN_p= 0
$$ End of Bruker specific parameters
$$ ---------------------------------
##NTUPLES= NMR FID
##VAR_NAME=  TIME,          FID/REAL,        FID/IMAG
##SYMBOL=    X,             R,               I
##VAR_TYPE=  INDEPENDENT,   DEPENDENT,       DEPENDENT
##VAR_FORM=  AFFN,          ASDF,            ASDF
##VAR_DIM=   8192,          8192,            8192
##UNITS=     SECONDS,       ARBITRARY UNITS, ARBITRARY UNITS
##FACTOR=    0.0002768,     1,               1
##FIRST=     0,             0,               0
##LAST=      2.2672688,     0,               0
##MIN=       0,             -50842,          0
##MAX=       2.2672688,     52193,           0
$$ Real data points
##PAGE= N=1
##DATA TABLE= (X++(R..R)), XYDATA
0 0 0 0 0 0 0 0 0 0 0 0 0 0 0 0 0 0 -8 8 -8 8 -8 8 -16 16 -16 24 -24 32 -32 40 -44 48 -56 64 -72 81 -92 103
38 103 -113 128 -142 158 -175 196 -215 238 -263 289 -319 351 -387 427 -470 519 -572 635 -704 784
58 784 -875 984 -1114 1274 -1473 1734 -2084 2590 -3385 4826 -8278 36986 2432 -47872 32286
73 32286 45664 -8730 -42136 10629 36498 -16027 -47803 1801 26583 -11168 -39662 3437
85 3437 35134 -2474 -26667 11770 30058 622 -18614 6275 20881 -5833 -19347 -986
97 -986 3645 -6085 -11156 -4805 2917 1410 776 3569 1627 8311 13759 5134 -2466 3243 13580 2362
113 2362 -20622 -6832 16199 -5860 -30397 -8977 18375 -1461 -30222 -2857 31327 5692
125 5692 -22840 2217 33389 10674 -26665 -3378 34052 5516 -33500 -9194 26942 3062
137 3062 -36566 -10413 31943 6305 -29442 -2820 32069 11572 -23408 -4200 30054 8678
149 8678 -24403 -9259 16719 2958 -26031 -14799 14531 2559 -20157 -5825 14404 7377
161 7377 -7014 653 16048 9264 -1588 3004 5751 2355 -1631 -4055 -3003 -3682 -2801 -2387 -8664
176 -8664 -5210 6355 2740 -7221 -2502 12448 10121 -10709 -6102 17638 8976 -16424 -10825 14387
190 14387 8264 -22395 -15967 17428 10409 -19581 -11972 20474 18154 -15860 -11856 25274 19659
203 19659 -16082 -12829 19399 15717 -21582 -20558 14836 10468 -22542 -18714 11947 12618 -16060
216 -16060 -15409 16510 17001 -9081 -7916 14874 15647 -7231 -10914 9315 8682 -9986 -10014 2458 3534
231 3534 -6299 -7262 3072 4283 -265 2267 3174 2728 4824 3571 -307 -2844 1167 3752 -7590
246 -7590 -12171 871 3988 -8794 -12560 4063 12868 -5360 -11596 11291 18205 -2824 -10650 10274
260 10274 19640 -5990 -18223 6990 15969 -10130 -20944 3592 16595 -9379 -22154 6706
272 6706 19549 -5855 -16435 8169 21353 -3275 -17771 6327 17559 -6130 -17921 1757
284 1757 13700 -5802 -18369 1647 13092 -3447 -10484 4664 13995 2185 -6399 5682 11414
297 11414 276 -4258 829 2918 -2455 -7149 -3495 -2172 -4743 -1954 -1974 -3708 513 4199 2319
312 2319 -2095 2233 10373 3065 -7276 1161 9357 -496 -11718 -3016 10458 -1039 -15572 -1672
326 -1672 13146 1313 -12776 148 18277 4982 -14484 -231 17117 2027 -16781 -4741
338 -4741 14900 810 -20549 -6169 13240 192 -16925 -4252 15976 5740 -13184 -621
350 -621 17127 6115 -9630 -1581 13622 5131 -11702 -4114 8264 310 -10205 -5044 4802 1459
364 1459 -7133 -2401 5003 2037 -880 588 2954 2597 259 74 -968 -2383 1385 -270 -6307 -3733
380 -3733 2611 1187 -5699 -3335 8688 6605 -5453 -1098 11580 7488 -7030 -5103 10689 6642
394 6642 -13032 -9089 8021 3953 -14313 -11382 9899 7891 -12561 -7923 13242 10230 -9072
407 -9072 -7411 13454 11846 -10286 -8582 10521 7892 -10948 -10731 7748 8138 -10343 -8285 8390
421 8390 7382 -5802 -5390 8145 8930 -4220 -4220 5801 4294 -4634 -5488 710 1563 -5290 -5227 -206
437 -206 -769 -1807 -442 265 1106 2288 4010 1710 -738 4673 6070 -1728 -3989 2801 4299 -4654
453 -4654 -9133 1569 6158 -5868 -9163 3649 8922 -3015 -9291 5614 12883 -3184 -9558 5417
467 5417 11024 -5055 -13413 2704 10101 -6974 -13206 3136 10570 -3354 -11021 4709 14402 -738
481 -738 -8643 5940 12817 -979 -10317 1724 9473 -4118 -11128 -110 4978 -3940 -8886 -803
495 -803 5954 -1117 -4811 2183 5570 1619 -1780 1315 4518 565 -1845 373 -583 -1574 -729 -1555
511 -1555 -2089 -405 2255 600 -3664 1436 6445 499 -3737 2261 6905 601 -7460 -1122 6535
526 6535 -1891 -10383 -2556 6463 -244 -11307 -2211 10730 1931 -8587 1179 12343 3889 -8304
540 -8304 99 11780 1803 -9631 -1820 8128 585 -11244 -4606 8524 1050 -9780 -1971 9152
554 9152 3585 -6993 -1255 9292 3101 -6469 -1617 4772 1050 -6078 -4296 2374 522 -4532 -2099
569 -2099 1815 2217 -287 -144 3253 2991 1628 2390 312 267 2179 163 -3571 -2704 1454 199 -6264
586 -6264 -3842 3619 767 -5467 -2112 5983 4244 -4725 -2385 8112 4799 -5901 -3692 6840
600 6840 4836 -8367 -6745 7013 3705 -8626 -5311 7362 6206 -6187 -4680 8533 6790 -5433
614 -5433 -4225 6454 5925 -6237 -7180 4244 3308 -7619 -6427 3101 3547 -5253 -4914 4619 4810 -2250
630 -2250 -1086 4756 4634 -347 -1784 2664 2278 -1843 -2098 -517 -584 -1337 -1936 -971 -853 445 2128
647 2128 -110 -1300 2580 3037 -1313 -2369 1906 3719 -3168 -5323 1821 2765 -4288 -5706 1850 5489
663 5489 -2532 -5206 4423 7228 -1787 -4437 4596 8299 -2203 -6776 3635 6412 -4511 -8078
677 -8078 1493 5556 -4530 -8838 1938 6155 -3070 -6101 3073 7636 -565 -5277 3315 6839 -1667
692 -1667 -5166 1250 4402 -2133 -5640 316 3280 -1858 -3119 878 3345 971 -1167 1614 3374
707 3374 815 102 286 -10 -276 -1308 -2011 -2410 -1824 120 -1527 -3368 517 2765 156 -2040 1755
724 1755 5731 1114 -3048 2059 5472 -303 -5088 -583 4782 -986 -7210 -747 5136 -758 -6223
739 -6223 -285 7011 1238 -6388 599 7289 802 -6038 -1028 5941 283 -7576 -1696 4776 -339
754 -339 -6219 -1620 5159 1787 -4404 181 6035 2343 -1994 354 4182 1928 -2997 -1272 1819
769 1819 -696 -3116 -2296 -194 -208 -2001 -1191 94 -46 795 781 -90 1258 2139 1043 -1138 -702 2079
787 2079 372 -3816 -1483 2318 471 -3631 -1810 4110 2515 -3292 -548 5558 3308 -3275 -1929
802 -1929 4709 2540 -5491 -3343 3615 1171 -6081 -4444 3508 2236 -5548 -2839 5021 3414 -3232
817 -3232 -2058 5371 4276 -3158 -2284 4520 2533 -3666 -3072 2600 1962 -3925 -2841 2566 1307 -2273
833 -2273 -1562 2126 2224 -1210 -743 2228 1012 -896 -963 -235 -120 -1180 -986 -658 -1486 -206 553 -700
851 -700 -99 1638 2294 428 -745 2651 3256 -1033 -1494 1959 2284 -2398 -4186 854 2196 -3854 -4268
868 -4268 1653 3146 -2097 -3757 2434 5016 -1854 -3226 3150 4486 -1689 -4396 1647 4025 -3005
883 -3005 -4787 1522 3561 -1902 -3836 1779 4766 -806 -2832 2603 4100 -325 -2924 952 3084
898 3084 -1498 -3685 -169 1085 -1562 -3028 -793 1210 -813 -1302 737 1250 785 757 550 1139 1123
915 1123 889 516 -1031 -123 987 -1246 -2141 -268 1336 -210 -2487 254 3248 -111 -2331 776
931 776 3530 323 -3104 108 3530 -860 -4377 -635 2706 -515 -4804 -858 4035 238 -3280
946 -3280 747 4955 1858 -2725 501 5015 685 -3689 -183 2855 -293 -4126 -1583 2118 -492
961 -492 -3667 -743 2176 732 -1888 -325 2941 945 -1448 171 1755 256 -1297 -789 507 -296
977 -296 -830 154 -345 -32 946 134 -19 582 1536 1145 -622 60 1902 156 -2013 -1370 750 264 -2979
996 -2979 -2251 1546 223 -3086 -1193 2763 1777 -2348 -634 4060 1888 -2245 -456 3113 1881 -2835
1012 -2835 -2139 3029 1072 -3713 -2241 2456 2059 -2941 -1952 3353 1774 -2296 -1005 2734 1774 -2158
1028 -2158 -1742 1716 836 -2621 -2123 746 726 -1733 -1810 1668 1217 -874 312 1843 1373 415 351 909
1046 909 321 -316 84 -903 -731 71 -570 -1198 -1250 72 893 -708 -1084 1453 1567 -795 -1158 1244 2151
1065 2151 -1273 -2398 1512 1668 -2037 -2440 917 2224 -1832 -2431 1893 2871 -1085 -1851 1733 2932
1081 2932 -729 -2290 1946 2626 -1611 -2925 651 1889 -2077 -3488 606 1949 -1639 -2112 690
1096 690 2552 55 -1498 1294 2557 13 -1144 483 1564 -194 -1666 -52 593 -761 -826 -246
1112 -246 74 230 59 420 602 410 891 -40 -755 480 328 -766 -1427 -435 537 -1030 -1973 282 1469
1131 1469 -187 -1156 763 2935 719 -1344 1438 2898 -191 -2018 304 2170 -729 -3082 -233
1146 -233 1779 -1053 -2795 -427 2320 35 -2361 196 2598 84 -1985 126 2215 177 -2349
1161 -2349 -112 1722 -426 -1918 -461 1202 246 -1370 131 1649 462 -240 187 1222 935 -405
1177 -405 214 671 -415 -652 -691 -954 -586 -581 -505 -716 -504 927 384 -488 696 1689 856 -536 -147 1604
1197 1604 488 -1765 -446 1213 228 -1924 -855 1857 855 -1995 -460 2454 868 -1429 -653
1212 -653 2171 994 -2318 -997 1680 271 -2392 -1634 1269 773 -2349 -1068 1873 1193 -1149 -518
1228 -518 2142 1675 -1002 -183 1879 1027 -998 -780 909 534 -1552 -1068 439 -44 -996 -612 176 406
1246 406 -322 -60 655 368 277 210 -179 -180 63 -77 -565 -743 188 355 -935 -407 675 964 57 -357 1442
1267 1442 1524 -558 -550 1217 950 -932 -1789 428 610 -1918 -1956 523 836 -1228 -1332 933 1823 -623
1285 -623 -880 1326 1702 -478 -1068 682 1709 -1073 -1547 689 889 -827 -1275 425 1417 -416 -691
1302 -691 992 1071 242 -687 388 690 -554 -1054 -44 -138 -467 -787 -459 -88 -376 -121 94 130 507 875
1322 875 86 128 700 961 251 -336 354 738 -643 -812 -193 324 -556 -1417 -54 1283 -419 -940 521
1341 521 1342 217 -1028 495 1448 -382 -1376 99 938 -394 -1478 -55 1410 -306 -1200 526
1357 526 1464 315 -657 383 1489 250 -1116 122 652 -151 -1386 -541 380 -523 -1256 -168 309
1374 309 -218 -344 -67 861 198 -198 482 285 375 112 -107 138 -173 -133 58 -247 -28 399 -90 -355 238
1395 238 592 538 -351 -17 1027 11 -764 -328 450 -121 -1468 -875 601 -222 -1366 -439 863 399
1413 399 -926 -31 1874 708 -934 189 1396 790 -1015 -543 1122 54 -1548 -679 631 534 -1205
1430 -1205 -798 1214 775 -920 -254 771 696 -663 -716 695 314 -758 -463 -100 -17 -221 -465 182 300
1449 300 -69 258 368 399 505 191 341 70 19 313 -348 -592 208 -130 -804 -732 1 145 -783 -693 820
1470 820 484 -426 -209 736 909 -406 -440 817 751 -673 -832 527 635 -415 -654 740 586 -391 -511
1489 -511 716 1077 -256 -658 452 685 -695 -583 101 160 -653 -1153 21 279 -553 -731 210 538 86
1508 86 -275 611 704 272 220 289 175 154 -322 -23 -86 -499 3 -245 -301 -92 -145 15 -54 -253 547 -181 -530
1531 -530 414 214 -291 -505 -58 466 -434 -667 397 537 -407 -160 515 867 -94 -588 517 910 -108
1550 -108 -317 163 894 -109 -1086 -33 516 -505 -912 -157 320 -400 -876 156 970 6 -391 122 1136
1569 1136 197 -359 161 665 26 -461 92 347 13 -563 225 416 1 37 99 73 210 -104 70 -40 -232
1590 -232 -74 -296 -609 -279 1 -282 -601 -204 313 49 -201 281 809 360 -49 214 957 254 -539 96
1610 96 644 20 -443 -381 554 69 -858 -85 487 134 -531 -199 687 406 -593 -280 652 64 -451 -390 445
1631 445 57 -673 -255 369 324 -182 73 547 604 -40 131 517 268 38 -150 100 140 -588 -366 -167 -391
1652 -391 -411 -156 -79 -146 -223 -91 268 -31 375 108 128 104 200 128 -202 -366 195 440 -551 -189 241 149 -135
1675 -135 -236 627 503 -448 -96 500 189 -359 -522 55 112 -662 -490 288 140 -428 -432 128 343 -381 -124
1696 -124 691 423 -74 -350 360 565 -247 -402 531 -154 -194 -191 50 37 -345 -500 35 103 -188 -81 -13 261
1718 261 -73 -254 125 -53 -83 -33 -297 16 24 -71 -221 -95 132 442 -111 41 472 219 172 -123 313 246
1740 246 -127 -309 98 47 -362 -538 -231 275 -275 -434 40 243 -134 -201 140 577 -263 -319 55 269 3
1761 3 -455 53 427 -87 -453 169 206 22 -100 148 427 -28 -232 18 -67 62 -582 -167 192 -205 -427
1782 -427 -85 -226 -18 -40 -153 255 266 -103 137 2 288 291 37 -60 122 144 -17 -175 -118 301 -243 -274 -36
1805 -36 120 115 -246 -39 374 -141 -131 52 3 -42 -452 -149 214 -166 -380 -27 192 -112 -237 0 510 205
1827 205 -110 227 409 229 -197 108 398 1 -365 -235 -93 -132 -388 -535 31 56 -150 10 51 114 -127
1848 -127 -97 452 285 -186 222 -36 8 69 108 139 158 8 74 77 226 303 134 78 13 15 12 -165 -249 107 -181 -164
1874 -164 -320 -142 -44 -349 -269 130 -40 -271 146 218 362 -166 150 473 289 -151 -29 200 73 -132 -222
1895 -222 391 42 -228 -174 93 277 -255 -257 274 193 -330 64 18 -251 -169 -394 261 -77 -158 -154 51 142 85 26
1919 26 340 371 30 242 222 174 106 -127 60 -161 -100 143 -289 -214 104 -99 -105 -131 -94 263 -123 -281 8 87
1943 87 17 67 -208 192 -205 -61 311 106 -66 126 216 209 -50 -73 434 113 -250 -55 189 85 -206 -313
1965 -313 -146 124 -316 -323 -186 -34 -141 -172 141 181 -119 91 34 29 73 11 151 196 47 116 75 -5 150 -101
1989 -101 83 182 -76 149 -10 -341 222 77 145 -8 31 146 -129 -592 12 -87 -61 -140 19 83 -18 46 104
2012 104 292 167 154 55 334 206 -132 -2 101 -143 -209 -20 230 69 -317 -120 238 -169 116 -208 80
2033 80 91 -154 91 264 107 -76 34 53 70 -180 60 121 -144 -30 -117 245 291 -50 130 396 -74 137
2055 137 -47 11 69 -21 -76 97 -142 -207 -178 -161 -35 -44 -11 -61 22 49 162 144 314 148 -115 269 -94 67 156
2080 156 -200 129 -35 -63 4 -76 -37 50 55 64 264 -104 88 -288 -72 -193 -188 -205 31 -153 1 -112 191 122
2104 122 43 30 -39 -27 -30 109 312 71 34 -6 27 -52 -93 -277 -148 86 -41 -183 -42 -234 -12 -259 -24 123
2128 123 65 -99 -41 -98 222 114 -137 -20 -24 19 66 -25 173 174 -68 142 26 8 -98 34 249 22 -384 -38
2152 -38 -82 -174 -257 -162 47 -38 -256 -269 122 70 125 -15 152 194 -124 5 91 -77 -71 -172 14 84 55 45 111 -151
2178 -151 41 -47 35 230 -128 19 -60 -128 13 -75 -119 -39 -257 -16 -46 -226 -85 165 -13 94 127 92 276
2201 276 137 175 206 -30 139 50 162 119 -262 16 -90 -193 -143 -134 -7 -81 -69 73 11 -81 -38 159 -7 56
2225 56 45 179 182 -73 -200 97 60 110 -101 -17 252 29 9 93 181 288 -200 -27 224 56 -143 -83 -101 -313
2249 -313 -138 -289 115 -84 -161 -137 -182 181 -17 -64 -59 -24 -178 175 -68 23 11 -25 25 -32 42 -16 -29 -144 102
2274 102 -44 30 -17 -47 76 -6 17 193 -198 -27 -41 -243 42 -127 -188 -221 -126 -90 98 20 118 125 -99 178 -66
2299 -66 173 104 61 42 109 -148 77 -260 73 -6 61 -151 185 -220 111 106 20 258 -120 39 84 83 -8 -130 -137
2324 -137 9 -14 94 -13 -43 133 93 -35 -12 2 -147 -37 -221 -123 -105 -75 -69 -78 154 7 65 5 -65 -183 119
2349 119 -92 -124 133 -60 -125 122 33 69 83 28 150 -86 -141 -79 91 172 -30 -92 161 221 -47 -6 -12 -77 64
2374 64 -184 -42 -20 -191 -50 -225 -86 -18 -26 -45 9 67 -80 -36 10 -73 291 96 190 85 89 -84 -131 101 -70
2399 -70 17 15 -201 68 60 5 88 96 -55 -5 40 106 -131 -11 -45 230 -66 37 -37 -156 -69 -16 131 125 -97 108
2425 108 -30 -33 27 -115 -203 -2 -50 1 -104 160 -12 -169 -151 34 46 96 -143 -2 24 -112 -77 -47 2 -80 -30
2450 -30 51 208 99 204 16 74 -172 -90 -33 160 -6 -56 -97 14 18 35 -27 -108 69 -53 28 -107 -80 51 -89
2475 -89 51 -311 -92 6 -25 148 115 -248 215 -6 25 152 56 24 -51 30 -27 -58 0 224 -78 -39 -25 15 -85
2500 -85 -35 -26 -47 -90 -26 39 -45 45 25 59 16 120 6 -91 -13 56 5 147 121 127 103 -23 -43 151 -101 14 92 26
2528 26 -186 -125 -229 -95 -74 -158 -143 76 -32 -208 69 87 -119 -81 -33 36 -80 49 46 -28 73 -47 -100 -21 -46
2553 -46 55 9 84 -1 -78 -24 -14 17 -11 88 -177 -50 -151 48 31 -112 -101 -32 156 -8 -44 -33 63 132 47 25
2579 25 158 81 189 12 -11 66 -235 -178 -190 -10 -108 -286 71 -220 -123 105 -66 -90 -45 22 -55 16 68 -68 -52
2604 -52 -104 25 -65 148 -111 26 191 26 -67 -35 154 120 96 221 148 76 56 -9 64 -153 -56 -168 -78 -2 -50
2629 -50 28 -166 -131 130 121 -71 -99 41 -28 22 -31 -111 -116 162 -122 -114 26 -78 130 64 -31 -117 -24 -198 -93 139
2655 139 -3 10 -220 41 -73 79 124 111 -22 198 -46 166 91 -11 171 -20 -38 270 141 -66 172 -86
2677 -86 151 29 -95 -52 -242 -197 54 53 23 25 -121 207 -78 -220 -110 -32 -329 -35 -7 -64 -6 -4 147 5 -101
2702 -101 -75 32 160 143 64 138 -8 67 146 -75 -189 -15 -98 -43 22 -225 202 -99 5 59 -148 26 -7 -44
2726 -44 -23 194 76 82 68 129 63 13 81 15 172 72 38 10 154 -73 148 -120 -31 -55 -135 -17 -34 -275 -57
2751 -57 18 -54 188 -117 -108 12 107 -9 83 -59 -134 -126 166 80 -126 -111 125 -23 169 -79 67 -6 107 33 -22
2776 -22 -74 -70 14 -84 319 -145 -131 7 -47 -54 -12 -123 89 -34 -83 61 -53 51 -96 103 -50 -155 15 -125
2800 -125 4 -50 278 -17 100 -29 -89 -50 -16 -117 278 -134 -47 -71 -177 12 -80 17 23 -76 36 -96 -100 102
2824 102 -229 -47 -97 -45 -113 -36 -126 76 -73 84 260 -28 -127 35 79 189 18 18 -16 -83 -40 -40 -99 -192 -200 45
2850 45 115 -76 118 154 -36 55 -55 -62 114 -53 -253 -24 -98 -60 74 -81 210 -180 -43 213 14 -46 124
2873 124 66 -206 -138 -57 4 -82 -127 -58 -146 -80 -16 29 37 -36 235 -2 131 -180 105 164 134 132 48 44 -18 129 -38
2900 -38 -23 19 -80 -129 22 35 46 -150 -4 136 5 -235 -7 -36 5 32 -36 -151 21 56 134 -233 -2 -52 140
2925 140 -2 88 -33 -201 111 -36 101 -25 -34 5 14 -45 -94 -37 -71 -6 -87 -184 87 25 -12 -123 66 -167 -142
2950 -142 109 148 33 -15 -4 113 -116 130 -77 100 105 -146 -86 -186 -155 90 39 -69 -23 -171 140 -32 81
2973 81 27 -379 -188 180 3 -73 45 -12 -92 92 -36 123 -250 -52 98 -5 -105 -4 21 83 117 -70 81
2996 81 33 -89 94 -118 -293 82 -52 226 -134 -23 32 -177 -323 -143 123 -36 -28 -95 24 98 -77 -101 138
3019 138 46 13 -31 98 -162 182 -87 20 -24 68 73 -134 10 -26 -64 -207 -94 -95 0 114 -319 43 57 208
3043 208 79 -93 -51 5 85 54 -95 34 -1 120 31 64 268 -86 -176 -37 256 -98 -38 -157 -1 -156 81
3066 81 -69 -236 -154 -50 161 63 51 208 127 -83 14 19 -160 74 109 259 54 6 45 -13 18 -53 96 -134 -41
3091 -41 -102 -117 -117 -108 38 -52 -41 13 -14 -13 -108 -95 17 5 -161 33 21 8 69 63 84 79 26 192 48 -119 17 -169
3119 -169 -79 41 -48 -97 133 -20 -12 -47 -92 -61 -103 13 -112 6 -78 -45 -250 80 -150 50 -27 -158 50 122
3143 122 -148 159 304 -3 161 88 -23 11 -32 61 59 77 36 -155 -141 84 54 42 -32 -77 14 -37 132 -63 19
3168 19 -50 -47 64 -8 38 -111 -85 -70 -23 -63 -83 -91 125 -174 -137 55 14 124 -120 -75 -75 57 16 -46 174 -50 22
3195 22 32 -78 -269 -104 7 70 122 -133 -7 6 108 58 101 79 167 257 -95 -176 -152 -34 120 -159 67 86
3219 86 2 66 -15 14 -63 19 -43 -49 -17 -88 102 -135 -99 45 113 -51 94 -5 60 12 120 -15 77 -114 -31 -12 169
3246 169 172 -97 -98 -11 125 111 -51 -155 138 52 -38 -122 -109 0 207 -203 29 148 -124 -174 -37 -62 97 26
3270 26 -87 -21 -34 206 4 -83 24 -173 -76 81 15 -39 -25 170 -128 -1 18 56 -139 -84 40 -123 -72 9
3294 9 165 -23 78 13 35 216 121 44 319 -14 -146 20 -5 153 -18 -106 -182 50 -15 102 49 -180 65 -119
3318 -119 -105 -88 -43 63 147 -32 136 -124 170 -118 -196 4 185 -56 66 31 -150 26 132 292 114 120 188
3341 188 4 -44 -61 -108 35 -77 -131 70 -46 -197 51 -10 -76 -63 -88 -78 47 -65 57 -33 8 -55 -93 -33 14
3366 14 46 -47 -80 -203 103 71 9 111 -80 151 58 -112 0 64 -75 64 112 -53 1 163 -39 -27 258 18
3390 18 80 82 164 26 101 11 45 40 120 142 248 -178 -104 126 -197 146 -84 -73 -14 37 -15 80 45 -70 -40 -160 49
3417 49 -9 59 83 74 14 16 67 -33 155 -103 -70 -20 139 46 225 81 63 -117 -112 -48 52 12 25 115 -58 -43 54
3444 54 -91 4 54 -129 -75 73 -315 94 24 -19 3 280 -101 -116 -72 161 54 250 61 51 -73 28 178
3467 178 177 113 128 15 65 2 -9 -80 -83 31 33 1 176 -19 -21 164 -40 -26 -26 -47 -115 123 69 -23 -22 -84 48 36 83
3496 83 -200 265 49 -194 -19 -136 -63 59 -146 -71 -14 -201 49 -128 -65 98 167 21 256 -56 -130 -63 64
3519 64 -54 45 111 26 -25 -48 102 -20 116 -9 69 -23 -169 -235 -46 15 84 13 28 -21 -34 49 -130 -62 39 22
3545 22 61 28 61 55 -72 -44 105 29 5 -106 58 152 0 69 -98 66 -39 -65 -39 -63 -75 113 138 -47 -97 1
3571 1 -91 -60 -52 -17 13 30 -38 -101 56 -40 66 41 -4 -94 193 -31 -57 -14 155 156 1 -165 -78 -3 -13 33 -25 25
3599 25 -49 -9 47 82 21 30 62 14 -53 31 -198 52 -26 -24 170 -118 -192 59 146 11 -101 -80 75 15 -180 -25
3625 -25 78 -30 -40 107 -51 -52 -254 -261 45 -93 192 -74 -124 31 -61 157 160 -84 -77 118 41 11 -60 8 -239
3650 -239 -152 97 26 100 45 13 58 33 -71 24 108 204 -31 139 -229 -156 74 150 12 -92 -35 -3 -12 174 127 -35
3676 -35 125 -9 -92 -19 92 -45 -66 -6 -106 -52 -101 119 -62 46 -35 53 131 -16 89 -72 -54 148 240 108
3700 108 69 -182 42 93 -52 -1 -99 111 -10 56 27 -78 96 -70 5 -64 54 -25 134 -28 48 157 -22
3723 -22 -185 -156 -22 -37 -297 71 -11 129 10 -134 -173 -69 15 -4 -32 -44 -166 -116 -7 -67 101 -155 -62 53
3747 53 -35 -121 131 140 -64 12 72 25 72 -88 -54 -60 41 61 112 -143 78 -76 53 150 27 98 -17 -30 43 41 69
3774 69 88 -105 108 -106 14 92 -167 77 -211 9 -92 -177 -61 46 -2 -103 -54 -59 24 84 -63 48 -114
3797 -114 -108 -60 3 118 -275 33 -94 12 6 86 130 -173 103 -88 -20 27 -41 -42 -65 39 -73 41 -10 -91 147
3822 147 155 19 3 -26 -287 78 -132 40 -91 -123 -81 40 -16 -57 42 40 -105 -189 135 13 -27 -68 81 -30 -237
3847 -237 -157 -83 -106 114 54 -5 -77 -82 -16 146 -109 83 -68 73 -193 -177 -58 -117 138 18 -3 -9 -8 -28 117 -39
3873 -39 156 100 32 -6 -80 130 -198 46 -6 -96 -73 -98 155 -95 -30 -135 -49 32 6 147 11 -74 -43 33 -2 -90
3899 -90 -72 20 20 25 -2 -82 76 21 -90 -101 -19 0 46 60 114 -89 34 -53 -122 41 135 0 -89 25 66 161 -100
3926 -100 -134 232 -3 302 127 -60 -70 -55 105 23 -70 143 -67 34 66 -100 64 -107 25 -11 216 -44
3948 -44 -28 -103 190 -165 -12 -64 -109 85 38 -252 -83 -86 -144 -80 -126 18 -97 100 137 54 103 -140 -69 102 -5
3973 -5 -30 -26 -92 14 -170 50 81 48 -78 -47 68 -84 122 -44 -53 66 -55 118 -14 15 208 -9 -2 188 110
3998 110 23 198 116 9 61 91 -113 -91 44 27 -51 -13 142 -102 141 -40 -14 57 10 12 -55 -7 70 -13 11 68
4024 68 138 -82 102 65 -149 -40 -14 63 134 -22 -19 74 21 27 -261 63 80 75 81 -60 15 -10 77 172 70 -247 -78
4051 -78 -5 60 -17 -86 42 4 230 -45 -62 -148 -51 -59 52 -35 11 -103 82 -80 -83 -28 -59 -65 29 -163 87 9 -304
4078 -304 142 -186 -7 -175 -135 41 -12 51 -56 -179 25 184 -77 -69 38 -53 150 -72 124 104 78 35 35 145
4102 145 -102 72 -160 22 98 57 87 -66 83 -9 -51 51 209 54 -17 -4 -50 -100 15 -64 -178 -225 135 39
4126 39 146 -25 -234 -129 -114 113 12 133 98 92 -35 196 53 2 -127 -54 1 -112 104 -1 -3 25 -51 57
4150 57 -100 -113 -154 22 94 160 52 -57 160 -45 236 98 65 0 112 113 -144 -58 -42 -98 141 47 20 201 -28
4175 -28 121 61 -82 105 239 -71 -14 -140 -178 -9 -43 -19 31 34 -41 -20 -143 -98 9 8 61 -33 -130 56 -168 40
4201 40 -78 -53 151 31 -33 2 87 -100 40 -200 9 -23 73 -62 131 101 201 21 -182 25 -74 9 -67 184
4225 184 17 29 -55 -2 7 143 102 98 89 -52 -6 33 19 -66 -85 -40 28 -77 -96 34 115 -38 61 -223 -15 16 248
4252 248 191 38 -48 -85 18 62 9 -36 44 -39 21 115 59 53 -77 -9 65 -221 -50 38 48 173 26 136 -111 178
4278 178 -73 44 48 -136 29 31 60 70 41 -105 -7 -160 21 -95 -32 141 -149 3 -47 81 94 -86 144 -82
4302 -82 -7 -14 135 8 -142 -63 -75 79 -97 -53 -115 -12 254 -121 -154 3 68 -153 28 47 -173 -241 84 -43
4326 -43 -59 -178 115 -18 1 -177 152 134 -156 -151 5 152 -36 -23 143 -50 85 137 27 349 91 73 -59
4349 -59 -79 -60 33 114 137 -113 41 -15 -149 -48 23 25 -128 -230 41 159 61 -151 158 -162 268 145 27 87
4373 87 58 226 -64 214 9 127 -170 -74 67 -65 -160 172 -96 10 -46 -39 -139 23 7 -120 -113 -6 -34 -93
4397 -93 41 -90 -28 95 -36 96 38 118 -89 159 18 -58 -21 -72 90 -78 -24 -34 87 -91 -5 -48 -182 108
4421 108 -113 -38 116 -67 -199 -108 40 -79 -18 6 57 -102 72 258 67 -89 10 -147 23 3 94 82 -113
4444 -113 53 114 -112 131 50 -84 99 -67 153 176 -37 166 13 -167 -190 85 -168 -44 70 -130 -20
4465 -20 111 -42 -212 52 33 -57 -117 69 -159 92 94 59 44 -71 -73 8 -45 -78 -45 -90 -279 41 -4 -104 65
4490 65 38 73 50 132 -52 -58 129 29 173 -100 -222 -53 138 55 58 -40 115 -37 51 -192 121 107 -251 58
4514 58 -208 -72 138 -62 -131 20 105 -12 -67 -20 109 -82 81 -29 -156 32 93 66 1 -43 51 -108 -47 11
4538 11 -27 76 2 12 17 -40 -54 -19 -186 -72 251 -117 -120 -6 115 2 -183 29 -52 207 93 -250 36 -88
4562 -88 -162 -94 -21 14 4 -244 24 -31 -245 7 -83 -88 -107 -105 40 -23 47 -26 188 -24 -95 156 195 -25 -59 217
4588 217 -200 8 -107 -3 6 54 -57 58 15 139 -148 -36 32 -49 -122 43 -43 44 132 4 103 -181 85 11
4612 11 -140 34 118 143 -157 10 -102 -74 -2 15 45 30 -119 19 -115 31 -10 -63 -11 99 -72 88 -33 -31
4636 -31 2 63 96 -3 -53 -89 -314 -31 57 -33 62 -60 -61 111 4 -185 -182 -162 220 -14 37 -147 -14 193 79
4661 79 96 139 61 -49 21 33 -179 69 47 6 144 -6 24 34 -22 82 96 -78 113 -126 -50 8 0 -49 12 17 -52
4688 -52 57 13 0 255 84 -25 140 -84 -56 31 85 50 115 43 -151 154 22 -196 -66 -74 2 -100 208 -79
4712 -79 64 -23 -98 34 -90 30 -6 -46 127 45 0 -39 -51 -167 198 191 4 60 -57 -14 -133 -17 78 -51 -99
4737 -99 -67 -49 221 61 -127 22 16 5 27 13 194 -98 -49 156 52 -37 86 83 -189 74 36 20 -83 53 -18
4762 -18 203 140 -99 66 -57 -26 34 -77 -44 115 -45 -96 15 95 -7 60 4 -164 -111 34 -64 30 -228 -178
4786 -178 -178 250 37 -83 116 -98 15 -32 -10 -256 -85 -75 98 98 -29 -230 -5 -55 -81 -65 2 77 -38 -155
4810 -155 84 -19 -130 41 135 -122 68 -208 3 -157 -38 198 -6 -60 161 -22 -221 -174 83 -141 95
4831 95 22 -94 106 5 -59 40 184 92 -37 -55 230 -2 61 -20 92 -96 46 77 -27 -71 35 37 -155 83
4855 83 11 -183 -102 -85 28 -63 -26 2 -141 60 -78 -4 10 42 -102 5 -58 1 -98 -43 137 46 32 18 -21 86
4881 86 -162 7 -31 43 -5 -168 -74 47 67 -80 -6 92 -101 -85 186 46 69 -5 155 -28 -86 -64 10 177 -74
4906 -74 92 -93 166 114 -167 202 -6 -106 32 142 123 14 -75 -86 -180 -183 101 -120 -137 -154 -40 -26 36 -110
4930 -110 -128 -7 13 -131 -46 -205 -119 84 -149 82 72 141 52 -233 -28 11 -123 23 -209 9 -43 165 -203
4953 -203 -31 76 -11 -43 -62 105 -56 104 222 -64 -65 65 -138 74 28 -24 107 159 157 31 35 8 69 33 15
4978 15 86 -28 -94 39 -116 21 45 -6 162 133 -142 -126 27 -202 -122 -10 14 43 -11 157 76 20 -170 -122 197
5003 197 -48 10 195 16 -19 -140 -53 80 -13 -33 89 21 -15 22 -50 90 37 -98 -71 74 -200 102 -135 -45
5027 -45 -154 -3 -29 10 -259 151 -150 -244 -34 -176 53 56 -171 11 293 -89 107 55 127 120 -103 250 19
5050 19 -55 113 -132 -67 -76 11 144 0 -113 -227 -62 47 -75 109 1 171 -2 -97 -110 -49 39 190 149 -24
5074 -24 -32 -32 -223 -101 50 -85 72 104 -109 71 -23 -54 -20 -51 -106 -103 76 -34 -134 -32 212 -67 -177 49
5098 49 60 111 82 -220 2 -33 -104 -163 39 113 -29 0 170 -19 229 61 -68 -218 -11 0 18 119 125 -1
5122 -1 -36 -43 -113 117 105 -107 108 -91 -114 15 -6 18 94 98 -131 -71 1 -18 114 60 -32 36 7 -105 -130 -127 62 27
5150 27 -143 50 -23 -23 27 97 -128 -155 66 -53 34 38 -96 -42 -183 117 -24 -95 -62 -18 48 -27 -123 -36 68 -113
5176 -113 21 -13 -67 -83 12 68 -59 -131 -71 29 -47 -44 127 -286 72 -136 -212 -80 -98 -14 12 -237 57 -157 -108
5201 -108 -2 37 -128 181 -71 -134 -38 -49 7 -56 -80 101 -16 -9 88 208 -19 -88 -224 39 -29 -58 -24 -30 -121 -76
5227 -76 -77 148 -8 180 163 62 -129 84 -70 -31 -26 -28 43 -99 129 -126 -15 53 -93 -138 -15 77 50 46 134 -32
5253 -32 -79 29 -54 105 -21 -88 0 -130 88 42 106 16 97 175 -65 -106 73 -45 -112 62 -148 -177 113 -47
5277 -47 -235 -61 -8 -16 -103 -51 175 34 -188 257 -38 -74 10 -75 90 -64 54 -93 -143 70 -89 -266 -18
5300 -18 -19 -30 175 119 -119 -151 -135 -5 -44 -10 166 42 89 -54 48 -70 167 102 42 55 222 136 -202 45 57
5325 57 3 30 47 -35 -155 55 230 -42 -193 -22 -108 -54 3 38 -48 -9 147 -38 -31 141 81 -21 -92 -97 -130 49
5351 49 129 49 -67 -123 107 -8 -159 91 214 18 207 -95 -78 31 181 20 20 22 -175 73 13 33 -218 43
5375 43 -196 72 -24 115 -136 -36 -34 110 -20 -50 143 -97 -182 -168 13 -8 138 -33 -54 9 97 45 -13 -110 44
5400 44 -88 157 37 61 -7 58 -101 62 -79 45 -61 33 -74 19 137 -53 -7 12 -83 -124 27 119 108 -22
5424 -22 -94 -50 98 -47 -61 -32 -97 -115 30 9 97 -54 -30 19 -173 2 16 -63 -73 -8 -15 -58 100 -64 184 57
5450 57 -48 64 -86 47 18 47 29 -129 85 165 78 74 92 17 -101 -7 21 3 -10 254 -10 48 30 -75 207
5475 207 124 71 48 -167 -86 -215 -138 10 -87 71 50 50 -8 -4 14 -56 -146 5 247 151 -209 22 54 -125 -185 -11
5501 -11 -85 -153 183 -16 -46 158 185 127 22 76 33 -3 -67 -81 56 77 63 -134 19 237 94 12 -71 -12 -55 19
5527 19 -107 -49 -73 48 -111 63 105 124 70 -115 -84 46 -31 6 24 185 10 -228 -63 2 -191 -52 -124 -221
5551 -221 -171 -314 -30 -17 -56 -58 -93 -58 50 25 -78 76 44 66 110 -181 3 197 40 -167 23 -98 -17 -143
5575 -143 126 -3 41 147 -116 20 -16 -97 -121 109 -65 169 75 -179 -16 113 -72 -163 -20 -137 -94 87
5597 87 -34 49 -16 3 62 -34 49 84 -72 -82 -193 214 -78 -110 14 -28 147 -152 -127 129 -30 -79 -11 -21 -97
5622 -97 43 134 -270 62 42 60 -165 16 0 3 -91 -113 -17 49 -59 -67 14 -121 130 -99 65 -45 -40 64 7 -159
5648 -159 -52 88 -135 106 66 -94 126 36 -152 -8 144 -58 212 174 -19 211 66 -45 22 -34 -118 -100
5670 -100 -85 -121 30 -2 -146 -21 -50 -39 14 11 71 27 7 -58 -26 -224 20 -207 -247 207 102 0 65 45 121 -55
5696 -55 -4 -46 136 -173 68 246 137 -102 -77 158 -7 -92 -182 -25 99 10 -53 68 -68 79 35 68 -67
5719 -67 -66 -95 61 60 45 51 -149 69 132 -95 31 -57 -47 27 145 117 160 73 33 11 -38 -59 -95 -270 -53 -12 -107 -30
5747 -30 50 -132 -117 117 123 -158 241 -63 123 -88 131 119 -72 123 -124 250 98 28 -16 -72 -255 2 -55
5770 -55 -55 -119 2 -110 51 128 -174 -81 -187 7 24 -11 177 71 102 -46 -118 -11 -51 -141 176 -62 -135 -29
5794 -29 4 -96 217 202 204 -238 106 25 -269 42 -56 65 29 -224 123 -182 -53 61 -83 67 -74 -13 70
5817 70 92 -63 106 14 108 -36 -92 48 -57 122 75 -95 -95 -33 157 326 -48 155 0 -13 -128 79 -115
5840 -115 181 146 -55 -128 115 222 -73 159 207 178 40 185 130 155 233 -23 -155 100 -134 -56 22 -110 19
5863 19 6 -15 57 112 67 170 14 228 135 -30 -40 22 40 -66 159 -83 192 138 82 60 -30 54 144 7 159
5888 159 -128 -19 148 -19 -34 -57 -41 -25 -165 -97 -130 -35 21 232 105 128 222 109 20 -50 84 194 145 24
5912 24 -204 -39 -151 -54 6 6 -165 -7 -44 19 -260 -25 69 8 48 52 -38 170 62 -109 25 99 -19 -107 112
5937 112 -60 53 -90 -32 -234 -61 -24 134 44 3 29 -121 68 -343 251 -13 47 104 19 59 -7 50 43 -129
5961 -129 -37 -62 18 47 -10 -193 79 -58 94 236 -251 -91 -17 -80 -106 215 -41 -37 -119 3 -127 -25 93 -40
5985 -40 -140 -69 14 -17 -100 -6 21 79 117 22 124 -183 40 80 -38 81 101 -51 20 -93 -75 -15 61 23 -141 98
6011 98 150 -54 -51 19 -56 47 -81 32 -51 -55 -131 -48 -114 76 80 -24 -72 174 -72 54 -231 -83 -66 -71 8 47 201
6038 201 67 50 87 -69 -135 65 -45 25 -76 98 -10 79 46 -90 -70 -180 72 112 -89 4 -112 55 3
6061 3 -150 -208 72 -47 -79 -94 157 -157 5 16 68 -89 76 15 -36 -88 -39 67 131 -9 -112 88 18 103 -98
6086 -98 -255 -182 0 -95 183 39 -24 290 -34 129 29 78 144 -53 -145 -53 -11 7 116 46 34 -62 18 102 149
6111 149 34 33 -93 -170 -102 -71 160 6 223 127 51 206 149 221 80 58 63 -156 -39 -73 16 83 52 -20 -85 94
6137 94 22 -68 -108 -69 -15 -156 36 -42 95 36 51 -165 -80 -142 -159 28 99 -163 -191 28 -53 -62 -100 3 -12 -15 2
6164 2 -43 -24 55 47 -164 -123 -79 90 -67 -21 -155 -173 8 -108 -38 -54 119 28 -20 14 -66 -100 88 -145 77 -192
6190 -192 189 -57 -89 32 -79 -37 -33 32 -81 -12 -15 -53 69 1 -65 119 69 156 -101 -103 -105 3 221 -134 -22 -35
6216 -35 -74 39 181 -123 91 170 7 251 85 57 73 65 -25 -101 47 90 237 72 162 104 188 128 -93 85 153
6241 153 106 72 -1 -155 49 19 -188 -87 163 -13 77 -36 -37 -51 -87 16 12 22 -188 63 -237 21 87 -47
6265 -47 86 -247 102 -34 41 -68 -83 -83 -85 -85 14 57 -96 137 -83 225 11 -13 113 -60 -76 19 65 168 -56
6290 -56 -61 -77 -16 97 -218 -33 46 -32 -96 23 40 -121 61 -98 -146 42 -7 40 -307 -187 40 108 122 15 -93
6315 -93 12 -46 -88 -50 -25 7 79 22 -69 35 -33 106 25 117 -65 -85 51 41 -93 -54 -59 55 -77 52 89 -108
6341 -108 -8 69 -126 92 27 16 87 -11 61 -74 104 40 61 33 111 109 -65 -180 -85 -31 -41 -59 -7 -30 -59 163
6367 163 -92 262 50 -33 -30 -30 13 -21 -17 68 63 10 83 -65 131 -50 -113 -18 52 155 -146 242 51 -85 133 25
6393 25 41 92 -119 3 141 -98 60 -23 62 18 -54 -80 98 200 122 -149 203 131 51 24 -135 31 31 -12 13
6418 13 58 -37 -115 123 -172 101 86 285 -108 -265 -96 38 41 11 45 -39 8 -143 84 131 -39 -97 166 46
6442 46 45 -32 63 28 -76 24 -185 -52 -29 83 -112 8 -55 79 -3 53 -141 -3 -2 33 -50 -106 -108 -144 82 130
6468 130 -179 -183 -124 -206 34 24 48 47 117 -107 -127 95 16 22 213 83 -112 -146 -238 132 28 11 -217 55 -10 -5
6494 -5 -48 -7 209 72 62 35 -12 -126 -102 -29 143 -11 -246 -116 -63 64 -46 -8 80 -27 -95 -33 -61 -265 36
6519 36 108 77 72 101 -27 2 207 -22 221 145 -138 34 -51 -24 120 78 85 8 -40 167 -96 -34 -78 57 41 115
6545 115 -40 -78 -201 -6 -17 -119 -123 65 -4 47 -36 -19 142 -54 127 -99 -178 -45 -131 -54 59 10 64 121 12
6570 12 -24 -4 69 -18 -23 -127 -135 -162 -36 12 113 -133 78 175 183 -36 -217 -125 -160 43 -79 79 -203 3 97 24
6596 24 256 21 99 -9 -54 52 -37 8 19 7 -35 105 -186 209 -22 -197 64 -8 14 -121 -39 -184 -9 116
6620 116 78 -194 -27 47 -179 -116 95 44 -7 2 70 81 15 49 -69 -55 27 -97 -16 -32 16 238 55 66 55 133
6646 133 92 -27 -63 11 108 -117 -100 -41 -89 20 -190 -15 190 -58 80 -62 105 70 -163 17 160 -63 139
6669 139 -55 216 155 -82 -100 10 143 -58 0 35 83 13 108 102 144 -122 98 -68 -10 119 45 -142 -149 95 19
6694 19 69 87 -11 58 -253 25 127 -24 111 38 -49 2 40 -110 125 53 19 -119 75 -27 161 57 -11 118
6718 118 194 150 25 -130 -59 -15 4 153 34 53 95 -62 -76 163 -151 -11 126 164 286 -22 115 -124 -83
6741 -83 134 7 160 107 39 13 -43 -50 -102 322 -8 -33 -155 -38 88 -76 -47 10 -5 51 -13 -109 -159 -113 92 63
6767 63 -86 -40 107 -37 23 3 172 -79 -55 76 -6 113 -48 -135 28 46 160 18 109 40 5 -175 129 77
6791 77 -151 -1 82 -52 11 -218 -131 71 -215 60 -33 -24 -97 -66 -98 4 -15 15 -3 197 -184 -5 31 -12 49
6816 49 77 9 -39 22 56 113 -11 -32 160 31 33 -76 89 170 -242 15 73 138 23 -48 -5 -24 -171 -22 -25 52
6842 52 -22 35 -47 106 182 10 99 11 256 -5 -47 -153 -93 -194 -125 177 -19 124 0 1 10 -164 -103 -46 17 235
6868 235 238 5 -237 -109 79 11 -149 19 -122 -79 -10 -104 -63 -42 -61 49 57 -59 -51 -219 89 -157 1 -104
6892 -104 29 -54 22 -76 35 35 15 -24 -95 -49 -152 -25 7 -53 110 -41 -29 191 48 -8 -96 387 21 -68 -41
6917 -41 190 -66 30 -177 15 167 -30 34 81 -150 -36 -63 -5 0 -138 127 -96 -119 57 90 -6 -137 -86 21
6941 21 118 21 84 8 55 -98 11 38 -22 137 -227 101 281 67 -93 -130 188 71 -132 -32 -162 101 -91
6964 -91 -136 -90 104 -18 213 -121 -5 -70 4 249 39 51 -184 28 70 69 139 58 -48 4 -99 -107 -44 161 12
6989 12 -14 -70 9 -112 0 35 -105 112 -97 66 15 -104 141 -45 59 -27 -25 -104 230 -122 21 47 -17 124
7013 124 -17 -15 16 -72 -100 2 -46 -46 63 83 124 19 256 71 -160 138 -92 -74 44 153 130 -121 -97 90
7037 90 -19 -140 -221 69 102 44 182 52 -85 163 57 -110 -47 -57 -123 -53 -63 -81 80 153 120 -68 -128 52
7061 52 135 -104 36 58 233 7 153 -73 99 -104 112 200 64 45 47 96 -197 -58 7 -149 256 141 -135
7084 -135 151 12 62 78 61 -45 71 13 -46 -5 126 -22 58 -11 26 35 83 -50 138 27 59 -12 -66 -165 108
7109 108 -223 -253 12 96 125 -68 -29 -116 -182 177 -148 57 39 -44 149 -106 -14 -67 41 149 182 49 -69 -149
7133 -149 23 -25 -164 -177 -92 -53 49 129 -23 0 -83 26 -1 16 -89 -111 182 -119 -47 -66 -16 -84 -83 -185 -250 -81
7159 -81 -37 56 143 129 95 -100 -123 31 -165 -76 -103 65 106 120 -52 -50 215 85 -47 -132 -104 -80 -5 -7 -48 -205 -48
7186 -48 -208 -77 -101 -72 58 10 50 -60 -27 29 21 70 186 -84 102 -46 -19 7 -109 54 -29 113 42 -48 26
7211 26 151 181 121 -86 -62 85 132 49 79 71 -79 4 -22 27 128 -40 130 10 -107 83 113 -5 -3 -128 152
7236 152 -143 125 151 -58 22 -101 -140 -218 -152 -69 -43 146 156 -104 -86 -8 6 117 63 -122 -86 54 -124 -23
7260 -23 -122 -34 -42 39 86 6 -79 -144 107 82 60 57 82 -42 94 290 -11 -201 -134 -54 217 44 189 -48 -30 61
7286 61 -168 -55 30 -12 -35 -99 -80 111 -175 102 65 79 -63 -49 -105 -172 87 98 125 -15 29 147 -103 -165 96
7311 96 89 30 -69 -33 -102 125 24 -34 -106 172 117 -8 -144 -213 -96 -82 -48 -45 34 75 30 -136 40 211 -60 -43
7337 -43 -84 96 162 9 -6 15 45 73 -39 21 36 94 8 -113 -117 201 -74 117 -53 39 36 -26 -14 -114 6 -13
7363 -13 23 -51 -228 25 -105 13 -61 -86 -86 -65 -10 52 52 -45 -16 -142 -18 -22 -88 196 75 58 -213 221 -129 -44
7389 -44 135 115 82 -49 16 -156 46 -107 29 148 -2 42 -39 132 13 127 -95 122 -56 -46 31 80 -2
7412 -2 95 -66 -168 16 104 -117 -108 74 -12 -97 69 -119 -133 109 -34 -51 -105 221 -199 121 -92 2 74 120 -40
7437 -40 14 122 45 -93 -17 -133 -102 -135 -79 -69 -108 1 146 -107 -16 -48 -24 -37 -53 -18 81 -35 137 129 -37 99
7463 99 -164 164 102 -35 -106 13 331 -112 -37 21 76 139 -13 134 67 68 -138 56 170 111 -154 -57 63 -24
7487 -24 -245 71 -124 -8 82 -56 -90 1 46 -71 -15 34 185 -46 -68 -2 63 -180 -227 -62 -83 -128 -36 84 229
7512 229 40 -167 -64 189 56 -78 -36 79 13 -30 -141 36 69 -118 -35 -120 39 25 -62 -226 -69 -21 -1
7535 -1 -6 172 60 72 161 76 123 -254 65 79 222 -90 17 -62 -80 -212 -106 -112 -61 -31 2 -82 -124 68 -15 -21 -131
7562 -131 116 -181 -89 131 -81 -66 -36 114 -23 -146 -89 17 94 -202 -119 78 -127 144 79 60 57 97 28 152
7586 152 -22 -212 -83 -106 46 -82 -45 -83 -80 11 88 86 -32 36 83 106 -69 68 -22 55 179 114 134 -12 234
7611 234 78 -2 -47 -37 3 -2 4 -41 210 157 87 27 24 -107 -48 -31 -7 93 16 52 175 23 -333 53 -72 131
7637 131 -25 18 322 112 111 163 11 8 -165 2 -14 109 -58 133 101 -99 -76 36 -203 -99 -27 -104 86 104
7661 104 -93 -89 21 -88 -68 29 212 -38 -34 15 17 -19 34 -5 -93 91 -5 63 147 13 -12 49 -126 140 111 19 -2
7688 -2 -52 -10 -49 184 74 -74 69 82 130 34 -39 100 129 0 140 127 -49 -1 -42 1 28 15 -143 43 -35 164
7714 164 -151 -35 -4 -15 93 178 264 159 -169 153 -62 -41 -24 125 -89 51 -199 16 -188 85 -173 84
7736 84 -27 143 39 -153 66 -17 109 76 136 -72 14 -69 -173 42 -125 -13 -61 -149 64 -108 -36 -24 56 89
7760 89 145 -21 83 -86 -21 62 59 -101 -117 164 -192 -23 -297 -10 -39 -19 37 -153 -299 1 47 171 17 109
7784 109 -19 53 -60 -74 12 -145 76 -180 -23 126 -166 -86 13 -126 20 59 -277 -121 -73 68 56 -7 37
7807 37 43 -168 -61 15 -24 35 5 -124 -12 -101 188 -19 160 56 -9 104 84 155 -1 57 -154 143 -116 141
7831 141 46 -148 -51 -157 249 -103 -157 -62 25 -40 133 19 55 -57 -55 126 -4 -118 -44 86 -9 -67 24 92 -90
7856 -90 -10 -53 63 3 -127 -113 111 -61 -22 36 -91 94 23 52 -135 -22 -109 43 181 -85 -90 -188 -184 15 -61
7881 -61 -23 -72 103 34 -49 53 27 60 203 161 71 107 -48 42 147 -138 16 67 -137 85 -116 -49 34 12 -61
7906 -61 43 -194 138 53 -78 -4 -128 -129 15 21 -184 -34 -24 116 56 -278 -134 -88 -103 53 39 -112 -2 1 78
7931 78 -96 -25 -44 110 -224 -157 -9 -42 -212 18 133 -68 -84 -183 -51 130 142 27 -72 44 12 48 83 -21
7955 -21 29 26 -135 -22 48 -69 88 -1 47 208 -137 1 159 -125 213 52 86 56 -117 -14 -17 3 -86 43
7979 43 -182 -47 -1 -115 13 47 71 -125 27 12 -228 -204 -178 -3 -41 -52 -195 -47 22 230 4 -38 -31 -164
8003 -164 102 -219 -16 -45 37 43 53 125 -138 -53 -96 21 -154 61 -102 7 -57 -119 30 -42 -102 -126 -28 180 254
8028 254 -142 -52 43 -26 -19 -51 -98 13 -115 134 9 -192 -96 15 -39 -40 -33 66 -19 79 0 132 1 -78 -17 44 90
8055 90 -207 99 -43 28 63 -33 87 42 -152 -41 -187 120 -46 123 -17 145 20 112 54 -150 100 -49
8077 -49 56 -80 -3 87 -244 -68 0 -193 -91 74 -90 178 -86 32 141 -110 -59 144 -42 78 73 -41
8099 -41 -16 64 62 0 -97 -66 89 -25 2 10 1 -169 108 -17 4 180 -64 -27 126 -75 -45 177 9 -227 -190 0
8125 0 46 52 -36 118 -120 34 -128 11 40 132 -65 213 -83 70 89 -59 10 -97 -11 -4 -38 133 23 103 -66
8150 -66 -87 84 29 108 180 146 10 -73 51 115 151 -14 -183 -2 -132 62 7 -70 61 -6 56 95 80 206 -66
8175 -66 -281 -71 112 70 -28 -49 -316 -140 -65 -163 -16 8 7 -32 75 -126
8191a26
$$ Imaginary data points
##PAGE= N=2
##DATA TABLE= (X++(I..I)), XYDATA
0 0 0 0 0 0 0 0 0 0 0 0 0 0 0 0 0 0 0 0 0 0 0 -8 8 -8 8 -8 8 -9 16 -16 16 -20 24 -24 30 -32 38 -40 46 -49 56 -62
42 -62 70 -78 86 -94 103 -112 127 -137 151 -167 185 -204 226 -250 279 -311 348 -393 447 -514 599
63 599 -715 873 -1109 1499 -2263 4308 -20567 -50842 17708 48608 -4299 -36136 23734 52193
77 52193 -4507 -34890 13519 35813 -8797 -39522 -915 28845 -11334 -39060 2412 25242
89 25242 -5090 -21282 7567 26557 1209 -13835 8604 14851 -1810 -8612 -3692 778 -4064
102 -4064 -9859 -6883 -6518 -2559 3777 -1436 -4578 5367 15376 9238 -7380 4344 26553 5749
116 5749 -20608 -1446 21261 -1752 -31734 -9347 22571 -3873 -34234 -6684 25001 4467
128 4467 -27093 -2963 36832 10995 -27932 -1711 33951 7957 -31942 -9194 30781 3207
140 3207 -36599 -9578 26116 4207 -28306 -6507 30962 12185 -20874 -1672 27299 11613
152 11613 -17395 -7867 19480 5582 -23440 -11333 8905 -1817 -18025 -9330 8091 3165 -7870
165 -7870 824 8859 6143 3883 3478 5215 5025 2717 1502 -3890 -4427 3816 -860 -11754 -6800 5987
181 5987 4377 -12121 -7352 16786 11065 -13123 -5553 18700 12002 -16858 -12534 18756 9848 -22899
195 -22899 -15731 14548 9831 -22274 -17923 20034 16937 -17890 -11648 23503 20631 -13839 -12476
208 -12476 23332 18971 -17445 -15246 14367 11003 -19556 -20442 10026 11060 -17107 -14805 11201
221 11201 12654 -8306 -9723 12953 14589 -5546 -6022 7987 7060 -5374 -7984 946 1736 -5728
235 -5728 -4284 -654 -1030 1754 2669 939 1857 5794 8503 143 -5066 6208 7947 -6721 -11500
250 -11500 1324 7043 -10566 -18086 3896 11518 -8972 -14198 8232 18417 -3895 -14394 11726
263 11726 21940 -4701 -15404 8159 18471 -7585 -21774 4694 17217 -9702 -20690 4676
275 4676 17655 -5485 -18705 6867 20908 -3056 -14386 6477 17248 -3238 -16877 1532
287 1532 12611 -6593 -16145 -183 8531 -4014 -11918 1947 10960 311 -3220 5488 8514 3773
301 3773 -584 2508 4403 -733 -1582 -1734 -5183 -3091 -727 -3598 -6413 -2243 5440 926 -7429 1965
317 1965 11568 2341 -7299 1179 12598 1450 -14095 -2253 11932 -1622 -15737 -3067 13597
330 13597 1764 -16284 -1051 18488 4180 -12936 653 19185 5402 -16068 -3108 16128
342 16128 716 -18165 -5865 11952 1119 -18544 -6456 13146 2462 -12957 -2281 13790
354 13790 6598 -8979 -1025 13721 4870 -7376 -1724 7144 2240 -8157 -4611 3619 -404 -4982
368 -4982 -1688 1245 1565 165 626 1738 1198 3252 2993 -3116 -1758 3150 202 -6849 -5796 3627
384 3627 1687 -9954 -5683 8012 5077 -6926 -3250 12668 10280 -7619 -4069 13542 8151 -10577
398 -10577 -8248 10218 7257 -14766 -11485 9731 5950 -13095 -9933 10851 10560 -10156 -8163 12949
412 12949 10393 -8680 -7689 9697 9346 -10008 -10003 7485 5698 -9284 -8040 5871 6834 -5679 -5365
427 -5365 7486 6786 -2177 -2029 5132 5800 -1671 -3312 1820 347 -3558 -2774 -2623 -2858 -2037 -1124 -1926
444 -1926 -3155 1683 5418 -1019 -2070 5584 7176 -1034 -4783 4516 8166 -4626 -9126 2767 6575
459 6575 -5646 -11293 2696 10622 -4405 -10425 6182 12208 -3098 -9927 5592 13093 -4538
472 -4538 -12655 3421 9254 -6254 -14113 742 10283 -4391 -12588 3655 12136 -1253 -8318 4434
486 4434 13702 355 -7666 3919 8961 -2017 -8178 -478 5069 -2937 -8273 -999 2955 -1818
500 -1818 -4054 -102 4015 1392 -1567 1902 2441 322 1260 398 -1171 -359 414 -1144 -4638 -1175
516 -1175 4026 -1026 -4951 1591 6530 1114 -4562 1869 9701 1746 -7031 493 8190 -2 -10821
531 -10821 -3590 7992 -1264 -12703 -2485 8617 380 -10433 -1086 11951 3356 -7933 1058
544 1058 11568 3348 -8408 -2415 9272 1719 -10727 -3491 7538 737 -9565 -3228 8153
557 8153 2960 -6572 -65 7638 3112 -4011 -1647 4825 2221 -4926 -3121 977 -700 -3764 -3315
572 -3315 -109 496 -1027 518 848 900 3509 2800 -232 1186 4303 2631 -3530 -2554 3869 402 -6680
589 -6680 -3517 3454 1378 -6792 -4474 6169 3918 -6009 -2654 8036 5733 -6173 -4901 8129
603 8129 5311 -8445 -5851 6567 4229 -8223 -7126 6518 5372 -6616 -4203 7546 7267 -3891
617 -3891 -4006 7315 6860 -5060 -4833 4728 3300 -6351 -6590 2352 2269 -5952 -4667 2477 2653 -1892
633 -1892 -2107 3150 4312 -55 314 2485 1740 89 -907 -474 -569 -829 -174 -1670 -2904 1010 2119
650 2119 -1256 -1759 2787 4616 -953 -3194 3414 4322 -3117 -4831 1548 3738 -4122 -7651 1570 4637
666 4637 -4365 -6354 3129 7046 -1773 -5680 5110 9084 -1962 -5168 4403 7685 -2615 -7718
680 -7718 2061 5874 -4567 -8158 1133 5293 -2936 -7252 1915 6732 -1733 -4533 2945 6132 -475
695 -475 -4515 1168 4178 -2067 -4495 -146 1703 -1059 -3294 -178 2358 183 -114 1574 1973 2133
711 2133 1195 727 460 470 995 -841 -3478 -1034 548 -2605 -4380 -866 2799 -507 -4260 1337 5582
728 5582 392 -3476 1574 6344 1180 -5419 465 5712 -937 -6812 -1290 5574 -87 -7339 -589
743 -589 7063 609 -5762 285 7041 1812 -5856 -517 6491 236 -6517 -1842 3916 145 -6564
758 -6564 -2236 4056 -15 -4362 -469 4238 2692 -1798 316 4512 1958 -805 232 1583 672
773 672 -1536 -1618 -389 -1290 -1258 -725 -1601 -382 1020 415 -840 -319 2842 1948 -2171 -524 2952 584
791 584 -3482 -2373 2536 1167 -4902 -2560 3953 2049 -3725 -1549 5469 4065 -3493 -1387 6245
806 6245 3217 -4244 -2754 3976 2585 -5986 -4458 3513 1310 -5324 -3715 3625 3200 -4031 -2459
821 -2459 5243 3425 -2706 -1660 3877 3454 -2880 -2636 3038 1446 -3358 -2539 1386 1601 -2152 -1567
837 -1567 2079 1283 -899 52 1314 1500 29 30 389 -730 -598 -216 -1914 -1800 -247 -143 -1480 -2057
855 -2057 786 2411 -824 -1102 3279 3499 -478 -1875 2598 3917 -2129 -3687 2028 2524 -3083 -4713
871 -4713 1218 3424 -2996 -4435 2684 4183 -1433 -3440 2522 5225 -1986 -4196 2237 3535 -2591
886 -2591 -4611 781 3554 -2243 -4409 1643 3820 -655 -2344 1775 4484 375 -2061 1931 2932
901 2932 -581 -2210 -363 1185 -1188 -2808 -671 -269 -1060 -916 -752 43 573 450 673 126 1066 2027
919 2027 -83 -1007 806 1450 -214 -2642 -550 2186 -945 -3320 514 3038 59 -2739 743 4271
935 4271 221 -3328 813 3646 -193 -4160 -974 3277 -927 -5222 -1169 3220 -59 -3933 -524
950 -524 4705 1240 -2891 1129 4678 1248 -2390 87 3650 221 -3512 -871 1993 -360 -3069
965 -3069 -1314 1784 327 -2130 118 2069 588 -589 95 1190 447 -935 -193 -7 -753 -251 -868
982 -868 -1118 -186 527 349 -498 -132 2249 1060 -614 241 2338 1700 -1423 -1292 2085 458 -3440 -1659
1000 -1659 1827 291 -3537 -2216 2563 972 -3226 -860 3484 1987 -2223 -1168 3545 1967 -3076
1015 -3076 -1592 2702 1456 -3115 -2467 2637 1477 -3185 -1439 2842 2114 -1585 -1153 2567 2139 -1719
1031 -1719 -903 1402 710 -1712 -2180 552 97 -2305 -1237 668 136 -621 -212 1056 1100 378 1112 830
1049 830 338 1284 534 -771 -461 190 251 -1176 -1808 589 828 -1568 -1403 886 1873 -842 -1652 1726
1067 1726 2388 -1479 -1978 1110 2057 -1704 -2914 1076 1936 -2046 -2417 1319 2590 -1122 -2181 1951
1083 1951 3360 -576 -1728 1947 2976 -858 -2835 995 2216 -1930 -2980 214 1221 -1384 -2597
1098 -2597 302 1780 -593 -1330 755 1985 569 -679 525 1607 -237 -869 -49 -181 -318 -625
1114 -625 -540 -115 -242 556 245 -115 1073 1241 -2 -162 442 987 -484 -1970 139 946 -1615 -2338
1132 -2338 -271 1156 -614 -2512 697 2601 147 -1460 990 3026 512 -2146 750 2745 -238
1147 -238 -2405 -163 1689 -242 -2935 -296 2110 -298 -2233 58 2226 480 -1900 295 2368
1162 2368 -122 -1787 -128 1263 -216 -2103 -693 1151 -357 -1255 -75 943 815 -128 440 1302
1178 1302 657 424 767 210 418 265 -396 -665 -1006 -233 -421 -1646 -646 559 9 -706 -46 1432
1196 1432 854 -765 60 1973 734 -1440 -489 1480 586 -2251 -919 1733 519 -1851 -698 2130
1212 2130 1355 -1545 -316 2679 1047 -1512 -780 1496 807 -2263 -1592 1415 282 -2271 -1297 1101
1228 1101 1020 -1730 -834 1891 980 -834 -46 1437 1401 -534 -448 1245 365 -828 -782 72 123 -669 -645
1247 -645 289 -251 -200 281 61 249 410 266 7 -272 346 225 -952 -859 312 4 -1075 -1075 650 1088
1267 1088 -663 -653 1484 1451 -168 -614 1386 1738 -1049 -1301 795 825 -1344 -1806 69 972 -1352 -1921
1285 -1921 818 1391 -823 -1273 1096 1942 -736 -1175 1103 1363 -724 -1561 236 1240 -740 -1218 598
1302 598 830 -433 -685 474 1210 164 -240 712 869 -39 -141 -357 23 -252 -765 -332 -760 -578 -94
1321 -94 -535 -533 124 288 268 -10 618 1310 -8 -225 735 772 17 -837 55 851 -585 -1413 247 861 -249
1342 -249 -1358 154 1709 -57 -1228 655 1325 -112 -1292 -279 1159 -622 -2004 -60 753 -250
1358 -250 -1209 -40 1409 150 -688 774 1625 479 -415 426 1330 -252 -1121 55 327 -596 -964 -496
1376 -496 13 -158 -665 25 140 -106 77 212 72 326 93 156 -39 -198 256 -140 -783 -116 210 105
1396 105 -448 -177 927 190 -648 288 1078 602 -579 -236 1044 42 -1579 -583 264 -120 -1522 -1097
1414 -1097 866 45 -1564 -92 1381 797 -606 -50 1677 683 -792 -201 1119 424 -1079 -835 801
1431 801 248 -1570 -472 571 302 -440 -471 849 419 -475 -26 523 -116 -333 -667 -256 -166 -730 -364
1450 -364 -174 -137 86 100 120 395 244 342 443 68 868 522 -236 -63 70 231 -717 -893 246 231 -814
1471 -814 -528 242 385 -631 -548 691 925 -473 -504 537 859 -586 -944 520 553 -762 -771 519 487
1490 487 -377 -345 728 948 -525 -299 739 753 6 -743 352 329 -726 -894 18 16 -588 -691 18 173
1510 173 -337 -28 404 211 435 78 409 516 250 -92 -4 -419 -3 -99 -215 -231 -262 489 -18 -384 269
1531 269 394 -248 -184 383 424 -110 -814 386 342 -588 -603 -131 132 -499 -871 383 959 -203 -540 518
1551 518 1234 227 -641 535 956 -274 -665 34 559 -46 -931 -136 420 -544 -804 84 298 126 -610
1570 -610 139 756 -100 -297 339 336 -106 -377 272 284 -212 -287 138 -14 245 49 46 390 267 364 350 47 277
1593 277 372 -211 -421 -369 83 -204 -853 -244 142 -258 -496 -224 610 309 -423 240 827 267 -306 -96 690
1614 690 147 -723 -302 861 24 -482 -157 567 528 -709 -165 743 204 -484 -106 460 175 -757 -393 578
1634 578 -75 -673 -262 42 118 -517 -91 520 313 -218 234 425 433 56 179 326 -15 -50 -87 -276 -114 -30
1656 -30 -281 -16 -222 -154 25 -142 51 239 -27 -146 9 172 149 -402 -266 499 60 -192 -248 131 348
1677 348 -363 -167 614 377 -101 -94 631 517 -340 -285 325 218 -518 -484 125 53 -569 -514 128 -29 -276 -256
1699 -256 605 574 121 -141 356 456 -84 15 182 348 -196 -266 160 164 -9 -120 -126 134 -7 -213 161 45
1721 45 -29 -43 -126 -152 66 -118 -203 -377 -112 -136 -241 -297 168 144 -191 -74 142 502 133 38 485 489 -23 -100
1745 -100 343 279 -269 -631 37 -20 -315 -223 -52 553 -251 -226 277 422 -107 -218 206 426 -167 -467 132
1766 132 470 -242 -132 -155 452 78 -258 334 465 204 35 195 363 246 -222 70 -23 -293 -204 -457 -226
1787 -226 -147 -451 49 -140 -106 223 116 -4 287 301 101 -8 164 300 -33 -211 144 31 61 -322 -125
1808 -125 364 -5 -352 192 209 10 -303 -111 623 -110 -354 -180 -12 -269 -434 -248 153 -161 -464 -51
1828 -51 285 94 -235 -38 681 205 -166 217 430 59 -315 -210 182 -15 -435 26 -88 -50 -260 -127 151
1849 151 160 -166 -1 160 105 140 -187 89 76 -287 -185 3 -173 0 -34 158 247 114 -23 -41 25 445 130
1872 130 -170 -65 19 -71 -232 -311 32 -59 -437 -93 120 25 -175 -151 365 210 -156 42 208 67 -31 -190
1894 -190 402 278 -266 -154 30 77 -172 -227 185 -3 -249 -47 344 58 -114 -30 182 138 -440 -358 -124 -61
1916 -61 -386 -325 -199 142 -4 33 180 127 299 240 189 188 300 191 -6 -43 71 76 -134 -258 -47 65 -90 -351
1940 -351 230 -108 -287 -78 -56 220 -278 -303 235 72 -221 -86 69 175 -100 -208 247 251 -46 77 166 250
1962 250 184 -259 396 230 87 6 244 39 -88 -383 -436 26 -201 -257 -70 -261 -161 -208 -70 407 203 111
1984 111 187 -25 5 102 61 200 -86 -101 115 -93 -75 63 27 -31 38 275 35 11 120 76 -180 -192 29 -363
2008 -363 -166 -321 -226 86 34 -390 30 184 254 -12 194 209 169 21 -33 260 -93 -149 -15 141 -116 -100 23
2031 23 -126 68 -260 -61 119 -45 -170 -40 182 -85 -268 -16 -7 -106 -76 -257 26 117 46 49 144 80 -55 213
2055 213 97 181 170 -19 162 -143 142 205 22 -177 23 -227 -177 -134 9 -114 79 73 -50 -214 74 -24 146
2078 146 225 -91 -30 127 -52 -250 -39 95 354 -102 -56 232 85 -92 -89 -119 77 -45 -124 62 -127 -213 -99
2101 -99 -13 19 -60 -3 1 -68 -57 -129 74 211 -152 -60 280 347 135 -61 177 282 100 54 12 -98 58 8 -272
2126 -272 27 -244 -250 75 -109 213 132 -64 -28 74 -247 -122 -76 63 25 58 -66 81 -56 198 34 62 299
2149 299 34 -103 -45 151 -124 -53 -97 90 -124 -146 120 -235 -281 -215 17 122 -21 -77 73 -88 -138 11 -9
2172 -9 169 -79 -247 224 177 -132 84 -71 148 26 53 60 43 175 -3 -97 42 219 -136 -94 -153 -247 -21 -36
2196 -36 -46 -124 -294 25 -117 -130 21 35 172 137 193 251 45 114 371 129 27 153 136 240 -227 -156 281 37
2220 37 -96 151 -204 -187 -123 -121 77 -114 -161 17 -96 48 39 -27 97 -158 -47 -93 -30 -227 -149 -7 199 -50
2244 -50 -115 83 90 276 97 -62 -48 64 -107 -108 -93 39 159 -330 174 212 -202 -102 -10 -88 56 157 240 106
2268 106 -363 240 90 21 301 -128 -100 289 193 61 -239 -87 124 -130 -125 61 114 95 -55 25 -152 -160 -130 -52
2292 -52 -28 -79 -12 65 122 -19 -57 129 14 170 70 -118 160 119 -200 105 -20 141 -21 -150 -103 85 -123
2315 -123 102 -5 53 29 -101 129 -190 -203 -7 19 -195 -187 -178 66 23 69 -2 -71 93 330 311 7 134 91 217
2340 217 -69 -1 -6 -115 -36 11 -133 221 -226 -235 13 -11 -231 -212 68 -101 -149 20 23 56 -40 145 -145 -146 109
2365 109 4 -42 45 -282 366 -21 -41 95 -42 76 -122 0 137 -14 -58 44 -236 -38 -203 -224 -65 -19
2387 -19 -60 79 -246 -32 61 -72 226 96 134 311 -102 168 42 -135 46 105 8 -185 93 -113 91 -179
2409 -179 -91 55 -202 55 56 51 -161 -95 -53 -19 -123 -24 34 -173 -13 -1 -9 127 12 -8 133 150 11 52 62 243
2435 243 75 -82 88 -15 80 -145 0 -89 -53 -19 -84 -107 -187 41 18 -89 -23 -125 103 43 -215 232 -53
2458 -53 87 150 -25 20 -137 -71 65 -27 -47 56 -246 -32 -188 93 -112 -106 8 -144 -51 80 -194 -144 151
2481 151 -162 -142 24 -132 165 140 122 198 -76 -17 -109 36 182 -59 -153 152 -87 42 168 -77 49 11 -40
2504 -40 -51 10 -81 59 -194 -14 98 -192 74 -156 -106 23 -42 -175 -170 49 285 -26 -56 90 -68 -69 79 99
2528 99 -28 -22 -129 -110 -9 4 91 -96 -264 -20 4 -7 74 -58 76 -247 -82 -86 -22 -49 -32 -188 143 -14 143
2553 143 53 12 105 33 74 42 26 149 209 -34 -95 -142 101 -72 -44 -125 64 -127 -63 -117 -243 28 -101 69 118
2578 118 -184 29 78 85 196 119 123 71 -13 144 -27 -10 50 -103 -151 144 -190 -128 179 -65 -129 44 -144 -66 -150
2603 -150 -214 57 -61 120 30 -190 100 72 7 -7 24 41 113 -170 26 196 -188 187 77 53 -228 113 16
2626 16 100 -65 -145 -108 61 -68 -140 150 -178 -154 -183 -202 113 129 2 15 79 -13 -57 3 -60 73 10 190 -55
2651 -55 -81 351 149 82 53 137 6 49 5 185 -17 -138 -6 6 2 96 42 -157 -121 31 -48 149 45 89 -59
2676 -59 22 216 33 -9 77 -26 71 85 54 43 39 -87 -252 -47 40 -47 -19 185 -24 37 -97 78 57 45 -126
2701 -126 199 -138 -160 -125 29 -6 36 1 -48 44 -86 -12 -151 26 16 -110 -77 16 1 -25 58 -138 -14 6 -22
2726 -22 -125 -104 68 -21 13 -56 -106 32 237 -170 126 -56 -25 -41 -112 -164 21 -1 21 7 81 162 22 162 -115
2751 -115 1 124 -138 -236 68 5 -157 -70 -66 -125 50 42 5 23 62 31 -137 145 -1 11 -147 77 70 4 -52 -79
2777 -79 108 -68 2 -47 78 -75 90 -57 -15 155 7 -21 117 118 -122 -77 -268 -49 -36 -12 -154 -30 43 -141
2801 -141 -23 -3 32 181 63 122 -13 85 -53 -95 121 23 -12 85 57 -161 -19 -77 0 -107 -102 135 -36 34 203
2826 203 -9 0 -86 133 -60 -76 189 59 -24 212 -35 180 22 193 16 148 -103 -67 141 -18 -24 -133 -82
2849 -82 -14 -29 -35 -87 -90 -102 10 -60 -106 -72 15 -78 100 -77 8 -114 269 -7 -18 24 150 -83 242 143 -3 70
2875 70 20 38 207 -22 -77 122 -24 15 -22 -35 32 116 -228 35 -100 -206 -103 -78 -13 32 -2 -45 9 53 203
2900 203 57 131 -27 100 4 -121 5 -133 -46 -56 -72 78 -59 73 -2 -195 -278 15 66 20 36 0 -90 150
2924 150 -92 -35 176 -22 -28 -13 -23 56 -124 23 181 -58 91 149 -19 149 -29 -16 -133 -34 -83 -3 30 -17
2948 -17 -139 104 -96 -128 -333 -115 221 21 -39 209 54 0 -36 -15 165 101 -122 41 27 -50 -54 47 52 102 96
2973 96 -109 12 143 -39 -13 -105 -86 21 46 -46 -16 56 -136 29 97 -10 14 97 84 91 115 -27 75 -231 255
2998 255 -80 -45 -171 179 -80 -53 -33 -19 -49 -94 -65 26 55 15 -15 -130 31 1 43 22 83 17 300 -78 95
3023 95 -2 116 101 109 198 -5 -103 1 26 96 -46 122 81 19 -15 -87 -74 -61 51 -238 -133 -68 24 71 -51 22
3049 22 15 -74 174 133 -83 -78 -39 105 233 134 129 -149 -161 -39 63 -39 169 -54 -103 98 -159 -56 11 66 -148
3074 -148 -34 -21 75 -54 -10 -79 -52 131 -93 -63 44 113 18 140 -10 202 -67 -97 147 61 159 181 -111 46
3098 46 -126 -176 -6 32 -64 50 58 -9 16 163 -55 25 -98 -69 157 -4 77 67 -185 48 -106 239 -15 41
3122 41 81 86 -67 111 9 108 35 -41 -73 -198 -113 3 -52 200 -109 73 35 -153 203 -153 20 56 -24 7 9
3147 9 -15 49 74 -96 34 161 35 -56 -267 26 33 -31 69 -25 -107 142 40 21 76 -190 -74 13 -59 147 196
3172 196 101 -83 -121 -141 -49 8 89 -66 -24 117 46 11 -62 -170 26 60 -22 12 -56 102 -110 -51 -57 -165 -122 -116 66
3199 66 -57 -26 -57 38 -14 -14 -111 138 1 -65 -31 117 79 -53 181 38 -21 41 -53 -206 82 15 14 158 -216 -24
3225 -24 -127 169 149 -163 -35 -172 -26 2 13 -159 240 1 0 172 -211 -27 62 70 -28 -39 -43 2 -6 -116 18
3250 18 17 181 -49 88 -123 29 231 -8 -5 -122 33 -55 -144 -171 153 -19 -11 -72 -113 -28 34 -78 -131 34 -55
3275 -55 35 68 -141 -35 -37 -81 35 -199 -67 62 22 -137 -116 29 24 -31 -67 -140 -62 -44 20 2 -50 217 70 43
3301 43 -75 37 -133 -55 128 -40 86 159 198 -31 103 42 -19 225 -168 60 -118 -165 -30 72 -17 -53 -233
3324 -233 -8 54 -50 24 57 83 229 23 12 -155 -27 -20 -49 -132 161 47 102 52 -8 -4 235 56 48 -78 -248
3349 -248 50 -84 232 -54 -162 -49 -156 -104 -39 -95 -279 -148 9 -35 49 -84 6 75 126 -70 48 66 -150
3372 -150 33 -45 219 15 39 275 -25 42 177 45 -81 93 -35 -109 41 -220 -102 34 154 -73 -73 -61
3394 -61 10 61 -47 16 25 -181 5 38 -47 -84 -44 269 103 -313 -187 20 38 -51 152 -70 70 -103 46 -50
3418 -50 182 -75 22 2 141 -83 -51 -57 -109 157 -163 130 -6 16 -98 -147 99 130 79 13 2 -21 -88 30 -98
3443 -98 24 -200 -20 76 -174 -130 -149 -137 -29 -71 -166 -320 -75 -114 -15 -60 176 26 -152 174 112 -21 108 -159
3467 -159 38 86 98 -24 43 -68 38 -78 53 92 207 152 -167 193 8 27 -104 -98 76 -12 -62 -98 -92 132
3491 132 -114 -37 14 53 -22 -68 -43 114 63 -46 -19 137 -37 112 -43 -7 -56 35 6 95 -51 8 180 71 102
3516 102 -196 -66 57 -10 138 149 -125 61 -5 90 34 39 -70 64 -135 21 49 -19 222 88 -2 214 157 -61
3540 -61 -16 11 34 -176 -4 52 -190 -54 68 78 -34 58 24 180 63 -180 -45 1 1 157 132 10 331 -56
3564 -56 16 -27 -114 138 35 22 -16 -157 -64 -100 51 -212 3 -107 123 19 -102 20 -125 -135 136 112 -147
3587 -147 125 126 65 -132 161 4 -22 -125 109 155 104 218 -188 -23 -36 93 -74 98 176 129 49 186 1
3610 1 -81 -187 73 -57 106 -59 85 55 81 -136 -65 -60 80 -12 -23 -158 4 -21 -157 -91 123 78 -191 -112 -98
3635 -98 15 53 -82 -43 24 94 10 111 34 -7 -56 112 26 103 -89 -61 -108 -43 118 5 33 74 43 -111 -16 0
3661 0 26 -133 31 72 22 -142 117 -61 -297 -22 59 -149 -129 -70 46 -128 -9 98 114 -77 -19 84 78 8
3685 8 -123 99 51 25 -130 25 -144 65 -148 71 136 -57 153 -118 -65 59 87 -170 -244 -74 -156 -82 61
3708 61 -42 75 41 46 -104 -159 29 43 13 -52 86 -207 -153 223 -22 -229 -29 -43 149 -157 22 -145 24
3731 24 -19 212 -1 25 118 -49 78 127 70 131 101 197 66 -93 -78 82 207 -56 -2 -23 -24 97 -156 102 -70
3756 -70 87 36 179 -51 -71 40 -33 -100 -101 -3 103 -79 101 67 -116 46 -113 5 -148 -126 -50 55 -72 -68
3780 -68 196 64 69 -57 98 211 -39 59 -42 9 144 24 -76 59 1 -57 276 -137 -149 24 25 100 -222 -94
3804 -94 22 75 159 21 -215 41 105 -104 91 -106 -72 -30 133 -47 112 -72 71 136 82 -123 -52 -217 132
3827 132 135 -123 111 -86 27 11 67 -160 -28 165 -59 -57 -64 -78 47 -132 88 107 -29 -22 239 131 -90 166
3851 166 -66 6 51 -42 -58 105 284 -84 -73 96 66 21 37 -124 36 6 24 -91 56 -226 57 -81 -69 172
3875 172 87 -12 76 -125 111 84 46 -129 -6 26 186 113 -16 153 -91 -36 -9 -89 4 -162 -94 -36 123 -170
3899 -170 14 75 90 35 105 83 65 178 -106 -144 -40 45 167 -43 117 30 143 208 -193 -115 -156 22 -27 -189
3923 -189 45 24 -136 134 7 -23 -198 -43 -36 71 106 -170 -243 -23 2 -1 -124 86 3 243 -100 -2 23 -57
3947 -57 140 110 171 82 -204 8 -9 -97 86 -116 245 71 -38 47 72 -1 103 13 70 -54 132 18 66 14
3971 14 -43 21 -8 56 81 133 -39 -100 -112 -61 61 -80 -2 -122 -111 -109 105 175 80 -100 67 173 -93 50 -8 65
3997 65 -157 -49 23 35 173 -13 -68 -105 -91 42 -4 100 3 -135 112 -24 96 -66 158 -17 -159 -16 131
4020 131 1 -143 -35 45 -129 -196 -38 6 -62 -17 50 -30 39 91 -59 54 42 -50 38 -127 59 -103 -218 -45
4044 -45 -76 -128 -10 -68 96 -59 -87 97 -14 -109 31 170 -60 116 148 -195 -63 -38 155 -29 -106 -7 27 14
4068 14 -139 -97 110 -113 91 39 -132 160 92 -111 17 -46 46 95 107 -94 53 -148 -14 31 -61 -16 -72 57
4092 57 77 112 257 91 112 -102 -30 72 149 -133 -75 1 142 112 85 182 -1 -214 7 -62 10 158 30 31 -16
4117 -16 4 -107 116 -50 -110 -84 -115 21 -43 16 58 -17 160 -33 -78 83 -36 49 -109 70 20 124 30 71 24
4142 24 -75 10 -56 -68 -133 -147 90 -133 -57 -51 16 -183 -53 75 66 19 85 -37 79 17 0 33 13 223 275 1 1
4169 1 22 -4 -52 -92 179 -58 -147 -54 -129 -118 30 42 -58 -3 131 124 177 -102 209 146 -357 -20 -84 152 239 -120
4195 -120 -40 -85 53 -20 18 -118 68 -108 -112 174 18 -83 57 103 111 -66 115 -104 -117 -130 19 -18 -2 22 127
4220 127 -8 -103 -43 27 -113 38 17 -51 -118 20 -8 -19 34 -13 -151 13 -41 155 29 -49 -149 26 26 -221 -19
4245 -19 10 52 -72 86 84 55 119 -30 231 -70 116 -163 18 -36 -89 41 38 1 150 -45 39 -8 -106 43 -161
4270 -161 70 43 -187 -126 216 37 -25 13 12 190 -14 121 169 -24 100 -115 -67 -162 -72 46 52 75 248 -1
4294 -1 123 -178 -115 -127 -36 109 -175 -134 -119 179 254 -25 -147 9 -181 -44 151 66 215 195 104 -78 34 -20
4318 -20 18 53 131 -37 72 -154 155 176 -75 168 -117 24 -158 102 -51 -14 33 -110 196 -12 236 50
4340 50 -142 -95 125 255 201 -68 160 45 127 142 172 -98 5 -55 20 34 110 -52 -163 65 51 -59 91 50
4364 50 136 -60 -90 -27 18 -172 -125 -79 120 140 -82 -150 -13 89 -67 -41 98 -117 132 105 -26 -104 -201 -138 -88
4389 -88 36 -40 -29 122 -45 123 10 6 -12 -205 25 62 119 -72 -62 -90 31 9 -21 26 31 105 -96 197 92
4414 92 45 -17 -8 143 -74 141 -91 131 -7 -29 -71 -127 -116 59 -120 -124 -5 27 -186 232 -3 16 -41 7 27
4439 27 97 101 -40 64 42 -147 -44 -61 -45 125 59 -94 -122 -40 -110 50 -61 -171 -32 44 -17 -78 -124 147 166
4464 166 -21 139 36 -109 -78 -61 -130 28 189 40 -77 -168 -68 -9 -101 -18 -2 -127 -76 49 -46 100 51 -3
4488 -3 -84 117 -98 -13 71 -71 -201 -18 36 -20 -57 158 168 -8 -24 -47 30 -37 -48 26 -74 126 -128 39 -63
4513 -63 90 -103 -30 20 -15 -20 -83 159 -113 208 -12 215 -200 -59 -2 -54 -213 88 -4 -91 11 -48 221 2
4537 2 -144 -31 -80 128 -69 -109 127 -60 104 18 55 71 -141 1 -62 10 111 -107 73 -69 -152 143 140 -101
4561 -101 -84 -60 127 -98 50 91 -76 10 126 122 81 -89 20 -29 36 -194 108 35 41 80 105 0 -22 37 -134
4586 -134 -76 -1 182 -20 -52 -183 9 -116 -209 -97 105 143 -3 50 134 -96 -66 -9 41 -86 94 6 66 -87
4610 -87 -157 -125 31 192 -126 -194 -58 69 -11 -115 -49 143 21 -97 163 119 -82 -98 -133 205 38 -91 55
4633 55 -18 21 21 39 -42 48 95 71 75 61 -56 -10 88 62 40 88 175 6 55 -173 -32 242 -111 -148 50 -168 112
4660 112 8 -69 144 96 -222 80 -10 54 167 25 -1 48 -74 -136 36 88 89 84 -107 -205 36 -39 6 27 9 -44
4686 -44 -24 -47 79 -34 53 -106 -64 237 72 71 -26 78 -18 -16 106 193 189 63 -230 53 80 -79 51 162 -99
4711 -99 -4 177 -53 -6 -129 233 -32 39 -50 111 289 -106 -77 19 -183 -3 -75 62 84 -21 64 79 -5 203
4735 203 -80 -36 -54 160 -34 -103 -34 29 -7 38 -47 79 -89 -49 78 -195 141 68 -288 143 154 -213 23 -255
4759 -255 5 -21 -79 -52 -9 -59 -10 -80 85 -40 49 -51 -120 89 -27 96 -146 20 -11 16 89 -16 -174 -12
4783 -12 80 -109 33 181 128 -99 24 -58 -249 -8 53 51 58 101 -87 -8 -19 30 82 -103 -83 -80 11 21 102 -112 -52
4810 -52 87 -30 210 -8 2 86 199 -79 12 -72 90 -154 -4 46 84 45 -201 -105 120 -23 0 24 -75 267
4834 267 -237 -29 124 -13 -186 -19 38 -164 -36 195 -13 105 199 -187 -7 119 -126 -47 24 44 -109 28
4856 28 -19 169 50 23 -167 -24 35 157 -107 -128 44 15 -26 41 -89 8 -79 -8 60 27 41 26 56 35 -119 28
4882 28 36 98 -6 17 -8 178 104 -26 -128 27 38 128 79 -39 160 -85 174 -100 -61 79 132 5 44 -20 103
4907 103 110 123 28 -157 -216 59 -198 -84 37 88 124 -52 55 11 19 -90 98 -103 84 -22 89 64 189 -6
4931 -6 34 -172 82 -35 -21 102 -2 148 -29 13 -66 32 -85 -132 120 2 47 -91 66 56 -162 -24 32 38
4955 38 200 88 24 137 12 43 89 13 -73 -20 28 -20 -141 19 -239 -71 -18 46 -52 89 -9 11 18 -59 -103 -133
4981 -133 17 -64 39 51 -93 214 51 -188 99 100 120 3 -72 -21 -35 106 2 -2 180 19 -44 9 -122 18
5005 18 -75 72 142 -46 6 -46 183 83 -47 135 59 17 23 39 -2 72 21 -57 -20 52 -55 -253 -6 -26 90 24
5031 24 -23 -70 -34 16 135 -120 -19 -30 -9 -5 71 90 112 3 -138 181 -169 36 -46 3 49 17 39 163 -197 -65
5057 -65 -97 80 29 -179 -78 59 -43 -171 -97 3 88 -26 -223 -154 -25 -43 187 -124 -50 -137 -82 19 -93
5080 -93 -106 98 23 22 -34 -82 -46 49 164 64 -34 -69 43 60 162 -32 -134 12 88 -49 -1 -44 16 1 150 18
5106 18 31 7 -57 130 3 131 1 46 -10 2 -6 -9 -10 -21 -42 -33 112 41 -220 107 -19 -44 91 -33 -56 133 134
5133 134 10 -48 -11 -77 27 45 75 12 24 -26 51 -134 -14 -50 75 -78 -68 -44 49 178 156 94 171 -119 46
5158 46 -137 -221 -209 -190 115 -22 -82 114 49 -2 -110 -98 -94 -241 -47 10 76 8 -10 150 -97 -25 76 77 -63 41
5184 41 -207 -55 -7 -7 -72 -2 -23 -85 237 92 4 -71 13 -155 -22 -25 -13 -1 63 -300 84 -64 -132 -131 13 -8 131
5211 131 -84 -44 13 -31 -20 6 30 -167 232 -104 49 -35 67 89 115 117 79 -159 17 21 -137 36 44 43 -78 21
5237 21 -115 1 61 -83 18 -44 -84 -70 -56 -59 -101 -7 -4 7 64 -67 20 228 51 -24 -60 171 29 164 177 5
5263 5 -111 156 111 -32 -119 -107 58 -149 -17 224 -48 -20 25 15 52 83 12 70 -279 165 -5 158 -67 91
5287 91 126 168 -9 -108 40 -47 -47 -104 142 56 62 2 -12 151 100 0 -101 10 -82 -104 103 -62 52 -161 182
5312 182 -115 41 88 39 4 -42 -205 -34 -124 -108 -43 -26 22 5 -15 -63 84 41 -61 157 -30 104 -44 135
5336 135 216 -102 -86 -37 -151 -9 -81 -43 102 -185 86 -94 -11 -82 50 -9 -112 -179 23 53 -43 -2 75 -34
5360 -34 -79 38 -27 -219 156 64 6 148 -129 14 76 -49 -8 -78 -45 262 82 -58 78 -119 -80 -20 -85 -110
5384 -110 128 47 134 -13 -124 -10 10 66 -10 -27 50 -283 71 55 -122 -138 -164 46 -69 21 6 128 62 -67
5408 -67 -118 -45 89 21 128 61 139 -72 -163 -31 156 -98 -190 -117 -138 124 48 13 107 -64 121 4 18 31 97
5433 97 125 -143 9 0 216 112 127 -154 -18 -11 -209 187 1 -32 18 -122 -72 9 -61 48 -75 82 -15 -6 71
5458 71 14 47 -6 193 -167 -57 44 0 177 75 3 -133 -10 -35 97 -63 62 -13 137 -132 -40 109 35
5481 35 -185 -18 -27 -90 -53 -50 -68 -51 -18 -35 -88 41 -120 -84 108 -209 -23 -4 60 -115 120 140 -55 -74 -56 -75
5507 -75 -27 34 40 80 -114 70 -107 -30 -169 -87 -52 37 4 24 143 16 -42 24 4 -12 -195 -208 16 -81 60 25
5533 25 53 -128 181 -81 -163 40 78 81 -7 -12 32 143 -87 9 -3 -65 78 104 -37 33 -208 87 -16 -273 -35
5558 -35 14 -56 -53 109 30 120 146 58 40 127 102 95 47 -72 47 -23 -9 -9 -30 22 -18 -159 4 112 103 59 -411 -26
5586 -26 57 -8 -37 29 28 76 49 46 106 -41 -22 65 24 -5 139 -98 -87 -86 -117 73 -7 46 33 92 139 -243 172 24
5614 24 -57 -66 -106 77 101 10 -107 194 11 -16 -108 -60 128 51 242 122 -51 -33 -18 -49 33 37 102 -40 25 -61 241
5641 241 2 144 112 37 -108 -276 -120 -24 9 126 -96 -35 9 -147 73 -53 133 -3 81 -107 -43 17 -70
5664 -70 102 48 -54 13 27 62 41 100 -118 -117 -48 -277 -171 -59 83 -229 -70 -138 -31 197 -31 -62 -56 16 -141
5689 -141 66 41 -94 91 -103 54 104 -135 -52 259 136 -53 52 162 -92 -175 53 64 9 80 120 -110 71
5712 71 -90 33 -41 -36 4 114 -23 -8 31 -125 3 18 17 42 31 17 6 -136 -97 -128 -84 -63 15 -33 93 -156 -104
5739 -104 47 -189 88 243 -81 -68 76 158 -104 54 93 -159 -112 -97 31 -69 19 -198 -53 -15 -7 -243 133
5762 133 -80 -34 -59 -92 -27 -84 8 54 -171 -6 87 -106 134 65 -53 7 -146 -13 23 -28 -62 85 -31 98
5786 98 54 43 -82 -98 -56 -27 -125 -5 36 -209 22 55 -17 -54 -179 -238 10 91 -124 78 -73 -132 -106 -15 110
5811 110 0 161 214 181 -65 22 -66 -33 191 -36 -86 74 25 35 -49 -136 17 66 81 -1 -154 -76 -128 74 162
5836 162 -168 -90 80 152 3 -41 -1 -1 53 -81 38 -135 19 43 -21 -5 -235 0 240 -89 83 129 4 13
5860 13 -91 -97 -131 -240 195 17 37 78 -86 -49 43 85 -143 -7 -174 -119 -7 -133 177 -177 -45 166 166 103
5884 103 47 -106 -73 49 120 144 65 22 -47 141 -47 -43 -2 -7 111 58 -17 140 -79 125 -82 34 -43 73 81 53
5910 53 -2 -179 -114 43 156 -128 -10 -142 -109 226 169 92 -87 -27 -58 -117 -33 145 -200 -99 -283 -40 -53 -119
5934 -119 -117 -147 62 107 -96 82 -32 38 111 -31 -44 3 -155 164 -110 -324 -18 -107 47 -141 10 -80 35
5957 35 27 -20 -161 -118 146 13 -56 63 61 -57 128 -4 -11 -163 134 61 2 122 -78 17 121 109 -34 -69 56
5982 56 -130 82 1 41 146 74 -77 -43 -30 43 -138 -93 31 -27 -175 132 -61 1 -19 94 70 -80 210 -63
6006 -63 -106 -64 72 2 -123 -115 169 14 -48 16 95 -36 -65 79 112 43 -55 106 -77 -191 141 -10 18 -18 -30
6031 -30 6 -84 12 -120 106 -33 -180 -37 201 181 89 -26 -17 7 89 192 -106 -41 -145 150 35 -47 45 -109
6055 -109 31 52 -5 -138 72 37 -265 -13 -57 -2 -74 -59 -85 52 104 -17 21 -32 144 90 20 -24 -143 91 -94
6080 -94 -4 -190 59 37 -48 -96 117 -29 -145 43 30 127 -12 34 95 86 87 -43 159 128 -192 27 -219 -60 -35
6105 -35 32 -65 99 51 -46 -133 223 -81 11 -33 -104 -54 -49 86 -87 41 -55 48 -9 68 -88 -11 -19 -35 -215 47
6131 47 -90 157 -96 -66 228 133 131 6 3 -15 -72 -62 -134 -4 -98 -44 52 -61 121 -17 87 -114 63 -43 -64
6156 -64 79 -84 -85 -97 -66 -81 162 -15 184 15 89 72 -11 -25 85 -49 -43 -4 55 -74 75 -83 31 82 49
6181 49 -91 44 410 33 -30 -5 -16 -126 -126 103 153 -182 -69 20 -62 122 61 25 -48 -56 -98 16 -102 65 -203
6206 -203 2 159 -57 -40 163 -10 -121 -43 -154 -8 88 -75 -104 54 -37 -9 -64 34 -16 -29 281 -213 81
6229 81 152 2 -13 -76 143 -11 135 -151 31 129 8 77 -135 -30 15 -81 -71 117 80 -80 18 -70 28 32 -129
6254 -129 -33 -93 -142 15 -68 -67 16 54 -166 65 -21 129 14 -63 -76 26 -48 -60 38 191 -131 89 79 -135 1
6279 1 73 -72 -186 -187 -114 -67 138 100 -83 142 34 78 34 197 -34 83 34 57 219 63 27 44 -119 63 -36
6304 -36 -28 -99 228 11 -13 -107 45 -75 -77 233 -89 68 97 -74 -181 -188 -78 -67 -121 -35 18 -16 -40 0 40 -34 11
6331 11 108 105 161 61 -9 -277 -134 18 15 48 169 -184 -5 4 -28 -177 -3 -49 -4 -28 69 -9 -75 21 225 112
6357 112 -63 75 -264 -3 -44 16 27 -36 24 -73 -236 8 151 -99 37 -17 22 -45 -13 -3 -4 -43 105 39 -92
6382 -92 -8 39 75 195 71 -23 19 120 52 104 100 110 -21 45 127 -12 -77 -153 -68 64 -24 -146 157 -121 -38 88
6408 88 -168 -80 -38 92 -67 -89 140 -172 -71 121 -112 160 54 -121 -15 161 32 -54 -44 -67 -103 -272 -92
6431 -92 193 135 70 39 -203 -180 -82 80 36 -120 -75 90 -20 92 -148 38 -8 -113 156 7 170 31 -93
6454 -93 -17 -42 -118 -17 -74 -43 -11 85 9 -63 72 104 -5 97 68 -33 -38 -181 -37 -112 -19 -208 -102 3 -148
6479 -148 -152 -79 -44 -41 95 -89 -118 -13 63 -23 -68 -49 -143 80 -7 -93 -59 34 15 -71 -15 -69 175 61 163 25 88
6506 88 -92 -135 -14 120 -111 -45 -96 220 32 -70 63 -82 207 88 47 -67 -33 103 21 23 133 -30 -140
6529 -140 43 -79 144 77 -116 -71 -52 -22 12 -137 70 -42 -22 -125 23 -19 -130 47 -100 24 -10 -41 173
6552 173 25 126 -31 -28 47 117 88 -181 0 87 252 -73 -113 37 -180 25 172 -146 -226 -12 66 36 -20 125
6576 125 -14 20 84 159 -54 84 -54 -6 -95 97 -156 129 -17 -116 14 59 95 -115 -76 -73 -5 -151 -56 -64 96
6601 96 -88 94 56 159 -73 -2 116 -38 134 -162 100 -134 -14 -44 11 -5 110 4 -14 -91 143 -142 -93
6624 -93 75 168 -68 49 -78 9 74 209 48 156 -15 110 -147 -32 69 105 -37 -164 -54 -172 147 -112
6646 -112 124 -48 -27 -83 249 17 -80 -19 -188 23 59 -5 -43 -75 53 24 -52 -25 -81 71 -143 -12 40 -24 -48
6671 -48 199 -52 56 -7 1 47 141 -180 -92 -182 -80 92 141 151 -190 -18 -78 -63 223 110 23 -78 -47 -21 82
6696 82 -93 128 -120 -99 20 78 16 50 11 139 60 85 51 -132 -4 63 3 33 19 -58 -85 -37 -121 -45 51 35 -117
6723 -117 -1 46 25 22 -134 -59 206 -51 -51 34 -10 64 -21 162 232 -75 65 -8 -199 -26 -185 -8 47 -60 -38
6748 -38 64 -45 28 -7 174 190 -125 72 -54 78 22 90 43 -118 162 89 -96 38 -178 -111 -57 -38 -196 49
6772 49 32 -141 18 -1 34 -168 -94 -10 -237 255 -126 58 136 -185 -13 119 134 -45 -222 204 70 3 -71
6795 -71 -20 23 -122 -20 -34 65 13 -17 176 -34 -100 9 34 91 31 -67 -13 -93 -52 -17 -80 -2 117 -52 -141 62
6821 62 73 156 -15 269 -175 -55 81 49 -15 158 -113 -70 48 -25 -82 20 -3 62 -60 -52 -7 67 40 -31 -122 -170
6847 -170 -83 -3 -103 -118 -54 -167 29 114 -168 -183 -10 -55 -111 -15 -52 -49 -16 -57 70 0 112 68 -186 108 -34
6872 -34 10 -113 -130 43 111 -19 -88 -101 -97 84 65 -64 -277 3 29 -134 -67 76 -88 -138 -53 -132 -72 18 -39 -110
6898 -110 78 116 -210 -73 86 -17 102 -3 -34 62 49 -4 -2 33 170 -13 -26 -17 -59 31 -24 -153 2 -57 45
6923 45 -87 -172 169 32 127 22 57 -11 63 -84 -54 -120 -83 -81 136 20 -8 45 -120 18 -183 23 12 106 -203
6948 -203 -82 -6 13 6 -21 -61 30 -100 115 -159 -111 102 -10 -96 -109 -50 -70 -198 81 -111 -106 -30 -7 -160 -48
6973 -48 -15 67 2 -101 -204 170 258 94 -183 -134 107 62 144 16 -77 57 35 27 57 -22 -52 -62 13 -157 -156 -119 -30
7000 -30 141 5 16 80 157 65 167 150 -81 -173 -68 -51 -41 -48 -184 42 -63 -99 -74 5 25 -67 65 -128 13
7025 13 140 69 -38 -42 -88 -46 -10 -136 182 146 -95 -34 -99 -140 155 -58 -15 -166 -64 -127 -87 208 -71 -60 -76
7050 -76 1 -62 100 -98 -116 -40 -245 33 40 130 -137 -161 29 154 -14 135 -69 -183 -8 -88 94 -419 88
7073 88 35 100 67 -211 -67 58 94 9 116 -31 -58 -58 -26 4 128 -10 -51 -166 -59 -13 -88 -119 79 -50 -109
7098 -109 -35 71 2 59 42 -33 136 145 -103 27 -41 -109 0 66 -180 -26 -45 -87 -48 -19 186 70 166 -53 99
7123 99 -82 -43 -88 -30 -30 -32 -135 -61 18 -35 129 45 87 29 35 -53 -19 51 52 26 -2 -107 -90 -64 56 76 48 142 -84
7152 -84 118 105 126 128 25 46 20 -61 -191 22 28 137 90 -58 -56 2 113 22 71 94 56 -6 -274 -43 -283 -108
7178 -108 25 -46 48 -81 -109 67 -160 -123 126 -75 -57 96 -106 -20 65 -28 93 -66 -116 -94 61 -23 -112 45
7202 45 54 -144 77 197 152 -5 23 -15 -133 108 54 11 -104 91 -10 -11 -176 -36 -64 -49 -23 -35 -174 4 26
7227 26 7 101 -79 -106 -100 -25 26 34 50 22 53 210 -4 -45 95 144 -5 136 -38 -82 -212 76 82 -89 -16 -12 -196
7254 -196 80 -44 -82 152 178 -85 64 -93 -104 -87 102 -158 -36 171 177 95 -100 80 98 31 -253 86 2
7277 2 -50 92 -47 226 113 -170 22 -23 -60 40 132 115 -156 84 -54 48 -58 13 152 -160 69 -318 -81
7300 -81 -51 14 45 -175 -130 -105 -152 -105 15 29 52 185 89 27 -82 -308 21 -4 -60 -117 -6 -118 78 -136 104
7325 104 72 -103 11 74 82 64 113 174 -31 -52 -88 101 54 138 -157 26 -90 -209 -110 -20 -154 -43 -53 74 -163
7350 -163 -58 159 207 -36 137 137 50 133 -125 46 -83 -88 -119 26 -100 81 44 -12 0 138 -40 -80 154 -152
7374 -152 -301 2 78 -157 2 -99 -113 -70 -81 -22 181 143 -102 29 159 15 -169 128 -37 1 -15 94 65
7397 65 -102 -168 -7 22 -38 35 -8 177 165 -126 21 -43 -144 38 -109 -106 173 -161 54 -155 -4 -15 -25 84
7421 84 -87 27 -112 58 4 55 -87 -175 -51 52 16 -47 -91 -111 73 118 -31 -274 -120 18 -10 -133 -16
7444 -16 -54 49 -25 -104 65 76 -39 191 -56 -124 91 -51 -44 141 42 -7 -43 -55 -37 -57 182 4 6 -99 56
7469 56 -52 105 -138 166 36 183 53 -61 60 -308 -55 -59 -77 34 41 67 104 -18 24 307 -48 -259 117
7492 117 75 -101 -42 -84 -102 3 -42 164 -188 39 20 -174 -66 -9 -74 -29 -101 -57 -72 -2 7 -31 -96 -4 117 4
7518 4 105 56 18 87 -341 -13 17 41 22 -11 -325 -58 -107 -175 6 -22 140 -76 -194 -180 -195 67 -24 149 -34
7543 -34 -15 8 226 117 -112 88 -160 78 -74 28 -42 23 114 -85 52 199 2 185 -48 -126 -162 -183 -134
7566 -134 12 -1 136 -139 -39 51 57 47 -200 -126 -145 176 37 37 23 95 -71 -59 -44 6 70 -98 58 -143 -113
7591 -113 92 104 2 -185 -106 71 -11 38 25 257 158 99 -72 -53 -56 2 -19 86 -220 -97 36 -3 95 100 -176
7616 -176 -114 8 42 -137 -224 96 155 -58 78 29 -32 61 121 -194 72 179 -28 -110 -24 -83 160 113 26 68 -63
7641 -63 123 -109 35 12 -210 -87 38 181 53 -150 108 85 -138 17 28 30 13 76 138 14 40 20 84 147
7665 147 -140 -171 152 -2 -12 -49 24 -4 23 60 -126 5 -5 -87 95 19 -30 76 142 -72 15 70 -137 -32 -10
7690 -10 6 79 17 73 -81 -187 84 57 -39 87 -63 141 -32 25 -46 -76 95 -50 -11 -29 -137 -45 -2 -40 -148
7715 -148 -60 -58 -62 82 -10 -84 -126 99 -140 -69 46 -129 100 -17 -36 -9 61 -51 -154 -114 122 -82 -56 63 -53
7740 -53 35 -92 9 139 -47 -22 21 -171 -51 -59 112 -151 21 -256 86 -19 -57 -73 265 -139 -117 -139 -59 79
7764 79 239 83 -5 235 -26 77 -11 -96 130 -13 78 -27 -17 -141 -23 59 -47 110 46 -4 -45 -108 -153 49
7788 49 46 -72 -176 -57 -191 136 33 -32 8 33 -99 -26 9 -37 -78 -45 107 -14 2 -199 -178 -92 -6 236 -183
7813 -183 -182 -60 -195 -103 76 30 108 -47 -17 99 124 84 -164 -39 -108 -163 -85 -168 111 -72 -21 -36 58 265 98
7838 98 -20 94 -12 64 144 39 -9 -10 -69 -136 -30 134 88 148 54 138 0 -146 25 -7 84 75 22 -21 43 54 92
7865 92 -181 -93 -120 18 -24 3 4 -101 100 -53 -167 -135 -8 -172 -143 31 -3 -18 137 74 58 -200 13 -84 -32
7890 -32 16 85 -6 -147 216 -88 60 31 21 1 -37 88 -15 -61 41 -151 -49 66 131 -188 15 105 -142 144
7914 144 68 -188 54 84 -15 95 12 115 -53 136 170 -92 -76 201 60 -5 37 -69 -14 85 -87 0 -33 -154
7938 -154 -114 -13 -51 84 42 -7 -320 -160 -197 -164 68 154 11 44 -88 58 -164 67 11 14 140 119 -3 83
7962 83 18 173 20 -146 -189 80 47 127 -45 135 10 -39 120 191 -1 -218 124 -60 136 62 -2 -109 126
7985 126 46 6 -60 -36 -181 -47 -47 -67 61 73 125 -54 -33 77 127 -4 121 -65 -31 39 16 146 -195 -119 44
8010 44 94 73 19 28 84 -124 84 -64 50 5 90 -1 94 66 -8 64 70 45 65 -109 -17 31 -56 47 -111 -50 67
8037 67 70 -129 -184 -95 74 93 97 -110 35 33 -52 -49 108 73 44 27 89 139 -280 -33 -2 124 101 -188 58 -192 117
8064 117 85 -70 -172 -160 88 -34 121 232 -41 -274 -27 135 79 -45 51 99 44 -3 25 -11 -81 -55 -77 9
8088 9 84 122 6 -16 -75 -102 -74 -50 -130 70 -200 160 31 86 -6 4 59 -159 152 -75 -199 93 91 -7 92 -88
8114 -88 203 -62 -28 -97 193 -137 -185 -8 -54 136 26 230 -273 -69 -93 4 39 96 -2 -73 31 106 26 -113
8138 -113 -141 -77 -90 -66 249 14 -194 35 -59 45 -39 -47 30 157 -20 -144 -47 -19 -74 12 -21 262 -75 70 -123
8163 -123 52 -8 44 -32 -23 115 122 -122 -148 89 96 67 102 -63 -111 36 53 -61 111 115 -13 297 70 147 196 -100
8189 -100 84 50
8191E0
##END NTUPLES=NMR FID
##END=
