##TITLE=1H_Iba-5
 200.13MHz, DMSO-d6+CCl4,
 8 sc
 
 11.3.2025
##JCAMPDX= 6.0         $$ Bruker NMR JCAMP-DX V2.0
##DATA TYPE= NMR FID
##DATA CLASS= NTUPLES
##ORIGIN= UXNMR, Bruker Analytische Messtechnik GmbH
##OWNER= pz
$$ XWIN-NMR		Version 3.5
$$ Tue Mar 11 16:11:22 2025 Russian Standard Time (UT+4h)  she@DPX200
##.OBSERVE FREQUENCY= 200.1313
##.OBSERVE NUCLEUS= ^1H
##.DELAY= (6, 6)
##.ACQUISITION MODE= SIMULTANEOUS
##.ACQUISITION SCHEME= undefined
##.AVERAGES= 8
##.DIGITISER RES= 18
##SPECTROMETER/DATA SYSTEM= spect
##.PULSE SEQUENCE= zg30
##.SOLVENT NAME= CDCl3
##.SHIFT REFERENCE= (INTERNAL, CDCl3, 0, 14.3821)
##AUDIT TRAIL= $$ (NUMBER, WHEN, WHO, WHERE, WHAT)
$$ ##TITLE= Audit trail, XWIN-NMR		Version 3.5
$$ ##JCAMPDX= 5.01
$$ ##ORIGIN= Bruker BioSpin GmbH
$$ ##OWNER= she
$$ F:/spectra/data/she/nmr/H-C/1/audita.txt
$$ ##AUDIT TRAIL=  $$ (NUMBER, WHEN, WHO, WHERE, WHAT)
(   1,<2025-03-11 16:10:35.14 +0400>,<she>,<DPX200>,
      <created by zg, POWCHK disabled, PULCHK disabled
       configuration hash MD5:
       00 E9 B6 7A A2 85 ED C7 34 08 36 98 17 FE 4E 26
       data hash MD5: 16K
       63 70 E3 10 20 32 67 24 FC 11 26 5B 4C C1 FC 63>)
$$ ##END=
$$ 
$$ hash MD5
$$ 82 C9 0A 07 FF 3B 14 CC 9E 54 C7 7C 35 B0 28 8A
##$RELAX= 
##$RELAX= 
##$RELAX= 
##$RELAX= 
##$RELAX= 
##$RELAX= 
$$ Bruker specific parameters
$$ --------------------------
##$DU= <F:/spectra>
##$EXPNO= 1
##$NAME= <H-C>
##$PROCNO= 1
##$TYPE= <nmr>
##$USER= <she>
##$AMP= (0..31)
100 100 100 100 100 100 100 100 100 100 100 100 100 100 100 100 100 100 
100 100 100 100 100 100 100 100 100 100 100 100 100 100 
##$AQSEQ= 0
##$AQ_mod= 1
##$AUNM= <au_zg>
##$AUTOPOS= <>
##$BF1= 200.13
##$BF2= 200.13
##$BF3= 200.13
##$BF4= 200.13
##$BF5= 200.13
##$BF6= 200.13
##$BF7= 200.13
##$BF8= 200.13
##$BYTORDA= 1
##$CFDGTYP= 0
##$CFRGTYP= 5
##$CHEMSTR= <none>
##$CNST= (0..31)
1 1 145 1 1 1 1 1 1 1 1 1 1 1 1 1 1 1 1 1 1 1 1 1 1 1 1 1 1 1 1 1 
##$CPDPRG= <>
##$CPDPRG1= <>
##$CPDPRG2= <>
##$CPDPRG3= <>
##$CPDPRG4= <mlev>
##$CPDPRG5= <mlev>
##$CPDPRG6= <mlev>
##$CPDPRG7= <mlev>
##$CPDPRG8= <mlev>
##$CPDPRGB= <>
##$CPDPRGT= <>
##$D= (0..31)
0 0.7 0 0 0 0 0 0 0 0 0 0.03 0 0 0 0 0 0 0 0 0 0 0 0 0 0 0 0 0 0 0 0 
##$DATE= 1741695034
##$DBL= (0..7)
120 120 120 120 120 120 120 120 
##$DBP= (0..7)
150 150 150 150 150 150 150 150 
##$DBP07= 0
##$DBPNAM0= <>
##$DBPNAM1= <>
##$DBPNAM2= <>
##$DBPNAM3= <>
##$DBPNAM4= <>
##$DBPNAM5= <>
##$DBPNAM6= <>
##$DBPNAM7= <>
##$DBPOAL= (0..7)
0.5 0.5 0.5 0.5 0.5 0.5 0.5 0.5 
##$DBPOFFS= (0..7)
0 0 0 0 0 0 0 0 
##$DE= 6
##$DECBNUC= <off>
##$DECIM= 32
##$DECNUC= <off>
##$DECSTAT= 4
##$DIGMOD= 1
##$DIGTYP= 9
##$DL= (0..7)
0 120 120 120 120 120 120 120 
##$DP= (0..7)
150 150 150 150 150 150 150 150 
##$DP07= 0
##$DPNAME0= <>
##$DPNAME1= <>
##$DPNAME2= <>
##$DPNAME3= <>
##$DPNAME4= <>
##$DPNAME5= <>
##$DPNAME6= <>
##$DPNAME7= <>
##$DPOAL= (0..7)
0.5 0.5 0.5 0.5 0.5 0.5 0.5 0.5 
##$DPOFFS= (0..7)
0 0 0 0 0 0 0 0 
##$DQDMODE= 0
##$DR= 18
##$DS= 0
##$DSLIST= <SSSSSSSSSSSSSSS>
$$ [...]
##$SUBNAM0= <"">
##$SUBNAM1= <"">
##$SUBNAM2= <"">
##$SUBNAM3= <"">
##$SUBNAM4= <"">
##$SUBNAM5= <"">
##$SUBNAM6= <"">
##$SUBNAM7= <"">
##$SUBNAM8= <"">
##$SUBNAM9= <"">
##$SW= 18.0517328524113
##$SWIBOX= (0..15)
0 0 2 0 0 0 0 0 0 0 0 0 0 0 0 0 
##$SW_h= 3612.71676300578
##$TD= 16384
##$TD0= 1
##$TE= 0
##$TE2= 300
##$TE3= 300
##$TEG= 300
##$TL= (0..7)
0 120 120 120 120 120 120 120 
##$TP= (0..7)
150 150 150 150 150 150 150 150 
##$TP07= 0
##$TPNAME0= <>
##$TPNAME1= <>
##$TPNAME2= <>
##$TPNAME3= <>
##$TPNAME4= <>
##$TPNAME5= <>
##$TPNAME6= <>
##$TPNAME7= <>
##$TPOAL= (0..7)
0.5 0.5 0.5 0.5 0.5 0.5 0.5 0.5 
##$TPOFFS= (0..7)
0 0 0 0 0 0 0 0 
##$TUNHIN= 0
##$TUNHOUT= 0
##$TUNXOUT= 0
##$USERA1= <user>
##$USERA2= <user>
##$USERA3= <user>
##$USERA4= <user>
##$USERA5= <user>
##$V9= 5
##$VALIST= <valist>
##$VCLIST= <CCCCCCCCCCCCCCC>
##$VD= 0
##$VDLIST= <DDDDDDDDDDDDDDD>
##$VPLIST= <PPPPPPPPPPPPPPP>
##$VTLIST= <TTTTTTTTTTTTTTT>
##$WBST= 1024
##$WBSW= 4
##$XGAIN= (0..3)
0 0 0 0 
##$XL= 0
##$YL= 0
##$YMAX_a= 82637
##$YMIN_a= -92880
##$ZGOPTNS= <>
##$ZL1= 120
##$ZL2= 120
##$ZL3= 120
##$ZL4= 120
##$ABSF1= 10
##$ABSF2= 0
##$ABSG= 5
##$ABSL= 3
##$ALPHA= 0
##$AQORDER= 0
##$ASSFAC= 0
##$ASSFACI= 0
##$ASSFACX= 0
##$ASSWID= 0
##$AUNMP= <proc_1d>
##$AZFE= 0.1
##$AZFW= 0.1
##$BCFW= 1
##$BC_mod= 2
##$BYTORDP= 1
##$COROFFS= 0
##$CY= -3
##$DATMOD= 1
##$DC= 2
##$DFILT= <>
##$DTYPP= 0
##$F1P= 0
##$F2P= 0
##$FCOR= 0.5
##$FTSIZE= 0
##$FT_mod= 4
##$GAMMA= 1
##$GB= 0.15
##$INTBC= 1
##$INTSCL= 1
##$ISEN= 128
##$LB= 0.25
##$LEV0= 0
##$LPBIN= 0
##$MAXI= 10000
##$MC2= 0
##$MEAN= 0
##$ME_mod= 0
##$MI= 1.114404
##$NCOEF= 0
##$NC_proc= 0
##$NLEV= 6
##$NOISF1= 3.799351
##$NOISF2= 2.8
##$NSP= 1
##$NTH_PI= 0
##$NZP= 0
##$OFFSET= 14.38212
##$PC= 1
##$PHC0= -466.8223
##$PHC1= 11.19221
##$PH_mod= 1
##$PKNL= yes
##$PPARMOD= 0
##$PSCAL= 0
##$PSIGN= 0
##$REVERSE= no
##$SF= 200.129724274929
##$SI= 16384
##$SIGF1= 3
##$SIGF2= 2
##$SINO= 400
##$SIOLD= 16384
##$SREGLST= <1H.CDCl3>
##$SSB= 0
##$STSI= 0
##$STSR= 0
##$SW_p= 3205.1282051282
##$SYMM= 0
##$S_DEV= 0
##$TDeff= 0
##$TDoff= 0
##$TI= <>
##$TILT= no
##$TM1= 0
##$TM2= 0
##$TOPLEV= 0
##$USERP1= <user>
##$USERP2= <user>
##$USERP3= <user>
##$USERP4= <user>
##$USERP5= <user>
##$WDW= 1
##$XDIM= 8192
##$YMAX_p= 0
##$YMIN_p= 0
$$ End of Bruker specific parameters
$$ ---------------------------------
##NTUPLES= NMR FID
##VAR_NAME=  TIME,          FID/REAL,        FID/IMAG
##SYMBOL=    X,             R,               I
##VAR_TYPE=  INDEPENDENT,   DEPENDENT,       DEPENDENT
##VAR_FORM=  AFFN,          ASDF,            ASDF
##VAR_DIM=   8192,          8192,            8192
##UNITS=     SECONDS,       ARBITRARY UNITS, ARBITRARY UNITS
##FACTOR=    0.0002768,     1,               1
##FIRST=     0,             0,               0
##LAST=      2.2672688,     0,               0
##MIN=       0,             -92880,          0
##MAX=       2.2672688,     82637,           0
$$ Real data points
##PAGE= N=1
##DATA TABLE= (X++(R..R)), XYDATA
$$ [...]
2025A246k582J60K078M46k199r10K006J236j807p43J322J132j475j229J452R05
$$ 1246 -1336 -1176 902 1348 -851 -1761 245 1481 -326 -1069 253 1385 -90 -1319 133 1038
2041A038j056j053J045P28p40q58Q34J383q62k359J458J925q97j621K23J864P4
$$ 1038 -18 -1071 -26 702 -38 -896 -62 1321 459 -1900 -442 1483 586 -1035 -812 1052 1126
2058A126k040m58K464M36k029q81J626J525j896j294J616J148j254j461J250J503
$$ 1126 -914 -1372 1092 1528 -501 -1382 244 1769 -127 -1421 195 1343 89 -1372 -122 1381
2074A381r84j943J022J592m60j721O85J745p34j495n3J951k3j721m50J518N99
$$ 1381 397 -1546 -524 1068 608 -1113 -428 1317 583 -912 -965 986 963 -758 -1208 310 909
2091I09j818r8J494M87j488m29J625J78j350p79J410J217j833j240J649J598j315
$$ 909 -909 -1007 487 974 -514 -943 682 860 -490 -1269 141 1358 -475 -1715 -66 1532 217
2108B17j542O84J876o49j520L08J680k21j983P8J390P83j646n65J614O10j207
$$ 217 -1325 -641 1235 586 -934 -626 1054 833 -1150 -1072 318 1101 -545 -1110 504 1114 -93
2125i3r56J641P28j840p30J473O55r51j101Q18J376j157j232J018J734j143j251
$$ -93 -1049 592 1320 -520 -1250 223 878 -73 -1174 -356 1020 -137 -1369 -351 1383 240 -1011
2142a011N11J612k13k120Q18J616o12j809K53K109j82j801j25J688M27j964m99
$$ -1011 -500 1112 899 -1221 -403 1213 601 -1208 -955 1154 972 -829 -954 734 1161 -803 -1302
2159a302J991Q36j791j265J491J317j122j285Q46J786j342j355M64J782l53j376
$$ -1302 689 1525 -266 -1531 -40 1277 155 -1130 -284 1502 160 -1195 -731 1051 698 -678
2175f78J01J213k25j268J94J302j39j379K34J574L55k137Q4J490P73k102o73J602
$$ -678 -577 636 411 -857 -663 639 500 -879 -645 929 1284 -853 -769 721 1494 -608 -1281 321
2193C21R51j365j398J146J352q68j481R10J487n96j506P29J595m52j890K27J601
$$ 321 1272 -93 -1491 -345 1007 139 -1342 -432 1055 459 -1047 -318 1277 825 -1065 -838 763
2210G63l32j483L78J716j09j508l61J514N08j538m53J183Q49j397q46J208J116
$$ 763 431 -1052 -674 1042 933 -575 -936 578 1086 -452 -905 278 1127 -270 -1116 92 1208
2227A208j191j203R98J056r44p71P13R80n77j303O92J628j054j380N96J346j00
$$ 1208 17 -1186 -188 868 -76 -847 -134 846 269 -1034 -342 1286 232 -1148 -552 794 694
2244F94j569M1J630M84j781o17J679R95j709j028J496R95j469r48R67R88o67j229
$$ 694 -875 -834 796 1280 -501 -1118 561 1556 -153 -1181 315 1310 -159 -1107 -140 848 181 -1048
2262a048P11J521j189p96N79J487q61j522N61J578n27j487n6J684J61j712M4J791
$$ -1048 -337 1184 -5 -801 -222 1265 404 -1118 -557 1021 494 -993 -1049 635 796 -916 -872 919
2280I19l4j404j94J116O00j181q38J259P59j436n19R01J267j068j196J009R79
$$ 919 885 -519 -713 403 1003 -178 -1016 243 1002 -434 -953 -52 1215 147 -1049 -40 939
2297I39k42j528N59J204l07j376k33J621L15j455l44J407L62j570j85J344N43
$$ 939 697 -831 -272 932 625 -751 -984 637 952 -503 -847 560 922 -648 -833 511 1054
2314A054j453o56J146R63j183q18J147O50r15r75J059J203q73j413P85J169p87
$$ 1054 -399 -1055 91 1054 -129 -947 200 850 -65 -1040 19 1222 349 -1064 -279 890 103
2331A03j244M28J496J9j526l48J830P7j413k98J315M25j189n31J420N65j415q45
$$ 103 -1141 -713 783 802 -724 -1072 758 835 -578 -876 439 864 -325 -856 564 1129 -286 -1131
2349a131J454N63r04j211J173J270j010j447R92J377n20j618M14J397l66j108
$$ -1131 323 886 -18 -1229 -56 1214 204 -1243 -251 1126 606 -1012 -598 799 433 -675
2365f75m2J794l26j451m5J218N09j300l41J198J52j456k11J619N41j708o92J142
$$ -675 -717 1077 751 -700 -745 473 982 -318 -659 539 691 -765 -976 643 1184 -524 -1216 -74
2383g4P48k87j527Q15J185n25j354N70J440k02j503p7J374j22j054L07Q40J87
$$ -74 674 387 -1140 -325 860 335 -1019 -449 991 789 -714 -791 583 461 -593 -286 554 741
2401G41j515j96J657J18j020l73J095N11j320p06J293P29j372j106J186R60n29
$$ 741 -774 -970 687 805 -215 -588 507 1018 -302 -1008 285 1014 -358 -1464 -278 682 153
2418A53r27O85R08k22j446L86J126k23j238K38J363k75r75j57J357J08j382j86
$$ 153 -774 -89 819 597 -849 -463 663 440 -798 -560 803 528 -447 -604 753 861 -521 -707
2436g07J060O20j181q53J444M98j365m87J060P10o02j384R41J081o38o89K23J221
$$ -707 353 973 -208 -1061 383 881 -484 -971 89 799 197 -1187 -246 835 197 -492 -269 952
2454I52o60j049M7J420Jj438j08J272N8j021k10J312J14j110o96J432N33q62r28
$$ 952 292 -757 -710 710 711 -727 -835 437 495 -526 -736 576 690 -420 -1116 316 849 -13 -941
2473i41J025Q04q82r49J004J028p88j157N94R82m48p85O3J454n72j063l7J256
$$ -941 84 888 6 -943 61 1089 301 -856 -262 720 272 -513 -450 1004 432 -631 -668 588
2491E88k22r19k36J236J29j100k07J320K71p09r00N91J068q49r00O94P89p45p59
$$ 588 366 -553 -789 447 576 -524 -731 589 860 151 -749 -158 910 61 -839 -145 644 -101 -860
2510h60O51J258r10j021R50O85m22j118M71J148k18j525n5J258O18j343p04J477
$$ -860 -209 1049 139 -882 68 753 331 -787 -316 832 614 -911 -966 292 910 -433 -1137 340
2528C40M96j173n65R37P37j164l58M11J207j098p81J204M38q25o11J004O34n65
$$ 340 836 -337 -902 35 772 -392 -750 -339 868 -230 -1011 193 631 -194 -805 199 833 268
2546B68j057J71J235j57j099L3J232kj330K8R11L15j092J57Q42N12j050n76J298
$$ 268 -789 -618 617 460 -639 -606 626 624 -706 -678 233 548 -544 -387 455 967 -83 -659 639
2565F39m9q13n47R09M79p84o34O71J149p93j134Q74P48j43j327L61R34j01j230
$$ 639 590 -223 -770 139 618 -166 -800 -129 1020 227 -907 -33 715 572 -755 -394 540 439 -791
2584g91K29J247q2j089J3O30N04j098j49P35M69j058o74J319N59r54p52J282M08
$$ -791 -562 685 603 -486 -473 157 661 -437 -586 149 618 -440 -1114 205 764 -190 -942 340 748
2603G48p07j046Q31J032p03j004N81Q37k0j143Q6P16J91j071J61J217j18r89k56
$$ 748 41 -1005 -174 858 155 -849 -268 569 549 -594 -508 208 399 -672 -511 706 588 -401 -657
2622f57R98K99r06k41O70Q55j206n26P02R16j336n66P06J007m37q56N32R49m63
$$ -657 341 640 -266 -507 163 1018 -188 -714 -12 904 -432 -998 -292 715 278 -578 -46 903 440
2641D40j097K05J004j16r53K64O26N3r46P4P93O2p19m37R77O69j261m46R45P80
$$ 440 -657 -452 552 436 -517 -253 373 426 -520 -446 347 409 -310 -747 230 899 -362 -808 137 917
2661I17r39n18N58P14q87l96K26J194o57r70R51O47r80o35M74O15O6j110M18K54
$$ 917 -22 -540 18 732 -155 -551 -325 869 212 -758 193 840 -140 -775 -301 314 380 -730 -312 -58
2681e8O93j133J0J045Q5o81n22N44P35q60n26Q08O02q49p87P38R93o53o69K26
$$ -58 635 -498 -488 557 642 -39 -561 -17 718 -142 -668 140 742 -107 -894 -156 837 184 -485 -259
2701b59J123n37r29O20O57l31j145K66J016m4j023NJ079k0j059j47R83N21p44
$$ -259 864 327 -602 18 675 344 -801 -535 481 437 -586 -581 498 478 -581 -728 255 776 32
2720C2o09L03J041q14o45O29O75n13o50M92Q31n83o93N25L87O7j350M37Q92n9
$$ 32 -577 -274 767 -47 -692 -63 612 99 -551 -59 772 189 -504 21 408 475 -875 -438 454 395
2740C95r67k01J284Q3j198k28Q49O35r12l38P43M86q85m01M56Q23q16l54M58P78
$$ 395 -572 -773 511 594 -604 -832 17 652 -260 -598 145 631 -254 -655 -199 624 -192 -546 -88 690
2760F90o37q37M88R80l30q69K7R49Pj134M02O38n0p53o3O63P52r56n62O10R11
$$ 690 53 -784 -296 684 354 -515 -488 461 468 -666 -264 374 324 -429 -492 171 923 -33 -595 15 926
2781I26p72o99M89O14l08q29O85M78p21m93O60P27n07r58N51O97q1j106K45O40
$$ 926 154 -545 -56 558 250 -579 106 584 -137 -630 30 757 250 -708 -157 540 459 -647 -402 238
2801B38K41p49l22R32L58r39n83Q14L96m45n37Q25N31p75p00P33Q25j089l65M97
$$ 238 479 -270 -592 340 698 -241 -824 -10 386 -59 -596 229 760 -15 -715 18 843 -246 -611 -114
2821a14Q60n08j052P93N39l99p13M54O21k3q55q8P62K60r55nN34K00o86m44J219
$$ -114 746 238 -814 -21 518 119 -594 -140 481 458 -397 -485 277 537 -418 -423 111 311 -375 -819 400
2842D00J30p93k84M41N16o61m81N46Q91n90q78P39P20n40p95K06O48p7n35j35
$$ 400 530 -263 -547 -106 410 -251 -732 -186 705 115 -763 -24 696 156 -639 -433 215 138 -397 -532
2862e32P14K79q02j31J162l27r31K00O30J28o10l00M84O85n69n24L07P91n74n91
$$ -532 182 461 -341 -472 690 363 -568 -368 262 390 -220 -520 -36 649 80 -444 -137 654 80 -511
2882e11K27Q09j78o38P2O35N2r78J35P88l36m31k92J072K02r41L3M09L44p43k49
$$ -511 -284 525 347 -291 -219 416 468 -510 -375 413 77 -354 -646 426 628 -313 -280 129 473 -270 -519
2903e19P77L64p18o27O67O00o08o83N36N77k04q25O25M61k30k29l61Q40m5j090
$$ -519 258 622 -96 -723 -56 544 -64 -747 -211 366 162 -663 -38 423 193 -36 -397 443 398 -692
2923f92Q4Q64k53k24j81N92K46m69k84N24M38q92k80J013J43n24n29M79L62k68
$$ -692 -608 256 3 -221 -402 190 436 -33 -317 207 645 -247 -527 486 629 105 -424 55 417 149
2943A49o06L11Q28m83n62K35P46l35m85n1P87j54q48J09O59N1o94j82J059j63
$$ 149 -457 -146 682 199 -363 -128 618 283 -202 -253 534 380 -468 -359 300 351 -343 -525 534 371
2963C71o99l15P46N77o87l44L61L23j81o45L78L58o6n93J90M91J5p88o2R84J81
$$ 371 -328 -643 103 680 -7 -351 10 333 152 -493 -115 243 177 -416 -226 265 280 -508 -570 414 595
2984E95j024N0O86K87r22j93R71qn44l66N44O01p41m59K45N24k60m91M65M65n11
$$ 595 -429 -379 307 594 -328 -521 450 442 -102 -468 76 677 -64 -523 -278 246 -14 -505 -40 425 -86
3005h6l06K86P76n00m11K02O70k64r13J09R66j66n33m17Q01M05p40l36M02L94
$$ -86 -392 -106 670 170 -241 -39 631 367 -546 -437 529 363 -170 -587 214 619 -121 -457 -55 339
3025C39l76n15O27L99o32j66L43N07n30k63J81M31r7o69J55P32j29n96p2M89J65
$$ 339 -37 -552 75 474 -158 -324 19 526 -4 -267 -86 345 248 -421 -266 466 337 -259 -331 158 323
3046C23o94J03M78n4l92l05N43L44n46K3N0N89j43q26M79L92l44n59L31N15k93
$$ 323 -371 -268 210 156 -236 -541 2 346 -200 -177 -127 462 319 -507 -28 364 20 -539 -208 307 14
3067A4l59L85M53l97m97k70J148l29n69L02N40J72r90k44J144J41j007k02N45
$$ 14 -345 40 493 96 -401 -671 477 148 -421 -119 421 593 -397 -641 503 644 -363 -565 -20
3086b0L89n19j13L33M98n96m04L37L17j03m55L93M06j79p37R1P98J09r04K9O30
$$ -20 369 -150 -263 70 568 -28 -432 -95 222 119 -336 57 463 284 -453 -362 436 545 -359 -330 300
3107C00J20p26O8L98k8l77J9L65M71l66q21O51P7j55l21K04J15m4m86M64N06k97
$$ 300 420 -306 -238 160 132 -245 -226 139 610 244 -577 74 151 -4 -325 -121 -6 -50 -536 -72 434 137
3129A37o91K83P15k66n81q8Q02O2n96l64P72K10p42L3N02K10m51n55K77N68k22
$$ 137 -554 -271 444 178 -403 -491 311 373 -223 -587 185 395 -347 -314 188 398 -53 -608 -331 237 15
3150A5k36N23Pl58m32M68L01j78m21j5N97j52l24O7J41L1k34l6M72j33m59J01
$$ 15 -221 302 309 -49 -481 -13 288 110 -311 -326 271 119 -205 -138 3 34 -200 -236 236 103 -356 -255
3172b55O22Q9n13j53L26J12o85O3R4Q11o39j56K88N04n10m96O62J26L6q36J98
$$ -255 367 456 -57 -210 116 228 -457 -394 -300 511 -128 -284 4 508 -2 -498 164 290 326 -510 -312
3193c12O56j75k24l95M08K89n37P8K77K73m62j15J74M53l49m41N83L04l63l70
$$ -312 344 169 -55 -450 -42 247 -290 -212 65 338 -124 -239 -65 388 39 -402 181 485 122 -248
3213b48K53K15l41k50K15M54l32J06j56M97l29j71j82N93j32n11J31J36L74m64
$$ -248 5 220 -121 -371 -156 298 -34 72 -84 413 84 -87 -269 324 192 -319 -188 -52 322 -142
3233a42n9K79M09n67k53N95K6n40j07M46K73l58m97L72K76j42m79N40k12K82n20
$$ -142 -201 78 487 -80 -333 262 288 -252 -359 87 360 2 -495 -123 153 11 -468 72 -140 142 -378
3254c78K85N01J19q66J94O34l48l20K41K90k90l54j91O89P5n27j35L60L08l73
$$ -378 -93 408 527 -339 -145 489 141 -179 62 352 62 -292 -483 206 281 -246 -381 -21 287 -86
3274h6o6K31P1j51k84L42K39k68n29K11M40J09m16M6N28m10m52J17O69n5n44j24
$$ -86 -152 79 150 -1 -285 57 296 28 -501 -290 150 259 -157 -111 417 7 -445 -328 341 286 -258 -382
3296c82L45M97n75J28J11L66l50k23J21R1m74K72J29J29j77n95L56L17R1m47K53
$$ -382 -37 460 -115 13 124 490 140 -83 38 129 -345 -73 56 185 8 -587 -231 86 177 -270 -17
3317a7J25L34p77K92J40K1o7o3n5J39n60J26L63J29n5l88M34M49l79o19L26M07
$$ -17 108 442 -335 -43 97 118 51 -12 -67 72 -488 -362 1 130 75 -313 121 570 191 -428 -102 305
3339C05m30k19L57L2R5m20Q6M78P7o26K83L28O7n53k7L97j42j64j61K46J41q5
$$ 305 -125 -344 13 45 140 -280 -194 284 361 -265 18 346 413 -140 -167 230 88 -76 -237 9 150 65
3361F5k97L7M33j47k29K00J75k29j25J44L58l88m60M11J0J23l27K59K87m71Nl0
$$ 65 -232 -195 238 91 -138 62 237 8 -117 27 385 -3 -463 -52 -42 81 -246 13 300 -171 -166 -196
3383a96L43J63l77j03L86j55K07m42M37o5l02J44K4J73l44k13K14L95q0m60J99
$$ -196 147 310 -67 -170 216 61 268 -174 263 198 -104 40 64 237 -107 -320 -106 289 209 -251 -52
3404e2J50o1k98K2M64j78j86J27L25j39l27k69P39j18m21p4N33j62l65J20L54
$$ -52 98 37 -261 -239 225 47 -139 -12 313 174 -153 -422 317 199 -222 -296 237 75 -290 -170 184
3425A84J60m58k74M72J25k85k76M56L12l55m45J75N05j35l96j11O74j31n93K80
$$ 184 344 -114 -388 84 209 -76 -352 104 416 61 -384 -209 296 161 -235 -346 328 197 -396 -116
3445a16jK35k42j17J68J33j51k12M92K20p96R1L30K49k44n6o2L75l95l63N90j95
$$ -116 -117 118 -124 -241 -73 60 -91 -303 189 409 -387 -296 34 283 39 -17 -79 296 -99 -462 128 -67
3467f7K31n10L69L44k85l86L54K5K17l54n7L72Pn49p4N16j03k17j90L39L59k41
$$ -67 164 -346 23 367 82 -304 50 75 292 -62 -119 253 260 -289 -363 153 50 -167 -357 -18 341 100
3489A00l59J65K59k91R6j77M25l4n85J68K24K8k15K38J66Pk44q6J04p7Q5k80K46
$$ 100 -259 -94 165 -126 -30 -207 218 184 -401 -233 -9 19 -196 42 208 215 -29 -115 -11 -88 -3 -283 -37
3512c7J44l61r0K70K78j92k97L68j7L2m71K03M90l58l57N69Pk47j31n9N34l7k68
$$ -37 107 -254 -344 -74 204 12 -285 83 66 98 -373 -170 320 -38 -395 174 181 -66 -197 -256 278 241 -27
3535b7o7L65J83n95K71J90Q8n18r5K67l0J4j09k8K22k34j98N22q8j50q9J49J51
$$ -27 -94 271 454 -141 130 320 408 -110 -205 62 32 46 -63 -91 131 -103 -301 221 133 -17 -106 43 194
3558A94R1n09k2K99L3l53L7O67m80k22j7M36m5m13M90r4R9k85k38L76j72M2N8
$$ 194 285 -224 -246 53 86 -267 -230 437 -43 -265 -282 154 109 -304 186 92 191 -94 -332 44 -128 -86 -28
3581b8K60k63j4j75j8L07j38k58L81Lm9k40J47J37J51k39p3K62k09P7l3J09J75
$$ -28 232 -31 -45 -220 -238 69 -69 -327 54 57 8 -232 -85 52 203 -36 -109 153 -56 21 -12 97 272
3604B72j94k09m5N26k68j12N0Q0j18k86L58J07k46r6K93p0K47j82j0Lj30M6m07
$$ 272 78 -131 -176 350 82 -30 20 100 -18 -304 54 161 -85 -181 112 42 289 107 97 100 -30 16 -391
3627c91N00j97J19j92J25J21m35L10p0L10m03Q1J34J43l04J12J1QJ27j35L0K66
$$ -391 109 -88 31 -161 -36 85 -350 -40 -110 200 -203 -122 12 155 -149 -37 -26 -18 109 -26 4 270
3649B70l05QO3N1J38m08K79k11K27P5k48N06l14m08J24K98J69l43p9M14j50k11
$$ 270 -35 -27 36 87 225 -183 96 -115 112 187 -61 445 131 -277 -153 145 314 -29 -108 306 156 -55
3671e5k8L16k36k58J19M20q1Pm75L01L65m18L8Pj84L28o08N8R43k56n13Q7kJ81
$$ -55 -83 233 -3 -261 -142 278 197 204 -271 30 395 -23 15 22 -162 166 -442 -384 559 303 -210 -123 -125 56
3695E6j76j75M64j14q1K38j21J60k44j98J23P0k58r9N38no8j09r4K74j39l5p9
$$ 56 -120 -295 169 55 -26 212 91 251 7 -191 -68 2 -256 -355 183 178 110 1 -93 181 42 7 -72
3718g2N4J90j83M6q9P2j93P0J27M0j23%K03j13P1l14J56N30n03j56K8L0P7p3J70
$$ -72 -18 172 -11 35 -54 18 -175 -105 22 62 -61 -61 142 29 100 -214 -58 472 -31 -187 -159 -129 -52 -125 45
3743D5K31r4l77L11Pn8K8n5J34k38k53K53K22l0k54q2P7L27m16K52rjj88q9J09
$$ 45 276 182 -195 116 123 65 93 38 172 -66 -319 -66 156 126 -128 -210 -133 194 -222 30 21 20 -168 -257 -148
3768a48M48m09o1J84qJ15l27K85Mj56J3k53K91p8j89J01M30L2l14J30j35N9j47
$$ -148 300 -109 -170 14 6 121 -206 79 83 -73 -60 -313 -22 -100 -289 -188 242 274 -40 90 -45 14 -133
3791a33p7L40k42P6m12L77J72j10l29K91L10m14l53N51K55m6k05o2J58K53o23
$$ -133 -210 130 -112 -36 -448 -71 101 -9 -338 -47 263 -151 -504 47 302 256 51 -11 147 400 -223
3812b23q7N42k8k23m5J70o6k20J13P9K32J9m65K12R5k42K00n1j32K38k27m8O5
$$ -223 -310 232 204 -19 -64 106 40 -180 -67 12 244 263 -202 10 105 -137 63 12 -120 118 -109 -157 -92
3835i2K96l98m8M82l33J84J10l83L62p04J84O03j57J24m41J52J70j53j66J13J91
$$ -92 204 -194 -242 240 -93 91 201 -182 180 -524 -340 263 106 230 -211 -59 111 -42 -208 -95 96
3856I6jo0N4p1j25J66j19K32k05j87kJ61q7j12K37J85j96j49Q2K80k5k79K64n3
$$ 96 95 35 89 18 -107 59 -60 172 -33 -220 -222 -61 -148 -260 -23 162 -34 -183 -101 179 154 -125 139 86
3880H6Kk7k18M10k3l61L2m3L87j85j07J91k5k9k35J14M4K60n05P3K43L5j39j4
$$ 86 88 61 -157 253 230 -131 -99 -142 245 60 -47 144 119 90 -145 -31 13 273 -232 -159 84 119 -20 -34
3904c4L02l5j22j15O4Mj90L03k87O0Q7j26K26p3K48m08M3n8N1K7k59N48n42K6
$$ -34 268 233 111 -4 60 64 -126 177 -110 -50 37 -89 137 64 312 -96 -53 -111 -60 -33 -292 256 -286 -260
3928b60M91k62J90k56j07M32j43k3k8J78j25j21j88J42J11m8j04M16jk59j88J11
$$ -260 231 -31 159 -97 -204 228 85 62 34 212 87 -34 -222 -80 31 -17 -121 295 294 35 -153 -42
3950d2Q0l99K10m9N59j38k24j48K22K50o26O9N04j35k93N0O4L42j88l90L85k2
$$ -42 38 -361 -151 -200 359 221 -3 -151 71 321 -305 -236 268 133 -160 -110 -46 296 108 -282 103 81
3972H1m72L67K39k24p7j14M33l33j70P0L15J32l32J44k27L48n8j21K05M6k09m29
$$ 81 -391 -24 215 -9 -86 -200 233 -100 -270 -200 115 247 -85 59 -168 180 122 1 206 252 43 -386
3994c86M47j59L7k54K28r1J87j57j09L75m5j86L3o2L04k24j1K4J76o2l46L03m6
$$ -386 61 -98 -61 -315 -87 -178 9 -148 -257 118 73 -113 -80 -142 162 -62 -73 -49 127 65 -281 22 -24
4017b4P0k09J03o3K03Jj87O5J20o5l48O04n69P2N2K68N0j41j45J57J9j88R3O8
$$ -24 46 -163 -60 -123 80 81 -106 -41 79 14 -334 270 -299 -227 -175 93 143 2 -143 14 33 -155 -62 6
4041FK28j23l25K46J84k92k6j00N02lo11L39J65L7J38n10L50l9l57K05J45Qm53
$$ 6 234 111 -214 32 216 -76 -102 -202 300 297 -314 25 190 227 365 -145 205 166 -191 14 159 167 -286
4064b86K0L71L3m08P8J84J86j44J8j47L02Rk98k32M21l94J35J93L36n65J36j29
$$ -286 -266 105 138 -270 -192 -8 178 34 52 -95 207 216 -82 -314 107 -287 -152 41 377 -188 -52 -181
4086a81M06j37j54k8K83K5n62J00K20J76j79k26M02q6o8l35J25O78q50L46j81
$$ -181 225 88 -66 -94 189 214 -348 -248 -28 148 -31 -257 145 59 -9 -344 -219 459 -391 -45 -226
4107b26L97J01k79J4L40l00q6R2jP0j68k92L81K08Pl52K75k13N4n9J3m6j21M0
$$ -226 171 272 -7 7 347 47 -39 53 52 122 -46 -338 43 251 258 -94 181 -32 22 -37 -24 -70 -191 -151
4131a51K93K90n09Q0j42K10nj89k9m7R8N4k32K21L39m16n5J03K35k15JK67n3k77
$$ -151 142 432 -77 3 -139 71 66 -123 -152 -199 -101 -47 -279 -58 281 -135 -190 -87 148 -67 -66 201 148 -129
4155a29O5J26J53l94K38K0K9M1l94K59KJ45l87J50J54N9k90K26K8K3j43o7K99
$$ -129 -64 62 215 -179 59 79 108 149 -245 14 16 161 -226 -76 78 137 -153 73 101 124 -19 -86 213
4178B13l77L0l37N10n1j92n8L42O0j50q0J07K67m63J89k43N25k71k77K40M00k49
$$ 213 -164 -134 -471 39 -12 -204 -262 80 140 -10 -90 17 284 -179 10 -233 292 21 -256 -16 384 135
4200A35k70K23K8o4j72PJ42O6m29Q0K51K04j91j95J9K81j88N9J77J1k82n1O2%
$$ 135 -135 88 116 52 -120 -113 29 95 -334 -254 -3 201 10 -185 -166 115 -73 -14 163 174 -108 -159 -97 -97
4224i7L08n01J03L70j38j5Pj0M9l12K81Q4J17l21J44K19R8m19j22J94N6m2l18
$$ -97 211 -290 -187 183 45 30 37 27 76 -236 45 129 246 -75 69 288 386 -33 -155 39 95 53 -265
4247b65L05M15m31k49J42K58k67N8n2l8O5o0J48n1K28m33M7K81J79l12j1q2L5
$$ -265 40 455 24 -225 -83 175 -92 -34 -86 -124 -59 -119 29 -22 206 -227 -180 101 280 -32 -43 -125 -90
4270i0M5l5l3K70l23KK19N7l23J61r5J59Nj92q5L12Q9k67K51j31k61J33Q8L17
$$ -90 -45 -80 -113 157 -166 -164 55 112 -211 -50 -145 14 19 -173 -258 54 143 -124 127 -4 -265 -132 -44 273
4294B73L2l73k01L87k60K05j93K67j5j37j00R4K93n46rP7K11l5j08Q2K10M0m22
$$ 273 305 -68 -269 118 -142 63 -130 137 122 -15 -115 -21 272 -274 -283 -206 5 -30 -138 -56 154 194 -228
4317b28j30N74j28j66L1K81l84M39m27K15m3k49N2P8J80j05J00l2k36P2R8P3R8
$$ -228 -358 216 88 -78 -47 234 -150 289 -138 77 34 -215 -163 -85 95 -10 90 58 -178 -106 -8 65 163
4340A63P1l86J91j16J90l56J57L64p2m23J31J90J93l67J05q0K09j28j20L82k65
$$ 163 234 -152 39 -77 113 -243 -86 278 206 -217 -86 104 297 -70 35 -45 164 36 -84 298 33
4361C3j74J02J38j03j47lJ76j28K4q5J24q1J89M3l44O47n50K17k50L19j28l42
$$ 33 -141 -39 99 -4 -151 -154 22 -106 -82 -167 -43 -124 65 108 -236 411 -139 78 -172 147 19 -323
4383c23L48q2K27j65L22k92J89m85j09M55J4k64J82n0L34m90K11k73K86j59l0
$$ -323 25 -57 170 5 327 35 224 -261 -370 85 99 -165 17 -33 301 -189 22 -251 35 -124 -154
4404a54Q7K68r7j74J56j33l7j18J78M8K18l95J96J21k82j37J86K27r7k41K00K34
$$ -154 -67 201 104 -70 86 -47 -84 -202 -24 24 242 -153 43 164 -118 -255 -69 158 61 -180 20 254
4426B54r4m28K49J00k20K55l84K34o3j7N6j69K69p7r1J25K5j60K23l1j62K31q4
$$ 254 160 -268 -19 81 -139 116 -268 -34 -97 -114 -58 -227 42 -35 -126 -1 24 -136 87 56 -106 125 41
4449D1m8p1k4mR1j26lJ37j09Q4J86k15k12K62J65o0j51J82L8Q5l46k50P71l62
$$ 41 -7 -78 -102 -106 -15 -141 -144 -7 -116 -32 154 -61 -273 -11 154 94 -57 125 163 248 -98 -348 423 61
4473F1q7J82K19m05J05j49J15J47l83K53J8Rj06J15j06n7j39K5J91K24q4k49Q
$$ 61 -26 156 375 -30 75 -74 41 188 -195 58 76 85 -21 94 -12 -69 -208 -183 8 232 148 -101 -93
4496i3r4K43k32J38J90j26O5r6K12j5j63m33N55j84p8J62K15m00L4r6N45j42j90
$$ -93 -187 56 -176 -38 152 26 91 -5 207 192 29 -404 151 -33 -111 51 266 -134 -100 -196 349 207 17
4519A7kj24M09m15J41J48q5k93q8K84J12l4l19J79L6J58j69K11j52K44l36j4K37
$$ 17 15 -109 300 -115 26 174 89 -204 -292 -8 104 70 -249 -70 -34 124 -45 166 14 258 -78 -92 145
4542A45m3j69n2J37L19l41l80L73mj65J91j82M86l61J87P5j45r2l35L33m6J31
$$ 145 102 -67 -119 18 337 -4 -384 -11 -15 -180 11 -171 315 -46 141 216 71 -21 -356 -23 -69 62
4564F2j05K04k34L2m6o9L95o1k83n5R2j38L4k00N38n3Rj65R9Q8k73j42J34K06
$$ 62 -43 161 -73 -41 -87 -156 239 178 -105 -160 -68 -206 -172 -372 166 113 122 -43 56 144 -129 -271 -137 69
4588F9j27q9P2K91l64K35J9j83K09j60j6J32k75M27j42J9k13j3m3K53o2q4Q6j52
$$ 69 -58 -147 -75 216 -148 87 106 -77 132 -28 -44 88 -187 240 98 117 -96 -109 -152 101 39 -45 41 -111
4612a11M98l98r7m5R8J47j66k11R1l8J41J18lr3N8j7O9N3n2q7K0l2J14J59j86
$$ -111 387 -11 -108 -153 -55 92 -74 -285 -194 -232 -91 27 24 -69 -11 -28 41 94 42 -45 -25 -57 57 216 30
4637C0P9j41J23K09j45K7k70L39k28K50k25J0P3j93j26n5M06q6k67N0M73l94J8
$$ 30 109 -32 91 300 155 182 -88 251 23 273 48 58 131 -62 -188 -243 163 77 -190 -140 333 -61 -43
4660d3J8j3N6R0l56M60k8j74p6Q4P2j41j55J41M15j68l49J61L9j43R9K2O8k20
$$ -43 -25 -38 18 108 -248 212 184 10 -66 18 90 -51 -206 -65 350 182 -167 -6 33 -110 -11 11 79 -141
4684a41O0k6L23m02J25Q4N1Q0l65J22J3p6N4J47j28K52l43p8K77L0q6j89K95J72
$$ -141 -81 -107 216 -186 -61 23 74 154 -211 -89 -76 -152 -98 49 -79 173 -170 -248 29 59 -27 -216 79 251
4708B51m04K78k12K38j75J29j46l2p0j24J32p6K11m2j55J37J66l65N37l69Q0l20
$$ 251 -153 125 -87 151 -24 105 -41 -73 -143 -267 -135 -211 0 -42 -197 -60 106 -259 278 -91 -11 -331
4730c31K32J38J40p0L0k17M39Qn76L75j12K2j87J82q7M34n75L94m37Q9l6Q7K99
$$ -331 -99 39 179 109 139 -78 361 369 -207 168 56 78 -109 73 -14 420 -155 239 -198 -109 -145 -58 241
4753B41p8n32J09L40P2j22k20K48j3L2p0j22J58O6o4r8J78Q9k35J54m6Pk99J51
$$ 241 163 -369 -260 80 152 30 -190 58 45 77 7 -115 43 109 45 -53 125 214 -21 133 87 94 -205 -54
4777e4R9j51K22k2L7J55l14P2l02K55q5J38Q7l35nl0L46M7j44ln1L02k28j12J51
$$ -54 45 -106 116 94 131 286 -28 44 -258 -3 -88 50 137 -198 -203 -233 113 160 16 13 -38 264 36 -76 75
4802G5k7j82j3R9J95k65n9J02q7K37k8n0j4j57M98o35M87k01p1R7k02J73K6J29
$$ 75 48 -134 -147 -48 147 -118 -177 -75 -162 75 47 -3 -17 -174 324 -311 176 -25 -96 1 -201 -28 -2 127
4826A27j40j85K23j80K94k60M1J71j65K90l71j46K23R4K55k18k01J23J57J01j94
$$ 127 -13 -198 25 -155 139 -121 -80 91 -74 216 -155 -301 -78 16 271 53 -148 -25 132 233 39
4847C9p8O2K3l80K01k9Q7J43M6k23J02M8J64q9p3j05n0K13J58j63k21j50L49K2
$$ 39 -39 23 46 -334 -133 -162 -75 68 114 -109 -7 41 205 116 43 -62 -112 101 259 96 -125 -275 74 96
4871I6k05M03j61j07k97K38J07j01L3j44q4M5J7M2L10n3j66j13J91Nl12K17J32
$$ 96 -109 294 133 26 -271 -33 74 -27 6 -138 -222 -177 -160 -118 192 139 -27 -140 51 56 -256 -39 93
4894I3n9l17K01O8o3J7K4J83k62J4l4J02r4J1N0K3J58J1m40J66l2J07o8J04J25
$$ 93 34 -283 -82 -14 -77 -60 -36 147 -115 -101 -135 -33 -127 -116 -66 -43 115 126 -314 -148 -180 -73 -141 -37 88
4919H8r6j64L39l8m9L5k43j01K28j0j59n8J55J93q4j34L3Q0j35j9K61m13J38P7
$$ 88 -8 -172 167 129 80 115 -128 -229 -1 -11 -170 -228 -73 120 36 -98 -65 15 -120 -139 122 -291 -153 -76
4943g6K03o8PO6l82J93nK3J34P8j97j64o3L51j31j63J65k3J53k18L4J88k31L20
$$ -76 127 59 66 132 -250 -57 -62 -39 95 173 -24 -188 -251 100 -31 -194 -29 -52 101 -117 -83 105 -126 194
4967A94l42K79k56j23R7L90j11m9q1K11k90L47n50J77M2Q8kn8K71k72J22p6l0
$$ 194 -148 131 -125 -248 -151 239 128 79 -2 209 -81 266 -284 -107 -65 23 21 -37 234 -38 84 8 -22
4990b2N8j05J43j14j7j18L44J57l58l13K82j06K74k64L32k68J74m4lJ97m01K62
$$ -22 36 -69 74 -40 -57 -175 169 326 -32 -345 -63 -169 105 -159 173 -95 79 35 32 229 -172 90
5012I0J75l64L9M4j75K79N6L1l55L19j1k3l07M10j77k0K6O0j38k8K25p6l2J5O3
$$ 90 265 -99 -60 -16 -191 88 144 175 -180 139 128 105 -202 208 31 11 37 97 -41 -69 156 80 48 63 126
5037A26l71J84p4K06j23J49k11M9k2n3J21J18j88Q0N4J4j89j61M06r1k09J55j93
$$ 126 -245 -61 -135 71 -52 97 -114 -65 -87 -140 -19 99 -89 -9 45 59 -130 -291 115 24 -185 -30 -223
5060b23K35LN0L8k24J29L9K9k52J25M05l42j20J21l9N6j36K36n12N76k85j7L81
$$ -223 12 15 65 103 -121 8 47 76 -176 -51 354 12 -108 13 -26 30 -106 130 -382 194 -91 -108 273
5083B73k43k18j5N21n77J79K97m16L0J33L29m11J87Q6l86L03M1k96K92k82J08
$$ 273 30 -188 -203 318 -259 -80 217 -199 -169 -36 293 -118 69 155 -231 72 113 -183 109 -173 -65
5104f5M4K64p6j58jJ18k52K41k42q9L58j78j86N49j38j9k52L49m49J92rP3N8l89
$$ -65 -21 243 167 9 8 126 -126 115 -127 -216 142 -36 -222 327 189 170 -82 267 -182 10 1 74 132 -257
5128b57O28k88J39j79M3j5Q9j65r7L28P3k42p1l5j8J27j48L44m62M02l25M9J56
$$ -257 371 83 222 43 86 71 160 -5 -102 226 299 57 -14 -49 -67 60 -88 256 -206 196 -129 -80 76
5151G6k28pM60j00j65j76K98r7J15j57j66J84J01n0K9j67p5j01K91j98O2k50L67
$$ 76 -152 -159 301 201 36 -140 158 61 176 19 -147 37 138 88 117 -50 -125 -226 65 -133 -71 -321 46
5174D6j0m8K25n54K34J94j33k24L20J29m47j30L94j51J55j6J48r0k58K97j85J30
$$ 46 36 -12 213 -341 -107 87 -46 -270 50 179 -268 -398 -4 -155 0 -16 132 42 -216 81 -104 26
5196B6J7J8j19j6K5J33k74Q7l8J54N3j56M43m13l1j07O4k48L81J66j58j07Qo3
$$ 26 43 61 -58 -74 -49 84 -190 -103 -141 13 66 -90 353 -60 -91 -198 -134 -382 -1 165 7 -100 -92 -155
5220a55P0j57J72J22j19J78k69L08j97j7o0l7K85j90q2O2m1J32m0l25R8M00m40
$$ -155 -85 -242 -70 52 -67 111 -158 150 -47 -64 -124 -161 124 -66 -148 -86 -127 5 -35 -360 -262 138 -302
5243c02N25j89K2J99k40J57k90K31r3k60L47J91j67k68P4pJ54l7J6J01j95k69
$$ -302 223 34 56 255 15 172 -118 113 20 -240 107 298 131 -137 -63 -70 84 47 63 164 -31 -300
5265c00L48P1l3n2rj00J8q0m5K86K1j70RR2j45J32k01K72p8J47r3L7J5j55m0J59
$$ -300 48 119 86 34 25 -75 -57 -137 -182 104 125 -45 -36 56 -89 43 -158 114 36 183 90 127 142 -13 -53 106
5291A06j09jj16K2m1Q5P1k97L11Np8K43Mk98J2q1J25J84N1k26j33K76j19k45K44
$$ 106 -3 -4 -120 -98 -139 -54 17 -280 31 36 -42 201 205 -93 -81 -162 -37 147 198 -28 -161 115 -4 -249 -5
5316eP1j07J88R6j7k07N6k72J71J0%k51K07j72J42K15l80M30o4k68J94r5Q5lP5
$$ -5 66 -41 147 243 226 19 75 -197 -26 -16 -16 -267 -60 -232 -90 125 -255 175 111 -157 37 -58 27 24 99
5341I9k15mP0O06n34J32j75M7O7k85J57r2L12j31l70K65K44m34L19j07p0J3%j6
$$ 99 -116 -120 -50 556 22 154 -21 26 93 -192 -35 -127 185 54 -316 -51 193 -241 78 -29 -99 -86 -86 -102
5365a02j5K42j71J37J10q5j2q3K7M0j78m7L63R9l86k4L17p8J00l03p6P6K92k01
$$ -102 -117 125 -46 91 201 116 104 21 48 88 -90 -137 226 325 -61 -85 232 154 254 -49 -125 -49 243 42
5389D2kk24n7K10j66J29j04L14p4k07L55l52K34j77ro5L47l83M1J89o2j91J66
$$ 42 40 -184 -241 -31 -197 -68 -172 142 68 -139 216 -136 98 -79 -88 -153 194 -189 -148 41 -21 -212 -46
5412d6L4J04O5n7k63K89m3K82k74j35m1j88M02l18J36P0n5j66J64J36O0m26L86
$$ -46 -12 92 157 100 -163 126 83 365 91 -44 -85 -273 129 -189 -53 17 -38 -204 -40 96 156 -270 116
5435A16k25K52m31L22p4K9M4l60K04K07k4j93K79N9j06j28J53k11Q9J17J28k44
$$ 116 -109 143 -288 34 -40 -11 33 -327 -123 84 60 -133 146 205 99 -29 124 -87 2 119 247 3
5457CJ27l35J75K75j96K58m61J92O7J77k57k21K62j61J16N2ql7r3j15J64M9m96
$$ 3 130 -205 -30 245 49 307 -154 38 105 282 25 -196 66 -95 21 73 65 28 -65 -180 -16 33 -463
5480d63K29%K36k51J30N12m14q0R6J25J27j52j46J62J25j94j7k92M59k9j38l67
$$ -463 -234 -234 2 -249 -119 393 -21 -101 -5 120 247 95 -51 111 236 42 25 -267 192 163 25 -342
5502c42L28K78j78J31m93P2N8q6K35o6j25OL4M1k2L15k20L4k9k05k08L63j12k91
$$ -342 -14 264 86 217 -276 -204 -146 -232 3 -63 -188 -182 -148 -107 -129 186 -34 0 -29 -234 -442 -79 -191 -482
5526d82O18l79L11l6n1J64k78K25K6J02m88J37j98M10O6k20J07J37j88P3j00q6
$$ -482 136 -243 68 32 -19 145 -133 92 118 220 -268 -131 -329 81 147 -73 34 171 -17 56 -44 -130
5548a30K21J54l11J01K22l83O4J74Q0j33j04N1J6J1J49O0k99o4J25m12M51N2j71
$$ -130 91 245 -66 35 257 -126 -62 112 192 59 -45 6 22 33 182 242 -57 -121 4 -408 43 95 -76
5571g6l04P07k18m23K45j44J23j9J0j0k9J49k09M21n5k67K4L21m19N73m63R8J33
$$ -76 -380 327 109 -314 -69 -213 -90 -109 -99 -109 -138 11 -198 223 168 -99 -75 246 -173 400 -63 35 168
5594A68k10l27J32J82n7K4P4J54K0l82R0r8K59K7q1J31p0o4J26j55P2J43m6q9
$$ 168 -42 -369 -237 -55 -112 -88 -14 140 160 -222 -132 -230 29 56 -25 106 36 -28 98 -57 15 158 112 23
5618B3K01j29j90L00j61J92L1j03j00J38o4k76K47k84Q6L01j89K18l80Q0r7J33
$$ 23 224 95 -95 205 44 236 267 164 64 202 138 -138 109 -175 -89 212 23 241 -139 -59 -156 -23
5640b3Q5n3q4N6k33K36J37J1k18oK19j25j25J05n9P1k10K09j92L67k6j71J07K2
$$ -23 62 9 -75 -19 -252 -16 121 132 -86 -92 127 2 -123 -18 -77 -6 -216 -7 -199 168 142 -29 78 100
5664A00j02l30L96K26l14l19N7L76n8j57L02m7m47K09K42n0J83m63J03K59o1j60
$$ 100 -2 -332 64 290 -24 -343 -286 90 32 -125 177 130 -317 -108 134 84 267 -196 -93 166 105 -55
5686e5J44j27k9J56k55M13o1n1k24K80j56K01l65M2J11o5J2m1P9K08j50O6K29
$$ -55 89 -38 -67 89 -166 247 186 135 -89 191 35 236 -129 -87 24 -41 -29 -70 9 217 67 133 362
5709C62l34j3k16N38j66j17J8k65oJ49j22j10K15J43Ll16L58P7l90K15k0n7rJ51
$$ 362 28 15 -201 337 171 54 72 -193 -199 -50 -172 -282 -67 76 79 -237 121 198 -192 23 3 -54 -63 88
5733H8L7k32j84M51j48r5K57j15j29J62j69J54j78K05j30j25M00k01j99l7N9K15
$$ 88 125 -107 -291 160 12 -83 174 59 -70 92 -77 77 -101 104 -26 -151 249 48 -151 -188 -129 86
5755H6l01J70m0L02k96R1K2J62k01j39J79k01K76l75O3L59l4j65l4Lk7M3k3J63
$$ 86 -215 -45 -85 217 -79 12 34 196 -5 -144 35 -166 110 -265 -202 157 123 -42 -76 -73 -100 -57 -80 83
5779H3J30j33j65Lm2K61k95J5J05m8J79j10K93l40j21j68M61pqm8j69Q7N6J0J53
$$ 83 213 80 -85 -82 -124 137 -158 -143 -38 -86 93 -17 276 -64 -185 -353 108 101 93 45 -124 -37 19 29 182
5804A82j97J15q6l04K39K91l77K93J3m12J48P8N6j93L25m8j24K3l11M1K93N9j24
$$ 182 -15 100 14 -290 -51 240 -137 156 169 -243 -95 -17 39 -154 171 123 -1 22 -289 -248 45 104 -20
5827b0M5Nj17j83J2K20j14L64j96O0J70k11j1KL08j45l57R8M44m11j13J21J94
$$ -20 25 30 -87 -270 -258 -38 -152 212 16 76 246 35 24 26 334 189 -168 -70 374 -37 -150 -29 165
5850A65j51k1K13o6O7k26N1Q8j55n7L9J49l7q2k47N33l14L04j57J0j25m4pJ96
$$ 165 14 -7 206 140 207 -19 32 120 -35 -92 -53 96 59 -23 -270 263 -51 253 96 106 -19 -63 -70 126
5874A26M3j46N9n4L7j49J01P9j15J50j05p6K44j77Mr6J06P3J8K44k90j7l16N13
$$ 126 169 23 82 28 65 -84 17 96 -19 131 26 -50 194 17 21 -75 31 104 122 366 76 59 -257 256
5898B56l61N7J09j18J13m8K06l19M19m05N4k46R7J52L19n57K79r9K46k66j33M16
$$ 256 -105 -48 61 -57 56 8 214 -105 314 -91 -37 -283 -186 -34 285 -272 7 -92 154 -112 -245 171
5920A71l11K0k31L35J48k26l28N59k00j01P2R0K43l34J9J40%Q4j74L6j00J16N7
$$ 171 -140 -120 -351 -16 132 -94 -422 137 -63 -164 -92 -2 241 -93 -74 66 66 150 -24 12 -88 28 85
5943H5N5R0j80j88K19K0P0k41nl3J70l3j88J08J44rl03K54o6J22j54L66m11j42
$$ 85 140 230 50 -138 81 101 171 -70 -75 -108 62 29 -159 -51 93 84 -219 35 -31 91 -63 303 -108 -250
5967b50K76L6m7j4k60M76l61J78j61j91O03o21M26k81M30m24mQ6j7K88m46M79
$$ -250 26 62 15 1 -259 217 -144 34 -127 -318 285 -336 90 -191 239 -185 -189 -103 -120 168 -278 201
5989B01j56j25L50k88J4k98L47k15K71j27l8k32R3K60J2k88jK27Q4j67O8J20p8
$$ 201 45 -80 270 -18 -4 -302 45 -170 101 -26 -64 -296 -203 57 69 -219 -220 7 91 -76 -8 112 34
6012C4j85K70jK9m18K58j97M36l11KJ78k01J3n0L42Lj51k60N48l43K0j53R0M19
$$ 34 -151 119 118 147 -271 -13 -210 226 -85 -83 95 -106 -93 -143 199 202 51 -209 339 -4 16 -137 -47 372
6036C72n57L21j73O0l7J57j09k67M53j58k63L29l1r2q7n1K93j91M4K97m81L52
$$ 372 -185 136 -37 23 -14 143 34 -233 220 62 -201 128 97 5 -82 -133 160 -31 13 310 -171 181
6058A81l18p9L16l27O3k19O09j97L0l86K62n7KK5rL6K26l41K44J91k45j73K15
$$ 181 -137 -216 100 -227 -164 -383 226 29 59 -327 -65 -122 -120 -95 -104 -68 158 -183 61 252 7 -166 49
6081D9J27k21L0m11Q92n52R1k44J92j86o0J77K36k23K40n0K8k02k6K74m7l9j32
$$ 49 176 -45 -15 -426 466 -86 5 -239 -47 -233 -293 -116 120 -103 137 87 115 -87 -113 161 114 75 -57
6104e7Q0J57k48j55p7O71k10r6k2m4j58L42j80J72j06r5m06M03M38m30q3J7rJ17
$$ -57 23 180 -68 -223 -300 371 161 65 43 -1 -159 183 3 175 69 -26 -432 -29 409 -21 -104 -87 -96 21
6128B1p3k33M06J08j92j41L57m21L34k07L5j6j14K33k05K45j88J34J59k25Q8L2
$$ 21 -52 -285 121 229 37 -104 253 -168 166 -41 -6 -22 -136 97 -108 137 -51 83 242 17 105 137
6150A37O7p5J22m49K24LK4l26O50k49n3j17J80k4k22K06M5k11j26K44N8kP8M4
$$ 137 204 129 251 -198 26 29 53 -273 377 128 75 -42 138 114 -108 98 143 -68 -194 50 108 106 184 228
6174B28l06J73R6j71j69J54o2M7j05l0L83l23J41j43L24m79J98NmK95l76J83M3
$$ 228 -78 95 191 20 -149 5 -57 -10 -115 -145 238 -85 56 -87 237 -242 -44 -39 -43 252 -124 59 102
6197A02j44J71l44L16k48J81j44K10j06K5j76M7j5k7J39P6j41J96k16Q6m9j12
$$ 102 -42 129 -215 101 -147 34 -110 100 -6 19 -157 -110 -125 -152 -13 63 -78 118 -98 -12 -61 -173
6219a73J43L3J40R8k41n2M8j52M28j13q5l4J21j01R2j70O0%P8m1J62l40J54j52
$$ -173 -30 3 143 241 0 -52 -4 -156 272 159 74 40 161 60 152 -18 42 42 120 79 241 -99 55 -97
6243i7K19j44J38q1k32j65K09R4J77Pj23J39k35Q2J21l4J0l6L1Jj70J57r3j38
$$ -97 122 -22 116 35 -197 -362 -153 -59 118 125 2 141 -94 -12 109 75 85 49 80 81 -89 68 -25 -163
6267a63K01j55N2j31m3K18k82K08nJ60j47K76k89N6K8R5K3J01j21k96J34O3k60
$$ -163 38 -117 -65 -196 -239 -21 -303 -95 -100 60 -87 189 -100 -44 -16 79 102 203 82 -214 -80 -17 -277
6290b77M38j78K14Q1k42j42L09j58j48J49Q1n4k69L40l30L39o0l1l8K53j9l76
$$ -277 161 -17 197 278 36 -106 203 45 -103 46 127 73 -196 144 -186 153 93 62 24 277 258 -118
6312a18j42M4J06K54k5k00J61J0j06OK06l93M15k30p9K77m7o5m5j3q8K13l29o9
$$ -118 -260 -216 -110 144 119 -81 80 90 -16 -10 196 -197 218 -12 -91 186 139 74 29 16 -72 141 -188 -257
6336b57P7J47J34j06k74P5L09k28L01J03n21K41k9k38P7L3K64L9lk9l32L00J49
$$ -257 -180 -33 101 -5 -279 -204 105 -123 178 281 -240 1 -28 -266 -189 -156 108 147 144 115 -217 83 232
6359B32l46j14N6j04N80l60ON1k88L09k12M08j92m2j68J17P1J20k92K8M3K46j22
$$ 232 -114 -228 -172 -276 304 -56 -50 1 -287 22 -190 218 26 -16 -184 -67 4 124 -168 -140 -97 149 27
6382B7J19k53N5q3L46J06l03q9o6J49J03q7j49R3Kr4J76j20L10k51j89M39l03
$$ 27 146 -107 -52 -135 211 317 14 -75 -141 8 111 24 -125 -32 -30 -124 52 -68 242 -9 -198 241 -62
6405f2j2k02L48k20j06K9J93J32j85j21K01J89Jm58J89K21j26k90J43P6J96j27
$$ -62 -74 -276 72 -148 -254 -225 -32 100 -85 -206 -5 184 185 -273 -84 137 11 -279 -136 -60 136 9
6427Ij72M4R0Q2j52K17jk47M36j03Q2m62k36L04r4LK60k9N2l74L88k79L6K32j88
$$ 9 -163 -119 -29 53 -99 118 117 -130 306 203 285 -177 -413 -109 -203 -200 60 31 83 -291 97 -182 -146 86 -102
6452a02J75j3ll6n7P0J26l9l73K15p7L19o2j07Q8q5k36K56l9M5j03P8K44k33l2
$$ -102 73 60 57 21 -36 34 160 121 -252 -37 -114 205 143 36 124 39 -197 59 20 65 -38 40 284 51 19
6477A9o5J17J33l13J46P1j08j06J25K01j59L2o5J1J93k65R8Q0m54O29l10j49L93
$$ 19 -46 71 204 -109 37 108 0 -106 19 220 61 93 28 39 232 -33 65 145 -309 320 10 -139 254
6500B54k58l9J23J29q7l01K32MK22j60k53J50J04k30J84j51Q7N6r0J52J10j24
$$ 254 -4 -43 80 209 122 -179 53 57 279 119 -134 16 120 -110 74 -77 10 66 -24 128 238 114
6522A14nk27K54k56l6L54k92K28k37J1J46J63n96L24M02l45L4Q5m4j51m26M43
$$ 114 109 -118 136 -120 -156 198 -94 134 -103 -92 54 217 -379 -55 347 2 36 121 77 -74 -500 -57
6544e7R0j16J6J27N1M5l06K46K7k64O5p3L45l57M9L14k67L6p6J58j1k52J07j96
$$ -57 33 -83 -67 60 111 156 -150 96 123 -141 -76 -149 196 -161 -112 202 -65 -29 -105 53 42 -210 -103 -299
6568b99K29K72k70j08J77k47M3J06M1P9j67M20l98L44r0o3n5J30j2j26k5O8k1
$$ -299 -70 202 -68 -176 1 -246 -203 -97 -56 23 -144 276 -122 222 132 69 14 144 132 6 -19 49 28
6591B8k18L07l19K05J53Ll09J12m9J08K98l0k53j20J32PJ23k9J36l72J9o3O0L01
$$ 28 -190 117 -202 3 156 159 -150 -38 -87 21 319 289 36 -84 48 55 178 149 285 -87 -68 -131 -71 230
6615B30m18l9L61k64K29J97k48lj08J44j77N26l75m41M0J22K96K07k92r8J82p5
$$ 230 -188 -227 134 -130 99 296 48 45 -63 81 -96 430 55 -386 -346 -224 72 279 -13 -111 71 -4
6637dj75R9J85l15R8K34j24M9k45J80P3M7j62K57l55K37l25K71k02K16l43K20
$$ -4 -179 -80 105 -210 -112 122 -2 47 -198 -18 55 102 -60 197 -158 79 -246 25 -177 39 -304 -84
6659h4n7K36J73n74N85o8q3K1N3k29Q0j19J20p0N0L8N7l12N00k75j0J33j83L6
$$ -84 -141 95 268 -306 279 211 128 149 202 -27 53 -66 54 -16 34 72 129 -183 317 42 32 165 -18 18
6683A8L0j23Q1n0j3J47j41Jj54J29j36J92L4J03K14m55K31J62l74J38L27m58J50
$$ 18 48 -75 6 -44 -57 90 -51 -50 -204 -75 -211 -19 15 118 332 -123 108 270 -104 34 361 -97 53
6706E3j04j14J58J65k72L53k04mK10k50j59M21l32J62j49j19K48j61kJ4lJ1J3
$$ 53 -51 -165 -7 158 -114 239 35 31 241 -9 -168 253 -79 83 -66 -185 63 -98 -100 -86 -89 -78 -65
6729f5K30n5J95j10j84J85q5K5P0k59K67n04J67J94k53j19J16L66k07J64k72m7
$$ -65 165 110 305 195 11 196 111 136 206 -53 214 -290 -123 71 -182 -301 -185 181 -26 138 -134 -181
6751a81o1N22l88NK95J32l03O7q2j47K07j69j51J41l34M37R5J7Q1k70L8k6J60
$$ -181 -242 280 -108 -103 192 324 21 88 6 -141 66 -103 -254 -113 -447 -10 85 102 183 -87 -49 -75 85
6774H5m1j02j2J87j32j16R5J4J28l0k2j60j28J94j0l02J31J87j68K16k24J96J98
$$ 85 44 -58 -70 117 -15 -131 -36 -22 106 76 54 -106 -234 -40 -50 -352 -221 -34 -202 14 -210 -14 184
6797A84j83k08J93n4K40m9K7L7j40L38l06R0n5Qk32M91n70J26P0J66J99n09j4
$$ 184 1 -207 -14 -68 172 123 150 187 47 385 79 169 114 122 -110 381 -189 -63 7 173 372 -137 -151
6820a51J45Ml17N06k74L90n54K75J67j86J23j69j61J38K77m6l38L13l50O2K48
$$ -151 -6 -2 -319 187 -87 303 -251 24 191 5 128 -41 -202 -64 213 167 -171 142 -208 -146 102
6841A02k65M46l27J35J27k43P1j03J96k23p5O4k3K01nj70j01J34N2N5mj07K45
$$ 102 -163 283 -44 91 218 -25 46 -57 139 -84 -159 -95 -118 83 78 -92 -193 -59 -7 48 44 -63 182
6864A82N1k66nj83L67k89L2K17k88K93j29J54J9r0k51J75r8j23L24l0o6k6J17
$$ 182 233 -33 -38 -221 146 -143 -111 106 -182 111 -18 136 155 65 -186 -11 -109 -232 92 62 -4 -30 87
6887H7m00L61k10J67O0o9pK10Qm85M02J07K75m13r8q4r8K40l11R0J46R4p1K91
$$ 87 -313 48 -162 5 65 -4 -11 199 207 -278 124 231 506 93 -5 -89 -187 53 -258 -168 -22 72 1 292
6911B92k05M1n0k79N95j00j63j17j00K09n9j00J14k5j09K8j2RK70j47Mn2J03p1
$$ 292 87 128 78 -201 394 294 131 14 -86 123 64 -36 78 53 -56 -28 -40 -31 239 92 96 44 147 76
6935G6J58k95J00j36L4K11k78j5J9L1K59j89K37J37l20k0k7k74L35k59K01K41
$$ 76 234 -61 39 -97 -63 148 -130 -145 -126 -95 164 -25 212 349 29 9 -18 -292 43 -216 -15 226
6957B26l21K37j83L4M3N2k96J34J29m36N45j88J27m5n3P0j19J63J18l45Q2R5j0
$$ 226 -95 142 -41 -7 36 88 -208 -74 55 -381 164 -24 103 58 5 75 -44 119 237 -108 -26 69 59
6980E9P6r4P0oj96K51j44N6J93n65K26%J7l77L28M1R1R8j27mJ01P3m55L23o2K21
$$ 59 135 41 111 105 -91 160 16 72 265 -300 -74 -74 -57 -434 -106 -65 26 124 -3 -7 94 167 -288 35 -27 194
7006A94o3q2l38m2J26J68q6j41K51kQQ1J37j67qQ7q4j4P8p9O5l4k92M56l48J54
$$ 194 131 49 -289 -331 -205 -37 -123 -264 -13 -15 -7 74 211 44 36 123 39 25 103 24 89 55 -237 219 -129 25
7032B5j14M6J37Q0j99Q5K43l07J25O3j0k93l0j28K69J27k4j94l2K18l26M91k0
$$ 25 -89 -43 94 174 -25 60 303 -4 121 184 174 -119 -149 -277 -8 119 95 -99 -131 87 -239 252 232
7055B32m65J79l3Q4J01L8j38k09M9q2M41k18m1j57J99J3J30j85J43j6r5K7J85
$$ 232 -233 -54 -87 -3 98 136 -2 -211 -162 -244 197 -21 -62 -219 -20 -7 123 -62 81 65 -30 -3 182
7078A82l24Q1lJ62p5j66K30Q1J2r0j84J43rl31K93J2j5J0r6K76k83J24j36J44
$$ 182 -142 -61 -64 98 23 -143 87 168 180 90 -94 49 40 -291 2 14 -1 9 -87 189 -94 30 -106 38
7102C8k7l21J33n6K61j93L08l2j10N6k71K57O2j25n0J86P0k21J00J1j11J37l17
$$ 38 11 -310 -177 -233 28 -165 143 111 1 57 -214 43 105 -20 -70 116 186 -35 65 76 -35 102 -215
7125b15J88j4m7K93l36J4n1L10m57O04o7l98k4K78j10J1l9p0J83j32J19n3l13
$$ -215 -27 -41 -88 205 -131 -117 -168 142 -315 289 222 -176 -200 78 -32 -21 -60 -130 53 -79 40 -13 -326
7148c26K57K1l85M02J19j66l2K31K33l62rJ51J76k91j97K16k52J78n7J16K91k01
$$ -326 -69 -48 -433 -31 88 -78 -110 121 354 -8 -17 134 310 19 -178 38 -214 -36 -93 23 314 113
7170A13j14q8qK24l25K59K3j17q1O0n9J20j03p5J03j43R2K26Q6k76k39K39M9O3
$$ 113 -1 -89 -97 127 -198 61 84 -33 -114 -54 -113 7 -96 -171 -68 -211 -119 107 193 -83 -322 -83 -34 29
7194B9j64m2K48O1o0k70J11R2j8k05R6K28ml97O05l33J49j18j03J60k38J42j35
$$ 29 -135 -177 71 132 72 -198 -87 5 -13 -218 -122 106 102 -295 310 -23 126 8 -95 65 -173 -31 -166
7217a66K87Q4j45o8J48K8k42O8j00m9L71k57Q4k24R6K89k49J66Q3j25l7K28m95
$$ -166 121 205 60 -8 140 168 -74 -6 -106 -155 216 -41 43 -181 -85 204 -45 121 204 79 42 270 -225
7240b25N15m82K97n4lJ34l47K07L47o52K41j8J0Q0p4J6o2p1K90k71L60k40n1J11
$$ -225 290 -192 105 51 48 182 -165 42 389 -263 -22 -40 -30 50 -24 -8 -70 -141 149 -122 238 -2 -53 58
7264E8p3j50J81J5k06M26l27M12n67J67o1L17k48Q1o8%J13j01m1j56N36l54O7
$$ 58 -15 -165 16 31 -175 251 -76 336 -231 -64 -125 192 -56 25 -43 -43 70 -31 -72 -228 308 -46 21
7287B1J73k95J20L9k9j65RJ76j97O7K42k88N1j06K69k66K53l4K21k80j61J63K57
$$ 21 194 -101 19 58 29 -136 -127 49 -148 -81 161 -127 -76 -182 87 -179 74 40 261 -19 -180 -17 240
7310B40j22j23K23l70L57l17K52kj61j70K22n4l52N00j42j77O47n28K8k14j36
$$ 240 118 -5 218 -152 205 -112 140 138 -23 -193 29 -25 -377 123 -19 -196 451 -77 -49 -263 -399
7331c99M31j09l8q9L73J0n5p3l93J50M45m14q0J8K46K9n6j70O4Q6R5J2K8L5J17
$$ -399 32 -77 -115 -204 169 179 124 51 -342 -192 253 -161 -241 -223 23 52 -4 -174 -110 -24 71 83 111 146 263
7356B63m63J2M00o8j30L3J38r0l2j55J47R4q7m40L96M24l50j44K39J1m85K20r8
$$ 263 -200 -188 212 144 14 47 185 95 63 -92 55 149 62 -378 18 442 92 -52 187 198 -287 -67 -165
7379a65L87l08J14k46L35n3j24J0K41l67Q5J03j00K94l53L4K65k04j82J13K19
$$ -165 222 -86 28 -218 117 64 -60 -50 191 -176 -91 12 -88 206 -147 -113 152 -52 -234 -121 98
7400I8k34K40l3M5n0j21Q9l5J17k67L46l22R6K2m9rJ42kL2l2j55K08j68K09j22
$$ 98 -136 104 71 116 66 -55 34 -1 116 -151 195 -127 -31 -9 -58 -67 75 73 105 73 -82 126 -42 167 45
7425D5J58O9l58L88j59j62m3j21O3j69M1J72L80m91L63k99J39j61K59j87J31j50
$$ 45 203 272 -86 302 143 -19 -62 -183 -120 -289 -248 -76 304 -187 176 -123 16 -145 114 -73 58 -92
7447i2J02J66k61k7m8K11j37J81j57M5q4J94l7L0j43J08r3k2J36L1n4l62K98r6
$$ -92 10 176 -85 -112 -160 51 -86 95 -62 -17 -101 93 56 86 -57 51 -42 -64 72 103 49 -313 -15 -111
7471a11N0o4q0K45M4l75M01L9l5j24l32L56j0L45k71j58P7k3j1r2K24J17l14L7
$$ -111 -61 -125 -205 40 84 -291 110 149 114 -10 -342 14 4 349 78 -80 -3 -26 -37 -129 95 212 -102 -65
7495f5M7P8l27O77l54l5k53j84L59J83n4j9j81j78K68k56N68m09J78P2l51J78
$$ -65 -18 60 -267 410 56 21 -232 -416 -57 126 72 53 -128 -306 -38 -294 274 -135 43 115 -236 -58
7517e8k1ML1RJ15k0n6nK26m50J24L35j94k80L36J47l71j28q9O21m70R5J37q8L88
$$ -58 -79 -75 -44 -35 80 60 4 -1 225 -225 -101 234 40 -240 96 243 -128 -256 -345 276 -194 -99 38 -50 338
7542C38l86l9O7Q7j46j7L8J9j52K40J06k00q1l5K79j87j27M43l75J43k9K7j60
$$ 338 -48 -87 -20 67 -79 -96 -58 -39 -191 49 155 -45 -126 -161 118 -69 -196 247 -128 15 -14 13 -147
7565a47L25O6j43l01K82j64J3K14P2o1K6k45J08j8o8P2k67J61M23m62K41j17J35
$$ -147 178 244 101 -200 82 -82 -69 145 217 156 182 -63 45 27 -41 31 -236 -75 348 -114 127 10 145
7588A45MO0l64J42L31j73l39M53l02K22k07J20p4o5Q5r0q5J8K00Q3k13kJ27k00
$$ 145 149 209 -155 -13 318 145 -194 259 -43 179 -28 92 18 -47 38 -52 -137 -119 81 164 -49 -51 76 -124
7612a24L9K97m49L03j75l4K28m1m9j1j05J43j21j13J78J73j51j98mL27k25k0L59
$$ -124 -85 212 -237 66 -109 -143 85 44 -5 -16 -121 22 -99 -212 -34 139 -12 -210 -214 113 -112 -132 227
7635B27Q6k87K5J55no6j11k72K40L88n50Q5L9J66j16k87L68L7k67M4JJ59k41J93
$$ 227 313 26 51 206 201 135 24 -248 -8 380 -170 -85 -46 120 4 -283 85 122 -145 -101 -100 59 -182 11
7659A1N0K97n23J63K77j61j76M9O5r0O6m3J3N8p6O1j92L06P9k71j87K11K66l02
$$ 11 61 358 -165 -2 275 114 -62 -13 52 -38 28 -15 -2 56 -20 41 -151 155 234 -37 -224 -13 253 -49
7683d9j01L5K56rj62J58M6j79m6o2R3k21J01K03j64K52j85N3l8K3l7l1J1M96o56
$$ -49 -150 -115 141 132 -30 128 174 -5 -51 -113 -20 -241 -140 63 -101 151 -34 19 -19 4 -33 -64 -53 443 -213
7708b13K86j08K44j88k05J42K31r0l00N53k03k24j41L65n0n7l58K58J42j74PK38
$$ -213 73 -35 209 21 -184 -42 189 99 -201 352 149 -75 -216 149 99 42 -316 -58 84 -90 -83 155
7730A55J15m7k33j31m1K1L93l25k3K73k10J88N2j02l18K64j21L87l17k42M33k5
$$ 155 270 223 -10 -141 -182 -161 232 -93 -116 157 -53 135 187 85 -233 31 -90 297 -20 -262 171 146
7752A46J95j34j99J2j00K54k41nJ09j76K41n7P9l3j85j7K32k49L94j44j11Q0k00
$$ 146 341 207 8 20 -80 174 -67 -72 37 -139 102 45 124 91 -94 -111 121 -128 266 122 11 91 -109
7775a09N2K59j34k04K33Jl80K20j86L68k4l16L60q0j99J00Rj5J27j59JJ61l1m1
$$ -109 -57 202 68 -136 97 98 -282 -62 -248 120 96 -220 140 60 -139 -39 -30 -45 82 -77 -76 85 54 13
7799A3J41j16J1K66m03M7P4K3Q8k83J73K3m6O2j98K49r7j10Q6J44j86j8P6p3J27
$$ 13 154 38 49 315 -88 -41 33 56 144 -139 34 57 11 73 -125 124 27 -83 3 147 -39 -57 19 -54 73
7824G3r5J01n9q5O6m3K23k48p1L70p7k92J23k26K63M62n28k50N47j40j11K56l01
$$ 73 -22 79 20 -65 1 -42 181 -67 -138 232 155 -137 -14 -240 23 485 -43 -293 254 114 3 259 -42
7847d2L6j00k96K63K95o9j64j9K89m40J90J55j01R0k42R7J77J98l89j45M47L3
$$ -42 -6 -106 -402 -139 156 87 -77 -96 193 -247 -57 98 -3 87 -155 -58 119 317 -72 -217 230 263
7869B63k57J3J95l4l58O8J76q4k79K35J2P6j50Q5K24j43k11Pp9L12J3j60L7L5
$$ 263 6 19 214 180 -178 -110 66 -18 -297 -62 -50 26 -124 -39 185 42 -169 -162 -241 71 84 -76 -39 -4
7893dJ07l26R2N4J63k56J10K21p0L9l74J14L58m27j0K97%k43jP8K90l67j41K81
$$ -4 103 -223 -131 -77 86 -170 -60 161 91 130 -244 -130 228 -199 -209 88 88 -155 -156 -78 212 -155 -296 -15
7917a5L15k80K6K96k36l69J01K53K13k51k8J44j92K77j59o4j79L60q8q1J49j7
$$ -15 300 20 46 342 106 -263 -162 91 304 53 25 169 -23 254 95 31 -148 212 124 43 192 175
7939A75k48J5K9J02r8k23M79k28K29k27np9N1l5Q5J56k56l3J29P0l1k18l9L06
$$ 175 -73 -58 -29 73 -25 -248 231 3 232 5 0 -79 -28 -63 22 178 -78 -111 18 88 57 -161 -200 106
7963A06mk74J19J70k4J61l36J79j50Lk36L61Q9k06k3J48Kj93L7J32j95K49j12
$$ 106 102 -172 -53 117 93 254 -82 97 -53 -50 -286 75 164 -42 -65 83 85 -108 -71 61 -134 115 3
7986Cj79M13n44L4K70J38k68Q1k3q9L0p1L04NJ19l16K17K53l64j8J27ML2j80j41
$$ 3 -176 237 -307 -273 -3 135 -133 -52 -75 -164 -134 -205 99 104 223 -93 124 377 13 -5 122 126 158 -22 -163
8011a63Q2K34k78k91N41j81J44k63K62l5k8m5L5O1J41m27K8L44l19L13l49Q4K33
$$ -163 -81 153 -125 -416 125 -56 88 -175 87 52 24 -21 14 75 216 -211 -183 161 -158 155 -194 -110 123
8034A23l04J83K21j79J00n30L69N4j55oM6j32Q4j31L35J45M3l31J15L8j19m5l18
$$ 123 -181 2 223 44 144 -386 -17 37 -118 -124 -78 -210 -126 -257 78 223 266 -65 50 88 -31 -76 -394
8057c94N72k48M0m6N8K30l83J09J90J1N2m03R3J95k04J62k00N1J31j60K84j67
$$ -394 178 -70 -30 -76 -18 212 -171 -62 128 139 191 -212 -119 76 -128 34 -166 -115 16 -144 140 -27
8079b7Nj60N8n4K59j37R1j44kj52K90J26j92k58M02l2J75o0n53N12nl95J22J31
$$ -27 -22 -182 -124 -178 81 -56 35 -109 -111 -263 27 153 -39 -297 105 73 248 188 -365 147 142 -253 -131 0
8103@J97n01J52q2J85L02m48K87r1j91n3L11J0J25l67L50j73M9k79J6R5K7m41
$$ 0 197 -304 -152 -234 -49 253 -195 92 1 -190 -243 68 78 203 -164 186 13 62 -217 -201 -106 -79 -520
8126e20N36K42l86K55k25K42J7l07O7j30K48k52J75N4K48k89j55M7K33k08J1K19
$$ -520 16 258 -128 127 -98 144 161 -146 -79 -209 39 -213 -38 16 264 -25 -180 -133 100 -108 -97 122
8148A22K6J41m86K68q1Q3k30j45J06K95j06JO1j16Q5R4j11j90K09k0M6j70K00
$$ 122 148 289 -197 71 -10 73 -157 -302 -196 99 -7 -6 55 -61 24 118 7 -183 26 6 52 -118 82
8171H2KK02j18K2l00J58k65L34l51K31K38l74R2J8J45k05j93M31j84J26
$$ 82 84 286 168 190 -110 48 -217 117 -234 -3 235 -139 -47 -29 116 -89 -282 149 -35 91
8191I1
$$ Imaginary data points
##PAGE= N=2
##DATA TABLE= (X++(I..I)), XYDATA
0@%%%%%%%%%%%%%jRj6J6j6J6k4L2l3M1m9N7p2Q4r3J06j22J41j64J86k11K39k68
$$ 0 0 0 0 0 0 0 0 0 0 0 0 0 0 -1 8 -8 8 -8 8 -16 16 -17 24 -25 32 -40 44 -49 57 -65 76 -88 98 -113 126 -142
36a42L02l41L79m20M70n25N82o44P14p89Q71r61J061j168J285j418J563j723J901
$$ -142 160 -181 198 -222 248 -277 305 -339 375 -414 457 -504 557 -611 674 -744 819 -904 997
55I97k102K331k594K898l250L672m187M827n651O755q325J0755j5045K4907r4568
$$ 997 -1105 1226 -1368 1530 -1720 1952 -2235 2592 -3059 3696 -4629 6126 -8919 15988 -78580
70g8580j4300J11428m9623l6256M6340Q8779m626l5605L713M7399q565n5814l0132
$$ -78580 -92880 18548 -31075 -67331 -20991 67788 63162 27557 31270 78669 70104 14290 -15842
83a5842K5071o387m2891q885L6493l798l6872R048N7804J2022m2769j2375M8224
$$ -15842 9229 2842 -40049 -48934 -12441 -16239 -53111 -44063 13741 25763 -17006 -29381 18843
96A8843K2242l8651k2828M1232L0655l1923l1943K6826L1923k4135m0454R666
$$ 18843 41085 2434 -20394 20838 51493 19570 -12373 14453 46376 22241 -18213 -8547
108h547K5239l1081m9598K0663N2899j7614n4225K3306P5851J0448m8536J955
$$ -8547 16692 -14389 -63987 -43324 9575 -8039 -62264 -38958 36893 47341 -1195 760
120G60O1460J7710o0212m2602L4465L0987m6996n6757J6290L7480j5063k4773
$$ 760 62220 79930 19718 -22884 11581 42568 -4428 -61185 -44895 -7415 -22478 -47251
132d7251K6408L7012q807j6415K3642K8484j8406k8137J4031J9358l0189m0162
$$ -47251 -20843 16169 7362 -9053 14589 43073 24667 -3470 10561 29919 -270 -40432
144d0432J8190M1277j3417m4530P304M9812Q410m0240o647M3147J1359m7869k3560
$$ -40432 -22242 19035 5618 -38912 -31608 18204 26614 -13626 -20273 22874 34233 -13636 -37196
157c7196L9991K4457l7555k8957L3221L2872k3695k7709K8118L9542j9466m6113
$$ -37196 2795 27252 -10303 -39260 -6039 26833 3138 -24571 3547 43089 23623 -22490
169b2490O979M2331n011m6769m912L8396L966l6207k961M0396J2940l0523j0320
$$ -22490 -15511 26820 21809 -24960 -29872 8524 12490 -23717 -26678 13718 26658 -3865 -14185
182a4185K8554J0837k6781j0699K5125O271l2834j3928L3850K1019k9244k1149
$$ -14185 14369 25206 -1575 -12274 12851 19122 -13712 -27640 6210 27229 -2015 -23164
194b3164K9562K5596k8902l1243K5689L4173k7536m4081J5399M2959o795l7654
$$ -23164 6398 31994 3092 -28151 -2462 31711 4175 -39906 -24507 18452 11657 -25997
206b5997O804M2705M405l6752n866L9270J3603l9182k6682K4007J9672k6611k4333
$$ -25997 -19193 23512 27917 -8835 -14701 24569 38172 -1010 -27692 -3685 15987 -10624 -34957
219c4957K1950K4485j8242k0597K1784K8983j0032k0668J1131J9418j4116k3772
$$ -34957 -13007 11478 -6764 -27361 -5577 23406 13374 -7294 3837 23255 9139 -14633
231a4633J1173K3137j4909l1699P796L2677l655l1197L625L5675M18l6610m446
$$ -14633 -3460 19677 4768 -26931 -19135 13542 9887 -21310 -17685 17990 18408 -18202 -22648
244b2648L8042J1633l4647j6192L0271J9403k5727j8357K5303K3238k4197k9852
$$ -22648 15394 27027 -7620 -23812 6459 25862 135 -18222 7081 30319 6122 -23730
256b3730J6920K8954j4888l3125P398L0345n834k7893P428L4115K871k7324m348
$$ -23730 -6810 22144 7256 -25869 -18471 11874 6040 -21853 -14425 19690 22561 -4763 -9111
269i111K5095O922k2391r590J5125K477k2351q021K1970R937j9860r562K4304
$$ -9111 15984 22906 515 -9075 6050 8527 -13824 -21845 125 10062 -9798 -19360 4944
282D944J4219k1522j2591K4904J7816k7120k6778J9321K8162j5124l0404R779
$$ 4944 19163 -2359 -14950 9954 27770 650 -26128 -6807 21355 6231 -24173 -14394
294a4394L1235l963k9878K587L2708L213l2038j0347K5613R606k4688j0314K2644
$$ -14394 16841 12878 -17000 -14413 18295 21508 -10530 -20877 4736 14342 -10346 -20660 1984
307A984J1403k0937j0449K4330J7798j7724j7783J4010J5472j6078j9780J0847
$$ 1984 13387 -7550 -17999 6331 24129 6405 -11378 2632 18104 2026 -17754 -6907
319f907J8280j2478k1519R510K5439k502j8688O482K2245m883k2887L139K1741
$$ -6907 11373 -1105 -22624 -13114 12325 9823 -8865 -2383 19862 14979 -7908 -4769 16972
332A6972l931k8449n011K3957N878k2879n504K7183J4000k3105j5304K4259K0944
$$ 16972 13041 -15408 -20419 3538 9416 -13463 -18967 8216 22216 -889 -16193 8066 29010
345B9010k0345k5910J0901K0054j2937k3581R281K4021m659k0841N153K4412K361
$$ 29010 8665 -17245 -6344 13710 773 -22808 -13527 10494 5835 -15006 -9853 14559 16920
358A6920j8622j708J5924k082k1534l503J9146K304k1035n023K2186R666j6415
$$ 16920 -1702 -3410 12514 10432 -11102 -14605 4541 6845 -14190 -19213 2973 12639 -3776
371c776n324K1231R143k2084j5163J6620J4329j7684k0249J1752J9451q181j6402
$$ -3776 -9100 12131 21274 -810 -15973 647 14976 -2708 -22957 -11205 8246 65 -16337
384a6337J3042K4534n322k2740L871K1419l919k4720l960J7900j656k2428k047
$$ -16337 -3295 21239 15917 -6823 -2952 18467 14548 -10172 -14132 3768 2112 -20316 -22363
397b2363K4986R848j7077o509K1365J3447j5037j2448J2029R802j8400j8202R562
$$ -22363 2623 12471 -4606 -11115 10250 23697 8660 -3788 8241 18043 -357 -18559 -8997
410h997J5083r888j4541J0245J6953n706j1512J1197J7260q541k0456L084J8107
$$ -8997 6086 -3802 -18343 -8098 8855 3149 -8363 2834 20094 11553 -8903 -5819 12288
423A2288m454k1750J09K1033K322k1124k921K4966J0501k0954j3489J6153J1779
$$ 12288 7834 -13916 -13807 7226 9548 -11576 -14497 10469 20970 16 -13473 2680 14459
436A4459j6297j5639J1774J3076j1665j4177J2379J8924m985j2913P443J5333
$$ 14459 -1838 -17477 -5703 7373 -4292 -18469 -6090 12834 7849 -5064 2379 17712
448A7712p130j8052M331J5756p715k3222q72J9803K625j6691o85K0694P309j5270
$$ 17712 10582 -7470 -3139 12617 4902 -18320 -19192 611 3236 -13455 -14140 6554 13863 -1407
462a407m454J7805Q392j6408j2332R640P637j3589j0975J2289J2168j2710j2988
$$ -1407 -5861 11944 20336 3928 -8404 1236 8873 -4716 -15691 -3402 8766 -3944 -16932
475a6932J3546J9208p608j7665O908J7180n759k0612J549J9329Q82j9758m633
$$ -16932 -3386 15822 8214 -9451 -2543 14637 8878 -11734 -10185 9144 10026 -9732 -14365
488a4365J8365Q806j3294o192J3301O337j4339r174J2528P927j4687j1320J2498
$$ -14365 4000 12806 -488 -6680 6621 12958 -1381 -10555 1973 9900 -4787 -16107 -3609
501c609J0018j0703r189J5017J4966j0912j5083R087J7325o425j9163J321J4925
$$ -3609 6409 -4294 -13483 1534 16500 5588 -9495 -408 16917 10492 -8671 -7350 7575
514G575l600j8471J211J8366K105j6516j636J6954M807j3622l629J3737M443j6004
$$ 7575 3975 -14496 -13285 5081 7186 -9330 -10966 5988 10795 -2827 -6456 7281 11724 -4280
528d280q343J4155J0712j2606j2248J0643J4177q716j3438Q648J4861q155j7504
$$ -4280 -12623 1532 12244 -362 -12610 -1967 12210 3494 -9944 -1296 13565 5410 -12094
541a2094L220J5299j915j4791N35J4636R07j2926J744J6440L127j5175m981J3956
$$ -12094 -8874 6425 4510 -10281 -9746 4890 5797 -7129 -5385 11055 14182 -993 -5974 7982
555G982M388j5686p885J2949O174j5766j0268J4978J3364j0316j1822J0120J4559
$$ 7982 12370 -3316 -11201 1748 7922 -7844 -18112 -3134 10230 -86 -11908 -1788 12771
568A2771p124j2859O990J4303n637j7112J956J5523j513j5009m74J3630Q5j5007
$$ 12771 5647 -7212 -222 14081 8444 -8668 -6712 8811 7298 -7711 -8185 5445 5530 -9477
582i477j498J4993M220j4167o458J3242Q194j0439p096J2782R678j1161j1148
$$ -9477 -10975 4018 8238 -5929 -12387 855 9049 -1390 -8486 4296 13974 2813 -8335
595h335R750J2496q399j4795L595J1732n525j4064L962J5336k073j4166K083J6160
$$ -8335 1415 13911 5512 -9283 -5688 6044 519 -13545 -9583 5753 3680 -10486 -8403 7757
609G757K980j2400j581J3351J597j5219m579J3986N048j4984r403J2398R063j1330
$$ 7757 10737 -1663 -3244 10107 11704 -3515 -8094 5892 10940 -4044 -13447 -1049 8014 -3316
623c316r305J1861J0837r776j1720Q401J4134n593j2452M075J2277l949j1904
$$ -3316 -12621 -760 10077 301 -11419 -3018 11116 5523 -6929 -2854 9423 5474 -6430
636f430L964J2791l211j4043m66J2542K09j3473k147J2643L165j3520l844J4866
$$ -6430 -2466 10325 7114 -6929 -7395 5147 5356 -8117 -10264 2379 5544 -7976 -11820 3046
650C046R346j1689q182J0234R638q162j0766O417Q984p964j2727M641J1730k571
$$ 3046 12392 703 -7479 2755 12393 4231 -6535 -118 8866 902 -11825 -7184 4546 1975
664A975j1585L805J2768k325j1299L181J4472j259j5445k471J3627L181j3559
$$ 1975 -9610 -5805 6963 4638 -6661 -3480 10992 9733 -5712 -8183 5444 8625 -4934
677d934n358J3009N858j1805p006J2788R090r653j0102P142Q688p343r559O992
$$ -4934 -10292 2717 8575 -3230 -10236 2552 11642 1989 -8113 -971 7717 374 -9185 -2193
691b193R644o974j0396O453J2935k924j1165K751J1690k720j3474o34J2696R85
$$ -2193 7451 477 -9919 -3466 9469 6545 -4620 -1869 9821 7101 -6373 -7007 5689 6674
705F674j3999m908J2268O862r422m980J1008O845r406p154Q353P902q831r967
$$ 6674 -7325 -12233 35 6897 -2525 -7505 3503 10348 942 -6212 2141 10043 1212 -8755
719h755N179Q364o441q820P197J1322m583j1572M285J3679j345j3513j64J0927
$$ -8755 -3576 4788 -1653 -10473 -3276 8046 3463 -8109 -3824 9855 8510 -5003 -5167 5760
733E760m12j3054k602J2919L990j0798m451J0805O842q222n399Q446N357j0089
$$ 5760 5348 -7706 -10308 2611 6601 -4197 -8648 2157 8999 777 -4622 3824 9181 -908
747i08p987P568Q459p790r494O098J0427m352q954N795J1827l204j2536N34J1190
$$ -908 -8895 -1327 7132 -658 -10152 -4054 6373 2021 -6933 -1138 10689 7485 -5051 -4517 6673
762F673L00j1558l159R690K370r856k756J1388N244r106m789Q411N873p993o491
$$ 6673 6973 -4585 -7744 1946 4316 -5540 -8296 3092 8336 -770 -5559 2852 8725 732 -5759
777e759O836O093q958q690O962J0248m875r924N009J0786k934j0035K616J0747
$$ -5759 1077 7170 -1788 -10478 -3516 6732 1857 -8067 -3058 7728 4794 -5241 -2625 8122
791H122j735j2439j531J0084J950r860j960R570K941q743k459J0662M430r151
$$ 8122 6387 -6052 -7583 2501 4451 -5409 -7369 2201 5142 -3601 -6060 4602 9032 -119
805a19n967P623N122q084p205P081P747p268q887O417J1746l495r734K840R627
$$ -119 -6086 1537 6659 -1425 -8630 -1549 6198 -1070 -9957 -3540 8206 4711 -5023 -2183 7444
820G444j351j0400J35R438n19j0531k065R406L011p723k207R172L181q504m006
$$ 7444 6093 -4307 -4172 5266 4747 -5784 -7849 1557 4568 -3155 -5362 3810 6991 -1513 -5519
835e519R284N482q966p914O541P256o527p937O044R148m408r266M054J0103j533
$$ -5519 3765 9247 281 -7633 -1092 6164 -363 -8300 -2256 6892 2484 -6782 -2728 7375 5842
850E842r439J26P859j027r104J77Q810P94q989j452R641L538q128l109Q553L463
$$ 5842 -3597 -3471 4388 3361 -5743 -5566 3244 4038 -4951 -6403 3238 6776 -1352 -4461 4092 7555
866G555r492n920P874O504p493q099N757Q535m137p076M727Q697l237q724J970
$$ 7555 -1937 -7857 17 6521 -972 -9071 -3314 5221 1084 -5992 -1265 7432 4195 -4529 -2559
881b559Q494j746r018M02P371q71q117J05R953J496r095k062Q977L957p914m920
$$ -2559 5935 4189 -4829 -4427 2944 2073 -6044 -5939 4014 5510 -3585 -5647 3330 7287 -627 -5547
897e547P395M831p506o554O102P735m757p496L699P467l034o731L347P043l055
$$ -5547 1848 6679 -827 -7381 -1279 6456 1699 -5797 -2098 5369 2335 -4396 -1049 5994 2939
912B939q198J434Q280p10q200K79Q284O52q472j099R512K742r337m810P276N018
$$ 2939 -5259 -3825 4455 3745 -4455 -4176 4108 4760 -3712 -4811 4701 7443 -1894 -6704 572 5590
928E590o803n355O117N743n651o337N606P408l663p251L291O933l552p028K343
$$ 5590 -1213 -6568 -451 5292 -359 -6696 -1090 6318 2655 -4596 -1305 5628 2076 -4952 -2609
943b609Q045l024q560P76Q740P15q244m74Q019J619q097k278Q031L847p256n037
$$ -2609 5436 2412 -6148 -5372 3368 4083 -4161 -4635 3384 5003 -3094 -5372 2659 6506 -750 -5787
959e787N733N224n226n137N149N108m977n935M640O820l767o972K605P081k316
$$ -5787 -54 5170 -56 -5193 -44 5064 87 -5848 -1208 5612 1845 -5127 -2522 4559 2243
974B243p211K147Q657q89q623o56Q591J806q083k597P341K142p474l522P078M394
$$ 2243 -4968 -2821 5836 4947 -3676 -4332 4259 6065 -2018 -4615 2726 4868 -2606 -6128 950 5344
990E344o204m708N517N516m992m443M978N347n154o415L997O768l654p507K405
$$ 5344 -860 -5568 -51 5465 473 -3970 1008 6355 1201 -5214 -1217 5551 1897 -5610 -3205
1005c205P284k079p429J683Q113j45p724j370P268J979o442k439O021L066o436
$$ -3205 4079 2000 -5429 -3746 4367 4222 -3502 -4872 2396 4375 -2067 -4506 1515 4581 -1855
1020a855k933O139M253n541m779M779M501n133n680M546O081m190o989L435Q272
$$ -1855 -4788 1351 5604 63 -4716 63 4564 -569 -6249 -1703 4378 188 -6801 -3366 4906
1035D906j632o990Q82P772r1p280n78P210M73p172l280O376K573n771k232O391
$$ 4906 3274 -3716 -2834 4938 4847 -2433 -3011 4199 4672 -2500 -5780 596 3169 -2602 -4834 1557
1051A557K636n620l326O709N142o199n487M568N582m631o089L579P090l469p283
$$ 1557 4193 -1427 -4753 1956 7098 899 -4588 -20 5562 931 -5158 -1579 5511 2042 -5241
1066e241K010P785p33o784k02O207p7o398r12O561J465o364j743O354K889n368
$$ -5241 -3231 4554 3821 -2963 -3165 3042 2965 -3433 -4345 2216 3681 -2683 -4426 1928 4817 -551
1082e51k991O031L203o410m861N342M801m590o431L419O313k198o012K653P384
$$ -551 -3542 2489 5692 -718 -5579 -237 4564 -26 -6457 -3038 3275 1077 -4935 -2282 5102
1097E102j352p159R31O914o27o537n26N883p77o112p70P509J731o763k341O816
$$ 5102 3750 -3409 -2478 4436 3809 -2728 -3254 2629 1852 -4260 -5030 2479 4210 -2553 -4894 1922
1113A922L331n631l855N909L938n853n655M435O241l660n729K781N900j694n437
$$ 1922 5253 -378 -4233 1676 5614 -239 -5894 -1459 4782 1122 -4607 -1826 4074 2380 -3057
1128c057K159N539j378o289R1N842k77n945l50N784N93n584j310P035K639n898
$$ -3057 -898 4641 3263 -3026 -2935 2907 2630 -3315 -3665 2119 2712 -2872 -4182 2853 5492 -406
1144d06l787N532L926n008m639L975M794m355n437L123O467k390n669K349N555
$$ -406 -4193 1339 5265 257 -4382 -407 4387 32 -5405 -2282 4185 1795 -3874 -1525 4030
1159D030j735n780J593O306j749p313L85O519J136o611q99O821J713o498j931
$$ 4030 2295 -3485 -1892 4414 2665 -4648 -4263 2256 3392 -3219 -4118 2703 4416 -2082 -4013
1174d013O279L056n599m253L988L786m000m136L643M640l199m630L423N822j987
$$ -4013 2266 5322 -277 -4530 -542 3244 -756 -4892 -1249 3391 192 -4438 -1015 4807 2820
1189B820n381J626N091j594n993Q91N746l74o994n56O622J696n484k082O115K589
$$ 2820 -2561 -935 4156 2562 -3431 -2540 3206 2832 -4162 -4718 1904 3600 -1884 -3966 2149 4738
1205D738n317l077M614M164m509n018L525M500l308m246L428M968l278n136K880
$$ 4738 -579 -3656 958 5122 613 -4405 -880 3620 312 -3934 -506 4462 1184 -3952 -1072
1220a072N539j760o405J051N590o90o479L76O833R03o112k025O118K829n133l102
$$ -1072 4467 2707 -3698 -2647 2943 2253 -4226 -3850 2983 3886 -2226 -4251 1867 4696 -437 -3539
1236c539M885K264m815l531M236L953l732m386L808M592l191l856L190M730k542
$$ -3539 1346 3610 -1205 -4736 -500 3453 -279 -4665 -857 3735 544 -3312 -122 4608 2066
1251B066n887J687N753j133o159o7N595Q52n557q05O135K011n300k535M299K821
$$ 2066 -3821 -2134 3619 2486 -3673 -3740 1855 2707 -2850 -3655 2480 4491 -809 -3344 955 3776
1267C776m055l184L927K934m285l904M397M658l543m627K987N363k379n481K263
$$ 3776 -279 -3463 464 3398 -887 -4791 -394 4264 721 -3906 -919 4444 2065 -3416 -1153
1282a153N189j485o045K92O042N32n798q56N108J124m436j571M735K121n154k690
$$ -1153 4036 2551 -3494 -3202 2840 3372 -2426 -3282 1826 2950 -1486 -3057 1678 3799 -1355 -4045
1298d045M797K823m440k758M368L059m136l875L715M782k520n294J780M969j549
$$ -4045 752 3575 -865 -3623 745 3804 -332 -4207 -492 4290 1770 -3524 -1744 3225 1676
1313A676n541R91N347Nn504n98N711J331m622j199M484J243m364j787M172K459
$$ 1676 -3865 -2874 2473 2478 -3026 -3624 2087 3418 -1204 -2403 2081 3324 -1040 -2827 1345 3804
1329C804m927l243M001L594l931l443L639L951k552n022K728N682j590n335P41
$$ 3804 -1123 -4366 -365 3229 -702 -4145 -506 3445 893 -4129 -1401 4281 2691 -2644 -1903
1344a903M743m69m905L57M855K25n022r76M936Q27m545j360M300J756m606j788
$$ -1903 2840 2371 -2534 -2177 2678 2903 -2119 -3095 1841 2668 -1877 -3237 1063 2819 -1787 -3575
1360c575M442L506l887l951L511L919k712m242K482M113k245n017J016N011o95
$$ -3575 867 4373 486 -3465 46 3965 1253 -2989 -507 3606 1361 -3656 -2640 2371 1676
1375A676m853L49M577J97m376K15M832P98m855j168M544J238m083k130M146K025
$$ 1676 -3177 -2828 1749 1946 -2430 -2215 2617 3415 -1440 -2608 1936 3174 -909 -3039 1107 3132
1391C132m112l386M333L549k974m535K633M047j703m041J738M289j328m326J430
$$ 3132 -980 -4366 -33 3516 542 -3993 -1360 2687 984 -3057 -1319 2970 1642 -2684 -1254
1406a254M602n67m363j26M102j15m596n26M573P74n086j390M430K463l720k279
$$ -1254 3348 2781 -1582 -1708 2394 2279 -2317 -2843 1730 2504 -2582 -3972 458 2921 -799 -3078
1422c078L829L164l455l108L005M027l131m000J614L655j546m070J607L946j021
$$ -3078 751 3915 460 -2648 357 4384 1253 -2747 -1133 2522 976 -3094 -1487 2459 1438
1437A438m291P78M721j34m647m4M265O74m470j048M406J940m274k814L786K922
$$ 1438 -2853 -2075 2646 2512 -2135 -2179 2086 2760 -1710 -2758 1648 3588 -686 -3500 286 3208
1453C208l293k836K660K897k724l300K194M076j940l722J365L868r53l870J061
$$ 3208 -85 -2921 -261 2636 -88 -3388 -1194 2882 942 -2780 -1415 2453 1500 -2370 -1309
1468a309M698j138m582K32M307L85m648j190M254J142m018j654M323K422l543
$$ -1309 3389 2251 -2331 -2099 2208 2593 -2055 -3245 1009 2151 -1867 -3521 802 3224 -319
1483c19k402L009K844k906k724K557K893k723l409J984L907j641l816J206L949
$$ -319 -2721 288 3132 226 -2498 59 2952 229 -3180 -1196 2711 1070 -2746 -1540 2409
1498B409o83l767L69M451m09m648m78M154J407m006j517L370J821l287j648L316
$$ 2409 1726 -2041 -1672 2779 2370 -2278 -2756 1398 2805 -1201 -2718 652 2473 -814 -2462 854
1514H54K451l195k518K335K448k481k585J802L345k276l544J885M381j123m116
$$ 854 3305 110 -2408 -73 2375 -106 -2691 -889 2456 180 -3364 -1479 2902 1779 -2337
1529b337O11M252m07l942kL658O61m312j219L646J494l012j817L399J826l393
$$ -2337 -1726 2526 2119 -1823 -1825 1833 2494 -1818 -3037 609 2103 -909 -2726 673 2499 -894
1545h94j922L412K297k913k867K541K750k118k834K028L418j799l600J073M599
$$ -894 -2816 596 2893 -20 -2887 -346 2404 286 -2548 -520 2898 1099 -2501 -1428 3171
1560C171j248m046J77L772j30l560p61L509R50l295q12L009J999k764j470K479
$$ 3171 1923 -2123 -1946 1826 1696 -1864 -2625 884 1834 -1461 -2273 736 2735 -29 -1499 980
1576I80J908l019k417K834K453k722l201J987L027j395k904J279L600r63l566
$$ 980 2888 -131 -2548 286 2739 17 -3184 -1197 1830 435 -2469 -1190 2410 1447 -2119
1591b119M55L757n4l443l65L046J89l066n65L502J009l506j325L418J684l385
$$ -2119 -1664 2093 2039 -1404 -1769 1277 1466 -1600 -2165 1337 2346 -1160 -2485 933 2617 -768
1607g68j530K622K182l183k364K459L573k178l563J935L259j267k774O39L124
$$ -768 -2298 324 2506 -677 -3041 -582 2991 813 -2750 -815 2444 1177 -1597 -958 2166
1622B166l58l622j31L084K88k926m26K846M74k484n93L074J195l267j655K915
$$ 2166 1808 -1814 -1945 1139 1427 -1499 -1925 921 1395 -1089 -1682 1392 2587 -680 -2335 580
1638E80J962k630k243K125K668k622k652K210L345j911k721P02L426q93l149O60
$$ 580 2542 -88 -2331 -206 2462 -160 -2812 -602 2743 832 -1889 -1187 2239 1346 -1803 -1143
1654a143L292n01l667K11L405J97k795j041L388O72k917j208K982J761l119k341
$$ -1143 2149 1648 -2019 -1808 1597 1794 -1001 -2042 1346 2018 -899 -2107 875 2636 -483 -2824
1670b824K423K403j916k396J538K803j650k366J218K967j082k775P18K372o02
$$ -2824 -401 2002 86 -2310 -772 2031 381 -1985 -767 2200 1118 -1657 -939 1433 831
1685H31k721N94L027k81l235j15L364N02l048j103K878J635k789k090L049J901
$$ 831 -1890 -1296 1731 1450 -1785 -1900 1464 1966 -1082 -2185 693 2328 -461 -2551 498 2399
1701B399k199k534J460L334j687k657J446K712j538k659J111K910n37l307L68
$$ 2399 200 -2334 -874 2460 773 -1884 -438 2274 736 -1923 -812 2098 1561 -1746 -1378
1716a378K912l37l092J68L091M24k895p67K799J499l096j395K683J524k406j755
$$ -1378 1534 1197 -1895 -1727 1364 1788 -1107 -1874 925 2424 -672 -2067 616 2140 -266 -2021
1732b021K270J871k111k373J978K300j539k593J873K175j342k853J192L193o94
$$ -2021 249 2120 9 -2364 -386 1914 375 -2218 -345 1830 488 -2365 -1173 2020 1326
1747A326k877J20K598N94l144n60K909J426l236j295K339J668j974j839J887J539
$$ 1326 -1551 -1431 1167 1761 -1383 -1943 966 2392 -844 -2139 200 1868 -106 -1945 -58 1481
1763A481j568j953J558K242j298k402J693K225j387k036J079K522j175k914L83
$$ 1481 -87 -2040 -482 1760 462 -1940 -247 1978 591 -1445 -366 2156 981 -1933 -1550
1778a550L367j5l338l64K832M73k882l19K494J296k478j271K181J547j904j453
$$ -1550 1817 1802 -1536 -1900 932 1405 -1477 -1796 698 1994 -484 -1755 426 1973 69 -1384
1794a384K190J391k248j880J651K188j216k698O74K533k42k745N64K513J34k824
$$ -1384 806 2197 -51 -1931 -280 1908 692 -2006 -1332 1201 959 -1786 -1222 1291 1425 -1399
1810a399k43K585J058k364q61J814Q74k027j015K232J047k292j310K279J378j998
$$ -1399 -1642 943 2001 -363 -1224 590 1464 -563 -1578 654 1701 -591 -1901 378 1756 -242
1826b42j413J577K265k254k003J541K596j119k868Q01K701n51k430L11K451K29
$$ -242 -1655 -78 2187 -67 -2070 -529 2067 948 -1920 -1119 1582 1031 -1399 -1088 1363 1592
1842A592k789o67K734P08k338j304K438J242k206q13K092J218j793j776J771J697
$$ 1592 -1197 -1864 870 1578 -760 -2064 374 1616 -590 -1403 689 1907 114 -1662 109 1806
1858A806j642j619J098J689r22j953N75K421o35j971K18K235l72j706J6J918K35
$$ 1806 164 -1455 -357 1332 410 -1543 -968 1453 818 -1153 -935 1300 928 -778 -762 1156 1391
1875A391k493n37K620O81k275r70K175J059k091j413K251J787k136k284J560K136
$$ 1391 -1102 -1639 981 1662 -613 -1583 592 1651 -440 -1853 398 2185 49 -2235 -675 1461
1891A461j021k178Q15K294k05k567N14K340j99k067l13K125j42j988k2J683O23
$$ 1461 440 -1738 -923 1371 1166 -1401 -887 1453 1254 -813 -1126 999 857 -1131 -1153 530 1153
1908A153k548k51J886Q82j738o44J839J127j610j689J881J536j441k290J192K206
$$ 1153 -1395 -1646 240 1122 -616 -1260 579 1706 96 -1593 288 1824 383 -1907 -715 1491
1924A491p92k025N74K217n82k442N13K541j10k318l96K308L94k219l23K000R34
$$ 1491 699 -1326 -752 1465 883 -1559 -1046 1495 1385 -933 -1329 979 1373 -846 -1169 831 1765
1941A765k471q45K031J555j990j694J576J451j468j523J128J577q56j719R21J644
$$ 1765 -706 -1551 480 2035 45 -1649 -73 1378 -90 -1613 -485 1092 236 -1483 -562 1082
1957A082l57j852P38J839n78k028P8K256J44k561l13K144N65k172p82K375J051
$$ 1082 725 -1127 -389 1450 872 -1156 -1078 1178 1322 -1239 -1552 592 1157 -1015 -1797 578 1629
1974A629j852j852K144J744j266k125J351J702j091k061Q39K132m88k477O22J979
$$ 1629 -223 -2075 69 1813 547 -1578 -227 1475 384 -1677 -838 1294 806 -1671 -1049 930
1990I30l54j508K31J818m72j755q3K059J33j637m19J932O60j934q75K025J013
$$ 930 576 -932 -701 1117 645 -1110 -1193 866 999 -638 -1057 875 1535 -399 -1274 751 1764
2007A764j857j445J546J236j270j241R77J570j072j561J025K050j131j726N34
$$ 1764 -93 -1538 8 1244 -26 -1267 -290 1280 208 -1353 -328 1722 591 -1135 -601
2022f01J605kk068J50J841M00k352q65K618Q88j980j159J515J124j340p72J349
$$ -601 1004 1002 -1066 -916 925 1325 -1027 -1892 726 1614 -366 -1525 -10 1114 -226 -998 351
2039C51O94j003j286J222J254j121j433R71J768j143j571P84K126q34k165L75
$$ 351 1045 42 -1244 -22 1232 111 -1322 -351 1417 274 -1297 -513 1613 779 -1386 -1011
2055a011J947j63j937k42K290J8j750o54J966R69j416j159J314J446j495j299
$$ -1011 936 773 -1164 -1406 884 902 -848 -1502 464 1433 17 -1142 172 1618 123 -1176
2071a176J213J492j281j561R09J913j019j607L21K007l20j919J04K015J74j891
$$ -1176 37 1529 248 -1313 -404 1509 490 -1117 -796 1211 891 -1028 -924 1091 1265 -626
2087f26m42J655L71j415l84J639L14j672o68J521Q94j504j060J438J105j246j448
$$ -626 -1068 587 958 -457 -841 798 1112 -560 -1228 293 1187 -317 -1377 61 1166 -80 -1528
2104a528J640J424j170j879P36K105n55j571K04J753j65j980J0J903L51j905m93
$$ -1528 112 1536 366 -1513 -777 1328 773 -798 -594 1159 994 -986 -976 927 1278 -627 -1120
2121a120J371J004j793n24J523K63j266o76J456R56j247j017J003J198j196j409
$$ -1120 251 1255 -538 -1062 461 724 -542 -1218 238 1194 -53 -1070 -67 1131 -65 -1474
2137a474J231J613p81j835N67J753m17j634M85J734o75j733N67J588J09j891j32
$$ -1474 -243 1370 589 -1246 -679 1074 657 -977 -492 1242 567 -1166 -599 989 1098 -793 -925
2154i25J496L36j632n21J946P92k007p32J301J163j157j167R54J291q21j430O65
$$ -925 571 907 -725 -1246 700 1492 -515 -1247 54 1217 60 -1107 -153 1138 317 -1113 -448
2171d48J585m66j671J22J542j28r99j77J573k68j464o5J694J03j914j0J667L74
$$ -448 1137 671 -1000 -878 664 536 -463 -640 933 665 -799 -864 830 933 -981 -991 676 1050
2189A050j730l07J491R04j636p53Q03J714j594j379J118J328q49j369Q08J414
$$ 1050 -680 -987 504 1408 -228 -981 -178 1536 -58 -1437 -319 1009 160 -1209 -401 1013
2205A013n00j421O6J949N0j875m0J986k74j899r0J598N05j654n96J611P37j680
$$ 1013 513 -908 -842 1107 1157 -718 -758 1228 954 -945 -1035 563 1068 -586 -1182 429 1166 -514
2223e14n38J155J115j202j096Q13J199r43j197J189J051p40j366P81J380n77j288
$$ -514 -1052 103 1218 16 -1080 -267 932 -11 -1208 -19 1032 292 -1074 -293 1087 510 -778
2240g78L36J460k77j576j6J757j82j710j34J577Q22j371j087J400P93j148j157
$$ -778 -442 1018 741 -835 -851 906 724 -986 -1120 457 1279 -92 -1179 221 1014 -134 -1291
2257a291J502R86j183j243Q09J252o59j181R94J073l92j684N64J556q96r86Q9
$$ -1291 211 1197 14 -1229 -420 832 173 -1008 -14 1059 667 -1017 -453 1103 207 -779 -690
2274f90J354j91j347j71J574K19j377n88J426O19j302m26J255P46j230j207J259
$$ -690 664 473 -874 -1045 529 748 -629 -1217 209 828 -474 -900 355 1101 -129 -1336 -77
2291g7J241j319r95R31J087m73j320O84J198l54j389p7J939q9j591m97J736K23
$$ -77 1164 -155 -1150 -219 868 395 -925 -241 957 603 -786 -863 1076 987 -604 -1101 635 858
2309H58j222n87J264O15j309n20J070Q36j259n28R28P41r34r53J191P86q05j148
$$ 858 -364 -951 313 928 -381 -901 169 1005 -254 -782 146 887 -47 -1000 191 977 172 -976
2327i76O20J540n92j326K61J793m57j910L31J313J38j490k88J463K10j248k26
$$ -976 -356 1184 592 -734 -473 1320 863 -1047 -716 597 735 -755 -1043 420 630 -618 -844
2344h44J094O58j370k12R07O70r06j126J303P09j059o73M13J652o41j782O52J084
$$ -844 250 908 -462 -674 233 903 -3 -1129 174 883 -176 -849 -436 1216 575 -1207 -555 529
2362E29r6r12l03J308j01j036Q5J260j3j340j91J400N90j448o41J215Q20j024
$$ 529 433 -479 -782 526 425 -611 -526 734 721 -619 -810 590 1180 -268 -909 306 1126 102
2380A02j285J435P34j080p94O06Q05l73j200M53J547j36j969L98J379l0j084j02
$$ 102 -1183 252 986 -94 -888 -282 523 150 -1050 -597 950 814 -1155 -757 622 592 -492 -594
2398e94P41M01j283K6R12N01p80q84J191N86j413m52J105Q92j124r66J098R03
$$ -594 147 548 -735 -709 203 704 -76 -960 231 817 -596 -1048 57 949 -175 -1141 -43 860
2416H60m67j320P51J152q93q74M23J298j89j672L83J426k78j257J28J108M1q64
$$ 860 393 -927 -176 976 83 -791 -368 930 741 -931 -548 878 600 -657 -529 579 620 -244
2434b44o78J336N01j068p93J599N10j143n02M56J229r82j153O16Q78m04q03M40
$$ -244 -922 414 915 -153 -946 653 1163 20 -482 -26 1203 221 -932 -316 562 158 -645 -205
2452b05Q99m72r02L01J270n69j295O43R00K44j494rJ188L98j449p03J538O75j143
$$ -205 694 222 -680 -379 891 322 -973 -330 570 814 -680 -689 499 897 -552 -1255 283 958 -185
2471a85q12J203R94j471p35P67J157m76j086K76J067k78j179L43R47j36j280M09
$$ -185 -997 206 1200 -271 -1006 -239 918 442 -644 -368 699 421 -758 -415 532 396 -884 -475
2489d75J310m90j034J75J331j86j117O1J012L2p11n47J185M66j015r04J065N87
$$ -475 835 345 -689 -514 817 631 -486 -425 587 619 -92 -639 546 1012 -3 -907 158 745
2507G45r03q17J009M23n46o11N52J147p92o89q1J392j56j343J59J408m5j298m19
$$ 745 -158 -975 34 457 -89 -700 -148 999 207 -482 -563 829 673 -670 -511 897 852 -446 -865
2526h65J375Q4j128k79J320n1o49o93R72Q32j022o37P61P94n67j194J036O88n26
$$ -865 510 594 -534 -813 507 456 -193 -886 86 918 -104 -741 20 814 247 -947 89 777 251
2545B51r44K60J022j74j044m0J424k29j336n5J406J55j197n14J326J41p07k37
$$ 251 -693 -433 589 415 -629 -669 755 526 -810 -865 541 696 -501 -1015 311 452 -255 -492
2563d92R73L16r28o59Q44P58q53p07O19J005r17p24P74J000j005n87J92J128k22
$$ -492 481 797 -131 -790 54 812 -41 -748 -129 876 -41 -765 9 1009 4 -583 -391 737 515
2582E15j021k8J096l21q99p5J119K91j163k84R15N42r79l63R11O06j090n78Q66
$$ 515 -506 -534 562 241 -658 -733 386 677 -486 -770 145 687 -292 -655 256 862 -228 -806 60
2601F0P06p85n70L95J048o10j098M73J346l29j071k09J067J21q94j83J129n5q68
$$ 60 766 -19 -589 -194 854 244 -854 -381 965 636 -435 -644 423 544 -350 -533 596 541 -327
2620c27m82J231K70q75l21L75J001j073o07J035Q59j093q58N73R77m73j054M36
$$ -327 -809 422 692 -183 -504 -129 872 -201 -808 227 1086 -7 -865 -292 685 212 -842 -406
2638d06J252p44n90J82P17K14j277L11J081l88p00J21O29J4q69j41J197J60j124
$$ -406 846 102 -488 -306 411 625 -652 -341 740 352 -348 -227 402 416 -453 -594 603 763 -361
2657c61k71R60N15p65r35R02R14r84o33K05J371m17j145L15J014k68j024K33R38
$$ -361 -632 328 843 78 -857 45 959 -25 -658 -453 918 501 -644 -329 685 417 -607 -374 564
2676E64k19j039M06O84k66m69k97Q75L19q92k92R20N13q32o51P81N30n44j033
$$ 564 345 -694 -288 396 130 -339 -636 239 558 -334 -626 294 807 -25 -676 105 635 91 -942
2695i42J087M23m29r79N28J003n08o20K54R97n31j095O38P11K44j259j53R78M13
$$ -942 145 568 139 -840 -312 691 183 -437 -183 814 283 -812 -174 537 781 -478 -631 347 760
2714G60r30k04Q90J62j110l48R38L76n85m81N34M00n19n83N63O22k86p19K23J000
$$ 760 -170 -374 516 678 -432 -780 158 534 -51 -532 2 402 -117 -700 -137 485 199 -520 -297 703
2734G03k35r84L38P41N0j210p3Q97L76j081l33J175K80j081k28Q49M33n62q58
$$ 703 468 -516 -178 563 613 -597 -670 227 603 -478 -811 364 644 -437 -665 184 617 55 -803
2753h03R78N75q73l87M13M26o33n58M78Q48J9q15n5P37J41r31l3P16L26r93m78
$$ -803 175 750 -123 -510 -97 329 -304 -862 -384 464 483 -332 -387 350 491 -440 -473 243 569 -424 -902
2774i02J155K60p23m48J205J43q58j41K76N39m37o75M85N15j51j109Q29O56o07
$$ -902 253 513 -210 -658 547 690 -168 -309 -33 506 69 -606 -121 394 243 -866 -37 619 12
2793A2o15L64Q27k02j151J24J382l4j097l19J044J87q91j59O99M18p45o47J242
$$ 12 -603 -239 588 386 -765 -641 741 707 -390 -709 335 522 -369 -528 171 589 -156 -803 439
2812D39j1l87m95O41N26p68n96N55M82m03n26J07J234m55j147O34O64J1r46j18
$$ 439 428 41 -454 187 713 -55 -651 -96 386 -17 -543 -436 798 343 -804 -170 494 505 -441 -559
2832e59P37J03l66o03J117K22j176k78Q53M87q70L9L61N24m78p63P12L72j40r80
$$ -559 178 281 -85 -688 429 651 -525 -803 50 537 -333 -294 67 591 113 -650 62 434 294 -686
2852f86J16J139m87o88L33O69J31p03j17P19J92r00j26R36j41n56j13P94r2o31
$$ -686 -570 569 82 -606 -273 396 527 -176 -293 426 618 -282 -408 528 387 -169 -282 512 420 -211
2872b11n32P38O44m82p92O80P31r18n91Q34M32j48r82N48O76l42r07K25P59O9
$$ -211 -743 -5 639 157 -635 45 776 -142 -733 101 533 385 -597 -49 627 285 -622 -397 362 431
2892D31q26n2O92L60p89l05R86R4p97l40N28P90j090k37O86O31o79p33N95N43
$$ 431 -395 -447 245 605 -184 -489 497 591 -206 -546 -18 772 -318 -555 131 762 83 -650 -55 488
2912D88l86p35K74P31n9p24K6R88k66p69L99M00J84q81r0Q00J17p63m96R79J76
$$ 488 102 -633 -359 372 313 -411 -385 603 337 -432 -33 367 551 -330 -420 380 497 -266 -762 217 393
2933C93k08q12N29N43n15n41M36N84l01n51M12O33m01m30l6Q39j88q24J19N89
$$ 393 185 -627 -98 445 -70 -611 -175 409 108 -443 -31 602 201 -229 -265 574 386 -438 -319 270
2953B70M14j013L75J39L62q96l46J058J63p79k00P60J28l54n40N11N22m62n30
$$ 270 684 -329 46 185 547 -349 -695 363 526 -253 -453 307 435 81 -459 52 574 112 -418
2972d18K08N04l23k56K26O77k69n54j29R42m20m24J57K82n8l36l39O61M37o79
$$ -418 -210 294 -29 -285 -59 618 349 -205 -334 608 188 -236 -79 203 145 -191 -530 131 568 -111
2992a11l75P92M64q13m63O50N56r30n46O82N82l78q71O41N35q8q74K94O29j77
$$ -111 -486 306 770 -43 -506 144 700 -230 -776 -94 488 110 -761 -120 415 327 -547 -253 376 199
3012A99p10J05N65L03q31J26N11Jl78m28O21J35k24n48N47N60m39p95N95J021
$$ 199 -511 -406 159 462 -369 -243 268 269 -109 -537 84 219 -5 -553 -6 554 115 -680 -85 936
3032I36j017l40K40N06k52o20M92O30l54m70Q2P12l67o99L33N39N7o83k86R09
$$ 936 -81 -421 -181 325 73 -547 -55 575 221 -249 -167 545 178 -521 -188 351 408 -275 -561 348
3052C48K68p26n32Q55K60n52m65O70J57l95l56J95M79k94m72M10N04j53m74M0
$$ 348 616 -110 -642 213 473 -79 -544 126 283 -112 -468 -273 206 -88 -560 -150 354 201 -273 -233
3072b33O48j64o62L15M32j32m24l32P89K76r75O6M06J64m05l98N25M03j96l00
$$ -233 415 251 -411 -96 336 204 -220 -552 237 513 -462 -396 10 174 -231 -629 -104 299 103 -197
3092a97K50L32l70l06M73K39l39o73N23O06n60l58J06O27j95o53J78N03j19o0
$$ -197 53 385 15 -291 182 421 82 -591 -68 538 -22 -380 -274 353 158 -495 -317 186 67 7
3112Gm44N95K64o53k30M11M75l28l87L75N16p13k60L51N21n93l56K08O01O8q12
$$ 7 -437 158 422 -231 -461 -50 425 97 -290 85 601 -112 -372 -21 500 -93 -449 -241 360 428 -384
3133c84L5P48J60n02l08N82J26q07k29P67K70p03j07P31J66o84l05O03J42n46
$$ -384 -349 399 559 57 -251 331 457 -350 -579 188 458 -245 -352 379 545 -139 -444 159 301 -245
3153b45mK39M49l43o37M08K09K56o44j03P52l14m58N59M72k34n18l5J68L26l89
$$ -245 -249 -10 439 96 -541 -133 76 332 -312 -415 337 23 -435 124 596 362 -156 -191 -23 303 -86
3174h6k07O10Q5l46l18O18o4j04n67K13N42n23k66N58l2q4m45J94O64p6n09j50
$$ -86 -293 317 402 56 -262 356 292 188 -379 -166 376 -147 -413 145 113 29 -416 -222 442 366 -143 -293
3196b93M70j6l94r1P67k01m24J03M41j08n13J37R6N98p90l88M78O44m89n57N13
$$ -293 177 161 -233 -324 443 242 -182 -79 362 254 -259 -122 -26 572 -218 -606 -128 516 27 -530 -17
3217a7J74r3m34K44K95l9m47K72K1M32n28j84M51k66k36J17J62J53l86k7M53J55
$$ -17 157 64 -370 -126 169 130 -317 -45 -24 408 -120 -304 147 -119 -355 -238 -76 77 -309 -336 117 272
3239B72p44K99K31K33j64o34M76K16k06j15k35N80L3m63k7O51k76n33M17L91k20
$$ 272 -472 -173 58 291 127 -507 -31 185 -21 -136 -371 209 242 -221 -248 403 127 -406 11 402 182
3260A82k14q0L06J20o35J58M79j89l03j52M49l5r3k27M64L10l71j59r5N68m89
$$ 182 -32 -112 194 314 -321 -163 316 127 -176 -328 121 86 -7 -234 230 540 169 10 -85 483 -6
3281fk43N12r6j43K4j35M57j50n00r2M86O2j19l55O01P5l48m04N31n8l4k00K5
$$ -6 -249 263 167 24 48 -87 370 220 -280 -372 114 176 57 -298 303 378 30 -374 157 99 65 -135 -110
3304a10N48m82k7J55N49m40m61L55P3j1l09L20q2J72m64J12L84j46n00L1N87L0
$$ -110 438 -44 -71 84 633 193 -268 87 160 149 -160 160 78 250 -214 -102 282 136 -364 -333 254 284
3326B84k08n38Q22q3k81j57m0L51j69m6L22j0k55J52p3L22j25n23R3M75m70r0
$$ 284 76 -462 360 277 -4 -161 -201 150 -19 -65 257 247 -8 144 71 393 268 -255 -162 313 -157 -247
3348b47J85N4n9l86J85K65K08k48k08L79P9l69k06M12L46n58J1L02L6j47n12M75
$$ -247 -62 -8 -67 -453 -268 -3 205 -43 -251 128 207 -162 -368 44 390 -168 -157 145 181 34 -478 -3
3370cM64n28k57K42L90l47k5J39o6J93l04o2M52p3l28M8M64l52p3k81L35L66n02
$$ -3 461 -67 -324 -82 308 -39 -64 75 9 202 -102 -164 288 215 -113 -65 399 47 -26 -307 28 394 -108
3393a08K47r9K83n30K74q2L54k52k14J81K73m45k66K28L22r7o35M09M50k10k05
$$ -108 139 40 323 -207 67 -15 339 87 -127 54 327 -118 -384 -156 166 69 -566 -157 293 83 -122
3414a22J67K46j18l02k1M19j47j95k05N42j39j58j05J14M80p29m0K31P57o41l79
$$ -122 45 291 173 -129 -150 269 122 -73 -278 264 125 -33 -138 -24 456 -273 -313 -82 675 34 -345
3435c45K83J30j05l02J02O46k70n53K64Q0M07m67j42M31J00n43J82K66L6m55L19
$$ -345 -62 68 -37 -339 -237 409 139 -414 -150 -70 337 -130 -272 159 259 -284 -102 164 200 -255 64
3456F4q0M12n97j24O28j62j7n40M13J29K4l39K20J4J73p04K70K64L50k64k87L68
$$ 64 -16 396 -201 -325 303 141 124 -416 -3 126 150 -189 31 45 218 -486 -216 48 398 134 -153 215
3478B15j22m42J05L39k3k57k00K57K99l25k79L14K16m04N8L86M06n14k97K42K6
$$ 215 93 -349 -244 95 72 -185 -385 -128 171 -154 -433 -119 97 -307 -249 137 543 29 -268 -26 0
3499@R7K24k95K5j52Ll6L43J02m29j20l3M24m07Q5J58q3p2j59L24J03m2k23L46
$$ 0 97 321 26 51 -101 -98 -134 209 311 -118 -238 -271 153 -254 -169 -11 -94 -166 -325 -1 102 60 -163 183
3523A83k08J26K8J18L4j99k25J70K10j27q2R3J12l61R6k58L33J50j04q3R1K95
$$ 183 -25 101 129 247 281 82 -143 27 237 110 28 121 233 -128 -32 -290 43 193 89 6 97 392
3545C92n38k15L74J91l0m45J58J31k60J06q0N34j72m93K68L96j81m33K89J01l13
$$ 392 -146 -361 13 204 174 -271 -113 18 -242 -136 -216 318 146 -347 -79 317 136 -297 -8 93 -220
3566b20k2L64J98k08j94K3K09J76o58n6L66K97k99J24k51M62j29k02J00o7k8k4
$$ -220 -242 122 320 112 -82 -59 150 326 -332 -388 -22 275 -24 100 -151 311 182 -20 80 13 -15 -39
3588c9m1M00o6n92J93L37j63j7P9K10k43k17P1mJ61m5j69kM23k01l36J07L13r6
$$ -39 -80 320 254 -338 -145 192 29 12 91 301 58 -159 -88 -92 69 24 -145 -147 276 75 -261 -154 159 63
3612F3j96J85L03m40J4K86O9k46o1K14N5r4l59J52m4R0p1J05n2K21k16M7K17r2
$$ 63 -133 52 355 -85 -71 215 284 38 -23 191 246 152 -207 -55 -99 -9 -80 25 -27 194 -22 25 242 150
3636A50j64m8k0L18m20N0L21j79M2j33J65J66j7o99O89l3k6k98J1K33K4l33M9
$$ 150 -14 -62 -82 236 -184 -134 187 8 50 -83 82 248 231 -468 221 188 162 -136 -125 108 132 -201 -152
3659a52M63l60J63Q4K82k46l64m8R2L45k25j53J72L11m91j20L61N9l16pK86m49
$$ -152 311 -49 114 198 480 234 -130 -178 -86 259 34 -119 53 364 -127 -247 114 173 -143 -150 136 -313
3681c13M29j49j02L10l81j17K64K73r0m90M11j47L04j02m02M22J32k82n2J12O0
$$ -313 116 -33 -135 175 -206 -323 -59 214 124 -366 45 -102 202 100 -302 120 252 -30 -82 30 90
3702I0rn1l5j18K8k58J76J87k26k56K31N73j39k70J16O9j30j18J30K9j3j83J02
$$ 90 81 30 -5 -123 -95 -353 -177 10 -216 -472 -241 332 193 -77 39 108 -22 -140 -10 19 6 -177 -75
3725g5J17k38K61j44J75j56J93n78N92j32k25M65l77K25k85K6J67L7J81n94L88
$$ -75 42 -196 65 -79 96 -60 133 -445 147 15 -210 255 -122 103 -182 -156 11 48 229 -365 23
3746B3K2j67K66k24K41o1l3k42L39J82l57J47kM0l24q7L55Q5K33n38K42N1N5m06
$$ 23 45 -122 144 -80 161 100 67 -175 164 346 -11 136 134 174 -150 -237 118 203 436 -102 140 191 246 -160
3770a60L13K30m96k16K34r6K78j76K34m02J12K5J86R7j74r7J0K51j24l16J53J23
$$ -160 153 383 -113 -329 -95 -191 87 -89 145 -257 -145 -120 66 163 -11 -108 -98 153 29 -287 -134 -11
3792a1J64k22o6k2J65o4j51P0K47k41J22Q3n9k6j17J5K50j06m8j70KJ23j02%J03
$$ -11 153 -69 -135 -157 8 -56 -207 -137 110 -131 -9 74 15 -11 -128 -113 137 31 -17 -187 -185 -62 -164 -164 -61
3817f1M6N1k46K73R6k21J88k53M81o04N8J99Mj0Q4K97k63J9k65L6mL71p02L58
$$ -61 -15 36 -210 63 159 -62 126 -127 354 -250 -192 7 11 1 85 382 119 138 -127 -91 -95 276 -426 -68
3841f8M24K01p52K95J44k2j99m81O54O8m63M0K86r3J45l78O4L85k73N4kJ21q5
$$ -68 356 557 -195 100 244 222 23 -458 196 264 -199 -159 127 34 179 -199 -135 250 -23 31 29 150 65
3864F5k87K97J93k79k2M2J71Q7o67L53j2M0k13qP6K9O3j92K44J91j40l52L31K38
$$ 65 -222 75 268 -11 -33 9 180 267 -400 -47 -59 -19 -232 -240 -164 -135 -72 -264 -20 171 31 -321 10 248
3888B48m89q4J91J67K79m63P8K73n3l46O6J52J81k37J2J76kk53r3L42m8j17j51
$$ 248 -241 -325 -134 33 312 -151 -73 200 147 -199 -133 19 200 -37 -25 151 149 -104 -197 145 97 -20 -171
3911a71Q5L9P3p9J71K9j09j21L97k13l43o4L80%k80J62P2K07q4k82n0K26J31l42
$$ -171 -86 -47 26 -53 118 147 38 -83 314 101 -242 -306 74 74 -206 -44 28 235 151 -131 -181 45 176 -166
3935a66j4L58N0k63j33K09j2K5M9r9L41l29l32K46J32k2j73j73M04K03n43L94
$$ -166 -180 178 228 -35 -168 41 29 54 103 4 345 16 -316 -70 62 40 -133 -306 98 301 -242 152
3957A52j04j12j85P4K64n7j70L75P2k94J20L0l02K21o5l9K65Om21N5J75J63l78
$$ 152 48 -64 -249 -175 89 32 -138 237 309 15 135 165 -137 84 19 -20 245 251 -170 -115 60 223 -155
3980a55j30M66o0j98l4j01O57m72k77K52L07p9k27P4K3L7Jm7o4K82k58n2j10q2
$$ -155 -285 181 121 -77 -111 -212 445 -27 -304 -52 255 176 -51 23 46 83 84 37 -27 255 -3 -55 -165 -247
4004b47p8L00N08m16J06j63q2L97j1j63k23k6P7n5j95L16J04k04j42K39L6l41
$$ -247 -325 -25 483 67 173 10 -72 325 314 151 -72 -98 -21 -76 -271 45 149 -55 -197 42 78 -263
4026b63J75M7M19n16L58j47j9k57m31M93K83j29P7m1P6K48m16O3R7p0j00M5J30
$$ -263 -88 -41 378 -138 220 73 54 -203 -634 -141 142 13 90 49 125 373 -43 20 117 47 -53 -8 122
4049A22j50J13k34L63n6m33K37L31j59n5k60J95L2k00jM49k20o0k26K47K8Q9l13
$$ 122 -28 85 -149 214 158 -275 -38 293 134 79 -181 14 46 -154 -155 294 74 14 -212 35 63 152 -161
4072a61P8K57m26J84J65j05K4k80J76L77l01pP4L88l66p2r2M25m6n31M4K30j66
$$ -161 -83 174 -252 -68 97 -8 16 -264 -88 289 -12 -19 55 443 77 5 -87 338 292 -239 -195 35 -131
4095a31P8l81N76o4r6P2j20L48j13k08m0M33k84j79J29M5J23l57L71j48K72n88
$$ -131 -53 -434 142 78 -18 54 -66 282 169 -39 -79 354 70 -109 20 65 188 -169 202 54 326 -262
4117b62K92k2N3j76m7Q6K02l64L7N84k98o8l49N65j81j06q7J68J88P3o08K72P
$$ -262 30 8 61 -115 -162 -76 126 -238 -201 383 85 17 -332 233 52 -54 -141 27 215 288 -320 -48 -41
4140d1j36K88k58K14k58J03N4J11K91l60P3j47L42l49L6K18k68P6k00K00k9K8
$$ -41 -177 111 -147 67 -191 -88 -34 77 368 8 81 -66 276 -73 -37 181 -87 -11 -211 -11 -40 -12
4162a2o9k8K24p3k15K77J71k29j68M9K53m5l04N8L88o4m85R2J91K19m99O7k02
$$ -12 -81 -109 115 42 -173 104 275 46 -122 -73 180 135 -169 -111 277 213 -272 -180 11 230 -269 -202 -404
4185d04M80o3k23L10J07k97J50j27K38j68j53M53k90M7n3j63L37l49L1J26J47
$$ -404 76 13 -210 100 207 -90 60 -67 171 3 -150 303 13 60 7 -156 181 -168 -137 -11 136
4206A36L07o11J31O9On3J7k83N05j93j53J86kj41M1m8j33P3m45N07jP9n0N2K49
$$ 136 443 -168 -37 32 38 -15 2 -281 224 31 -122 64 62 -79 -38 -86 -219 -146 -591 -84 -85 -6 -56 -4 245
4231B45j36k23n0j61M48J23l29mL25j87k50K61%l23k7K97K14M0k77k49M92l31
$$ 245 109 -114 -164 -325 123 246 -83 -87 238 51 -199 62 62 -261 -288 9 223 263 -14 -263 229 -102
4253a02J47j5L7k32R6O6M31l72k28Q1M4M29k98k23O8J27j69j1L25l80K3L81j26
$$ -102 45 30 67 -165 -69 -3 428 56 -172 -91 -47 382 84 -139 -71 56 -113 -124 201 -179 -156 225 99
4276I9Q4j47j0J75m0l23K34j12R3q6k38M22l7p8n0k31L28L3Q7l51K90R2j83j78
$$ 99 183 36 26 201 161 -162 72 -40 53 -33 -271 151 114 36 -14 -245 83 116 203 -148 142 234 51 -127
4300a27N07j78l72j71M42r0k29M7R1J8k05J97k1K50l81k3L18K6j33j70M51J33
$$ -127 380 202 -170 -341 101 11 -218 -171 -80 -62 -267 -70 -91 159 -222 -245 73 99 -34 -204 247 380
4322C80m23K66m96K85O6j98j15M88l42q0j19K64K86o36J50L43M0l6j01l26N08
$$ 380 -43 223 -273 12 78 -120 -235 253 -89 -169 -288 -24 262 -374 -224 119 159 123 22 -304 204
4343B04p8j54RJ9j76L05M5L90l99j71m5J64M7j52j93K87J87l17J32J08m2j40j15
$$ 204 126 -28 -19 0 -176 129 174 564 165 -6 -51 113 160 8 -185 102 289 -28 104 212 170 30 -85
4366h5L06j10j13j40o2M44k93j8o4K66j90m8j9K47j19k13L96K1m16J28O8M7J73
$$ -85 221 111 -2 -142 -204 240 -53 -71 -135 131 -59 -107 -126 121 2 -211 185 206 -210 -82 -14 33 206
4389B06l14M8J58j7j6j05k28N76l20k16J66l9M8k08J37J44Q8m22K44o8J49j98
$$ 206 -108 -60 98 81 65 -40 -268 308 -12 -228 -62 -101 -53 -261 -124 20 108 -314 -70 -138 11 -187
4411a87J64J80n1l48K45j5OP1n9j32M42l20j43J74L0m0j12J06nL12m44N7J66J40
$$ -187 -23 157 106 -242 3 -12 -6 65 6 -126 316 -4 -147 27 57 17 -95 11 6 318 -126 -69 97 237
4435B37m26K25j21J7P3j07L46k09j84l0K78p4j05K9K06k54J72j56p8L95p3k60
$$ 237 -189 36 -85 -68 5 -102 244 35 -149 -179 99 25 -80 -51 155 -99 73 -83 -161 234 161 -99
4457i9J02J85l63K32OO7k09L2Q0Q6k49k15M54K01k78J12J02p5l31j52K2K29J13
$$ -99 3 188 -175 57 63 130 -79 -47 33 119 -130 -345 109 310 32 144 246 171 -160 -312 -290 -61 52
4480E2p5p3K78j57j04L8k8L39k88j50J53P2m71K79J74P2Kj23j9pK52k62j3L22
$$ 52 -23 -96 182 25 -79 -41 -69 270 -18 -168 -15 57 -414 -135 39 111 113 -10 -29 -36 216 -46 -59 263
4504B63m62J74J44J6J35n71J47K27j76O2j07L46K16n54J16J58K14m05pP2Or0j12
$$ 263 -199 -25 119 135 270 -301 -154 73 -103 -41 -148 198 414 -140 -24 134 348 -57 -64 8 14 -76 -188
4527a88K25J05q6J33n48L37J9N7j93L69m9l69J5L03o4j29P8O3Mj24N4r4K78k35
$$ -188 37 142 56 189 -359 -22 -3 54 -139 230 181 -188 -173 130 66 -63 15 78 82 -42 12 -82 196 -39
4551c9K0J32N6j32m06L59k9K23l40l1L81p8k84M4K61j94j49M32l9J1l85OJ98j87
$$ -39 -19 113 169 37 -369 -10 -39 184 -156 -187 194 116 -168 -124 137 -57 -206 226 187 198 -187 -181 17 -170
4575a70K10j78J28J59k17J6N6K96l33Q9J21j13L74m62k7L47k16l26J7M3m8J43
$$ -170 40 -138 -10 149 -68 -52 4 300 -33 56 177 64 438 -24 -51 296 80 -246 -229 -186 -234 -91
4597i1j78L23L4j52K57k51K58m60K50J78qk45P5m7k28L03j47M9N9J56Lj74L09
$$ -91 -269 54 88 -64 193 -58 200 -260 -10 168 160 -85 -10 -57 -285 18 -129 -80 -21 135 138 -36 273
4620B73m39J60L3J25l24M7j02j6L71K03m46K70j89k56J89J77pKj19K70l6l84J06
$$ 273 -166 -6 27 152 -172 -125 -227 -243 128 331 -115 155 -34 -290 -101 76 69 71 -48 222 186 -198 -92
4643i2J49P8k49lJ21K89M4m83J76R0j4j83j03L57r5k72K37l8O2j19L47l85K75
$$ -92 57 135 -114 -117 4 293 337 -146 30 120 106 -77 -180 177 82 -190 47 9 71 -48 299 -86 189
4666A89l13J29j10K41k11J08K30l87M13n31K84J07j48J0j79Q8J51m4n2j06J78
$$ 189 -124 5 -105 136 -75 33 263 -124 289 -242 42 149 1 11 -168 -80 71 27 -25 -131 47
4687D7K56l90L68j83k61Q2L9L82m66Q0O2l01M02k88K21m9L2k62J29P4J89q8j8
$$ 47 303 -87 281 98 -163 -81 -42 340 -126 -46 16 -285 117 -171 50 1 33 -229 -100 -26 163 75 57
4710E7p3j44J14j33J96Q5k69M40m25o5K59M1O7p3%R0p7j50q6n3K06Q6j9j38J42
$$ 57 -16 -160 -46 -179 17 102 -167 273 -152 -217 42 83 150 77 77 167 90 -60 -146 -199 7 93 74 -64 78
4735G8q3p1j51K60J5m6j62J75Jn1j49J30K10Q3l99r1N45r5j87j17q5L30k25K05
$$ 78 -5 -76 -227 33 48 2 -160 15 16 -35 -184 -54 156 239 -160 -251 294 199 12 -105 -190 140 -85 120
4759A20Qjk68K96l33K86r8j06J48k3Jk48p2J46M7k5n7J06O9N1k98K13K8m5O1k65
$$ 120 128 127 -141 155 -178 108 10 -96 52 29 30 -218 -290 -144 -97 -122 -179 -73 -4 47 -251 -38 -10 -55 6 -259
4785b59O10J64n72j06K58O2l15J71ok3pr6J19j70J10j3J3L63k89j17M5K52k99
$$ -259 351 515 -57 -163 95 157 -158 13 7 -16 -23 -119 0 -170 -60 -73 -60 303 14 -103 -58 194 -105
4808a05r1K53qk50J94n3J11Qm7j17J07r5J78r2j08L1Rm3k72K27K25m9J0J11j82
$$ -105 -196 57 49 -201 -7 -60 51 59 12 -105 2 -93 85 -7 -115 -84 -75 -118 -390 -163 62 13 23 134 -48
4833d8j0J50J93l43J15Q0k32j42K08J04l5k16K59k50J59l25J73J25K41k22j59
$$ -48 -58 92 285 -58 57 137 -95 -237 -29 75 40 -176 83 -167 -8 -333 -160 -35 206 -16 -175
4854a75J66K80j84l03K57J52j53l1j71O0j73L27j49K8O5r9N0Q1L3p0j2j33K99
$$ -175 -9 271 87 -216 41 193 40 9 -162 -102 -275 52 -97 -69 -4 -103 -53 28 61 -9 -21 -154 145
4877A45j49P4j81J37j20K1J17K2N9mj74L7L9j25J42n7J47j46N4j79L99n64N99
$$ 145 -4 70 -111 26 -94 -73 44 66 125 121 -53 -16 23 -102 40 -17 130 -16 38 -141 258 -306 293
4900B93l48J82j27k08J42N4P3l80L56j01J43j22j0M10l92R3l40M04J52l70K44
$$ 293 -55 127 0 -208 -66 -12 61 -319 37 -64 79 -43 -53 357 -35 58 -282 122 274 -96 148
4921A48k48K48l52L15K2K6j55m1N5j1L32m35J82k30j54L68j17K48J6q1l25J80
$$ 148 -100 148 -204 111 133 159 4 -37 18 7 339 -96 86 -144 -298 70 -47 201 217 136 -189 -9
4943iM3J17k07J36J24j46r3J94o6k94K13J46r7J35j41j54k8j40K58ok1l00J91
$$ -9 34 151 -56 80 204 58 -35 159 93 -201 12 158 61 196 55 -99 -127 -267 -9 -15 -36 -336 -145
4966a45J42O3j42%k45M92p8l42P3J00O3k04J16J22k22K4K46J38j98j66K64k64
$$ -145 -3 60 -82 -82 -327 165 87 -255 -182 -82 -19 -223 -107 15 -207 -183 63 201 3 -163 101 -163
4988a63R9J97n61K89K65j46m7j21%P9J43J51q6J00j24j74j5N7p8K72j27J65j95
$$ -163 -64 133 -428 -139 126 -20 -67 -188 -188 -109 34 185 99 199 75 -99 -114 -57 -135 137 10 175 -20
5011b0j25M01K6k49r1J71L0k84k31K88L8J0q3K97j57J1m5k04L85k58Q6J24j73
$$ -20 -145 256 282 33 -58 113 143 -141 -372 -84 -46 -36 -119 178 21 32 -13 -217 168 -90 -4 120 -53
5034e3J19j83N8K30m08K55k5J46n8Kj02K4K2j56P7K02j36J62m03K00L5N2j04P6
$$ -53 66 -117 -59 171 -237 18 -7 139 81 83 -19 5 27 -129 -52 150 14 176 -227 -27 8 60 -44 32
5058C2q8j86N9J91o9K77l02P3Q2j2j59Q5j22J7J25ln3J40o8J84J65n81L67j31
$$ 32 -56 -242 -183 8 -61 216 -86 -13 69 57 -102 -17 -139 -122 3 0 -53 87 19 203 368 -213 154 23
5082B3r1P4n9j7K06j12J99p1j70O2L2j28m5J22O1j18j93J74L15p3j03j28Q7n1
$$ 23 -68 6 -53 -70 136 24 223 152 -18 44 76 -52 -97 25 86 -32 -225 -51 264 191 88 -40 47 -4
5106dJ21r1nj10j11K34o7l04L93k80K79J50k97J59k96M13j24r9N1Q0m8l2J07l00
$$ -4 117 26 21 -89 -200 34 -33 -337 56 -224 55 205 -92 67 -229 184 60 -39 12 92 44 12 119 -181
5130a81K27j71p2R6k64K87K47l27L31j2K16l14K45m16J6K53J1j6k55J33j36j7
$$ -181 46 -125 -197 -101 -365 -78 169 -158 173 161 377 63 308 -108 -92 161 172 156 -99 34 -102 -119
5152a19M3K5K22j6o32N52k60R4N6J92J41n08J43q8J65K33j93K23j41k06k5J15
$$ -119 -76 -51 171 155 -477 75 -185 -91 -35 157 298 -210 -67 -155 10 243 50 273 132 -74 -99 16
5174A6kn0j3K5J84p9j0n8j6jM5l25M68l71K50k34Q3N1n2K86j45j07j36K77k6K2
$$ 16 14 -36 -49 -24 160 81 71 13 -3 -4 41 -284 184 -187 63 -171 -88 -37 -89 197 52 -55 -191 86 60 82
5200H2j98m0J34M5P4k78N2L30m9m3%M3J3p4J51j53j64k66M13k03R9J13n00M88
$$ 82 -116 -156 -22 23 97 -181 -129 201 152 109 109 152 165 91 242 89 -75 -341 72 -131 -32 81 -419 69
5224F9o3j41K05j20LPJ22j62P0j13L80l61k45M24j52J9j6J97P5j95k5J14j82k0
$$ 69 6 -135 70 -50 -47 -40 82 -80 -10 -123 257 -104 -349 75 -77 -58 -74 123 198 3 -22 92 -90 -110
5248a10J19J6j63p2L54k0J7r2j84M39l18O8R6m30L7M28m4l10N18l78J6lQ1J39
$$ -110 9 25 -138 -210 144 124 141 49 -135 304 -14 54 150 -280 -243 185 141 -169 349 -29 -13 -16 65 204
$$ [...]
8191B0
##END NTUPLES=NMR FID
##END=
