##TITLE=1H_Iba-4
 200.13MHz, DMSO-d6+CCl4,
 8 sc
 
 11.3.2025
##JCAMPDX= 6.0         $$ Bruker NMR JCAMP-DX V2.0
##DATA TYPE= NMR FID
##DATA CLASS= NTUPLES
##ORIGIN= UXNMR, Bruker Analytische Messtechnik GmbH
##OWNER= pz
$$ XWIN-NMR		Version 3.5
$$ Tue Mar 11 16:05:18 2025 Russian Standard Time (UT+4h)  she@DPX200
##.OBSERVE FREQUENCY= 200.1313
##.OBSERVE NUCLEUS= ^1H
##.DELAY= (6, 6)
##.ACQUISITION MODE= SIMULTANEOUS
##.ACQUISITION SCHEME= undefined
##.AVERAGES= 8
##.DIGITISER RES= 18
##SPECTROMETER/DATA SYSTEM= spect
##.PULSE SEQUENCE= zg30
##.SOLVENT NAME= CDCl3
##.SHIFT REFERENCE= (INTERNAL, CDCl3, 0, 14.3821)
##AUDIT TRAIL= $$ (NUMBER, WHEN, WHO, WHERE, WHAT)
$$ ##TITLE= Audit trail, XWIN-NMR		Version 3.5
$$ ##JCAMPDX= 5.01
$$ ##ORIGIN= Bruker BioSpin GmbH
$$ ##OWNER= she
$$ F:/spectra/data/she/nmr/H-C/1/audita.txt
$$ ##AUDIT TRAIL=  $$ (NUMBER, WHEN, WHO, WHERE, WHAT)
(   1,<2025-03-11 16:04:20.56 +0400>,<she>,<DPX200>,
      <created by zg, POWCHK disabled, PULCHK disabled
       configuration hash MD5:
       00 E9 B6 7A A2 85 ED C7 34 08 36 98 17 FE 4E 26
       data hash MD5: 16K
       C2 1B B5 3F 5C 60 04 C6 E2 95 86 8E 7D 92 B9 3D>)
$$ ##END=
$$ 
$$ hash MD5
$$ FA C7 F5 40 AB F9 74 6F E4 9B 19 76 29 AB DF A4
##$RELAX= 
##$RELAX= 
##$RELAX= 
##$RELAX= 
##$RELAX= 
##$RELAX= 
$$ Bruker specific parameters
$$ --------------------------
##$DU= <F:/spectra>
##$EXPNO= 1
##$NAME= <H-C>
##$PROCNO= 1
##$TYPE= <nmr>
##$USER= <she>
##$AMP= (0..31)
100 100 100 100 100 100 100 100 100 100 100 100 100 100 100 100 100 100 
100 100 100 100 100 100 100 100 100 100 100 100 100 100 
##$AQSEQ= 0
##$AQ_mod= 1
##$AUNM= <au_zg>
##$AUTOPOS= <>
##$BF1= 200.13
##$BF2= 200.13
##$BF3= 200.13
##$BF4= 200.13
##$BF5= 200.13
##$BF6= 200.13
##$BF7= 200.13
##$BF8= 200.13
##$BYTORDA= 1
##$CFDGTYP= 0
##$CFRGTYP= 5
##$CHEMSTR= <none>
##$CNST= (0..31)
1 1 145 1 1 1 1 1 1 1 1 1 1 1 1 1 1 1 1 1 1 1 1 1 1 1 1 1 1 1 1 1 
##$CPDPRG= <>
##$CPDPRG1= <>
##$CPDPRG2= <>
##$CPDPRG3= <>
##$CPDPRG4= <mlev>
##$CPDPRG5= <mlev>
##$CPDPRG6= <mlev>
##$CPDPRG7= <mlev>
##$CPDPRG8= <mlev>
##$CPDPRGB= <>
##$CPDPRGT= <>
##$D= (0..31)
0 0.7 0 0 0 0 0 0 0 0 0 0.03 0 0 0 0 0 0 0 0 0 0 0 0 0 0 0 0 0 0 0 0 
##$DATE= 1741694659
##$DBL= (0..7)
120 120 120 120 120 120 120 120 
##$DBP= (0..7)
150 150 150 150 150 150 150 150 
##$DBP07= 0
##$DBPNAM0= <>
##$DBPNAM1= <>
##$DBPNAM2= <>
##$DBPNAM3= <>
##$DBPNAM4= <>
##$DBPNAM5= <>
##$DBPNAM6= <>
##$DBPNAM7= <>
##$DBPOAL= (0..7)
0.5 0.5 0.5 0.5 0.5 0.5 0.5 0.5 
##$DBPOFFS= (0..7)
0 0 0 0 0 0 0 0 
##$DE= 6
##$DECBNUC= <off>
##$DECIM= 32
##$DECNUC= <off>
##$DECSTAT= 4
##$DIGMOD= 1
##$DIGTYP= 9
##$DL= (0..7)
0 120 120 120 120 120 120 120 
##$DP= (0..7)
150 150 150 150 150 150 150 150 
##$DP07= 0
##$DPNAME0= <>
##$DPNAME1= <>
##$DPNAME2= <>
##$DPNAME3= <>
##$DPNAME4= <>
##$DPNAME5= <>
##$DPNAME6= <>
##$DPNAME7= <>
##$DPOAL= (0..7)
0.5 0.5 0.5 0.5 0.5 0.5 0.5 0.5 
##$DPOFFS= (0..7)
0 0 0 0 0 0 0 0 
##$DQDMODE= 0
##$DR= 18
##$DS= 0
##$DSLIST= <SSSSSSSSSSSSSSS>
$$ [...]
##$SUBNAM0= <"">
##$SUBNAM1= <"">
##$SUBNAM2= <"">
##$SUBNAM3= <"">
##$SUBNAM4= <"">
##$SUBNAM5= <"">
##$SUBNAM6= <"">
##$SUBNAM7= <"">
##$SUBNAM8= <"">
##$SUBNAM9= <"">
##$SW= 18.0517328524113
##$SWIBOX= (0..15)
0 0 2 0 0 0 0 0 0 0 0 0 0 0 0 0 
##$SW_h= 3612.71676300578
##$TD= 16384
##$TD0= 1
##$TE= 0
##$TE2= 300
##$TE3= 300
##$TEG= 300
##$TL= (0..7)
0 120 120 120 120 120 120 120 
##$TP= (0..7)
150 150 150 150 150 150 150 150 
##$TP07= 0
##$TPNAME0= <>
##$TPNAME1= <>
##$TPNAME2= <>
##$TPNAME3= <>
##$TPNAME4= <>
##$TPNAME5= <>
##$TPNAME6= <>
##$TPNAME7= <>
##$TPOAL= (0..7)
0.5 0.5 0.5 0.5 0.5 0.5 0.5 0.5 
##$TPOFFS= (0..7)
0 0 0 0 0 0 0 0 
##$TUNHIN= 0
##$TUNHOUT= 0
##$TUNXOUT= 0
##$USERA1= <user>
##$USERA2= <user>
##$USERA3= <user>
##$USERA4= <user>
##$USERA5= <user>
##$V9= 5
##$VALIST= <valist>
##$VCLIST= <CCCCCCCCCCCCCCC>
##$VD= 0
##$VDLIST= <DDDDDDDDDDDDDDD>
##$VPLIST= <PPPPPPPPPPPPPPP>
##$VTLIST= <TTTTTTTTTTTTTTT>
##$WBST= 1024
##$WBSW= 4
##$XGAIN= (0..3)
0 0 0 0 
##$XL= 0
##$YL= 0
##$YMAX_a= 73786
##$YMIN_a= -75116
##$ZGOPTNS= <>
##$ZL1= 120
##$ZL2= 120
##$ZL3= 120
##$ZL4= 120
##$ABSF1= 10
##$ABSF2= 0
##$ABSG= 5
##$ABSL= 3
##$ALPHA= 0
##$AQORDER= 0
##$ASSFAC= 0
##$ASSFACI= 0
##$ASSFACX= 0
##$ASSWID= 0
##$AUNMP= <proc_1d>
##$AZFE= 0.1
##$AZFW= 0.1
##$BCFW= 1
##$BC_mod= 2
##$BYTORDP= 1
##$COROFFS= 0
##$CY= -3
##$DATMOD= 1
##$DC= 2
##$DFILT= <>
##$DTYPP= 0
##$F1P= 0
##$F2P= 0
##$FCOR= 0.5
##$FTSIZE= 0
##$FT_mod= 4
##$GAMMA= 1
##$GB= 0.15
##$INTBC= 1
##$INTSCL= 1
##$ISEN= 128
##$LB= 0.25
##$LEV0= 0
##$LPBIN= 0
##$MAXI= 10000
##$MC2= 0
##$MEAN= 0
##$ME_mod= 0
##$MI= 1.114404
##$NCOEF= 0
##$NC_proc= 0
##$NLEV= 6
##$NOISF1= 3.799351
##$NOISF2= 2.8
##$NSP= 1
##$NTH_PI= 0
##$NZP= 0
##$OFFSET= 14.38212
##$PC= 1
##$PHC0= -471.16
##$PHC1= 16.19221
##$PH_mod= 1
##$PKNL= yes
##$PPARMOD= 0
##$PSCAL= 0
##$PSIGN= 0
##$REVERSE= no
##$SF= 200.129724274929
##$SI= 16384
##$SIGF1= 3
##$SIGF2= 2
##$SINO= 400
##$SIOLD= 16384
##$SREGLST= <1H.CDCl3>
##$SSB= 0
##$STSI= 0
##$STSR= 0
##$SW_p= 3205.1282051282
##$SYMM= 0
##$S_DEV= 0
##$TDeff= 0
##$TDoff= 0
##$TI= <>
##$TILT= no
##$TM1= 0
##$TM2= 0
##$TOPLEV= 0
##$USERP1= <user>
##$USERP2= <user>
##$USERP3= <user>
##$USERP4= <user>
##$USERP5= <user>
##$WDW= 1
##$XDIM= 8192
##$YMAX_p= 0
##$YMIN_p= 0
$$ End of Bruker specific parameters
$$ ---------------------------------
##NTUPLES= NMR FID
##VAR_NAME=  TIME,          FID/REAL,        FID/IMAG
##SYMBOL=    X,             R,               I
##VAR_TYPE=  INDEPENDENT,   DEPENDENT,       DEPENDENT
##VAR_FORM=  AFFN,          ASDF,            ASDF
##VAR_DIM=   8192,          8192,            8192
##UNITS=     SECONDS,       ARBITRARY UNITS, ARBITRARY UNITS
##FACTOR=    0.0002768,     1,               1
##FIRST=     0,             0,               0
##LAST=      2.2672688,     0,               0
##MIN=       0,             -75116,          0
##MAX=       2.2672688,     73786,           0
$$ Real data points
##PAGE= N=1
##DATA TABLE= (X++(R..R)), XYDATA
$$ [...]
2005f0r91J194J213j193j691J352J612j122j998J127K326j186k191P09K537k66
2021A372k666k84K865N31k703n15K201J098k524j190K339J092j428j518J065J842
2037A577j342j415R31J387j018j276Q22J468p70j631O65J695o83j638L55K227
2053A354l10k051k70K102N16k098o89K053N29j989q51J879J503j944j630J912
2069A6J620j406j841J017K298j211j653L26K312k76k444J19K061J20j752m49K313
2086A170J31j903k37J269O32j613m30J393O32j524p64J382R21r11j512J475J337
2103A448j412j588J368J763r56k456P31K127K01j985n24K226L85k189n49J950
2119E40J046k034q80J579Q08j108j163J299R81j424j198J180J520q28j402O87
$$ plain form
2005 -60 -1051 143 1356 163 -1528 -176 1436 314 -1684 -557 1769 583 -1608 -899 1638 1372
2021 1372 -1294 -1578 1287 1818 -885 -1400 801 1899 -625 -1815 524 1616 188 -1330 -265 1577
2037 1577 235 -1180 -249 1138 120 -1156 -334 1134 364 -1267 -602 1093 410 -1228 -873 1354
2053 1354 1044 -1007 -1277 825 1341 -757 -1446 607 1136 -853 -1704 175 1678 -266 -1896 16
2069 16 1636 230 -1611 -594 1704 493 -1160 -834 1478 1202 -1242 -1123 938 1058 -694 -1143 1170
2086 1170 1301 -602 -839 430 1062 -551 -981 412 1044 -480 -1244 138 1059 148 -1364 111 1448
2103 1448 36 -1552 -184 1579 623 -1833 -1102 1025 1226 -759 -1283 943 1328 -861 -1410 540
2119 540 1586 -448 -1328 251 1059 -49 -1212 87 1068 -356 -1554 -374 1146 318 -1084 -397
2135c97J702j115j387O63J797m62j959J13K246j75j659k32J723k32j572m14K026
2152F66L51j384j023K040P58j508j165J594J260j622j843J390J935o88k014O11
2168f42K075q42j523K8J693J60j621j87J553J12j532k88J468M88j756l64J356
2185A78J050j467p98J358Q93j510j106J148J746j179j683R76J885r26j848P98
2201d85J748p80k078J012J731m78j472q3J449N61j669l74J712L67j314j407J615
2218E5J385j528j048J041J196r37j192P84J277n57j355J95J883p43j454M22J489
2235I13l90j321J23J631M2k023p8J579P45j507p33J298J012j687q61J348J099
2252A190r05j484Q69J476r31j444P60J603m07j643L07J483k31j341j56J779P6
$$ plain form
2135 -397 1305 190 -1197 -534 1263 801 -1158 -1045 1201 1026 -633 -865 858 626 -946 -1360 666
2152 666 1017 -367 -1390 650 1408 -100 -1265 329 1589 -33 -1876 -486 1449 761 -1253 -642
2168 -642 1433 591 -932 -904 789 949 -672 -859 694 806 -726 -1014 454 942 -814 -1178 178
2185 178 1228 -239 -1037 321 1214 -296 -1402 -254 1492 313 -1370 -394 1491 565 -1283 -485
2201 -485 1263 483 -1595 -583 1148 670 -802 -885 564 1125 -544 -918 794 1161 -153 -1560 55
2218 55 1440 -88 -1136 -95 1101 164 -1028 -244 1033 476 -879 -684 1199 456 -998 -576 913
2235 913 523 -798 -675 956 998 -1025 -1103 476 1221 -286 -1019 279 1291 -396 -1257 91 1190
2252 1190 285 -1199 -330 1146 215 -1229 -469 1134 727 -916 -609 874 643 -698 -854 925 1001
2269A001j688k26J703J63j387l57J231O60j358n88J166Q21j173j024J115R92p22
2286C29j460J157J247j096j213O93J554q70j478L48J829m27j551r0J523O49k007
2303h63k18J740M40j384q78J270P78j027o66J074O73j142o86Q36J304j353j059
2320a161R88J231m94j658P22J259j21j654J53J439K65j639j05J276O26j567p94
2337a234J456Q35j194p87J212N52j002p38J165Q03r35j121Q12J065n23j403P33
2354c04J380m13j467oJ527L20j859q5J134M16j128m26J293L81j300j90J128M62
2372H63j079m86J073N18r13j226J213R86p27j139K72J366j21j635N97J175K7j571
2390h07L8J443Q9j391K7J046J96j144m54J320M71j203n84R17P27o35j166J224
$$ plain form
2269 1001 -687 -913 790 953 -434 -791 440 1100 -258 -846 320 1141 -32 -1056 59 1051 329
2286 329 -1131 26 1273 177 -1036 -343 1211 341 -1137 -789 1040 613 -938 -1028 495 1144 -863
2303 -863 -1081 659 1099 -285 -1163 107 885 -142 -808 266 939 -203 -889 -53 1251 -102 -1161
2320 -1161 -173 1058 564 -1094 -372 887 766 -888 -735 704 969 -670 -775 501 1127 -440 -1234
2337 -1234 222 1057 -137 -924 288 840 -162 -900 265 1068 133 -988 -176 889 366 -1037 -304
2354 -304 1076 663 -804 -810 717 1037 -822 -907 227 643 -485 -911 382 763 -537 -727 401 863
2372 863 -216 -702 371 889 -24 -1250 -37 949 222 -917 -645 721 600 -1035 -438 737 764 -807
2390 -807 -769 674 763 -628 -601 445 641 -503 -957 363 834 -369 -953 -36 691 56 -1110 114
2408A14P24p76j115R06J330q78j266N38J152k62j053m8J167L28j588J93J097J00
2426F63j003m50J226M18j364m42J438L75j045j106J335N80o07j284J073J268q73
2443B02j150N96J025m20p29L36P21k82j010J10J094j20q00n0R48N18j338k98J051
2462D04L43q57l53O13Q10q03j352J365R33r33j270P05J112m12r53L14J038m15
2480B89r30K34J291k93j099j2J265m44p74k62J394J40j473j53Q75O35p66o51Q62
2499A28R57r92r10P05P25n11o74K43J091n24r21L73Q25Kj071M3J145j64j146l63
2519a039J606J77j270k41J172M01p88p63J090O03p34r10P83O67p23q02N85J030
2537H44q74o14N45Q76o17q18K38R40m50m52j26R09K23r86j60P43N31j101k84P90
$$ plain form
2408 114 838 62 -1053 -147 1183 305 -961 -423 729 467 -586 -634 533 861 -727 -534 563 663
2426 663 -340 -790 436 854 -510 -952 486 861 -184 -1290 45 625 18 -1266 -193 1075 202
2443 202 -948 -352 673 253 -476 -140 581 299 -711 -601 493 373 -427 -477 471 989 -349 -647 404
2462 404 747 -110 -463 150 960 157 -1195 170 1103 170 -1100 -395 717 305 -648 -334 704 289
2480 289 -641 -407 884 591 -508 -520 745 301 -473 -735 659 799 -674 -827 48 683 -83 -734 128
2499 128 1085 93 -817 -112 613 102 -572 -329 762 238 -683 -310 515 517 -554 -511 634 470 -676 -1039
2519 -1039 567 744 -526 -767 405 806 18 -745 345 948 214 -696 87 754 31 -771 -186 844
2537 844 -30 -644 -99 777 160 -658 -420 520 70 -382 -508 401 624 -362 -522 221 752 -349 -633 157
2557A57N36r34m25Q26P86r91o36N27Q39n43q29Q03M18j43j230M45R82l64r23P8
2577f21J244j83r13L2R57L74j146j33O80L59j005l78Q82N98q76m53N25P22n40
2596A25r95P88Q86l82r91J24R51j47r48Q3R14L39j440L43P69M1n63o45J074J92
2616E18p11k70R72j30p11l94O62P55p77p23P73P95o78q16N35J228p20j135O20
2635b07P35k50j086L36J167p44k34l29R85k36p41R0P51L66p05o38R76M77q55l77
2655e19O03P87r89m42N37Q84o61p00K26R22j46j110M17O93l56n81O2Q71R6j077
2675d83R8O46K22q45p2P76L15r57k70P53L67o65n85M77O77n23l67J91O94l84n75
2696e10N3P46Q3o55l7P43o3o86N9P95j12r24j29O23M78o31m03Q27j5l62l84L71
$$ plain form
2557 157 693 -241 -666 160 946 -45 -681 -154 685 142 -687 116 534 391 -839 -394 588 224 -699 -621
2577 -621 623 440 -473 -441 516 890 -256 -389 291 650 -355 -733 149 747 -129 -582 -57 665 125
2596 125 -870 -82 804 422 -569 -445 506 359 -589 -506 408 747 -693 -350 419 460 -103 -748 326 518
2616 518 -193 -463 509 379 -332 -726 -64 691 -86 -809 -36 759 81 -735 -200 1028 308 -827 -207
2635 -207 528 278 -808 -472 695 -49 -283 -612 373 137 -604 -514 237 603 -102 -740 236 713 -142 -519
2655 -519 84 871 -118 -560 -23 861 200 -500 -274 648 502 -608 -191 502 146 -435 -373 498 594 -483
2675 -483 -385 261 483 -362 -434 342 657 -300 -570 183 550 -115 -700 -223 454 -69 -436 -245 449 65 -510
2696 -510 -457 289 372 -283 -320 423 360 -326 -267 528 416 -508 -637 -14 464 -167 -570 257 242 -120 -504 -133
2718a33Q83q38o00M40O80l49m18PP81l65n76L25M63j55m35n4Q27j71o28l88J040
2739C36M38j149J79M32L14p70k96N03M13n11l11L81P42o08m78L95O83l54r29L92
2759a98O38m94o01M40P76m73m57O7Q90o8o19k29N29K9l13m32O50M58n77o00P22
2780A38L27m54n13M95N68p40k26R5O26j18m18J23O41k91q49N9J035o0r68O9P63
2801C02j3l66k96N47M33r53j74P14J73o45l08O22K57jr14P66L07k55m39p9Q08
2822D86l34n88pQ82m9q75N45M03j15o68QO36J24p37j52M80O51o69n74K95R06p94
2844a46m67O58L89j96p12M9N73k18l61J82O38p0o95J21P07m04j20k77O08K09o48
2865a80l30P11K60n67k26L48L76l66k87L20M13l80l52K68L39k54n64K62P75j49
$$ plain form
2718 -133 750 -88 -688 -248 432 83 -335 -328 453 88 -488 -163 300 145 -290 -344 483 312 -316 -704 336
2739 336 774 -375 -196 236 550 -220 -516 -13 400 -111 -422 -41 701 93 -385 10 693 339 -590 -198
2759 -198 440 -54 -655 -215 561 88 -369 -302 588 520 -99 -328 201 230 -83 -515 135 593 16 -584 138
2780 138 465 11 -502 -7 561 -179 -405 -310 316 198 -220 -97 544 253 -596 -537 498 438 -530 -461 302
2801 302 289 -77 -373 174 607 -346 -520 194 367 -278 -586 36 293 292 -622 144 451 196 -243 -322 486
2822 486 152 -436 -443 439 390 -485 60 463 348 -320 -312 324 448 -289 -441 39 690 21 -553 -258 648 -146
2844 -146 -613 45 434 238 -474 -425 148 -70 -431 -249 389 319 -376 -255 452 48 -72 -349 259 468 -180
2865 -180 -510 201 461 -106 -332 16 392 26 -261 59 472 92 -260 8 347 93 -471 -209 566 417
2885D17p75L00N16l81p4j49Q40n15m17k37L03M54o81L96p5L72n34l88N88M76n03
2906f7m05M14K64j64j71J12J73N0o35K42K09J38n24O1O39l27j12l22O56J45n84
2927b08k03P30r3o68J82K07K52m80k82L44O63o86k55N09M37l71n91P27K23l84
2947E3k93M80K93p2p49J7O79p0m73k24N50J24l16m31O42M10o41l48M74K05k50
2968F0o52P31K26j07k75k56O16j59p11M24N09k38k40j40L92l6k15l11N46L37q17
2989c16j34P94P4n04j60K76Q4j98j80L14L91l73l64O2O57k64m34L78j8J24o76
3010d67M44J20J72n83K33L73l44m16L46K83L82p26m42O30M95n99Ok70N69k3p89
3031f06N21N05m5o64K92K80n4l13J60O1K30n31r7N48J5m92KK27L92p60L34L3J25
$$ plain form
2885 417 -358 -58 458 77 3 -146 694 179 -238 -475 -172 282 -399 -3 -78 294 -240 -628 -40 436 -67
2906 -67 -472 -58 206 42 -129 -17 156 206 -429 -187 22 160 -364 -303 336 9 -103 -425 231 376 -208
2927 -208 -411 319 226 -442 -260 -53 199 -281 -563 -219 444 -242 -497 12 449 78 -513 214 437 53
2947 53 -240 240 533 461 -288 -271 408 338 -135 -359 191 315 -1 -432 210 620 -21 -369 105 310 60
2968 60 -592 139 365 258 -17 -273 343 184 -527 -103 406 168 -72 -212 180 144 -71 -382 164 501 -316
2989 -316 -450 344 418 -86 -246 30 114 -84 -264 50 441 68 -296 -234 423 159 -275 103 85 209 -467
3010 -467 -23 97 269 -314 -81 292 -52 -468 -122 161 543 -183 -625 5 500 -99 -93 -363 206 183 -606
3031 -606 -85 420 375 -289 3 283 229 -84 76 137 367 -164 -261 287 302 -190 -188 39 431 -329 5 38 163
3054A63k60k33L36L87k64o02M20K59n25r4L80N64l55l00J22N55l74o34M68J54
3074A67J07l98p7K60K52k60l41Q33m35j76k2J80R9n14J67L47K82m67r8k3M75l62
3096dj50j90P31k71l75q9P77O4r00M70L45l82j48k69M87J7k28O0K87k78J37j13
3118b2p8M26m65l01M18N93m08k76J19O40n44n86M49K76n3n26K49J11L07p75L58
3139h8J76J79l99k20O22k57p6M4K49M0p0n55R1M12k87j70J55K05n7l42K96M33
3161C81q4m53l7N36p4o71K33L49k7l76K3J73M13p44n5L55R2j36k95M60N4ok78
3184a67K7L78k82m39K15M95l72K0R4O00n03l04M05k75K60k63J58M2L33n54k16
3205c48N58J51k41o90P67K52l57j11j25L91k20j70k0L48p5r8o5J78l40K0N0K63
$$ plain form
3054 163 -97 -330 6 393 129 -473 -53 206 -319 -413 -33 531 176 -124 -2 553 179 -455 13 167
3074 167 274 -124 -201 59 311 51 -290 543 108 -68 -90 90 189 -325 -158 189 471 4 -94 -117 358 -4
3096 -4 -154 -344 387 116 -259 -348 429 493 -407 63 408 26 -122 -391 96 113 -115 -55 232 -46 91 -22
3118 -22 -100 326 -139 -440 -22 571 163 -113 6 646 102 -484 -35 241 188 -338 -89 22 329 -446 -88
3139 -88 88 267 -132 -352 270 13 -63 -19 230 270 200 -355 -264 148 -139 -309 -154 51 -6 -348 -52 381
3161 381 297 -156 -193 343 269 -402 -169 180 153 -223 -200 -27 386 -358 -413 -58 34 -102 -397 63 117 111 -167
3184 -167 -140 238 -44 -483 -268 227 -145 -125 -31 569 66 -238 167 -108 152 -111 47 89 422 -132 -348
3205 -348 210 361 120 -570 197 449 92 -19 -144 247 27 -143 -163 185 110 12 -53 125 -215 -195 -145 118
3227A18J32o39K75K05P0l29o3O33k21k96j26K73K66n23P1L16N4j19j62J13L30
3248C78j22n47L09J59j30k6K35p8k15j46O2M45M5l72j46K14J42k21j90L99p3l36
3270b14J6L69J63k20r1o7K06j99k64M00p9R3n23K00N00j05l56k16O89j00m39j11
3292c48M97p6m08p0L41K60k10j9K12l50N6L7J11J53q9k83P4M58l31l64J89K85
3314A25j97j01J17K96k9l88R8L06L3m68J74K33r0J47n39K10K96k86k18K50K80
3335B49k50j29j3J71k57j18L48J38j45j18k34L56K98n29j85N74r7k2l30L06R6
3356A09l75K71K86K6k26k01k12K82J71j74J91j7Ol42K13L52k46j64J5K60j27k45
3378a47j39O92k89k70l18N01j19r3K41O5K7k68j86M43R5k83j03K54J1j54rj41
$$ plain form
3227 118 250 -389 -114 91 161 -168 -231 402 181 -115 -241 32 298 -225 -154 162 216 97 -65 48 378
3248 378 256 -291 18 177 47 21 256 178 -37 -183 -121 324 369 -3 -149 65 207 -14 -204 195 122 -214
3270 -214 -198 171 334 114 23 -44 162 -37 -301 99 20 113 -410 -210 290 185 -171 -387 302 202 -237 -348
3292 -348 149 73 -335 -405 -64 196 -14 -33 179 -171 -115 -78 33 186 97 -186 -112 346 15 -349 -160 125
3314 125 -72 -173 -56 240 211 -177 -79 227 260 -208 -34 199 109 256 -283 -73 223 -63 -281 -31 249
3335 249 -1 -130 -143 28 -229 -347 1 139 -6 -124 -358 -2 296 -233 -418 156 59 37 -293 13 109
3356 109 -266 5 291 317 91 -110 -322 -40 131 -43 148 131 137 -205 8 360 114 -50 -35 225 98 -147
3378 -147 -286 406 117 -153 -471 30 -89 -182 59 124 151 -117 -303 140 235 -48 -151 103 114 -40 -49 -190
3400a90K67r0k00J16L19k06N6k25K48j5m7j09J52o6j47m5M21jk66J22j6K5j32
3423b9L3R2J93l65j96N22k3l18k5O1M06q3k87k27N41J93m37k31K87j5k61R2K82
3446B05j55j73J65L05k77m9r9L30K7m21k9J26L24q9m24L63M1k17j54q3O80n58
3468a62j29N5L41J19n55LK55J71l99J25L13k27l16K86j57L29j14m7J09K11p0l90
3490b49L06L19k62l21j2K11R1j94J10l8k29P4M0K35j96K66N9k5Nj73P4P1J17k11
3514F8l76N43k94j10n0K20L14m68K43k35L22j54J14j55J14J71l82l17O94r4l49
3535a81P4N4J85k68J92J9Q7k16l43K66K41k26j49J02J52M3o5j01j4J96o7J41Q2
3558B04j25j64j85r1L39j90l8M73n6k15n7n8L54j88K40m32K09l5p5J59ql18p4
$$ plain form
3400 -190 77 -13 -213 -97 222 16 72 -153 95 80 33 -76 76 10 -137 -182 239 238 -28 94 78 103 -29
3423 -29 4 96 289 -76 -272 250 227 -91 -116 -55 351 268 -19 -246 295 488 51 -180 107 92 -169 -77 205
3446 205 50 -123 42 347 70 21 -78 252 279 -142 -171 -45 279 190 -234 129 170 -47 -201 -284 396 -162
3468 -162 -291 -236 105 224 -331 -328 -73 98 -301 -176 137 -90 -406 -120 -277 52 -62 -109 0 211 141 -249
3490 -249 57 376 114 -207 -219 -8 83 -111 -1 -39 -268 -194 -154 81 -115 151 210 185 190 17 91 162 279 68
3514 68 -308 235 -59 -169 -219 1 315 -153 90 -145 177 23 137 -18 96 267 -115 -432 262 168 -181
3535 -181 -107 -53 132 -136 56 75 162 -54 -397 -131 110 -116 -265 -163 -11 32 -33 -134 -148 48 -19 122 204
3558 204 79 -85 -270 -361 -22 -212 -250 223 167 -48 -105 -163 191 3 243 -189 20 -15 -90 69 61 -257 -331
3581c31L67J14Lq2j44M45m19n2R9K03k7k4m22L83J93m32L1K03K12o69L90m0N8
3604E9j59Oj53L46k16P8J25J16k62k94K85Q8J5m20O75k90Q9m18L65j65K65J43
3626B78m44J08L60m00n5R2K88k41m6J06K03m08n6L05p3r9j76L90j80p7J28l01
3648b98K46J78j51j08K81j88k38J67J32K16m18k06K14N7O8J4j14M56j49m80L95
3669G4R6k51j71J00K49j09k7L12m2k4j35m86L96L5m09M60J61j44r3R3O3o3K7j68
3693e6J05R4p5qN8K39m06m7J03K23n36K30J43L4J48l91N9J65L2L2r1k4j42Mn1
3718a58J71j37J97l89K83O3p0J29P7J35K2m33Q7L04l32j9j68K64K02o11L71o6
3740g8K27k23J04n2J2j00M50l89K40ml92K53N9r3l02J03L56k42K54j28j2Q2j03
$$ plain form
3581 -331 36 150 153 71 -73 372 -47 -99 0 203 176 152 -270 113 306 -126 -95 108 320 -349 41 1 59
3604 59 -100 -94 -247 99 -117 -39 86 202 -60 -354 -69 19 34 -386 289 -1 88 -330 35 -130 135 278
3626 278 -166 -58 302 -98 -153 -61 227 -14 -60 46 249 -159 -215 90 17 -82 -258 132 -48 -125 3 -298
3648 -298 -52 126 -25 -133 148 -40 -278 -111 21 237 -181 -387 -173 -116 -48 -34 -148 308 159 -321 74
3669 74 170 -81 -252 -152 97 -12 -39 273 231 207 72 -414 -18 17 -392 68 229 85 -8 85 148 85 112 -56
3693 -56 49 143 68 60 118 357 -49 -96 7 230 -306 -76 67 101 249 -142 -83 82 114 146 55 31 -111 -107 -158
3718 -158 13 -124 73 -316 -33 30 -40 89 166 301 323 -110 -23 281 -51 -70 -238 26 228 -383 -12 -78
3740 -78 149 -74 30 -22 -10 -110 340 -49 191 187 -205 48 107 14 -288 -185 171 -71 183 55 43 125 22
3763B2m2L43k56k84k98P24j82O5n0K7j21j91J74M25p1k58l33L22j9Q2j08k56L05
3786B0J99j93Q6o5j81J19M9n7M2o2j62J87qk7K86k99p8J06p8P9J01r0o3R2J66
3811A69J32m78L77Q0l95K64r6j38j38O7j24N85k51k58K3M10n7l22R6J52J26n58
3833c34J04L53L8l03k92O22l6l54L11J24j72p9j84K75k83M71l49K1n3L75j07k51
3855a03J14M23p89K78M06k0p77L17L08j53k28J8M50k37l0l34L44K22r5k88K76
3876A02j20K14j90K11l9j94j60J50pL46p6m16R9P9M1p1J46%j84J18j11K76n13
3899b99M57l81K12R5o8K89n87M45m41J33K14j66j8q2L15K45l38lP5P6k44n1J55
3922C3k58K3L04M1j05j52O2J44L43j38l46L44l24j7j06J49J07k77N4J59j89J41
$$ plain form
3763 22 -20 323 67 -217 -515 209 27 92 42 69 -52 -243 -69 356 285 27 -306 16 -3 79 -29 -285 20
3786 20 219 26 112 47 -134 -15 34 -23 19 -43 -205 -18 -26 -53 233 -66 -144 -38 -116 -37 64 -26 -89 3 169
3811 169 301 -177 200 280 -115 149 53 -85 -223 -156 -280 305 54 -204 -181 229 172 -150 -54 98 224 -334
3833 -334 -230 123 161 -142 -434 188 152 -202 109 233 61 -18 -202 73 -210 261 -88 -67 -120 255 148 -103
3855 -103 11 434 -355 -77 329 309 -468 -151 157 4 -224 -206 244 7 -23 -357 -13 209 114 -174 102
3876 102 -18 196 6 217 178 -16 -176 -26 -33 313 237 -179 -80 -1 40 -31 115 115 -69 49 -62 214 -299
3899 -299 158 -223 -11 84 16 305 -282 163 -278 -145 69 -97 -115 -197 118 363 25 22 97 173 -71 -122 33
3922 33 -225 -202 102 143 38 -114 -52 92 435 297 -49 295 -29 -46 -152 -3 104 -173 -119 40 -149 -8
3944ho5j06K09K9J2l08K49L7j53K40k25l1L0oJ98K41l96J08o1K00j32J59n3m1
3968A27k50j04N2J84O0l08N24k97P8J49L7j21k25m5k31N44k50O5k29M07j25j39
3990i7m1J44k84o5L98k79K54k25K95r6Q8j93J21r0o9K77l50M9J41N1j71L39L4
4013B31l0k48J58L5K3l44J66J30N2l8m30J98K29j49j65K17j17J23j77J42N1j50
4035i3r3J2J50l8K56j49R5L0J8j07j46K24l95J65Q3l55J71K30K31m87J87n0J41
4058H0K08o21Q3J47L18q6j66J89k3j05k12L03k34J79o6m4L82k05r2j0NK92m05
4081h3R4l8J81k84J74k80L79k48J36m09L78J5j55K13q6J56k47N7J67j18k00J40
4103e8j3J61l32PM1M05l76J28L3k37J02J70k08J70J00j20n8Q7kl57K97K54m91
$$ plain form
3944 -8 -73 -179 30 59 71 -237 12 49 -104 136 -89 -120 -90 -96 102 343 -53 55 -6 194 62 221 168 127
3968 127 -123 -227 -175 9 69 -239 285 -12 66 215 252 131 -94 -139 -370 174 -76 -11 -240 167 42 -97
3990 -97 -138 6 -278 -343 55 -224 30 -195 100 4 92 -101 20 -70 -139 138 -212 -163 -22 29 -142 197 231
4013 231 201 -47 111 146 169 -175 -9 121 173 135 -295 -97 132 -17 -182 35 -82 41 -136 6 57 -93
4035 -93 -186 -174 -24 -62 194 45 140 170 188 81 -65 159 -236 -71 12 -343 -172 58 289 -198 -11 -61 80
4058 80 288 -333 -250 -103 215 129 -37 152 129 24 -188 115 -119 60 -6 -50 332 127 35 25 30 322 -83
4081 -83 11 -27 154 -130 44 -236 143 -105 31 -378 0 15 -140 73 -13 143 -104 -47 120 2 -198 -58
4103 -58 -71 90 -242 -235 -194 211 -165 -37 -4 -241 -139 31 -177 -7 93 -27 -85 2 0 -357 -60 194 -297
4126b97L94j2j53J39J47j43r7J67j43J9M2k15M4k20L10R5j03J78l58K64J4k71
4148a99K17J35M4k00j21K39k79M60k94j23J00q8JJ62k1j24J08j28J59J9j40j75
4170b48Q5L05m96K85K15r6K9l07K08J39l36K53k75J18L23j61j21J64K5q6j11J48
4192F0j60j41K19j2J46k79j2O8LO2N8j69J42j18J32QP4K98l45o7k3NK07K2k44
4217f6K63j76j05j32K07Lj58J61J75j34R3P7N8l62J07L6l8r8K64k46L0J31n3m6
4241iK9K5J31j87M72o41L39r9j14lQ0j51Nk6m4Q2L33o1j06K9J66m12k4L18p2J86
4267B46l79J60PR2R3j72ln8N4R1m7l6j46k12M04J62J4k67R4O6k77J11J93Q2P9
4292C51l93J37k64j01L45j54K25j2j21J42k69l5M12n35K6L34j85J41K1R9k00j8
$$ plain form
4126 -297 97 85 -68 71 218 75 -22 145 2 21 63 -152 -108 -328 -18 77 -26 152 -206 58 72 -199
4148 -199 18 153 197 -3 -124 115 -164 296 2 -121 -21 -109 -108 54 33 -91 17 -111 48 67 -73 -248
4170 -248 -163 142 -354 -69 146 50 79 -228 -20 119 -217 36 -239 -121 202 41 -80 84 109 23 -88 60
4192 60 -100 -241 -22 -34 112 -167 -179 -111 -108 -46 12 -157 -15 -133 -1 7 81 379 34 -33 -56 -51 156 178 -66
4217 -66 197 21 -84 -216 -9 -6 -164 -3 172 38 131 208 266 -96 11 47 9 -89 175 -71 -41 90 37 -9
4241 -9 20 45 176 -11 461 -180 159 60 -54 -57 23 -128 -123 -149 -193 -111 222 161 55 84 250 -162 -186 132 60 246
4267 246 -133 27 34 126 219 47 44 -14 40 131 84 48 -98 -310 94 256 270 3 97 163 -114 -3 190 272 351
4292 351 -42 95 -169 -270 75 -79 146 134 13 155 -114 -149 263 -272 -246 88 -97 44 65 164 -36 -54
4314e4R6K07l49q7M48k96O7K4j18l4K55k95Q2Q0Q3j53l1r9M66k3m78Q6J08m9o8
4339a32J29J05M4%kM6j74Ll45L56q8l6M35r9n24K74J23k18J52k8j00L6k0J21L8
4364I6j01N0j12J02n3J5J37p3K2m27N59k64J5j9j13j9oK26j37j11O4K11j8K3j95
4389a28K57J64j83p1l16N01k96K34j24R2r4q7j54J67l0J19o0k14K94K18k12l22
4411b45L76k31L85m96L63j72j51J20k8L6j46K51k46J44M8m0K56j8j83l5K3J04
4433A15l54J36j5K51n43M26L9J1r6k53L67J62j08j48m8K42l27R2K16m13On8K11
4456h9n9L16l49J0J98j36r1j39K25J31m28K09L48l09J73J68k62J82j69j10J90
4477IL25k88k05J98J48n4k78K00K61m36J14l27N25l20L16l10L51j26k00k61L36
$$ plain form
4314 -54 42 249 -100 -187 261 -35 32 56 -62 -96 159 -136 -54 26 109 -44 -75 -174 292 269 -209 -123 -15 -64 -132
4339 -132 -3 102 146 146 144 190 16 19 -326 30 -58 -94 341 242 -282 -8 115 -103 49 21 -79 -43 -63 58 96
4364 96 -5 45 -67 35 -18 -3 134 61 83 -344 215 -49 -34 -53 -166 -185 -191 35 -102 -213 -149 62 44 67 -128
4389 -128 129 293 110 39 -277 224 -72 162 38 130 36 -51 -205 -38 -68 51 -9 -223 71 289 77 -245
4411 -245 131 -100 285 -211 152 -20 -171 -51 -79 -43 -189 62 -184 -40 8 -32 224 206 23 -12 11 115
4433 115 -239 -103 -118 133 -410 16 55 66 -30 -283 84 246 138 -10 -58 184 -143 -51 165 -248 -242 -300 -89
4456 -89 -148 168 -181 -171 27 -109 -200 -339 -114 17 -411 -202 146 -163 10 178 -84 98 -71 -181 9
4477 9 334 46 -159 39 187 133 -145 55 316 -120 -6 -333 192 -128 188 -122 229 103 -97 -358 -22
4498b2J82k02k28L59l7n03M35j23J67J65k80O8K85j33n21L34j40L31l04M67m08
4519a08J03j9pj01J88J30n25K09kR7N3j53J88K81l68J57o9K7j27p4M32l23p1p9
4543a61J70k69K02K00j11o8P6N5k79J28j12J29J37k8Q0m57J82J59k89L9J76r3
4565a34K14j61P6J8J1m36K88m0K01R1k0L1K8o5k34K44Kj85J6J08J44j11J52r6
4589A42n8j22kn1J95j3n8J45j94O9j77L01L8n9k35R8k38K05j25o5L39k3N4J09
4613B75k2p2k89J8K6kJ77L0l15N8O5j2J43K39m37J33R5o8j60L3O3qJ93r6n6J51
4639A62l20K18j10P1K03k25k38L15R4j42l7P0o2J3k28M77L3l48N9nj30K38l69
4662b61K54J7K23l08J96r9L07k79k66L92o3Qn3Oj64q7J54j17Q0j44j30M68l21
$$ plain form
4498 -22 160 -42 -270 89 52 -451 -16 -139 28 193 -87 -19 266 133 -388 -54 -194 137 -167 300 -108
4519 -108 -5 -24 -31 -132 56 186 -339 -130 -132 -35 18 -135 53 334 -34 123 54 81 -46 -120 312 -11 -82 -161
4543 -161 9 -260 -58 142 31 -37 39 94 -185 -57 -169 -40 97 69 149 -308 -126 33 -256 -217 -41 -134
4565 -134 80 -81 -5 13 24 -412 -124 -164 37 128 108 139 167 102 -132 112 114 -71 -55 53 197 86 238 142
4589 142 84 -38 -40 -91 104 91 33 178 -16 53 -124 177 215 156 -79 19 -219 -14 -139 -204 135 112 166 275
4613 275 253 181 -108 -90 -64 -66 111 141 -174 -116 -51 -63 80 319 -118 15 110 42 -118 -85 -22 -30 163 67 11 162
4639 162 -158 60 -50 21 224 -1 -239 76 170 28 -9 61 -1 12 -216 261 294 -54 5 0 -130 108 -261
4662 -261 -7 10 233 -75 121 22 329 50 -216 176 113 121 68 74 -90 -177 -23 -140 -60 -204 -334 134 -187
4685a87R0r2Q8J0K7j4j86M51j53j84k0K93j83J86m9%J53r4j00L7R2j14l15Q2K23
4710D1M2J69m57M07k92k5M38j52m23rO40n91K50l17K9K80j35K30j27J67M5m40
4732b30j21R1J68K00j37K09l24K62m76L19n6Nk72K75M8N2N9N3L66n33j00K7M40
4755C25r6k30j09L09r5j73J0L11j17l77k17N52p8j73J11L8MJ61k11O1L6K91m24
4778i1N0J08L6j27r4n5K88l09R6L52l8l92J84l1K88l09k43K12K16j21J4o9J58
4801A23j44j49K90p6K37l10K28mk52j19J50k58L75q6n3P9J91j67k6Q1lj92n6J95
4825E4j41j62K59R0K89m35J05N0Nj96l4L46j53j50J2R3jj9j55L36l6k77L48k08
4849B0J5L34o35J08J91%p4K16j93L36m87P4K64k04Qk83L54J85j69p2M5j40L16
$$ plain form
4685 -187 -97 -189 -101 -91 -64 -78 -264 187 34 -150 -170 123 -60 126 77 77 230 136 36 73 165 51 -264 -182 41
4710 41 83 252 -205 202 -90 -115 323 171 -252 -261 379 -212 38 -279 -250 30 -105 125 -2 165 210 -230
4732 -230 -351 -260 -92 108 -29 180 -144 118 -358 -39 -95 -90 -362 -87 -39 13 72 125 491 -42 -142 -115 325
4755 325 229 -1 -110 199 104 -69 -59 252 135 -242 -459 93 15 -158 -47 -9 -5 156 -55 6 42 333 -91
4778 -91 -41 67 103 -24 -118 -173 115 -194 -98 254 216 -176 8 -23 265 -44 -287 -75 141 20 34 -35 123
4801 123 -21 -170 120 44 281 -29 199 195 -57 -176 -26 -284 91 5 -48 31 222 55 29 110 107 -85 -141 54
4825 54 -87 -249 10 100 389 -46 59 109 114 -82 -116 230 77 -73 -61 32 31 12 -143 193 157 -120 228 20
4849 20 35 369 -266 -158 33 33 -41 175 -18 318 -169 -95 169 -35 -27 -310 44 229 60 -12 33 -107 209
4872B09k76M0QJ08l12P7J07L9j49L62j1k04j10j93M39j11N9k79K45J16j36l56
4894c28kL35J7l7Mp4J50p5K3k38K00j66j7M02k86K33L6l14J76m33L46J27J1q2
4918HJ1J20Q4k28k20M12j06m8l78K22M16j19l23J08j71K20j09j39L39Ol15K1P2
4941a17Q8N9j12K31j30p6L7L02j84J8l16O6J0nP6J00J3j7kj33N6P3k29l8K30k84
4967b84PJ01K83j0j74P2p5L01l01j03K40Qq2j32M76l37p7R9k66M30k40O2M6j1
4991C3Mk58K25Q4k8j13j18K75l5n18N22R9N6k22j10K13M6k31RJ9M00m67J48N5
5015H8J12m06J17L02Lj80k71j56L86L7l39J58J47L8kM9K34l37P4j06J15j64J88
5038H7p5J15p3N8j44k17K14K44l28o8M33k58o1k99L02K7j22r5l4J61M3j04L51
$$ plain form
4872 209 -67 -27 -19 89 -223 -146 -39 0 -149 213 202 -2 -112 -305 134 23 82 -197 48 164 28 -328
4894 -328 -330 5 22 -15 -11 -85 65 -10 13 -225 -25 -191 -208 194 -92 141 177 -137 39 -394 -48 79 90 8
4918 8 19 139 223 -5 -225 187 81 33 -345 -123 293 174 -149 -41 -212 8 -101 -240 99 105 -210 -189 -117
4941 -117 -29 30 -82 149 19 -57 -20 282 98 116 -200 -134 -124 -129 -53 47 60 43 41 -92 -36 37 -192 -230 0 -284
4967 -284 -277 -176 107 97 -77 -5 -80 221 -80 -183 57 65 -17 -149 327 -10 -87 12 -254 176 -64 -2 44 33
4991 33 37 -221 4 88 60 -53 -171 104 69 -449 73 172 228 6 -104 109 155 -76 -67 -48 352 -115 33 88
5015 88 200 -206 -89 213 216 36 -235 -391 -5 32 -307 -149 -2 36 34 83 317 -20 54 -52 63 -101 87
5038 87 12 127 54 112 -32 -249 -35 209 -119 -187 246 -12 -73 -372 -70 -43 -165 -260 -294 -133 -90 -194 157
5061A57M6j63j88J41K21l70Q1J21Q3k13j00O8j9K90k86J90J38m1j47O4m1j31P2
5084b7O2M97m99kj56L77j22Q6m17M89m67J84K2J8oj49J30j11k2Km72P28J27m09
5108a37j20J06L27m04J52k83N28j88Q9j62N9O1j99M5J52mO5j74L05Q4k04j11m1
5131e4K77J7l32K65j02j00k5l1K38j24k43K51L03m48r8J14J94k9p8kJ54l1k88
5154a72PL22n5l2n99P13J26m32K68Ko6J05o0k57J17J8j03J54j77J45K35l47K23
5177A35K2j76o1J42K38m01j00J99M0k18K05q8J41k86J73J21l1J78l15M8J95j35
5199B6k00K55q3K30j85Q5j42J25m6j40K96p3r1j44P4L3j05k8O46n83L68o95M98
5222A21q3K22j51m98N79mr7j99M17j84l7j83K53j81K12k69K04j31o6J06Q6j83
$$ plain form
5061 157 203 40 -148 -7 214 -156 -75 46 129 -84 -184 -116 -135 155 -131 59 197 156 9 73 32 -99 -27
5084 -27 35 532 33 31 -125 252 130 216 -201 288 -179 5 27 45 39 -110 20 -91 -113 -111 -583 145 272 -137
5108 -137 -257 -151 176 -228 -76 -359 169 -19 70 -92 -33 28 -171 -126 26 22 87 -87 218 302 98 -13 -54
5131 -54 223 240 -92 173 71 -29 -54 -85 153 29 -214 37 340 -108 -206 -92 102 73 -5 -7 147 116 -172
5154 -172 -165 157 102 70 -529 184 310 -122 146 148 82 187 127 -130 -13 5 -98 56 -121 24 259 -88 135
5177 135 157 -19 -80 62 300 -101 -201 -2 38 -180 25 -63 78 -208 -35 86 55 233 -82 -34 161 26
5199 26 -174 81 -2 228 43 128 -14 111 65 -75 221 148 57 -87 -13 20 -85 -113 533 -50 318 -377 121
5222 121 38 260 109 -389 190 186 89 -110 307 123 86 -97 156 -25 187 -82 122 -9 -75 31 117 -66
5244f6Q0rnK54m80k67M86M3K9j76J33m1j19j57K53N3P5j10J92m9j06j26K83m0
5268A30j54r7J23L02n72J77J50J49j90j51l5J90N0j72J65k08M84m59j04R8J83
5289E9L8l71L05j3j93K20kP3l4j73N3R2K14n12R4J53J58r8p1j5J50k73J34L3Q6
5314A07j07j15k2K52j09k40K35j28K24j35o6J62q6l52O04J09k95j90J16j3J74
5335A25J72m48J25K4j08N2K22r3j57J14Q0m37J70Q4J74K48l45m77M28o8J99j27
5357d3j31K05J71l57K2j20N75n29J08K31k3j12J17O8k18l5J66j32K26j36j83n6
5379a86K90k60K61J42k58j10j06J53K08K88n10j12K92J12l28j1NK96l33J87J04
5400A24l2k20J1L00j07l40K29J14J70l62K97J28m26m7N6K5O8K66j08O3j28k10
$$ plain form
5244 -66 14 5 0 254 -226 -493 -7 36 65 -111 22 -19 -138 -295 -42 11 86 -24 168 119 13 -113 170 130
5268 130 -24 -121 2 304 -268 -91 59 208 18 -133 -168 22 72 -100 65 -143 341 -118 -222 -124 59
5289 59 97 -274 31 18 -175 45 43 116 82 -91 -38 54 268 -244 -150 3 161 63 -8 -23 127 -146 -12 21 107
5314 107 0 -115 -137 115 6 -234 1 -127 97 -38 -104 58 -28 -380 224 333 38 -152 -36 -49 125
5335 125 297 -151 -26 -2 -110 -58 164 71 -86 28 108 -329 -159 -75 99 347 2 -475 -47 -115 84 -43
5357 -43 -174 31 202 -155 -133 -253 322 -207 -99 132 109 -3 114 182 -36 -71 95 -37 189 53 -130 -186
5379 -186 104 -156 105 247 -11 -121 -227 -74 134 422 -88 -200 92 204 -124 -135 -130 166 -167 20 124
5400 124 92 -128 -117 183 76 -264 -35 79 249 -113 184 312 -114 -161 -105 -80 -12 254 146 209 81 -129
5422a29K32j87K30l3j50Q4OJ08J11l59J09J73q6l08M7K00j77J25N2j70K16m50
5444c56L99J19Kk84j72J87j01j00K48R3M64m85j36J18J74p2k37J11j4l66K02L63
5466A57kk36L1L87k01K6j98K84k83j35j5K62o8J12j66j50L70k21l6J90q8l6k4
5489d0L1l87O07k72R8k02L00k23Q8J25Q0k37J08o2j31P7nK32j22K64j49j39M4
5512H5%P7mj39J68n5k22J09J47m37K1L99L0n32L87K05k53Q9j93J51L02l81J53
5535A07j0J57n15K19J88j22o3P3k29M1M50k56J6K15j64o2j19K31k8M1k07k5K09
5558A47l28P4L3J26j05j5k3K20l20jJ82K33j12l42M47n6j40k00K93j7j56j56J43
5581g3Q3J48l21O8J10o0j05M02m97L08n8j12L37J5k93j29o0K24j46m8K11P6j53
$$ plain form
5422 -129 103 -84 146 113 -37 47 53 161 272 -87 22 195 109 -199 -152 48 -129 -4 48 -122 94 -356
5444 -356 43 162 164 -120 -292 -105 -206 -306 -58 35 499 14 -122 -4 170 98 -139 -28 -42 -408 -206 157
5466 157 155 -81 -50 337 136 162 -36 248 -35 -170 -185 77 9 121 -45 -195 175 -46 -82 108 20 -16 -40
5489 -40 -9 -396 211 -61 37 -165 135 -88 0 125 205 -32 76 14 -117 -40 -45 187 65 329 180 41 85
5512 85 85 162 158 19 187 132 -90 19 166 -271 -250 149 179 -353 34 239 -14 75 -118 33 335 -46 107
5535 107 97 254 -261 -42 146 24 -39 34 -195 -154 296 40 56 271 107 45 -74 157 129 170 -37 -62 147
5558 147 -181 -107 -74 52 -53 -68 -91 129 -191 -192 -10 223 111 -231 216 160 20 -180 113 96 -60 -216 -73
5581 -73 10 158 -163 -95 15 -45 -150 252 -245 63 5 -107 230 245 -48 -177 -237 -13 -159 -207 4 80 -73
5604g3j2LJ28j12J16m4J02j23k7j77L40rn39L63J36Mm19L64j92m1N62m71j05M20
5628A94m37J83L7O9J07j87O1qkq9K0J66k1j67PQ4n7J84o1K06J40k56n5J99n98
5653b81M01k27N6L59k67l46Q9L56k43n6j06L50L22m61L89m01K60M9j80K42l38
5674c3J21r9J77k53Q7K5J77m09K55o5K4l0K15l76L5L41j5m48OJ86K2m5J16J47
5698A61j87L79l69j57K62J44l15K66l01j71J50K21J35l85K42j71L13k31o4P7K27
5719B26l00j20K9K88j99l5J95n0L3j15j66J86p7K8o2K05Q7k42O4J76j77m2l00
5742c68L62N6j0k14K9M72m12R8j36K25l51J27K21o0k22k6J08J88J03j19l5J46
5764A82l00j80J68J60n8K17k23k85L12j33K34L6j89L53k80j31K44o8p4J40J05
$$ plain form
5604 -73 -85 -82 46 -66 50 6 108 -15 -42 -219 121 112 -427 -64 72 76 -343 21 -171 -212 350 -121 -226 194
5628 194 -243 -60 -23 46 153 -34 27 19 17 -72 -52 114 93 -74 -67 17 -40 144 83 289 429 173 118 317 -281
5653 -281 120 -107 -51 308 41 -305 -216 140 -103 -159 -265 85 407 -54 335 -66 194 243 63 305 -33
5674 -33 88 -11 166 -87 0 25 202 -207 48 -17 7 -23 192 -184 -149 192 177 -271 -265 -79 -57 -102 14 161
5698 161 -26 353 -16 -173 89 233 -82 184 -117 -288 -138 83 218 -167 75 -96 217 -14 -78 -1 226
5719 226 -74 -194 -165 123 -76 -111 84 34 67 -48 -214 -28 -105 -77 -139 66 153 -89 -25 151 -26 -68 -368
5742 -368 -6 50 40 -174 -145 327 -85 13 -123 102 -249 -122 99 39 -183 -209 -101 87 190 71 36 182
5764 182 -118 -298 -130 30 -28 189 -34 -319 -7 -140 94 130 -59 294 14 -117 127 59 -15 125 230
5785B30j19l21Q3J32j16R7jPjmj83M6M7l9J17j02J79qJ60rj98K09k84K1K34k10
5811c3K0M27m28q8J00K5Q6q3k72K43K1J12k35j25M51j47Jk65K35j57p7J14J43
5834F8r3J79l70N9K3K24j85k10M42p2j28j43L67k46j78K28L85l47q7o4K33N6j72
5857c1J42l05L77k40j08J74j46N2J40k00K49k41k00K51K49l8l85M58k5k03Q3j54
5879a01K15r0k79K57j4M8L3k25K87j98j31j8J20n8j75L23j29J11j53K85k7n5j59
5902a33L5J96j7k79M6J70K92l82m0J17J26k0j11l7J40j31k5j0o6J24r6M8K52k68
5926f9j92J59n6M46n3j94K1J36o1k8q3J89l20o0L22j27j26J13J04k74N4J37k27
5949a89K44j38J30J04K02j45l04r4K58m5j10j51J42K6q3J10K68k3j10q9Qj23J8
$$ plain form
5785 230 111 -210 -127 5 -111 -14 -15 -8 -9 -13 -196 -150 -103 -142 -25 -127 52 44 204 195 -3 206 -78 -57 177 -33
5811 -33 -13 414 -14 -102 -2 23 109 26 -246 -3 18 130 -105 -230 221 74 75 -190 45 -112 -189 -75 68
5834 68 -25 154 -216 -157 -134 90 -95 -305 137 65 -63 -206 161 -85 -263 -35 350 3 -84 -148 85 141 -31
5857 -31 111 -194 183 -57 -165 9 -137 -85 55 -145 104 -137 -337 -86 163 125 -260 198 173 -30 53 -101
5879 -101 114 24 -255 2 -12 36 69 -156 131 -67 -198 -216 -96 -154 -329 -6 -135 -24 -177 108 81 26 -133
5902 -133 -98 98 81 -198 -152 18 310 -72 -112 5 131 111 0 -37 103 -28 -53 -63 -129 -5 -101 -53 199 -69
5926 -69 -261 -102 -158 288 235 41 62 198 137 109 26 215 -105 -165 157 30 -96 17 121 -153 -99 38 -189
5949 -189 55 -83 47 151 353 208 -96 -190 68 23 -87 -238 -96 -70 -153 -43 225 202 92 3 11 -112 -94
5972i4k2N8K34k47k49L66j9J78k80P6P7j9J0%l15J82p2j4K16o1K73n01J82J32
5996I1r3K66l6j89j36K6K18N4l65K31O4jj1l05KR7J73l6m0r0M10l29R5M45p00
6021a59K80l50J69nK35k62n0L99m11p1m0K17N6m0j37M20k77j41j6M41l01J57j65
6044e1Q7k96L31k75j7L31j52K25m41K32O2O2p7NK0j38J84N9j66j18k44L03J29
6067E5l36L61j55l8J26J3K1J31l15r4M29l38j95K79M8j20J84k63K13J12j82K8
6089c6J67J48m47K50K19j03o4m30K29J59j14j34j2K74Q7m19O9K10J41l67o4K44
6111Gl06M04k57L07o1Q4l09N21l17k61J90k78M63k94O7R8M5l87M13j55J63J11
6133B48m30K48j14J66j74j00J82K6P8k68k23K17K18j31m0Q1n7q5K42J26j93J4
$$ plain form
5972 -94 -116 -58 176 -71 -320 46 27 205 -75 1 78 59 69 69 -246 -64 -136 -150 66 5 278 -223 -41 91
5996 91 -2 264 228 39 -97 -71 147 201 -164 67 131 130 119 -186 -184 -87 86 50 10 -80 330 1 96 541 -159
6021 -159 121 -229 -60 -65 170 -92 -142 257 -154 -225 -265 -48 8 -32 -169 251 -26 -167 -183 258 -43 114 -51
6044 -51 36 -260 71 -204 -221 110 -42 183 -258 -26 36 98 21 26 46 -92 92 151 -15 -133 -377 -74 55
6067 55 -281 80 -75 -113 13 26 47 178 -137 -231 198 -140 -335 -56 -8 -128 56 -207 6 118 -64 -36
6089 -36 131 279 -168 82 301 198 134 -296 -67 92 -22 -156 -168 106 193 -226 -157 53 194 -173 -237 7
6111 7 -299 105 -152 155 94 178 -131 390 73 -188 2 -276 187 -107 -40 58 103 -284 129 -26 137 248
6133 248 -182 66 -48 118 -56 -156 26 52 130 -138 -361 -144 74 -57 -97 -16 -73 -158 84 210 17 31
6155C1j14NN2j45K16j64J06j93K88M4j40p8j04K47J71k77J34m7R2J38m28RL34
6178A77q1j2j03L35n87L02j80J62j76K62l99Q3J76k5kl4K04k33K93n4j66K58l26
6201a26nJ68m4N4j61M21m11J98q5j06J64j85Q0J70j09j99R1L53m9l00J61j00m1
6224f1j00J37J62N2k45RN8J9n7K68k81J3J40k6p8J73l19N5J5K40k26j0J15J62
6248B15j2l06J32r9J54j25J8P1J83n13L21Np1lj44K83J28k60k2j28l8K68n65P65
6272B57k19o2J44j83k90K60J06l9L5J33l55J50J91p0j95L30l35J36l20J91J19
6293a6K23j68J14k16J15L08l08%J95j50k16K73O5k86k17J30L37k15j98M05OR4
6315B75j47j19l22M21r4j8j23K57K8k74K17m54L21q4J69J01j08k99J84M59l62
$$ plain form
6155 31 -83 -78 -26 -171 45 -119 -13 -206 82 126 -14 -92 -196 51 222 -55 79 32 124 262 -166 -157 177
6178 177 96 84 -19 316 -271 31 -149 13 -163 99 -300 -217 -41 -66 -68 -102 102 -131 162 108 -58 200 -126
6201 -126 -131 37 -7 47 -114 307 -104 94 9 -97 67 -118 -38 132 23 -176 -85 268 219 -81 80 -20 -61
6224 -61 -161 -24 138 190 -55 -46 12 31 -26 242 -39 -26 114 88 10 183 -136 -81 -66 174 -52 -62 53 215
6248 215 203 -103 29 -70 84 -41 -23 48 231 -282 39 44 -27 -30 -174 109 237 -23 -45 -173 -211 57 -508 257
6272 257 38 -24 120 -63 -353 -93 13 -26 9 142 -213 -63 128 58 -137 193 -142 -6 -326 -135 -16
6293 -16 207 39 153 -63 52 360 52 52 247 97 -119 154 219 -67 -284 -154 183 -32 -230 175 181 275
6315 275 128 9 -313 108 14 -4 -127 130 158 -116 101 -353 -32 -116 53 154 46 -253 -69 390 28
6336B8j73L28J97K9m16j29L09k5j83l29L05J89k78p7LJ96j22J77L18l74K8K9M2
6359G2n3l34J13l30O63n3Q6k96K2Q8R5k61L49O1j63l16K02K64j74j78J56K30j09
6382A34j69j37J04J90j9n8O4r4q2M79k98j69O3j35L7L71l31r4K62L6l00J98n4
6405bJ30l15M02j81j14K04k18K52j26k16K50R2j04m3j87J86K46k1j70N4k39N5
6427f5J68J3j23j8k59J28K73j71J17j66K46j12R0M6k25K6p9k51N61Q4l98r2k10
6450d17M28K67j54j78J58j19j01Nk2o5J07o3L52j97J20J00k14R4q7j73J25K09
6472A75oL0m7k61K77j52J4j56K6K88Jj34j00r1K87m37K20p1N7N0K10j84j70J15
6496e9J67j89k31K58J42j00r2p0K86l09l6K78J78k36j09J61o0K44k17k00K28k46
$$ plain form
6336 28 -145 183 380 409 -7 -136 173 148 -35 -364 -59 130 -148 -225 -222 -26 -148 29 347 -27 1 30 72
6359 72 19 -315 -202 -532 131 78 164 -132 -110 -22 73 -188 161 222 59 -257 -55 209 35 -143 13 243 134
6382 134 -35 -172 -68 122 103 45 109 15 -67 412 114 -55 8 -127 -90 281 -50 -144 118 154 -146 52 -2
6405 -2 128 -187 215 34 -80 124 -94 158 32 -184 66 158 54 11 -176 10 256 235 65 119 -120 -65
6427 -65 103 116 -7 -25 -284 -156 117 -54 63 -103 143 31 121 167 -58 -32 -111 -362 199 283 -115 -207 -417
6450 -417 11 278 124 -54 104 -15 -116 -111 -133 -198 -91 -154 198 1 121 221 7 101 14 -159 -34 175
6472 175 169 199 152 -109 168 16 30 -126 -100 188 189 55 -45 -136 151 -286 -66 -137 -80 -30 180 -4 -174 -59
6496 -59 108 -81 -312 -54 88 -12 -104 -174 112 -197 -233 45 223 -13 -122 39 -21 223 6 -194 34 -212
6518b12J25K14k93O9j5K39j14J8J18jk86K20k07R4k68P47n19P3N1l7J8n0p4K98
6542B08k06l4J20J37K7k34Rj92L20k71K39k15K4q9K41K2k37ok4K28j76r7K10q5
6566h1k04J43J78K21k89j45K58j23Q6M0j25l1J84j18j81j4J19l4K25j6K7m9q5
6589a4NJ71k8l00M90k03Q2l50J47K53j37k34R8m9L07j15j83M9p3J57j13J29j75
6612h6o4J79j70K41j12l0J07J81j08k79n9j2K86j06O0N9O5l9j08q6M36j78k18
6635d1j12J00N4O2r2j23J36j23R5J75K8k43k45L79m2l5p1PK50j46R7N3j47k97
6659b81K90M4k60J94j13m4K24J91l44K41n5j94K86k45J72j04m45L92K15k0m6l19
6681b21L36L8k27J35J10j80J93j99j10K50p0j45P3J11q8l06L77j47o1K15L68k76
$$ plain form
6518 -212 -87 127 -166 -97 -112 127 13 31 149 148 -138 82 -125 -31 -299 448 -71 2 53 16 34 -16 -90 208
6542 208 2 -32 88 225 252 18 27 -165 155 -116 123 -92 -68 -157 84 106 -131 -137 -161 67 -109 -206 4 -81
6566 -81 -285 -142 36 257 -32 -177 81 -42 44 84 -41 -72 112 -6 -187 -201 -82 -116 109 93 120 71 -14
6589 -14 -9 162 134 -166 324 121 203 -147 0 253 116 -118 -20 -69 238 123 -60 -11 -84 73 -40 89 -86
6612 -86 -150 29 -141 100 -12 -42 65 246 138 -141 -200 -212 74 -32 28 87 152 113 5 -81 355 177 -41
6635 -41 -153 -53 1 63 -29 -152 -16 -139 -44 131 159 -84 -329 50 8 -27 -98 -91 159 13 110 163 16 -281
6659 -281 9 53 -207 -13 -126 -170 54 245 -99 142 87 -107 179 -66 106 2 -443 -51 164 144 98 -221
6681 -221 115 153 -74 61 171 -9 184 -15 -125 125 55 -90 -17 94 6 -300 77 -70 -131 84 452 176
6703A76m31K83j23J96N5p8j22j9Rr2K33k31N26n10l1K03Q9j18m5M0l4k0K3K06
6727A85l44J42K19k81K56k56J48J19j08k23M30m28o3L38l67L14J16j29j59K33
6747A42J5j2r4R9K0j3j56L4J15k41K70l22J77lM6l7L1j13N0N2L0J39o6m11M24
6772A76r8R6k44M9j22j34L35Jj23j04J09L5J75k41N1r1J44J38m31J32K5K41p5
6795D4q7O2K50j56Q1j15N7l1l17K42J50k07j81J14K1O9r3J87j95O9k78M64j40
6818A0K01o04P74l84n6r9l5L35Lj88K10j69J1J58l87J69K10m74K93k41K06K79
6840B22m03O0oo0K65j60L6K5J0l51N60j71k15Q5O4K38j29j53K2R9q3j44L82k39
6864d6NM26m76P4M2K17k18j7J83Q3k50P9k24n6n7j38M69M1l83K76r1J05N9o5L0
$$ plain form
6703 176 -255 28 -95 101 156 78 -44 -63 -54 -146 87 -144 382 -128 -159 44 133 15 -30 10 -24 -44 -21 185
6727 185 -159 -17 202 -79 177 -79 69 188 80 -143 287 -141 -204 134 -233 81 197 68 -91 142
6747 142 157 145 51 150 170 157 1 35 150 -91 179 -143 34 31 77 40 71 -42 8 60 90 229 163 -248 176
6772 176 78 174 -70 -21 -143 -277 58 59 -64 -168 -59 -24 151 -90 -39 -130 14 152 -279 -147 -122 119 44
6795 44 -43 19 269 113 194 79 136 105 -212 30 180 -27 -208 -94 -73 -4 -97 90 -105 -36 -314 150 10
6818 10 211 -393 381 -3 -59 -158 -193 142 145 -43 167 -2 9 167 -220 -51 159 -315 -22 -263 -57 222
6840 222 -181 -121 -127 -187 78 -82 -46 -21 -11 -362 198 27 -188 -103 -39 199 70 -83 -61 38 -45 -189 193 -46
6864 -46 -41 385 -91 -17 25 242 24 7 190 273 23 102 -122 -178 -235 -373 96 137 -246 30 -61 44 103 38 68
6889F8LJ60l01K74r5r4N2j26J31R8o4l33K22J64k61J07O5o2m0P4j4k9K6o5R4K54
6915C08n44J88L31k45j8j2j18K98k5l37K51q3R0p3k09O6M5o3M8j02J29m9l2J94
6939C8jkk8J59R6l67K5J59Q1j57%K54l82n6K67J01j56j10K17j49L06l06k5J28
6963I2j9j0J02k16K46l99j53N43k43L04o4j77K29j91j67K41L86n16j11Q6K06j52
6985A7l4p7k2J98k32J38Q8k15K03m16M61r4r8J46j08J56n7J29j86K07j44j22K2
7008d0J4l1K19l8k27K23l14L30rJ3J42m75L44k45R1j32J41k18N9O2P3M6P5k17
7032a14J70j40P5l11M15R7q2j82m4p9q0L43j84l2M3j1J07m5J29k49K37J2k5m3
7056Gk6k4j43K64j23J1K53k21k92K1M18m22K86J02J18K1%l48P6K37k36J2j11M83
$$ plain form
6889 68 71 231 -70 204 109 15 67 -59 72 170 106 -227 -5 159 -102 5 70 8 -32 42 28 -1 25 -40 54 308
6915 308 -236 -48 283 38 20 8 -110 188 163 -174 77 -6 84 11 -198 -132 -87 -150 -102 -204 -75 -124 -156 38
6939 38 37 35 7 166 262 -105 -80 79 160 3 3 257 -125 -181 86 187 31 -79 138 -11 295 -11 -36 92
6963 92 73 63 165 -51 195 -204 -357 186 -57 247 183 6 235 44 -123 118 504 -12 -123 -37 169 17
6985 17 -17 -94 -116 82 -150 -12 76 -139 64 -352 109 15 -83 63 -45 111 54 183 -3 204 60 -62 -40
7008 -40 -26 -57 162 124 -103 120 -194 136 127 140 282 -193 151 -94 -3 -135 6 -212 -153 -91 -18 28 103 -114
7032 -114 56 -84 -9 -320 95 192 110 -72 -116 -195 -275 68 -116 -148 -105 -116 -9 -54 75 -174 63 75 50 7
7056 7 -19 -43 -186 78 -45 -34 219 -2 -294 -273 145 -277 9 111 229 250 250 -98 -22 215 -21 -9 -120 363
7080C63j06l16L9p2J12j73L94l83K55j06p2J6j28j0J42J47p5M5m7J02k84K31n7
7103A7k5kl00M23j61k14K56K94j04k27P5j60J08o6J38l02K66n9J38j07Q1J75k20
7126B4J2k6J6M9j83J89O6j5Q9k28L1J88j39q1J03l28L41k28j13K11J9K5m9L94
7150C67l61K6O2l04K11r9L9K0L5j75J43J49P5k79K00l3O0Q8j32q6Rr9j2KJ8Q9
7176A3L03k66L0o5l1k0m9P9K42k65K73l05Q8k02J2L25K2k04p4L34k43K37k71r9
7200a36J2M3L46l16KL0j50P7j43Q8J98q4k6m5R8R0j36r2K5K58k0l57J48J6J39
7225F5M7n7M1j97O1J37n3L51o26M36j53O8j48R7R8j32k4M5j74Q8j06Q5K57l12
7249a06J00j76J79k3o0N8Jj7P6L0k97L26j88J2L99k78J92l51J18k0K9q7j89L90
$$ plain form
7080 363 257 -59 -20 -92 20 -153 241 -142 113 7 -65 -49 -177 -187 -45 102 27 72 25 127 -157 74 17
7103 17 -8 -10 -310 113 -48 -262 -6 288 184 -43 32 -128 -20 -86 52 -250 16 -43 95 -12 69 244 24
7126 24 36 10 26 75 -108 81 147 132 221 -7 24 212 73 -8 95 -233 108 -120 -233 -22 -3 22 -27 367
7150 367 6 32 94 -210 1 -98 -59 -39 -4 -179 -36 113 188 -91 109 76 136 224 92 6 15 -84 -96 -94 -76 13
7176 13 316 50 80 15 -16 -36 -85 -6 236 -29 244 -61 27 -175 -163 162 184 -20 -94 240 -3 234 -37 -136
7200 -136 -124 -81 265 -51 -49 -19 -169 -92 -235 -147 51 -33 -59 -104 -6 84 -52 -144 -119 139 119 -238 -90 -74 65
7225 65 112 55 96 -101 -40 97 44 395 -231 205 52 120 -28 69 167 35 11 56 -118 -30 -136 -51 206 -106
7249 -106 -6 -182 -3 -26 -86 -28 -27 -44 32 62 -235 91 -97 -85 314 36 228 -123 -5 -25 4 -83 -272 118
7273A18R3m40L91j74J36j08K7K26l08j25J50n7J43J4N5j67k90K86j58M5O3Q1j16
7296a15k1N4L48k15k02L75j54J29m20M66n5j84mK43k87O0j27J39J28m04L41j12
7318a7j17Q9J11k2p4M0k4J6j01l9K57j59K2J40k14j2J05j7k47J67L40j07j74N1
7342A4K64l57KMJ35J45k0l42K4K15m1j24k1KJ20k81l8K76j19P5K22k60J43j1k3
7367Dj53K93q7k51M15l49k5J61J47J14k16o4J33l31K83J57N2l05J61k8J58j12
7389A57m27P0N77k02l75L38j01Pk38J95j21J17j03J55o6K54l45n9LJ53L29k43
7411G5l08P9K37l2k55K20J46m15J80p7N2j94L06m06M58K3k15L6O5J99k12qp5L01
7435A80m01L68j52K7p0j86K15m1o4L07k37K7Q0j87L07k20L76l00k35K70k2o9j05
$$ plain form
7273 118 211 -229 162 -12 124 16 43 269 -39 -164 -14 -71 72 86 141 -26 -316 -30 -188 -143 -80 1 -115
7296 -115 -136 -82 266 51 -151 224 70 199 -221 245 190 6 2 245 -42 18 -109 30 158 -246 95 -17
7318 -17 -134 -45 66 44 -30 10 -14 2 -99 -138 119 -40 -18 122 -92 -104 1 -16 -263 -96 244 137 -37 14
7342 14 278 -79 -77 -73 62 207 187 -155 -131 84 43 -81 -102 -100 20 -261 -299 -23 -142 -67 155 -105 38 27 4
7367 4 -149 144 57 -194 221 -128 -153 8 155 269 53 -11 122 -209 74 231 283 -22 139 111 269 157
7389 157 -270 -200 377 175 -200 138 37 44 -194 1 -120 -3 -106 49 -17 237 -108 -167 -164 -11 318 75
7411 75 -233 -154 83 51 -204 16 162 -253 -73 -150 -98 -292 14 -392 66 89 -126 -90 -25 174 -38 -46 -121 180
7435 180 -221 147 -5 22 -48 -234 -19 -60 -124 183 -54 -27 53 -134 173 -47 329 29 -206 64 42 -27 -132
7458a32K71l47L17j20K52j92j21Q0J15m8q5J92J06k44j42j10K11J16j75j48J36
7479f8L35k20j68J41K7r5J31Q6j12k7n0k97K77k3k2m6J80j33J55k86K37j25K50
7502A47N6j64J92j18j62R1K16k29l09M28j49J3M4j40lj09L23r2Qk10K09j22L05
7525B25L4j65k40L23l88N24j44j70P7l63J63K25k7J14j25q6p4Q2J60l1j9j90J98
7548A03J3L3o5o2k66J45J2K2J00k4j34K11k02Q1O8j39k3K15J80l82L01l91K24
7571B0m23L35J45k17J01J19j69P8mj46j33N81k66l12N8L42j10k8k68M11j09n1
7593d6l3J63K06n54L20J09k84K9o5l9K78k49J88J35j84J23j63K94j33n59M62J02
7615A00L1j87J00o8Oj76J85m5lN9N4J96l86M8L7K61l43J29rp0j8K36j07l5j0K29
$$ plain form
7458 -132 139 -208 109 -11 241 49 -72 8 123 75 -10 182 288 44 -98 -208 3 119 -56 -204 -68
7479 -68 267 47 -121 20 47 -48 83 169 57 30 -20 -317 -40 -63 -85 -131 49 -84 71 -215 22 -103 147
7502 147 203 39 231 113 -49 42 258 29 -280 148 -1 12 56 -84 -87 -196 127 35 43 -167 42 -80 225
7525 225 259 94 -146 177 -211 313 169 -1 76 -287 -124 101 74 188 63 -23 -97 -15 145 114 95 -95 103
7548 103 116 149 84 22 -244 -99 -87 -65 35 11 -123 88 -114 -33 35 -104 -127 88 268 -114 187 -204 20
7571 20 -403 -68 77 -140 -39 80 -89 -11 -15 -161 -294 287 21 -291 -233 109 -1 -29 -297 114 5 -46
7593 -46 -79 84 290 -264 56 165 -119 -90 -155 -194 84 -165 23 158 -26 97 -66 228 95 -464 -2 100
7615 100 131 -56 44 -24 -18 -194 -9 -54 -57 2 56 252 -134 -86 -49 212 -131 -2 -11 -81 -99 137 30 -5 -15 214
7641B14k31j01K98n8k03j9L2l4P8J07K1n1j13j01K40j71O5r2O8L78m22L53l75
7664a17J88r5%j3Rq4J83j61K52N0k61P2J28j84j08K61r3K05k95K43l83L47j04
7687D0J11k04K58j48J9r4j64J36P8j55p5L13o6L9j35K83j63j73L6j56K73k86K48
7710A5K13m13L5P8J51J8k03m3L6q8J14R7k3J64k33N9K49k70N6J19k00J84K30j97
7734A48j02K5k16J29J96n9q6l4J11J29k05n4j15K32M6o6k06r0K99j13j47j5M2
7757a51M06k70L08m68l6J11R0r5K13j55K01j90j37K94k70L78m10K21J3l60N33
7778B26m90j7K98p2J1K38j68M3j68M2l4O0J09Om2QK36m98K21J28k42k81M27j33
7802i2L93n62K19l3m6j1M2L8K37n9n2k57j0K98m13K90J27k22j08l0K37j24L46
$$ plain form
7641 214 -17 -118 180 122 -81 -100 -68 -102 -24 83 104 53 -60 -161 79 -92 -27 -119 -51 327 -95 258 -117
7664 -117 71 -24 -24 -37 -28 -112 71 -90 162 212 -49 23 151 -33 -141 120 27 232 -63 180 -203 144 40
7687 40 151 -53 205 57 76 -18 -182 -46 32 -123 -198 115 49 88 -47 236 73 -100 -64 -220 53 -233 15
7710 15 228 -185 -150 -72 79 97 -106 -149 -113 -201 -87 10 -13 151 -82 -23 226 -44 12 131 -69 115 345 148
7734 148 46 71 -145 -16 180 121 35 1 112 241 36 -18 -133 99 145 79 -127 -217 82 -31 -178 -193 -151
7757 -151 255 -15 293 -175 -211 -100 -10 -105 108 -47 154 -36 -173 121 -149 229 -181 40 53 -307 226
7778 226 -264 -281 17 -55 -44 194 26 69 -99 -57 -91 -31 78 84 42 50 286 -212 9 137 -105 -386 41 -92
7802 -92 301 -261 -42 -75 -121 -132 -90 -52 185 126 74 -183 -193 105 -308 -18 109 -113 -221 -251 -14 -138 208
7825B08k21j51q4J69M6j09L66n32M08qr3J33k3P2p4j85K43k2j82j02M3K21K78
7848D01n17R3J28j77n5K55j29M3j03J15l4J59j86L35n44J40O5k28j75K18K88J86
7870B78m7k66J30k80p2L61q7R1K2j20lj67K68j90M01n63J83k18N00J22l61l0J3
7893c5oJ30J60m44J50J28J41k11K7j34O5K52j52k43K13J9j43K5k22J96n8J96n7
7916cj56L75k86n9K5K75m93L22NJ33K15k82k6q6K45o6q2k17K62k35L8M1N2n4l0
7941h7R2mQ7m19K13Q3k03K59J06p5r4Mk1J06J57l15K70N8l06J15j36M08l90j48
7965b40K33LK45l54J6P4p1K29j56K2j35P5Q5n6l3J55k42j6o9O4J84j3J92j33O9
7990A28k24K8L74l02j86l0J93omN0R0J32l76K31L1L06l62k87K15R9p8J49K1k89
$$ plain form
7825 208 -13 -164 -248 -79 -33 -142 224 -308 100 92 -1 132 109 181 107 -78 165 143 -39 -141 -98 123 401
7848 401 -116 -23 105 -72 -127 128 -1 42 -61 54 20 179 -7 328 -216 -76 -11 -239 -414 -196 92 278
7870 278 231 -35 95 -185 -257 104 17 108 130 10 7 -160 108 -82 319 -244 -61 -279 221 343 -18 -48 -35
7893 -35 -41 89 249 -195 -45 83 224 13 40 -94 -29 223 71 -172 41 60 -83 -58 -280 -84 -142 54 -3
7916 -3 -159 216 -70 -129 -104 171 -322 0 5 138 353 71 45 -41 204 138 56 -161 101 -134 -96 -55 -3 -57 -87
7941 -87 5 1 88 -331 -118 -35 -238 21 127 52 -42 -38 -59 47 204 -111 159 217 -89 26 -110 298 -92 -240
7965 -240 -7 -4 241 -113 -97 -23 -94 135 -21 1 -134 -59 26 -30 -63 92 -150 -166 -235 -171 13 0 192 59 128
7990 128 -96 -68 306 4 -182 -212 -19 -25 -29 21 111 243 -133 98 129 435 73 -214 1 100 22 171 192 -97
8014i7O8j45P7J32j47L10j61m2n9J12K04m6j85l00K24J55k17K34p9k21M85p5j0
8037B17o1J3m35M04l5k37J32m3N6m5j79K32J96j43j8N4Qj66k7q5J77K06j63j69
8061a11K34j8Q8j10k03K10%p4J13m2r5j34J48P5J7k64J5K65J7l60R0r5J58l7Q9
8086b4L2p4O0jJ97m6l5q0rL5j78N3R2P2j86q5K07L2r0l46O10jl03Q8o7J23L0j07
8114aM7j28P7L5j8j65j05L3M20j73J89k23N1L7k33l2j7MK70J36N6j07k04M6k3
8139b8J0J03k6m54M40k05K44j93K05K34l44J61l00J87k06M16l80K59j89K63j14
8160H3p1J22l47R4K34q8J27j03j44J64j5k34K08N0K33l44M5l8J26p5k77L18Q6
8183A54j79L9J6R7J97l82J64n5
$$ plain form
8014 -97 -29 -174 -97 35 -112 198 37 -5 -64 48 252 206 21 -279 -55 100 -117 117 38 -183 302 227 217
8037 217 156 169 -266 138 103 -134 -2 -45 11 -34 -213 19 215 72 54 108 116 -50 -77 -162 15 221 58 -111
8061 -111 123 105 193 83 -120 90 90 16 129 87 -8 -142 6 81 98 -166 -151 114 131 -229 -139 -234 -76 -113 -24
8086 -24 8 -66 -6 -7 190 144 109 29 20 55 -123 -70 22 94 -92 -177 30 62 -28 -374 236 235 -68 20 -47 76 106 -1
8114 -1 46 -82 -5 30 12 -153 -258 -225 195 22 211 -12 39 76 -157 -189 -206 -202 68 204 260 153 -51 -5 -28
8139 -28 -18 85 59 -395 45 -160 84 -109 96 330 -14 147 -153 34 -172 244 -136 123 -66 197 83
8160 83 12 134 -213 -119 115 27 154 51 -93 71 56 -178 30 80 313 -31 14 -24 102 27 -250 68 154
8183 154 -25 14 30 127 324 -58 106 51
8191E1
$$ Imaginary data points
##PAGE= N=2
##DATA TABLE= (X++(I..I)), XYDATA
0@%%%%%%%%%%%%%%Qj6J6j6J6k0K8l2L8m6N2o0P2q4R4j08J24j42J64j86K11k38
36a25K66k99L35l75M18m66N16n70O32o99P72q50R37j035J140j255J383j527J687
55H85j865K068k300K567k879L253l709M275n000N976p364R501j3273K1914q2963
70f8914m063J00735n1431l9399M1628P8668r946l7508N864M9059n366n1472k3026
83a5171L2299L12l9658r968L2545n595l7972K134M5152M848l9256p989M4672K0154
97B6507l0145q897M5643K6020l2464k6540K6854K2298l4155m2579J2205K3677
109H424l4000m6566K8163N8981j3474n0709K4077P2111O724n2667n286N3346J2458
122F1582n9752l9564L6589L4543l8085m5616K1790L7330j5410k5248K1716K7721
$$ plain form
0 0 0 0 0 0 0 0 0 0 0 0 0 0 0 0 8 -8 8 -8 8 -12 16 -16 22 -24 28 -32 40 -44 50 -58 66 -76 88 -98 113 -125
36 -125 141 -158 177 -198 220 -246 270 -300 332 -367 405 -445 492 -543 597 -658 725 -802 885
55 885 -980 1088 -1212 1355 -1524 1729 -1980 2295 -2705 3271 -4093 5408 -7865 14049 -68914
70 -68914 -72977 27758 -23673 -63072 -21444 57224 47278 9770 15634 64693 59327 7855 -15171
83 -15171 17128 17440 -22218 -32186 359 -5236 -43208 -41074 4078 8926 -30330 -38319 6353 26507
97 26507 -3638 -12535 33108 59128 26664 124 26978 49276 15121 -27458 -15253 8424
109 8424 -25576 -72142 -43979 15002 1528 -49181 -25104 47007 53731 1064 -4222 49124 61582
122 61582 1830 -37734 -1145 33398 -4687 -50303 -28513 8817 -6593 -31841 -10125 17596
134A7596j5698k2292J8120K4814j5073k1413J9502K3787k2226l1244K0670L7033
146C3576j8042m4731L436L8723j880m0889j845M5518J1320m2329j3378M7458K6775
159D3712l8622k9195L1216K7002l1751l5456K3052L8780j7820m4009R188M7097
171B3194K900l8817k840L6647K935l6061o939L1527O801l0418j0066K4911Q828
184A2602k3195m882K8152P205l0391j1957L1655J7860k9247k0340K8134K1920
196B7516k8694k7564K7283L3007k5948m0979J4948L8770j0537l8120O814M0803
208A7299K464l7670m831M2620J8443l4695k4545K6265K1904k5713k6100J7984
220f575K1564j8992k3715J4817K4335p225j6745J1518J8629j1374j8154J4590
$$ plain form
134 17596 1898 -20394 -2274 22540 7467 -13946 5556 29343 7117 -24127 -3457 33576
146 33576 15534 -29197 -25761 12962 11082 -29807 -31652 13866 25186 -17143 -30521 16937 43712
159 43712 5090 -24105 7111 34113 2362 -33094 -10042 28738 10918 -33091 -23903 23194
171 23194 26094 -12723 -15563 21084 24019 -12042 -18981 12546 19347 -11071 -21137 3774 12602
184 12602 -10593 -15475 12677 19882 -10509 -22466 9189 27049 -2198 -22538 5596 27516
196 27516 -1178 -28742 -1459 31548 5600 -35379 -20431 18339 7802 -30318 -23504 17299
208 17299 19763 -17907 -22738 19882 38325 3630 -20915 5350 27254 1541 -24559 -6575
220 -6575 14989 -4003 -27718 -12901 11434 4209 -12536 -1018 17611 6237 -11917 2673
232B673K3877j3621k9203Q160K8960o925l2623L549L3143k710l8047m510L7426
245A0149J1831l2544j3695L0581J7467k5472j6788K6825K2463k4678k9313J6963
257f211K9352j4909l1944Q772K8646p178k9617M967L1603K875k6928o142K2851
270F137Q683j7249o123J7113M541j8748o721J9213P190k1316r610J9808Q550k3855
284a2387j0824K7277J8913k4167k2513K2556K8878j3974k9429R724K8198q789
296A3463l3001O47L1312L528l0003p327K8093J0875k1995q260K3819R708k3807
309b948j4139J9775J4360j7492j6441J3921J6068j2680j5238J3773J9281j1396
321F844k1835P049J9044o566j9060O496J9290o065k0204O863K5342j356k4187
$$ plain form
232 2673 26550 12929 -16274 -8114 20846 13921 -18702 -15153 17990 15280 -22767 -27277 10149
245 10149 21980 -10564 -24259 6322 23789 -1683 -18471 8354 30817 6139 -23174 -6211
257 -6211 23141 8232 -23712 -14940 13706 6528 -23089 -18122 13481 16356 -10572 -16714 6137
270 6137 14820 -2429 -8552 8561 13102 -5646 -12367 6846 14036 -7280 -16890 2918 11468 -12387
284 -12387 -23211 4066 22979 -1188 -23701 -1145 27733 13759 -15670 -5946 22252 13463
296 13463 -19538 -18891 12421 15949 -14054 -21381 6712 17587 -4408 -12668 11151 20859 -2948
309 -2948 -17087 2688 17048 -444 -16885 -2964 13104 424 -14814 -1041 18240 6844
321 6844 -14991 -7942 11102 4536 -14524 -8028 11262 5197 -15007 -8144 17198 15842 -8345
334h345k665K2150J285k5437p591K4318J0141k5186j4852K5138K3240j5777k0075
347a3656J5414K1491j2813k3999P199K1116p381k4382L65K0656K371j5786J594
360g811J8391N93j7761p40J9231K091k0408n972J7773M829j8528m616K1811J0268
374A9151k0175j3849J7099J5043j5700j9002J0684J6136j1386j7868J1870K3572
386A5575n097k0292N165K2249k978k1776m92J8894k432k4778m964K2599Q840j8393
400g880q455J8654J2823j3444j0948J3854J2123j4286j6363Q922J3752q505j2050
413a1803R293J3038q771j3341J0456J6621q309j9830L676J7897l040j9295J602
426a1806K2584L697k1123n832K2451J0935j9252j3638J3545J0174j5849j3345
$$ plain form
334 -8345 -11010 11140 12425 -13012 -20603 3715 13856 -11330 -26182 -1044 22196 6419 -13656
347 -13656 1758 23249 10436 -13563 -6364 14752 7371 -17011 -16646 4010 6381 -9405 -7811
360 -7811 10580 11173 -6588 -7328 11903 13994 -6414 -12386 5387 10216 -8312 -12928 8883 19151
374 19151 -1024 -14873 2226 17269 1569 -17433 -6749 9387 -1999 -19867 -7997 15575
386 15575 10478 -9814 -4649 17600 14622 -7154 -7646 11248 8816 -15962 -20926 1673 10513 -7880
400 -7880 -16335 2319 15142 1698 -9250 4604 16727 2441 -13922 -5000 8752 247 -11803
413 -11803 -2510 10528 1757 -11584 -1128 15493 7184 -12646 -8970 8927 5887 -13408 -11806
426 -11806 10778 14475 -6648 -12480 9971 20906 1654 -11984 1561 11735 -4114 -17459
438a7459J2798J4587j1088j3806J1179J7949o116j4359O950J4394p746j9293L715
451h295J7602k780j9420o47J8234K905j4938q60J7330K932j7276n926J5290O816
465A0967j4308q528J2975Q714j3100r140J4521J3560j2626j6515R128J6176p927
478C897j7169N848J6992l879j7363K663K0238K820j7506m345J4991M534j5752
491d031o794J3735O438j5654r030J4224J1085j0752q682J2021J0155j1395j0564
504i244J1621J2165j1122j4810P077J3981o058j4800N595J6198m703j8050J958
517a0192J8494Q94j6911k710J5224L971j3584l724J4724O586j4266r052J1846
530A300R887j1410j1047R612J0205j0893j1688J0365J5564o832j5637M805J5997
$$ plain form
438 -17459 -4661 9926 -1162 -14968 -3789 14160 8044 -6315 635 15029 7283 -12010 -8295
451 -8295 9307 6527 -12893 -13540 4694 7599 -7339 -8199 9131 12063 -5213 -11139 4151 10967
465 10967 -3341 -11869 1106 9820 -3280 -12420 2101 15661 3035 -13480 -4352 11824 3897
478 3897 -13272 -7424 9568 5689 -11674 -9011 11227 14047 -3459 -7804 7187 11721 -4031
491 -4031 -10825 2910 9348 -6306 -15336 -1112 9973 -779 -9461 2560 12715 1320 -9244
504 -9244 2377 14542 3420 -11390 -4313 9668 3610 -11190 -5595 10603 5900 -12150 -10192
517 -10192 8302 9196 -7715 -10425 4799 8770 -4814 -8538 6186 12772 -1494 -10546 1300
530 1300 11187 -223 -11270 -1658 8547 -2346 -14034 -3669 11895 5063 -10574 -5769 10228
543A0228k284j4601J004J4559m10j5586k295J4808M066j3059m912J2523L254j3052
557e757m518J4950O048j4799q788J4008J1389j1512j1010J0483J3267r513j5703
570a1455O965J5680l964j6388M68J4226l24j2136Q51J2962l8j3146j378J3305
584E628L038j2746m638J2340N031j3019p146J3458J0555j1900j2950Q954J3281
597I886o068j2693M663J2157m242j2996L265J3984j285j2968R19J2398q82j2693
611f555N96J4255Q11j5846m399J5734O898j3505q264J1638Q924j1132j0511J0195
625a161J1941q450j1506M958J1851m151r835N240J0344n345j2432M247J2658k291
639F068j3345kJ2390J006j2670j948J4167M495j3234p464J1939P768r663q644
$$ plain form
543 10228 7944 -6657 -5653 8906 8496 -7090 -9385 5423 9489 -3570 -8482 4041 7295 -5757
557 -5757 -10275 4675 10723 -4076 -12864 1144 12533 1021 -9989 494 13761 4248 -11455
570 -11455 -4490 11190 7226 -9162 -8694 5532 5208 -6928 -6077 6885 6847 -6299 -7677 5628
584 5628 8666 -4080 -8718 3622 8653 -4366 -11512 1946 12501 601 -12349 -3395 9886
597 9886 3818 -8875 -4212 7945 3703 -9293 -6028 7956 6671 -6297 -5378 7020 6138 -6555
611 -6555 -5959 8296 9107 -6739 -11138 4596 11494 -2011 -10275 1363 10287 -845 -11356 -1161
625 -1161 10780 2330 -9176 -4218 7633 3482 -6353 -1113 9231 3886 -8546 -4299 8359 6068
639 6068 -7277 -7279 5111 6117 -6553 -8501 5666 10161 -3073 -10537 1402 9170 -493 -9137
653i137Q091Q392p861q496Q079J1113o516j1604N228J1279m982j2073L670J1771
667F954l490j3622J899J5191J745j2828j924J2614K695j2104m310J1720M377j2452
681c535p410J0040P981p961o874Q913Q507p959r330P698R887o646j2189L474J0618
696E214l559j0006L364J2528j154j1958N0J3000J834j2454m070R747L096j1418
710e786m559J1165O933q839p043Q876Q563o390q821O111P193p418j0258N623J1073
725F423m089j0818M129J2114j919j0787K001J1910j195j3806l069J1803L459j0604
739d448m631R989N926q405m255R826O614q792q053O633O641p311q149O626Q270
754F481o615r086N962J1770k615j1262Q16J0572m04j1058j108J0469K177j0675
$$ plain form
653 -9137 -1046 7346 -515 -9011 -932 10181 3665 -7939 -2711 8568 3586 -8487 -4817 6954
667 6954 3464 -10158 -8259 6932 8677 -4151 -6075 6539 9234 -2870 -7180 4540 8917 -3535
681 -3535 -10945 -905 7076 -885 -7759 1154 9661 1702 -7628 70 9957 3311 -8878 -5404 5214
696 5214 1655 -8351 -4987 7541 6387 -5571 -5521 7479 9313 -3141 -7211 2536 5632 -5786
710 -5786 -10345 820 7753 -1086 -8129 747 9310 2920 -5901 210 7403 -15 -10273 -4650 6423
725 6423 2334 -8484 -4355 7759 5840 -4947 -2946 8964 7769 -6037 -9106 2697 6156 -4448
739 -4448 -9079 910 6836 -1569 -5824 4002 10616 1824 -6229 404 7045 -266 -8415 -1789 6481
754 6481 -134 -9220 -3258 8512 5897 -5365 -4549 6023 5619 -5439 -6547 3922 6099 -4576
768d576l139R944N241p849m180P427L778r030n398P903O383q042q407P203R394
783F652n106q804O047J0298l622j1609J750J1554j107j1179j094R082J041r094
797e191n99R553K645r533l008R253L571q155m628Q209N308q786o347Q360Q824
812I476o491r884M674R134l842r395K901Q818k525r339J111R657J227q629o76
827c783Q184J281q984j881R129K652r858m737Q532N708p272n994P225O760o778
842A84p923O109Q358l675r590K795Q418k055p723K084Q731j165r129k33R163O05
858D954q617j836Q283J530q402k406Q957M739p942n774P250O715o529o281N132
873b27O821n607q084M660Q434k583p929J845P311j277p553J460Q251r88r505n30
$$ plain form
768 -4576 -7715 2229 7470 -379 -4559 2868 6646 -2384 -7782 121 6504 -1538 -9945 -2742 6652
783 6652 1546 -7258 -1211 9087 5465 -6144 -4394 7160 6053 -5126 -6220 2862 3903 -5191
797 -5191 -5790 3763 6408 -3125 -6133 3120 6691 -1464 -6092 2117 7425 -1361 -7708 652 9476
812 9476 2985 -6899 -2225 6909 3067 -6328 -3427 5391 2866 -6473 -5362 4295 5522 -3107 -3783
827 -3783 4401 5682 -3302 -5183 3946 6598 -3260 -7997 535 6243 -1029 -7023 202 6962 184
842 184 -7739 -1630 6728 3053 -6537 -3742 4676 2621 -5102 -3018 5713 4548 -4581 -4814 4349 4954
858 4954 -3663 -5499 2784 4314 -4088 -6494 2463 7202 -740 -6514 736 7451 922 -5359 -227
873 -227 6594 987 -7097 -2437 5997 3414 -4515 -2670 4641 3364 -4189 -2729 5522 4534 -4971 -5501
889e501Q809J901q242k246P949L119p786l929P575N632o888p014N329O240m086
904H62o243L765O405l464p063K819P473j416p584J102P441j293p629P76R083K09
920E243r446k127Q874L531p964l737O758M467o874n149O426O426n179o728M300
935a179N992l554n996L865O562l822p258K955P733j425p714M87P311j60p807r30
951d940Q410J785p522l749P080M303n561l978M868M263n028n187M757N690m530
966F61o066L555O050l486o018L322P691k297p900M18Q106Q28q233j799P248J809
982C889p262k501P841L353o368l967N896M481m979m363M615M200n258n319M747
997i95O590l487o772K932O426k100p021J874P410j406p890k75P360J213n854j628
$$ plain form
889 -5501 3308 5209 -3033 -5279 2670 5789 -1997 -5926 1649 7281 393 -6621 -1292 4948 862
904 862 -5381 -1616 4789 1325 -5738 -2919 4554 3138 -4446 -3344 4097 2804 -4825 -4049 5034 5243
920 5243 -4203 -6330 2544 6075 -1889 -5626 1132 5599 -1275 -6424 2 6428 1249 -5479 -1179
935 -1179 4813 1259 -4737 -872 5690 1868 -5390 -2435 5298 3873 -3841 -3354 3957 3797 -4010 -4940
951 -4940 3470 5255 -2267 -6016 1064 5367 -194 -4172 696 4959 -69 -5256 -499 5191 661
966 661 -5405 -1850 4200 714 -5304 -1982 5709 3412 -4488 -4070 4036 4864 -3369 -5168 2080 3889
982 3889 -3373 -5874 1967 5320 -1048 -5015 881 5362 383 -3980 635 4835 -423 -5742 -995
997 -995 5595 2108 -4664 -1732 4694 2594 -4427 -2553 4857 3451 -4439 -4714 2646 3859 -1995 -3623
1013c623O480J852n924j980N720L259o025n306N021L780m445m434M562N681l889
1028G29n915L879P134k500o854J168O505j254p115J12P515M8p489p44O491K370
1044D080n779k537N592K492n925l192O125L486m792l920M947M520m329m725M579
1059F22N313m336o846K512O480j703o732O92O445J96n831J56P128J329o110k230
1075b915N063K157n069k552M239K727n831k857N276M384m518m760L293N792l443
1090I86n523K743O572k251o870J255P100j29n977k86N237K57o086l83N455O87
1106B787o011k159O113K662n235k034N702L579n698m149M632N664l981o100K414
1121a814N364k405n142J625N472j133m930L97N447K32n039m16N030n5n498o76
$$ plain form
1013 -3623 2857 4709 -1215 -3195 2525 5784 -241 -5547 -526 3254 -1191 -5625 -1063 4618 729
1028 729 -5186 -1307 5827 3327 -3527 -2359 4146 2892 -4223 -4111 3404 3452 -4037 -4781 1710 4080
1044 4080 -1699 -4236 1356 3848 -2077 -5269 856 4342 -450 -4370 577 5097 768 -3957 622
1059 622 5935 1599 -5247 -2735 3745 2042 -4690 -3998 2447 2643 -3188 -3032 4096 5425 -685 -2915
1075 -2915 2148 4305 -764 -3316 923 3650 -2181 -5038 238 4622 104 -4656 -1363 4429 986
1090 986 -4537 -1794 4778 2527 -4343 -3088 4012 3883 -2094 -2380 2857 3114 -2972 -3355 2100 2787
1106 2787 -3224 -5383 730 3392 -1843 -3877 1825 5404 -294 -4443 189 5853 1872 -4228 -1814
1121 -1814 3550 1145 -3997 -2372 3100 1967 -2963 -2566 2881 3113 -1926 -2342 2688 2633 -2865 -3541
1137c541O159J975n878k607N293L099m660l884M212L942l923n255L476N377k306
1152A479n248K108N156j882m619J714N173j426o128L12O055L82o133p31O246J277
1168C735o347j486N741L007n050m185M315L595l677l534L350M290l266m224K900
1183h36M559j777m999J811M761j871n320J528N704o07n968n07N733J455n342j741
1199c417N020K443n341k702M652L802m189l795L325M203l226m468L586M265l125
1214A033n174J970N349j552n126J442M932q51n468R82N685L68n987j095N312J617
1230C437m883k010M459K380m586k843L981L685l346l954L062L791l073l652K872
1245f80M388k660m562K064M802r40m807k7N302n05n627JN392J305n474j577M536
$$ plain form
1137 -3541 2618 4593 -1285 -3892 1401 4500 -160 -4044 168 4110 187 -5068 -1592 3785 1479
1152 1479 -3769 -1661 3495 1613 -3006 -1292 3881 2455 -3673 -3361 2694 3076 -3057 -3788 2458 3735
1168 3735 -2612 -4098 1643 4650 -400 -4585 -270 3325 -352 -3886 -536 3754 488 -3736 -836
1183 -836 3723 1946 -3053 -1242 3519 1648 -3672 -2144 3560 2953 -3015 -3522 2211 3666 -1676 -3417
1199 -3417 1603 4046 -1295 -3997 655 4457 268 -3527 -202 4001 775 -3693 -107 4158 1033
1214 1033 -4141 -2171 3178 1626 -3500 -2058 2874 2023 -3445 -2463 3222 3590 -2397 -3492 1820 3437
1230 3437 -1446 -3456 1003 3383 -1203 -4046 -65 3620 274 -3680 -618 3173 100 -3552 -680
1245 -680 3708 1048 -3514 -1450 3352 2412 -2395 -2422 2880 2375 -3252 -3251 2141 3446 -2028 -3605 931
1262I31K570l883k634M156K373l874l125L613L815l688l305K690L725k632m227
1277c495K634M891k230n403R86N856p25n012j44M806O49n264q54M799J720m237
1293a023k253L794J925l176k182L606K602l806l131L542L620k904m407K481M340
1308C028j921m757J158N869j108n065o7M954R82m386p28M241P27m434j434M439
1324A498J810m516k113L851K772l902k737L775L514l551m756L223M684j824m728
1339c000J430M552m74n068J112M364j80m616r43M029L73l639j182M123J162l949
1355a906j184M412K586m084k546L129L429l759l591K930L887k716m205J492M724
1370B598r25m399J179L850p51m254L52M624L01m616n80M152J430m030r85M042
$$ plain form
1262 931 3501 -382 -3016 1140 3513 -361 -3486 127 3942 254 -3051 -361 3364 732 -3495
1277 -3495 -861 4030 1800 -3603 -2617 3239 2514 -2498 -2642 2164 2813 -2451 -3305 1494 3214 -1023
1293 -1023 -3276 518 2443 -733 -2915 691 3293 -513 -3644 -102 3518 614 -3793 -1312 3028
1308 3028 1107 -3650 -2492 3377 2269 -2796 -2863 2091 3073 -1313 -2041 2200 2927 -1507 -2941 1498
1324 1498 3308 -1208 -3321 530 3302 -600 -3337 438 3952 401 -4355 -1132 3552 1728 -3000
1339 -3000 -1570 2982 2508 -2560 -1448 2916 2736 -1880 -2823 1206 1579 -2060 -3242 881 2043 -1906
1355 -1906 -3090 1322 3908 -176 -2722 407 3836 77 -3514 -584 3303 587 -3618 -2126 2598
1370 2598 1673 -2726 -1547 2303 1552 -2702 -2350 2274 2575 -2041 -2621 1531 2961 -1069 -2054 1988
1386A988J804m395k933L965K601l576l448K973L343k073l504K596M199j488m476
1401b424J316M198q84m438N78L915p04m263n6M517R00m498j130M417J509m231
1417a278j904M184K240l744l336L700L624k307m240K371L614j914l646J680L622
1432B666j336m339J157L487j98l612O19L891j6l819j053M891J143m512k176L680
1448D73K520l608k752L569L206l311l225K821L175j877l124J380L270j655l486
1463b624J401L938q72m216K42M286N5m230l18M378P40m723j507M494K231l849
1479e74k275K977K367k405k869K848K730k485l324K163L211j753k970J649L511
1494B801j638l969J446M204q96m138m08M031P71l630j308L903J652l933j509L440
$$ plain form
1386 1988 3792 -603 -3536 429 3030 -546 -3994 -1021 2322 249 -3255 -659 3540 2052 -2424
1401 -2424 -1108 3090 2206 -2232 -1654 2261 1557 -2706 -2762 1755 2655 -1843 -2973 1444 2953 -1278
1417 -1278 -3182 1002 3242 -502 -3838 -138 3486 1179 -3061 -690 2924 1010 -2636 -956 2666
1432 2666 1330 -3009 -1852 1635 1437 -2175 -1556 2335 2319 -1500 -2553 2338 3481 -1031 -3207 473
1448 473 2993 -615 -3367 202 3408 97 -3128 -307 2868 991 -2133 -753 2517 862 -2624
1463 -2624 -1223 2715 1843 -2373 -2131 2155 2210 -2020 -2338 2040 2780 -1943 -3450 1044 3275 -574
1479 -574 -2849 128 2495 90 -2779 69 2799 314 -3010 -847 2364 611 -2359 -710 2801
1494 2801 1163 -2806 -1360 2844 1948 -2190 -2598 1433 2204 -1426 -2734 1169 2821 -1112 -2621 819
1510H19K230k928k450K497K295k346k483K413L161k229l908K022L454j222l974
1525b649J176M081q09m371L1M454N46l748j243L500J630l272j300L131J502l552
1541h93j966L209K154k820k426K651K317k357k566K529K908j745l609J439L282
1556B107o19l743Q03L484m16l749j75M075O79l613j157L085J314l036j205K817
1572F51K003k894k296K612K771k230k839J748L393k142l485J987L676j488l741
1587b274P39L747l13l724k4L370N39l554q38L848Q99l400j174K790J348l227r42
1604b190L176J767l116k325K648K917k354l101J943L048j775l514J212L747m25
1619A658l645k15L583J32k736m74K942P43l151q19L038J481k843j979K717J339
$$ plain form
1510 819 3049 121 -2329 168 2463 117 -2366 47 3208 979 -2929 -907 2547 1325 -2649
1525 -2649 -1473 2608 1799 -2572 -2541 1913 2459 -1289 -2532 968 2598 -674 -1974 1157 2659 -893
1541 -893 -2859 350 2504 -316 -2742 -91 2226 -131 -2697 -168 2740 995 -2614 -1175 2107
1556 2107 1488 -2255 -1452 2032 1616 -2133 -2308 1767 2446 -1167 -2324 761 2075 -961 -2166 651
1572 651 2654 -240 -2536 76 2847 617 -2222 -474 2919 777 -2708 -721 2955 1467 -2274
1587 -2274 -1535 2212 1899 -1825 -1849 1521 2060 -1494 -2332 1516 2415 -985 -2159 631 1979 -1248 -2190
1604 -2190 986 2753 -363 -2688 -40 2877 523 -2578 -635 2413 638 -2876 -1664 2083 1658
1619 1658 -1987 -2202 1381 1513 -1223 -1697 1245 1988 -1163 -1982 1056 2537 -306 -2285 432 1771
1635A771k519j916K772K592k326l209K036L353j305l035Q72L016r08l149O01L642
1651B288n63l252l86L284K80l249l83L363R59l718r39L059J738l104j860K608
1667A25K238k195k429K104K670j476l178O39L165o93k778M67K522k33k997Q92
1683a157K692K4k904k65K962M80l175n24L069R39l058j687K875K497k669k605
1699b506K559K509k217k700J532L402j624l047J298K885p49l007N39L218l17l497
1715a722r6L524J62l173n35K786P41k361j491L010J409k411k068K484J569j307
1731E21k108J569J740j784k023J421K559r30l036J052K863r44l057O17L539p49
1747A250l267k15L668O75l072j335L151J436k637j852K683J796k475k231J675
$$ plain form
1635 1771 -748 -2664 108 2700 374 -2835 -799 2554 1249 -1786 -914 2102 1194 -1955 -1354 2288
1651 2288 1725 -1527 -1913 1371 1651 -1598 -1981 1382 2341 -1377 -2316 743 2481 -623 -2483 125
1667 125 2363 168 -2261 -157 2513 1037 -2141 -1502 1663 970 -1808 -1341 1181 948 -2049 -1157
1683 -1157 1535 1559 -1345 -1610 1352 1832 -1343 -1867 1202 2141 -917 -2604 271 2768 99 -2506
1699 -2506 53 2562 345 -2355 -823 2579 955 -2092 -794 2091 1342 -1665 -1126 2092 1775 -1722
1715 -1722 -1818 1706 1868 -1305 -1840 946 1687 -674 -2165 845 2254 -157 -2225 259 1828 521
1731 521 -1587 -18 1722 -62 -2085 -664 1895 965 -2071 -1019 1844 900 -2157 -1540 1999 1250
1747 1250 -2017 -2232 1436 2111 -961 -2296 855 2291 -346 -2198 485 2281 -194 -2425 -750
1762g50K437j356j931J307K230j578k238J420K491r46k768O32K597m18k487J80
1778a178L066k13k605r38K819J104k663j635K829J240k202j755K408J762j904
1793A35k041J357K796j805k325J351K881j379l067N50L285k36k819p11K897Q30
1809A699k733p42K742O98k566r87K019J309j683j138J664J299k005j377K137J826
1825B162k249j948J716K060j149k834J353K933j340k698M90L091o1k777m70L100
1841A379L41k141j171K574R66k361j481K057J651j625k047J850J539j155k601
1856b225J752K494j230k339N01K387j59k156j58K366j27k363Q5K173K14k257m21
1873a463J980P63k433n70K544J183k794j342K352K100k092k305K242J904j632
$$ plain form
1762 -750 1687 331 -1600 -293 1937 359 -1879 -459 2032 1086 -1682 -1050 1547 1129 -1358 -1178
1778 -1178 1888 1675 -930 -1868 951 2055 -608 -2243 586 1826 -376 -2131 277 2039 135
1793 135 -1906 -549 2247 442 -1883 -532 2349 970 -2097 -1547 1738 1502 -1317 -2028 869 1699
1809 1699 -1034 -1776 966 1664 -902 -1889 130 1439 -244 -1382 282 1581 -424 -1801 336 2162
1825 2162 -87 -2035 -319 1741 592 -2242 -889 2044 704 -1994 -1504 1587 1526 -1251 -1721 1379
1841 1379 1720 -421 -1592 982 1948 -413 -1894 163 1814 189 -1858 -8 1531 376 -2225
1856 -2225 -473 2021 791 -1548 -1047 1340 1181 -975 -1133 1233 1106 -1257 -1172 1001 1215 -1042 -1463
1873 -1463 517 1280 -1153 -1723 821 2004 -790 -2132 220 2320 228 -2077 165 2069 437
1888D37k626J299L117j085k702J92K712R0k467j76K273L17k699j08J932J160j911
1905b45r96K054O79j675j074J520J568k034j636J907J624j896j479J239K023j239
1921C40k173J214K294m37k461M6K448q2k393Q8K523l5k764l70K348J191k204j498
1939a925J971J575k122j419J716K061j117k357R92K062q48j796O59J826r06j761
1955a389N40J939j54k083N45J669k04j835k04K451L35k344j126K835J057k597
1971e65j130J955J793k177j505J433J968j349j919Q15K424r90k173Q24J799k90
1987I13k267M34K276j01k202m22K243K13j862p04K208O63j859j205J654J422j652
2004b48j192J651R91j379j155J560J314j041k043R70J905q24k011J039J759m21
$$ plain form
1888 437 -2189 -890 2227 1142 -1560 -1368 1344 1434 -1033 -1209 1064 1381 -1318 -1426 506 1666 -245
1905 -245 -1241 813 1492 -183 -1257 263 1831 -203 -1839 68 1692 -204 -1683 -444 1579 340
1921 340 -1833 -619 1675 1238 -1223 -1177 1271 1189 -1204 -1116 1407 1372 -1392 -1762 586 1777 -427 -1925
1939 -1925 46 1621 -501 -1920 -204 1857 740 -1617 -625 1437 589 -1207 -548 1278 372 -1389
1955 -1389 -849 1090 936 -1147 -602 1067 863 -972 -1176 1275 1610 -734 -1860 975 2032 -565
1971 -565 -1695 260 2053 -124 -1629 -196 1772 423 -1496 -681 1743 753 -1420 -596 1203 913
1987 913 -1354 -920 1356 1255 -947 -1369 874 1087 -775 -1479 729 1392 -467 -1672 -18 1404 -248
2004 -248 -1440 211 1202 -177 -1332 228 1542 501 -1542 -572 1333 509 -1502 -463 1296 875
2020H75k632K19L002K09k641m99K625O05k110j233K058J280j880j498J477J579
2036A436j680j041J147J301r76j527J215J836j357j381K30J827l71j746L33K142
2052A388m84j972R2K043J07k130m98J804R86j915p94J770J310j923j447J517J586
2069A440j112j992J220J917q87k120P58K239l80k539L29J781L35j696n44K102
2085H51N16k070l73J601L28j098r43J394R34j598r50J956J013j484j438J440J360
2102A439j308j390J057J744r83k011R39J650j44k005j04K195k4j796q07K336N94
2119A382j798j007J600J259j541r27J333R34j431j363J512J200r68j556P40J890
2135A259q80j539P94J384l54j824L11J678K04j854pJ630K18j785l53J884M51k005
$$ plain form
2020 875 -1757 -1538 1464 1673 -968 -1467 1158 1763 -347 -1580 478 1758 -122 -1620 -143 1436
2036 1436 -244 -1285 -138 1163 187 -1340 -125 1711 354 -1027 -797 1030 659 -1087 -754 1388
2052 1388 904 -1068 -976 1067 1174 -956 -1454 350 1336 -579 -1373 397 1707 -216 -1663 -146 1440
2069 1440 328 -1664 -444 1473 586 -1534 -776 1463 1083 -1456 -1127 654 989 -707 -1251 851
2085 851 1367 -703 -1076 525 853 -245 -1188 206 1140 -458 -1408 548 1561 77 -1361 79 1439
2102 1439 131 -1259 -202 1542 559 -1452 -513 1137 993 -1012 -1116 1079 1055 -741 -1548 788 1382
2119 1382 -416 -1423 177 1436 -105 -1032 301 1235 -196 -1559 -47 1153 185 -1371 -631 1259
2135 1259 379 -1160 -366 1018 664 -1160 -849 829 1033 -821 -828 802 1020 -765 -1118 766 1217 -788
2153g88l39J633Q55j882q50J595J254j483j800J468J861q51j843L05K007o06j394
2170h58j31J857j80j375k72J620K77j629k53J463L95j512k74J517M24j733k30
2187h94J220J027j435j492J533J444j223j515R35J719j060j395N00J645n08j650
2203a149N22J544Q2k049j21J844M45j914l65J616O47j745o78J825P61j403r85
2220a123Q48J449j058j371J139R91o74j217L57J673m47j159K08R78L39j986K73
2237g80J986j42j838l01K093R0j399q97J679J013j680j564J871J137j264j468
2253a464J111J259n40j476O27J437o57j222N34J595o70j540O22J136j78j260j33
2270h19J561K10j490m55J274Q68j394p83J411P19j213j134J422J042j376r43J185
$$ plain form
2153 -788 -1127 506 1361 -521 -1371 224 1478 -5 -1805 -337 1524 673 -1170 -865 1142 536 -858
2170 -858 -989 868 688 -687 -959 661 938 -691 -944 519 914 -598 -872 645 1069 -664 -894
2187 -894 326 1353 -82 -1574 -41 1403 180 -1335 -400 1319 259 -1136 -636 1009 501 -1149
2203 -1149 -627 917 999 -1050 -1171 673 1118 -796 -1161 455 1102 -643 -1321 504 1265 -138 -1123
2220 -1123 -275 1174 116 -1255 -116 875 201 -1016 -659 1014 567 -592 -384 594 933 -1053 -780
2237 -780 1206 1064 -774 -1075 1018 1108 -291 -1188 491 1504 -176 -1740 131 1268 4 -1464
2253 -1464 -353 906 366 -1110 -483 954 297 -925 -391 1204 534 -1006 -384 752 574 -686 -819
2270 -819 742 952 -538 -993 281 1149 -245 -1028 383 1102 -111 -1245 177 1219 -157 -1100 85
2287H5J260j204j136Q60J111n51j343K84J657k40j403k58J533O00j908m05J454
2304C96P33j231j222J344J253j585o64J219R93j281q91R38Q60p91r88M69J363
2321I15p01j368P43J241k48j230j3J101O43j475n86J492M81j391l96J150Q20j390
2339b12q60Q80Q91p18r29J011J182j074j217O71J303m44j588N35J503k41j429
2356g36L18J260m6j412j02J183M10j237n87J444L45j203k66J368L15j119q65Q06
2374a24J108j235o49J223O27n87j669J032J367p31j364N67J008J07j372J43J004
2391D55K24j175l04J288K70j038l93R28N29r87o73J250N28j109n83O99J196r76
2409A29j137P13J532r55j096N90J085m20j307N43J031l78q73j29J454j84q82o46
$$ plain form
2287 85 1345 141 -995 -135 976 425 -918 -634 1023 783 -620 -878 655 1255 -653 -1058 396
2304 396 1129 -102 -1324 20 1273 -312 -976 243 1236 -45 -936 2 862 71 -917 -448 915
2321 915 214 -1154 -411 830 582 -648 -661 440 1083 -392 -978 514 995 -396 -792 358 1178 -212
2339 -212 -1072 -192 699 -19 -948 63 1245 171 -1046 -375 928 484 -1104 -569 934 693 -736
2356 -736 -418 842 796 -616 -718 465 875 -362 -949 495 840 -363 -629 739 1054 -65 -930 -124
2374 -124 984 -251 -900 323 950 363 -1306 -274 1093 362 -1002 -435 573 680 -692 -549 455
2391 455 679 -496 -800 488 758 -280 -673 255 784 -203 -876 374 902 -207 -790 -91 1105 129
2409 129 -1008 -295 1237 282 -814 -224 861 441 -866 -323 708 330 -543 -672 782 598 -284 -930
2427i30J236M79r10n69J042O02r42j110J174J147r85q80L16J368q63q56M51R19
2445F89m39j211O98J032k74j017m12J496J3j077k51R92L86j411J76J002M36j533
2463g05K2J028N66r48r97J041R34q22r06Q07Q23o47j148O43J322p91j037J80J445
2482H10k37j051K2R63L76j234r9R81K05j200k99J141M22q68p81J207L35o55q08
2501g70M99P76k34j035N13J116l15j203L38J227l86j262L33R35j88j119q0J546
2519F91o9j262j67J233K47p01o93O55Q43p58p06P52O57o94q84O13J045q65p42
2538h05M89Q13l60r94P06R84l55j408L67R94L05j185k19J022J81r39l09J146M33
2557H66j016m92O14P83q31n83Q10Q00o92j041P84Q95n62j273P86O89L7j187P6
$$ plain form
2427 -930 306 785 -125 -694 348 950 8 -1102 72 1219 234 -646 -330 1038 175 -681 -230 689
2445 689 250 -961 -263 769 495 -522 -934 562 575 -502 -753 239 625 -786 -610 392 828 -705
2463 -705 -683 345 911 -37 -1034 7 941 119 -787 20 843 196 -952 -309 1013 222 -815 -635 810
2482 810 573 -478 -456 507 883 -351 -450 531 736 -464 -763 378 800 -68 -849 358 693 38 -770
2501 -770 -271 505 271 -764 -251 865 550 -653 -315 912 526 -736 -403 532 344 -775 -855 691
2519 691 622 -640 -807 426 673 -28 -721 -66 777 19 -687 65 722 28 -856 -243 802 -63 -805
2538 -805 -316 497 137 -857 -151 833 478 -930 -563 431 736 -449 -668 354 535 -404 -713 433 866
2557 866 -150 -642 -28 755 -76 -659 151 951 259 -782 2 897 335 -938 -152 537 574 -613 -537
2576e37Q62n6o36l70J183L9p83l16P42N38r36m80Q14L69n19n59M65N95l90q14
2596g89N85R77p73p14N42Q14k17r27n5J359l77j122J74R34J68q09k43P67N69j195
2616c32n04J102K77o82l82Q61M83r95l45K98Q29m38p60P45L53k97o47K12R87k92
2636D73r55M80M44n2o25n2M21L40j032J74P17R8q71k03Q90J82p60n44Q74M13m21
2657ip34O45O55m05r03N17Q67l50r51L89N88j18p67J98Q27k15o83k45O93M21p29
2678c09k92Q62P29j320m80R93N34p17m04J52Q73p73l96M47O29j58q34M14O14k47
2698C17q48M36N24l22n02J33P78k36o14k02M31O80o68m33Q89J49n38n42O49L91
2718D72l57p21N32M45k67o25J70O57k30m33n4J009n17n51K95O04j15m38m98J078
$$ plain form
2576 -537 325 269 -367 -737 446 485 -298 -614 128 666 -270 -750 64 433 -86 -645 -180 415 25 -789
2596 -789 -204 773 0 -714 -172 642 425 -502 -557 802 425 -697 -523 411 579 -230 -473 294 863 -332
2616 -332 -836 266 543 -139 -521 340 823 -172 -517 -219 610 172 -588 157 510 213 -434 -222 765 473
2636 473 -482 -2 442 390 -235 -287 134 474 -558 -384 333 431 -440 -643 247 429 -331 -875 -1 412 -9
2657 -9 -743 -98 557 152 -751 -234 633 283 -668 -279 309 191 -576 -378 449 234 -449 -694 -1 420 -309
2678 -309 -601 261 990 -330 -810 183 717 0 -404 -252 621 -152 -548 -101 528 370 -464 -50 564 317
2698 317 -531 -95 429 107 -395 -262 516 280 -334 -536 -105 575 -93 -526 363 512 -26 -568 81 472
2718 472 115 -606 -74 371 104 -521 -351 306 76 -357 -411 598 81 -470 -175 429 314 -124 -622 456
2738D56K30q78n69J201O8o03l57O64K46m74o59R66L09o05n11M80O86m16o84L33
2758a17Q54n57p85M09M33N3p86K00L97K17n62k81R74L38r53n58R94J05m82l83
2778d90Q41L11j049j4K46N97l97m93N08O66o15o61J35J002j32j023L29N68op64
2798d41Q4O83J31n13n59Q25J00o88o7O77J74n20m97N55P04q03l41L95P76k84p50
2819c59K48N99l71n46K67N42m8o95l4Q81j95n63J1N09K51p41k21Q29j33m30m55
2840f54Q26K14m05o12M73Q63r41k54M70M48m01n20L50P07m09m18P4M71J28n96
2860a86j49N24m8p27N13J90K51n01l70N01N82n35n58O14M37m79n31K47O58k51
2880A82n83L65K14j60n22M05M94l85j84l0N45j2n84J06L06l0m35O6J75M95p19
$$ plain form
2738 456 686 -192 -761 440 508 -95 -452 212 458 -16 -675 291 600 -5 -516 -36 650 234 -450 -117
2758 -117 737 180 -605 -196 237 290 -496 -296 101 318 -244 -525 449 787 -166 -724 270 375 -107 -490
2778 -490 351 662 -387 -401 -155 442 45 -448 60 726 111 -550 -415 587 455 -568 -239 329 323 -441
2798 -441 -357 326 457 -56 -615 210 310 -378 -445 232 406 -114 -611 -56 648 -155 -496 -101 675 391 -359
2819 -359 -111 488 117 -429 -162 380 332 -363 -397 484 289 -274 -263 246 497 -244 -465 364 231 -199 -654
2840 -654 172 386 -19 -631 -158 705 -236 -490 -20 428 27 -493 -143 564 155 -263 -189 282 410 -186
2860 -186 -335 189 141 -586 -73 117 368 -133 -503 -2 580 45 -513 101 538 59 -472 -225 433 182
2880 182 -401 -36 178 18 -504 -99 395 10 -174 -204 341 329 -255 -149 157 127 -308 -242 -67 428 -291
2901b91N0M25L01m98m08L16O76o57n18N63O56m97n80M45L22k82l12l1M65R8n16
2922b73k2O39j16o03j25P21L11p96j6N62L39o56o27N11N32l68k94J20M86n58M1
2943a92J42K12o4n75L49N75j89n49L97M97l66m29j15K47N02o51ML48J5K4n55L10
2965f3N74p50j17L61M87m73l57K53O81l97n92J62O81q8n75J42K88L4m07l94P19
2986A69K79n11j03N74n0m39l80M21M02l84j55R5L69l26o47P53L7m3k97J22M56
3007C42l57j44Q2M75m23p6j57M20Q2l20l34O05R2p10j5N04R0n7l31M06K24n53
3029a55j18L35M33J08q29n5N98k32k99N1N10m3n55J80L58qo14j41N17K12l26j49
3051b22O16j87l64l01P41j3l99j41J78L38l92o8L26O0K2n69J01O86j77o11L30
$$ plain form
2901 -291 -241 184 485 -13 -421 -105 571 -86 -604 -41 615 118 -462 -17 305 23 -289 -320 145 243 -273
2922 -273 -295 344 228 -375 -500 221 532 -264 -280 282 621 -35 -662 -151 381 13 -281 -161 325 -233 -192
2943 -192 -50 162 98 -477 -128 447 258 -291 106 603 237 -192 -307 -60 442 -209 -205 143 158 182 -373 -63
2965 -63 511 -239 -356 5 492 19 -338 -85 596 199 -393 -231 450 362 -213 -71 217 251 -156 -550 169
2986 169 448 -63 -166 408 358 -81 -461 -40 362 -22 -177 -82 287 -39 -686 67 104 61 -236 -114 342
3007 342 -15 -159 -77 398 -25 -101 -258 162 244 -76 -410 195 287 -423 -438 66 156 99 -232 174 398 -155
3029 -155 -273 62 495 603 -226 -281 317 85 -214 -163 347 304 -251 -71 287 279 -335 -476 41 253 -73 -222
3051 -222 394 207 -157 -458 283 270 -129 -270 -92 246 -146 -214 112 172 194 -375 -274 412 235 -376 -46
3072d6O66n01j98L0N25j83n80Q3L1K38k59J43K92N9l14m71L87M63k42m64L16N03
3094D78o59k30J89O14l49m63M09M57m23j64k13N49k2o23N22q7J60j82j62O01k84
3115A18k24k8K16J15l21k28N29L2k32k05K32K81j80l52j18K19L12n93J44M29n4
3136I2n1j25L83k42m17J95J81J11l16K7R6M69m53J93j47J65l6n29M15J89j01k45
3158a46m7M47q0m24K09L51j34o38L26N13k58n33N05J52o9m13O7N05q9l56o9M24
3180B43J6k37m77L65O27n06m68L29J92Q8l90N8L65n42J36j79Q44m69k50L0M66
3201B41l23j09j70L61K34n25N3N05l1l66K3P9M97n12j06K45M4r9m52L10K54p0
3223H3q6j54L81j76l79n9L85M05m76K0J57j6k91j16M00Qj50k14K89M86n34j82
$$ plain form
3072 -46 620 119 -79 -49 476 293 -287 -204 -173 65 -194 -51 241 300 -14 -485 -98 365 123 -341 -25 478
3094 478 -181 -411 -222 392 43 -420 -11 446 23 -141 -354 195 173 -450 72 -15 145 -37 -199 402 118
3115 118 -106 -134 82 197 -124 -352 177 209 -23 -228 4 285 105 -247 -365 -146 166 -427 -283 146 92
3136 92 41 -84 299 57 -360 -165 16 127 -189 -162 -66 403 -50 143 -4 161 125 -404 11 200 99 -146
3158 -146 -193 254 174 -250 -41 310 176 -462 -136 377 119 -414 91 243 174 -239 -172 333 244 -112 -181 243
3180 243 259 22 -455 -90 537 31 -437 -108 84 172 -218 -160 205 -337 -201 -380 464 -5 -255 -225 241
3201 241 -82 -191 -361 0 234 -291 -238 267 236 -130 -107 -28 469 -43 -149 96 140 41 -411 -101 153 83
3223 83 -3 -157 224 48 -331 -390 -5 400 -76 -56 101 85 -206 -322 78 86 -64 -278 11 497 -37 -219
3245b19O2N49n22Q9j1K73k91j39J02J63J14m71K39K24j78m2j59M49k59j73l6m2
3267b78M57j38l84M74L61l84m19M33K23j89l95L75J25k47l29L00N3L2l22K16K77
3288B41j59n27K93M66j31m84J03J88P7jl83N4M04j42m66K79O03m18j47J91J44
3309A85q6n65N28L07k26j40l45M91r3k39m4M38J4m64O2K85J33l59L6N1K07k50
3331g4k51M66j69j41R4N0K23m07J22K87L78n47M3j28J11Q0j55J31J77J18m25j85
3353b02K32K92m93k0O58k09k84j03J46N10o57k82K69N22o46J55k1J05P8l63j9
3374c32L87o3k13J7K8M45n74oP4K51k74L93j50k9J28j90J49J10l25j62J05M96
3396B65j89k13J57k95K79m32M42K97l66k47L07L50j67n02K90O7L3j77l47O13j61
$$ plain form
3245 -219 -157 392 -130 -41 -52 221 -70 -209 -107 56 170 -301 -62 162 -16 -58 -217 232 -27 -200 -236 -278
3267 -278 179 41 -343 131 492 108 -311 122 345 156 -239 136 261 14 -315 -15 38 70 -252 -36 241
3288 241 82 -445 -152 314 183 -301 -198 -10 67 66 -317 -263 141 -1 -467 -188 415 -3 -150 41 185
3309 185 99 -466 62 369 143 3 -342 149 56 -183 -227 211 225 -239 -177 108 241 -118 -82 -31 176 -74
3331 -74 -325 141 -28 -169 -75 -25 198 -209 -87 200 578 31 74 -54 57 137 -18 113 290 408 -17 -202
3353 -202 30 322 -171 -191 467 258 -26 -129 17 527 -130 -412 -143 379 -267 -112 -133 -28 50 -313 -332
3374 -332 55 -8 -221 -204 -176 269 -305 -311 -237 14 -260 133 -17 -46 82 -108 41 151 -174 -336 -231 265
3396 265 76 -137 20 -275 4 -428 14 311 -55 -302 5 355 188 -314 -24 43 76 -101 -448 165 4
3417Dk80J77L3L95m86J36J72J28l27k96L4O51r0l46j28M23k09k41J83R2J25l07
3439a57J0L36j79j39J10L44r9l30j07K08L2j21p3K80k12Q3j73M83j81p8k58K42
3461B1K26j35m91J18K79p4l7o5K16P3j66j09J56N2l44qK71J27k05QJ68k86L86
3484A81m03L48J90j34m39J01L66m15N1L34p6o6j07J02K44l64k45K11L51k69M2
3505CK04k70j38J80k4J23K78l39l75K67K12k5l96K56J41k50K04K9K3j33j33K78
3527A15J42l34p9N8M87n09l30J74N13k5j76k18M77o00L76n38O22q1k09j50K63
3548b2J04j44j53L4M45k55j39J98K3m4k45p5M28j20n17P09p9k30L7l17J43L05
3570H6j54nJ31P2k17k1K24n8n5j80r4J89J88l01N7M16k83M4r1J33j6k65N6M19
$$ plain form
3417 4 -276 -99 -66 329 -157 -21 151 279 -48 -344 -310 341 251 -95 -223 200 -9 -250 -67 25 150 -157
3439 -157 -147 189 10 -129 -19 325 226 -104 -211 -3 29 -92 -165 115 -97 -14 -187 296 115 37 -221 21
3461 21 247 112 -379 -261 18 -56 -93 -158 58 131 -35 -144 12 64 -280 -288 -17 110 -95 -87 81 -205 181
3484 181 -222 126 316 182 -257 -156 210 -205 -154 180 104 38 -69 33 277 -87 -332 -121 230 -39 3
3505 3 207 -63 -201 -21 -45 78 356 17 -358 -91 121 96 -300 -44 97 -153 51 80 103 -30 -163 115
3527 115 257 -77 -156 -98 389 -120 -450 -276 237 212 36 -182 295 -305 71 -467 155 74 -135 -285 -22
3548 -22 82 -62 -215 -181 264 9 -130 68 91 47 -198 -273 155 35 -482 227 148 -82 -45 -362 -219 86
3570 86 -68 -73 58 130 -87 -108 116 58 3 -177 -271 -82 106 -195 -138 278 -5 39 -52 81 65 -200 -144 275
3594B75k13M8k28K33O3m23mJ05L49j42L33l54L83m84m8K53N32q07R9p9L24k16
3616ak90O4J90K64l84r2M91n0m37J90l0J91m5l04K52J90k42rj9K35j90j41J34
3639c3Kn3NP7L36k34k34KJ31K63l68K40p0J45k38m7J60L55l08n71K97L58j79l8
3663bJ01K54l58j49l5O38m60M5J27k05j60n3K14M8q2R0L8j22N2k01K98J43k28
3686gR0Pj12J90m58L77P1n9j05o0K81o3R9j49p1r3J5j14J7J94P0k56M9J53K66
3711C32k87k34O3K46o5m2K42n8k99K9R1rj21Q1K42M0l15j64L78l37L57l21J50
3734aL56l51k57K05K24p7l32L26p5J18j38j76L16R1j72J95j72J8%k12q8M06l4
3757A70k43j11J69L55m90Q7J54R7l54Q4K61n1l77K58K0J47j24M0K90l83k16K72
$$ plain form
3594 275 62 110 -118 115 178 -245 -249 -144 205 63 396 42 425 -59 -107 146 678 -129 -30 -109 215 -1
3616 -1 -291 -227 -37 227 -157 -249 242 192 -245 -55 -85 106 61 -243 9 199 -43 -52 -71 164 -26 -167 -33
3639 -33 -31 -84 -79 -2 334 100 -134 -132 -1 262 -106 134 64 209 -29 -76 84 439 131 -440 -143 215 36 -2
3663 -2 99 353 -5 -154 -189 449 -11 34 161 -44 -204 -257 -43 5 -77 13 51 -71 -19 -220 78 221 -7
3686 -7 83 90 -22 168 -290 87 158 99 -6 -66 215 152 251 102 31 -62 -47 -161 -144 50 120 -136 -87 66 332
3711 332 45 -189 -126 120 55 13 255 197 -102 -73 18 9 -112 -31 211 251 -64 -228 150 -187 170 -151 -1
3734 -1 355 4 -253 -48 176 99 -233 93 18 136 -2 -178 138 229 57 252 80 98 98 -114 -202 204 170
3757 170 -73 -184 -15 340 -150 -63 91 188 -166 -82 179 128 -249 9 29 176 52 92 382 -1 -217 55
3779E5r7J38k47K36n6j13L4k12K87jk46O5Q4M63m47Rm4L37k6l88M3oJ64L0o1J65
3805A66p3l85j3L44N4k01K29k94K50l28o6L97j05L77o28K83P6q7m23N14R6j57
3827B6j28Q3n0K02k45n8J94L8q9j48K68l9l04K95j51J93l4m0P4j15L1j64K5K32
3851I6J35k05j10J6q6L15k8P0j44k66J42J00k33J07j52J94j29J79j01K31K3j97
3873d3o5O5L07j49l30J84p6M29l60j8L9K9o4Q2K31p3k08k5P8r6N6o8J5J88j63
3898c5k12L49r1Q2r3l46L45j55J72j95K56K67m15J79nNj40J67l18P4K43l15J82
3921Ak5k35K72P1J37l26m8%K85Ok75K83N9m66L18j57J81k1k2r8J84L06m20J77
3945A87l46Q0j58M49j43m5j54j2%L05l16l27N46M2k74L42P7l33J13R5j71L8j8
$$ plain form
3779 55 -42 96 -151 85 29 -84 -50 -262 25 24 -222 -157 -73 390 -57 -48 -92 245 219 -169 -126 -132 32 62 1 166
3805 166 93 -292 -305 39 93 -108 121 -173 77 -251 -317 80 -25 352 -276 7 83 -4 -427 87 183 26
3827 26 -102 -19 -69 133 -112 -170 24 62 -27 -175 93 54 -250 45 -106 87 53 13 87 -28 3 -161 -136 96
3851 96 231 26 -84 -68 -154 161 133 203 59 -207 -65 35 -198 -91 -243 -49 -178 1 -100 131 154 -43
3873 -43 -108 -43 264 115 -215 -31 -107 322 -38 -56 -17 12 -52 30 261 188 -20 -45 33 -63 -7 -75 -60 128 -35
3898 -35 -247 102 11 93 0 -346 -1 -156 16 -179 77 344 -71 108 103 108 -32 135 -183 -109 134 -181 1
3921 1 -24 -259 13 84 221 -105 -153 -153 132 138 -137 146 205 -261 57 -100 81 60 38 -60 124 430 10 187
3945 187 -159 -79 -237 212 69 24 -130 -142 -142 163 -153 -480 66 108 -166 176 253 -80 33 128 -43 -5 -23
3968b3k89K75L39o4l46K8J71j68j35M3L36k53J72L6j52J24m0n4m2k4j71J20M5
3991g2oJ55j00K8K53l66J1m2J02J09k71J34R8k9J34l71J47K43k00K33j35j68N
4014a08m7Q7k1J43k60K48l6q3J45k81K73j22o0J95J28o3k15J09L53o04J72p7l6
4037a60L38kj58o7L7J15m2J42o2k71J64J6j2k10P9J58pr7m0K75j65J1J5LJ12l7
4063A35j95K14n5J33o55M19K15j95O3l30n3J15M56o6k34P2k35M5R3K35r3j06p0
4086i2j21J13k45N00k67J03j72J06K94m1m66N00j09m0k5j62L30n1j34Oqo8R8m4
4110EQ7j22L0k41J83K26k21j31J84Q9j37J2J79J5O8k74o3L22l78R7m2J08J44k04
4134f4J80r4l06M35l32K90j73J80K54l36j16L47l21J34j3j32L3J70j89P8l04L72
$$ plain form
3968 -23 -312 -37 302 238 -108 -80 91 -77 -212 -169 167 -86 86 122 -30 94 54 0 -42 -66 -237 -117 -72
3991 -72 -78 77 -23 5 258 -108 -97 -139 -37 72 -199 -65 33 4 138 -233 -86 157 -43 190 55 -113 -108
4014 -108 -155 -68 -89 54 -206 42 6 -77 68 -213 60 -62 -122 73 201 138 -77 32 385 -219 -47 -124 -160
4037 -160 178 176 18 -49 -12 103 61 203 141 -130 34 50 38 -172 -93 65 58 -39 -79 196 31 42 57 60 172 135
4063 135 -60 154 99 232 -423 -4 211 16 79 -251 -304 -189 267 201 -33 39 -196 -151 -58 177 84 -22 -92
4086 -92 -213 -100 -345 155 -112 -9 -181 -75 219 178 -288 212 103 63 38 -124 206 155 21 27 19 -49 49 5
4110 5 92 -30 0 -241 -58 168 -53 -184 0 89 -48 -36 143 158 226 -48 -111 211 -167 -70 -112 -4 140 -64
4134 -64 116 22 -284 151 -181 109 -64 116 370 34 -82 265 -56 78 65 -67 -34 136 -53 25 -279 93
4156I3j54J06R2k38L33q0n9l63M39N3k68k44L13j15J00R2k79M37l94r6L58p5j03
4179e2M8k03J83n1L6J00J19o0q0J51l52J84p9j55L37j57k02K1K40Q5j51R7J02
4202A61M6J44k79l74L69l3k14L70j65J78J4j96m7n6J35k14N04l63K02k20O2N5
4224G9k72m0L28N9r5k29Q3JJ79k90J01r0R9J92J93k98j75K10q5j05L51j66j84
4247a54J03K5j2K58k89j58J11J26J25k41M03l22j56J20o8N7J48j22j06L69m08
4268a91L49N9o6K31n08P7O3j94M30r3j82%k22M81k13J80j78k35K31k5J5n6L04
4291B57j25j09o8K89m43K87o3j00K14k90L40l34O8K09o6j14O4k94K73K07j53J01
4313A50k20J43k32K92k54K0L77m19K71j27P8J24n6L5j5j43P1N9J51k10j25k03
$$ plain form
4156 93 -61 45 137 -101 232 152 93 -270 169 222 -46 -290 23 -92 8 100 -179 258 -136 -232 126 51 -52
4179 -52 -4 -207 -24 -75 -39 61 180 120 40 191 -161 23 -56 -211 126 -31 -233 -212 28 113 -38 59 161
4202 161 207 351 72 -302 67 34 -180 190 25 203 217 21 -26 -82 53 -161 343 -20 182 -38 24 79
4224 79 -193 -233 95 154 59 -170 -87 -86 93 -197 -96 -186 -87 105 298 0 -175 35 -50 -155 196 30 -154
4247 -154 -51 -26 -38 220 -69 -227 -116 10 135 -106 297 -25 -181 -61 -129 -72 76 -46 -152 217 -191
4268 -191 158 217 151 382 -126 -49 14 -180 250 157 -25 -25 -247 234 21 201 23 -212 19 -6 9 -47 257
4291 257 132 23 -45 244 -199 88 25 -75 139 -151 189 -145 -77 132 66 -48 16 -278 -5 202 49 150
4313 150 -70 73 -159 133 -121 -101 276 -143 128 1 79 203 147 182 167 24 95 154 305 95 -30 -233
4335b33M24k91J42j46L5k02K43J50k85L52j13o2K20k41Q2p8l9J8k19R7l7K54j61
4358i0J09k05m3M02J82n84L75ok25L7K30k25K14k62k5J04J20j22p6J35Q9j18o1
4381d5K0O6J02o29N89j28p0K81Jj61J93l34K54M2l84L92l23pJ0J62j64L29q3j81
4405f8J66r1n1o7K08l3j95K22j45j24J21j95L66J38j87q9J15Mm7j17k8J30l31
4428b98J44L16j16L7m5l6K7m6K54l83N2j6K1j27J71J07k86R0L41j30j39k38P1
4451b29R6J00Q6m2q7K16r6j46J15P7M0M4M2k03PJ35n1n1l07J90j9J70jJ2J23j19
4477A02r7O5q0K09j82M7j70R5N1N9k48m2N59j59k29J23j81K62j00L6k71J18J8
4500a5K0J61j84j43k5J25r7J00Q0p6J99k52j12O2J7J78j5J02L4j57Q0k43O01k00
$$ plain form
4335 -233 191 -100 42 -104 -69 -271 -28 122 -163 189 76 14 234 -7 75 -3 -42 -24 -243 -146 -183 71 -90
4358 -90 19 -186 -229 173 355 -229 146 140 -85 -48 182 -43 171 -91 -116 -12 108 -14 -90 45 134 16 -45
4381 -45 -25 41 143 -486 103 -25 -95 186 187 26 219 -115 139 181 -203 189 -134 -141 -131 31 -133 196 113 -68
4405 -68 98 7 -44 -111 97 64 -131 91 -54 -178 -57 -252 114 252 65 -24 91 95 48 -69 -97 33 -298
4428 -298 -154 162 46 83 38 2 29 -17 237 -146 -94 -110 -89 -216 -45 62 -224 -134 207 77 -62 -300 -229
4451 -229 -133 -33 53 11 -76 140 44 -102 13 90 130 174 216 13 20 155 104 53 -254 -64 -83 87 86 98 221 102
4477 102 5 70 -10 199 17 64 -106 -11 40 99 -149 -191 368 209 -20 103 -78 184 84 120 -151 -33 -15
4500 -15 5 166 -18 -161 -186 -61 -158 -58 22 -54 145 -107 -219 -157 -140 38 23 125 159 2 82 -161 440 240
4524B40k54M5J4J40k92K06k23L55k44K70k28J36k13N0o3K74j39L9j26O1J8M2j36
4547b8Q4L8k8j19Nn6j64J16J81J85o4Oj37O6k22J74Q4l7m02M45j20J65l74J72
4571c0J06p8j17P2P0K36k75q9o3L28n7j74K46j74r1j13J64L11L7m03J17q8M8K30
4595B13l71J74K50m58J75K60k00j51k13L95J1K1l36K46k86k3O6J57Jj68K32j91
4617a96J21j20K52j80J29j4l9Q2l0l0kK14k1j28K4k48J74J78k84l6R2K28n47M47
4641F6Q9j18m2j24N7K40n72L46j3R4J96k66k65M54k0Q2%j47j56K19L0k36K24k50
4665a12j87M73j85j20k7K09l8k53J44J98j34J67k17L71k49q3nr4L56j38j22J01
4687E5j52J22j23M5K13mj16k85M08j38j38o7J4L39m10K81j96l9NK41K0j53K22
$$ plain form
4524 240 -14 31 45 185 -107 99 -124 231 -13 257 29 165 -48 2 -61 213 74 113 -13 48 66 108 -28
4547 -28 56 94 66 -53 -48 -104 -268 -152 29 214 150 156 19 85 -137 37 121 84 -318 127 7 172 -202 -30
4571 -30 76 -2 -119 -47 23 259 -16 -105 -168 160 103 -71 175 1 -90 -203 -39 272 309 -94 23 -65 -17 213
4595 213 -158 16 266 -192 -17 243 43 -108 -321 74 85 106 -230 16 -270 -293 -227 -70 -69 -237 -5 -196
4617 -196 -75 -195 57 -123 6 -8 -47 35 5 -25 -27 187 166 38 62 -186 -12 166 -118 -154 -62 166 -381 66
4641 66 155 37 -5 -129 -72 168 -404 -58 -71 23 219 -47 -312 142 122 204 204 57 -99 120 150 -86 138 -112
4665 -112 -299 174 -11 -131 -158 51 13 -240 -96 102 -32 135 -82 289 40 -43 -48 -142 214 76 -46 55
4687 55 -97 25 -98 -53 160 156 40 -245 163 25 -113 -180 -166 173 -237 44 -152 -191 -186 55 75 -78 144
4710A44m04Q2J24j11K60j08J34j2o9J22k52K56k18j07M04m04k3O0M19j2k28j71
4732a14L33J1k53lJ82j33j82J13j15L55j64j91N8J79j73OJ23j91J96k57J20K35
4754A35P4j67M4J12m56O0K90m2q7p3K61k77L3J12l22M51l5%n2n3K17k05k89p1
4778c40N43j25j16p6jp8K7J13J19K18k12M4jj96j04K58j73P1l3K76k9l26L28j78
4802Il2L37l28O0q7L13j48k75o6J66k3k5J19Q3j1j90K59j52n1j25L3L27o0n22
4826c89J15J69J73k29N1j2L74k12k91L26J16m05o2K66o5J79l08J23K40r3j82O
4848a10Q5J11k17p9P2n6J9j49N15n8j39kK0M05n22J15j98M12j75l5j6J49m0l01
4872a94P0K77J16o20J52L83j6m92L11J03K85n91K12Kj0j4P8n2J94r7l8j54L47
$$ plain form
4710 144 -260 -178 -54 -165 95 -13 121 109 40 162 -90 166 -52 -159 245 -159 -182 -122 297 285 57 -114
4732 -114 219 230 -23 -26 156 23 -159 -46 -161 194 30 -161 -103 76 -97 -91 32 -159 37 -220 -100 135
4754 135 209 42 86 198 -258 -198 92 50 -37 -110 151 -126 -93 19 -303 148 113 113 61 8 225 20 -269 -340
4778 -340 203 78 -38 -114 -115 -193 -166 -53 66 284 72 116 115 -81 -185 73 -100 -29 -62 214 185 -141 187 9
4802 9 -23 314 -14 46 -41 272 124 -151 -217 -51 -74 -99 20 103 92 -98 161 9 -42 -167 -134 193 133 -389
4826 -389 -274 -105 68 -161 -110 -122 252 40 -251 75 191 -214 -276 -10 -75 104 -204 -81 159 66 -116 -110
4848 -110 -25 86 -131 -210 -138 -194 -175 -324 191 133 -6 -8 12 417 -105 10 -188 224 49 14 -2 147 107 -194
4872 -194 -124 153 269 -351 -199 184 168 -324 -13 90 375 -216 -4 -2 -12 -26 52 0 194 97 59 -95 252
4895B52m00q4M07j09J24m30N04k50m4L3k11n3J95N9j40L1L29m74j25O69k31R8
4917A50j2l07J36J85m30M54j43j75J42m8rJ63j10k46L17l0k87K57J55J0k04J38
4939A06J5L5k26J56J6m8j08l9O3J58k39nJ95J36l69Q2J41M6k32q0N0K07j19k58
4963c17J66LL2J46r0L17k62p3J6J74o9j58K75j01K52m78j0L1o5J57j95L27K22
4986C00m6j84l99N77n43L33j49K46O9r8l06M23l71K14j35P2J51n04J48M57q1l7
5008A37k65J72L28p18L89k2N4r9Q3n8J45j74k59R6J65L6R4k45L85j48r5o9J23
5031E5J49J03n46M61r6r6p9K66k43K41k17J92p6k94j3K9M74j84l16L54m2o2k22
5054a62o2M74k53p6L01k8k08k25K60j6K51l86r2M27j16l42J16O2K26l61L21j88
$$ plain form
4895 252 -148 -232 175 66 190 -240 264 14 -30 3 -208 -261 -66 -7 -147 -116 213 -261 -386 283 52 150
4917 150 138 -169 -33 152 -278 176 33 -142 0 -48 -57 106 -4 -250 67 37 -250 7 162 172 -32 106
4939 106 121 156 -70 86 102 54 -54 -93 -30 128 -111 -116 79 215 -154 -72 69 115 -117 -197 -147 60 -59 -317
4963 -317 -151 -148 -116 30 -60 257 -5 -78 -62 112 43 -115 160 59 311 -167 -177 -146 -211 -54 -249 78 300
4986 300 254 70 -329 248 -295 38 -111 135 204 106 -200 223 -148 66 -69 3 154 -350 -202 255 174 137
5008 137 -128 44 372 -346 43 21 75 -24 59 1 146 -28 -287 -191 -26 10 104 -141 244 96 1 -68 55
5031 55 204 307 -239 222 126 30 -49 217 -26 215 -2 190 114 -180 -193 -164 310 126 -190 164 122 60 -162
5054 -162 -224 250 -3 -79 222 194 -14 -239 21 5 256 -130 -222 205 89 -253 -137 -75 151 -210 111 -77
5076g7j8j28l2L08n2j54k9o8J25L60l08k14J96J41l04J09K02R8l53L08k25J17
5098Bqq7j0M14m19N2j4K97J42l12J33j9l00J26n0j81N21l80R9m7k2J17k23J1L02
5123A44N4l83O71m16j95L1J87k7k66J63m1L36l00j67J92R0P4m28K71Pj0o9j10
5146a92M15L4l88j65L01m5j0J57m8J12l95L22k36L41r6m43J79N03l75j34K79K
5168A18j02j54oL31Rk45L17j46kk09J12k4K29j52j72J3J69L4k46L06j75n2K60
5191B13q7Lj3k72L4J52j77Q2j2p5J47m36K32L96j30J32n9O1m66K94k86K33J57
5214A23nl96L95k28rJ68q3N3k87O1K55J37K0l80K29j41J70J28k57K85m61J72N5
5237DK13l77Q0L06j27o5L12m07K42mj13J5J08Jn17K11K34J59m25J88J79q2j37
$$ plain form
5076 -77 -95 -223 -255 53 1 -153 -182 -250 -125 235 -73 -287 -91 50 -254 -145 57 155 -198 110 -115 2
5098 2 -6 -93 -103 311 -108 -56 -70 227 369 57 190 171 -129 -3 -53 -234 287 -93 6 -41 -63 54 -169 -158 144
5123 144 198 -185 486 70 -125 -94 93 66 -200 -37 -78 258 -42 -209 -17 73 147 -281 -10 -3 -13 -82 -192
5146 -192 223 257 -131 -296 5 -40 -50 107 59 171 -224 98 -138 203 107 -336 -157 346 -29 -163 116 118
5168 118 16 -138 -144 187 196 -49 268 122 120 -89 23 -1 228 76 -96 -83 86 120 -126 180 5 -47 213
5191 213 126 129 116 -156 -122 30 -147 -65 -77 -152 -5 -441 -209 187 57 189 130 191 -275 19 -267 -34 123
5214 123 118 -278 117 -111 -120 48 -35 18 -269 -208 47 184 204 -176 53 -88 82 210 -47 238 -223 -51 4
5237 4 217 -160 -80 226 99 34 346 -61 181 177 64 79 187 188 -329 -118 116 275 -150 38 217 135 -2
5260bj09R8j66L3J28j10M17k22j56k21J36J10J6k0K32k06J37k38M8J97m7k13J73
5283A5L9l3k53M32K00l95j68P9K67J18j61Oj3j7j49j52L18j30M8j90J52M0l45
5306b92L45J12l06J30j76Q5O1L0qJ18l42J0n5K39M39k88k94K68N4p8k16K7M09
$$ plain form
5260 -2 -111 -13 -179 -146 -18 -128 289 67 -89 -310 -174 -64 -48 -68 164 -42 95 -143 -95 102 55 -158 15
5283 15 54 21 -232 200 400 5 -163 -84 183 301 140 146 133 116 -33 -185 133 3 51 -139 13 53 -292
5306 -292 53 165 -141 -11 -187 -102 -41 -11 -19 99 -243 -233 -288 -49 390 102 -192 76 130 52 -164 -137 272
$$ [...]
8191c2
##END NTUPLES=NMR FID
##END=
