##TITLE=1H_IPACAT-36
 IPACAT-36
 64 sc, 
 14.2.2024
##JCAMPDX= 6.0         $$ Bruker NMR JCAMP-DX V2.0
##DATA TYPE= NMR FID
##DATA CLASS= NTUPLES
##ORIGIN= UXNMR, Bruker Analytische Messtechnik GmbH
##OWNER= root
$$ XWIN-NMR		Version 3.5
$$ Wed Feb 14 15:52:18 2024 Russian Standard Time (UT+4h)  she@DPX200
##.OBSERVE FREQUENCY= 200.1313
##.OBSERVE NUCLEUS= ^1H
##.DELAY= (6, 6)
##.ACQUISITION MODE= SIMULTANEOUS
##.ACQUISITION SCHEME= undefined
##.AVERAGES= 64
##.DIGITISER RES= 18
##SPECTROMETER/DATA SYSTEM= spect
##.PULSE SEQUENCE= zg30
##.SOLVENT NAME= CDCl3
##.SHIFT REFERENCE= (INTERNAL, CDCl3, 0, 15.7039)
##AUDIT TRAIL= $$ (NUMBER, WHEN, WHO, WHERE, WHAT)
$$ ##TITLE= Audit trail, XWIN-NMR		Version 3.5
$$ ##JCAMPDX= 5.01
$$ ##ORIGIN= Bruker BioSpin GmbH
$$ ##OWNER= she
$$ F:/spectra/data/she/nmr/H-F/1/audita.txt
$$ ##AUDIT TRAIL=  $$ (NUMBER, WHEN, WHO, WHERE, WHAT)
(   1,<2024-02-14 15:51:14.09 +0400>,<she>,<DPX200>,
      <continue with go, POWCHK disabled, PULCHK disabled
       configuration hash MD5:
       00 E9 B6 7A A2 85 ED C7 34 08 36 98 17 FE 4E 26
       data hash MD5: 16K
       5C 18 D0 D5 8D 92 6A 17 9B E5 3A 8F E3 32 EF 1E>)
$$ ##END=
$$ 
$$ hash MD5
$$ 75 A5 BB DF 2A 15 9D 26 60 EE 6F 03 65 35 11 CD
##$RELAX= 
##$RELAX= 
##$RELAX= 
##$RELAX= 
##$RELAX= 
##$RELAX= 
$$ Bruker specific parameters
$$ --------------------------
##$DU= <F:/spectra>
##$EXPNO= 1
##$NAME= <H-F>
##$PROCNO= 1
##$TYPE= <nmr>
##$USER= <she>
##$AMP= (0..31)
100 100 100 100 100 100 100 100 100 100 100 100 100 100 100 100 100 100 
100 100 100 100 100 100 100 100 100 100 100 100 100 100 
##$AQSEQ= 0
##$AQ_mod= 1
##$AUNM= <au_zg>
##$AUTOPOS= <>
##$BF1= 200.13
##$BF2= 200.13
##$BF3= 200.13
##$BF4= 200.13
##$BF5= 200.13
##$BF6= 200.13
##$BF7= 200.13
##$BF8= 200.13
##$BYTORDA= 1
##$CFDGTYP= 0
##$CFRGTYP= 5
##$CHEMSTR= <none>
##$CNST= (0..31)
1 1 145 1 1 1 1 1 1 1 1 1 1 1 1 1 1 1 1 1 1 1 1 1 1 1 1 1 1 1 1 1 
##$CPDPRG= <>
##$CPDPRG1= <>
##$CPDPRG2= <>
##$CPDPRG3= <>
##$CPDPRG4= <mlev>
##$CPDPRG5= <mlev>
##$CPDPRG6= <mlev>
##$CPDPRG7= <mlev>
##$CPDPRG8= <mlev>
##$CPDPRGB= <>
##$CPDPRGT= <>
##$D= (0..31)
0 1.2 0 0 0 0 0 0 0 0.06 0 0.03 0 0 0 0 0.0002 0 0 0 0 0 0 0 0 0 0 0 0 
0 0 0 
##$DATE= 1707911208
##$DBL= (0..7)
120 120 120 120 120 120 120 120 
##$DBP= (0..7)
150 150 150 150 150 150 150 150 
##$DBP07= 0
##$DBPNAM0= <>
##$DBPNAM1= <>
##$DBPNAM2= <>
##$DBPNAM3= <>
##$DBPNAM4= <>
##$DBPNAM5= <>
##$DBPNAM6= <>
##$DBPNAM7= <>
##$DBPOAL= (0..7)
0.5 0.5 0.5 0.5 0.5 0.5 0.5 0.5 
##$DBPOFFS= (0..7)
0 0 0 0 0 0 0 0 
##$DE= 6
##$DECBNUC= <off>
##$DECIM= 32
##$DECNUC= <off>
##$DECSTAT= 4
##$DIGMOD= 1
##$DIGTYP= 9
##$DL= (0..7)
0 120 120 120 120 120 120 120 
##$DP= (0..7)
150 150 150 150 150 150 150 150 
##$DP07= 0
##$DPNAME0= <>
##$DPNAME1= <>
##$DPNAME2= <>
##$DPNAME3= <>
##$DPNAME4= <>
##$DPNAME5= <>
##$DPNAME6= <>
##$DPNAME7= <>
##$DPOAL= (0..7)
0.5 0.5 0.5 0.5 0.5 0.5 0.5 0.5 
##$DPOFFS= (0..7)
0 0 0 0 0 0 0 0 
##$DQDMODE= 0
##$DR= 18
##$DS= 0
##$DSLIST= <SSSSSSSSSSSSSSS>
$$ [...]
##$SUBNAM2= <"">
##$SUBNAM3= <"">
##$SUBNAM4= <"">
##$SUBNAM5= <"">
##$SUBNAM6= <"">
##$SUBNAM7= <"">
##$SUBNAM8= <"">
##$SUBNAM9= <"">
##$SW= 18.0517328524113
##$SWIBOX= (0..15)
0 0 2 0 0 0 0 0 0 0 0 0 0 0 0 0 
##$SW_h= 3612.71676300578
##$TD= 16384
##$TD0= 1
##$TE= 0
##$TE2= 300
##$TE3= 300
##$TEG= 300
##$TL= (0..7)
0 120 120 120 120 120 120 120 
##$TP= (0..7)
150 150 150 150 150 150 150 150 
##$TP07= 0
##$TPNAME0= <>
##$TPNAME1= <>
##$TPNAME2= <>
##$TPNAME3= <>
##$TPNAME4= <>
##$TPNAME5= <>
##$TPNAME6= <>
##$TPNAME7= <>
##$TPOAL= (0..7)
0.5 0.5 0.5 0.5 0.5 0.5 0.5 0.5 
##$TPOFFS= (0..7)
0 0 0 0 0 0 0 0 
##$TUNHIN= 0
##$TUNHOUT= 0
##$TUNXOUT= 0
##$USERA1= <user>
##$USERA2= <user>
##$USERA3= <user>
##$USERA4= <user>
##$USERA5= <user>
##$V9= 5
##$VALIST= <valist>
##$VCLIST= <CCCCCCCCCCCCCCC>
##$VD= 0
##$VDLIST= <DDDDDDDDDDDDDDD>
##$VPLIST= <PPPPPPPPPPPPPPP>
##$VTLIST= <TTTTTTTTTTTTTTT>
##$WBST= 1024
##$WBSW= 4
##$XGAIN= (0..3)
0 0 0 0 
##$XL= 0
##$YL= 0
##$YMAX_a= 768072
##$YMIN_a= -854725
##$ZGOPTNS= <>
##$ZL1= 120
##$ZL2= 120
##$ZL3= 120
##$ZL4= 120
##$ABSF1= 10
##$ABSF2= 0
##$ABSG= 5
##$ABSL= 3
##$ALPHA= 0
##$AQORDER= 0
##$ASSFAC= 0
##$ASSFACI= 0
##$ASSFACX= 0
##$ASSWID= 0
##$AUNMP= <proc_1d>
##$AZFE= 0.1
##$AZFW= 0.1
##$BCFW= 1
##$BC_mod= 2
##$BYTORDP= 1
##$COROFFS= 0
##$CY= 11.3945322036743
##$DATMOD= 1
##$DC= 2
##$DFILT= <>
##$DTYPP= 0
##$F1P= 15.7292609196834
##$F2P= 12.9074282941183
##$FCOR= 0.5
##$FTSIZE= 0
##$FT_mod= 4
##$GAMMA= 1
##$GB= 0.15
##$INTBC= 1
##$INTSCL= 1
##$ISEN= 128
##$LB= 0.24
##$LEV0= 0
##$LPBIN= 0
##$MAXI= 10000
##$MC2= 0
##$MEAN= 0
##$ME_mod= 0
##$MI= 1.114404
##$NCOEF= 0
##$NC_proc= 0
##$NLEV= 6
##$NOISF1= 3.799351
##$NOISF2= 2.8
##$NSP= 1
##$NTH_PI= 0
##$NZP= 0
##$OFFSET= 15.70392
##$PC= 1
##$PHC0= -24949.12
##$PHC1= 9.852645
##$PH_mod= 1
##$PKNL= yes
##$PPARMOD= 0
##$PSCAL= 0
##$PSIGN= 0
##$REVERSE= no
##$SF= 200.130013532006
##$SI= 16384
##$SIGF1= 3
##$SIGF2= 2
##$SINO= 400
##$SIOLD= 16384
##$SREGLST= <1H.CDCl3>
##$SSB= 0
##$STSI= 0
##$STSR= 0
##$SW_p= 3612.71676300578
##$SYMM= 0
##$S_DEV= 0
##$TDeff= 0
##$TDoff= 0
##$TI= <>
##$TILT= no
##$TM1= 0
##$TM2= 0
##$TOPLEV= 0
##$USERP1= <user>
##$USERP2= <user>
##$USERP3= <user>
##$USERP4= <user>
##$USERP5= <user>
##$WDW= 1
##$XDIM= 8192
##$YMAX_p= 0
##$YMIN_p= 0
$$ End of Bruker specific parameters
$$ ---------------------------------
##NTUPLES= NMR FID
##VAR_NAME=  TIME,          FID/REAL,        FID/IMAG
##SYMBOL=    X,             R,               I
##VAR_TYPE=  INDEPENDENT,   DEPENDENT,       DEPENDENT
##VAR_FORM=  AFFN,          ASDF,            ASDF
##VAR_DIM=   8192,          8192,            8192
##UNITS=     SECONDS,       ARBITRARY UNITS, ARBITRARY UNITS
##FACTOR=    0.0002768,     1,               1
##FIRST=     0,             0,               0
##LAST=      2.2672688,     0,               0
##MIN=       0,             -854725,         0
##MAX=       2.2672688,     768072,          0
$$ Real data points
##PAGE= N=1
##DATA TABLE= (X++(R..R)), XYDATA
0 0 0 0 0 0 0 0 0 0 0 0 0 0 0 0 0 0 0 0 0 0 5 -7 50 -64 64 -64 64 -64 71 -98 124 -129 135 -162 191 -199
36 -199 229 -258 288 -315 355 -393 433 -481 532 -587 647 -714 783 -866 948 -1047 1157 -1279
54 -1279 1412 -1572 1750 -1954 2197 -2491 2853 -3299 3889 -4682 5802 -7542 10531 -16695
68 -16695 34501 -198912 -765172 -191674 673773 625835 -126604 -283615 373798 767516 245139
79 245139 -342749 -132297 366709 118042 -647356 -791266 -102947 303828 -203314 -760589
89 -760589 -349940 558625 730560 68544 -271872 251630 768072 423653 -264276 -303221
99 -303221 179921 212475 -374453 -659651 -166432 314614 3425 -578450 -413752 350512
109 350512 595241 -10512 -476565 -57165 593989 485297 -153612 -299903 212534 480172
119 480172 39427 -404381 -174380 253814 60698 -526247 -575844 26692 359317 -66157
129 -66157 -508908 -167899 537929 616583 45906 -237934 164847 529190 212911 -329963
139 -329963 -325665 72358 88308 -359597 -523024 -71614 324636 69492 -368743 -201470
149 -201470 401787 548146 28184 -353164 -39902 423714 286104 -231115 -326906 80726
159 80726 275524 -63065 -355823 -112856 243839 86964 -359791 -354214 146227 378818
169 378818 -4948 -369549 -94071 438537 443888 -41672 -258415 70200 339101 68533
179 68533 -337016 -279451 63090 68299 -280790 -359297 44349 352160 116027 -241505 -92273
190 -92273 377872 443066 -17153 -325983 -72656 269195 127615 -273575 -310090 36330
200 36330 183666 -72933 -254158 -12873 269709 119663 -231520 -200239 192593 330735
210 330735 -18350 -313494 -88883 312940 280242 -113943 -257731 23654 228345 10151
220 10151 -277327 -185834 96015 79417 -194022 -224662 116925 335234 103185 -190914 -57011
231 -57011 309404 319311 -79665 -318642 -97565 170509 43294 -261456 -249254 50344 162047
242 162047 -41183 -153413 68294 279574 123273 -167092 -128248 178653 247647 -65129
252 -65129 -298159 -104684 207895 166869 -136632 -219716 22527 181215 10644 -188333
262 -188333 -90482 124399 86068 -136842 -142211 132076 273026 56706 -178805 -58791 227380
273 227380 212127 -114033 -286319 -92955 119526 16871 -206682 -168741 78224 155441
283 155441 -9245 -80781 107083 255426 96650 -147032 -106656 133585 161999 -106534
293 -106534 -282811 -108671 143980 108401 -120162 -159127 46775 166339 31707 -108974
303 -108974 -23523 128388 71017 -110975 -103686 107041 192918 4407 -173630 -63679 161299
314 161299 140620 -111152 -227925 -64134 99341 18918 -140149 -96159 91947 136166 4588
325 4588 -37345 109365 200777 49930 -142915 -98680 89510 94136 -124838 -247753 -89760
336 -89760 114386 84044 -83646 -94162 72795 154642 42421 -58374 11250 107557 35881
347 35881 -109739 -91614 73754 121737 -35825 -159803 -52259 125028 102924 -86863 -161394
358 -161394 -27801 91685 26911 -86177 -47287 83334 100219 69 -20321 90042 138834
369 138834 6507 -135272 -85578 59997 52167 -116930 -195882 -58353 101559 77337 -43484
380 -43484 -40825 83514 130107 38379 -33693 17970 71547 -4145 -114332 -82516 47578 72754
392 72754 -53352 -132198 -29063 112282 89189 -54763 -102341 270 82233 26697 -57025
403 -57025 -26030 59005 57327 -16725 -19072 66268 88826 -20088 -116715 -63061 49587 34760
415 34760 -92466 -140159 -26966 92018 70811 -14491 -11324 71948 95179 24299 -24651 9615
427 9615 31862 -36238 -109797 -68701 33755 46267 -49418 -93146 -277 107898 84755 -26195
439 -26195 -60276 11059 61608 14499 -45362 -25819 26642 17201 -29537 -16760 50609 59246
451 59246 -25977 -86926 -33576 52936 33836 -64439 -95558 -8309 76965 58424 -4520 -4194
463 -4194 46759 57060 7919 -20956 453 4054 -49910 -90970 -45039 33458 35655 -31007 -53924
476 -53924 21416 98557 76041 -9387 -39843 3178 31939 -1998 -42720 -31480 -1526 -8211
488 -8211 -28588 -2976 48203 48070 -16447 -52742 -4812 55121 31792 -46718 -70299 -8150 50364
501 50364 37267 -7560 -10201 22170 27835 -87 -10367 3118 -3337 -45516 -63709 -19614 37401
514 37401 32307 -18155 -29876 26653 79703 56832 -6901 -35624 -13318 4496 -13381 -36437
526 -36437 -31124 -14528 -15413 -14215 17104 53570 44831 -3183 -25085 11124 47109 22013 -41250
539 -41250 -62387 -21099 22101 16198 -11709 -13514 6098 14659 7089 7674 15053 802 -30302
552 -30302 -38218 -350 36465 24241 -17661 -24109 17258 52322 35981 -11373 -36585 -24927
564 -24927 -10125 -13495 -22438 -20807 -13974 -9198 4896 35220 56652 41035 2347 -12815 10295
577 10295 30565 5357 -43907 -63024 -34350 40 6290 -6301 -8994 3497 15111 22343 28334
590 28334 25596 5726 -21509 -22606 5838 26331 9682 -23055 -27762 2988 29766 20287 -11988
603 -11988 -31604 -26307 -10962 -3071 -3438 -6934 -8498 -3155 17279 42607 50820 30812 -1160 -12246
617 -12246 1902 12900 -8572 -45525 -61200 -40229 -7343 7421 4166 1357 7985 21775 34512
630 34512 40734 31259 4414 -20158 -19105 1607 11341 -5873 -30492 -32277 -7236 17863 16574
643 16574 -3882 -20883 -19229 -3860 10692 11333 2350 -6173 -2386 17881 38415 39438 16953
656 16953 -9302 -16302 -5546 1300 -13764 -40628 -53100 -37051 -5073 14987 16682 10327 12209
669 12209 24237 38716 42261 26680 -2825 -24762 -23069 -7614 -930 -14977 -33623 -31250 -8131
682 -8131 15262 20326 7051 -8881 -11119 2523 18187 19173 3242 -9839 -8141 11212 28514
695 28514 25631 3948 -14374 -18941 -8599 -589 -8762 -29759 -39834 -27428 1443 22406 23672
708 23672 14426 10052 20324 34341 35526 16020 -11673 -30327 -27243 -13156 -6559 -16175 -28474
721 -28474 -25123 -2606 20713 28160 18101 1570 -3861 6601 19037 16591 -1625 -18802 -16575
734 -16575 751 16236 14066 -2490 -15840 -16386 -4675 5219 429 -16080 -26846 -16804 6764
747 6764 25513 25467 10940 5069 12023 24259 24590 6580 -19339 -34632 -29669 -13574 -5995 -11409
761 -11409 -19448 -15032 5708 28232 36095 24303 6189 -1665 4353 12688 8819 -10078 -27019
774 -27019 -25982 -8711 7980 8312 -2506 -13122 -9695 3810 14185 10853 -4299 -15833 -10036
787 -10036 9656 23398 19629 5323 -3623 1427 11833 13411 -1847 -22095 -33495 -27634 -10841
800 -10841 272 -1665 -9452 -5762 12586 32391 37890 24858 6083 -4441 -1222 4442 -369
813 -369 -18373 -32654 -31551 -14236 4500 9427 1443 -4951 -1668 12715 24086 19030 3043 -10690
827 -10690 -8604 6511 17018 10270 -3357 -11734 -7865 3183 6341 -3028 -19538 -28358 -21009 -2768
841 -2768 10309 6881 -1015 908 15524 33955 34602 19808 601 -9957 -8974 -5165 -8549 -21879
855 -21879 -34278 -32156 -14187 6811 15090 10711 2370 5795 20069 27903 22186 2969 -11054
868 -11054 -10898 -564 6742 601 -11465 -17979 -12615 -1837 5962 1391 -10980 -20143 -13095 5589
882 5589 16922 13726 2298 1375 15168 26860 26306 10005 -6425 -15352 -14903 -11860 -11934 -19746 -27884
897 -27884 -26848 -9412 12816 22824 17569 8400 9355 21798 27338 18108 -1703 -16610 -16584 -8770
911 -8770 -2945 -6670 -14584 -17830 -11975 243 10724 9896 -760 -10261 -4672 10611 20430 13577
925 13577 -1151 -4418 7189 17002 14949 1368 -12403 -18024 -16442 -11355 -8553 -11402 -18198 -17124
939 -17124 -2358 19430 28340 20333 7856 8209 17635 20800 9431 -9804 -23148 -22951 -13911 -8167
953 -8167 -7759 -11182 -10703 -5298 6073 18012 18917 7668 -4580 -2028 10856 17407 6803 -8217
967 -8217 -12278 -2135 8157 6232 -3633 -11848 -14410 -11343 -6369 -594 -1477 -7211 -9373 3032 21472
982 21472 27695 17144 3211 1380 9764 11535 17 -17046 -26442 -23776 -14096 -7472 -3386 -3234
996 -3234 -2715 2417 12676 24019 23987 10929 -3960 -4254 4959 9071 -1570 -16542 -19194 -7689
1010 -7689 2567 2669 -3977 -6814 -7006 -4594 1895 7451 6947 -983 -7079 2949 18074 22461 10299
1025 10299 -4114 -6878 1180 5132 -4550 -18294 -23139 -18717 -9370 -1752 4379 3989 4288 7264 15789
1040 15789 23880 21803 7609 -8416 -10591 -1728 1458 -8432 -20442 -20704 -8615 2156 5429 2579
1054 2579 -206 661 2871 7571 10875 9774 -676 -7943 -1238 10989 14157 2038 -9578 -11156
1068 -11156 -1202 2180 -3960 -12137 -15366 -11812 -3170 4187 8756 8502 6532 6447 12583 18934 14872
1083 14872 855 -14212 -15335 -6548 -2735 -9799 -17437 -16196 -4130 6864 11249 8977 6121 4575
1097 4575 4948 7857 9644 5271 -5288 -12488 -9148 2927 7357 -2185 -10774 -8697 968 6108 1924
1112 1924 -4843 -7442 -4693 872 7173 9454 7235 2385 1215 6896 12045 7802 -4483 -15640
1126 -15640 -14783 -6375 -1578 -6034 -11195 -9854 983 10597 14534 11259 7905 4320 3070 4028 4635
1141 4635 -336 -10898 -16725 -11489 123 4732 -1323 -7067 -4499 5533 10833 7076 990 -2811
1155 -2811 -2866 429 5331 5997 1830 -3177 -4457 1958 6637 4205 -5712 -13016 -10835 -3351 1725 12
1171 12 -5037 -3568 3779 11919 13992 10389 5381 521 -1807 -846 435 -4584 -13312 -16413 -10258 948
1187 948 6020 1570 -2038 1392 8985 13013 9667 2899 -3362 -5190 -2256 450 1453 -2532 -7167
1202 -7167 -7533 175 6730 4854 -2888 -7564 -4782 1322 4783 3200 -1502 -3018 2794 8897 11018
1217 11018 7545 586 -3865 -4108 -1999 -1877 -4945 -12210 -13543 -6807 3562 8178 5303 1811 3865
1232 3865 8873 11140 8736 1278 -4870 -7613 -6823 -1945 -1583 -5047 -9312 -6774 1509 7670 7159 -235
1248 -235 -4020 -438 3525 5296 3104 -1249 -3301 -751 4751 7637 4129 -1753 -5667 -3756 -454
1263 -454 -450 -4624 -9205 -9481 -2969 4794 9524 6474 2336 3808 7426 8955 5949 -557 -7376 -9861
1279 -9861 -7221 -2617 -2328 -4611 -7253 -4253 4486 9770 8277 2662 -1218 -155 3785 4227 2061
1294 2061 -2749 -5902 -3615 2332 5429 2524 -2726 -5856 -2707 814 435 -1917 -6161 -6109 -977 4859
1310 4859 7686 5289 1961 1141 3501 6835 4704 -975 -7372 -9484 -5666 -1881 -741 -3521 -5448
1325 -5448 -1722 5470 10015 7700 2775 -1664 -771 1635 2452 264 -4778 -6478 -4103 1153 5391
1340 5391 2322 -1641 -3228 -1611 2535 3154 -227 -4847 -5474 -1973 3451 6004 3659 -197 -364 2734
1356 2734 5871 3213 -1490 -6784 -7672 -4472 -231 740 -1331 -2699 -692 5455 9116 6502 1466
1371 1466 -1780 -2102 -625 101 -1247 -5217 -7202 -4093 1785 5489 3541 544 -1633 795 3545
1386 3545 4014 38 -4824 -5806 -2944 1349 3727 1702 -2305 -2058 1959 4607 3739 -655 -4787 -5037
1402 -5037 -2200 1189 1836 -597 -2999 -1569 4029 6800 5513 -180 -4377 -3829 -1106 372 -1137
1417 -1137 -4736 -6990 -2271 3485 6260 5666 2276 -699 766 2865 2866 -249 -6300 -7978 -5055 157
1433 157 2462 118 -2329 -1828 3591 5954 5168 910 -2043 -2419 -846 1098 1329 -445 -3615 -3873
1449 -3873 781 4841 3869 -1235 -5652 -3899 672 1473 -680 -3649 -3038 0 3023 6792 5621 2251
1465 2251 -376 -847 856 1717 -1764 -7057 -9072 -5693 -372 2758 -472 -1977 991 5150 8154
1480 8154 6059 2288 221 -2032 -1791 -1248 804 -1042 -5557 -5909 -1474 4058 3630 -1844 -4436 -2060
1496 -2060 3392 4115 983 -840 -660 1068 3043 4706 4265 1091 -2310 -2956 -559 1285 -1226 -7074
1512 -7074 -9298 -5028 2600 4466 2314 -45 2792 7429 7881 5392 1867 -274 -2294 -4851 -3201
1527 -3201 -1488 -2932 -7018 -7949 -1344 5729 5572 -826 -3576 1282 5925 5057 1126 -949 122 806
1543 806 72 1282 2284 953 -4372 -6200 -2016 1734 -52 -6097 -7867 -1956 5321 6244 1708 329
1559 329 3303 7607 6101 2507 655 -1455 -4524 -7277 -5791 -1505 -1355 -6543 -6917 -439 7685 7830
1575 7830 977 -751 3797 8551 4624 -519 -1643 -40 -713 -3133 -2629 992 -285 -4405 -7139
1590 -7139 -2289 4564 2847 -4864 -6619 888 8370 7193 1180 126 4226 6749 2581 -1131 -359
1605 -359 -1054 -4922 -8898 -6772 874 158 -5252 -7358 1533 11019 9530 1168 -1814 5121 8037 3196
1621 3196 -3213 -3112 -779 -1856 -6111 -4619 278 1113 -3830 -7562 -410 7313 5696 -3426 -5871
1636 -5871 2529 9461 5791 -1371 -826 4330 4855 -485 -3752 -1612 -302 -5528 -10134 -5614 3359
1651 3359 2649 -5007 -6336 3362 12922 9749 -1080 -2508 4587 7552 144 -6849 -3335 -265 -2567
1666 -2567 -8294 -5335 2955 4509 -3576 -7157 943 10210 6616 -4010 -6094 3095 8992 3297 -4437
1681 -4437 -3217 3183 3711 -3565 -5652 -96 1595 -4611 -10063 -3790 6134 5370 -4422 -7143 3618
1696 3618 12737 7816 -2770 -4519 5204 6714 -1607 -8736 -4668 1924 -2285 -8144 -5038 5661
1710 5661 7462 -3493 -6486 2779 12332 6166 -5800 -7011 3602 9029 1051 -7254 -3798 4373
1724 4373 3317 -4495 -6167 2233 4366 -3617 -9511 -3284 8190 6646 -5607 -7889 4018 12698
1738 12698 6516 -6232 -5334 4703 6317 -3369 -9330 -1865 4184 -1745 -9134 -3965 8455 8832
1752 8832 -2861 -7718 2910 13104 5557 -8540 -8633 2538 8582 -1583 -9750 -3425 6189 3507
1766 3507 -5706 -4604 5076 8150 -2693 -9229 -987 9712 6980 -6931 -10044 3213 12411 3225
1780 3225 -9739 -5078 5724 6680 -4875 -9656 223 6961 60 -8360 -3094 10597 9077 -4341
1794 -4341 -8200 2982 12069 4019 -11044 -9762 4199 7287 -3891 -10396 -1964 8325 4504 -5969
1808 -5969 -4010 7155 9805 -2508 -10592 -1620 10744 5040 -8475 -10801 3747 11433 740
1821 740 -11155 -5670 7448 6926 -5016 -8649 1815 9354 63 -9875 -2295 10990 9353 -5262
1835 -5262 -10726 2964 12347 2704 -12960 -10045 4210 7644 -3427 -10806 -363 10921 5122
1848 5122 -6886 -3335 8794 10275 -4052 -11516 -544 11083 3783 -11715 -11387 3644 11181
1861 11181 -935 -10888 -4596 9615 7547 -5567 -8060 4473 10964 237 -9997 -2940 12199
1874 12199 8221 -7891 -12132 2545 12008 46 -13441 -9703 5746 8825 -4111 -9569 2091
1887 2091 12098 5301 -6796 -3301 10142 9608 -5147 -12938 -1233 10206 2068 -12878 -11118
1900 -11118 4939 11261 -1187 -11794 -2405 11333 7844 -5884 -7030 5649 10534 -1555 -11759
1913 -11759 -3035 11023 6568 -9539 -11504 3477 12307 432 -12911 -7917 8529 9455 -4267
1926 -4267 -9970 3307 12463 4263 -7724 -3462 10160 8865 -7074 -13195 -1356 10031 1332
1939 1332 -13183 -10277 5628 11851 -856 -8887 -245 12705 7354 -5852 -6858 6423 9550
1952 9550 -3026 -12776 -2845 9358 4634 -10556 -11791 3745 12489 529 -12688 -5264 10345
1965 10345 9098 -5485 -8356 3745 11950 1791 -9434 -4522 9918 7140 -7989 -12944 -294
1978 -294 9922 1733 -11663 -8457 7765 11650 -1577 -8956 963 11864 5558 -6387 -6677 4634
1992 4634 7827 -4194 -12575 -2595 9238 5106 -9153 -9559 5161 13063 998 -10586 -3190 9352
2006 9352 8119 -6206 -8754 2757 9335 33 -10314 -3846 8946 6326 -8629 -11449 1848
2019 1848 10650 1200 -11332 -6522 8336 10415 -2543 -8340 1055 10283 3447 -8334 -7171 4942
2033 4942 7285 -5158 -11853 -1514 9532 4430 -8498 -8579 6635 12474 900 -10504 -2786 9771
2047 9771 6348 -7061 -8812 3324 8317 -1212 -10442 -3803 8365 5603 -7019 -9598 3821 11159
2061 11159 1414 -9738 -4950 8328 9627 -2385 -8106 1007 8604 2869 -8302 -5990 5393
2074 5393 5516 -5212 -9667 -63 10180 4388 -7332 -6708 6727 11377 -432 -8713 -3171 8115
2088 8115 4595 -6773 -8399 2405 7285 -1238 -8982 -1554 8471 5306 -6403 -7931 4288 10185
2102 10185 1106 -8914 -4755 6821 7247 -3661 -7984 326 7223 1180 -7885 -4712 5032 5671
2116 5671 -4699 -8404 1265 9787 3860 -6810 -5305 5970 8579 -1167 -8606 -2728 5493 3347
2130 3347 -7409 -7424 3209 6293 -1348 -7284 -309 8895 4939 -5674 -5721 3959 8573 -37 -8461
2145 -8461 -3711 5553 5252 -4099 -7715 129 6264 945 -6798 -3345 5918 4285 -3958 -6767 1828
2160 1828 8371 2806 -6208 -4286 5359 6785 -2066 -8584 -1917 4593 2264 -6673 -5141 3089 5547
2175 5547 -1083 -5274 697 7686 4506 -5347 -5577 4191 7104 -1367 -7439 -3801 4785 3820 -4137
2190 -4137 -5805 1801 5541 232 -4776 -1060 5316 4173 -3700 -5369 1908 6282 1473 -6118 -3620
2205 -3620 5146 5097 -2629 -7040 -923 4491 1710 -4545 -3055 3506 4694 -1161 -3668 1444 6504
2220 6504 3500 -4238 -4141 3376 5075 -704 -6675 -2563 4101 2451 -3259 -4021 2299 4635 729 -4106
2236 -4106 -884 4508 2917 -3447 -4301 1515 4945 808 -5353 -2939 3329 4601 -2352 -5326 -1042
2251 -1042 3776 1214 -3779 -2638 3117 3845 -1427 -3429 1177 5552 1194 -4317 -3255 2639 4141
2266 4141 -1493 -5834 -2468 2839 2476 -2841 -2967 1779 4217 675 -2047 -559 4651 1703 -3392
2281 -3392 -3099 731 3362 34 -4678 -2353 2781 3050 -1615 -3888 367 2854 1215 -2216 -1497 2819
2297 2819 2662 -1815 -2325 1469 4372 1088 -3369 -2735 1842 3156 -1199 -5134 -1683 3349 2230 -2028
2313 -2028 -1898 2489 3566 -490 -2081 483 2554 1190 -2511 -2306 425 2989 -184 -3374 -1650
2328 -1650 2306 2653 -325 -2284 61 2145 775 -1091 -1334 1479 1759 -1644 -2634 359 2659 910
2344 910 -3644 -1692 2010 3038 -1423 -3764 -437 2840 1975 -617 -877 2007 2045 -447 -2227 -156
2360 -156 1327 180 -3676 -2494 1105 1409 274 -2790 -120 3087 2132 -530 -1041 454 1612 202
2376 202 -1550 -1245 657 220 -2093 -2502 408 1926 4 -2309 -2501 2026 1840 -716 -1869 217
2392 217 2011 1189 -333 -652 520 995 -371 -1944 -412 478 -732 -2170 -1685 667 1354 -175 -1421
2409 -1421 386 2680 2126 -180 -593 160 1230 65 -1120 -1223 257 -490 -1900 -1532 575 1859
2425 1859 363 -1937 -357 1722 2152 663 -968 464 1935 1419 -814 -476 198 134 -1263 -1277 -105
2442 -105 386 -334 -2175 -538 1470 2068 584 -126 880 2456 2087 539 -505 -33 330 -960 -745
2459 -745 -823 -505 -333 -1421 -1293 -74 1860 271 -553 414 1219 1294 829 -243 369 239 310 -989 -230
2478 -230 187 -802 -1144 -1799 -363 209 -110 -864 -103 1248 1357 -139 -356 384 1961 1389 138 -190
2496 -190 -254 -275 -305 -1430 -543 -971 -403 -887 -567 629 1088 -4 97 278 1624 1332 934 -423 -398 909
2516 909 378 -239 -598 -749 -1110 -1203 -1194 211 435 -228 -695 668 748 1742 -342 -451 46 -114 1145 -147
2536 -147 -125 -603 -570 -633 -1413 648 -253 -728 -396 393 814 700 233 307 259 366 1073 12 -290 -326 -482
2557 -482 -250 -367 -458 -283 -463 -986 6 832 780 -313 135 1131 921 1135 -146 -340 -158 55 369 147
2577 147 -608 -489 90 -491 -353 -167 -316 -636 -572 -50 1100 1262 667 177 590 26 350 65 -813 -1522
2597 -1522 -668 -172 -58 -943 30 21 -567 -95 481 867 -440 -235 -66 620 408 101 -610 -536 143 305
2617 305 29 -575 -416 -951 -400 -153 170 200 -489 -273 135 251 566 65 -673 86 -881 -133 -207 -311 -542
2638 -542 -236 108 -136 -489 -210 -90 -166 141 516 -88 -84 -680 -302 -35 441 -504 -92 -284 1135 105
2658 105 -216 235 215 443 351 114 273 -166 4 -658 153 64 994 -365 96 -96 284 -386 -155 -202 -835
2679 -835 -35 181 218 217 403 64 178 695 204 -396 -453 -958 -256 152 121 133 -382 73 187 220 501 -40
2701 -40 332 208 689 822 118 -227 -1095 -582 -44 312 14 139 -778 -30 495 623 254 -518 0 126
2721 126 633 451 522 385 171 -273 419 16 -324 -289 -187 -580 886 33 -375 -492 636 1108 -432 650
2741 650 74 5 -8 -207 355 211 -675 -577 -881 -173 603 408 -118 343 75 383 393 131 -284 -473 -111
2762 -111 96 341 -77 -71 -1658 -763 -129 -752 164 -697 -225 -205 -187 473 545 -189 384 724 210 -193 -22
2783 -22 -225 91 -799 -118 -260 -627 -1342 -358 -570 42 810 508 91 384 965 1000 609 -173 -3 -326 -441
2804 -441 -564 -254 -23 -218 173 -303 -229 452 -101 -1520 481 193 729 296 -547 -843 466 -76 173
2823 173 -193 -1023 -895 -148 120 524 312 -614 -158 -96 710 892 306 688 449 591 755 105 -729 -955
2843 -955 -323 -50 -200 -258 -733 -377 -914 271 -29 -62 357 409 397 115 277 -155 87 -745 -191 26 102
2864 102 -438 284 -385 -770 142 580 -237 770 -335 -100 1242 -42 -390 -317 570 303 -168 163 -349
2883 -349 -606 -1335 -310 -447 -277 -595 -175 -273 383 941 380 -458 40 -608 359 -53 -18 -80 -347 -360 6
2904 6 -128 129 566 335 -133 507 956 69 738 -467 414 396 382 41 -663 -207 178 70 73 176 -415 -498
2926 -498 435 367 -450 87 224 674 660 313 788 24 -180 -721 -396 39 -187 -322 -826 -37 255 -250 591
2947 591 22 1062 336 572 991 12 332 -69 -304 -227 173 -1062 219 -42 -270 168 -231 -156 347 555
2967 555 -86 707 -139 274 108 432 -136 407 191 -673 -1086 -968 -217 -257 -55 -118 502 212 40 549 633
2988 633 85 567 323 237 -655 -301 -260 -635 -279 405 -171 -716 -309 435 45 -54 -296 671 640 102 310
3009 310 23 -74 -666 -87 -1121 -158 -83 28 -567 -442 -563 300 201 511 -180 614 157 1274 1128 300
3029 300 207 -328 -226 288 -722 -83 -1004 174 -324 -474 -695 656 -92 876 489 510 573 -146 802 15
3049 15 -233 -46 6 -650 -772 -1133 73 78 -4 -564 202 -81 147 679 372 -432 533 -7 -84 231 -95 -576
3071 -576 -542 -882 -625 -623 -885 -542 -379 -792 -182 70 474 -222 -100 573 527 916 269 316 -75 -371 -720 -412
3093 -412 -124 -1100 -239 -182 287 -786 -209 -24 371 626 156 1022 730 487 -324 489 182 -105 -261 -484
3113 -484 -373 -331 -1044 268 -354 -277 376 37 1061 988 257 876 1435 992 364 -41 -696 -339 -47 -529
3133 -529 -3 -557 -666 -197 317 192 64 -19 201 798 998 993 1563 880 -117 -396 249 -746 -345 -323 -659
3154 -659 -976 -91 -484 83 -145 233 37 404 481 398 98 193 461 281 -115 -302 -375 -689 -1002 -447 -555
3175 -555 22 63 -124 321 203 712 330 330 -24 -374 826 -65 -756 392 72 -215 -928 -234 -482 -273
3195 -273 -60 -125 545 505 271 504 262 508 -185 -376 367 -21 138 -500 -826 -750 -406 -602 -817 -905 -384
3216 -384 -85 -127 797 356 171 142 115 207 540 235 553 -341 -236 -269 -916 170 301 -50 -391 -298 508 97
3238 97 545 250 238 287 159 -147 254 377 8 134 -467 -102 -22 41 -474 134 -119 476 -348 -177 382 227
3260 227 -239 -77 611 -448 -367 -155 -289 -373 -215 -621 -32 352 -453 -40 -257 541 44 -31 382 284 406
3281 406 -302 257 80 -423 802 -183 -149 -105 -449 181 -318 118 -368 -747 177 405 -17 -375 -322 -170 -52
3302 -52 56 -18 376 -27 -570 -444 -82 -322 -416 -990 -420 533 398 474 369 -119 617 -37 404 -65 -439
3323 -439 537 -187 -365 -333 -404 -4 -548 -770 160 -475 391 -257 -170 -365 723 800 1090 115 245 -701 -484
3344 -484 25 -166 -483 234 330 455 -199 -320 -502 -191 90 -246 345 -310 500 41 144 1032 -743 15
3364 15 -387 -197 97 -102 -482 -26 594 214 348 -220 -145 509 795 -34 272 496 -276 408 194 -205 -153
3385 -153 -606 -1125 95 182 -647 187 75 -393 191 212 696 662 121 -230 407 -305 -66 -198 411 499 -197
3406 -197 468 207 -161 968 90 404 725 307 287 167 -241 273 -466 128 -209 -185 -201 -813 -254 -54 312
3427 312 -158 -323 59 184 74 -77 79 298 78 268 -106 53 -474 -42 -1 -355 191 506 -644 199
3447 199 62 -154 358 -34 60 845 221 -386 -92 186 1019 -132 528 371 -81 135 -277 13 103 847
3467 847 163 -7 -58 -252 -154 361 -2 45 333 661 -520 515 45 295 -208 70 216 151 324 -16 318
3488 318 585 114 447 5 113 731 90 5 -544 -175 26 -61 -189 -196 -343 -571 296 -239 65 284 -148
3509 -148 -146 -103 140 -219 529 -204 -154 484 963 -112 505 -125 25 454 -279 161 241 383 427 597 -237 -196
3531 -196 -203 -110 65 -30 -407 -163 -293 1068 46 31 -376 367 -535 -88 -601 534 40 -269 190 -119 -504
3552 -504 37 213 -363 262 639 529 -755 -240 90 1032 -108 -211 -448 289 275 -298 -227 -303 217 422
3572 422 114 -336 329 892 -53 -76 1205 441 311 -213 87 -18 -113 -344 -166 -617 -249 522 -812 -408
3592 -408 -31 120 -276 -323 -1014 44 227 171 557 641 208 -286 -348 135 -867 563 69 -215 435 197
3612 197 -26 -307 -321 327 206 20 5 224 466 531 -321 -432 904 567 71 -342 -477 -77 -586 -285 -211
3633 -211 -180 1146 -699 -902 -552 432 -457 -663 -177 -27 216 -245 -350 -796 -639 190 -452 -73 -396 -290
3653 -290 -515 -309 -455 -42 -35 -480 -169 -136 49 530 -123 -418 -167 636 -763 -911 -229 469 438 161 -1226
3674 -1226 824 236 -72 -119 424 365 -411 -604 -830 556 -131 61 -22 -389 -100 242 -349 284 759 226
3694 226 344 -317 30 239 213 66 -275 563 359 347 -549 6 960 257 -1125 -375 77 377 -156 -4
3714 -4 -379 233 658 98 -226 -95 340 339 -433 180 309 1070 -629 -886 -32 535 -99 -1193 -792 260
3734 260 351 -318 -235 -366 -336 141 -538 -262 -213 -132 77 -971 -727 238 398 220 -71 -88 958 111 -330
3755 -330 -141 -72 600 376 -650 -385 142 -134 -923 -357 305 606 50 -430 -491 296 -119 -554 60 349
3775 349 477 637 -281 -399 235 152 -683 70 125 -21 -593 -209 -449 -427 65 172 152 582 506 474 -203 -468
3797 -468 700 -140 473 -481 219 525 465 -515 -309 391 779 -1300 -290 -21 712 279 -380 -95 277
3816 277 1113 10 -132 -463 579 -152 -744 -423 579 121 47 283 -744 246 -282 -601 -55 461 325
3835 325 196 -30 -54 -65 761 -300 -577 643 -104 -319 57 -88 262 407 184 95 221 867 318 -122
3855 -122 -30 777 681 -111 -1370 -750 470 -271 -140 -491 187 552 -124 -981 -98 123 354 -379 229 1094
3875 1094 48 486 -747 -307 620 242 27 -504 -439 530 -451 -151 -152 351 397 393 324 181 -70 70 -420
3896 -420 -277 207 254 -473 -1123 -478 141 33 -677 45 293 -311 -552 -244 -210 440 -139 242 -168 44 332
3917 332 -116 574 -223 222 199 -247 -161 -41 -47 -327 -407 -376 -52 187 -926 149 -156 419 102 -1178 -108
3938 -108 -419 779 -490 -729 551 -586 483 11 -65 -285 -277 376 -1225 -41 638 -1 -366 -592 -263
3957 -263 952 647 -687 -422 -351 222 158 -1113 -90 466 345 376 -29 1124 215 -127 -611 235 853
3976 853 -175 -539 -732 460 137 190 120 154 144 -282 -37 -26 390 354 40 126 93 1044 617 -526 -367 -1025
3998 -1025 272 135 -316 -100 -75 -85 -404 -772 224 -16 748 -236 316 814 495 329 -591 -149 379 -409
4018 -409 -916 -9 505 244 -947 -680 -535 -36 -35 -214 33 721 239 -133 -551 -317 2 -258 -356 -587 473
4039 473 314 -496 -221 -8 308 -317 -511 -187 381 725 514 -89 237 789 -34 386 -665 -109 181 -406
4059 -406 -668 -126 -6 -192 60 -190 73 538 308 -427 475 89 407 -259 -264 -625 437 923 -177 -254
4079 -254 -211 669 -166 -249 210 344 -133 -100 42 206 89 344 -415 -6 1 283 197 -347 -341 330 -309 -381 242
4102 242 -332 181 63 113 70 524 -496 263 391 -31 32 -173 -292 -70 292 -178 519 -1164 -364 -228
4122 -228 97 -300 -494 -107 628 171 -337 -474 -475 -459 77 -67 76 -303 -613 -316 -767 -52 -261 -45 9
4143 9 -36 -6 358 -323 291 9 -625 71 -283 413 958 250 -326 -149 502 562 -573 -1117 -75 -141 -402
4164 -402 -281 51 -166 -209 -70 -437 -122 427 -48 33 -396 -190 258 -343 -142 -267 -300 -170 -143 -165 279 613
4186 613 292 -237 625 -498 86 -31 -583 22 346 -617 -104 123 81 365 281 523 33 -441 -47 -464
4206 -464 -264 113 735 43 -816 -418 -149 -76 -768 41 -416 560 -102 -214 55 548 -587 57 -85 -26
4226 -26 -326 36 -182 -719 279 -319 195 -550 451 374 -302 145 -175 -306 628 -289 522 55 257 22
4246 22 -338 -243 -267 -149 -436 -337 -168 -548 -66 200 -111 622 -57 -32 38 239 485 345 -109 365 -267 -339
4268 -339 451 354 -334 233 -124 -520 -110 387 -140 -301 277 125 -678 -1032 144 -491 153 107 345 -624
4288 -624 100 -446 -141 -184 -1120 -62 266 -822 -204 -603 -77 -140 -153 133 206 -186 454 429 -684 555
4308 555 -503 776 343 -485 544 159 496 -695 -198 299 -409 55 -622 516 433 -92 482 958 200
4327 200 -132 -138 -183 154 96 -235 -62 120 335 -68 293 -23 332 56 -412 455 -143 199 -235 -262 292 -279
4349 -279 -407 581 -545 324 177 -350 -353 70 -360 217 422 248 440 135 -45 -486 -251 718 -87 -222
4369 -222 -347 342 598 -60 -74 -155 -468 153 -442 -148 -446 -670 -135 -418 1 -254 -139 138 -71 351 259
4390 259 -149 -160 -219 -122 -226 244 73 263 -320 259 -609 471 284 -514 412 -320 502 323 97 -35 -260
4411 -260 -310 293 -528 519 234 110 -159 -210 646 248 40 -284 110 -78 14 95 90 423 258 -155 -125 488
4433 488 -14 -189 -285 -412 223 1054 136 307 54 193 -743 -582 -404 82 91 -94 368 362 165 87 -170 59
4455 59 308 150 -18 113 17 678 -524 571 -233 -233 324 -834 -51 35 548 -10 130 316 -55 510 152
4476 152 81 766 113 14 -479 -329 -584 421 -89 -900 137 -554 -504 -121 51 260 -402 162 -102 -899
4496 -899 -84 -181 130 -96 254 75 -628 121 -548 653 430 68 -155 -59 225 -179 -806 -244 33 -51 -231
4517 -231 -135 164 230 697 -716 -393 626 -22 -198 88 -11 329 -340 25 -425 248 -565 613 25 583
4537 583 11 -453 -263 -498 -618 534 437 320 260 -444 -389 330 -32 -50 404 175 -616 -719 -71 -1102 -31
4558 -31 -196 114 229 170 -378 689 -64 207 513 -491 -155 401 -14 -194 783 -475 -1231 3 -186
4577 -186 268 114 -121 190 -32 721 13 -50 590 588 650 444 -250 -34 -271 -226 644 210 -198 -300 -245 -25
4599 -25 -65 299 673 53 50 -179 500 -225 95 -156 -30 -412 532 531 197 -129 475 220 623 -510 -647 -375
4621 -375 -750 -97 627 -430 -172 237 350 -23 164 -213 213 286 245 25 670 447 97 201 245 147 67
4642 67 824 533 71 -236 34 -62 77 -114 -39 -283 -95 203 78 -290 -507 510 518 432 -69 -111 455 -430
4664 -430 -74 176 296 -246 478 -578 -235 300 -308 -497 207 517 -12 20 -418 -131 451 -595 354 250
4684 250 238 435 237 -143 -255 -461 -920 550 566 -688 -282 -133 -20 493 893 123 -190 693 330 445
4704 445 432 -60 -108 -350 -849 497 -210 117 -271 -137 -146 51 -297 40 -695 -19 -210 823 183 147 268
4725 268 93 -597 -192 -18 221 633 -1096 -165 -9 -14 -619 102 -26 577 -77 124 -159 -334 -29 251
4745 251 -520 -299 -50 -279 -233 2 129 -855 328 669 347 305 8 63 433 333 597 -552 664 558
4765 558 -44 -65 193 169 -87 -370 179 -171 -932 42 -13 148 364 -270 -415 -389 -296 386 -152 -189 65 -322
4787 -322 -297 130 -693 320 -253 16 348 358 410 587 -595 -84 68 -211 -130 48 -615 -286 -307 -657 233
4808 233 680 -269 593 -72 -422 664 241 140 116 -117 223 208 -576 299 -122 169 -62 34 163 -156 447
4829 447 -99 -187 -635 300 38 69 855 -168 253 646 -422 -327 329 48 -604 -107 903 432 402 231
4849 231 339 -546 -259 -141 -154 -304 272 618 107 176 -101 -116 264 -225 -148 69 -289 177 -241 -382 -179
4870 -179 -281 143 634 -113 -224 57 54 -133 -227 -68 676 -7 -327 427 -37 -594 2 333 255 -671 -352
4891 -352 -226 402 -45 -1135 869 17 381 17 430 229 581 -137 468 257 241 829 -109 -242 -493 -105
4911 -105 -246 -9 138 100 415 66 -117 136 3 -155 -335 341 465 498 251 -254 1011 -502 160 -136
4931 -136 -514 -504 -275 497 12 -265 295 -387 -67 7 -846 219 13 -395 80 47 179 -248 481 24 412
4952 412 245 98 -85 631 -254 246 29 107 -134 217 668 506 315 234 90 -782 59 444 -136 -146 619
4973 619 -656 359 -81 -220 -341 -156 46 205 278 -254 -433 -380 76 191 492 -111 494 -76 84 -223
4993 -223 292 -256 159 309 -527 388 22 -347 53 131 522 669 4 -121 -523 -891 -85 -46 -676 473
5013 473 -610 -379 125 527 46 -351 -391 -41 227 -107 -433 429 29 162 573 -327 -284 413 -396 131
5033 131 -46 -43 -431 -1002 -167 -55 39 -88 31 -185 6 -44 95 -218 -325 166 -180 -146 284 240 -938 233
5055 233 350 -263 -3 -147 167 -718 804 -696 -498 -249 344 -554 -280 -594 -91 -379 630 221 147
5074 147 153 -197 453 224 101 -181 -75 -603 -271 -266 121 -83 -442 -155 -44 10 -633 123 59 53 -1248 -109
5096 -109 -27 226 45 -21 -344 -311 377 673 1100 -254 -199 341 -166 -292 -147 -253 128 61 -168 413 -157
5117 -157 -263 -504 -119 -69 -151 -364 -104 124 -53 250 643 666 132 469 -781 -690 206 50 126 740 116
5138 116 -542 -675 148 169 -58 569 -486 1 625 -287 140 262 -507 200 492 165 -56 -222 -506 -166
5158 -166 -50 -107 -649 -858 86 -422 -187 684 359 -178 199 250 -141 242 -218 -76 -130 144 -187 -146 -65 -159
5180 -159 -835 289 440 -184 -355 31 56 -18 -112 -1144 -431 11 -168 -271 -428 20 305 -123 -291 -242 823
5201 823 -257 678 -296 477 42 375 385 -180 2 -95 -294 222 253 -76 -774 274 566 105 -318 253
5221 253 780 -2 115 48 28 -15 -186 217 -511 -318 418 -87 -447 343 390 -442 -203 -306 276 -269 -474
5242 -474 79 -511 288 -313 -167 -158 -439 245 217 25 -1047 -269 407 249 166 740 -12 3 -422 294 -62
5263 -62 -44 484 -47 462 -183 68 130 -984 -20 -368 67 304 -134 -168 652 -354 94 91 311 -1 -296
5284 -296 -240 642 59 -341 251 562 145 -232 -3 395 766 33 -673 -550 -530 -36 472 -522 600 -342
5304 -342 -443 -240 -371 -145 865 -120 -255 261 -327 -413 614 -520 -233 -390 122 121 -539 563 566 -171
5324 -171 -212 -540 -48 -634 -410 -191 -133 -213 -25 152 469 212 -417 -417 267 846 437 358 -422 -612 -169 -844
5346 -844 -533 -106 42 389 -78 -256 -307 -247 295 -25 -344 469 -129 -487 335 159 434 529 -368 375 -178
5367 -178 -380 156 450 -570 473 -101 -495 617 570 242 73 580 251 337 502 605 2 80 283 -650
5387 -650 -105 280 280 436 103 -209 -135 -46 729 35 40 -510 36 -655 -190 708 -22 -164 20 -1 312 -734
5409 -734 -19 -59 305 56 -447 -638 -230 349 254 -388 164 -192 243 462 -72 -140 -67 326 -338 457 -58
5430 -58 -466 363 161 9 178 355 -624 429 125 370 185 -359 -703 35 -31 -526 -665 353 284 575
5450 575 133 53 -104 -660 -150 307 430 153 -99 -569 -10 -25 -462 -69 583 365 40 -302 -366 -354 -318 -496
5472 -496 -210 100 434 -295 56 -62 -174 -751 336 -366 -514 605 -263 -160 -13 69 41 -316 464 245
5492 245 -542 5 321 273 110 20 476 264 171 98 -559 372 -193 -639 1036 -232 208 -395 -93 172 148
5513 148 774 265 132 -178 20 -416 -454 206 255 -497 536 152 -186 -199 201 -101 -427 -394 238 553 227
5534 227 187 103 460 -139 -44 -207 32 -385 96 193 103 542 -529 75 -135 -115 269 18 5 59 380 167
5556 167 -385 13 -5 233 621 255 330 -53 121 -773 -78 52 -366 -306 335 72 -325 -301 -118 56 -293
5577 -293 -414 243 -168 36 365 488 -405 -305 549 -595 -507 356 157 94 280 -186 -58 135 -242 -192 217
5598 217 464 915 235 -211 30 404 32 402 151 -598 15 -99 625 -246 -880 215 -747 14 244 -136
5618 -136 -38 -602 82 122 -414 -686 674 -1019 126 602 -210 144 268 18 -260 -384 -523 -486 -407 -186
5638 -186 597 -611 218 202 224 174 -437 -104 -291 -221 -437 -33 281 -122 -20 4 -288 378 -403 58 600
5659 600 -361 423 44 -219 107 -83 414 -431 99 175 -579 -49 337 -269 -209 220 37 214 492 -2 -348
5680 -348 -47 -102 -306 678 -102 -427 557 -44 -1423 314 777 -385 -317 -127 211 258 -50 73 -6 469
5700 469 -333 -62 483 186 -85 80 -78 266 384 51 240 -434 184 -23 398 120 66 344 545 -457
5720 -457 237 -746 262 -224 -272 -25 295 147 -206 76 -634 -79 -606 327 -300 -146 -77 64 -42 469
5740 469 562 -381 -189 473 -452 -295 77 105 -390 -69 -338 65 164 -697 516 417 303 166 -137 -20 -510
5761 -510 144 -44 529 -174 365 415 324 1061 31 149 -438 -390 -62 -490 -50 -156 -140 250 589 420 -270
5782 -270 692 -316 -551 32 -532 621 -918 -55 -332 -611 -587 11 134 -82 -301 -107 202 -302 445
5801 445 234 461 243 71 -547 -197 -437 -61 -161 -86 -41 122 -438 415 239 -204 -243 -334 -11 413 245
5822 245 63 -21 -122 109 145 83 124 -161 1 -95 219 -174 140 317 -171 -132 -166 -299 -368 187 563 567 -34
5845 -34 -37 -472 -331 346 263 130 -555 -495 -879 -97 495 282 199 -234 -558 -614 -367 657 -185 -116 -486 546
5867 546 366 -101 -115 55 238 -37 -154 -222 -195 -299 57 381 -198 -676 -20 6 244 -62 -556 -502 3 -204
5889 -204 -191 385 46 447 -145 68 -83 -223 -389 211 -14 -334 -214 219 196 -315 -63 705 1016 526 291
5910 291 -113 -165 15 -41 14 231 65 -471 219 -415 61 -591 289 -355 -671 74 -832 -203 5 69 -120
5931 -120 791 -288 -399 383 -150 -213 -110 -20 285 60 374 -251 -287 -48 -537 -82 -68 -500 -114 130 -268
5952 -268 -351 -436 278 708 487 -313 -542 111 -331 93 -130 -124 -79 -14 -563 226 -441 646 -105 603 425 -497
5974 -497 492 -330 -316 1116 -11 -604 -321 -259 181 62 409 -94 145 -112 427 -687 -51 195 877 -513
5994 -513 -190 605 613 -338 846 136 357 725 89 301 72 93 -259 -325 -421 594 -336 -74 -26 577 -341
6015 -341 -220 475 -890 251 -320 -609 -523 219 4 -92 450 -149 449 -8 -429 -628 -137 134 185 -579
6035 -579 288 -204 521 435 -555 732 96 309 16 -315 -398 943 476 -275 2 272 -386 -300 -109 552
6055 552 86 -638 -49 216 61 30 -217 -273 585 -293 -252 851 -284 -313 87 53 -194 -10 170 387 385 -115
6077 -115 -196 -353 -271 218 298 58 -175 -492 619 -133 455 -52 -490 -419 -58 425 -205 -381 257 -24 -496
6098 -496 326 668 -379 -4 35 -380 334 329 -13 -10 677 -428 307 319 -218 -118 -35 -503 157 3 -488 147
6120 147 -441 199 -286 -254 -244 -5 -14 27 381 289 82 283 35 -661 -51 788 28 -530 -133 -156 -76 515 158
6143 158 -119 -249 -415 -190 125 -38 -97 -226 156 -294 -127 -250 -301 -287 -490 -126 320 -244 248 -445 -373
6164 -373 431 142 236 746 -180 275 136 -285 154 -182 16 21 -135 -180 595 -153 -30 -89 -137 199 335 -589
6186 -589 143 -98 -447 -181 -649 392 -163 61 -52 43 816 -7 120 -842 -352 -321 267 365 379 -638 173
6207 173 -37 131 13 110 322 285 -92 89 -432 -264 -703 -214 272 -93 -366 -492 636 -79 -334 -178
6227 -178 -255 -243 4 2 63 -68 -101 429 197 366 -201 -300 179 253 236 229 -55 -539 899 -221 -167 849 -851
6250 -851 770 101 -544 -60 66 -401 -334 -52 -77 285 -517 -47 -159 -322 -667 -387 -150 334 -200 -290 -151
6271 -151 -105 383 -474 -445 59 -210 144 326 -280 563 264 -17 333 -275 -204 -204 -146 -361 150 284 582 -294
6293 -294 -406 -240 -739 -379 -603 -109 -417 369 285 620 -56 -509 -15 -138 419 -104 -460 161 726 -177
6313 -177 -37 32 88 -26 60 -70 53 -933 86 -611 -372 -619 -418 -126 815 -334 377 88 -326 -162
6333 -162 -207 147 -865 -665 -214 421 -475 -871 157 -186 30 77 63 -314 -868 -61 -188 -551 646 115
6353 115 -363 84 213 242 303 127 -1 -125 -448 77 -347 132 -618 -341 194 825 -271 651 260 -250
6373 -250 593 502 -279 138 -386 178 -101 261 -113 191 212 -83 285 -42 635 -108 -491 -466 321 -625 553
6394 553 363 743 -6 341 63 -435 210 92 -142 -147 -145 -61 -339 -183 -248 -94 -354 -318 -569 1022 -48 332
6416 332 302 310 622 -98 -80 542 201 101 311 234 -441 105 110 -250 37 338 -392 -528 -461 544 416 -46
6438 -46 -532 -607 365 -543 1102 -202 -472 460 -154 340 98 -229 275 -142 176 -459 21 -339 -473 -915
6458 -915 596 -407 39 -203 -297 403 1122 494 261 454 513 333 -302 583 453 487 -109 -260 -215 -21 902
6479 902 -84 -163 -541 690 120 -440 104 35 -146 -115 -848 -36 -69 630 82 960 36 -396 340 -49 155
6500 155 161 55 -254 -198 -141 617 368 45 539 -29 243 -95 -466 -87 -446 801 463 -22 -406 -31 -262
6521 -262 -621 -188 174 -298 376 77 36 -213 585 362 -702 60 286 138 -513 -653 -129 415 -176 216
6541 216 -564 138 -818 420 315 129 437 116 855 93 13 -93 402 -131 -635 387 -342 306 -667 -407
6561 -407 -289 -315 -160 -737 44 -593 -46 -423 15 -515 152 134 345 250 -53 128 96 -59 167 -527 -20
6582 -20 351 -379 153 -26 -231 66 252 19 -614 363 122 -294 49 585 -560 200 268 -463 79 153 -238
6603 -238 -497 336 -106 -57 -74 712 -40 -708 277 -222 430 405 -320 534 232 -1154 167 302 -520 137
6623 137 -457 -843 326 -334 -412 471 735 385 579 118 -443 -9 600 164 251 -31 -95 113 -347 -181 -462
6644 -462 420 -190 404 408 -101 -114 50 -609 654 -29 47 482 184 -32 153 -145 -344 -115 -93 323 -198
6665 -198 649 -279 92 -566 174 -456 -370 230 -140 325 124 -502 -326 282 -252 -466 -970 102 -351 -50
6685 -50 -569 -422 156 -356 142 -67 -127 1107 -472 336 -487 2 -434 202 115 -322 -28 -132 238 -490
6705 -490 94 337 209 403 -103 266 -493 525 398 -131 129 388 215 102 -366 44 92 -14 222 195
6725 195 389 475 169 -416 -52 -670 591 -165 208 163 -380 -519 56 388 -348 -652 -412 -124 108 -316
6745 -316 442 289 290 166 -91 127 255 -62 348 146 -563 157 -81 110 -414 425 -259 487 622 -508
6765 -508 505 -316 -435 171 -59 256 310 -375 -126 397 -448 304 69 -2 149 -8 9 578 -210 -303 777
6786 777 212 -564 -301 -140 -251 38 -679 105 913 -330 376 143 81 92 16 -147 -388 -366 -225 -196 415
6807 415 42 -42 193 422 -284 850 105 -142 -122 -726 157 -28 754 287 -112 -549 -632 84 -340 672
6827 672 -228 -169 -395 42 -171 128 -280 -137 -380 184 690 441 271 -228 -444 -312 94 -102 -183 373 -155
6848 -155 -497 90 32 594 -566 216 240 15 85 41 -101 262 -559 -185 679 293 323 195 -20 -59 -21 -504
6870 -504 -135 -424 -370 960 -214 610 -94 374 150 -416 -350 5 -435 -538 85 71 454 341 -362 383
6890 383 195 916 657 304 473 -152 -828 -117 124 293 -355 692 287 -763 308 -224 -531 -429 -77
6909 -77 36 -654 101 -172 -426 -5 -69 -375 -539 -12 -279 35 73 -620 408 -125 24 283 -143 186 -638
6930 -638 326 -488 -182 37 502 482 -714 148 -448 -62 591 191 -97 59 543 -427 -160 71 56 -234
6950 -234 -363 -477 94 318 -378 -301 -111 -745 -10 548 124 28 441 438 -266 369 36 729 446 -458 -464 712
6972 712 -253 407 -397 -431 -168 149 43 115 -2 229 198 -348 -8 -214 241 -352 710 -153 -239 -23 166
6993 166 415 -740 84 -452 -481 42 -481 -89 -100 -515 280 181 169 -380 546 281 152 190 -120 510 11
7014 11 216 -286 -102 -542 345 553 242 452 -449 -507 240 -332 -355 -585 -522 490 -72 -422 502 -9 -310
7035 -310 -22 165 -312 155 840 -549 -168 -524 -84 93 -709 -499 -580 26 544 -667 -742 -215 230 507
7055 507 -175 90 67 75 96 -252 475 33 547 -600 67 531 349 -345 -197 274 470 362 540 -192 92
7076 92 -400 458 104 -354 -21 358 -257 -375 -50 281 -137 -93 -712 94 40 -515 400 -144 585 -557 -67
7097 -67 -524 137 -331 406 215 412 -170 364 9 -28 2 395 -273 -35 394 323 -361 299 -242 -201 234 -27
7119 -27 668 -279 -9 612 94 48 41 310 -404 260 -197 399 -13 58 -248 339 78 175 10 -61 -127 -110 -404
7142 -404 266 -411 101 534 -116 329 54 -218 173 -649 323 -627 522 -306 -1396 -375 -167 434 -155
7161 -155 201 249 -280 289 67 -554 829 -323 196 -21 408 -25 -16 -217 43 68 172 -28 30 82 -26
7182 -26 -157 384 251 -358 -407 -112 506 125 335 469 -855 156 -547 108 63 -395 -635 -363 478 -262
7202 -262 -162 -157 897 -565 -237 490 259 99 431 165 -631 -208 -317 471 -455 493 -769 -154 347 335
7222 335 72 -264 -121 443 -988 -478 -112 -41 -336 -245 613 -51 187 -13 4 142 477 4 -381 -445 -281
7243 -281 172 141 162 682 2 509 197 -479 265 -184 -565 8 389 27 -118 -31 856 61 -243 127 -264
7264 -264 -219 681 580 227 390 -836 -63 -364 264 -7 248 191 32 -160 11 -213 -386 294 -174 411
7284 411 -40 -456 110 543 90 265 -223 -195 -418 -629 546 479 466 -142 208 563 -163 73 -499 57 -154
7305 -154 -88 -32 -333 -151 52 93 246 39 320 107 -464 315 -548 -299 189 699 -46 -336 410 -541 771
7326 771 -734 -767 -272 -96 838 486 -63 139 -164 -406 743 499 181 -565 -342 805 577 -214 -82
7345 -82 -189 764 -610 -88 -521 -411 -81 -284 431 400 727 -377 -578 275 481 -420 -358 308 524 137
7365 137 414 455 410 247 -981 72 -216 72 187 -536 98 66 -169 156 -169 335 -153 13 149 -529
7385 -529 -286 11 -331 -30 430 -217 -652 -507 -333 -516 8 306 221 141 163 -275 56 -233 343 369 503
7406 503 349 -6 360 -341 198 631 164 321 427 278 126 467 453 254 -156 -576 -327 -218 98 68 271
7427 271 -53 -413 -23 -555 258 445 295 -115 283 -98 333 502 65 312 122 377 -68 47 272 32
7447 32 211 -417 47 888 -192 470 -99 29 385 574 64 -606 352 745 -568 -69 318 160 -305 -36
7467 -36 -76 324 652 -435 41 -327 -124 324 -418 567 297 -55 441 265 -125 216 156 208 322 -244 -262
7488 -262 -179 -308 255 20 1 6 634 152 381 -5 224 49 -103 130 -197 27 229 -54 530 22 -50 36
7510 36 293 -220 -18 -106 232 64 458 252 -282 -98 -165 -488 -373 171 -537 610 19 335 86 74 360
7531 360 -499 258 399 527 -9 -226 763 223 113 709 84 387 254 -101 -429 -648 369 -377 237 84
7551 84 303 111 52 -110 500 -185 508 -497 408 239 -301 18 -505 -54 -553 -26 -194 -272 -591 518
7571 518 -555 104 303 568 -213 930 212 133 161 552 -37 -278 -573 -583 208 15 -22 492 -179 -365 477
7592 477 -262 1311 78 -2 -165 -164 -154 80 -423 -293 -74 304 51 749 526 182 -619 -225 39 101 -360
7613 -360 -299 70 924 -104 -281 -370 -141 -639 132 -19 -51 -91 -64 196 60 -327 -329 209 168 -57 -11 -856 126
7636 126 317 259 264 456 257 -194 422 -122 503 -93 -77 10 -129 -630 226 528 645 -374 90 -149 -280
7657 -280 331 -20 69 -441 -740 -308 22 223 179 -697 -121 -61 -634 476 153 354 -129 -87 222 193 4
7678 4 183 267 11 -107 83 183 717 405 -598 290 132 98 507 466 266 221 699 -32 -45 -230 -47 631
7700 631 -18 -180 -569 343 94 98 -149 -565 -131 -354 464 12 -213 -396 183 -258 462 -285 168 15 34
7721 34 -158 105 430 -444 -436 -217 477 -529 -319 -237 -160 -403 -925 -270 -284 -37 -249 -230 87 709 -22 -286
7743 -286 -371 662 694 -145 515 -112 -290 834 103 -15 503 21 103 -529 -65 405 -48 -27 124 193 155
7764 155 829 14 -51 -170 322 -436 -65 46 150 -125 228 -310 -128 346 141 247 -56 282 192 -536 -162
7785 -162 -619 61 -70 471 250 114 182 652 -450 -346 355 -588 736 871 -721 -334 603 -232 -142 -75
7805 -75 -399 -307 -389 -296 222 -699 266 -248 -357 -440 -114 683 -97 -343 -491 -379 766 -392 120 -126 445
7826 445 188 303 286 56 -39 82 389 306 771 -450 -145 -479 335 10 643 -247 -154 -204 -845 607 -183
7847 -183 270 -403 -633 -646 122 522 -17 -101 182 219 -299 -40 394 588 -3 -136 -688 354 52 -503 -319
7868 -319 -245 470 118 -301 36 108 3 740 239 -194 -5 -245 -251 279 -406 -70 -182 -795 -461 111 175 -66
7890 -66 -460 123 164 -31 -99 -411 159 -25 529 -321 -520 -59 -478 -425 -620 -194 285 148 693 25 -23 -35
7912 -35 -345 -91 137 -663 124 -310 -380 -269 -265 -157 -605 -309 -252 391 -131 -358 44 -61 -101 81 -213 135
7934 135 485 239 -1 -134 -451 555 128 -132 -44 362 172 -611 -109 243 161 336 -251 -168 -11 224 14
7955 14 -493 84 52 276 -565 306 -192 -265 -626 -210 962 -22 -180 -39 333 -312 -315 292 372 316 -218 -814
7977 -814 285 602 -26 257 -224 163 281 -99 -62 -76 -292 -85 559 -487 -365 -53 -45 -286 529 -510
7997 -510 186 -191 -183 -139 -159 101 -665 -130 -81 656 -465 473 29 -185 21 -387 51 -311 -165 517 310
8018 310 -265 168 463 -27 485 -306 -71 45 -9 294 297 449 -496 -60 631 545 112 -96 74 -166 315
8039 315 11 361 -498 240 -30 -336 -373 -71 -508 278 974 43 578 -734 -447 -461 35 -59 409 780 -328
8060 -328 -77 428 128 -229 561 -233 726 -248 -74 366 -450 378 113 98 -685 -117 206 136 252 268 -52
8081 -52 284 113 -344 520 -315 -294 658 -516 486 -144 -100 -219 -544 -399 -455 -96 -371 -164 133 -101 -195
8102 -195 134 -291 -312 408 34 441 257 -271 -388 -207 -50 167 -180 662 371 -203 -303 408 289 29
8122 29 442 255 312 -355 -808 -277 -360 -413 595 -311 -435 -25 -56 119 605 530 724 253 -253 -778 -184 79
8144 79 -255 -210 -230 -888 -311 -256 472 534 275 -142 480 -473 -91 -64 107 477 -218 -113 528 -260 -392 403
8166 403 335 -556 -533 287 -196 -12 131 112 -7 -147 383 -358 -318 398 71 -107 47 244 -197 325 193
8187 193 -66 -213 -264 210
8191B10
$$ Imaginary data points
##PAGE= N=2
##DATA TABLE= (X++(I..I)), XYDATA
0 0 0 0 0 0 0 0 0 0 0 0 0 0 0 -2 64 -64 64 -64 65 -92 128 -130 192 -194 255 -260 322 -381 413 -467 536
31 536 -641 712 -795 908 -1033 1150 -1292 1436 -1603 1782 -1982 2202 -2437 2691 -2974 3288
47 3288 -3618 3985 -4398 4844 -5327 5882 -6487 7168 -7935 8816 -9815 10981 -12361
60 -12361 14019 -16048 18609 -21959 26544 -33226 43947 -63929 114285 -557450 -556914 442512
72 442512 114852 -520019 -519200 371627 730991 258084 -224035 172686 664083 393293 -340680
83 -340680 -355331 274616 469678 -238379 -778344 -349123 402550 284184 -483583 -707803
93 -707803 -25347 497777 154780 -382478 -160454 478892 551946 14768 -167694 315537
103 315537 614787 98508 -541453 -387922 225653 211164 -508996 -854725 -270274 392574
113 392574 229988 -327457 -257365 402985 669640 208506 -168797 117499 483390 184117
123 184117 -411864 -409952 133596 278790 -271057 -662763 -241083 390496 308597 -294320
133 -294320 -431298 117741 499159 173906 -269385 -107629 358001 347027 -109017 -238631
143 -238631 165990 388279 -29508 -497249 -307125 214284 204492 -349617 -577732 -92131
153 -92131 411215 250845 -196016 -141814 345059 494101 94249 -197474 33440 291978
163 291978 25908 -429217 -372793 95830 213376 -216174 -482823 -93379 419014 327015
173 327015 -162326 -258385 166224 417859 106006 -259303 -126538 222074 169180 -200186
183 -200186 -261357 102483 280815 -55653 -392244 -181920 256957 232614 -221136 -386081
193 -386081 11873 378851 202996 -167910 -119279 245302 318718 -16040 -221124 -13443
203 -13443 180712 -44588 -374796 -273694 123569 204356 -139280 -319016 15805 406475
213 406475 294531 -110293 -182030 141796 295747 14554 -269396 -143061 121704 58157
223 58157 -221407 -217295 108500 244723 -32270 -273302 -66608 287132 231636 -156774 -281393
234 -281393 37917 300803 121563 -182522 -130497 158306 194482 -74676 -204878 -6587
244 -6587 144315 -48845 -291470 -168387 161974 202699 -88598 -218586 59928 351334
254 351334 227942 -107480 -158630 89686 184816 -49223 -254199 -135145 71072 12655
264 12655 -187448 -141444 136297 232408 107 -177825 4608 271897 192990 -135501 -234047
275 -234047 16649 204345 43592 -190054 -130230 104092 123863 -80479 -151985 29323
285 29323 143141 -24986 -208233 -88807 175596 180915 -71716 -171622 57065 272033 150958
296 150958 -119687 -150179 47026 111017 -72945 -212611 -101185 57931 7202 -132114
306 -132114 -69141 155022 211100 14550 -117165 31677 223527 134606 -135588 -208672 -13911
317 -13911 120923 -6621 -172332 -106962 76339 91342 -53174 -83566 65718 138034 -8063
328 -8063 -145104 -39137 158011 133068 -80386 -151563 34804 194423 87054 -121166 -129266
339 -129266 29448 72618 -66020 -154275 -53930 60995 10889 -86440 -17578 155226 173858
350 173858 5455 -90772 31166 166908 75930 -137232 -184440 -29965 69609 -24307 -134003
361 -134003 -69299 70335 79623 -19105 -24656 86316 119360 -7442 -107358 -19106 118998
372 118998 78166 -93741 -136893 16086 134336 47979 -102151 -94533 29233 58346 -43802
383 -43802 -96806 -16067 58588 8362 -57993 7003 133509 125686 -15598 -80934 20995 117209
395 117209 33618 -129202 -153394 -28178 46614 -20445 -89352 -31274 70673 72065 4871
406 4871 10126 86858 88862 -21589 -92325 -18821 76499 31282 -99735 -118906 7489 98953
418 98953 35560 -66919 -53680 36922 53673 -18863 -50945 3438 41855 -5310 -47403 11415
430 11415 98973 76816 -34392 -72117 15482 83150 14988 -105641 -113955 -14915 40071 -5879
442 -5879 -50082 -5033 63198 58648 13560 22542 70640 53144 -39113 -85860 -22921 43815 2123
455 2123 -92614 -93347 12134 83696 40046 -30106 -19531 41272 48367 -2643 -26203 3570 14869
468 14869 -25677 -47021 4815 64846 39945 -39256 -54828 18095 67850 14778 -71052 -75989
480 -75989 -5167 35049 4227 -24279 2625 42190 35334 10137 21161 46635 21511 -49344
492 -49344 -73485 -18562 30078 -4719 -71435 -62862 21589 76034 45260 -5453 -1481 32881
504 32881 32888 -2437 -20532 -8278 -13689 -42927 -45769 3210 45888 22995 -29952 -28316 31007
517 31007 64582 22979 -40997 -48005 -5158 22096 4397 -16656 -5887 13071 11539 4895 18536
530 18536 30952 3449 -43959 -50659 -5287 28524 877 -45574 -36389 25248 64311 43121
542 43121 3374 -2185 13773 12382 -8866 -20588 -19969 -30660 -47086 -35979 10131 41570 22444
555 22444 -11718 -4647 40949 62355 26283 -25426 -37293 -13842 3477 -5241 -20167 -18794 -9547
568 -9547 -3236 6482 23114 28002 2810 -27122 -24239 10370 31403 7373 -29087 -24720 18198
581 18198 47342 31894 800 -12229 -7107 -4293 -10307 -16707 -23393 -34218 -39735 -17577 22873
594 22873 43223 26340 2823 10075 40892 52196 22146 -22017 -39571 -28678 -14177 -13830 -21474
607 -21474 -25434 -20972 -6671 14739 33029 31425 8773 -11495 -6101 18895 28345 5417 -24196
620 -24196 -24360 3323 26745 19579 -4139 -19982 -17677 -10618 -4880 -7004 -16873 -27901 -26518 -1657
634 -1657 31168 42694 26209 7127 12659 33416 38226 12020 -24175 -44014 -38173 -23557 -15812
647 -15812 -18264 -23885 -19908 -558 26274 43215 36662 14001 -1889 2779 18535 19666 -1464
660 -1464 -26824 -30607 -9607 11821 13102 -4910 -19924 -17976 -5852 5896 5007 -7602 -20246
673 -20246 -16516 6830 31558 36864 19823 3307 6469 20668 23707 3917 -25098 -43952 -40494
686 -40494 -22087 -8220 -8173 -15581 -13643 7178 33423 47354 35494 12861 -1607 1015 10354
699 10354 8350 -10143 -31515 -36091 -17857 4876 12247 157 -13091 -11702 3989 17705 15985
712 15985 124 -14668 -12450 6582 24227 25301 9710 -5105 -3732 9704 15082 1148 -22355
725 -22355 -37980 -33716 -15259 1402 2616 -6463 -6290 11421 34462 43329 29998 6716 -7178
738 -7178 -5669 279 -1699 -17091 -33587 -36518 -18351 5391 17231 8843 -3629 -2356 13061
751 13061 25317 21171 2694 -13837 -15285 -1413 13719 13312 -1579 -13188 -10940 3862 11644
764 11644 4519 -15883 -27399 -22149 -4516 11254 10805 410 -2405 10363 30108 35811 21394
777 21394 -2087 -16443 -14880 -8544 -7446 -18800 -31757 -32096 -12994 12663 24962 17824 6221
790 6221 6527 18097 27386 19952 596 -17861 -22115 -11254 2336 3312 -9379 -18749 -13820 3093
804 3093 15723 10807 -5492 -15786 -10350 5357 16563 14764 2979 -3118 4640 19348 24108
817 24108 11253 -10403 -22813 -21133 -11227 -7434 -14454 -25551 -23782 -4431 19624 29883 23728
830 23728 12405 9813 17563 21909 14921 -4729 -23630 -30419 -20037 -6286 -2185 -11615 -19663 -10736
844 -10736 7792 22024 19190 4480 -5484 -1340 9591 16578 12567 -141 -8507 -4233 8002
857 8002 13806 4975 -14522 -25634 -20852 -7900 -1476 -7957 -16317 -13778 4912 24262 32921 25297
871 25297 12284 7674 11123 13240 6208 -10994 -28654 -35693 -24510 -8298 -1731 -7989 -13594 -4970
885 -4970 16016 29687 24716 9899 -225 2202 7630 10739 5491 -5825 -15658 -13611 -1448 7702
899 7702 2084 -12695 -22087 -15318 278 6689 550 -8583 -7009 9500 24073 27872 19524 8484
913 8484 1106 2048 3565 -690 -13651 -28701 -34256 -22877 -3974 4833 -269 -6108 3014 21842
927 21842 32714 25637 9595 -926 -1365 296 730 -3375 -12879 -20948 -18666 -4802 7812 6735
941 6735 -6052 -14239 -6524 8737 15198 6635 -4299 -4011 7346 17767 18524 10243 133 -6050
955 -6050 -6452 -3059 -3056 -12738 -23506 -27770 -15646 3607 13156 7039 841 7935 22958 30048 20170
970 20170 3927 -5777 -9121 -9016 -8338 -9601 -15911 -21172 -18831 -3287 12878 14683 3146 -5170
984 -5170 2283 15916 19025 8194 -5456 -7066 760 7105 6802 444 -7294 -11585 -9334 -3487 -716
999 -716 -5130 -15545 -17707 -6673 11497 19334 11268 2436 7079 19811 22838 12251 -4428 -12976
1013 -12976 -15390 -13989 -12217 -11070 -13178 -16460 -12166 3534 19514 21706 9743 1028 6030 15715
1027 15715 15712 2184 -11116 -13258 -7753 -1753 -608 -3944 -8172 -9858 -6703 624 6861 3086 -6569
1042 -6569 -10173 -993 14354 18278 8938 -1049 1547 11140 12519 4615 -8659 -15787 -16616 -13250 -9853
1057 -9853 -6107 -6237 -8586 -5160 9185 23446 24079 10714 582 3085 10331 9023 -3756 -16896
1071 -16896 -17781 -11653 -5176 -1864 -1385 -2895 -3574 -546 7865 13273 8667 -1771 -6439 -428 10144
1086 10144 12405 2272 -7428 -4573 3944 6863 142 -8088 -12345 -12352 -7986 -2487 693 786 -3395 -1017
1102 -1017 10854 21367 20106 6144 -3528 -2478 4250 1204 -9029 -18102 -17494 -11108 -2465 2233
1116 2233 3471 2958 1282 5466 11503 15109 9271 -2838 -9194 -4624 4545 4514 -4169 -10903 -8549
1131 -8549 368 6585 3380 -2552 -7212 -5602 -1816 2825 5374 2700 -1950 -1206 7482 14984 12375
1146 12375 957 -7818 -5918 -743 -88 -8051 -14361 -13505 -7222 1863 7314 9323 6758 4585 6051
1161 6051 11500 12476 5165 -7915 -13464 -7961 -1835 -649 -6437 -11345 -6655 1562 8280 8149 2545
1176 2545 -1029 -1650 2704 5352 5580 1345 -5694 -4558 3051 10098 6272 -2649 -9599 -6780 -247
1191 -247 845 -4210 -8722 -8555 -2777 4749 9725 9970 6108 3284 3611 8008 8014 -75 -10619 -14347
1207 -14347 -10060 -3303 -1550 -4761 -7137 -2782 5308 11056 11623 6531 638 -785 1595 3562 2646
1222 2646 -2959 -8203 -7992 -702 5914 3446 -3196 -7109 -4083 1969 3918 383 -3537 -4538 -974
1237 -974 4703 9253 8387 3269 -636 1008 4878 5037 -1838 -11077 -13553 -8220 -2340 132 -1792 -2163
1253 -2163 -51 6447 12740 12129 6480 620 -1913 -124 1569 -606 -6509 -11095 -8308 -2404 3825
1268 3825 3473 -827 -3668 -730 4110 6223 2685 -1961 -4041 -1560 3760 7003 5519 39 -2664
1283 -2664 -1388 3231 3526 -3248 -9357 -9883 -6832 -162 1735 1098 -284 358 5912 11802 10747 4776
1299 4776 -2009 -4145 -1460 -288 -1866 -7500 -10124 -7177 -576 5241 5381 1532 -982 625 5366
1314 5366 6950 2832 -2345 -4995 -2977 1485 4290 3177 -1844 -4141 -1594 3575 4178 -953 -6493
1329 -6493 -7103 -3545 612 2330 503 -353 70 3714 8409 8773 3769 -2635 -5654 -2169 -481 -1744
1345 -1744 -6286 -8149 -6026 861 5316 6195 3069 48 1276 4597 5336 1536 -3501 -6272 -4561
1360 -4561 -268 2571 2086 -1672 -3335 566 4359 5746 1418 -4649 -5374 -2372 742 2504 262
1375 262 -1897 -2043 2237 6960 6107 1390 -4279 -4765 -1567 894 -13 -3667 -6252 -3760 2473 5471
1391 5471 6195 2777 -547 -112 2483 3559 -331 -5275 -6724 -5346 -1173 2685 2168 -182 -1751 2158
1407 2158 5525 6856 3679 -2998 -5429 -2455 675 1085 -1702 -4048 -3417 735 4106 5053 1808 -2577
1423 -2577 -2556 -80 1690 1652 -1542 -3822 -3230 1688 5920 5356 1151 -3175 -1311 1884 2047 -1848 -4805
1440 -4805 -7085 -3602 -439 3092 3492 1678 80 1524 6300 8153 3215 -4002 -6477 -4462 -380
1455 -380 -488 -3947 -5644 -3389 368 4455 5223 3551 188 -674 1335 3758 3412 -919 -4422 -5216
1471 -5216 73 3667 2427 -1864 -4490 -2624 1333 1304 -1207 -3621 -4333 -1242 931 3415 4633 3554
1487 3554 1263 1496 4462 5650 2371 -6235 -8918 -4772 -1704 -2286 -4777 -5586 -1120 2190 5259 5579
1503 5579 5961 2693 735 847 2767 3180 -408 -6287 -6363 -1907 3012 1612 -3680 -5135 -1840 3519
1519 3519 3090 -383 -1535 -542 472 941 4193 4817 3245 -1241 -1527 2107 5019 155 -7676 -9811
1535 -9811 -4341 -100 -1903 -3573 -2815 1105 4848 5832 6901 6658 4918 225 -1290 1914 1997 -2200
1551 -2200 -8984 -9276 -3374 2718 322 -3692 -3335 1682 5342 4678 1599 1672 1878 1049 -234 1932 4482
1568 4482 1891 -3141 -5224 392 4339 -197 -8881 -8983 -2435 2625 355 -2718 -533 4877 5796
1583 5796 4819 4986 6643 4480 -1614 -5275 -1414 1230 -3011 -10597 -10499 -2508 4133 1730 -3480 -2369
1599 -2369 5033 7634 4405 1581 2554 3778 385 -2853 -549 2930 1353 -6440 -7923 -564 5479
1614 5479 175 -8198 -7534 509 5649 2052 -2315 882 6412 5456 2927 3031 6195 4451 -3778 -7742
1630 -7742 -2999 2796 -2530 -11526 -10675 -881 6668 2644 -2527 0 7261 8930 3420 290 2474
1645 2474 4110 -2418 -6805 -2264 3610 181 -8240 -9159 881 7089 1344 -7593 -6516 4005 7852
1660 7852 983 -2990 1465 6541 4160 -1135 367 5418 4132 -6320 -9205 -1573 4457 -1386 -11607
1675 -11607 -8996 2349 9177 2526 -3589 847 9415 8163 857 -2431 1917 3214 -3522 -8903
1689 -8903 -1851 4214 1378 -8719 -8916 2845 10389 1897 -7421 -4092 6077 7565 -424 -4837
1703 -4837 1925 7103 1964 -4242 -1491 5883 3919 -6782 -10065 157 6687 165 -11352 -8740
1717 -8740 5363 9917 1643 -4544 653 9118 6746 -2426 -3414 2882 3255 -5303 -10088 -3127 5536
1732 5536 2474 -8592 -7823 5608 11764 1993 -7445 -2793 7524 7770 -3123 -6719 1398 7028
1746 7028 174 -7217 -1195 7644 4252 -7918 -9775 2017 10102 205 -11610 -6715 7397 10415
1760 10415 466 -7099 807 9564 4058 -6706 -5029 4271 4614 -5918 -10921 -1421 9236 4395
1774 4395 -8780 -6838 7851 13771 1394 -9031 -3881 7651 6760 -5887 -9547 510 6772
1787 6772 -1694 -8948 -2185 9865 6305 -7431 -9499 4438 12363 440 -11727 -5949 7662
1800 7662 9780 -2406 -9314 632 9044 2459 -8989 -5909 5726 4830 -6611 -11022 1024 11129
1814 11129 4414 -8815 -6198 8346 13030 24 -10231 -3724 8401 4681 -8454 -9879 2140
1827 2140 7074 -2304 -10367 -589 11514 7587 -6467 -8078 6499 13427 1149 -12532 -6676 8659
1841 8659 8404 -5264 -10965 607 8708 813 -8772 -5440 7737 6458 -6209 -9882 3010 13328
1855 13328 4462 -9676 -6050 9629 12434 -2523 -13400 -3756 8270 3020 -9746 -9504 3460
1868 3460 8502 -1886 -8743 1276 13560 7625 -7133 -8009 6847 12607 -694 -13423 -7145
1881 -7145 8371 7017 -7574 -11208 845 9334 1112 -9639 -3280 9001 8047 -5912 -9156 3900
1895 3900 13955 2830 -11204 -6274 9609 10838 -4191 -13619 -3055 8463 2773 -10093 -8336
1908 -8336 5485 9225 -2403 -8425 2875 13988 7188 -9078 -8584 7103 11990 -3041 -15454
1921 -15454 -6416 8574 6545 -8755 -10684 2573 11546 1174 -9466 -1741 11482 7754 -6264
1934 -6264 -9866 4439 11919 1404 -11976 -7439 8729 9560 -5688 -12810 -1609 8205 2392 -10553
1948 -10553 -6696 7119 10007 -2393 -8544 2787 13328 5552 -9453 -9069 6502 10620 -4145
1961 -4145 -15313 -5289 9338 5159 -7542 -9775 5153 11505 1644 -8637 -309 11190 7229
1974 7229 -7531 -9243 4263 11474 -395 -12745 -7417 8913 9306 -5553 -11187 -187 9894
1987 9894 3165 -8864 -5434 7572 8910 -3142 -8299 2644 12378 3659 -10604 -8699 6233
2000 6233 9705 -4833 -13656 -3555 9744 5268 -6957 -7843 5931 10904 732 -8590 -514 9500
2014 9500 5426 -9113 -9934 4007 9929 -2325 -11587 -5010 8221 9092 -4568 -8964 1826 10811
2028 10811 2544 -8028 -4231 7941 8452 -3923 -8825 1743 10825 2255 -10895 -7679 6542
2041 6542 8772 -3921 -12582 -2312 10340 5026 -7159 -6699 6234 9799 -278 -8303 -824 8837
2055 8837 4230 -9433 -8764 4368 8976 -1442 -11697 -4152 10340 7739 -4304 -7897 2429
2068 2429 10038 1936 -8445 -4591 6789 4703 -5627 -8562 1777 9520 1123 -9720 -6035 7068
2082 7068 8663 -3758 -9578 165 9402 4588 -5269 -5428 6048 8548 -1803 -8751 -824 7412
2096 7412 2495 -8687 -8209 4037 7962 -1681 -9684 -1977 8268 6895 -4885 -6650 3274 9155
2110 9155 -55 -8318 -3508 5437 4034 -5769 -7333 2639 8810 383 -7803 -3844 6796 8518 -3267
2125 -3267 -8041 -218 8067 2999 -6214 -6060 4738 6143 -2397 -7079 -394 7260 1803 -8406 -5974
2140 -5974 4306 7777 -935 -8238 -712 8557 5719 -3360 -6062 2779 6476 -78 -7465 -3519 5117
2155 5117 2632 -5814 -6292 2465 7928 801 -6633 -2335 6928 6874 -2473 -6905 -519 6860 1998 -6455
2171 -6455 -4444 4029 4514 -2657 -6215 1109 6471 1034 -7028 -4425 5095 6842 -527 -7120 -393
2186 -393 7103 4558 -4147 -4892 2708 4751 -736 -6508 -2384 4627 1592 -5189 -4610 2839 6748 1423
2202 1423 -4530 -1386 6317 5865 -3041 -6699 934 4946 1441 -5870 -3857 3943 3682 -2896 -4386
2217 -4386 1820 6681 1228 -5411 -3484 5007 5534 -1683 -5877 -226 5949 1963 -3957 -4346 1141
2232 1141 3724 -1196 -5452 -850 3305 1842 -4322 -3511 3211 6309 301 -3776 -889 4978 4145
2247 4145 -3056 -5139 -129 4821 369 -4620 -3005 2574 2218 -1961 -4015 1395 4771 1015 -4493
2262 -4493 -2490 3972 4256 -2395 -4493 -144 4805 2172 -3925 -3138 1839 2898 -1643 -3820 -543
2277 -543 3617 1592 -3239 -1877 3882 5352 44 -4044 -1333 3826 2786 -2810 -4909 710 2641
2292 2641 -314 -4199 -1923 2662 2446 -1748 -2141 1338 3934 682 -3615 -1552 3036 2697 -2167 -4763
2308 -4763 0 3340 1185 -2629 -1884 1402 1669 -962 -2097 326 3091 402 -2336 -853 2459
2323 2459 3443 -44 -3406 -1358 2728 2297 -1821 -3047 107 1791 208 -2281 -923 2644 1817 -586
2339 -586 -1237 2752 2787 -582 -2735 -1895 2398 1639 -2279 -3835 -578 2405 1178 -1840 -1214 1274 2107
2356 2107 -487 -1955 602 2424 83 -2312 -1098 1283 2289 -1276 -3243 -596 1825 1360 -1529
2371 -1529 -2322 271 2030 173 -1293 685 1792 1456 -1021 -634 1525 1796 167 -2760 -1404 980
2387 980 1357 -2574 -2516 201 2580 1937 -1410 -135 2272 1579 -518 -237 1284 1245 -689 -2499 -1701
2404 -1701 663 1132 -1686 -2507 -195 1343 828 -1580 -1018 557 1474 271 73 596 1689 597 -59
2421 -59 -280 744 1251 -1051 -2382 -1351 960 1254 -1283 -1811 811 1258 1524 -83 -80 1713 1014 222
2439 222 -32 -136 530 -1076 -2230 -1051 -2 484 -572 -1318 -262 724 1285 -144 72 838 2017
2456 2017 1051 -149 647 842 245 -19 -554 220 881 -1351 -2389 -636 926 178 -431 -941 529 1788
2474 1788 1345 332 747 747 1305 -326 -363 181 -399 -1801 -2199 -1598 233 -6 -1012 -972 -151 1192 444
2493 444 1028 632 457 1157 258 735 -43 489 -962 -1175 137 181 -674 -1018 -1233 -761 427 412 422 -660
2513 -660 476 1303 1049 337 263 566 145 62 -773 -58 -205 -1397 -1867 -863 66 238 -332 -433 435 1249
2533 1249 1267 956 193 422 633 286 -536 -203 306 -1099 -976 -753 -320 -119 -496 -1160 -177 715 151 -129
2553 -129 68 -123 565 942 405 16 165 -715 -1292 -617 328 267 -1191 -910 -611 990 784 -241 -185 484
2573 484 1101 732 592 242 -436 -363 -518 268 -301 -227 -566 -588 118 -112 325 -52 -486 94 724 47 641
2594 641 -646 -302 188 805 -104 -343 -692 -414 -466 -82 -81 -662 -1513 -438 488 1007 1291 152 -183 163
2614 163 1009 677 1540 -365 -263 -147 -36 642 168 131 86 -211 482 239 -1 237 -658 284 625 1288
2634 1288 167 -751 -220 -842 183 -318 -445 -766 487 319 515 593 493 -429 -101 -134 343 -119 -78 -298
2654 -298 50 196 -257 -872 99 -713 -32 506 -571 499 -300 -599 189 1082 144 14 862 -232 -446
2673 -446 59 -11 -573 -1228 -1279 22 561 485 -50 216 518 432 436 499 236 -1230 -863 -99 828 553 -291 -1691
2695 -1691 -746 562 -263 -91 -372 -688 -166 -185 561 -106 -410 288 486 375 171 413 425 -397 404 -51
2715 -51 448 244 -252 -384 58 273 1361 560 110 178 -76 -9 -829 -109 -572 -575 -844 -18 -899 -589 -590 -405
2737 -405 234 195 24 485 -402 -320 256 1012 494 815 -254 -168 441 150 -245 -917 -734 -843 -59 -703 91
2758 91 -298 457 -129 696 645 318 442 11 588 -423 90 -507 -481 -641 -1145 212 -374 -642 -480 -74
2778 -74 479 363 -419 -263 211 236 472 573 360 -608 -427 -1039 -104 -110 -736 -979 -1264 552 560 62 134 625
2800 625 140 179 925 36 625 65 110 -65 204 252 -1439 -662 78 -341 409 293 -507 592 379 -269
2820 -269 779 547 -31 -13 283 399 54 99 -263 -633 -680 -96 151 -58 -625 -415 -31 -172 662 220 65
2841 65 197 814 -2 -177 654 -238 -88 -229 -502 -592 -390 -560 -1265 -462 -215 635 561 70 338 110 318
2862 318 500 60 -91 -743 305 370 -552 -291 -888 -226 -51 632 573 46 -99 -83 269 1024 335 -105 532
2883 532 208 -203 -326 239 -428 -297 28 -42 -327 251 538 482 108 361 642 376 -259 -122 520 319 297
2904 297 -95 271 -829 -1063 -212 362 -115 -1 -225 582 703 328 98 -460 149 -253 -488 195 -728 -75
2924 -75 35 134 -948 98 -823 539 -159 374 1282 235 589 -85 520 354 -71 469 -571 332 123
2943 123 275 87 -212 -258 -77 -323 -414 593 -578 -613 388 1392 191 179 -142 -16 328 160 -752 -73
2963 -73 -617 -436 298 269 370 503 252 563 897 559 710 793 52 535 -126 373 52 -353 -184 -90 -1022
2984 -1022 74 -363 -330 -12 151 229 668 1216 13 98 923 642 -227 411 -253 -284 -202 -1013 -331 260 -828
3005 -828 56 60 36 538 772 -198 513 675 660 631 258 -451 -286 159 -89 269 -342 -393 -38 -467 -421 706
3027 706 494 77 405 653 -155 267 564 -176 -87 -495 -288 -12 -508 -555 -480 376 -268 586 -180 -189 357 980
3049 980 961 231 163 359 476 805 5 -293 -578 -809 -765 -472 -76 -566 390 -148 -246 298 544 708 8
3070 8 1271 895 666 149 41 -166 -656 -291 202 -607 -770 -558 138 -80 188 322 831 93 1286 802
3090 802 322 451 -211 234 292 55 372 -558 -912 -582 -400 -421 -314 153 651 -450 169 650 1078 69
3110 69 211 139 411 -18 -222 286 -206 -200 -552 -868 -800 -215 -234 -15 -543 193 1009 -108 193 659 646 -321
3132 -321 387 16 -146 -725 -490 -461 -760 -1043 -428 -518 208 325 368 84 1308 523 -254 439 167 1192
3152 1192 761 -343 -427 -1136 -700 -37 -717 -89 -294 87 215 253 31 183 600 467 219 143 -241 89
3172 89 -151 -46 -250 -45 -528 -683 309 502 -976 122 442 -47 513 1029 392 1167 466 -152 119 234
3192 234 -179 -5 -714 -484 -935 52 -656 84 -298 -74 -120 -106 586 142 1054 410 474 279 -311 -180 -86
3213 -86 76 -197 -466 -419 -512 -139 1 -274 -314 645 341 522 -267 759 1100 418 88 614 173 -279 -794
3234 -794 -692 -202 -520 78 -35 377 -621 307 339 410 218 547 607 331 -229 -126 81 39 -507 -402 -574
3255 -574 -451 49 -328 -168 -23 -86 -117 692 -575 445 224 287 -213 -39 57 -460 -545 215 -797 -225 197
3276 197 -1 297 142 184 112 68 472 1147 172 372 87 308 327 715 725 271 -469 -267 -209 16 -458 148
3298 148 -136 220 -358 409 1 44 416 254 70 504 199 -300 -457 232 59 -719 252 -334 -110 -348
3318 -348 269 336 -243 -8 999 224 893 137 -295 -398 59 -246 -324 -32 -767 122 -266 -413 581 436
3338 436 -33 -180 15 20 367 428 -285 -456 211 -354 119 444 318 295 -164 -98 295 320 -341 -304 179 58
3360 58 625 658 417 74 -6 599 260 433 -72 -440 -194 -23 -345 -429 -125 10 -15 354 -69 -840 282
3381 282 399 -487 319 60 -214 -365 -6 -339 -137 -439 71 59 87 400 490 -148 456 970 519 100 -124
3402 -124 435 16 149 190 327 -5 -839 -899 -668 -356 -517 162 103 495 -307 162 70 -83 -454 -164 -220 -704
3424 -704 -373 -622 115 -171 -197 249 -420 -515 -309 -229 519 -373 365 -341 -73 450 -443 -65 539 -349 -324
3445 -324 323 44 -286 465 -346 662 259 811 -255 -137 401 -426 -261 328 -158 440 378 -389 -539 101
3465 101 314 395 -379 -61 519 37 -1066 -288 446 638 340 207 1353 443 -74 -166 166 149 169 315 -709
3486 -709 86 11 -608 202 -212 -12 240 202 -381 579 359 -49 -78 -527 415 445 -216 -858 -303 -234 -27 25
3508 25 -520 -608 -12 -348 17 158 -264 -222 215 -26 -78 -366 -392 627 -91 813 622 -155 -954 295 455
3529 455 -210 -185 150 8 -105 -36 -994 387 212 -599 -549 -63 219 367 -736 -1309 348 336 1056 178
3549 178 -459 -622 48 -121 -284 176 -241 -21 226 111 -134 181 -226 39 451 340 372 -634 -691 -353
3569 -353 691 4 405 -320 88 -257 -247 -425 24 482 265 -206 -91 26 -409 -394 619 339 335 667 -516
3590 -516 -872 -520 249 -18 -345 159 286 698 -549 639 228 -570 -67 -16 -155 -72 -48 153 -926 -113
3610 -113 505 -529 -73 -349 334 -94 -925 -256 381 324 224 -395 -140 297 768 260 -51 -663 -333 225
3630 225 -97 165 97 -339 66 -495 -57 -212 475 -839 -1020 -358 101 -456 -440 202 -41 -134 -171 -260 -8
3651 -8 -396 613 -484 -824 -40 331 -128 -415 503 356 966 -286 -110 376 95 385 231 -229 -174 845
3671 845 107 -125 -410 75 -19 -411 371 1009 -187 -41 -187 -152 332 -664 349 169 429 439 -598 405
3691 405 -8 445 982 43 -611 -169 720 -136 -14 32 949 212 67 -645 204 398 -220 -516 9 862
3711 862 -174 -393 -61 -171 15 -244 -473 14 -374 294 -200 94 274 564 -251 533 -110 107 367 -605
3731 -605 -823 -146 8 -234 -987 -298 115 217 -128 481 908 166 -190 456 479 -627 386 265 -178 -102
3751 -102 565 -68 -648 -861 293 -250 -220 -229 146 919 84 211 -154 1040 126 -169 158 -465 296 -230
3771 -230 -120 -1184 403 -3 33 -547 -502 330 504 292 222 717 1060 -336 44 600 1261 -227 -833 364
3791 364 -272 412 200 -24 -460 601 443 -62 354 24 439 272 -204 -715 -296 552 -7 -453 -180 557
3811 557 78 -805 -402 411 167 -270 111 230 238 750 -358 -617 246 189 -162 186 -658 47 -767 -657 -276
3832 -276 90 664 -155 -301 206 -142 -408 -467 -164 81 922 70 -879 -267 390 -103 -158 -418 328 580 450
3853 450 232 -110 430 475 640 -893 -276 492 58 -89 -396 261 -103 135 -414 85 547 140 -128 -196
3873 -196 159 185 -78 -842 9 154 -128 -329 -720 -276 170 185 273 84 -192 192 322 -731 540 124
3893 124 171 -357 -583 256 355 -370 -493 483 -66 641 -369 -169 470 677 -697 -496 209 251 333 -569 -4
3914 -4 312 867 -549 -300 171 88 -598 71 -335 412 290 -75 -640 -242 658 714 -489 -166 505 498 -156
3935 -156 -148 103 460 701 -167 -648 53 547 -186 -522 -708 311 503 -235 -1126 334 -244 188 -155 -694
3955 -694 630 112 -205 -529 225 -186 -241 -171 -139 -47 -171 -583 -771 357 858 214 -224 -184 68 603 371
3976 371 -263 -192 -105 460 -53 -450 143 99 -5 -513 -68 67 -269 269 -839 642 569 644 157 46 649
3997 649 101 292 -343 180 118 406 -279 -153 121 -153 -674 182 -167 220 196 -13 -183 367 790 44 -807
4018 -807 -75 463 224 -138 -716 -283 451 -69 104 796 3 354 -520 -720 94 831 -758 -594 429
4037 429 880 214 -355 -311 -177 105 140 -208 520 242 480 -551 371 565 550 -201 -97 -444 611 191
4057 191 -111 -623 -265 -201 823 -236 -20 85 514 -374 -82 -367 1163 67 208 29 -186 -56 -340
4076 -340 118 -510 435 -638 -33 -143 95 517 221 -525 -75 -444 1250 491 -385 817 325 393 -4
4095 -4 -476 -159 152 428 -192 534 468 -185 -379 -732 322 383 14 614 86 951 750 -454 456 264 453
4116 453 -75 80 -277 319 157 -364 -485 486 478 -130 27 321 258 705 -27 241 -393 769 -86 -246 -297
4137 -297 120 811 41 -348 -244 739 262 119 -453 -150 -153 240 -330 -145 370 -655 148 35 32 751 -135
4158 -135 -8 179 -100 0 -17 88 -333 -318 443 -274 -56 -103 546 -563 170 -75 544 542 1046 48 80 345
4180 345 -238 70 81 -141 535 31 -439 280 21 -130 170 122 -47 136 -418 -498 -29 392 -463 -29 -88
4201 -88 180 -299 73 664 -27 -240 -459 -231 -170 217 350 -171 141 267 -245 490 -856 -65 127 132 -835
4222 -835 109 134 330 384 -211 191 73 497 -145 -197 700 353 243 -204 -214 477 121 -124 -6 -121 -831
4243 -831 -324 -534 414 1139 -326 174 261 -355 216 -268 -177 237 -17 -356 748 62 385 548 -193 130
4263 130 -404 32 -62 330 -52 -385 371 105 84 -88 -323 227 -174 -69 247 32 81 421 -339 140 432
4284 432 -180 -33 -520 305 472 -514 -1037 -139 38 101 -613 567 447 603 -601 399 -180 -43 115
4303 115 58 -413 -21 -274 667 -304 721 328 225 300 -185 50 -57 -150 -627 259 347 -472 -360 217 -232
4324 -232 0 605 549 -109 776 240 377 116 126 -120 -452 -468 -491 27 479 -240 85 -122 -133 -26 548 119
4346 119 -289 371 -33 113 85 188 184 -200 587 -247 655 85 -767 14 141 -465 519 -7 -466 101 -491
4367 -491 -116 -7 493 -257 -301 298 -144 -288 581 98 392 173 120 -20 137 816 -261 -129 445 -3
4387 -3 -210 277 -274 -166 341 44 220 195 -52 -76 27 -48 74 153 147 137 485 105 264 77 48 -109 140
4410 140 -310 119 -63 -183 101 586 403 107 298 -204 430 -143 -942 -760 -23 497 297 -4 45 562
4430 562 -14 -174 -120 -38 236 -321 -105 67 -56 -75 -18 116 -4 -51 -463 467 402 -4 805 345 10 -248
4452 -248 -325 416 -229 162 561 566 78 161 -417 506 -614 -374 853 290 16 840 -327 -37 84 187
4472 187 260 124 -93 87 144 -403 -107 -176 539 453 -551 -623 -47 159 108 146 -361 -691 511 -71 148 411
4494 411 262 -183 417 429 410 -144 221 -363 -775 -190 -80 -188 419 295 -327 679 -38 -462 809 323
4514 323 191 -140 248 -422 -334 558 -84 153 612 537 -240 -7 195 395 171 243 217 -349 -553 -84 -25 789
4536 789 -357 -597 -253 398 -223 -28 825 -445 -1 -566 151 -163 293 89 -539 32 -322 422 586
4555 586 11 392 249 137 -934 -391 -176 -623 -214 281 285 0 252 280 129 345 -499 -243 -214 25 -584
4576 -584 -337 226 378 68 207 402 153 228 552 132 109 238 166 282 416 435 285 118 -78 -135 90 215
4598 215 -429 201 -320 -1004 -334 -68 -231 -51 374 444 -364 -4 -12 701 66 -546 -29 -448 303 -381 270
4619 270 312 -133 114 -585 16 -537 146 -183 472 -261 561 -403 380 -19 -696 -130 -67 -777 -165 145 -128
4640 -128 -297 159 158 30 570 -123 453 111 431 439 -102 186 427 514 -126 -38 651 120 421 -3 -96 -251
4662 -251 59 17 -81 -224 447 -374 90 -679 436 -38 48 248 -23 -128 424 492 189 171 -107 95 206
4683 206 -368 98 283 -185 -148 92 -557 -61 -406 -196 -407 -69 316 -660 -545 195 410 22 81 590 -490
4704 -490 148 198 -643 397 779 1131 346 -86 45 45 -111 230 521 328 -109 109 -482 236 -72 291 361
4725 361 379 476 156 -52 536 -35 165 479 -136 12 -506 825 287 655 -34 365 214 283 -240 -496 655
4746 655 131 72 -419 -665 -575 -471 221 -204 -355 168 -102 116 -248 -202 57 -144 340 424 -948 203 148
4767 148 -340 222 -1169 -374 282 88 -58 132 94 -36 98 5 -229 -92 81 -58 -239 160 233 195 -711
4788 -711 218 -90 -454 -680 -373 -792 18 -211 373 93 33 157 482 -81 -242 285 -395 228 -499 -492 -355
4809 -355 587 -65 -281 502 304 103 -261 628 -258 -336 190 249 -158 -551 849 -266 -178 257 -169 -309
4829 -309 -124 -280 -157 -518 685 313 -107 1060 24 -14 -338 60 536 -307 -436 710 889 -22 -198
4848 -198 -295 196 184 -158 38 -299 -567 334 333 109 -287 -514 853 -330 620 351 152 392 -332 14 410
4869 410 346 28 -74 257 108 -41 71 317 122 -304 5 87 -64 115 -247 451 -385 -57 -56 -119 158 76
4891 76 119 195 36 -760 -190 -295 -159 -275 -154 254 -12 991 236 100 288 693 -240 115 122 -583 41
4912 41 -7 79 40 207 68 -328 16 -427 12 -122 321 -152 306 134 481 -615 116 -472 -479 -568 -252 567
4934 567 -606 317 244 -593 -238 -178 -14 190 21 505 628 216 -135 -306 398 845 -520 -423 594 57
4954 57 93 -476 239 178 287 136 108 -508 486 -65 125 -542 -55 202 367 355 832 -194 295 -329 -296 -294
4976 -294 592 16 83 -63 241 254 -387 -26 -519 207 -242 491 195 54 -3 683 -44 217 -470 -863 1094
4997 1094 376 73 993 311 126 -73 -44 436 210 256 206 -41 555 -254 82 -223 -180 215 -339 -360 489
5018 489 -174 -395 187 483 -311 -57 -98 -165 -588 -257 44 81 -198 -1057 -80 -346 3 132 540 182 944
5039 944 -521 120 137 207 643 -216 -593 -188 -5 -28 -473 600 -320 -630 312 357 191 569 -296 -114 -232
5060 -232 97 -188 -603 499 -547 -437 27 -114 273 -49 -47 -219 159 -474 171 -336 170 -166 -242 30
5080 30 -155 383 -13 648 -394 -110 -177 719 -776 279 -707 189 366 328 281 -129 55 440 464 -484 -21
5101 -21 627 -313 -954 208 -101 405 405 -648 -46 -859 -291 -213 -128 -775 29 431 281 205 168 18 303 -103
5123 -103 -180 -124 324 331 -448 -136 -821 -522 -306 177 -330 -157 759 245 -598 -466 134 242 269 118 -98 410
5145 410 810 -83 -314 609 252 -92 752 408 330 -254 49 -290 -103 242 -304 -349 -15 463 574 -77 -328
5166 -328 -34 666 -95 851 224 -303 -65 43 361 289 249 558 -544 -892 -540 128 667 140 -323 -250 -235
5187 -235 116 -34 -120 146 -450 545 183 91 -525 -298 387 530 -124 -207 29 198 -227 43 17 -296 438
5208 438 -472 107 94 122 -506 -158 -106 -48 572 -308 396 -500 221 -522 -356 398 187 -21 342 250 -126 -559
5230 -559 151 -56 -78 -165 421 456 402 418 -864 419 799 -725 332 252 287 343 477 -54 362 197 -289
5251 -289 -892 -22 168 -37 -341 340 -266 -369 315 111 482 194 493 -516 -723 386 -363 81 587
5270 587 31 -563 -467 641 -13 597 301 -639 -56 -232 -49 -321 236 -61 37 -525 469 -125 -44 343 211
5291 211 56 24 -53 41 148 145 396 86 -68 104 824 -395 257 46 -358 538 -387 -157 759 -35 -310
5312 -310 -198 355 654 -183 215 -390 231 474 19 288 381 -227 470 521 -694 253 214 312 540 -862 339
5333 339 -604 118 410 -241 -315 49 -332 -622 204 145 325 -71 -24 -339 500 -67 -64 -685 -399 43 -162 -76
5355 -76 217 100 631 -298 472 128 -237 553 -10 -10 -200 -45 -81 -213 291 -267 13 17 -146 368 -382 -163
5377 -163 -430 755 -451 -15 32 -386 -610 485 656 61 -206 510 483 -210 -32 -618 -54 -69 -710 538
5397 538 280 431 310 159 58 -129 -133 -575 514 272 -187 -105 118 396 323 -354 309 307 15 360 83 122
5419 122 290 102 -96 -67 377 300 587 205 -3 252 468 -343 365 -630 -6 -540 677 107 480 351
5439 351 -565 -17 79 -136 -168 -380 -59 57 -46 119 -302 -347 213 -598 298 -463 249 86 -167 -11 -444
5460 -444 129 159 807 -260 -433 333 -247 -321 265 127 346 362 98 -263 635 -503 42 -28 195 627 231
5481 231 -388 320 -319 655 -528 39 113 -552 -160 -325 -750 334 -470 -153 -197 213 48 -273 462 -440
5501 -440 -36 299 418 312 -311 -40 -17 17 -225 -120 319 -1041 612 119 -70 57 378 -359 462 -66
5521 -66 19 -237 90 -96 -831 -394 403 -424 432 216 -881 15 -663 -437 136 684 41 485 403 -655
5541 -655 -641 -481 461 152 -148 -208 170 112 318 -76 -561 163 -194 -88 27 -509 20 -52 42 867 150 -167
5563 -167 587 -58 -270 40 123 96 137 -154 169 29 90 653 -350 22 90 -485 -262 139 263 385 189
5584 189 332 -840 -597 -11 445 283 24 164 271 669 -111 -246 356 224 -18 44 -415 -52 759 -449
5604 -449 296 -252 -343 889 -281 -111 375 -410 -55 564 -331 -59 -641 19 92 -882 48 -293 -403 630
5624 630 -429 202 476 143 -649 366 282 304 -394 38 195 485 117 -532 -33 -658 -531 236 80 99
5644 99 979 -60 -468 -297 -426 -73 86 50 -362 133 657 13 -341 38 96 -543 -501 -613 -188 -68 625
5665 625 41 300 -31 -435 -184 97 1122 247 98 -5 -613 72 -205 -53 -28 662 -576 -440 41 180
5685 180 73 -25 -25 468 408 235 -50 386 453 153 694 224 803 370 -171 197 622 -637 51 65 -232 -245
5707 -245 404 14 430 76 742 325 -462 -135 -808 332 84 44 -388 -84 150 237 201 600 239 100 -24
5728 -24 386 414 -313 -122 -128 -293 391 -70 -62 216 153 -487 213 -99 -213 -322 572 62 400 984 -97 -20
5750 -20 -501 -883 66 496 -96 18 181 201 -128 -31 188 13 -316 -21 114 457 97 -625 -369 442 271
5771 271 628 -79 245 -19 -606 -527 -277 -878 -756 -49 517 313 -74 632 -218 -29 -396 9 -189 -347
5791 -347 367 189 14 574 -574 56 580 -121 -98 -65 28 548 193 -772 0 231 194 -68 -267 -437 121
5812 121 -106 395 -1369 -730 365 -504 -53 295 -127 547 -205 216 314 -210 -396 -266 -98 232 -152 129
5832 129 354 51 -221 1049 -238 -141 -78 0 -224 83 48 -198 -41 -103 76 326 -190 -566 254 66 254
5853 254 267 657 310 -4 76 -63 113 576 -353 -85 105 -142 -144 572 586 -713 -459 403 -104 -185 -427 675
5875 675 349 -246 -541 136 -82 -494 -529 390 -2 63 -91 360 50 114 274 -35 -529 -216 386 -111 -76
5896 -76 58 -93 201 -34 -676 216 -221 -550 1051 137 434 -307 -338 40 368 -194 240 294 369 178 -367
5917 -367 -681 -290 -54 126 -526 -339 385 -86 361 -183 -480 -254 -99 550 -227 534 156 354 368 -27
5937 -27 79 -199 -143 -229 502 650 162 -163 -96 -659 183 -287 313 -228 161 32 103 -126 -912 -176 -589 -211
5959 -211 313 -196 387 -93 263 323 389 19 221 -230 256 -159 83 130 -445 217 24 479 296 -490 -333
5980 -333 244 806 -124 409 -19 121 216 -244 511 272 -188 -45 631 -494 -1190 -125 171 407 157 -261
6000 -261 228 584 -222 58 325 -143 111 136 -35 522 385 130 247 696 17 315 -43 258 -59 334
6020 334 639 111 266 53 -515 612 164 554 -503 -230 88 -562 706 -629 -99 -158 -365 -507 652
6039 652 151 84 -738 -967 -85 -491 -529 615 7 -487 855 -230 -266 -610 5 -629 158 353 45 -340
6059 -340 -96 -292 -253 70 67 187 219 -257 115 133 -587 407 23 16 -246 -296 -220 148 -206 -672 -327 -597 624
6082 624 -539 327 269 -217 249 203 136 237 316 511 -465 -167 841 -239 203 43 -542 39 684 -529
6102 -529 128 -456 280 191 -161 86 107 -96 251 1006 453 -73 -388 331 162 -162 251 900 667 275 -508
6123 -508 -299 343 4 -19 -1123 150 -1 -334 -408 -130 727 -244 -744 -51 267 -89 232 -542 706 164
6143 164 85 448 165 -10 85 -446 -438 80 342 321 274 -655 266 -28 472 -129 33 -753 302 -44 139 -330
6165 -330 -648 623 393 -224 -296 -190 665 -174 -222 403 -256 143 309 79 65 -239 -184 -366 227 33 118
6186 118 13 -10 -426 83 -64 280 -95 463 81 -83 198 -473 337 209 321 148 -367 -583 -812 150
6206 150 288 473 308 -419 465 247 247 -326 403 -386 -133 62 379 73 291 -608 -670 -701 -4 -111 404
6227 404 626 404 -31 -8 -17 -77 180 728 -140 325 -199 -735 223 345 651 -422 -562 465 471 -499 385
6248 385 -527 442 336 485 152 780 -47 -565 54 54 313 73 -479 434 35 -561 312 230 -68 432 699
6269 699 296 297 -10 200 -718 -40 131 -133 561 767 -164 -269 0 257 407 184 186 677 -897 -335 300
6290 300 473 -395 162 578 121 -189 -89 551 -209 318 179 -306 101 -225 12 -458 -399 -181 184 742
6310 742 -64 591 -321 369 383 -522 -213 93 7 -77 181 198 208 22 288 124 -112 531 73 -6 67 38 87
6333 87 -178 -78 570 -269 366 276 -76 262 -337 113 154 -365 158 -534 -238 -42 137 -375 -596 25 -146
6354 -146 -445 -208 -149 -249 4 -319 -232 -314 208 79 224 -52 484 -218 101 339 -344 241 87 849 115
6375 115 28 -316 -238 83 275 432 104 -468 -198 308 707 387 -136 -15 -447 -167 -194 -56 470 -170 -522
6396 -522 -504 -377 -52 118 -408 679 292 495 558 -436 216 21 477 123 -54 576 -294 354 374 -450 -84
6417 -84 -339 -273 -917 241 43 328 102 -215 16 395 556 218 -420 136 -183 -543 59 -260 -73 732
6437 732 349 998 68 3 589 141 -473 450 145 290 656 -193 435 -92 -113 354 -343 10 425 75 215
6458 215 -393 -346 -563 132 -377 -132 -123 -356 710 323 -162 218 -266 265 533 -140 -104 469 -420 446 -151
6479 -151 64 344 -250 -599 194 -589 670 352 70 228 -958 -16 132 -268 -734 242 -558 19 -48 -306
6499 -306 -169 -127 -723 104 719 -39 199 -641 -299 -398 152 139 -126 -253 525 -252 -510 284 122 -306 -263
6520 -263 -283 -328 253 557 60 -209 -305 -273 -618 -128 636 -436 -590 -92 -324 191 190 -48 -246 -306 263 390
6542 390 89 110 513 -304 557 -76 539 -57 -167 -87 -57 715 -535 766 166 -476 327 15 346 -229
6562 -229 381 60 160 124 98 102 -165 146 156 -226 161 261 -93 -90 183 -174 215 141 -154 -77 -271 300 -145
6585 -145 278 156 -154 -608 -207 -644 -416 10 -358 132 -2 392 254 279 293 20 84 -117 -318 1 195
6606 195 507 -653 -277 -158 59 -112 143 -284 -217 263 100 -239 154 9 1074 -590 -462 -11 17 910
6626 910 -91 197 255 53 -357 103 181 27 -378 -55 -300 434 -268 -319 275 -470 -480 -369 -242 306 184
6647 184 344 448 -99 243 48 -173 166 -421 -74 423 136 -411 193 -9 217 -332 206 658 302 903
6667 903 174 -168 -39 -36 122 578 -240 -425 453 234 23 -481 -683 -89 -24 660 263 360 35 -570 394
6688 394 99 -369 -430 162 608 -379 -24 -428 -504 -175 -401 -734 -20 -314 -61 227 -503 128 -355 -190 -175
6709 -175 -165 -182 312 19 574 -683 -511 -115 -325 362 325 -197 -52 -60 -336 -381 88 -81 -181 173 438 -54
6731 -54 170 48 -275 -448 -619 735 -255 68 132 307 -152 -184 90 465 -81 -148 126 -39 -13 -170 -201 42
6753 42 -546 170 -109 -523 -99 362 193 -217 876 104 227 106 98 -100 234 54 34 309 324 -557 410
6774 410 -205 -8 -108 306 200 -397 41 394 -718 187 321 42 -55 -31 118 225 -140 574 -115 79
6794 79 -65 -545 -458 301 -137 -350 269 222 203 -496 -178 -381 -504 -10 -205 285 581 155 -101 -472 94
6815 94 265 -815 244 1 186 -311 598 -726 -398 160 -1309 261 0 695 126 -291 -149 -235 -9
6834 -9 380 -31 -379 -491 -311 272 -452 542 914 -467 -72 315 509 -178 -4 -40 -514 -43 126 79 160
6855 160 370 -171 547 -236 93 418 -217 14 -739 95 -474 -204 -216 534 -170 90 -285 -106 531 593 48
6876 48 -245 -359 556 -39 546 -122 -451 -323 328 -9 -116 683 329 506 -252 -217 212 408 -34 -102 181
6897 181 -203 -85 456 44 359 680 -515 -601 717 852 -924 -590 -96 220 -469 486 185 71 -389
6916 -389 -500 380 30 228 -186 997 -283 -92 -242 -252 383 424 191 -64 -353 383 300 276 -312 70 92
6937 92 110 731 -290 258 96 -624 249 353 498 -697 63 199 754 -156 -21 42 -676 73 -364 -312 -112
6958 -112 -447 722 -17 -130 837 -441 -31 405 334 -353 6 180 -538 430 283 490 138 -54 -84 -238
6978 -238 -132 54 231 257 -580 54 607 -223 356 -142 179 7 -71 -162 -355 150 5 310 554 69 27
6999 27 255 337 319 61 965 -727 5 33 -613 -320 -35 253 329 271 -316 230 15 796 -501 340 599
7020 599 -435 114 -117 -169 297 -733 -193 479 210 70 -82 -25 -489 529 -392 -296 107 -135 -818 223
7040 223 213 -172 -73 -45 -124 -145 -42 296 -259 259 -231 19 -22 169 -110 199 428 -225 -238 62 -377 -140
7062 -140 -182 99 -309 -191 783 -310 -40 724 199 486 517 342 373 -456 -420 -724 15 395 450 894 -327
7083 -327 -44 456 -407 -476 -397 869 -361 -408 -177 -198 138 -588 -149 -313 -9 138 559 -224 165 56 634
7104 634 -238 -182 -59 -332 298 339 326 -289 20 136 -75 197 -254 349 -764 -280 -319 -160 -41 41 377
7125 377 -724 208 534 -264 -114 193 263 -649 -56 411 633 -198 339 99 40 285 363 -261 -179 737 -530
7146 -530 442 -180 -156 154 -232 386 -237 -762 -640 29 -258 -392 -93 573 233 60 62 -578 552 303 144
7167 144 -308 -368 199 -768 -20 -291 -163 -139 148 335 383 -387 290 -262 394 123 -257 614 355 -349 -101
7188 -101 -815 -255 3 -924 -112 -278 527 116 146 -529 641 -92 141 -100 364 293 255 -15 696 -162 -102
7209 -102 -27 87 611 -741 -134 104 -228 161 -391 -307 -72 -99 -270 459 -51 -71 -260 -202 -368 -314 -256 -182
7231 -182 178 39 -23 227 508 -733 -394 189 -214 154 -430 -348 529 -43 -238 -170 237 159 177 479 159
7252 159 403 273 340 169 -174 112 -476 535 339 1060 57 386 -68 72 310 413 -203 -262 -63 132
7272 132 -200 -167 482 -615 252 -90 54 276 15 -486 -333 -417 135 -507 -307 106 151 -481 280 -136 -189
7293 -189 423 -130 -153 137 -696 306 -732 244 -642 -505 -359 -34 445 -327 234 87 -651 515 -225
7312 -225 -324 -348 127 70 543 -537 482 92 -338 151 -508 -216 234 776 -325 -46 -271 226 -20 -383
7332 -383 347 -124 -279 350 225 133 72 486 47 515 -183 -256 -386 731 -306 4 -549 156 54 -80
7352 -80 -287 -117 -4 367 269 -292 -270 250 74 -126 406 207 86 -42 127 9 -293 116 69 590 404
7373 404 -420 593 192 -111 259 -133 -194 529 250 -31 -136 -224 -185 53 -383 -308 -475 -272 -60 -591 -122
7394 -122 -451 28 77 494 220 -24 -527 -256 -408 -328 -158 -142 415 9 -592 -405 -441 -582 -180 667 176
7415 176 -444 -108 45 59 -243 -282 217 -346 -557 160 -86 -178 156 279 500 429 -13 -191 192 -410 610
7436 610 112 -632 -266 65 317 405 225 484 1320 -167 -288 -21 229 -508 -177 -302 62 -492 -283 -252
7456 -252 -491 259 -376 -536 138 63 509 -10 408 43 563 -193 -233 -634 -88 442 139 -134 255 51 306
7477 306 -161 -242 80 -338 628 -295 -224 -527 -189 643 425 -402 -138 -589 199 -290 68 -12 -258 182 -43
7498 -43 -103 55 -321 41 254 718 427 -267 -482 46 -216 345 -125 195 -390 -331 434 -131 -108 561 414
7519 414 -25 294 50 12 809 215 -318 -8 38 -138 -211 338 30 368 -31 -377 -247 806 489 339 -211
7540 -211 -425 -338 -106 126 -413 -222 -71 -21 -385 323 -70 659 -240 -224 444 -211 -275 -256 274 -285 232 72
7562 72 -565 -509 -849 -108 531 -430 -23 -154 82 -204 -377 -114 -290 -7 358 120 22 -19 -249 -351 127
7583 127 -162 133 -192 812 -5 83 -429 505 -139 -180 704 565 112 -195 652 278 513 -166 -155 683 9
7604 9 410 -76 294 -22 -898 -186 -490 67 -429 184 -50 -327 -21 -528 -823 -120 -526 -311 -267 310 53
7625 53 -435 466 -317 51 -180 619 -893 144 -415 -241 -70 254 598 313 -618 -79 1005 -685 -77
7644 -77 -78 -569 348 -335 -498 -350 283 -297 59 601 329 649 313 74 243 352 -42 -310 -703 592 44
7665 44 336 586 589 -695 84 247 30 419 -520 -38 178 -353 -38 -440 206 -32 -123 -51 110 123 -262 -316
7687 -316 337 191 -173 -123 142 -503 478 -71 159 -105 -426 252 411 804 -3 362 158 38 645 -40
7707 -40 221 -228 -480 160 -525 302 -410 543 -224 -431 -337 202 568 235 -166 585 -149 -175 87 211 105
7728 105 144 652 466 185 -440 -362 489 -792 107 520 249 -168 518 -170 157 -387 158 550 -88 338
7748 338 -600 -3 -665 82 179 -717 -27 -152 -40 286 196 61 32 264 270 -73 40 40 344 142 -36 350
7770 350 -418 136 -84 282 -440 185 589 -402 -584 -612 374 245 847 -352 82 -40 -7 156 -208 110
7790 110 -69 31 -157 347 -116 369 -208 -238 -498 404 83 -512 -414 732 146 -176 26 -292 33 -7 -485
7811 -485 -427 174 -585 -497 -74 488 -755 517 -262 305 96 -361 422 -206 -428 -542 352 -765 426
7830 426 581 335 0 -306 461 -49 -236 -461 -89 -150 -2 616 -195 49 -134 -230 25 246 -621 -117 -148
7851 -148 479 375 188 -606 -70 -116 563 45 809 -48 10 250 -133 -188 -78 138 -472 -569 710 -450 93
7872 93 30 -61 363 -302 -276 -48 -37 -87 -97 -354 -145 -148 207 -381 558 -221 294 -180 70 -193 -98 -110 -53 -255
7896 -255 223 198 175 -297 -479 -185 119 -544 107 -148 498 -432 321 -306 -3 5 -277 -269 78 -203 -213 420
7918 420 -528 446 447 368 -541 276 315 -249 118 -447 -23 -61 518 -63 -301 -83 -207 -740 -29 356 584 -290
7940 -290 524 509 -256 -161 -89 -507 558 -191 -349 -9 319 35 -80 12 43 123 265 -237 -232 69 -227 -155 169
7963 169 -33 246 5 -712 -3 455 125 94 508 -707 104 -474 -503 -304 790 -387 120 -103 -382 -252
7983 -252 244 93 510 404 149 339 141 133 244 865 -237 230 221 -36 405 238 -117 347 501 518 -351
8004 -351 88 508 150 -636 251 -383 -363 -8 93 210 -237 329 159 -26 342 215 -18 408 -34 -113 532
8025 532 111 -27 37 39 435 -48 -611 -495 523 -532 279 -367 -375 -35 529 1011 -316 490 509 78 226
8046 226 -354 554 -143 104 240 304 -60 120 -210 -70 176 519 219 200 555 -123 -390 -91 -479 313 -31
8067 -31 -245 -257 175 -423 -110 198 -450 -367 -420 -162 -170 502 -38 640 -289 703 84 468 1187 287 8 -319
8089 -319 407 188 -6 -310 -244 166 747 381 -149 -305 -223 -912 -705 4 -219 292 -447 390 363 -92 -184
8110 -184 -314 -188 -625 350 -458 -12 175 -49 248 -849 -200 -409 91 303 -122 -752 -196 65 -310 -433
8130 -433 127 25 -29 -409 147 871 236 -390 -46 116 -713 -849 356 217 -663 -248 -129 -242 345 403
8150 403 -61 466 -265 358 636 -200 444 449 -380 455 11 459 -579 -180 384 -273 -392 359 206 140 -210
8171 -210 -552 179 299 531 357 119 165 -668 -357 585 202 -311 331 400 -192 128 -677 -29 -94 -415
8191d15
##END NTUPLES=NMR FID
##END=
