##TITLE=1H_IPACAT-34D
 CDCl3
 64 sc, 
 2.11.2023
##JCAMPDX= 6.0         $$ Bruker NMR JCAMP-DX V2.0
##DATA TYPE= NMR FID
##DATA CLASS= NTUPLES
##ORIGIN= UXNMR, Bruker Analytische Messtechnik GmbH
##OWNER= root
$$ XWIN-NMR		Version 3.5
$$ Thu Nov  2 13:25:27 2023 Russian Standard Time (UT+4h)  she@DPX200
##.OBSERVE FREQUENCY= 200.13135
##.OBSERVE NUCLEUS= ^1H
##.DELAY= (6, 6)
##.ACQUISITION MODE= SIMULTANEOUS
##.ACQUISITION SCHEME= undefined
##.AVERAGES= 62
##.DIGITISER RES= 18
##SPECTROMETER/DATA SYSTEM= spect
##.PULSE SEQUENCE= zg30
##.SOLVENT NAME= CDCl3
##.SHIFT REFERENCE= (INTERNAL, CDCl3, 0, 15.7039)
##AUDIT TRAIL= $$ (NUMBER, WHEN, WHO, WHERE, WHAT)
$$ ##TITLE= Audit trail, XWIN-NMR		Version 3.5
$$ ##JCAMPDX= 5.01
$$ ##ORIGIN= Bruker BioSpin GmbH
$$ ##OWNER= she
$$ F:/spectra/data/she/nmr/H-F/1/audita.txt
$$ ##AUDIT TRAIL=  $$ (NUMBER, WHEN, WHO, WHERE, WHAT)
(   1,<2023-11-02 13:24:06.75 +0400>,<she>,<DPX200>,
      <continue with go, POWCHK disabled, PULCHK disabled
       configuration hash MD5:
       00 E9 B6 7A A2 85 ED C7 34 08 36 98 17 FE 4E 26
       data hash MD5: 16K
       D2 67 3A 79 53 A2 83 50 75 96 15 74 F1 37 BF 86>)
$$ ##END=
$$ 
$$ hash MD5
$$ 05 C4 DA B1 7E B0 BB CF F8 FC A8 50 DD 41 5E D3
##$RELAX= 
##$RELAX= 
##$RELAX= 
##$RELAX= 
##$RELAX= 
##$RELAX= 
$$ Bruker specific parameters
$$ --------------------------
##$DU= <F:/spectra>
##$EXPNO= 1
##$NAME= <H-F>
##$PROCNO= 1
##$TYPE= <nmr>
##$USER= <she>
##$AMP= (0..31)
100 100 100 100 100 100 100 100 100 100 100 100 100 100 100 100 100 100 
100 100 100 100 100 100 100 100 100 100 100 100 100 100 
##$AQSEQ= 0
##$AQ_mod= 1
##$AUNM= <au_zg>
##$AUTOPOS= <>
##$BF1= 200.13
##$BF2= 200.13
##$BF3= 200.13
##$BF4= 200.13
##$BF5= 200.13
##$BF6= 200.13
##$BF7= 200.13
##$BF8= 200.13
##$BYTORDA= 1
##$CFDGTYP= 0
##$CFRGTYP= 5
##$CHEMSTR= <none>
##$CNST= (0..31)
1 1 145 1 1 1 1 1 1 1 1 1 1 1 1 1 1 1 1 1 1 1 1 1 1 1 1 1 1 1 1 1 
##$CPDPRG= <>
##$CPDPRG1= <>
##$CPDPRG2= <>
##$CPDPRG3= <>
##$CPDPRG4= <mlev>
##$CPDPRG5= <mlev>
##$CPDPRG6= <mlev>
##$CPDPRG7= <mlev>
##$CPDPRG8= <mlev>
##$CPDPRGB= <>
##$CPDPRGT= <>
##$D= (0..31)
0 1.2 0 0 0 0 0 0 0 0.06 0 0.03 0 0 0 0 0.0002 0 0 0 0 0 0 0 0 0 0 0 0 
0 0 0 
##$DATE= 1698916835
##$DBL= (0..7)
120 120 120 120 120 120 120 120 
##$DBP= (0..7)
150 150 150 150 150 150 150 150 
##$DBP07= 0
##$DBPNAM0= <>
##$DBPNAM1= <>
##$DBPNAM2= <>
##$DBPNAM3= <>
##$DBPNAM4= <>
##$DBPNAM5= <>
##$DBPNAM6= <>
##$DBPNAM7= <>
##$DBPOAL= (0..7)
0.5 0.5 0.5 0.5 0.5 0.5 0.5 0.5 
##$DBPOFFS= (0..7)
0 0 0 0 0 0 0 0 
##$DE= 6
##$DECBNUC= <off>
##$DECIM= 32
##$DECNUC= <off>
##$DECSTAT= 4
##$DIGMOD= 1
##$DIGTYP= 9
##$DL= (0..7)
0 120 120 120 120 120 120 120 
##$DP= (0..7)
150 150 150 150 150 150 150 150 
##$DP07= 0
##$DPNAME0= <>
##$DPNAME1= <>
##$DPNAME2= <>
##$DPNAME3= <>
##$DPNAME4= <>
##$DPNAME5= <>
##$DPNAME6= <>
##$DPNAME7= <>
##$DPOAL= (0..7)
0.5 0.5 0.5 0.5 0.5 0.5 0.5 0.5 
##$DPOFFS= (0..7)
0 0 0 0 0 0 0 0 
##$DQDMODE= 0
##$DR= 18
##$DS= 0
##$DSLIST= <SSSSSSSSSSSSSSS>
$$ [...]
##$SUBNAM2= <"">
##$SUBNAM3= <"">
##$SUBNAM4= <"">
##$SUBNAM5= <"">
##$SUBNAM6= <"">
##$SUBNAM7= <"">
##$SUBNAM8= <"">
##$SUBNAM9= <"">
##$SW= 18.05172834244
##$SWIBOX= (0..15)
0 0 2 0 0 0 0 0 0 0 0 0 0 0 0 0 
##$SW_h= 3612.71676300578
##$TD= 16384
##$TD0= 1
##$TE= 0
##$TE2= 300
##$TE3= 300
##$TEG= 300
##$TL= (0..7)
0 120 120 120 120 120 120 120 
##$TP= (0..7)
150 150 150 150 150 150 150 150 
##$TP07= 0
##$TPNAME0= <>
##$TPNAME1= <>
##$TPNAME2= <>
##$TPNAME3= <>
##$TPNAME4= <>
##$TPNAME5= <>
##$TPNAME6= <>
##$TPNAME7= <>
##$TPOAL= (0..7)
0.5 0.5 0.5 0.5 0.5 0.5 0.5 0.5 
##$TPOFFS= (0..7)
0 0 0 0 0 0 0 0 
##$TUNHIN= 0
##$TUNHOUT= 0
##$TUNXOUT= 0
##$USERA1= <user>
##$USERA2= <user>
##$USERA3= <user>
##$USERA4= <user>
##$USERA5= <user>
##$V9= 5
##$VALIST= <valist>
##$VCLIST= <CCCCCCCCCCCCCCC>
##$VD= 0
##$VDLIST= <DDDDDDDDDDDDDDD>
##$VPLIST= <PPPPPPPPPPPPPPP>
##$VTLIST= <TTTTTTTTTTTTTTT>
##$WBST= 1024
##$WBSW= 4
##$XGAIN= (0..3)
0 0 0 0 
##$XL= 0
##$YL= 0
##$YMAX_a= 138209
##$YMIN_a= -209417
##$ZGOPTNS= <>
##$ZL1= 120
##$ZL2= 120
##$ZL3= 120
##$ZL4= 120
##$ABSF1= 10
##$ABSF2= 0
##$ABSG= 5
##$ABSL= 3
##$ALPHA= 0
##$AQORDER= 0
##$ASSFAC= 0
##$ASSFACI= 0
##$ASSFACX= 0
##$ASSWID= 0
##$AUNMP= <proc_1d>
##$AZFE= 0.1
##$AZFW= 0.1
##$BCFW= 1
##$BC_mod= 2
##$BYTORDP= 1
##$COROFFS= 0
##$CY= 11.3945322036743
##$DATMOD= 1
##$DC= 2
##$DFILT= <>
##$DTYPP= 0
##$F1P= 15.7292609196834
##$F2P= 12.9074282941183
##$FCOR= 0.5
##$FTSIZE= 0
##$FT_mod= 4
##$GAMMA= 1
##$GB= 0.15
##$INTBC= 1
##$INTSCL= 1
##$ISEN= 128
##$LB= 0.24
##$LEV0= 0
##$LPBIN= 0
##$MAXI= 10000
##$MC2= 0
##$MEAN= 0
##$ME_mod= 0
##$MI= 1.114404
##$NCOEF= 0
##$NC_proc= 0
##$NLEV= 6
##$NOISF1= 3.799351
##$NOISF2= 2.8
##$NSP= 1
##$NTH_PI= 0
##$NZP= 0
##$OFFSET= 15.70392
##$PC= 1
##$PHC0= -23881.12
##$PHC1= 24.6527
##$PH_mod= 1
##$PKNL= yes
##$PPARMOD= 0
##$PSCAL= 0
##$PSIGN= 0
##$REVERSE= no
##$SF= 200.130013532006
##$SI= 16384
##$SIGF1= 3
##$SIGF2= 2
##$SINO= 400
##$SIOLD= 16384
##$SREGLST= <1H.CDCl3>
##$SSB= 0
##$STSI= 0
##$STSR= 0
##$SW_p= 3612.71676300578
##$SYMM= 0
##$S_DEV= 0
##$TDeff= 0
##$TDoff= 0
##$TI= <>
##$TILT= no
##$TM1= 0
##$TM2= 0
##$TOPLEV= 0
##$USERP1= <user>
##$USERP2= <user>
##$USERP3= <user>
##$USERP4= <user>
##$USERP5= <user>
##$WDW= 1
##$XDIM= 8192
##$YMAX_p= 0
##$YMIN_p= 0
$$ End of Bruker specific parameters
$$ ---------------------------------
##NTUPLES= NMR FID
##VAR_NAME=  TIME,          FID/REAL,        FID/IMAG
##SYMBOL=    X,             R,               I
##VAR_TYPE=  INDEPENDENT,   DEPENDENT,       DEPENDENT
##VAR_FORM=  AFFN,          ASDF,            ASDF
##VAR_DIM=   8192,          8192,            8192
##UNITS=     SECONDS,       ARBITRARY UNITS, ARBITRARY UNITS
##FACTOR=    0.0002768,     1,               1
##FIRST=     0,             0,               0
##LAST=      2.2672688,     0,               0
##MIN=       0,             -209417,         0
##MAX=       2.2672688,     138209,          0
$$ Real data points
##PAGE= N=1
##DATA TABLE= (X++(R..R)), XYDATA
$$ [...]
$$ plain form
2552 -201 -1037 -324 -352 164 214 -291 -514 550 112 613 1053 733 1560 1516 1301 -107 217 879 745 -432
2572 -432 18 -172 -639 -152 -788 -548 -1253 -1580 -1112 -953 -560 -760 -678 -472 -483 201 63 -292 594 1083 1156
2593 1156 151 1635 924 434 580 592 1025 705 517 869 55 927 586 -350 91 45 -350 -158 -630 -811
2613 -811 -643 -1420 -940 -1102 -1566 -550 -524 -1 584 186 -428 793 -142 726 727 1097 941 611 755 988
2633 988 1250 237 72 -174 103 -690 -606 -241 -369 -945 -331 -737 -1003 -721 -345 -1326 -589 -617 -1016 -416
2653 -416 -173 308 877 431 1075 517 735 1374 877 747 511 1211 39 874 -66 101 242 -3 -183 -456
2673 -456 -567 -635 -705 -279 -602 -235 -547 -1204 -451 428 -1005 -967 -93 703 19 452 -134 1616 516 681
2693 681 530 583 1372 939 40 685 818 -346 289 98 -401 -718 52 -699 -397 -733 -286 -1387 -681 -93
$$ packed form
2552b01q36P13k8N16N0n05k23J064m38N01M40l20Q27m4k15j408L24O62j34j177
2572d32M50j90m67M87o36K40p05l27M68J59L93k00Q2K06j1O84j38l55Q86M89P3
2593A156j005J484p11m90J46J2M33l20j88L52q14Q72l41r36M41m6l95J92m72j81
2613h11J68p77M80j62m64J016K6N23N85l98o14J221r35Q68JL70j56l30J44K33
2633I88K62j013j65k46K77p93Q4L65j28n76O14m06k66K82L76r81P37k8l99O00
2653d16K43M81N69m46O44n58K18O39m97j30k36P00j172Q35r40J67J41k45j80k73
2673d56j11o8p0M26l23L67l12o57P53Q79j433L8Q74P96o84M33n86J750j100J65
2693F81j51N3P89m33q99O45J33j164O35j91m99l17P70p51L02l36M47j101P06N88
$$ plain form
2713 -93 -421 -541 106 -453 49 -11 399 -24 1298 865 625 1057 919 348 743 206 352 1040 250 395
2733 395 66 -577 90 372 -499 -837 -1490 -1219 -225 -315 -397 -448 -1013 -665 -686 -437 -342 228 -686 626 233
2754 233 73 709 548 426 785 1384 530 831 614 638 522 199 -560 -462 -443 -137 377 -422 -512 -535 -1322 -625
2776 -625 -269 -209 -709 20 13 658 645 257 -277 244 980 854 194 -359 583 237 100 -18 50 451 -276 -158
2798 -158 86 -576 264 -413 -912 -281 -398 -998 -1158 -981 -1431 -418 -987 -176 -193 -938 769 451 -27 804
2818 804 537 709 283 678 1222 1218 1164 1101 953 895 930 -224 533 -81 60 -483 -519 -1009 -877 -1124 -290 -320
2840 -320 -633 -983 -647 -653 -126 -16 -278 -1 304 498 451 565 690 784 1070 866 976 885 659 -111 673 131
2862 131 256 414 593 -169 -607 -847 -567 187 -187 -383 -1329 -766 -706 -413 33 19 -178 566 230 732 754
$$ packed form
2713i3l28j20O47n59N02o0M10m23J322m33k40M32j38n71L95n37J46O88p90J45
2733C95l29o43O67K82q71l38o53K71R94r0q2n1n65L48k1K49R5N70r14J312l93
2754B33j60O36j61j22L59N99q54L01k17K4j16l23p59R8J9L06N14p99r0k3p87O97
2776f25L56O0n00P29pO45j3l88n34N21P36j26o60n53R42l46j37j18O8M01p27J18
2798a58K44o62Q40o77m99O31j17o00j60J77m50J013n69Q11j7p45J707l18m78Q31
2818H04k67J72m26L95N44mn4o3j48n8L5j154P57o14J41n43l6m90J32k47Q34l0
2840c20l13l50L36oN27J10k62K77L05J94m7J14J25R4K86k04J10r1k26p70P84n42
2862A31J25J58J79p62m38k40K80P54l74j96r46N63O0K93M46j4j97P44l36N02K2
$$ plain form
2883 754 619 1053 187 397 460 363 -19 -102 373 808 62 -204 -610 -590 117 5 -1156 -497 -129 -580 -1330
2904 -1330 -458 110 -1103 -183 -577 -88 -434 -274 -325 349 336 -39 441 335 647 880 727 252 267 661
2924 661 428 546 162 53 179 -510 -364 -526 -1115 -854 -1269 -1041 -1135 -897 -157 -458 653 -788 357
2943 357 -265 -230 52 227 23 39 892 604 956 833 599 886 360 74 572 379 901 229 191 -67 -541
2964 -541 -511 -936 -1402 -743 -659 -1127 258 -492 396 -284 -535 -294 494 -17 211 540 -262 273 312 654 86
2985 86 1454 577 8 -1040 382 260 610 -420 -625 -242 -808 -593 -1292 -178 -618 -1087 -712 -1001 -1035
3004 -1035 -653 208 -71 -464 -253 -153 -49 518 175 231 589 393 939 1330 943 808 35 178 181 -137 94
3025 94 17 -93 -475 -616 -414 -466 -887 -750 -467 -1686 -347 -400 -739 49 -261 -301 -528 310 472 1035 95
$$ packed form
2883G54j35M34q66K10O3r7l82q3M75M35p46k66m06K0P07j12j161O59L68m51p50
2904a330Q72N68j213R20l94M89l46J60n1O74j3l75M80j06L12K33j53m75J5L94
2924F61k33J18l84j09J26o89J46j62n89K61m15K28r4K38P40l01J111j441J145
2943C57o22L5K82J75k04J6Q53k88L52j23k34K87n26k86M98j93N22o72l8k58m74
2964e41L0m25m66O59Q4m68J385p50Q88o80k51K41P88n11K28L29q02N35L9L42n68
2985H6J368q77n69j048J422j22L50j030k05L83n66K15o99J114m40m69L75k89l4
3004a035L82Q61k79l93K11J00J04N67l43N6L58j96N46L91l87j35p73J43Ll18K31
3025I4p7j10l82j41K02n2m21J37K83j219J339n3l39P88l10m0k27Q38J62N63r40
$$ plain form
3046 95 386 54 750 217 -34 854 505 233 142 63 123 130 51 -261 -356 -366 -697 -298 -139 -186 -449 -942 -663
3069 -663 -134 -264 -618 97 752 -460 121 883 -193 968 568 352 364 378 273 -487 291 674 182 584
3089 584 557 -494 -394 -526 -403 -979 -547 -907 -256 -160 -281 0 -331 -392 -166 967 735 -16 608 -108
3109 -108 -139 -247 346 529 914 1017 249 775 385 163 240 602 -17 -299 121 243 -493 -474 -161 -636 558
3130 558 -554 -358 -977 -281 -385 -381 315 -330 48 767 57 658 456 787 329 621 488 310 1393 -224
3150 -224 637 588 -115 26 28 -298 199 -135 -149 -442 -957 -896 -407 -415 -74 -226 -650 -256 31 83 872 450 337
3173 337 -590 527 742 -814 396 341 359 122 468 361 19 478 -667 162 167 351 -693 -536 -692 -281
3193 -281 -483 110 -485 -733 -588 87 -186 11 640 -645 426 236 906 2 480 203 449 574 192
$$ packed form
3046I5K91l32O96n33k51Q88l49k72r1p9O0Pp9l12r5j0l31L99J59m7k63m93K79
3069f63N29j30l54P15O55j212N81P62j076J161m00k16J2J4j05p60P78L83m92M02
3089E84k7j051J00j32J23n76M32l60O51R6j21K81l31o1K26J133k32p51O24p16
3109a08l1j08N93J83L85J03p68N26l90k22P7L62o19k82M20J22p36J9L13m75J194
3130E58j112J96o19O96j04MO96o45L78P19p10O01k02L31m58K92j33j78J083j617
3150b24Q61m9p03J41Kl26M97l34j4k93n15O1M89qL41j52m24L94K87N2P89m22j13
3173C37r27J117K15j556J210n5J8k37L46j07l42M59j145Q29NJ84j044J57j56M11
3193b81k02N93n95k48J45O75k73J97O29j285J071j90O70r04M78k77K46J25l82
$$ plain form
3212 192 282 -98 632 326 117 588 -939 327 -541 -589 -651 -876 513 -72 -940 -234 -199 211 -408 251
3232 251 202 -887 -73 442 279 701 -108 774 90 120 275 237 480 210 127 747 185 292 -547 -276 97
3253 97 884 -398 -317 -38 -469 109 -408 -49 248 -119 -320 -11 -212 95 536 71 -337 -82 -371 306
3273 306 1388 932 372 150 -237 -561 358 600 45 -77 -68 253 -165 165 -476 -889 -463 -452 -403 -497 -548 85
3295 85 -481 -346 70 461 -263 -174 1228 -225 464 520 1104 584 626 958 310 323 438 59 184 171 -381
3316 -381 -192 576 100 -132 -259 -330 -551 -214 -347 -359 -506 -488 -414 -435 370 -7 559 211 -89 -326 214 966
3338 966 224 214 50 274 447 397 -178 311 -367 165 -293 -262 -295 -165 -824 -416 -232 286 -334 -535 -205
3359 -205 -273 -889 -201 -588 410 163 -74 -289 243 674 -382 270 699 47 400 66 94 -477 392 -385
$$ packed form
3212A92R0l80P30l06k09M71j527J266q68m8o2k25J389n85q68P06L5M10o19O59
3232B51m9j089Q14N15j63M22q09Q82o84L0J55l8K43k70q3O20n62J07q39K71L73
3253I7P87j282Q1K79m31N78n17L59K97l67k01L09k01L07M41m65m08K55k89O77
3273C06J082m56n60k22l87l24R19K42n55j22RL21m18L30o41m13M26J1M9r4n1O33
3295H5n66J35M16L91p24Q9J402j453O89N6N84n20M2L32o48J3J15l79J25j3n52
3316c81J89P68m76k32j27p1k21L37j33j2j47J8P4k1Q05l77N66l48l00k37N40P52
3338I66p42j0j64K24J73n0n75M89o78N32m58L1l3J30o59M08J84N18o20k01L30
3359b05o8o16O88l87R98k47k37k15N32M31j056O52M29o52L53l34K8n71Q69p77
$$ plain form
3379 -385 -240 247 -158 -122 49 -159 -338 -90 -477 -823 -497 -1072 -187 133 -190 126 70 608 -444 300
3399 300 -18 774 316 482 126 764 234 880 200 484 -191 1197 256 -307 -1220 -87 -93 -179 38 126 147
3420 147 -269 -127 145 -169 -21 -587 -51 15 314 553 183 149 457 583 -74 600 -319 131 -57 71 68
3441 68 -98 319 -421 324 -318 -207 -556 -182 -378 -365 -518 -554 -306 -464 -539 -487 271 357 -435 407 16 -210
3463 -210 290 249 218 -15 -327 478 265 217 466 -240 442 -251 -269 -245 -271 -393 -1187 -5 321 -39 -497 -490
3485 -490 -675 211 -992 130 -400 -83 -110 632 99 200 -461 338 -329 63 169 -29 45 960 187 183 292
3506 292 122 -283 -323 -208 316 -51 -1017 -233 -1194 -77 -250 -641 -194 -426 -151 -253 182 -503 -104 130
3526 130 -446 -231 301 499 -109 79 -125 -288 133 14 -373 -361 186 91 -23 -405 1 -214 -902 -417 52
$$ packed form
3379c85J45M87m05L6J71k08j79K48l87l46L26n75Q85L20l23L16n6N38j052P44
3399C00l18P92m58J66l56O38n30O46o80K84o75J388r41n63r13J133oq6K17Q8K1
3420A47m16J42K72l14J48n66N36O6K99K39l70l4L08J26o57O74r19M50j88J28l
3441F8j66M17p40P45o42J11l49L74j96J3j53l6K48j58p5N2P58Q6p92Q42l91k26
3463b10N00m1l1k33l12Q05k13m8K49p06O82o93j8K4k6j22p94J182L26l60m58P
3485d90j85Q86j203J122n30L17k7P42n33J01o61P99o67L92J06j98P4R15p73mJ09
3506B92j70m05m0J15N24l67r66P84r61J117j73l91M47k32K75j02M35o85L99K34
3526A30n76K15N32J98o08J88k04j63M21j19l87J2N47r5j14l82M06k15o88M85M69
$$ plain form
3547 52 -209 160 -821 -130 -8 179 120 161 340 6 -407 413 165 302 -136 255 396 576 667 193 685
3568 685 274 531 -185 -37 -928 -143 1 492 -287 -197 -564 -918 599 -319 10 -1130 -658 -185 -481 -649
3588 -649 -254 128 -16 175 533 18 1020 757 -109 295 905 -162 714 573 -421 -993 -63 37 -193
3607 -193 163 -449 522 -136 -162 -29 -255 -241 -157 389 -405 -144 894 -238 517 186 348 1089 -4 331
3627 331 164 638 148 417 413 277 -70 257 155 308 -390 -684 -661 -485 -299 -214 -118 -189 498 -532 170 -579
3649 -579 172 254 -404 -555 514 244 -87 167 191 575 1010 201 739 616 -440 201 330 231 -90 -608
3669 -608 -81 -224 29 -226 403 -389 248 -778 488 -828 -120 -382 168 -595 -30 -326 181 113 353
3688 353 -89 684 79 120 -32 816 266 33 155 390 -244 288 319 -905 -252 -230 -53 588 -258 -202 -359
$$ packed form
3547E2k61L69r81O91J22J87n9M1J79l34m13Q20k48J37m38L91J41J80R1m74M92
3568F85m11K57p16J48q91P85J44M91p79R0l67l54J517r18L29j140M72M73k96j68
3588f49L95L82j44J91L58n15J002k63q66M04O10j067Q76j41r94n72R30J00k30
3607a93L56o12R71o58k6J33k26J4Q4N46p94K61J038j132P55l31J62P41j093L35
3627C31j67M74m90K69mj36l47L27j02J53o98k94K3J76J86Q5R6p1O87j030P02p49
3649e79P51Q2o58j51J069k70l31K54K4L84M35q09N38j23j056O41J29r9l21n18
3669f08N27j43K53k55O29p92O37j026J266j316P08k62N50p63N65k96N07o8K40
3688C53m42P73o05M1j52Q48n50k33J22K35o34N32L1j224O53K2J77O41q46N6j57
$$ plain form
3709 -359 187 -117 -396 110 -259 -152 -139 348 235 23 16 244 647 714 486 1133 385 255 817 150 428
3730 428 400 663 51 -352 -220 -371 -335 639 -427 700 734 -816 -554 -961 -235 -616 15 196 -444 -17
3750 -17 -31 137 551 456 -124 -151 420 465 317 457 569 241 877 -36 -115 123 66 161 -562 533 487 -711
3772 -711 -396 -284 -356 -288 108 522 510 -67 -180 -74 337 445 94 435 595 101 37 376 -57 -107 1116
3793 1116 849 -250 675 -1065 -604 -54 200 -433 -54 -135 -624 -206 91 -270 -64 -362 -256 423 156
3812 156 -149 128 160 197 -214 327 1083 201 201 486 13 -65 418 887 -179 587 45 464 26 67 -320 279
3834 279 -457 -120 -434 -163 121 213 -519 -131 458 -661 -305 361 113 -187 153 510 158 -543 207 278
3854 278 142 169 -364 -26 206 2 778 -136 -447 -25 -783 472 -204 -1338 -221 -21 -262 -337 -262 121
$$ packed form
3709c59N46l04k79N06l69J07J3M87j13k12pK28M03O7k28O47p48j30N62o67K78
3730D28k8K63o12m03J32j51L6R74j066J127L4j550K62m07P26l81O31J81o40M27
3750a7j4J68M14r5n80k7N71M5j48J40J12l28O36r13p9K38n7R5p23J095m6j198
3772g11L15J12p2O8L96M14j2n77j13J06M11J08l51L41J60m94o4L39m33n0J223
3793A116k67j099R25j740M61N50K54o33L79q1m89M18K97l61K06k98J06O79k67
3812A56l05K77L2L7m11N41P56q82%K85m73p8M83M69j066P66n42M19m38M1l87N99
3834B79p36L37l14K71K84R2p32L88N89j119L56O66k48l00L40L57l52p01P50P1
3854B78j36K7n33L38K32k04P76r14l11M22p58J255o76j134J117K00k41p5P5L83
$$ plain form
3874 121 -459 172 210 -84 -10 -541 262 847 439 724 -303 20 466 406 237 374 877 -109 275 444 103
3895 103 -71 340 -171 -14 -381 -28 60 -493 -25 -473 -731 -245 -244 357 410 354 462 17 419 660 398 55
3917 55 -193 -22 -528 627 193 1008 11 -151 -528 674 289 754 130 -699 118 -601 -531 -51 -233 -321
3937 -321 362 -122 -327 -129 -407 -339 568 -180 90 326 -171 -264 689 -18 205 149 709 127 257 491 -251
3958 -251 88 -453 -230 114 -120 74 382 -557 -141 -301 -722 367 62 338 683 -511 359 362 -217 237
3978 237 71 760 683 537 -615 -37 189 306 -238 -300 -2 30 303 155 197 5 201 589 -265 -301 -90
3999 -90 -529 57 362 11 0 535 -423 -242 -125 -257 597 209 373 103 527 -492 -599 451 363 387 553
4020 553 -44 -342 -256 -433 3 181 -555 25 -429 -158 497 -150 -195 -32 595 -135 206 -177 -578 183 -15
$$ packed form
3874A21n80O31L8k94P4n31Q03N85m08K85j027L23M46o0j69J37N03r86L84J69l41
3895A03j74M11n11J57l67L53Q8n53M68m48k58M86JO01N3n6J08m45M02K41k62l43
3917E5k48J71n06J155m34Q15r97j62l77J202l85M65o24q29Q17p19P0M80j82q8
3937c21O83m84k05J98k78O8R07p48K70K36m97r3R53p07K23n6N60n82J30K34p42
3958b51L39n41K23L44k34J94L08r39M16j60m21J089l05K76L45j194Q70Ln79M54
3978B37j66O89p7j46j152N78K26J17n44o2K98L2K73j48M2j92J96L88q54l6K11
3999i0m39N86L05l51j1N35r58J81J17j32Q54l88J64k70M24j019j07J050q8K4J66
4020E53n97k98Q6j77M36J78p36N80m54K71O55o47m5J63O27p30L41l83m01P61j98
$$ plain form
4041 -15 23 158 283 228 -49 -60 420 390 461 38 402 -381 597 364 -59 -291 -411 160 -48 381 -406 201
4063 201 -169 -826 251 121 -413 -9 -335 305 148 -287 99 551 506 418 1033 388 784 139 936 -62
4083 -62 116 -514 273 -342 -1091 -174 -23 -344 -266 -10 238 -325 -460 -376 -147 -287 254 277 415 -32 -285
4104 -285 -451 593 275 311 988 -148 -195 165 -158 -298 393 -310 -483 997 137 -152 -511 315 59 113
4124 113 173 -433 272 258 96 359 -203 149 -473 477 521 -10 45 794 -1164 -509 -415 406 759 674 425 -27
4146 -27 -178 164 119 152 276 212 -53 -8 60 -272 169 158 95 -348 138 -700 252 -835 -437 215 339 -186
4168 -186 340 662 -238 118 176 438 742 444 414 342 -118 -164 232 -698 643 -96 125 -121 -449 -208 427
4189 427 -156 -433 -246 163 218 308 -308 -73 -641 -84 117 -23 518 64 146 -574 1216 -171 295 -425
$$ packed form
4041a5L8J35J25n5k77j1M80l0P1m23L64p83R78k33m23k32j20N71k08M29p87O07
4063B01l70o57J077j30n34M04l26O40j57m35L86M52m5q8O15o45L96o45P97r98
4083f2J78o30P87o15p49R17J51l21P8K56K48n63j35Q4K29j40N41K3J38m47k53
4104b85j66J044l18L6O77j136m7L60l23j40O91p03j73J480q60k89l59Q26k56N4
4124A13O0o06P05j4j62K63n62L52o22R50M4n31N5P49j958O55R4Q21L53q5k49m52
4146b7j51L42m5L3J24o4k65M5O8l32M41j1o3m43M86q38R52j087L98O52J24n25
4168a86N26L22r00L56N8K62L04k98l0p2m60m6L96r30J341p39K21k46l28K41O35
4189D27n83k77J87M09N5R0o16K35n68N57K01j40N41m54Q2p20J790j387M66p20
$$ plain form
4209 -425 196 98 398 -234 820 172 497 -974 -287 -102 518 249 331 -146 -215 -139 -590 -403 -1033 57
4229 57 -455 146 -499 110 160 655 -114 503 299 346 196 214 -74 213 502 94 36 215 -874 484 -86
4250 -86 -91 -184 -479 -179 146 -476 -262 -325 -29 -509 -394 492 -198 -474 -679 -73 -196 664 -208 142 796 -264
4272 -264 448 -170 193 395 236 -504 3 217 -871 -347 -350 -442 -336 -152 -196 -504 359 420 345 -63 269 -49
4294 -49 -61 227 2 255 176 394 -452 249 356 107 -390 102 1 -653 187 -99 -74 -72 -131 149 -731 108
4316 108 -436 -89 74 186 -34 -122 122 -810 -63 -925 247 147 -11 185 149 116 91 -156 -210 155 24
4337 24 150 231 -60 -282 624 -554 -98 249 279 -475 27 451 -277 -345 79 -256 -451 479 -162 327 108
4358 108 248 -959 211 16 -35 -247 251 493 453 94 -225 83 137 -286 82 950 -183 -189 183 132 -129
$$ packed form
4209d25O21r8L00o32J054o48L25j471O87J85O20k69Q2m77o9P6m51J87o30J090
4229E7n12O01o45O09N0M95p69O17k04M7j50J8k88K87K89m08n8J79j089J358n70
4250h6nr3k95L00L25o22K14o3K96m80J15Q86o90k76k05O06j23Q60q72L50O54j060
4272b64P12o18L63K02j59p40N07K14j088N24lr2J06J84m4l08Q63O1p5m08L32l18
4294d9j2K88k25K53p9K18q46P01J07k49m97M92j01o54Q40k86K5Kn9K80q80Q39
4316A08n44L47J63J12k20q8K44r32P47q62J172j00j58J96l6l3k5k47n4L65j31
4337B4J26Q1k91k22R06j178M56L47L0p54N02M24p28o8M24l35j95R30o41M89k19
4358A08J40j207J170j95n1k12M98K42m0l59l19L08N4m23L68Q68j133oL72n1k61
$$ plain form
4379 -129 -360 4 6 406 55 -28 -789 -197 -148 338 225 771 79 -482 -200 78 806 171 870 107 483
4400 483 527 -567 417 251 -21 423 457 175 97 -415 -9 -61 -159 209 268 259 -617 382 -297 -206 -153 -573 426
4423 426 -384 254 -88 251 -164 582 68 142 787 326 1126 745 8 79 -393 -325 -288 -454 122 88 131 -503
4445 -503 -362 -1217 -227 -621 377 -26 -737 55 -35 -205 -237 465 759 866 722 263 763 100 84 222 120
4466 120 -309 639 -307 482 45 58 503 240 346 -185 -194 13 200 354 -282 213 -235 -104 132 -1012 85
4487 85 441 395 48 -384 -597 -15 756 -91 162 -97 405 -316 -47 -70 -133 -285 -259 -64 127 501 -811
4508 -811 -330 191 -628 -757 -48 -419 27 -250 -988 504 250 -25 375 -307 -204 -445 471 357 219 -116
4528 -116 258 319 -128 -283 -4 359 197 -3 -11 -774 360 580 -7 167 -987 -332 -114 -288 -144 -584
$$ packed form
4379a29k31L64KM00l51q3p61N92M9M86j13N46o92n61K82K78P28o35O99p63L76
4400D83M4j094R84j66k72M44L4k82p8n12M06n2r8L68N9rq76R99o79R1N3m20R99
4423D26q10O38l42L39m15P46n14P4O45m61Q00l81p37P1m72O8L7j66N76l4M3o34
4445e03J41q55R90l94R98m03p11P92r0j70l2P02K94J07j44m59N00o63j6J38j02
4466A20m29R48r46P89m37J3M45k63J06n31rK07J87J54o36M95m48J31K36j144J097
4487H5L56m6l47m32k13N82P71q47K53k59N02p21K69k3o3j52K6J95J91L74j312
4508h11M81N21q19j29P09l71M46k77p38J492k54k75M00o82J03k41R16j14j38l35
4528a16L74O1m47j55K79L63j62k00qp63J134K20n87J74j154O55K18j74J44m40
$$ plain form
4548 -584 221 281 -469 849 180 402 -348 -81 19 -101 -424 71 516 -203 71 -54 743 263 286 -121
4568 -121 13 -164 -156 1013 398 126 -91 -308 -384 -863 30 389 218 1083 -381 254 -96 803 243 86
4588 86 239 -16 -48 -244 -361 231 -216 -257 -209 468 -207 -70 101 -524 503 47 -172 -618 -792 592 17
4609 17 28 -946 833 -639 307 -222 -7 -352 -334 350 152 511 341 -275 -374 -58 -97 379 225 629 -4
4630 -4 523 455 -148 -366 -512 -804 -790 -251 -170 25 157 165 -468 -173 75 -364 -226 -286 -61 556 359 -5 249
4653 249 451 68 381 321 -110 230 344 505 -278 225 20 218 -588 -259 -519 -65 -350 -202 -587 -446
4673 -446 127 -123 -478 -248 -384 460 -56 -204 -154 413 -229 -169 312 98 260 -129 -357 -73 162 102 138
4694 138 -202 149 9 -239 -185 -956 -204 631 153 -331 340 -689 415 209 -720 -176 -811 -367 282 61
$$ packed form
4548e84Q05O0p50J318o69K22p50K67J00j20l23M95M45p19K74j25P97m80K3m07
4568a21J34j77QJ169o15k72k17k17p6m79Q93L59j71Q65j464O35l50Q99n60j57
4588H6J53k55l2j96j17N92m47m1M8O77o75J37J71o25J027m56k19m46j74J384n75
4609A7J1r74J779j472R46n29K15l45J8O84j98L59j70o16r9L16l9M76j54M04o33
4630dN27o8o03k18j46k92J4N39Q1J95J32Qo33K95K48m39J38o0K25O17j97l64K54
4653B49K02l83L13o0m31L40J14J61p83N03k05J98q06L29k60M54k85J48l85J41
4673d46N73k50l55K30j36Q44n16j48N0N67o42O0M81k14J62l89k28K84K35o0L6
4694A38l40L51j40k48N4p71P52Q35m78m84O71j029J104k06r29N44o35M44O49k21
$$ plain form
4714 61 375 96 -162 346 905 875 -83 579 140 43 172 280 636 -1505 -24 203 101 259 572 -65
4734 -65 -686 -504 -163 494 298 -328 -278 11 -246 -716 483 39 -37 -103 171 230 87 -73 -40 13 558 -417
4756 -417 -478 -665 -19 101 400 -395 -144 219 -135 188 833 -236 -560 222 -459 -84 -282 -667 -317 488
4776 488 20 509 183 631 -372 -189 285 -445 215 -523 788 -276 -506 -379 -283 301 174 321 156
4795 156 -589 -121 200 -152 -677 489 -600 -682 651 7 -147 -12 848 21 -452 633 26 -165 -344
4814 -344 -154 263 349 483 -489 -147 -123 911 -3 -155 -36 954 -733 -211 -189 50 -355 -528 -109 83
4834 83 364 269 83 98 -85 123 -85 -136 149 215 422 425 460 762 -169 290 37 209 26 160 -232 -725 -34
4857 -34 -164 -195 -319 717 741 302 131 285 -668 192 -9 -81 -82 -133 -171 -54 -52 -71 -239 -162 -155 -347 646 615 -12
$$ packed form
4714F1L14k79k58N08N59l0r58O62m39r7J29J08L56k141J481K27j02J58L13o37
4734f5o21J82L41O57j96o26N0K89k57m70J199m44p6o6K74N9j43j60L3N3N45r75
4756d17o1j87O46J20K99p95K51L63l54L23O45j069l24P82o81L75j98l85L50Q05
4776D88m68M89l26M48j003J83M74p30O60p38J311j064k30J27R6N84j27J47j65
4795A56p45M68L21l52n25J166j089q2J333o44j54J35Q60q27m73J085o07j91j79
4814c44J90M17Q6J34r72L42K4J034r14j52J19R90j687N22K2K39m05j73M19J92
4834H3K81r5j86J5j83K08k08n1K85O6K07LL5L02r31M59k53J72j83J34l92m93O91
4857c4j30l1j24J036K4m39j71J54r53Q60k01p2jn1l8J17Kj9j68P7Pj92R93l1o27
$$ plain form
4882 -12 -153 511 248 -21 287 -295 -315 -78 -533 -186 -683 -729 -29 -395 -498 99 -318 -389 -691 -500 -105
4903 -105 -237 -561 49 719 -34 514 93 -48 395 -341 14 451 519 427 421 48 187 253 628 -72 -442 -401
4925 -401 -447 -1009 112 -556 -47 251 -321 -275 173 26 -43 -134 413 -627 -667 692 -579 612 -158 466
4945 466 -92 416 260 700 -226 -361 262 -336 -219 -545 -131 -292 80 335 -806 564 336 -294 -5
4964 -5 -11 -240 -589 287 313 29 -295 -66 266 130 26 672 604 -144 -710 551 591 -65 133 -948 192
4985 192 138 257 -35 -298 -68 -156 -482 -191 -36 -80 35 -186 125 260 -127 -567 193 363 -43 -206 -584
5006 -584 52 287 -137 -565 -44 -100 -542 -66 359 361 439 -76 -416 148 216 -285 -494 181 -235 118 313 -773
5028 -773 -511 -444 699 -402 -322 -276 -330 410 207 869 -192 -156 98 -326 185 -254 123 -517 -84 -86 -133 -435
$$ packed form
4882a2j41O64k63k69L08n82k0K37m55L47m97m6P00l66j03N97m17p1l02J91L95
4903a05j32l24O10O70p53N48m21j41M43p36L55M37O8r2ol73J39O6L75p00l70M1
4925d01m6n62J121o68N09K98n72M6M48j47o9r1N47j040m0J359j271J191p70O24
4945D66n58N08j56M40r26j35O23n98J17l26M14j61L72K55j141J370k28o30K89
4964eok29l49Q76K6k84l24K29L32j36j04O46o8p48n66J261M0o56J98j081J140
4985A92n4J19k92k63K30q8l26K91J55m4J15k21L11J35l87m40P60J70m06j63l78
5006e84O36K35m24m28N21n6m42M76M25KP8n15l40N64O8n01k09O75m16L53J95j086
5028g73K62O7J143j101Q0M6n4P40k03O62j061L6K54m24N11m39L77o40M33km7l02
$$ plain form
5050 -435 301 87 -1013 526 -266 207 -680 -475 -590 -830 136 -1146 -490 170 -23 257 -509 -29 -651
5069 -651 -710 454 37 -50 296 131 -28 -54 24 586 313 -147 600 128 -109 -140 150 -826 -164 303 553
5090 553 -359 -47 -1237 316 -526 47 550 -414 586 -156 -254 -465 649 309 337 548 291 197 420 822
5110 822 461 3 -881 -121 -11 -159 346 -76 265 -298 94 286 -154 156 -685 332 -103 153 -72 -2
5130 -2 -470 92 -35 -179 -30 214 654 9 413 566 -155 -179 783 -413 508 152 171 40 79 264 -469
5151 -469 -510 -587 328 -32 -220 -470 -61 -4 -119 -88 -191 -124 118 -511 -194 249 23 88 -329 394 353 666
5173 666 -138 375 391 -1020 17 105 466 -399 396 -139 -125 -446 -587 -281 -156 -80 -589 -494 -176 -265 -244 264
5195 264 151 -291 724 106 307 -44 47 42 -1033 604 836 -372 -570 534 101 -310 936 84 186
$$ packed form
5050d35P36k14j100J539p92M73q87K05j15k40R66j282O56O60j93K80p66M80o22
5069f51n9J164m17q7L46j65j59k6P8N62k73m60P47m72k37l1K90r76O62M67K50
5090E53r12L12j190J553q42N73N03r64J000p42r8k11J114l40K8K11k57r4K23M02
5110H22l61m58q84P60J10j48N05m22L41n63L92J92m40L10q41J017m35K56k25P0
5130bm68N62j27j44J49K44M40o45M04J53p21k4R62j196R21l56J9j31L9J85p33
5151d69m1p7R15l60j88k50M09N7j15L1j03O7K42o29L17M43k26O5m17P23m1L13
5173F66q04N13J6j411J037Q8L61q65P95n35J4l21j41L06J25P6n09R5L18q9K1N08
5195B64j13m42J015o18K01l51R1nj075J637K32j208j98J104m33m11J246q52J02
$$ plain form
5214 186 0 -437 401 -13 69 -224 172 -378 50 -251 13 -204 706 332 -315 160 164 13 -785 120 -78
5235 -78 52 600 -138 889 -248 639 358 784 508 -285 458 277 775 -510 213 -596 -226 247 -180
5254 -180 -190 -24 234 -368 62 14 417 178 220 -124 229 -97 -168 297 208 252 -947 -79 -123 723 -3 -164
5276 -164 63 -53 230 -791 79 -20 845 -58 104 488 292 -314 189 27 334 577 -251 263 211 28
5296 28 -36 113 257 188 126 -195 209 519 -262 185 -437 -483 453 382 -379 274 -173 140 208 -247 416 778
5318 778 -219 -634 225 -4 -157 296 42 -455 415 59 -27 -237 615 893 424 444 80 -26 -326 709
5338 709 -314 374 61 -637 123 -105 619 250 -440 -491 -53 -997 -470 342 222 426 -659 -24 265 529
5358 529 390 463 919 143 -492 188 318 -178 -426 -379 297 40 650 -396 644 726 -110 -814 -425 -53
$$ packed form
5214A86j86m37Q38m14Q2k93L96n50M28l01K64k17R10l74o47M75Mj51p98R05j98
5235g8J30N48p38J027j137Q87k81M26k76p93P43j81M98j285P23q09L70M73m27
5254a80j0J66K58o02M30m8M03k39M2l44L53l26p1M65q9M4j199Q68m4Q46p26j61
5276a64K27j16K83j021Q70r9Q65r03J62L84j96o06N03j62L07K43q28N14n2j83
5296B8o4J49J44o9o2l21M04L10p81M47o22m6R36p1p61O53m47L13O8m55O63L62
5318G78r97m15Q59k29j53M53k54m97Q70l56q6k10Q52K78m69K0l64j06l00J035
5338G09j023O88l13o98P60k28P24l69o90n1M38r44N27Q12j20K04j085O35K89K64
5358E29j39P3M56p76o35O80J30m96k48M7O76k57O10j046J040Q2q36p04L89L72
$$ plain form
5378 -53 586 -168 472 -4 -518 -122 497 42 323 944 -653 -298 -420 -206 26 -133 -108 0 187 -413
5398 -413 -67 -179 -58 -223 -188 69 -56 -124 273 -181 57 -563 224 164 -8 237 -25 407 -30 574 -493
5419 -493 386 -849 173 169 69 -285 -374 -169 -576 239 156 -863 -452 -418 85 -337 -241 -672 -368 -577 -169
5440 -169 314 38 192 -475 -663 3 -512 -27 292 438 181 613 234 370 -66 85 1092 669 128 357
5460 357 25 399 -574 -175 -305 -362 313 -70 -420 -469 -145 -335 617 638 418 -29 249 257 319 204 -298 -886
5482 -886 -486 -426 115 -347 -187 -243 927 245 -243 -3 659 104 546 -8 223 -231 -321 610 -185 111 -144
5503 -144 -17 -24 112 -366 -263 -516 -302 -479 -414 144 183 -21 -284 -135 -509 -320 -206 -652 108 594 -188
5524 -188 243 12 483 -188 207 -355 -158 -219 -414 -25 241 122 -630 134 170 6 -832 34 149 89 121
$$ packed form
5378e3O39p54O40m76n14L96O19m55K81O21j597L55j22K14K32j59K5J08J87o00
5398d13L46j12J21j65L5K57j25o8L97m54K38o20P87o0j72K45k62M32m37O04j067
5419d93Q79j235J022mj00l54q9K05m07Q15q3j019M11L4N03m22R6m31L04k09M08
5440a69M83k76J54o67j88O66n15M85L19J46k57M32l79J36m36J51J007m23n41K29
5460C57l32L74r73L99j30n7O75l83l50m9L24j90R52K1k20m47K78QO2j15n02n88
5482h86M00O0N41m62J60n6J170o82m88K40O62n55M42n54K31m54r0R31p95K96k55
5503a44J27pJ36m78J03k53K14j77O5N58L9k04k63J49l74J89J14m46P60M86p82
5524a88M31k31M71o71L95n62J97o1j95L89K66j19p52P64L6j64q38Q66J15o0L2
$$ plain form
5545 121 141 -779 374 218 162 108 -288 -77 268 361 -341 -55 -388 -155 627 135 -157 115 -371 1030 -134
5566 -134 -249 104 39 -499 120 -90 597 82 36 -444 -861 -616 -398 -98 -242 -125 -531 654 -25 -552
5586 -552 -40 -576 32 321 325 390 7 -770 94 -160 20 -794 -1028 115 142 -5 -74 19 -454 348 -17 -467
5608 -467 -451 -681 136 352 477 -27 58 184 -1 -118 267 -12 223 268 204 -42 120 36 -84 730 -473
5629 -473 625 -170 -261 -184 -152 -238 -169 -339 118 -400 -401 -233 4 -470 119 -180 -20 -133 79 101 -337 126
5651 126 151 177 -394 407 87 -466 220 865 600 25 471 899 -375 -503 68 -6 44 260 93 501 412
5672 412 173 -449 151 -16 603 -783 -82 -548 126 -97 320 691 591 32 1192 -329 174 -137 -69
5691 -69 96 626 640 188 410 -103 2 -522 -602 265 -220 85 1177 673 -308 -110 -256 -47 397 336 177
$$ packed form
5545A21K0r20J153j56n6n4l96K11L45R3p02K86l33K33P82m92k92K72m86J401j164
5566a34j15L53o5n38O19k10O87n15m6m80m17K45K18L00j44J17m06J185o79n27
5586e52N12n36O08K89MO5l83p77Q64k54J80q14k34J143K7j47o9R3m73Q02l65m50
5608d67J6k30Q17K16J25n04Q5J26j85j17L85k79K35M5o4k46J62q4j20Q14j203
5629d73J098p95r1P7L2q6O9j70M57n18jJ68K37m74N89k99J60j13K12K2m38M63
5651A26K5K6n71Q01l20n53O86O45k65n75M46M28j274j28N71p4N0K16j67M08q9
5672D12k39o22O00j67O19j386P01m66O74k23M17L71j00n59J160j521N03l11O8
5691f9J65N30J4m52K22n13J05n24q0Q67m85L05J092n04r81J98j46K09M44o1j59
$$ plain form
5712 177 416 494 -197 358 14 211 113 192 -151 886 7 227 389 -5 342 60 -552 744 37 76 -248
5733 -248 -781 87 898 56 109 -552 124 167 43 -291 -353 69 -449 321 449 118 -696 158 -487 322 -17
5754 -17 -789 -237 146 -719 114 -26 -838 -877 -471 -393 -353 -74 498 -173 277 424 -31 491 116 165 42 12
5776 12 -612 -56 171 452 478 488 192 55 155 668 -74 130 5 -316 -652 157 501 -432 170 128 -248
5797 -248 -433 236 -94 -280 -848 -241 -548 170 486 -207 -265 253 20 90 411 670 283 592 264 690 216
5818 216 -48 272 97 -577 226 -87 9 -423 -229 -60 -856 -190 -170 -146 449 833 -186 -381 -810 145 -411
5839 -411 342 -629 448 -517 282 309 -166 542 -380 -328 -105 495 199 310 316 -48 275 -893 53 1073
5859 1073 -194 -206 -359 -192 -25 -737 297 455 63 1 -437 -294 -136 193 114 411 113 -4 756 239
$$ packed form
5712A77K39P8o91N55l44J97r8P9l43J037q79K20J62l94L47k82o12J296p07L9l24
5733b48n33Q68Q11q42N3o61O76M3j24l34o2M22n18P70J28l31q14Q54o45Q09l39
5754a7p72N52L83q65Q33j40q12l9M06P8M0K79N72o71M50J47m55N22l75M9j23l0
5776A2o24N56K27K81K6J0k96j37J00N13p42K04j25l21l36Q09L44r33O02m2l76
5797b48j85O69l30j86n68O07l07P18L16o93n8N18k33P0L21K59l87L09l28M26m74
5818B16k64L20j75o74Q03l13R6m32J94J69p96O66K0K4N95L84j019j95m29R55n56
5839d11P53r71J077r65P99K7m75P08r22N2K23O00k96J11Ol64L23j168R46J020
5859A073j267j2j53J67J67p12J034J58l92o2m38J43J58L29p9K97k98j17P60n17
$$ plain form
5879 239 -418 -164 711 518 -256 -200 393 -682 -478 151 327 162 406 -375 -796 266 -499 -727 -529 -173
5899 -173 11 -219 -130 399 8 -154 -296 -211 87 239 -161 -588 132 -293 -109 188 -253 -459 772 -241
5919 -241 425 -205 225 96 350 -59 -182 -519 -217 280 144 -251 827 16 -587 -314 319 89 432 783
5939 783 43 430 -133 375 -365 -402 -206 530 -131 180 -55 -131 -278 -71 -335 -26 -261 -353 211 -92 163
5960 163 -368 -187 -166 197 140 -358 460 -281 172 1245 -373 52 783 552 -322 106 134 349 531 20
5980 20 763 -214 -5 240 -238 723 381 -147 -206 326 117 718 585 30 129 290 -278 250 483 1 -523
6001 -523 -351 23 -550 297 391 452 -139 -372 199 -338 -5 -408 4 305 640 -177 -301 -112 -626 -290 275
6022 275 -234 -447 267 -357 -467 99 259 -162 369 -94 -591 243 -458 237 -456 -475 -112 -152 396 102 275
$$ packed form
5879B39o57K54Q75j93p74N6N93j075K04O29J76j65K44p81m21J062p65k28J98L56
5899a73J84k30Q9N29l91j62j42Q5K98J52m00m27P20m25J84K97m41k06J231j013
5919b41O66o30M30j29K54m09j23l37L02M97j36l95J078q11o03K73O33k30L43L51
5939G83p40L87n63N08p40l7J96P36o61L11k35p6j47K07k64L09k35r2N64l03K55
5960A63n31J81K1L63n7m98Q18p41M53J073j618M25P31k31q74M28K8K15J82n11
5980B0P43r77K09K45m78R61l42n28n9N32k09O01j33n55R9J61n68N28K33m82n24
6001e23J72L74n73Q47R4O1n91k33N71n37L33m03M12L01L35q17j24J89n14L36N65
6022B75n09k13P14o24j10N66J60m21N31m63m97Q34p01O95o93j9L63m0N48k94J73
$$ plain form
6043 275 -258 237 -45 216 860 -625 614 -189 -358 -608 8 -558 282 289 -568 -20 359 10 69 -329
6063 -329 -238 929 191 51 -134 239 76 1098 745 -61 -513 -118 640 -219 645 -244 450 -407 -808 280
6083 280 -240 109 -539 314 -619 91 -333 -627 -818 195 11 -274 282 507 -363 -283 276 407 236 515
6103 515 51 -120 264 -190 -419 889 -162 155 -270 -332 438 226 211 -372 209 -196 -49 -431 294 196
6123 196 -152 212 -228 -286 302 45 -168 -86 -75 95 -228 347 -6 213 364 549 -85 235 -598 835 -444
6144 -444 310 -42 297 448 526 672 128 -99 3 -121 266 -454 256 598 -366 -54 360 769 -201 -54
6164 -54 210 340 -103 112 25 266 -164 -507 -518 123 98 814 -474 495 -25 -587 321 276 -129 131 398
6185 398 145 -474 -42 -8 -241 133 113 517 146 578 81 57 52 361 586 -159 147 -197 -273 260 342 311 -296
$$ packed form
6043B75n33M95k82K61O44j485J239q03j69k50O16n66Q40Pq57N48L79l49N9l98
6063c29R1J167p38j40j85L73j63J022l53q06m52L95P58q59Q64q89O94q57m01J088
6083B80n20L49o48Q53r33P10m24k94j91J013j84k85N56K25q70Q0N59J31j71K79
6103E15m64j71L84m54k29J308j051L17m25o2P70k12j5n83N81m05J47l82P25r8
6123A96l48L64m40n8N88k57k13Q2J1J70l23N75l53K19J51J85o34L20q33J433j279
6144d44P54l52L39J51P8J46n44k27J02j24L87p20P10L42r64L12M14M09r70J47
6164e4K64J30m43K15q7K41m30l43j1O41k5P16j288R69n20n62R08m5m05K60K67
6185C98k53o19M32L4k33L74k0M04l71M32m97k4nL09K25p45L06l44p6N33Q2l1o07
$$ plain form
6208 -296 735 82 683 -433 -524 59 -113 -69 -125 -199 -323 454 116 9 226 735 -129 137 339 -117 612
6229 612 -677 -10 -759 -822 346 73 59 -22 -131 346 -445 -174 -77 56 -285 509 -153 171 -236 50 -180
6250 -180 -197 504 613 -279 44 -323 883 329 386 -15 -220 344 -89 -158 1039 305 569 -585 -690 -626
6270 -626 203 -316 -186 498 -240 67 480 273 -57 199 72 -69 -346 793 -656 -239 -179 333 -255 -305
6290 -305 -354 -382 -263 175 432 111 -186 -159 741 -243 -231 -59 -119 -106 185 484 558 -7 37 -382 438 -263 150
6313 150 651 233 45 93 285 690 -721 488 -8 -249 1085 -111 -56 276 -294 -306 -517 -69 369 490
6333 490 -9 158 -36 473 132 400 396 231 -179 554 -154 69 -262 468 498 8 409 -257 -19 -62 -241
6354 -241 330 -679 -163 -557 -160 -60 141 -173 164 282 -625 212 175 -38 -315 -675 -256 210 309 607
$$ packed form
6208b96J031o53O01j116r1N83j72M4n6p4j24P77l38j07K17N09q64K66K02m56P29
6229F12j289O67p49o3J168k73j4q1j09M77p91K71R7J33l41P94o62L24m07K86k30
6250a80j7P01J09q92L23l67J206n54N7m01k05N64m33o9J197p34K64j154j05O4
6270f26Q29n19J30O84p38L07M13k07l30K56j27j41k77J139j449M17O0N12n88n0
6290c05m9k8J19M38K57l21k97K7R00r84J2J72o0J3K91K99P4n65M4m19Q20p01M13
6313A50N01m18j88M8J92M05j411J209m96k41J334j196N5L32n70j2k11M48M38J21
6333D90m99J67j94N09l41K68mj65m10P33p08K23l31P30L0m90M01o66K38m3j79
6354b41N71j009N16l94L97J00K01l14L37J18r07Q37l7k13k77l60M19M66R9K98
$$ plain form
6374 607 132 -243 561 496 134 108 605 -886 -22 -172 350 403 -120 -254 -528 -427 -790 22 -824 -449 157
6395 157 -824 -30 2 -310 -85 328 -64 -46 -37 -26 -335 -134 94 194 -460 -358 -134 -344 307 -624 606
6416 606 -404 -6 -105 -365 43 263 39 344 -338 -140 352 471 228 239 -321 -324 -544 258 -192 81 96
6437 96 -103 923 249 -337 683 180 -956 148 -77 206 -603 -543 -964 62 523 -620 278 -142 389
6456 389 411 250 -6 -156 272 849 -488 -97 -288 -29 90 -845 71 241 -108 270 172 441 477 -657
6476 -657 -192 -343 -216 -111 185 -145 84 -435 -17 -705 -696 88 -184 -32 101 -367 -36 -12 -276 -30 60
6497 60 -160 -396 -774 396 -347 -198 -644 856 -302 122 -269 -470 384 -246 -744 -97 -499 311 -716
6516 -716 -56 490 612 400 219 -533 422 239 142 729 171 418 351 -992 121 38 641 205 -28 328
$$ packed form
6374F07m75l75Q04o5l62k6M97j491Q64j50N22N3n23j34k74J01l63Q12q46L75O06
6395A57r81P94L2l12K25M13l92J8RJ1l09K01K28J00o54J02K24k10O51r31J230
6416F06j010L98r9k60M08K20k24L05o82J98M92J19k43J1n60lk20Q02m50K73J5
6437I6j99J026o74n86J020n03j136J104k25K83q09O0m21J026M61j143Q98m20N31
6456C89K2j61k56j50M28N77j337L91j91K59J19r35R16J70l49L78r8K69L6j134
6476f57M65j51J27J05K96l30K29n19M18o88RP84k72J52J33m68L31K4k64K46R0
6497F0k20k36l78J170p43J49m46J500j158M24l91k01Q54o30m98O47m02Q10j027
6516g16O60N46J22k12j81p52R55j83r7N87n58K47o7j343J113q3O03m36k33L56
$$ plain form
6536 328 -667 118 555 -1031 211 -382 -396 266 -193 -127 2 241 -68 -380 -158 -589 -169 -467 472 -139
6556 -139 -66 -270 -108 318 147 -33 -176 73 -169 425 -204 734 -33 -263 -426 -199 295 51 42 -264 -7
6577 -7 139 -525 1070 76 -35 -118 257 -378 330 -293 -311 354 -668 199 51 226 501 462 0 -440 -360
6598 -360 -81 174 -537 -114 278 -48 834 115 202 9 622 -255 534 18 283 -108 386 594 272 396
6618 396 725 89 -70 26 -346 388 315 165 301 -151 559 4 -163 129 -614 108 444 -236 25 141 267
6639 267 -235 -30 88 -272 220 -336 101 17 309 862 -90 -525 109 -654 -292 -359 -155 -406 863 198
6659 198 -101 70 214 57 42 -37 -218 424 -202 -216 -667 -131 -86 395 -287 456 -626 -143 353 -737 -570
6680 -570 220 -9 633 -50 614 426 562 797 -315 579 -312 74 -542 -328 -6 8 59 273 16 -404
$$ packed form
6536C28r95P85M37j586J242n93j4O62m59O6J29K39l09l12K22m31M20k98R39o11
6556a39P3k04J62M26j71j80j43K49k42N94o29R38p67k30j63K27M94k44rl06K57
6577gJ46o64J595r94j11q3L75o35P08o23j8O65j022Q67j48J75K75l9m62m40Q0
6598c60K79K55p11M23L92l26Q82p19Q7j93O13q77P89n16K65l91M94K08l22J24
6618C96L29o36j59R6l72P34p3j50J36m52P10n55j67K92p43P22L36o80K61J16J26
6639B67n02K05J18l60M92n56M37q4K92N53r52m35O34p63L62o7K04k51J269o65
6659A98k99J71J44j57j5p9j81O42o26j4m51N36M5M81o82P43j082M83M96j090J67
6680e70P90k29O42o83O64j88J36K35j112Q94q91L86o16K14L22J4N1K14k57m20
$$ plain form
6700 -404 -479 255 -307 289 -157 220 -75 404 -1101 -320 173 -420 307 -165 661 -448 244 -57 -106 -161
6720 -161 -48 239 429 646 109 -49 641 -489 -406 20 -13 -38 206 -147 -467 -245 160 -135 -908 -1133 -488
6741 -488 171 -164 577 41 -156 -139 -216 371 223 1231 -5 -241 -313 40 771 438 397 -125 -559 -273 164
6762 164 313 -30 -312 -718 -294 -281 -52 -337 -430 -605 328 3 -235 -255 102 -92 296 -75 -463 334 375
6783 375 -229 222 -85 -739 632 -335 899 182 693 225 -739 -24 -129 -572 -148 -380 -282 9 287 -15
6803 -15 1 78 759 -146 369 -253 -580 62 -354 -656 -270 -249 116 160 -734 60 -552 -629 541 65 -414 -838
6825 -838 536 -698 -679 -574 18 124 -413 390 415 -187 -344 28 298 129 -830 -393 447 79 527 452
6845 452 295 -378 -370 731 -5 -168 550 -46 595 -130 -706 31 96 -107 -224 402 -723 52 444 656
$$ packed form
6700d04p5P34n62N96m46L77k95M79j505P81M93n93P27m72Q26j109O92l01m9n5
6720a61J13K87J90K17n37j58O90j130Q3M26l3k5K44l53l20K22M05k95p73k25O45
6741d88O59l35P41n36j97J7p7N87j48J008j236k36p2L53P31l33m1n22m34K86M37
6762A64J49l43k82m06M24J3K29k85r3j75R33l25k38k0L57j94L88l71l88P97M1
6783C75o04M51l07o54J371r67J234p17N11m68r64P15j05m43M24k32R8K91K78l02
6803a5J6P7O81r05N15o22l27O42m16l02L86K1L65M4q94P94o12p7J170m76m79m24
6825h38J374j234J9J05N92J06n37Q03K5o02j57L72K70j69r59M37Q40l68M48p5
6845D52j57o73QJ101p36j63P18n96O41p25n76P37O5k03j17O26j125P75L92K12
$$ plain form
6865 656 -241 -196 -345 372 193 -375 -455 -83 832 -288 -729 -70 345 99 176 197 116 919 -380 529 211
6886 211 -41 445 -103 -437 74 72 317 -365 -65 -479 145 -637 -171 180 347 65 342 -433 -211 1 -750
6907 -750 -335 286 -419 150 -125 -553 137 119 -366 44 -127 -300 -272 216 61 -463 90 -424 333 245 180
6928 180 848 -3 -972 15 -362 -193 -297 -374 35 -623 -638 -58 -533 -1 286 -385 -306 462 -83 -170 134
6949 134 -302 78 -55 -119 -217 -464 541 -119 93 397 -141 -537 -407 -179 -377 570 528 -214 88 -222 185
6970 185 409 177 311 969 34 -328 684 199 -256 -126 291 -668 43 64 367 12 88 -159 -86 193 282
6991 282 -651 -12 -131 -228 -321 -277 5 -303 421 294 399 -612 -264 175 -125 -242 3 212 -137 -28 -133
7012 -133 16 569 -45 6 163 33 -379 -535 24 -96 138 -1046 -111 -324 31 240 338 -383 -263 142
$$ packed form
6865F56q97M5j49P17j79n68q0L72R15j120m41O59M15k46P7K1q1Q03j299R09l18
6886B11k52M86n48l34N11kK45o82L00m14O24p82M66L51J67k82K77p75K22K12p51
6907g50M15O21p05N69k75m28O90j8m85M10j71j73K8M88j55n24N53n14P57q8o5
6928A80O68q51r69R87l77J69j04p7M09o58j5N80m75N32K87o71P9P68n45q7L04
6949A34m36L80j33o4r8k47J005o60K12L04n38l96J30K28j98R47m2p42L02l10M07
6970A85K24k32J34O58r35l62J012m85m55J30M17r59P11K1L03l55P6k47P3K79Q9
6991B82r33O39j19r7r3M4K82l08P24j27J05j011L48M39l00j17K45K09l49J09j05
7012a33J49N53o14N1J57j30m12j56N59j20K34j184R35k13L55K09R8p21J20M05
$$ plain form
7032 142 -212 83 782 88 -670 -401 41 278 -88 608 457 -204 -7 -106 -506 -190 -147 -66 7 -195 -650
7053 -650 -190 -174 89 316 -410 513 375 -815 -366 371 -465 -297 -627 9 271 20 -314 -97 502 -11
7073 -11 -496 -485 341 434 -377 -312 -631 35 -418 -331 -62 470 606 411 -365 -776 424 94 -208 -596 -304
7094 -304 -15 418 637 -769 -377 561 -592 -261 -117 212 94 -306 198 80 659 -436 -742 -181 -657
7113 -657 -20 -156 -298 -199 258 -180 -18 -725 -229 242 228 -15 -163 156 149 -311 -340 50 169 462 989 858
7135 858 -222 552 -274 -86 510 538 160 -179 -9 397 11 75 473 -654 170 342 -398 227 -136 931
7155 931 247 161 227 -482 243 340 -347 -789 97 402 149 -65 -193 181 90 -772 226 100 169 -396 748
7176 748 -60 -105 379 106 193 91 312 622 -518 -376 568 -35 29 -122 178 342 193 -51 542 -328 -500
$$ packed form
7032A42l54K95O99o94p58K69M42K37l66O96j51o61J97r9m00L16M3Q1P3k02m55
7053f50M60J6K63K27p26R23j38j190M49P37q36J68l30O36K62k51l34K17N99n13
7073a1m85J1Q26R3q11O5l19O66m53Q7K69N32J36j95p76m11J200l30l02l88K92
7094c04K89M33K19j406L92R38j153L31J44L29j18m00N04j18N79j095l06N61m76
7113f57O37j36j42R9M57m38J62p07M96M71j4k43j48L19pm60k9L90J19K93N27j31
7135H58j080P74q26J88N96K8l78l39J70M06l86O4L98j127Q24J72p40O25l63J067
7155I31o84q6O6p09P25R7o87m42Q86L05k53k14j28L74r1q62R98j26O9n65J144
7176G48q08m5M84k73Q7j02K21L10j140J42R44o03O4j51L00J64j49k44N93q70j72
$$ plain form
7197 -500 296 499 -622 -144 -261 284 447 -315 26 -67 235 -380 -550 174 657 76 -319 -178 84 -368
7217 -368 -9 -397 58 1068 617 -192 98 -287 -99 -107 564 409 209 406 76 -182 -5 172 312 -163
7237 -163 74 263 -146 -315 611 -33 -399 -207 -739 -193 -376 -5 -11 -246 129 -411 -513 -134 544 271 431
7258 431 458 112 -4 -592 -105 62 10 236 356 -427 -687 172 189 356 22 173 191 -145 190 -172 191
7279 191 416 -499 -126 -211 -483 108 41 295 64 -101 -124 -330 79 -583 -172 137 125 -228 161 143 562 -404
7301 -404 976 426 -9 -280 -306 137 -603 573 437 663 -336 146 -29 -111 9 -801 -7 121 236 -251
7321 -251 -391 -107 -199 -53 141 -227 1 -5 -674 -174 -658 -587 -417 85 401 679 117 -367 -124 213 -132
7342 -132 606 -347 622 -10 -185 -1297 404 -88 141 -225 272 -374 205 -325 289 -6 -55 110 -450 -1100
$$ packed form
7197e00P96K03j121M78j17N45J63p62L41r3L02o15j70P24M83n81l95J41K62m52
7217c68L59l88M55J010m51q09K90l85J88qO71j55k00J97l30k58J77J77J40m75
7237a63K37J89m09j69R26o44l66J92n32N46j83L71ok35L75n40j02L79O78k73J60
7258D31K7l46j16n88M87J67n2K26J20p83k60Q59J7J67l34J51J8l36L35l62L63
7279A91K25r15L73q5k72N91o7K54k31j65k3k06M09o62M11L09j2l53L89j8M19r66
7301d04J380n50m35k71k6M43p40J176j36K26r99M82j75q2J20q10P94J28J15m87
7321b51j40K84r2J46J94l68K28oo69N00m84P1J70N02L16K78n62m84K43L37l45
7342a32P38r53R69o32j75j112J701m92K29l66M97o46N79n30O14k95m9J65n60o50
$$ plain form
7362 -1100 36 306 -111 348 -595 183 20 650 421 160 101 75 199 346 396 533 -149 140 -73 -39 229
7383 229 -3 18 -91 -780 -460 -431 -208 -354 646 517 348 480 214 199 485 -694 401 -336 991 513
7403 513 -166 574 -201 975 281 82 -598 -60 -383 557 800 -104 330 -95 31 -864 -336 268 53 -279
7423 -279 -54 -247 324 357 811 -14 -287 -757 -589 481 -5 -529 416 31 -519 421 -234 -37 -386 389
7443 389 -520 -267 26 370 -499 84 -498 197 411 328 199 398 92 90 374 -120 -310 259 74 260 379
7464 379 -287 306 -116 194 -279 264 -108 162 -811 3 -191 -500 393 -652 107 265 -64 -139 -54 184
7484 184 -225 -289 -191 -78 456 360 373 72 286 -134 -383 -203 326 197 225 797 505 434 376 -389 0 -139
7506 -139 151 67 -128 423 -741 -301 456 -366 41 -104 176 193 39 73 -49 79 -209 157 826 -125 6
$$ packed form
7362a100J136K70m17M59r43P78j63O30k29k61n9k6J24J47N0J37o82K89k13L4K68
7383B29k32K1j09o89L20K9K23j46J000j29j69J32k66j5K86j179J095p37J327m78
7403E13o79P40p75J176o94j99o80N38l23R40K43r04M34m25J26q95N28O04k15l32
7423b79K25j93N71L3M54q25k73m70J68J070m86n24R45l85n50R40o55J97l49P75
7443C89r09K53K93L44q69N83n82O95K14q3j29J99l06kK84m94j90N69j85J86J19
7464C79o66N93m22L10m73N43l72K70r73Q14j94l09Q93j045P59J58l29p5Q5K38
7484A84m09o4R8J13N34r6J3l01K14m20k49J80N29j29K8N72k92p1n8p65L89j39
7506a39K90q4j95N51j164M40P57q22M07j45K80J7j54L4j22J28k88L66O69r51J31
$$ plain form
7527 6 124 -266 176 147 538 -251 586 -661 -238 652 -205 -209 35 -308 193 125 -33 -64 -91 -401 291 516
7549 516 -163 127 -14 -169 164 354 59 683 87 -59 97 719 -54 -346 119 349 11 -465 241 -132
7569 -132 -66 -105 -144 470 285 165 -271 -104 -48 333 -148 -126 -241 -439 -462 190 275 457 -6 -731 360 301
7591 301 404 171 640 -97 145 -100 -341 -143 -193 -200 381 -20 -583 170 -215 -368 -485 174 200 3 27 -92
7613 -92 -260 297 -121 -376 -857 -822 -87 267 -6 -68 -107 0 841 263 850 403 2 -241 -302 -346 -752 -754 290
7636 290 354 -63 113 -205 259 162 271 225 -215 26 -226 -574 -1013 -576 343 -180 -51 -1000 -40 -526 -186
7657 -186 149 282 -13 427 -271 22 -101 -315 -195 135 -275 261 407 184 110 300 -703 -366 -26 -1055
7677 -1055 549 -599 -302 124 70 -433 226 -339 -729 -299 -593 -47 -285 -991 -754 -122 -98 -47 37 191
$$ packed form
7527FJ18l90M42k9L91p89Q37j247M23Q90q57mK44l43N01o8j58l1k7l10O92K25
7549E16o79K90j41j55L33J90k95O24n96j46J56O22p73k92M65K30l38m76P06l73
7569a32O6l9l9O14j85j20m36J67N6L81m81K2j15j98k3O52Q5J82m63p25J091n9
7591C01J03k33M69p37K42k45k41J98n0pN81m01n63P53l85j53j17O59K6j97K4j19
7613i2j68N57m18k55m81L5P35L54k73o2l9J07Q41n78N87m47m01k43o1m4m06kJ044
7636B90O4m17J76l18M64r7J09m6m40K41k52l48m39M37R19n23J29r49R60m86L40
7657a86L35J33k95M40o98K93j23k14J20L30m10N36J46k23p4J90j003L37L40j029
7677a055J604j148K97M26n4n03O59n65l90M30k94N46k38p06K37O32K4N1Q4J54
$$ plain form
7697 191 329 -710 528 256 -166 58 -25 -1 -356 235 -629 91 326 -334 234 -147 955 837 -172
7716 -172 -75 -200 106 -787 -109 183 -486 159 -275 -34 -538 -42 373 554 265 586 -214 -56 -391 398
7736 398 184 -255 -199 -379 129 -394 378 -222 97 349 210 45 408 -75 -208 37 214 123 -292 -171 -115
7757 -115 354 424 253 358 584 -207 -21 -101 -357 -201 -116 -76 -511 189 -438 -498 165 81 188 -291 397 -530
7779 -530 -901 -396 94 238 -127 -5 25 218 -311 -192 202 -237 528 -529 -7 8 113 417 -527 -816
7799 -816 -624 -723 -557 85 -34 -689 111 -394 -192 -694 672 -79 -68 -584 -251 101 -583 -373 38 578
7819 578 397 67 -20 516 220 205 -69 248 -343 -251 -272 -583 217 592 0 -252 -182 189 879 23 258 -710
7841 -710 -110 -933 -313 -220 346 -146 -80 -22 -180 505 35 71 -52 -234 415 405 -178 394 -313 -273 -470 293
$$ packed form
7697A91J38j039J238k72m22K24q3K4l55N91q64P20K35o60N68l81J102j18j009
7716a72R7j25L06q93O78K92o69O45m34K41n04M96M15J81k89L21q00J58l35P89
7736C98k14m39N6j80N08n23P72o00L19K52j39j65L63m83j33K45J77r1m15J21N6
7757a15M69P0j71J05K26p91J86q0k56J56Q5M0m35P00o27o0O63q4J07m79O88r27
7779e30l71N05M90J44l65J22L0J93n29J19L94m39P65j057N22J5J05L04r44k89
7799h16J92r9J66O42j19o55Q00n05K02n02J366p51J1n16L33L52o84K10M11N40
7819E78j81l30q7N36k96j5k74L17n91R2k1l11Q00L75n92k52P0L71O90q56K35r68
7841g10O00q23O20R3N66m92O6N8j58O85m70L6j23j82O49j0n83N72p07M0j97P63
$$ plain form
7863 293 424 2 -229 -417 270 218 151 37 351 -564 -207 341 -239 -19 51 301 -177 -200 63 349 -320
7884 -320 0 492 406 50 403 -30 337 -355 271 112 -32 41 -310 -360 -303 21 -9 -141 -322 -628 -190 -223
7906 -223 21 -122 -228 45 -224 286 592 19 -67 151 310 -259 -386 86 -423 295 405 -586 11 -343
7926 -343 -170 -650 -625 129 529 -628 -282 -619 -200 -37 118 267 -284 13 -413 172 252 248 -478 -783 -110
7947 -110 464 190 -14 -169 19 -182 40 -169 373 515 -163 199 1062 -7 -267 -223 -375 -126 -191 -99 -438
7968 -438 -41 -33 -270 -471 -11 367 632 -145 -92 -8 -116 115 546 440 -427 -522 733 810 -150 -198 -303 -64
7990 -64 -117 110 266 239 -426 -267 314 -162 31 -99 -192 -256 -452 -578 36 268 -156 320 306 -404 557 -307
8012 -307 -195 122 -472 128 -57 263 -227 194 892 -273 -269 -660 51 123 86 -209 -250 384 -104 -152 -43 278
$$ packed form
7863B93J31m22k31j88O87n2o7j14L14r15L57N48n80K20P0K50m78k3K63K86o69
7884c20L20M92q6l56L53m33L67o92O26j59j44P3l51n0N7L24l0j32j81l06M38l3
7906b23K44j43j06K73k69N10L06n73q6K18J59n69j27M72n09P18J10r91N97l54
7926c43J73m80K5P54M00j157L46l37M19J63J55J49n51K97m26N85Q0mp26l05O73
7947a10N74k74k04j55J88k01K22k09N42J42o78L62Q63j069k60M4j52K49o5R2l39
7968d38L97Qk37k01M60L78K65p77N3Q4j08K31M31j06q67r5J255P7r60m8j05K39
7990f4n3K27J56k7o65J59N81m76J93j30r3o4j96j26O14K32m24M76j4p10R61q64
8012c07J12L17n94O00j85L20m90M21O98j165Ml91P11P2l7k95m1O34m88m8J09L21
$$ plain form
8034 278 -440 511 414 759 508 495 -322 -729 -601 381 -265 231 253 15 -163 -323 252 -277 71 210 353
8055 353 -558 123 -714 -649 362 32 -285 -796 367 -634 314 35 936 -231 -348 51 -251 -420 297
8074 297 -180 227 747 -50 -231 -455 194 677 172 -354 -9 -201 28 -579 -141 -374 126 -276 -374 250
8094 250 -392 -534 -140 -279 798 276 -871 -609 -429 622 423 -440 125 -232 -106 93 -119 -656 -73
8113 -73 444 -183 -213 330 -417 694 20 -48 -34 -712 128 538 32 -390 45 28 344 -234 255 -420 385
8134 385 -289 -431 -200 224 -18 -637 236 545 621 -105 -338 -23 198 284 -70 -217 101 353 -23 -133 -450
8155 -450 -137 317 -111 108 -620 -14 -271 401 493 56 60 13 163 -554 -326 52 143 148 -102 50 73 -33 -294
8178 -294 646 -381 240 -278 -387 643 155 655 531 -446 -25 -156 320
$$ packed form
8034B78p18R51r7L45k51j3q17m07J28R82o46M96K2k38j78j60N75n29L48J39J43
8055C53r11O81q37O5J011l30l17n11J163j001R48k79R01j167j17L99l02j69P17
8074B97m77M07N20p97j81k24O49M83n05n26L45j92K29o07M38k33N00m02r8O24
8094B50o42j42L94j39J077n22j147K62J80J051j99q63N65l57J26J99k12n37N83
8113g3N17o27l0N43p47J111o74o8J4o78Q40M10n06m22M35j7L16n78M89o75Q05
8134C85o74j42K31M24k42o19Q73L09P6p26k33L15K21Q6l54j47L18K52l76j10l17
8155d50L13M54m28K19p28O06k57O72R2m37Mm7J50p17K28L78R1Nk50J52K3j06k61
8178b94R40j027O21n18j09J030m88N00j24r77M21j31M76
8191C20
$$ Imaginary data points
##PAGE= N=2
##DATA TABLE= (X++(I..I)), XYDATA
$$ plain form
0 0 0 0 0 0 0 0 0 0 0 0 0 0 0 0 0 0 0 0 0 -58 62 -62 62 -62 62 -77 124 -124 126 -170 186 -200 247 -262 308
35 308 -342 378 -433 481 -538 600 -663 734 -819 904 -996 1105 -1221 1346 -1479 1626 -1791
52 -1791 1975 -2180 2408 -2665 2957 -3291 3687 -4146 4695 -5366 6213 -7321 8825 -11008
66 -11008 14454 -20859 36823 -194874 -130672 271 -209417 -136323 -40446 -112369 -155369 -34014
78 -34014 -39286 -68610 -33367 -8772 -17900 27458 30000 23546 59559 74800 41233 71163 107498
91 107498 76981 52618 97033 100495 51380 57379 101409 58279 15262 60418 66245 11 14042
104 14042 49817 194 -22722 22181 1997 -34211 -3179 -7064 -44523 -15986 -7753 -52462
116 -52462 -31761 -6509 -55383 -52961 -6847 -41921 -70242 -24775 -27741 -70424 -41648 -15553
$$ packed form
0@%%%%%%%%%%%%%%%%%%%n8J20j24J24j24J24j39K01k48K50k96L56l86M47n09N70
35C08o50P20q11R14j019J138j263J397j553J723j900K101k326K567k825L105l417
52a791L766m155M588n073N622o248O978p833Q841j0061J1579j3534J6146j9833
66a1008K5462l5313N7682k31697O4202J30943k09688P3094R5877p1923m3000J21355
78c4014n272k9324L5243K4595r128M5358K542o454L6013J5241l3567K9930L6335
91A07498l0517k4363M4415L462m9115N999M4030m3130m3017M5156N827o6234J4031
104A4042L5775m9623k2916M4903k0184l6208L1032l885l7459K8537Q233m4709
116e2462K0701K5252m8874K422M6114l5074k8321M5467k966m2683K8776K6095
$$ plain form
128 -15553 -54471 -55421 -17961 -31545 -46501 -14443 -8433 -26198 -11640 10931 4456 7350 30931
141 30931 31058 23928 45107 54033 41550 55102 67752 45817 47312 71012 51824 33006 53906
154 53906 46878 10176 22682 34911 -4395 -11700 8855 -20637 -40311 -13970 -26514 -56405
166 -56405 -37966 -32117 -58118 -47754 -27380 -46334 -47239 -21674 -28263 -34496 -8881 -4373 -17918
179 -17918 1298 15295 2533 8267 28596 19027 8032 26671 30587 10050 18097 29847 8619
192 8619 1533 20112 8988 -7903 6672 4452 -14445 -5275 5352 -12821 -12975 3906 -7465
205 -7465 -13980 7400 4467 -9911 6522 14471 -2101 6347 21622 6665 1569 18570 12271
218 12271 -2661 11494 12994 -8111 -2966 7374 -9118 -14799 -1756 -10457 -23538 -11591 -9398
$$ packed form
128a5553l8918r50L7460j3584j4956L2058O010j7765J4558K2571o475K894K3581
141C0931J27p130K1179Q926j2483J3552J2650k1935J495K3700j9188j8818K0900
154E3906p028l6702J2506J2229l9306p305K0555k9492j9674K6341j2544k9891
166e6405J8439N849k6001J0364K0374j8954r05K5565o589o233K5615M508j3545
179a7918J9216J3997j2762N734K0329r569j0995J8639L916k0537Q047J1750k1228
192H619p086J8579j1124j6891J4575k220j8897R170J0627j8173j54J6881j1371
205g465o515K1380k933j4378J6433P949j6572Q448J5275j4957n096J7001o299
218A2271j4932J4155J500k1105N145J0340j6492n681J3043q701j3081J1947K193
$$ plain form
231 -9398 -22846 -17567 -7726 -18684 -18491 -932 -6346 -11917 3929 5715 -4017 8373 19047 8176
245 8176 9477 23968 15637 7490 21771 20982 4197 10596 17171 569 -962 9037 -3487 -14010
259 -14010 -3279 -6979 -20477 -12253 -7687 -22168 -19121 -5286 -14989 -17178 -2208 -4573 -11653 2360
273 2360 8187 -914 7221 17995 8970 7770 22456 16527 6476 18311 18604 3651 8125 13681
287 13681 598 -4068 4320 -3914 -14389 -6505 -6930 -19346 -14388 -8004 -18884 -16913 -6239 -12477
301 -12477 -16533 -2325 -945 -8632 1738 10128 1127 4633 17069 11489 6388 18504 17290 6244
315 6244 13264 16820 4628 4791 10723 -664 -6211 2783 -3366 -15071 -7647 -5943 -18551 -13770
329 -13770 -6412 -15266 -16662 -4580 -8253 -12554 -971 2139 -5124 1587 10512 4103 5914 15755
$$ packed form
231i398j3448N279R841j0958J93J7559n414n571J5846J786r732J2390J0674j0871
245H176J301J4491q331q147J4281p89j6785O399O575j6602j531R999j2524j0523
259a4010J0731l700j3498Q224M566j4481L047J3835r703k189J4970k365p080J4013
273B360N827r101Q135J0774r025j200J4686n929j0051J1835K93j4953M474N556
287A3681j3083m666Q388q234j0475P884m25j2416M958O384j0880J971J0674o238
301a2477m056J4208J380p687J0370Q390r001L506J2436n580n101J2116j214j1046
315F244P020L556j2192J63N932j1387n547Q994o149j1705P424J704j2608M781
329a3770P358q854j396J2082l673m301J1583L110p263O711Q925o409J811R841
$$ plain form
343 15755 12665 6023 15941 16308 6789 9474 13811 3329 464 7066 -149 -8682 -1545 -4348 -14673
358 -14673 -9534 -5634 -16553 -14936 -5725 -12376 -15443 -4394 -4375 -9746 -550 5664 -936 3284 12991
373 12991 7274 5804 17247 13043 7373 15074 16193 6567 7212 12031 2176 -407 5071 -591 -10171
388 -10171 -4628 -5717 -15304 -11809 -7733 -16324 -16820 -8104 -11499 -14893 -6347 -3704 -9147 -2318 4987
403 4987 167 1231 11387 8585 5155 14390 14838 6641 12537 15104 6694 6543 12175 3696 -2130
418 -2130 5252 1437 -7392 -2925 -1518 -11627 -9862 -3966 -10546 -12630 -3975 -6167 -11068 -3011 33
433 33 -5200 -629 6456 1912 1985 10403 7875 3557 10027 11267 3722 5606 9927 2395 -944 3754
449 3754 -534 -7749 -3103 -4133 -13471 -10199 -6653 -14447 -13818 -6034 -10824 -14598 -4696 -3077 -8858
$$ packed form
343A5755l090o642R918L67r519K685M337j0482k865O602p215q533P137k803j0325
358a4673N139L900j0919J617R211o651l067J1049J9n371R196O214o600M220R707
373A2991n717j470J1443m204n670P701J119r626O45M819r855k583N478n662r580
388a0171N543j089r587L495M076q591m96Q716l395l394Q546K643n443O829P305
403D987m820J064J0156k802l430R235M48q197N896K567q410j51N632q479n826
418b130P382l815q829M467J407j0109J765N896o580k084Q655k192m901Q057L044
433C3n233M571P085m544P3Q418k528m318O470J240p545J884M321p532l339M698
449C754m288p215M646j030r338L272L546p794O29P784m790l774R902J619n781
$$ plain form
464 -8858 -925 4851 -621 3703 11788 8352 7984 15504 14528 10783 15461 17053 9486 10919 14503 6962
480 6962 2895 7251 3043 -5158 -2410 -3412 -11067 -10836 -8300 -13073 -15483 -10250 -12083 -16958 -9719
495 -9719 -6268 -12132 -8425 232 -4307 -3318 5444 3971 940 8543 10233 4092 8538 12735 6021
510 6021 5980 11093 5068 727 6108 2845 -4112 -572 160 -7338 -6641 -2482 -7896 -9008 -2780 -3956
526 -3956 -7938 -2648 794 -3756 -609 5662 2491 2519 8338 7576 3770 9643 10552 3972 5927 9943
542 9943 3801 29 4797 90 -6408 -2839 -2881 -11061 -9785 -6827 -13558 -14739 -7454 -11703 -13889 -7420
558 -7420 -5884 -10232 -3733 1640 -2804 118 7152 5260 5932 13041 12626 8707 13095 14903 9501 12132
574 12132 14743 8198 4943 8926 4858 -471 545 209 -6318 -8463 -5500 -9957 -11998 -8195 -9956
$$ packed form
464h858P933N776n472M324Q085l436l68P520r76l745M678J592p567J433L584p541
480F962m067M356m208q201K748j002p655K31K536m773k410N233j833m875P239
495i719L451n864L707Q657m539R89Q762j473l031P603J690o141M446M197o714
510F021m1N113o025m341N381l263o957L540P32p498O97M159n414j112O228j176
526c956l982N290L442m550L147O271l171K8N819p62l806N873R09o580J955M016
542I943o142l772M768m707o498L569m2q180J276K958o731j181P285m249k186O469
558g420J536m348O499N373m444K922P034j892O72P109m15l919M388J808n402K631
574A2132K611o545l255L983m068n329J016l36o527k145K963m457k041L803j761
$$ plain form
589 -9956 -14294 -8637 -7736 -10420 -7646 -1895 -5039 -5075 2278 2615 -467 5397 6838 2232 6045 10675
605 10675 5020 5029 8877 3995 850 5182 3051 -3280 -378 863 -4767 -4925 -1867 -6049 -6713 -3464
621 -3464 -2741 -5535 -1742 -43 -2360 861 4289 3208 3366 7539 8561 4541 8836 10082 5326 5078
637 5078 9210 4592 353 4781 2303 -4970 -3173 -2412 -8997 -9500 -6622 -11922 -14374 -10245 -12999 -14562
653 -14562 -9419 -8583 -12045 -6900 -2858 -5300 -1346 3486 2950 2771 8955 9848 8177 13166 13866 10067
669 10067 12349 14346 11871 9125 10095 8760 4497 4412 3850 -1176 -2776 -1291 -4915 -7950 -6181 -7454
685 -7454 -10210 -8229 -5910 -10355 -8475 -3911 -6974 -7185 -692 -1319 -3378 1536 3075 -1285 1934 4803
701 4803 1399 1836 4296 1761 -456 2613 660 -2464 -673 -742 -5139 -4554 -2160 -4422 -4717 -2196
$$ packed form
589i956m338N657R01k684K774N751l144l6P353L37l082N864J441m606L813M630
605A0675n655RL848m882l145M332k131o331K902J241n630j58L058m182o64L249
621c464P23k794L793J699k317L221L428j081J58M173J022m020M295J246m756k48
637E078M132m618m239M428k478p273J797P61o585n03K878n300k452M129k754j563
653a4562N143Q36l462N145M042k442L954M832n36j79O184Q93j671M989P00l799
669A0067K282J997k475k746R70j335m263q5n62n026j600J485l624l035J769j273
685g454k756J981K319m445J880M564l063k11O493o27k059M914J539m360L219K869
701D803l404M37K460k535k217L069j953l124J791o9m397N85K394k262k95K521
$$ plain form
717 -2196 -2545 -4103 -966 1352 -77 1799 5193 4700 3803 8945 8825 7343 9080 12103 8587 8549 10169
734 10169 7570 4419 6479 3832 -938 -435 -544 -6143 -6785 -5142 -10314 -11948 -10062 -11842 -14042 -11113
750 -11113 -9815 -12687 -9752 -5697 -8264 -6205 -1084 -757 -430 5072 5246 4057 7760 9862 8060 8378
766 8378 11206 9440 7111 9358 8695 4216 4491 5401 796 -592 514 -2260 -4182 -2856 -3626 -7205
782 -7205 -4489 -3479 -6166 -4960 -1491 -2857 -3183 1163 815 -763 2700 4521 2350 4053 6660 4483
798 4483 3122 5697 4238 1534 2516 1375 -2645 -1113 -1528 -5053 -5769 -4314 -6514 -7415 -5765 -5553
814 -5553 -8011 -6428 -4021 -5189 -5073 -1267 -1584 -692 2193 3800 2858 5493 7696 5752 6676 8619
830 8619 7110 5399 7413 7125 3413 4007 4539 379 -108 460 -2558 -4198 -2824 -4137 -6386 -4700
$$ packed form
717b196l49j558L137K318j429J876L394m93q97N142j20j482J737L023l516l8J620
734A0169k599l151K060k647m770N03j09n599o42J643n172j634J886j780k200K929
750a1113J298k872K935M055k567K059N121L27L27N502J74j189L703K102j802L18
766H378K828j766k329K247o63m479K75R10m605j388J106k774j922J326p70l579
782g205K716J010k687J206L469j366l26M346l48j578L463J821k171J703K607k177
798D483j361K575j459k704R82j141m020J532m15l525p16J455k200r01J650K12
814e553k458J583K407j168J16L806l17Q92K885J607r42K635K203j944R24J943
830H619j509j711K014k88l712N94N32m160m87N68l018j640J374j313k249J686
$$ plain form
846 -4700 -3786 -6581 -4647 -1856 -4175 -3521 440 382 -776 2060 3690 2831 4293 6387 4441 4061 5173
863 5173 4012 2473 3351 3012 -867 -791 -702 -4043 -5936 -4638 -6114 -8252 -5731 -6950 -9446 -7722 -5579
880 -5579 -7786 -5471 -2297 -2082 -2133 1386 3018 2363 5046 8055 6177 7596 10114 8835 8336 10770
896 10770 9689 7170 7795 6565 3915 3867 3112 -58 -1558 -1142 -4027 -6264 -4923 -5713 -7613 -7309 -5862
913 -5862 -7993 -7231 -4993 -4641 -5626 -3746 -1942 -2548 -858 1732 859 1196 3744 3092 2757 3973 3252
930 3252 2381 2145 3305 728 339 1479 -1149 -2381 -517 -2481 -3533 -1876 -1775 -2768 -2029 -645 -1173
947 -1173 -333 1422 1677 1039 3165 4852 3379 4927 6711 5983 5089 6145 4949 4388 4942 2830 628
964 628 -163 326 -2119 -4140 -2927 -5376 -7801 -6807 -7288 -8759 -7368 -6573 -7970 -7377 -4940 -4447 -4128
$$ packed form
846d700R14k795J934K791k319O54L961n8j158K836J630q59J462K094j946l80J112
863E173j161j539Q78l39l879P6Q9l341j893J298j476k138K521j219k496J724K143
880e579k207K315L174K15n1L519J632o55K683L009j878J419K518j279m99K434
896A0770j081k519O25j230k650m8p55l170j500M16k885k237J341p90j900L04J447
913e862k131P62K238L52r85J880J804o06J690K590q73L37K548o52l35J216p21
930C252q71k36J160k577l89J140k628j232J864j964j052J657J01r93P39J384n28
947a173Q40J755K55o38K126J687j473J548J784p28q94J056j196n61N54k112k202
964F28p91M89k445k021J213k449k425R94m81j471J391P95j397N93K437M93L19
$$ plain form
981 -4128 -1150 293 -225 2229 3931 3526 5059 7753 6240 6274 8052 7120 5803 6518 6501 3760 2523
998 2523 3489 740 -926 271 -1162 -4278 -3232 -3618 -5779 -5346 -4129 -5029 -6220 -3489 -3573 -4270 -1929
1015 -1929 -616 -2141 506 1340 400 1729 3855 3589 3051 4127 4024 2535 2917 3284 973 -459 1270
1032 1270 -793 -2120 -2329 -2581 -4389 -3518 -2391 -4229 -3193 -2498 -2988 -2289 -293 -512 -265 2671 3555
1049 3555 3405 4207 6201 3951 4325 6907 5514 4183 4436 5136 2316 2460 2495 -220 -1664 -1096 -3218
1066 -3218 -5025 -5054 -5666 -7422 -7907 -6193 -7832 -8200 -5288 -5543 -5345 -3117 -2765 -2388 420 1648 1930
1083 1930 3096 5262 5399 4825 7799 7590 6089 6937 7463 5468 5053 5433 3249 2313 2688 1075 -166
1100 -166 703 -891 -3496 -2006 -2887 -4283 -3195 -2918 -3244 -3181 -2647 -2395 -2339 -1570 -522 -482 -696 435 634
$$ packed form
981d128K978J443n18K454J702m05J533K694j513L4J778r32j317P15j7k741j237
998B523R66k749j666J197j433l116J046l86k161M33J217r00j191K731q4o97K341
1015a929J313j525K647Q34r40J329K126k66n38J076j03j489L82L67k311j432J729
1032A270k063j327k09k52j808Q71J127j838J036O95m90O99J996k19K47K936Q84
1049C555j50Q02J994k250L74K582j393j331K53P00k820J44L5k715j444N68k122
1066c218j807k9o12j756m85J714j639l68K912k55J98K228L52L77K808J228K82
1083A930J166K166J37n74K974k09j501Q48N26j995m15L80k184r36L75j613j241
1100a66Q69j594k605J490q81j396J088K77l26O3N34K52N6P69J048M0k14J131J99
$$ plain form
1119 634 -222 436 633 -845 -369 30 -2187 -2924 -1798 -2976 -3432 -3471 -3566 -4866 -3421 -2691 -3781 -2978
1137 -2978 -1274 -1699 -134 1521 1697 1977 4875 5902 4904 6946 8040 7976 8322 10157 8198 6961 7635
1154 7635 7388 5781 4475 3696 1505 489 -847 -2786 -3658 -5209 -5907 -8086 -8756 -8259 -10895 -9997 -9319
1171 -9319 -9747 -9475 -7680 -6616 -7272 -5614 -2536 -2860 -1141 914 1353 558 4403 5062 4455 5636 6221
1188 6221 5913 6030 6135 5050 5304 4638 4495 2719 3599 2784 1034 2115 1473 194 -247 749 820 -318
1206 -318 -339 948 184 -200 1235 644 -854 970 629 -311 879 278 -1413 -585 -1949 -2004 -2796 -3243
1224 -3243 -3984 -5393 -3942 -5168 -6695 -5138 -5693 -6960 -5558 -4041 -4505 -3750 -1522 -1080 -1557 1075
1240 1075 2987 2286 3571 5482 6707 6815 7505 7803 7843 8254 7872 7172 6920 6257 4240 3935 3166 538
$$ packed form
1119F34q56O58J97j478M76L99k217p37J126j178m56l9r5j300J445P30j090Q03
1137b978J704m25J565J655J76K80K898J027r98K042J094o4L46J835j959j237O74
1154G635k47j607j306p79k191j016j336j939q72j551o98k179o70M97k636Q98O78
1171i319m28K72J795J064o56J658L078l24J719K055M39p95L845O59o07J181N85
1188F221l08J17J05j085K54o66j43j776Q80q15j750J081o42j279m41R96P1j138
1206c18k1J287p64l84J435n91j498J824l41r40J190o01j691Q28j364n5p92m47
1224c243p41j409J451j226j527J557n55j267J402J517m64P55K228M42m77K632
1240A075J912p01J285J911J225J08O90K98M0M11l82p00k52o63k017l05p69k628
$$ plain form
1258 538 -176 -380 -1092 -4353 -4569 -4372 -5832 -6563 -5734 -5967 -7103 -5405 -5053 -5090 -4254 -2319 -2660 -1787 -435
1277 -435 178 363 1990 1576 2015 3432 3372 2911 2684 2538 1459 2025 1570 778 28 -362 -82 -1445 -1325
1296 -1325 -977 -2193 -1745 -822 -951 -1305 -1136 344 371 1686 2193 1781 1439 2805 3294 3340 3404 3657 3591 3060
1316 3060 2618 1249 633 713 -598 -1550 -1536 -2622 -3763 -3579 -3202 -4569 -4621 -4114 -4571 -5190 -4234 -3102 -3009
1335 -3009 -2196 -1052 -906 -330 1552 1059 2202 3323 4058 4304 4036 4338 5232 4171 4787 3661 3153 3169
1353 3169 1865 731 758 67 -1227 -2078 -2086 -2852 -3258 -3268 -3462 -4224 -3385 -2253 -2947 -1705 -1193 -859 -625
1372 -625 1279 -105 545 2707 2490 2471 2882 2778 2208 2523 2301 1923 608 1453 -751 -865 -1031 -1301 -2075
1391 -2075 -3246 -2144 -2939 -3340 -2746 -2536 -2854 -2668 -1649 -504 -450 689 1191 690 2648 2874 2702 3545
$$ packed form
1258E38p14k04p12l261k16J97j460p31Q29k33j136J698L52l7Q36J935l41Q73J352
1277d35O13J85J627m14M39J417o0m61k27j46j079N66m55p92p50l90K80j363J20
1296a325L48j216M48R23j29l54J69J480K7J315N07m12l42J366M89M6O4K53o6n31
1316C060m42j369o16Q0j311r52J4j086j141J84L77j367n2N07m57o19R56J132R3
1335c009Q13J144J46N76J882m93J143J121P35K46k68L02Q94j061O16j126n08J6
1353C169j304j134K7o91j294q51qp66m06j0j94p62Q39J132o94J242N12L34K34
1372f25J904j384O50K162k17j9M11j04n70L15k22l78j315Q45k204j14j66k70p74
1391b075j171J102p95m01N94K10l18J86J019J145N4J139N02n01J958K26j72Q43
$$ plain form
1409 3545 4064 3212 2774 3458 2886 1994 2301 1373 331 1169 -185 -2229 -2030 -2050 -2697 -3295 -3327 -3977 -4228
1428 -4228 -3187 -3744 -3506 -2006 -2236 -2557 -694 481 31 957 2356 1946 2257 2712 3603 2937 3791 3671
1446 3671 2616 2474 2654 1010 318 935 280 -818 -1395 -1343 -1901 -2552 -2770 -2870 -2287 -2484 -2010 -2158 -1597
1465 -1597 -951 -402 -900 194 1138 1564 1595 2227 2014 3118 3693 3191 2317 2772 1684 1750 861 260 152
1484 152 -434 -1043 -2411 -1920 -2760 -3724 -3821 -2472 -3463 -2943 -2328 -2034 -2492 -2303 -1015 -275 -94 458 1855
1503 1855 1936 2925 1740 3392 2604 3988 3504 3023 2277 2839 1686 1196 1691 168 -35 -38 -1078 -1005 -1955
1522 -1955 -2727 -2428 -2114 -2452 -2400 -2140 -1933 -1920 -702 -291 -272 127 1261 2159 1516 2236 2332 1333 1975 1980 2021
1543 2021 1239 891 547 -195 -489 -290 -1891 -1908 -1862 -2889 -2958 -2746 -2993 -3620 -2560 -2933 -1596 -2343 -837
$$ packed form
1409C545N19q52m38O84n72q92L07r28j042Q38j354k044J99k0o47n98l2o50k51
1428d228J041n57K38J500k30l21J863J175m50R26J399m10L11M55Q91o66Q54j20
1446C671j055j42J80j644o92O17o55j098n77N2n58o51k18j00N83j97M74j48N61
1465a597O46N49m98J094R44M26L1O32k13J104N75n02q74M55j088O6q89o01j08
1484A52n86o09j368M91q40r64r7J349r91N20O15K94m58J89J288P40J81N52J397
1503A855Q1R89j185J652p88J384m84m81p46N62j153m90M95j523k03lj040P3r50
1522a955p72K99L14l38N2K60K07J3J218M11J9L99J134Q98o43P20R6r99O42NM1
1543B021p82l48l44p42k94J99j601j7M6j027o9K12k47o27J060l73J337p47J506
$$ plain form
1562 -837 -422 321 1049 1221 1333 2551 3181 3131 4358 4296 3531 3739 4172 3602 2428 2425 1733 1079 47 541
1582 541 -791 -1320 -1796 -2285 -3512 -2735 -3011 -3488 -3641 -3707 -3919 -2976 -2546 -2403 -1188 -212 -628 -42 528
1601 528 1148 1723 1366 2190 2165 1519 2341 2429 1349 1471 1357 518 585 542 -546 -833 -1003 -1673 -1920 -1366 -1040
1622 -1040 -1410 -786 -225 -538 97 847 450 1032 607 2009 1966 2188 2764 2370 2726 2263 2641 1555 1352
1641 1352 823 -22 -263 -897 -618 -1792 -2252 -2461 -3484 -2782 -4098 -4172 -4584 -2829 -3485 -2898 -1866 -2039
1659 -2039 -2045 -439 116 270 924 2493 1946 2684 3104 3645 4061 2914 2836 3031 2981 2919 1387 955 1543 -405
1679 -405 633 -409 -1225 -1236 -1500 -1714 -2815 -2136 -1186 -2679 -2033 -1780 -474 -713 -621 -154 64 427 1108
1698 1108 1508 1603 1941 2072 1666 1498 880 402 1100 832 -292 -590 -368 -783 -1352 -411 -2267 -2707 -2061
$$ packed form
1562h37M15P43P28J72J12J218O30n0J227o2p65K08M33n70j174lo92o54j032M94
1582E41j332n29m76m89j227P77k76m77j53o6k12R43M30J43J215R76m16N86N70
1601E28O20N75l57Q24k5o46Q22Q8j080J22j14q39O7m3j088k87j70o70k47N54L26
1622a040l70O24N61l13O35P50l97N82m25J402m3K22N76l94L56m63L78j086k03
1641A352n29q45k41o34K79j174m60k09j023P02j316p4m12J755o56N87J032j73
1659b039oJ606N55J54O54J569n47P38M20N41M16j147p8J95n0o2j532m32N88j948
1679d05J038j042q16j1k64k14j101O79R50j493O46K53J306k39R2M67K18L63O81
1698A108M00R5L38J31m06j68o18m78O98k68j124k98K22m15n69R41j856m40O46
$$ plain form
1717 -2061 -1902 -2059 -1794 -1264 -1394 -757 -356 605 317 766 1547 1265 2308 2170 1897 2773 3029 3102 2283 2667
1737 2667 1560 1741 1497 499 2 -411 -504 -1835 -2053 -2453 -1901 -2484 -2780 -1698 -2901 -2786 -2237 -1835 -1203
1756 -1203 -1144 105 -735 684 758 890 1103 1527 1814 1958 2818 1531 2191 2186 1137 1255 1423 1096 44
1775 44 -332 -760 -979 -291 -1754 -1524 -1774 -2125 -1803 -889 -1461 -1621 -1307 -788 -58 -158 -145 836 1465 253
1795 253 1414 1686 1960 1712 2425 1506 1363 1372 1062 -237 -56 58 -318 -1062 -602 -1538 -1386 -1405 -1688 -2685
1815 -2685 -2283 -2192 -2358 -2030 -1534 -1114 -873 -319 783 897 1297 1545 1858 2433 2243 1968 2145 2842 2548 1626
1835 1626 1628 1114 270 423 346 -596 -319 -1249 -1899 -1492 -1928 -2259 -2689 -2000 -1919 -2071 -2365 -805 -663 -1472 -468
1856 -468 -388 354 933 1364 1326 1347 1693 1468 1578 1960 1118 1802 1158 341 673 -31 -574 -885 -1218 -925 -1216
$$ packed form
1717b061J59j57K65N30j30O37M01R61k88M49P81k82J043j38k73Q76K56P3q19L84
1737B667j107J81k44r98m97m13r3j331k18m00N52n83k96J082j203J15N49M02O32
1756a203N9J249q40J419P4J32K13M24K87J44Q60j287O60nj049J18J68l27j052
1775D4l76m28k19O88j463K30k50l51L22R14n72j60L14N19P30j00J3R81O29j212
1795B53J161K72K74k48P13r19j43Rl10j299J81J14l76p44M60r36J52j9k83r97
1815b685M02R1j66L28M96M20K41N54J102J14M00K48L13N75j90k75J77O97k94r22
1835A626Kn14q44J53p7r42K77r30o50M07m36l31m30O89Q1j52k94J560J42q09J004
1856d68Q0P42N79M31l8K1L46k25J10L82q42O84o44q17L32p04n43l11l33K93k91
$$ plain form
1877 -1216 -2046 -1014 -1433 -1185 -1062 -794 -716 -539 62 625 1124 1555 1253 1311 1728 1669 2035 1790 1944 2298
1897 2298 1317 1513 537 1090 480 276 -232 -749 -562 -1631 -1858 -1529 -1895 -3171 -2472 -2510 -2488 -1647 -1863 -1862
1917 -1862 -1064 -707 -336 -1118 297 740 780 1239 1980 1489 1872 2333 2102 1890 1428 1573 877 1079 767 194
1937 194 597 475 -52 -1124 -963 -1174 -1509 -1601 -823 -1204 -875 -603 -1029 -417 -357 -41 288 676 554 1221
1957 1221 1370 1158 1027 1461 1206 1566 255 457 696 163 -403 -576 -987 -1688 -1189 -1712 -2082 -2507 -1687
1976 -1687 -2503 -1320 -1573 -1301 -1140 -1026 389 -120 -400 1109 1366 1206 1749 1954 2460 2876 2228 3064 2973
1995 2973 2718 2788 2203 1733 134 390 445 -7 -1064 -1436 -1853 -1179 -1703 -2036 -1803 -1866 -1001 -2053 -1797 -1130
2015 -1130 -934 -984 -1201 -263 724 808 1168 1340 1125 1746 1408 787 751 436 380 846 609 -154 -317 -243 -603
$$ packed form
1877a216q30J032m19K48J23K68P8J77O01N63M99M31l02N8M17n9L66k45J54L54
1897B298r81J96r76N53o10k04n08n17J87j069k27L29l66j276O99l8K2Q41k16J
1917a862P98L57L71p82J415M43M0M59P41m91L83M61k31k12m62J45o96K02l12n73
1937A94M03j22n27j072J61k11l35r2P78l81L29K72m26O12O0L16L29L88j22O67
1957A221J49k12j31M34k55L60j311K02K39n33n66j73m11p01M99n23l70m25Q20
1976a687q16J183k53K72J61J14J415n09k80J509K57j60N43K05N06M16o48Q36r1
1995B973k55P0n85m70j599K56N5m52j057l72m17O74n24l33K33o3Q65j052K56O67
2015a130J96n0k17R38R87Q4L60J72k15O21l38o21l6l15n6M66k37p63j63P4l60
$$ plain form
2036 -603 -967 -1225 -1492 -1404 -1406 -928 -1449 -820 -776 -243 51 278 460 189 670 1204 1773 1045 1977 1816 1469
2057 1469 1766 1552 1086 1134 1128 920 547 125 -298 -5 -1434 -1452 -1999 -851 -1964 -1928 -2001 -2146 -1488 -1561 -864
2078 -864 -1099 -607 -924 200 609 736 786 961 1602 1872 1922 2119 1430 873 749 832 561 -178 131 442 -475
2099 -475 -1146 -946 -1261 -1840 -1163 -1837 -2302 -1398 -1435 -796 -1682 -1113 -860 -27 -95 119 -64 510 731 1252 1159
2120 1159 2278 1225 1604 1248 1151 1058 1623 945 -585 26 103 11 -835 -1054 -1193 -1351 -1580 -1200 -1248 -1312 -1362
2141 -1362 -877 -1380 49 4 -484 347 437 618 339 1665 1561 1123 1094 1875 1106 1363 1493 507 863 315
2161 315 301 250 -679 -244 -1292 -1205 -1225 -1457 -2021 -1784 -1203 -913 -1226 -1141 60 -630 674 953 109 846 405
2182 405 1513 1587 1684 1192 1392 2205 2107 524 999 681 463 371 155 -844 294 -481 -838 -1508 -1200 -1381
$$ packed form
2036f03l64k58k67Q8kM78n21O29M4N33K94K27J82k71M81N34N69p28R32j61l47
2057A469K97k14m66M8ok08l73m22m23K93j429j8n47J148j113L6p3j45O58p3O97
2078h64k35M92l17J124M09J27N0J75O41K70N0J97o89n57j24Q3k71p39L09L11r17
2099d75o71K00l15n79O77o74m65R04l7O39q86N69K53Q33o8K14j83N74K21N21r3
2120A159J119j053L79l56r7r3N65o78j530O11P7r2q46k19j39j58k29L80m8o4n0
2141a362M85n03J429m5m88Q31R0J81k79J326j04m38k9P81p69K57J30r86L56n48
2161C15j4n1r29M35j048Q7k0k32n64K37N81K90l13Q5J201o90J304K79q44P37m41
2182D05J108P4R7m92K00Q13r8j583M75l18k18r2k16r99J138p75l57o70L08j81
$$ plain form
2202 -1381 -1750 -2007 -1505 -1683 -1278 -1037 -918 -862 94 606 -96 521 946 612 929 1164 1197 852 951 1072 1195
2223 1195 1299 186 652 -355 -568 -504 -1174 -521 -190 -1603 -1076 -903 -1000 -392 -1062 -147 -256 931 554
2242 554 508 348 1395 945 1161 1396 1192 1071 973 1701 1648 839 518 812 627 5 8 -463 -1400 -1286 -1432
2263 -1432 -1503 -1435 -1616 -2272 -1767 -1658 -1743 -1134 -1705 -406 137 -843 828 411 -4 283 1031 1205 561 1235
2283 1235 2058 1632 1493 1456 1178 1302 517 205 626 -292 40 -413 -464 -356 -335 -1074 -1008 -486 -1045 -132 -819
2304 -819 -976 -1026 -757 150 68 274 877 328 848 505 933 840 1185 133 106 840 144 -230 -432 -422 -1316
2325 -1316 -410 -689 -1915 -912 -1132 -1320 -1464 -1244 -854 -1256 -545 -867 -264 249 448 307 1163 846 991
2344 991 1195 1309 1608 1686 2314 1462 1023 244 573 614 486 26 -254 -340 -325 -910 -732 -1350 -931 -1571 -1341
$$ packed form
2202a381l69k57N02j78M05K41J19N6R56N12p02O17M25l34L17K35L3l45R9J21J23
2223A195J04j113M66j007k13O4o70O53L31j413N27J73r7O08o70R15j09J187l77
2242E54m6j60J047m50K16K35k04j21r8P28n3q09l21K94j85o22Lm71r37J14j46
2263a432p1O8j81o56N05J09q5O09n71J299N43r80J671m17m15K87P48J74o44O74
2283A235Q23m26j39l7k78J24p85l12M21r18L32m53n1J08K1p39O6N22n59R13o87
2304h19j57n0K69R07q2K06O03n49N20l43M28r3L45j052k7P34o96l74k02J0q94
2325a316R06k79j226J003k20j88j44K20L90m02P11l22O03N13J99j41Q56l17J45
2344I91K04J14K99P8O28q52m39p79L29M1j28m60k80q6J5n85J78o18M19o40K30
$$ plain form
2365 -1341 -1454 -1471 -1444 -954 -684 -238 -460 -212 34 -186 864 542 803 389 434 1151 737 1150 1324 248
2385 248 549 766 88 -379 -354 -1094 -896 -211 -1064 -448 -633 -527 -957 -1239 -85 -218 -730 -401 -89 44
2405 44 104 448 362 566 1479 1547 1491 1245 1096 912 1009 -4 547 652 663 -192 -370 -746 -720 -1369 -1208 -824
2427 -824 -1245 -1266 -1335 -931 -915 -802 -1357 -229 -539 186 309 1015 149 232 965 1338 1022 787 1155 625 1005
2448 1005 1364 550 794 -238 610 -537 522 -296 -728 -713 -749 -743 -747 -679 -560 -523 -720 -883 -50 -679 -29
2469 -29 -215 325 749 1225 769 951 606 293 1299 1003 547 1343 1113 340 266 -296 -186 47 -671 -980
2489 -980 -1353 -1020 -517 -847 -1545 -722 -966 -490 -76 -82 -270 -80 206 776 595 560 553 767 1297 1019 1354 380
2511 380 1401 2019 467 507 391 101 208 -410 -848 -1169 -604 -1303 -1490 -1757 -942 -1160 -1462 -1879 -1578 -375
$$ packed form
2365a341j13j7K7M90K70M46k22K48K46k20J050l22K61m14M5P17m14M13J74j076
2385B48L01K17o78m67K5p40J98O85q53O16j85J06m30k82J154j33n12L29L12J33
2405D4O0L44q6K04R13O8n6k46j49j84R7j013N51J05J1q55j78l76K6o49J61L84
2427h24m21k1o9M04J6J13n55J128l10P25J23P06q66Q3P33L73l16k35L68n30L80
2448A005L59q14K44j032Q48j147J059q18m32J5l6OmO8J19L7j97j63Q33o29O50
2469b9j86N40M24M76m56J82l45l13J006k96m56P96k30p73p4n62J10K33p18l09
2489i80l73L33N03l30o98Q23k44M76M14oj88J90K86N70j81l5pK14N30k78L35r74
2511C80J021O18j552M0j16k90J07o18m38l21N65o99j87k67Q15k18l02m17L01J203
$$ plain form
2531 -375 -399 -89 -678 381 739 707 523 972 954 1511 531 805 36 1059 477 544 370 300 -554 218 568
2552 568 -337 -527 -1143 -760 -1282 -779 -820 -177 -1179 -405 -346 -132 -322 38 508 1255 497 566 1509 1497 1069
2573 1069 1233 1078 161 807 706 812 613 -394 -443 -221 -649 -775 -783 -1079 -394 -1013 -548 -1272 -682 -1328
2593 -1328 -424 -838 -573 45 -306 172 -1 535 544 1320 791 991 763 912 1343 1429 997 793 1313 110
2613 110 -71 545 -110 268 -706 -1082 -912 -550 -50 -919 -602 -1732 -746 -513 -304 -80 -452 -210 336 430
2633 430 789 114 787 1424 544 478 931 1290 247 -289 564 -44 -353 -107 -113 -1138 -408 -951 -1447 -953
2653 -953 -284 -970 -962 -43 -39 -245 -856 569 117 81 736 91 607 466 1435 1535 845 702 1123 840 967
2674 967 1269 205 636 137 -95 140 -773 -318 -1230 -1138 -1251 -750 -883 -1643 -592 -30 -333 -385 30 -255
$$ packed form
2531c75k4L10n89J059L58l2j84M49j8N57r80K74p69J023n82O7j74p0q54P72L50
2552E68r05j90o16L83n22N03m1O43j002P74N9K14j90L60M70P47p58O9R43j2m28
2573A069J64j55r17O46j01J06j99j007m9K22m28j26qk96O85o19M65p24N90o46
2593a328R04m14K65O18l51M78j73N36RP76n29K00k28J49M31Q6m32k04N20j203
2613A10j81O16o55L78r74l76J70L62N00q69L17j130R86K33K09K24l72K42N46R4
2633D30L59o75O73O37q80o6M53L59j043n36Q53o08l09K46oj025P30n43m96M94
2653i53O69o86QR19Mk06o11J425m52l6O55o45N16j41R69J00o90j43M21k83J27
2674I67L02j064M31m99k32K35r13M55r12R2j13N01j33p60J051N62l03n2M15k85
$$ plain form
2694 -255 -68 -340 202 621 -29 902 371 683 1077 702 895 330 621 477 1320 542 -491 7 -288 -943
2714 -943 -1011 -840 -1086 -493 -566 -694 -879 -670 -741 -707 685 -343 947 362 530 564 1300 753 597 834 472
2735 472 1168 833 1061 737 602 188 -282 -286 -137 -375 -1209 -749 -877 -618 -424 -728 -1080 -605 -1154 -317 176
2756 176 -36 352 -221 105 -38 61 478 768 1164 800 697 798 114 816 964 624 1440 562 252 -287
2776 -287 -481 -183 -480 -700 -614 -1305 -491 -233 -907 -1032 -1021 -879 -586 -770 -91 -332 74 387 377 462 117
2797 117 -199 647 759 1207 643 559 586 37 -242 -205 -723 -107 -327 -783 -902 -793 -1245 -1385 -1049 -702 -1331
2818 -1331 -1438 -254 -420 -942 -675 197 167 1121 559 643 588 40 396 789 968 373 611 363 304 622 691
2839 691 -603 42 -402 -723 -995 -550 -1038 324 -807 -774 -97 -683 -739 44 -365 -197 469 -198 -600 634
$$ packed form
2694b55J87k72N42M19o50R31n31L12L94l75J93n65K91j44Q43p78j033M98k95o55
2714i43o8J71k46N93p3j28j85K09p1L4J392j028J290n85J68L4P36n47j56K37l62
2735D72O96l35K28l24j35m14m70mJ49k38q34M60j28K59J94l04l52M75n49Q37M93
2756A76k12L88n73L26j43R9M17K90L96l64j03J01o84P02J48l40Q16q78l10n39
2776b87j94K98k97k20Q6o91Q14K58o74j25J1J42K93j84O79k41M06L13j0Q5l45
2797A17l16Q46J12M48n64q4K7n49k79L7n18O16k20m56j19J09m52j40L36L47o29
2818a331j07J184j66n22K67Q72l0R54n62Q4n5n48L56L93J79n95K38k48n9L18O9
2839F91j294O45m44l21k72M45m88J362j131L3O77n86n6P83m09J68O66o67m02J234
$$ plain form
2859 634 117 -22 832 300 322 1295 221 957 -501 -63 520 -246 379 -372 -201 -395 -270 279 -516 -955
2879 -955 -772 -528 -548 -161 286 -222 -405 248 348 879 461 714 771 929 706 988 199 1252 459 754
2899 754 613 98 -14 -278 -683 -436 -39 -200 -494 -1086 49 -595 -105 -151 -700 -564 -392 -616 -300 -595
2919 -595 399 -176 611 832 422 621 223 721 1267 348 787 737 442 368 92 558 395 88 -202 40 -351
2940 -351 -631 -829 -443 -208 -962 -209 -688 -174 -253 -347 -395 -127 405 -578 495 37 750 104 936 793 862
2961 862 377 563 280 57 745 57 -204 75 -136 -532 -970 -587 -537 -265 -938 -1028 -230 -828 604 594 -40
2982 -40 -274 510 450 -264 -278 -151 493 455 1055 656 411 771 699 719 229 -199 39 -136 319 -460 -98 -460
3004 -460 -484 -631 -641 -842 -500 -594 -1032 -378 -38 -67 -537 -745 467 -270 249 778 545 433 936 687 94
$$ packed form
2859F34n17j39Q54n32K2R73j074P36j458M38N83p66O25p51J71j94J25N49p95m39
2879i55J83K44k0L87M47n08j83O53J00N31m18K53N7J58k23K82p89J053p93K95
2899G54j41n15j12k64m05K47L97j61k94n92J135o44M90m6n49J36J72k24L16k95
2919e95R94n75P87K21m10J99l98M98N46r19M39n0k95p4k76M66j63l07k90K42l91
2940c51k80j98L86K35p54P53m79N14p9r4m8K68N32r83J073m58P13o46Q32j43O9
2961H62m85J86k83k23O88o88k61K79k11l96m38L83N0K72o73r0P98n98J432j0o34
2982d0k34P84o0p14j4J27O44l8O00l99k45L60p2K0m90m28K38j75M55p79L62l62
3004d60k4j47j0k01L42r4m38O54L40k9m70k08J212p37N19N29k33j12N03k49n93
$$ plain form
3025 94 141 870 825 379 150 199 951 -210 -203 79 -603 -392 -535 -268 -1400 -426 -739 -878 -539 -583 -856 -279
3047 -279 -625 -171 -159 -78 275 552 790 -49 168 575 -42 697 -44 207 338 66 -568 161 -900 -553
3067 -553 183 328 -297 -797 -814 2 -412 -49 278 -303 -656 -228 -163 -184 -639 95 446 695 574 1165 659
3088 659 464 663 -26 483 595 526 358 -70 -145 52 -216 -592 -1185 -406 -1046 -201 169 -837 266 -533
3108 -533 174 -67 105 25 -159 166 320 53 -248 369 217 -102 1047 1003 -226 551 -75 168 309 500
3128 500 718 522 -203 -560 -926 301 -715 -131 -74 -1027 -358 -553 -818 -1051 -479 -60 484 86 -526 524
3148 524 51 125 622 885 481 451 511 989 134 574 105 117 -203 1633 305 -116 -371 -643 160 -854
3168 -854 -585 -556 -336 -1020 -34 -167 68 294 -37 332 192 -357 108 838 430 146 577 101 1224 62
$$ packed form
3025I4M7P29m5m46k29M9P52j161PK82o82K11j43K67j132R74l13j39L39m4k73N77
3047b79l46M54J2Q1L53K77K38q39K17M07o17P39p41K51J31k72o34P29j061L47
3067e53P36J45o25n00j7Q16m14L63L27n81l53M28O5k1m55P34L51K49j21N91n06
3088F59j95J99o89N09J12o9j68m28p5J97k68l76n93P79o40Q45L70j006J103p99
3108e33P07k41J72q0j84L25J54k67l01O17j52l19J149m4j229P77o26K43J41J91
3128E00K18j96p25l57l66J227j016N84N7r53O69j95k65k33N72M19N44l98o12J050
3148E24m73P4M97K63m04l0O0M78q55M40m69J2l20J836j328m21k55k72Q03j014
3168h54K69K9K20o84R86j33K35K26l31L69j40n49M65P30m08k84M31m76J123j162
$$ plain form
3188 62 -43 815 -698 383 206 0 -74 -663 -317 324 -468 -331 -617 -554 -167 -241 -1312 -773 56 -119
3208 -119 -5 -244 230 -332 -595 525 571 -385 452 677 376 292 -173 589 97 480 93 -44 286 -197
3228 -197 -169 -411 -86 -1003 -617 -431 -290 -98 -71 -412 -79 951 35 469 -270 361 615 78 136 -221 378
3249 378 745 815 -81 -336 606 346 486 305 -189 18 57 -269 -165 -203 -775 -680 -577 -218 -354 -520 -493 -429
3271 -429 118 -442 -860 546 478 875 644 623 258 353 303 320 881 626 338 346 -54 -419 298 -78 -360 27
3293 27 -420 -709 -173 97 -538 -320 -532 -142 -981 -785 -976 -305 -821 231 -50 786 -70 -98 870 299
3313 299 -190 -242 412 -437 492 135 383 1192 484 -333 -387 161 116 -287 -337 -512 -228 -978 -407 -663 -68
3334 -68 -7 153 173 -469 -25 108 302 417 -425 146 775 -763 102 331 378 822 -327 -60 681 377 -273
$$ packed form
3188F2j05Q58j513J081j77k06p4n89L46O41p92J37k86O3L87p4j071N39Q29j75
3208a19J14k39M74n62k63J120M6r56Q37K25l01q4m65P62m92L83l87j37L30m83
3228a97K8k42L25r17L86J86J41J92K7l41L33J030r16M34p39O31K54n37N8l57N99
3249C78L67P0q96k55R42k60J40j81m94K07L9l26J04l8n72R5J03L59j36j66K7O4
3271d29N47n60m18J406o8L97k31k1l65R5n0J7N61k55k88Qm00l65P17l76k82L87
3293B7m47k89N36K70o35K18k12L90q39J96j91O71n16J052k81Q36q56k8R68n71
3313B99m89n2O54q49R29l57K48Q09p08q17n4N48m5m03n0j75K84p50N71k56N95
3334f8O1J60K0o42M44J33J94J15q42N71O29j538Q65K29M7M44j149K67P41l04o50
$$ plain form
3355 -273 96 -391 -259 -1085 -226 -636 -285 -1069 -844 -181 -989 -194 -728 -285 619 243 -154 445 331 572
3375 572 462 203 125 730 281 1016 506 520 394 -93 712 8 -38 463 689 -517 -391 -102 -858 -407 -544
3396 -544 -821 763 219 -1147 -454 776 -320 -483 150 -192 358 282 -626 599 684 511 395 265 -51
3415 -51 451 33 62 306 -165 -399 53 357 -81 358 -231 -519 -438 -847 -732 -222 731 -106 117 -26 400
3436 400 -635 -327 644 898 -191 800 61 -316 924 -471 719 258 386 274 -332 -88 550 -401
3454 -401 -722 -636 -1081 444 -206 -172 71 -45 -816 23 -329 -134 -575 135 485 -348 113 -140 -84 265 478
3475 478 -807 -278 75 -149 481 151 266 96 -232 26 400 146 -191 55 573 -266 -321 -632 -519 266
3495 266 -748 284 -530 -421 255 637 618 -15 121 -126 380 -188 -415 97 275 378 54 458 617 23
$$ packed form
3355b73L69m87J32q26Q59m10L51p84K25O63q08P95n34M43R04l76l97N99j14K41
3375E72j10k59p8O05m49P35n10J4j26m87Q05p04m6N01K26j206J26K89p56M51j37
3396e44k77J584n44j366O93J230j096j63O33l42N50p6r08J225Q5j73j16j30l16
3415e1N02m18K9K44m71k34M52L04m38M39n89k88Q1m09J15N10R53q37K23j43M26
3436D00j035L08R71K54j089R91p39l77J240j395J190m61J28j12o06K44O38r51
3454d01l21Q6m45J525o50L4K43j16p71Q39l52J95m41P10L50q33M61k53N6L49K13
3475D78j285N29L53k24O30l30J15j70l28K58L74k54l37K46N18q39n5l11J13P85
3495B66j014J032q14J09O76L82j9o33J36k47N06n68k27N12J78J03l24M04J59n94
$$ plain form
3515 23 150 -130 -424 259 -676 367 511 -566 -396 -535 195 -724 -364 372 -69 -592 -105 806 339 344
3535 344 -139 195 449 285 -197 504 -4 -10 -256 729 108 522 346 -155 85 -443 -341 -177 -506 -549 -359
3556 -359 -281 -324 -394 -424 -914 10 302 -410 -11 -578 -1061 110 539 343 11 332 -292 1021 -214 669
3576 669 -438 378 -367 -15 -316 -97 7 -16 -417 -1114 -557 -1173 -644 -275 122 7 -36 99 -979 65
3596 65 67 -490 347 -82 400 979 113 137 325 1021 164 -277 -222 146 -444 290 138 -344 -1126 -128 510 -557
3618 -557 179 -539 -412 -319 -159 -343 -249 -550 -661 -665 118 295 265 372 371 681 57 464 677 580 625 292 -16
3641 -16 187 153 24 -107 -671 -506 420 -60 -335 -254 -636 -793 -963 -28 399 -418 -196 -252 -863 420 -64
3662 -64 -185 266 556 -440 710 445 513 239 302 111 74 -260 303 210 313 -54 -289 -441 -148 -521 -127
$$ packed form
3515B3J27k80k94O83r35J043J44j077J70j39P30r19L60P36m41n23M87R11m67N
3535C44m83L34K54j64m82P01n08ok46R85o21M14j76n01K40n28J02J64l29m3J90
3556c59P8m3p0l0m90R24K92p12L99n67m83J171M29j96l32L21o24J313j235Q83
3576F69j107Q16p45L52l01K19J04k3m01o97N57o16N29L69L97j15m3J35j078J044
3596F5Kn57Q37m29M82N79q66K4J88O96q57m41N5L68n90P34j52m82p82R98O38j067
3618e57P36p18J27R3J60j84R4l01j11mP83J77l0J07jL10o24M07K13r7M5l33l08
3641a6K03l4j29j31n64J65R26m80k75Q1l82j57j70R35M27q17K22n6o11J283m84
3662f4j21M51K90r96J150k65O8k74O3j91l7l34N63r3J03l67k35j52K93l73L94
$$ plain form
3683 -127 -637 -533 10 178 -311 450 614 38 205 654 -159 -69 -4 520 183 481 79 973 400 547 295
3704 295 47 208 -293 -1089 -50 149 -367 176 103 -154 -210 56 -86 -993 -724 -1289 -232 207 274 23
3724 23 -73 -128 348 162 73 15 333 239 600 35 681 77 -306 608 -156 24 -278 213 -460 -386 -352 22 -356
3747 -356 270 -134 -160 364 205 -189 49 -293 -192 -777 536 -43 35 -89 255 -226 -573 434 33 -424
3767 -424 383 431 291 454 -79 595 -424 143 943 95 -358 -250 -599 -552 85 151 -201 -583 273 -741
3787 -741 187 -170 505 210 -285 84 255 582 429 502 227 532 -11 565 370 -252 259 151 236 59 171
3808 171 -450 222 147 231 87 -626 376 798 -749 -543 175 327 -16 -352 611 67 338 103 563 142
3828 142 199 695 -291 724 50 -168 271 101 458 -632 946 -78 -327 -115 -683 -830 -368 -173 -591
$$ packed form
3683a27n10J04N43J68m89P61J64n76J67M49q13R0O5N24l37K98m02Q94n73J47k52
3704B95k48J61n01p96J039J99n16N43p3k57n6K66j42r07K69n65J057M39O7k51
3724B3r6n5M76j86q9n8L18r4L61n65O46o04l83R14p64J80l02M91o73P4L4L74l78
3747c56O26m04k6N24j59l94K38l42J01n85J313n79P8j24L44m81l47J007m01m57
3767d24Q07M8j40J63n33O74j019N67Q00q48m53J08l49M7O37O6l52l82Q56j014
3787g41R28l57O75k95m95L69J71L27j53P3k75L05n43N76j95o22N11j08Q5j77J12
3808A71o21O72p5Q4j44p13J002M22j547K06P18J52l43l36R63n44K71k35M60m21
3828A42N7M96r86J015o74k18M39j70L57j090J578j024k49K12n68j47M62J95m18
$$ plain form
3847 -591 258 -604 456 -157 -355 306 -386 481 120 410 -289 18 292 -404 319 345 238 -226 296 -63
3867 -63 -280 90 -131 240 14 -827 -66 -230 265 -302 19 -228 444 -423 68 -101 -239 367 819 964
3887 964 -377 361 -386 655 470 196 255 862 562 17 199 -406 174 55 -460 -676 28 -80 457 -93
3907 -93 -572 -516 -486 140 -671 225 -572 -876 -427 -378 -505 -152 -217 101 311 439 636 -26 349 67 333 270
3929 270 63 81 -466 32 506 -65 34 -126 352 545 -258 -254 -225 -143 -16 -422 94 -218 -168 -302 -537 392
3951 392 -26 369 -284 -297 519 -107 572 198 -6 -217 -393 464 59 -281 31 -118 266 342 75 -633 -151
3972 -151 -99 -594 2 -602 38 181 28 238 57 -462 -239 820 357 197 39 395 268 205 67 201
3992 201 51 -73 -456 -545 731 -405 469 -360 416 -290 74 170 -430 -228 497 -664 -161 -393 -717 450
$$ packed form
3847e91Q49q62J060o13j98O61o92Q67l61K90o99L07K74o96P23K6j07m64N22l59
3867f3k17L70k21L71k26q41P61j64M95n67L21k47O72q67M91j69j38O06M52J45
3887I64j341P38p47J041j85k74N9O07l00n45J82o05N80j19n15k16P04j08N37n50
3907i3m79N6L0O26q11Q96p97l04M49M9j27L53o5L18K10J28J97o62L75k82K66o3
3929B70k07J8n47M98M74n71R9j60M78J93q03MK9Q2J27m06N16l12N0j34k35R29
3951C92m18L95o53j3Q16o26O79l74k04k11j76Q57m05l40L12j49L84P6k67p08M82
3972a51N2m95N96o04O40J43j53K10j81n19K23J059m63j60j58L56j27o3j38J34
3992B01j50j24l83q9J276j136Q74q29P76p06L64R6o00K02P25j161N03k32l24J167
$$ plain form
4012 450 -330 -437 -740 751 -103 261 55 -108 396 -179 -86 21 478 -35 -91 10 -377 379 -50 152
4032 152 -602 -334 -40 -79 -296 -514 -232 -1206 -590 -323 -101 -298 460 640 -914 -332 299 166 -899 305
4052 305 184 -336 141 361 69 -255 598 215 115 -171 -553 333 113 -662 -173 -267 351 -142 -573 143
4072 143 118 23 -129 372 -390 336 -117 -354 -95 -219 -70 121 672 95 363 -247 -132 18 -335 571 -457
4093 -457 161 160 -42 -35 -421 354 189 -274 -174 -377 -329 -23 -285 -345 -40 413 -172 -43 -832 -237 662 152
4115 152 750 215 1084 679 327 -86 -97 464 32 222 -111 205 -14 -95 -557 -146 -409 -59 -109 160 -561
4136 -561 295 -470 -470 422 372 232 -301 -148 -3 -522 -371 144 79 -161 150 142 -51 -330 -317 -167 -457 195
4158 195 -283 -232 -470 250 72 -456 347 -831 -827 -544 148 -15 -313 -475 -626 130 294 276 -188 281 516
$$ packed form
4012D50p80j07l03J491q54L64k06j63N04n75R3J07M57n13n6J01l87P56m29K02
4032A52p54K68K94l9k17k18K82r74O16K67K22j97P58J80j554N82O31j33j065J204
4052C05j21n20M77K20k92l24Q53l83j00k86l82Q86k20p75M89r4O18m93m31P16
4072A43k5r5j52N01p62P26m53k37K59j24J49J91N51n77K68o10J15J50l53R06j028
4093d57O18jk02Pl86P75j65m63J00k03M8L06k62o0L05M53n85J29p89N95Q99n10
4115A52N98n35Q69m05l52m13j1N61m32J90l33L16k19q1m62M11k63L50n0K69p21
4136e61Q56p65%Q92n0j40n33J53J45n19J51N15o5k40L11qj93k79J3J50k90O52
4158A95m78N1k38P20j78n28Q03j178MK83O92j63k98j62j51P56J64j8m64M69K35
$$ plain form
4179 516 -23 -308 143 212 535 3 119 -177 483 284 243 367 -377 258 801 284 -81 86 -396 163 -369
4200 -369 -661 -45 186 292 -28 931 171 351 -174 -347 26 -155 182 -239 -510 -248 154 -738 -300 736
4220 736 -329 116 -40 32 -219 -269 -206 301 121 -845 -277 -617 -812 -2 -81 -568 -491 -570 8 28 440 337
4242 337 15 72 -680 818 157 157 328 280 58 36 408 321 76 -657 -162 -208 -635 80 147 -365 -151 -296
4264 -296 -249 141 -64 -689 208 -65 37 870 -293 758 -103 -285 541 95 213 581 820 186 -110 162
4284 162 123 248 -316 653 412 -460 -161 434 129 17 -313 -294 -98 -36 -56 46 765 476 -602 732 179
4305 179 130 31 229 -118 -45 700 56 -67 1041 -568 -461 354 -314 350 578 344 37 -266 578 -776
4325 -776 -3 69 -380 -352 -203 -197 -625 -466 88 -259 -291 59 -37 -38 587 -360 118 91 -175 8 424 -647 776
$$ packed form
4179E16n39k85M51O9L23n32J16k96O60j99m1J24p44O35N43n17l65J67m82N59n32
4200c69k92O16K31J06l20R59p60J80n25j73L73j81L37m21k71K62M02q92M38J036
4220G36j065M45j56P2k51n0O3N07j80r66N68l40j95Q10p9m87P7p9N78K0M12j03
4242C37l22N7p52J498o61%J71m8k22k2L72q7k45p33M95m6m27P15O7n12K14j45
4264b96M7L90k05o25Q97k73J02Q33j163J051q61j82Q26m46J18L68K39o34k96K72
4284A62l9J25n64R69k41q72K99N95l05j12l30J9J96O2k0J02P19k89j078J334n53
4305A79m9r9J98l47P3P45o44j23J108j609J07Q15o68O64K28k34l07l03Q44j354
4325g76P73P2m49K8J49Om28J59N54l47l2L50r6jO25r47M78k7k66J83M16j071J423
$$ plain form
4348 776 -772 -12 421 273 -222 -322 -87 -267 -204 289 162 -41 -51 -452 260 86 -165 102 -214 213
4368 213 -184 153 561 155 343 298 9 520 76 -95 30 230 -164 -157 121 259 198 -322 -39 -1145 -24
4389 -24 -239 -421 -272 75 -584 50 98 71 465 144 564 630 -99 6 558 726 -517 -283 -326 -152 -44
4410 -44 30 -227 -103 -71 -335 224 101 121 -435 -453 22 402 480 -377 -122 -400 122 -79 -651 -600 -452 -90
4432 -90 399 -118 -134 -9 -390 363 -336 -373 340 -56 322 340 787 -214 -41 -576 -129 -13 -904 -811 -485
4453 -485 -101 -80 72 -612 16 -319 -786 -136 -74 820 -164 -81 368 253 -26 1195 -352 -219 135 -307
4473 -307 194 -546 -211 331 95 67 -61 -356 354 291 -16 -99 -49 -1028 61 -767 -60 -185 -99 117 104 -513
4495 -513 35 234 30 65 -482 568 223 -113 336 -123 -430 -163 518 107 992 138 457 41 -666 -866
$$ packed form
4348G76j548P60M33j48m95j00K35j80O3M93j27k03j0m01P12j74k51K67l16M27
4368B13l97L37M08m06J88m5k89N11m44j71J25K00l94PK78J38o1n20K83j106J121
4389b4k15j82J49L47o59O34M8k7L94l21M20O6p29J05N52J68j243K34m3J74J08
4410d4P4k57J24L2k64N59j23K0n56j8M75L80P8q57K55k78N22k01n72N1J48L62
4432i0M89n17j6J25l81P53o99l7P13l96L78J8M47j001J73n35M47J16q91R3L26
4453d85L84K1J52o84O28l35m67O50O2Q94r84Q3M49j15k79J221j547J33L54m42
4473c07N01p40L35N42k36k8j28k95P10o3l07q3N0r79J089q28P07j25Q6K16j3o17
4495e13N48J99k04L5n47J050l45l36M49m59l07K67O81m11Q85q54L19m16p07k00
$$ plain form
4515 -866 -587 91 -83 -183 39 155 -325 -217 -190 -122 18 -52 -295 -566 -100 136 -275 385 200 507 97
4536 97 570 -13 -403 102 -589 1160 707 162 -310 -750 -549 65 851 -99 -234 614 -441 -339 -113 -143
4556 -143 -220 -279 -270 -100 -171 -73 139 493 -46 -399 -312 258 874 373 -221 536 30 -106 182 -325 -259 202 151
4579 151 -186 -58 158 -233 -119 -113 -413 -475 -108 392 -96 501 360 -437 359 652 179 -436 -456 216 23
4600 23 383 630 54 -159 417 140 212 -308 -63 -368 7 455 -609 -755 -297 -266 26 79 289 260 277 413
4622 413 -237 114 -198 -214 -249 87 -281 537 -158 -2 504 -522 28 290 -278 -288 375 -441 507 -513
4642 -513 505 -332 44 -104 -91 -25 -430 280 168 135 -210 97 391 -33 63 24 278 208 322 29 -198 -41
4664 -41 -231 99 409 235 741 -845 669 -53 -561 151 171 -435 -561 -291 326 -396 -982 -366 -509 173
$$ packed form
4515h66K79O78j74j00K22J16m80J08K7O8J40p0k43k71M66K36m11O60j85L07m10
4536I7M73n83l90N05o91J749m53n45m72m40K01O14P86r50j35Q48j055J02K26l0
4556a43p7n9RJ70p1R8K12L54n39l53Q7N70O16n01n94P57n06j36K88n07O6M61n1
4579A51l37J28K16l91J14Ol00o2L67N00m88N97j41p97P96K93m73o15k0O72j93
4600B3L60K47n76k13N76k77P2n20K45l05L75M48j064j46M58L1K92N3K10k9J7J36
4622D13o50L51l12j6l5L36l68Q18o95J56N06j026N50K62n68j0O63q16R48j020
4642e13J018q37L76j48J3O6m05P10j12l3l45L07K94m24R6l9K54p0J14k93k27J57
4664d1j90L30L10j74N06j586J514p22n08P12K0o06j26K70O17p22n86O16j43O82
$$ plain form
4684 173 -103 37 55 109 -496 142 -472 -272 201 64 -213 75 392 -13 -287 327 203 518 -258 412 -108
4705 -108 294 -425 1 -48 274 -167 -3 135 -144 -619 -238 -228 219 -287 219 501 59 195 -161 -7 339
4726 339 150 -64 319 314 241 531 -126 485 232 -33 127 -331 534 -3 -161 201 -167 249 -276 -35 43
4747 43 -297 70 -635 387 33 299 372 -537 -468 58 -739 -117 -216 161 -234 -391 805 468 430 342 -28
4768 -28 187 191 129 470 40 -223 68 57 675 369 -119 -502 706 -173 -858 -30 877 -889 -660 312 -196
4789 -196 274 1637 229 140 -336 -250 144 -193 223 -660 582 383 488 -39 476 56 160 401 19 -294
4809 -294 361 200 61 -385 294 -474 -482 341 -200 105 253 -354 412 6 -418 129 470 379 117 -101 -229
4830 -229 624 -253 376 148 351 467 141 -297 48 109 -80 -45 1147 -55 842 -121 197 -368 85 426
$$ packed form
4684A73k76J40J8N4o05O38o14K00M73j37k77K88L17m05k74O14j24L15p76O70n20
4705a08M02p19M26m9L22m41J64J38k79m75L81J0M47n06N06K82m42J36l56J54L46
4726C39j89k14L83np3K90o57O11k53k65J60m58Q65n37j58L62l68M16n25K41P8
4747D3l40L67p05J022l54K66P3r09O9N26p97O22r9L77l95j57J196l37l8q8l70
4768b8K15Mo2L41m30k63K91j1O18l06m88l83J208q79o85Q28R07j766K29R72n08
4789a96M70J363j408q9m76Q6L94l37M16q83J242j99J05n27N15m20J04K41l82l13
4809b94O55j61j39m46O79p68qQ23n41L05J48o07P66m06m24N47L41r1k62k18j28
4830b29Q53q77O29k28K03J16l26m38L45O1j89L5J192j202Q97r63L18n65M53L41
$$ plain form
4850 426 -530 53 17 400 780 408 187 101 254 697 308 -436 137 -55 68 888 -64 670 -29 272 14
4871 14 -50 -522 -532 12 97 97 268 -462 -1105 325 -354 -342 616 77 262 178 -118 426 491 -11 -191 54 672
4894 672 -395 202 -68 481 -67 -265 -478 -603 296 -652 -51 -467 -368 -507 -97 -562 28 -745 -258 -913
4914 -913 352 339 -251 230 56 11 713 -384 -26 154 -646 553 -59 -176 -376 484 200 -194 -462 -124
4934 -124 472 494 -446 134 -312 618 -152 -239 -218 113 -160 -364 426 -204 402 101 167 -394 38 -240 -81
4955 -81 -151 707 628 -458 157 497 29 -766 -1167 -415 -905 79 -523 -185 121 -5 436 -401 670 -198
4975 -198 -109 -442 -91 -387 -172 356 447 -84 49 28 -132 -17 258 192 204 -749 858 -751 408 -192 496
4996 496 206 -377 -384 63 539 -182 -125 -427 -1024 -576 646 360 -269 -444 -982 492 111 140 358 357 26
$$ packed form
4850D26r56N83l6L83L80l72k21q6J53M43l89p44N73j92J23Q20r52P34o99L01k58
4871A4o4m72j0N44Q5%J71p30o43J430o79J2R58n39J85q4k96N44O5n02j80K45O18
4894F72j067N97k70N49n48j98k13j25Q99r48O01m16R9j39M10m65N90p73M87o55
4914i13J265j3n90M81j74m5P02j097L58J80q00J199o12j17k00Q60k84l94k68L38
4934a24N96K2r40N80m46R30p70q7K1L31k73k04P90o30O06l01O6n61M32k78J59
4955h1p0Q58p9j086O15L40m68p95m01P52m90R84o02L38L06j26M41q37J071q68
4975a98Q9l33L51k96K15N28R1n31J33k1j60J15K75o6J2r53J607j609J159o00O88
4996D96k90n83pM47M76p21N7l02n97M48J222k86o29j75n38J474l81K9K18jl31
$$ plain form
5017 26 475 810 96 -537 343 434 658 -679 -438 482 339 -180 -554 19 -275 114 -311 351 -72 -66 -891
5038 -891 25 103 -103 -95 -87 85 322 361 -458 -135 380 2 715 92 249 -692 30 325 -267 225 138 417
5060 417 593 35 -138 -156 -766 -289 -254 -548 93 71 -48 -943 -356 -237 -154 -167 80 -35 -23 -151 467 867
5082 867 1046 403 559 -523 -185 391 -8 -107 858 -127 -648 -448 -141 81 -374 19 -180 -29 737 548
5102 548 -103 -336 -8 -504 -265 -743 461 314 -18 -137 50 -93 426 946 -258 1169 229 368 768
5121 768 224 10 405 -356 -590 297 75 -240 556 785 -483 -183 572 279 322 -7 101 20 -151 44
5141 44 429 341 238 220 252 267 -215 510 -141 273 140 187 91 108 -102 -340 -371 140 393 -829 8 -300 58
5164 58 28 -437 -881 454 -115 -561 136 301 217 347 438 -167 153 -35 120 194 -222 25 -72 52 78 -556
$$ packed form
5017B6M49L35p14o33Q80R1K24j337K41R20j43n19l74N73k94L89m25O62m23Oq25
5038h91R16P8k06QQJ72K37L9q19L23N15l78P13o23J57r41P22K95n92M92q7K79
5060D17J76n58j73j8o10M77L5k94O41k2j19q95N87J19Q3j3K47j15J2j28O18M00
5082H67J79o43J56j082L38N76l99r9R65r85n21K00L07K22m55L93j99J51P66j89
5102E48o51k33L28m96K39m78J204j47l32j19J87j43N19N20j204J427r40J39M00
5121G68n44k14L95p61k34Q87k22l15P96K29j268L00P55k93M3l29J08q1j71J95
5141D4L85q8j03j8L2J5m82P25o51M14j33M7r6J7k10k38l1N11K53j222Q37l08L58
5164E8l0m65m44J335n69m46O97J65q4J30R1o05L20j88J55P4m16K47r7J24K6o34
$$ plain form
5186 -556 132 50 27 482 -394 167 -584 423 -607 -4 -74 -464 98 -506 -50 -34 -94 89 -94 -130 -412
5207 -412 -140 345 241 482 380 -140 169 478 448 -163 -24 88 -84 122 360 359 186 38 -480 371 -273
5228 -273 -230 -139 -281 395 120 48 42 174 96 427 189 556 471 -373 970 -281 880 -326 425 2 399
5249 399 583 -380 331 -316 -384 -656 -600 -238 -488 -64 106 -628 -129 -49 -86 -841 -205 -3 63 -212 258 712
5271 712 44 481 430 363 345 -198 -418 -434 145 676 491 -369 -251 -165 -94 -717 -210 9 -167 -167 -343 -832 -405
5294 -405 134 -690 403 -10 -287 743 185 -129 641 154 494 622 -101 1188 44 215 606 430 -346
5313 -346 131 -650 282 114 185 174 -238 -314 -243 291 95 -241 -233 -287 140 -231 128 -296 -174 268 6 573
5335 573 -102 312 491 -151 536 226 356 81 -256 -266 -267 694 156 -282 -626 340 345 455 81 69 -274 287
$$ packed form
5186e56O88q2k3M55q76N61p51J007j030O03p0l90N62o04M56J6o0J83j83l6k82
5207d12K72M85j04K41j02n20L09L09l0o11J39J12j72K06K38jj73j48n18Q51o44
5228b73M3R1j42O76k75p2oJ32p8L31k38L67q5q44J343j251J161j206P51m23L97
5249C99J84r63P11o47o8k72N6L62k50M24J70p34M99Q0l7p55O36K02O6k75M70M54
5271G12o68M37n1o7j8n43k20j6N79N31j85q60J18Q6P1o23N07K19j76%j76m89M27
5294d05N39q24J093m13k77J030n58l14P70m87L40J28p23J289j144J71L91j76p76
5313c46M77p81R32j68P1j1m12p6P1N34j96l36Qn4M27l71L59m24J22M42k62N67
5335E73o75M14J79o42O87l10J30k75l37j0jR61n38m38l44R66NJ10l74j2l43N61
$$ plain form
5357 287 -525 -195 361 -369 11 -502 -896 333 -309 237 -10 -231 598 -718 467 616 -205 146 613
5376 613 -29 -162 252 372 -567 193 -221 -288 -460 155 349 -355 -517 -722 -410 448 339 -816 -115 94
5396 94 232 -644 426 -223 323 391 295 945 -32 823 -203 264 279 196 470 358 -360 -184 -704 68 -717
5417 -717 -311 -181 -79 -1287 379 -349 544 -32 -238 -475 -48 -818 118 191 655 44 -436 125 -950
5436 -950 -354 171 570 131 -357 -713 -232 159 112 -466 -121 693 -310 365 121 -111 -397 113 -113 -556
5456 -556 -116 -388 -529 270 576 -113 -194 633 -391 -254 24 109 484 538 222 -582 54 -115 330 168 490
5477 490 -398 -846 45 -395 -171 -252 -323 -189 811 -174 165 896 -5 198 -355 326 -306 516 531 622 -115
$$ packed form
5357B87q12L30N56p30L80n13l94J229o42N46k47k21Q29j316J185J49q21L51M67
5376F13o42j33M14J20r39P60m14o7j72O15J94p04j62k05L12Q58j09j155P01K09
5396I4J38q76J070o49N46O8r6O50r77Q55j026M67J5q3K74j12p18J76n20P72p85
5417g17M06J30J02j208J666p28Q93n76k06k37M27p70R36P3M64o11m80N61j075
5436i50N96N25L99m39m88l56M81L91m7n78L45Q14j003O75k44k32k86N10k26m43
5456e56M40k72j41P99L06o89q1Q27j024J37K78Q5L75N4l16q04O36j69M45j62L22
5477D90q88m48Q91m40K24q1p1J34J000r85L39P31r01K03n53O81o32Q22J5R1p37
$$ [...]
8191C91
##END NTUPLES=NMR FID
##END=
