##TITLE=1H_IPACAT-34-5
 CDCl3
 64 sc, 
 23.11.2023
##JCAMPDX= 6.0         $$ Bruker NMR JCAMP-DX V2.0
##DATA TYPE= NMR FID
##DATA CLASS= NTUPLES
##ORIGIN= UXNMR, Bruker Analytische Messtechnik GmbH
##OWNER= root
$$ XWIN-NMR		Version 3.5
$$ Thu Nov 23 15:57:17 2023 Russian Standard Time (UT+4h)  she@DPX200
##.OBSERVE FREQUENCY= 200.1313
##.OBSERVE NUCLEUS= ^1H
##.DELAY= (6, 6)
##.ACQUISITION MODE= SIMULTANEOUS
##.ACQUISITION SCHEME= undefined
##.AVERAGES= 64
##.DIGITISER RES= 18
##SPECTROMETER/DATA SYSTEM= spect
##.PULSE SEQUENCE= zg30
##.SOLVENT NAME= CDCl3
##.SHIFT REFERENCE= (INTERNAL, CDCl3, 0, 15.7039)
##AUDIT TRAIL= $$ (NUMBER, WHEN, WHO, WHERE, WHAT)
$$ ##TITLE= Audit trail, XWIN-NMR		Version 3.5
$$ ##JCAMPDX= 5.01
$$ ##ORIGIN= Bruker BioSpin GmbH
$$ ##OWNER= she
$$ F:/spectra/data/she/nmr/H-F/1/audita.txt
$$ ##AUDIT TRAIL=  $$ (NUMBER, WHEN, WHO, WHERE, WHAT)
(   1,<2023-11-23 15:54:37.81 +0400>,<she>,<DPX200>,
      <continue with go, POWCHK disabled, PULCHK disabled
       configuration hash MD5:
       00 E9 B6 7A A2 85 ED C7 34 08 36 98 17 FE 4E 26
       data hash MD5: 16K
       C8 58 E3 91 61 E4 FA 18 5D 10 AB 24 B9 32 A0 96>)
$$ ##END=
$$ 
$$ hash MD5
$$ 39 12 7D 3D F0 4E 39 51 3C EC 0C 63 76 EF A4 7C
##$RELAX= 
##$RELAX= 
##$RELAX= 
##$RELAX= 
##$RELAX= 
##$RELAX= 
$$ Bruker specific parameters
$$ --------------------------
##$DU= <F:/spectra>
##$EXPNO= 1
##$NAME= <H-F>
##$PROCNO= 1
##$TYPE= <nmr>
##$USER= <she>
##$AMP= (0..31)
100 100 100 100 100 100 100 100 100 100 100 100 100 100 100 100 100 100 
100 100 100 100 100 100 100 100 100 100 100 100 100 100 
##$AQSEQ= 0
##$AQ_mod= 1
##$AUNM= <au_zg>
##$AUTOPOS= <>
##$BF1= 200.13
##$BF2= 200.13
##$BF3= 200.13
##$BF4= 200.13
##$BF5= 200.13
##$BF6= 200.13
##$BF7= 200.13
##$BF8= 200.13
##$BYTORDA= 1
##$CFDGTYP= 0
##$CFRGTYP= 5
##$CHEMSTR= <none>
##$CNST= (0..31)
1 1 145 1 1 1 1 1 1 1 1 1 1 1 1 1 1 1 1 1 1 1 1 1 1 1 1 1 1 1 1 1 
##$CPDPRG= <>
##$CPDPRG1= <>
##$CPDPRG2= <>
##$CPDPRG3= <>
##$CPDPRG4= <mlev>
##$CPDPRG5= <mlev>
##$CPDPRG6= <mlev>
##$CPDPRG7= <mlev>
##$CPDPRG8= <mlev>
##$CPDPRGB= <>
##$CPDPRGT= <>
##$D= (0..31)
0 1.2 0 0 0 0 0 0 0 0.06 0 0.03 0 0 0 0 0.0002 0 0 0 0 0 0 0 0 0 0 0 0 
0 0 0 
##$DATE= 1700740154
##$DBL= (0..7)
120 120 120 120 120 120 120 120 
##$DBP= (0..7)
150 150 150 150 150 150 150 150 
##$DBP07= 0
##$DBPNAM0= <>
##$DBPNAM1= <>
##$DBPNAM2= <>
##$DBPNAM3= <>
##$DBPNAM4= <>
##$DBPNAM5= <>
##$DBPNAM6= <>
##$DBPNAM7= <>
##$DBPOAL= (0..7)
0.5 0.5 0.5 0.5 0.5 0.5 0.5 0.5 
##$DBPOFFS= (0..7)
0 0 0 0 0 0 0 0 
##$DE= 6
##$DECBNUC= <off>
##$DECIM= 32
##$DECNUC= <off>
##$DECSTAT= 4
##$DIGMOD= 1
##$DIGTYP= 9
##$DL= (0..7)
0 120 120 120 120 120 120 120 
##$DP= (0..7)
150 150 150 150 150 150 150 150 
##$DP07= 0
##$DPNAME0= <>
##$DPNAME1= <>
##$DPNAME2= <>
##$DPNAME3= <>
##$DPNAME4= <>
##$DPNAME5= <>
##$DPNAME6= <>
##$DPNAME7= <>
##$DPOAL= (0..7)
0.5 0.5 0.5 0.5 0.5 0.5 0.5 0.5 
##$DPOFFS= (0..7)
0 0 0 0 0 0 0 0 
##$DQDMODE= 0
##$DR= 18
##$DS= 0
##$DSLIST= <SSSSSSSSSSSSSSS>
$$ [...]
##$SUBNAM2= <"">
##$SUBNAM3= <"">
##$SUBNAM4= <"">
##$SUBNAM5= <"">
##$SUBNAM6= <"">
##$SUBNAM7= <"">
##$SUBNAM8= <"">
##$SUBNAM9= <"">
##$SW= 18.0517328524113
##$SWIBOX= (0..15)
0 0 2 0 0 0 0 0 0 0 0 0 0 0 0 0 
##$SW_h= 3612.71676300578
##$TD= 16384
##$TD0= 1
##$TE= 0
##$TE2= 300
##$TE3= 300
##$TEG= 300
##$TL= (0..7)
0 120 120 120 120 120 120 120 
##$TP= (0..7)
150 150 150 150 150 150 150 150 
##$TP07= 0
##$TPNAME0= <>
##$TPNAME1= <>
##$TPNAME2= <>
##$TPNAME3= <>
##$TPNAME4= <>
##$TPNAME5= <>
##$TPNAME6= <>
##$TPNAME7= <>
##$TPOAL= (0..7)
0.5 0.5 0.5 0.5 0.5 0.5 0.5 0.5 
##$TPOFFS= (0..7)
0 0 0 0 0 0 0 0 
##$TUNHIN= 0
##$TUNHOUT= 0
##$TUNXOUT= 0
##$USERA1= <user>
##$USERA2= <user>
##$USERA3= <user>
##$USERA4= <user>
##$USERA5= <user>
##$V9= 5
##$VALIST= <valist>
##$VCLIST= <CCCCCCCCCCCCCCC>
##$VD= 0
##$VDLIST= <DDDDDDDDDDDDDDD>
##$VPLIST= <PPPPPPPPPPPPPPP>
##$VTLIST= <TTTTTTTTTTTTTTT>
##$WBST= 1024
##$WBSW= 4
##$XGAIN= (0..3)
0 0 0 0 
##$XL= 0
##$YL= 0
##$YMAX_a= 643017
##$YMIN_a= -643321
##$ZGOPTNS= <>
##$ZL1= 120
##$ZL2= 120
##$ZL3= 120
##$ZL4= 120
##$ABSF1= 10
##$ABSF2= 0
##$ABSG= 5
##$ABSL= 3
##$ALPHA= 0
##$AQORDER= 0
##$ASSFAC= 0
##$ASSFACI= 0
##$ASSFACX= 0
##$ASSWID= 0
##$AUNMP= <proc_1d>
##$AZFE= 0.1
##$AZFW= 0.1
##$BCFW= 1
##$BC_mod= 2
##$BYTORDP= 1
##$COROFFS= 0
##$CY= 11.3945322036743
##$DATMOD= 1
##$DC= 2
##$DFILT= <>
##$DTYPP= 0
##$F1P= 15.7292609196834
##$F2P= 12.9074282941183
##$FCOR= 0.5
##$FTSIZE= 0
##$FT_mod= 4
##$GAMMA= 1
##$GB= 0.15
##$INTBC= 1
##$INTSCL= 1
##$ISEN= 128
##$LB= 0.24
##$LEV0= 0
##$LPBIN= 0
##$MAXI= 10000
##$MC2= 0
##$MEAN= 0
##$ME_mod= 0
##$MI= 1.114404
##$NCOEF= 0
##$NC_proc= 0
##$NLEV= 6
##$NOISF1= 3.799351
##$NOISF2= 2.8
##$NSP= 1
##$NTH_PI= 0
##$NZP= 0
##$OFFSET= 15.70392
##$PC= 1
##$PHC0= -24231.49
##$PHC1= 7.052685
##$PH_mod= 1
##$PKNL= yes
##$PPARMOD= 0
##$PSCAL= 0
##$PSIGN= 0
##$REVERSE= no
##$SF= 200.130013532006
##$SI= 16384
##$SIGF1= 3
##$SIGF2= 2
##$SINO= 400
##$SIOLD= 16384
##$SREGLST= <1H.CDCl3>
##$SSB= 0
##$STSI= 0
##$STSR= 0
##$SW_p= 3612.71676300578
##$SYMM= 0
##$S_DEV= 0
##$TDeff= 0
##$TDoff= 0
##$TI= <>
##$TILT= no
##$TM1= 0
##$TM2= 0
##$TOPLEV= 0
##$USERP1= <user>
##$USERP2= <user>
##$USERP3= <user>
##$USERP4= <user>
##$USERP5= <user>
##$WDW= 1
##$XDIM= 8192
##$YMAX_p= 0
##$YMIN_p= 0
$$ End of Bruker specific parameters
$$ ---------------------------------
##NTUPLES= NMR FID
##VAR_NAME=  TIME,          FID/REAL,        FID/IMAG
##SYMBOL=    X,             R,               I
##VAR_TYPE=  INDEPENDENT,   DEPENDENT,       DEPENDENT
##VAR_FORM=  AFFN,          ASDF,            ASDF
##VAR_DIM=   8192,          8192,            8192
##UNITS=     SECONDS,       ARBITRARY UNITS, ARBITRARY UNITS
##FACTOR=    0.0002768,     1,               1
##FIRST=     0,             0,               0
##LAST=      2.2672688,     0,               0
##MIN=       0,             -643321,         0
##MAX=       2.2672688,     643017,          0
$$ Real data points
##PAGE= N=1
##DATA TABLE= (X++(R..R)), XYDATA
$$ [...]
$$ plain form
2505 -578 -462 185 247 714 280 -412 -747 -242 -33 -295 -416 -32 519 -448 616 -941 174 -148 255
2524 255 -38 612 -466 -225 -123 460 -186 -409 -344 -496 304 597 52 14 29 579 -361 135 -437 -954 -88
2545 -88 9 -191 246 16 -505 -214 -42 -303 -722 -202 -156 198 -583 468 10 -673 -462 -907 -259 -511 32
2566 32 221 -242 -357 -441 -96 -69 277 536 -396 128 60 238 -708 -172 -517 -830 153 -94 -72 -169 380 -5
2588 -5 506 51 18 -262 -743 816 467 715 358 860 -185 205 -513 335 422 -187 16 46 -71 -341 -180
2609 -180 329 319 162 216 51 -46 358 177 1267 250 622 -224 -441 322 322 23 606 -81 -237 -194 -215 -566
2631 -566 -614 -392 368 -523 -279 -528 -16 504 -338 -266 -249 1137 -112 206 -346 414 121 -431 297 104
2651 104 508 -206 -30 429 -152 553 237 -367 -323 563 15 205 522 -375 -381 328 170 -254 -314 304 -312
$$ packed form
2505e78J16O47O2M67m34o92l35N05K09k62j21L84N51r67J064j557J115l22M03
2524B55k93O50j078K41J02N83o46k23O5j52Q00K93n45l8J5N50r40M96n72n17Q66
2545h8R7k00M37k30n21K91J72k61m19N20M6L54p81J051m58o83K11m45O48k52N43
2566C2J89m63j15q4L45K7L46K59r32N24o8J78r46N36l45l13R83k47K2r7N49l85
2588eN11m55l3k80m81J559l49K48l57N02j045L90p18Q48Q7o09K03L0j17k70J61
2609a80N09j0j57N4j65r7M04j81J090j017L72q46k17P63%k99N83o87j56M3k1l51
2631e66m8K22P60q91K44k49N12N20q42P2J7J386j249L18n52P60k93n52P28j93
2651A04M04p14J76M59n81P05l16o04M4Q86n48J90L17q97oP09j58m24o0O18o16
$$ plain form
2672 -312 -624 -517 -397 -932 -321 -95 355 215 154 330 -29 234 -239 -47 364 25 335 -379 440 280
2692 280 261 101 376 727 -47 -127 36 39 -146 -412 -262 -270 281 28 -217 351 -363 -373 361 653 149 885
2714 885 145 -492 -471 -243 24 179 109 226 -312 -315 -490 -199 -221 -121 -192 -382 490 393 -614 312 208 660
2736 660 245 -159 148 102 318 266 320 558 -467 -1095 89 990 -50 -3 129 45 561 -313 9 -384 -379
2757 -379 75 346 -201 180 1052 190 -301 179 -18 -192 -256 52 623 -128 134 34 -407 -150 -378 377
2777 377 -22 486 755 -564 -104 76 -122 -508 321 -12 227 -125 121 476 275 -269 507 -127 -149 -78
2797 -78 -456 -32 257 367 60 318 -533 250 -198 213 50 239 499 -574 96 -354 556 186 -274 -234
2817 -234 -326 -124 249 -43 178 -408 127 -805 345 -137 527 124 523 885 48 801 93 -96 -13 -248
$$ packed form
2672c12l12J07J20n35O11K26M50j40o1J76l59K63m73J92M11l39L10p14Q19j60
2692B80j9j60K75L51p74q0J63Lj85k66J50qN51k53k45N68p14j0P34K92n04P36
2714H85p40o37K1K28K67J55p0J17n38lj75K91k2J00p1j90Q72r7j007R26j04M52
2736F60m15m04L07m6K16n2N4K38j025o28J184R01j040M7J32q4N16q74L22l93N
2757c79M54K71n47L81Q72q62m91M80j97j74o4L08N71p51K62j00m41K57k28P55
2777C77l99N08K69j319M60J80j98l86Q29l33K39l52K46L55k01n44P76o34k2P1
2797g8l78M24K89J10l07K58q51P83m48M11j63J89K60j073O70m50R10l70m60M0
2817b34r2K02L73k92K21n86N35r32J150m82O64m03L99L62q37P53p08j89Q3k35
$$ plain form
2837 -248 -279 85 -654 152 185 -45 356 -647 -51 -61 -220 -338 3 386 -270 -379 593 -142 313 391 -15
2858 -15 185 21 309 -1075 -109 -68 -662 -183 840 -194 149 806 71 578 142 26 54 228 -201 -129
2878 -129 -452 235 366 -167 19 -335 375 221 951 331 108 -610 -371 282 -841 -486 235 371 216 -564
2898 -564 -1 -447 210 311 163 57 483 180 -178 -342 -225 375 -133 364 -724 -58 -432 -703 -264 -316
2918 -316 413 382 430 -492 258 121 109 -499 949 514 193 421 -223 -719 471 262 -33 -215 303 475
2938 475 324 -332 150 -229 855 -2 620 146 -481 -624 -48 -412 -343 -359 -287 -395 -671 175 312 188 24
2959 24 -429 337 -221 -261 -554 154 16 423 460 318 -32 -52 355 -324 -286 372 93 -195 297 215 -333 -201
2981 -201 -22 780 164 -33 282 160 -64 -61 149 629 199 254 259 285 -738 420 157 -14 308 267 217 -1041
$$ packed form
2837b48l1L64p39Q06L3k30M01j003N96j0j59j18L41L83o56j09R72p35M55P8m06
2858a5K00j64K88j384R66M1n94M79J023j034L43O57p35N07m36j16K8J74m29P2
2878a29l23O87J31n33J86l54P10j54P30o20k23p18K39O53j123L55P21J36j55p80
2898e64N63m46O57J01j48j06M26l03l58j64J17O00n08M97j088O66l74k71M39n2
2918c16P29l1M8r22P50j37j2o08J448m35l21K28o44m96J190k09k95j82N18J72
2938D75j51o56M82l79J084q57O22m74o27j43N76l64O9j6P2j08k76Q46J37j24j64
2959B4m53P66n58m0k93P08j38M07L7j42l50k0M07o79L8O58k79k88M92q2n48J32
2981b01J79Q02o16j97L15j22k24LK10M80m30N5NK6j023J158k63j71L22m1n0j258
$$ plain form
3003 -1041 227 -488 633 419 75 764 424 32 64 -295 -533 -286 -486 37 685 -297 -33 241 -378
3022 -378 -154 436 -709 152 812 577 912 617 -238 29 -363 -727 -116 399 297 53 -341 -533 -741 354
3042 354 396 301 513 -369 -307 23 432 -438 47 -26 578 84 -149 -59 -140 149 -223 -995 500 -125 -189 90
3064 90 375 379 481 168 -37 1002 -16 -276 373 -73 -561 -654 -302 191 -64 5 -67 681 388 32 335
3085 335 98 -440 -8 25 -308 322 276 -101 118 -66 101 681 410 -113 -312 -210 875 120 -570 -49
3105 -49 -427 549 30 358 232 -406 -95 -168 237 40 351 -143 41 -91 405 59 93 586 156 621 202
3126 202 306 280 768 -115 37 88 -511 -241 45 61 -438 230 -340 23 -9 -209 72 -856 -33 -524 -225
3147 -225 5 -255 -680 -237 -853 716 91 170 467 -225 6 -400 435 -66 -592 23 149 122 501 412 10
$$ packed form
3003a041J268p15J121k14l44O89l40l92L2l59k38K47k00N23O48r82K64K74o19
3022c78K24N90j145Q61O60k35L35k95q55K67l92l64O11N15j02k44l94j92k08J095
3042C54M2r5K12q82O2L30M09q70M85p3O04m94k33R0q1K89l72p72J495o25o4K79
3064I0K85MJ02l13k05J039j018k60O49m46m88r3L52M93k55O9p2P48k93l56L03
3085C35k37n38M32L3l33O30m6l77K19j84J67N80k71n23j99J02J085p55o90N21
3105d9l78R76n19L28j26o38L11p3M05j97L11m94J84j32M96l46L4M93m30M65m19
3126B02J04k6M88q83J52N1n99K70K86J6m99O68n70L63l2k00K81r28Q23m91K99
3147b25K30k60m25M43o16J569o25P9K97o92K31m06Q35n01n26O15J26k7L79q9m02
$$ plain form
3168 10 219 515 -89 423 627 297 9 200 135 -290 -285 -4 200 186 -264 -12 -76 38 100 -75 360 822
3190 822 -332 -124 -754 -53 75 -454 46 -780 -189 -131 833 380 111 161 358 113 -551 -37 87 90 -214
3211 -214 606 -115 839 200 -350 101 -577 -216 -273 901 369 -422 385 185 53 31 -530 -73 20 -217 481
3232 481 415 -95 -105 -31 -146 211 -323 259 737 51 404 -160 -132 31 -88 -55 232 -574 -606 292 238 169 956
3255 956 288 436 855 -323 -373 612 -298 -470 553 -472 558 304 -10 -200 -226 238 442 113 231
3274 231 -688 -50 125 178 -112 336 167 -379 33 860 709 -210 -201 46 -327 -183 290 639 8 -259 447
3295 447 -44 126 655 -423 -246 38 -212 -361 -149 214 475 236 9 481 427 -441 876 -645 -23
3314 -23 199 -217 -542 108 789 -322 666 -14 2 200 -410 -465 -166 383 387 571 250 -467 496 -566 -232
$$ packed form
3168A0K09K96o04N12K04l30k88J91o5m25NK81K04j4m50K52o4J14O2j75M35M62
3190H22j154K08o30P01J28n29N00q26N91N8R64m53k69N0J97k45o64N14J24Ll04
3211b14Q20p21R54o39n50M51o78L61n7J174n32p91Q07k00j32k2n61M57R3k37O98
3232D81o6n10j0P4j15L57n34N82M78o86L53n64K8J63j19L3K87q06l2Q98n4o9P87
3255I56o68J48M19j178n0R85r10j72J023j025J030k54l14j90k6M64K04l29J18
3274B31r19O38J75N3k90M48j69n46M12Q27j51r19RK47l73J44M73L49o31k67P06
3295D47m91J70N29j078J77K84k50j49K12L63K61k39k27M72n4q68J317j521O22
3314b3K22m16l25O50O81j111R88o80J6J98o10n5K99N49MJ84l21p17R63j062L34
$$ plain form
3335 -232 633 797 -234 -46 -9 -587 -526 214 284 556 129 -182 -167 197 -484 -11 -3 -452 -501 24 65 -907
3357 -907 239 -110 -94 -182 116 -1016 -124 -856 -525 -236 397 -83 -202 -629 -283 -661 232 -184 63 -796
3377 -796 -90 -348 106 638 -639 44 -680 -711 -329 536 217 131 -227 -130 1 600 -722 448 308 -662
3397 -662 13 136 41 -329 89 414 -517 29 -544 -192 584 717 -286 293 -66 547 592 -759 73 -334
3417 -334 734 637 -265 218 87 505 -59 192 255 150 868 27 -240 191 430 -161 69 -442 -449 -139 -346
3438 -346 349 -513 105 405 510 -187 592 425 -802 600 570 342 -774 564 305 486 909 -99 -614
3457 -614 710 442 -629 320 -411 104 -238 20 137 -435 -438 -31 -431 699 96 122 529 -402 -537 224
3477 224 -29 592 -496 148 -51 177 44 364 192 255 -685 -97 937 -414 126 10 -248 237 128
$$ packed form
3335b32Q65J64j031J88L7n78O1P40P0K72m27l11J5L64o81M73Qm49m9N25M1r72
3357i07J146l49J6q8K98j132Q92p32L31K89O33m80j19m27L46l78Q93m16K47q59
3377g96P06k58M54N32j277O83p24l1L82Q65l19q6l58R7J31N99j322J170j40r70
3397f62O75J23r5l70M18L25r31N46n73L52P76J33j003N79l59O13M5j351Q32m07
3417c34J068r7r02M83j31M18n64K51O3j05P18q41k67M31K39n91K30n11pL10k07
3438c46O95q62O18L00J05o97P79j67j227J402l0k28j116J338k59J81M23j008n15
3457f14J324k68j071R49p31N15l42K58J17n72lM07m00J130o03K6M07r31j35P61
3477B24k53O21j088O44j99K28j33L20j72O3r40N88J034j351N40j16k58M85j09
$$ plain form
3496 128 -19 98 -632 -674 -58 600 420 305 338 -451 151 -317 -392 24 -220 475 1102 -96 -326 152 148
3517 148 -338 -657 0 170 284 -295 -780 418 -148 -649 -149 -477 140 334 -71 -99 583 -617 -506 -16
3537 -16 -510 -116 348 -85 194 263 171 -515 414 -165 -48 532 -257 45 324 -644 401 85 700 290 547
3558 547 -179 -167 -69 -166 -670 772 934 342 -710 58 234 -67 669 162 571 620 161 523 391 -538 6
3579 6 104 -794 188 329 -67 180 -234 196 -519 1036 -117 93 96 192 163 -382 -471 -239 238 61 -157 283
3601 283 46 9 -36 357 -326 -423 398 43 443 -273 -292 436 189 -19 -71 66 201 616 -163 -67 207 403
3623 403 -699 20 441 -266 261 351 -435 330 -602 231 -518 97 83 -210 -121 -77 625 69 223 -692 -121
3644 -121 178 202 -117 -743 -204 -338 927 270 31 0 275 35 -148 -18 -667 -494 82 178 553 53 654
$$ packed form
3496A28j47J17p30m2O16O58j80j15L3p89O02m68p5M16k44O95O27j198k30M78m
3517A48m86l19O57J70J14n79m85J198n66n01N00l28O17J94m05k8O82j200J11M90
3537a6m94L94M64m33K79O9r2o86R29n79J17N80p89L02K79r68J045l16O15m10K57
3558E47p26J2R8r7n04J442J62n92j052P68J76l01P36n07M09M9m59L62j32r29N44
3579FR8q98R82J41l96K47m14M30p15J555j153K10LR6k9n45q9K32M77j77k18M40
3601B83k37l7m5L93o83r7Q21l55M00p16j9P28k47k08n2J37J35M15p79R6K74J96
3623D03j102P19M21p07N27R0p86P65r32Q33p49O15j4k93Q9M4P02n56J54r15N71
3644a21K99K4l19o26N39j34J265o57k39l1K75k40j83J30o49J73N76R6L75n00O01
$$ plain form
3665 654 -441 266 -411 -221 273 -462 -357 -94 -865 133 257 143 86 407 53 541 125 -259 -131 30
3685 30 -184 252 -5 553 73 -202 -583 -176 767 568 -314 461 493 867 -6 299 243 -4 461 -293 1163
3706 1163 61 -20 72 -375 -472 433 512 407 -950 -67 16 110 30 681 22 -376 -211 -350 370 131 -178
3727 -178 94 330 -462 88 589 565 148 509 -201 -258 495 -770 -323 -356 267 142 6 22 -402 51 -183
3748 -183 163 167 -234 389 149 -169 -446 279 336 15 226 -71 685 -46 206 395 584 -134 663 472 407
3769 407 -1056 -725 -75 801 -545 356 -83 -73 160 -35 -200 60 -192 -365 -94 -241 -10 -521 780
3788 780 85 -1144 442 -53 -347 -55 -472 -175 377 962 -591 241 232 -82 163 -419 24 844 -131 324
3808 324 -621 144 -100 123 -278 -15 287 -140 -323 -388 160 310 163 143 436 282 -284 -341 431 -518 118
$$ packed form
3665F54j095P07o77J90M94p35J05K63p71R98J24j14n7L21l54M88m16l84J28J61
3685C0k14M36k57N58m80k75l81M07R43j99q82P75L2L74q73L05n6k47M65p54J456
3706A163j102q1R2m47r7R05P9j05j357Q83Q3R4q0O51o59l98J65j39P20k39l09
3727a78K72K36p92N50N01k4m17L61p10n7P53j265M47l3O23j25j36J6m24M53k34
3748a83L46Mm01O23k40l18k77P25N7l21K11k97P56p31K52J89J89p18P97j91o5
3769D07j463L31O50Q76j346R01m39J0K33j95j65K60k52j73K71j47K31n11J301
3788G80o95j229J586m95k94K92m17K97N52N85j553Q32rl14K45n82M43Q20r75M55
3808C24r45P65k44K23m01K63L02m27j83o5N48J50j47k0K93j54n66n7P72r49O36
$$ plain form
3829 118 666 56 194 -51 -247 314 393 355 134 243 -427 295 39 674 -363 -242 805 884 -603 -394
3849 -394 35 173 -208 -322 -63 -36 556 430 126 -491 602 -723 -480 488 214 778 229 -280 48 424
3869 424 -615 459 362 -673 495 353 -507 -99 208 -167 -215 -161 -485 382 -6 198 -250 -1031 19
3888 19 -113 -14 356 339 -836 149 -224 -147 -605 357 888 63 -363 -578 628 -233 -434 542 -255 105 -370
3909 -370 -123 254 -524 -395 -478 -681 -457 434 463 -307 265 -51 251 825 348 232 350 -250 -87 467 52
3930 52 286 -306 240 56 501 299 357 -578 -307 898 766 403 336 -505 -123 227 -300 132 -741 724
3950 724 -382 137 -464 830 467 212 390 -131 -103 -176 -357 -132 117 60 177 -960 -91 91 182 -270
3970 -270 85 -131 -863 313 155 261 137 -147 1032 -42 534 -103 -35 -426 34 -38 -323 -207 -406 -176
$$ packed form
3829A18N48o10J38k45j96N61P9l8k21J09o70P22k56O35j037J21J047P9j487K09
3849c94M29J38l81j14K59K7N92j26l04o17J093j325K43R68k74N64n49n09L28L76
3869D24j039J074r7j035J168j42q60M08L07l75m8N4l24Q67l88K04m48p81J050
3888A9j32R9L70j7j175R85l73P7m58R62N31q25m26k15J206q61k01R76p97L60m75
3909c70K47L77p78J29q3k03K24Q91K9p70N72l16L02N74m77j16J18o00J63N54m15
3930E2K34n92N46j84M45k02N8r35K71J205j32l63o7q41L82L50n27M32q73J465
3950G24j106N19o01J294l63k55J78n21K8p3j81K25K49n7J17j137Q69J82R1m52
3970b70L55k16p32J176j58J06j24k84J179j074N76o37O8l91M60p2k85J16j99K30
$$ plain form
3990 -176 -302 -385 -52 249 41 36 87 290 324 255 287 -756 190 -88 -640 -481 -548 -280 621 538 290 453 216
4013 216 -457 -369 -612 334 -342 615 -340 -3 651 238 320 649 -82 -274 -53 484 -464 -103 594 566 -550
4034 -550 1 269 -230 218 423 -356 618 -660 354 269 -193 -60 -279 523 -450 12 118 118 -323 -421 24
4055 24 -208 -279 65 -186 841 -179 1325 446 -287 -149 147 398 -205 241 216 -421 -738 216 -867 -401
4075 -401 -128 1334 504 84 187 -611 233 -208 429 -158 712 -336 -72 38 -391 233 -470 339 573
4094 573 -190 -199 269 -331 -485 751 -75 -40 732 -130 809 412 226 35 -118 264 582 -238 -52 171 140
4115 140 615 408 515 -336 81 -495 -528 11 272 248 122 26 -85 -1 -56 252 -319 657 232 -112 172 19
4137 19 423 1050 -121 655 192 -346 74 -1043 103 433 803 141 -153 375 123 448 294 -43 264
$$ packed form
3990a76j26q3L33L01k08nN1K03L4o9L2j043R46k78n52J59o7K68R01q3k48J63k37
4013B16o73Q8k43R46o76R57r55L37O54m13Q2L29p31j92K21N37r48L61O97k8j116
4034e50N51K68m99M48K05p79R74j278J014q5m62J33k19Q02r73M62J06%m41r8M45
4055B4k32p1L44k51J027j020J504q79p33J38K96K51o03M46k5o37l17R54j083M66
4075d01K73J462q30m20J03p98Q44m41O37n87Q70j048K64J10m29O24p03Q09K34
4094E73p63rM68o00j54J236q26L5P72q62R39l97j86j91j53L82L18q20J86K23l1
4115A40M75k07J07q51M17n76l3N39K61k4j26r6j11Q4n5L08n71R76m25l44K84j53
4137A9M04O27j171P76m63n38M20j117J146L30L70o62k94N28k52L25j54l37L07
$$ plain form
4156 264 134 -99 -232 -256 86 -923 254 -721 -201 -8 -748 -405 -235 -572 -266 -234 625 183 517 299
4176 299 77 201 264 211 -37 964 328 -210 481 -211 -39 -200 616 8 122 73 -292 376 148 76 320
4197 320 -711 -366 37 111 477 -207 16 -820 41 48 -279 426 349 -512 -91 143 335 828 186 249 683
4218 683 -600 272 -14 -259 -350 -177 -470 -196 -568 207 -1131 201 -1179 158 570 -299 277 -588 159
4237 159 -224 123 586 101 129 -458 16 39 248 227 117 172 49 -427 -48 457 130 -117 -15 414 384 -41
4259 -41 37 -167 -29 -71 577 431 -520 388 -273 104 298 495 177 108 426 -163 -14 56 257 712 315 454
4281 454 -413 422 66 -415 -679 -37 -273 -95 -326 -39 136 -294 134 -563 316 74 -98 -476 207 -72
4301 -72 372 897 213 118 27 178 -715 -480 -293 408 633 -84 739 116 -210 90 -366 -459 -319 423 164
$$ packed form
4156B64j30k33j33k4L42j009J177r75N20J93p40L43J70l37L06L2Q59m42L34k18
4176B99k22J24O3n3k48J001o36n38O91o92J72j61Q16o08J14m9l65O68k28p2K44
4197C20j031L45M03P4L66o84K23q36Q61Pl27P05p7q61M21K34J92M93o42O3M34
4218F83j283Q72k86k45r1J73k93K74l72P75j338J332j380J337M12q69N76q65P47
4237A59l83L47M63m85K8n87M74K3K09k1j10N5j23m76L79N05l27k47J02M29l0m25
4259d1P8k04J38m2O48j46r51R08o61L77J94J97l18o9L18n89J49P0K01M55l97J39
4281D54q67Q35l56m81k64O42k36J78k31K87J75m30M28o97Q79k42j72l78O83k79
4301g2M44N25o84r5r1J51q93K35J87P01K25p17Q23o23l26L00m56r3J40P42k59
$$ plain form
4322 164 75 35 -410 109 168 152 522 178 -344 175 -753 230 -245 -283 40 866 334 424 -128 -545 214 176
4344 176 -322 -495 -303 -326 102 425 165 -287 566 581 -557 438 670 427 -489 -274 585 458 104 -307
4364 -307 -22 569 -219 174 -86 -248 321 571 124 -400 224 -197 112 -198 97 -70 54 387 -351 642
4384 642 -490 -657 204 89 817 346 297 971 574 -404 -658 266 265 -470 305 101 -90 196 54 -230 -475
4405 -475 279 -339 580 -30 -765 -716 -566 435 -352 129 4 423 211 -358 317 193 -76 18 424 -115
4425 -115 499 -598 567 -58 55 -155 26 204 -314 -718 10 367 -344 251 706 645 -351 357 94 554
4445 554 -266 707 37 -370 -571 -432 593 310 550 149 386 815 16 -103 -143 453 266 292 -628 859
4465 859 567 395 -256 -81 -424 -560 542 195 186 49 -543 123 397 102 -172 65 391 271 -286 460
$$ packed form
4322A64q9m0m45N19N9j6L70l44n22N19r28R83m75l8L23Q26n32R0n52m17P59l8
4344A76m98j73J92k3M28L23k60m52Q53J5j138R95K32k43r16K15Q59j27l54m11
4364c07K85N91p88L93k60j62N69K50m47n24O24m21L09l10K95j67J24L33p38R93
4384F42j132j67Q61j15P28m71m9O74l97r78k54R24jp35P75k04j91K86j42k84k45
4405d75P54o18R19o10p35M9J50J001p87M81j25M19k12n69O75j24k69R4M06n39
4425a15O14j097J165o25J13k10J81J78n18m04P28L57p11N95M55o1r96P08k63M60
4445E54q20R73o70m07k01J39J025k83K40m01K37M29p99j19m0N96j87K6r20J487
4465H59k92j72o51J75l43j36J102l47rj37n92O66K74k95k74K37L26j20n57P46
$$ plain form
4485 460 -204 -735 -200 -264 -368 263 416 578 -371 159 -478 -430 -451 293 -482 -127 -622 9 263 -256 534
4506 534 374 306 -146 -95 205 476 515 523 41 -292 -145 -148 -126 198 -405 615 982 -573 -369 -397 -290 -137
4528 -137 -297 531 -419 -594 -344 457 189 -119 393 -260 -257 -186 -236 -213 -212 49 395 -36 638 -22 -23 -117 -428
4551 -428 -623 8 235 200 -154 502 159 449 -189 -3 53 120 144 -697 -140 32 -515 -385 608 -342 94
4572 94 205 388 -157 -497 96 -302 240 629 174 577 34 -205 -242 704 -226 139 108 598 224 252 48
4593 48 -123 343 -217 -688 138 -260 -158 -386 298 1147 96 -778 -352 124 -759 -215 -359 13 544 292
4613 292 -603 51 426 328 105 22 -803 -29 -594 568 211 416 6 373 -263 -13 -145 744 560 -185
4633 -185 90 281 -462 -185 -709 288 -203 -593 119 327 -94 184 -245 259 492 -661 680 449 837
$$ packed form
4485D60o64n31N35o4j04O31J53J62r49N30o37M8k1P44p75L55m95O31K54n19P90
4506E34j60o8m52N1L00K71L9Qm82l33J47lK2L24o03J020L67j555K04k8J07J53
4528a37j60Q28r50j75K50Q01k68l08N12o53LP1n0K3JK61L46m31O74o60jr4l11
4551d28j95O31K27l5l54O56l43K90o38J86N6O7K4q41N57J72n47J30R93r50M36
4572I4J11J83n45l40N93l98N42L89m55M03n43k39l7R46r30L65l1M90l74K8k04
4593D8j71M66n60m71Q26l98J02k28O84Q49j051q74M26M76q83N44j44L72N31k52
4613B92q95O54L75r8k23q3q25P74n65J162l57K05m10L67o36K50j32Q89j84p45
4633a85K75J91p43K77n24R97m91l90P12K08m21K78m29N04K33j153J341k31L88
$$ plain form
4652 837 -64 159 327 234 286 -48 396 9 317 217 -171 -260 -686 -387 -382 -16 449 -399 -362 60 -182 -185 231
4675 231 102 -271 -184 86 -458 197 -68 237 429 -701 82 -651 -678 -444 19 393 -452 -191 -1014 -320
4695 -320 -262 -152 136 -76 207 -775 241 -78 175 438 -264 153 -347 -518 407 -247 -591 257 -328 520
4715 520 -185 -377 146 470 -117 -210 149 -494 -112 -218 40 396 273 417 527 235 -198 184 -185 399
4735 399 547 -218 -357 344 403 -20 -212 322 7 -552 62 320 -741 706 -324 674 518 473 305 117
4755 117 118 -619 75 197 -20 -419 302 421 -57 142 644 -233 149 520 -329 -325 -748 -751 -556 260 149 -102
4777 -102 745 493 -556 -63 948 692 -804 -260 -144 -734 -100 -243 82 210 10 16 301 -88 71 -108
4797 -108 -76 -199 696 -76 -242 386 803 -446 -433 564 32 -736 234 692 777 -559 -39 392 -238 -183 253
$$ packed form
4652H37r01K23J68r3N2l34M44l87L08j00l88q9m26K99NL66M65q48L7M22k42lM16
4675B31j29l73Q7K70n44O55k65L05J92j130P83p33k7K34M63L74q45K61q23O94
4695c20N8J10K88k12K83r82J016l19K53K63p02M17n00j71R25o54l44Q48n85Q48
4715E20p05j92N23L24n87r3L59o43L82j06K58L56j23J44J10k92m33L82l69N84
4735C99J48p65j39P01N9m23j92N34l15n59O14K58j061J447j030R98j56m5j68j88
4755A17Jp37O94J22k17l99P21J19m78J99N02q77L82L71q49Mm23lJ95Q16j11k51
4777a02Q47k52j049M93J011k56j496N44J16n90O34j43L25J28k00OK85l89J59j79
4797a08L2j23Q95p72j66O28M17j249J3R97n32p68R70M58Q5j336N20M31o30N5M36
$$ plain form
4818 253 905 267 413 -101 -302 203 -526 -432 124 538 -349 -238 -36 -20 -271 -379 -36 -988 108 390
4838 390 337 -512 -214 -295 -211 -454 -684 65 414 -85 -406 355 903 -116 -474 -363 658 346 110 -109
4858 -109 1210 -18 -12 346 -486 -915 -75 572 -847 -199 836 40 -340 -183 -93 -234 500 815 104 242
4878 242 -192 519 -221 -799 -335 508 -281 -284 -643 152 324 -55 731 390 31 428 132 -736 541 319
4898 319 634 -574 -434 -54 -238 411 58 -459 430 548 -204 319 312 58 22 -41 -297 325 779 457 205
4919 205 -581 331 -486 126 -643 -66 522 -736 177 365 -338 295 -106 313 30 -173 -352 -326 -233 -235 -224
4940 -224 294 218 -95 367 296 322 -360 -311 55 311 86 741 570 410 -444 -626 -535 6 559 -56 -502 96
4962 96 579 -14 -432 133 493 -337 431 334 242 109 57 500 -684 -160 -80 -79 287 -409 374 -432 -428 -192 90
$$ packed form
4818B53O52o38J46n14k01N05p29R4N56M14q87J11K02J6k51j08L43r52J096K82
4838C90n3q49K98q1Q4k43k30P49L49m99l21P61N48j019l58J11J021l12k36k19
4858a09J319j228OL58q32m29Q40O47j419O48J035p96l80J57R0j41P34L15p11J38
4878B42m34P11p40n78M64Q43p89ll59P95J72l79P86l41l59L97k96q68J277k22
4898C19L15j208J40L80j84O49l53n17Q89J18p52N23pk54l6o3k56O22M54l22k52
4919B05p86R12q17O12p69N77N88j258R13J88p03O33m01M19k83k03j79K6R3kJ1
4940b24N18p6l13M62p1K6o82M9L66K56k25O55j71j60q54j82R1N41N53o15m46N98
4962I6M83n93m18N65L60q30P68r7r2j33n2M43j184N24Q0JL66o96P83q06MK36K82
$$ plain form
4985 90 118 477 235 1052 -70 -104 169 -15 617 -199 72 453 -61 -525 361 -494 51 -322 113 325 -978
5006 -978 -63 34 126 53 -223 6 -522 -374 43 886 -205 -213 465 83 214 86 -693 203 269 581 481 -223
5028 -223 128 404 216 636 216 -156 557 -413 48 390 528 195 -237 349 61 -562 104 345 225 277
5048 277 706 790 -611 -218 197 -209 114 80 346 -450 502 705 277 165 -337 -30 -39 619 156 -747 -204
5069 -204 -176 734 -227 386 -321 -308 160 39 -237 86 20 165 -37 -350 -339 -883 171 220 -184 250 57
5090 57 -960 -86 786 242 -237 64 -23 -306 278 -474 -289 -310 -118 47 -842 -678 -110 585 223 810 -576
5111 -576 854 492 -329 -626 193 6 37 -89 262 -265 -381 -381 -1125 371 -740 -285 408 44 -344 26
5131 26 -61 74 -552 -11 40 135 448 -62 -705 383 -39 594 13 264 -123 -207 30 -391 192 -224 546
$$ packed form
4985I0K8L59k42Q17j122l4K73j84O32q16K71L81n14m64Q86q55N45l73M35K12j303
5006i78R15R7R2p3k76K29n28J48M17Q43j091qO78l82J31j28p79Q96O6L12j00p04
5028b23L51K76j88M20m20l72P13r70M61L42J38l33m32N86k88o23O66K41j20N2
5048B77M29Q4j401L93M15m06L23l4K66p96R52K03m28j12n02L07rO58m63r03N43
5069b04K8R10r61O13p07J3M68j21k76L23o6J45k02l13J1n44J054M9m04M34j93
5090E7j017Q74Q72n44m79L01q7k83N84p52J85k1J92J65q89J64N68O95l62N87j386
5111e76J430l62q21k97Q19j87L1j26L51n27j16%p44J496j111M55O93l64l88L70
5131B6q7J35o26N41N1R5L13n10o43J088m22O33n81K51l87q4K37m21N83m16P70
$$ plain form
5152 546 -552 -11 137 -33 -240 540 340 280 111 31 -932 -674 -314 1 -361 -180 -638 271 324 125 -434
5173 -434 161 98 -90 -311 -228 -99 -110 142 350 -790 367 248 -112 81 84 -481 277 -296 -613 -747 48
5194 48 -95 -417 -261 -157 -4 -225 274 48 117 216 845 278 -280 -354 -751 128 73 -37 77 -303 -71 -241
5216 -241 -218 -62 565 -97 732 -1032 91 259 611 111 198 529 1039 -409 -287 244 -172 526 141 111
5236 111 194 440 612 604 51 160 280 39 -2 557 475 -20 465 548 -861 -652 290 286 -447 592 -760 -145
5258 -145 393 -366 379 83 424 6 -117 263 236 81 135 37 -532 137 -128 39 -763 207 37 280 331
5279 331 322 345 -189 -306 713 488 -154 384 -210 -486 -89 177 312 -242 508 564 -822 15 30 10 37 574
5301 574 -49 378 -826 -89 116 311 -352 5 479 747 16 158 -829 173 1034 -407 18 -357 -99
$$ packed form
5152E46j098N41J48j70k07P80k00o0j69q0r63K58L60L15l62J81m58R09N3j99n59
5173d34N95o3j88k21Q3J29j1K52K08j140J157j19l60J93Ln65P58n73l17j34P95
5194D8j43l22J56J04J53k21M99k26O9R9O29n67n58p4l97Q79n5j10J14l80K32j70
5216b41K3J56O27o62Q29j764J123J68L52n00Q7L31N10j448J22N31m16O98l85l0
5236A11Q3K46J72qn53J09J20k41m1N59q2m95M85Q3j409K09R42mp33J039j352O15
5258a45N38p59P45k96L41m18j23L80k7j55N4r8n69O69k65J67q02R70j70K43N1
5279C31rK3n34j17J019k25o42N38n94k76L97K66J35n54P50N6j386Q37J5k0K7N37
5301E74o23M27j204P37K05J95o63L57M74K68p31J42r87J002Q61j441M25l75K58
$$ plain form
5320 -99 120 -89 -316 221 -839 299 20 271 -160 -313 -371 -264 41 -32 182 -322 -323 327 200 220 -319
5341 -319 -114 -150 -261 -116 -404 162 -187 237 -534 24 481 -292 744 -327 409 311 -178 -74 -110 151
5361 151 642 -186 -532 505 -386 210 -92 -392 299 327 514 400 455 -2 544 118 -105 -378 5 -301
5381 -301 -37 171 -86 59 -479 -508 -295 -118 334 -13 46 -857 -453 -508 -986 275 -523 -188 0 -551 -114
5402 -114 -3 167 291 653 -369 -390 266 -77 466 -600 91 537 193 434 731 83 -460 -216 -559 140
5422 140 -272 -465 -549 -293 568 -187 41 84 272 403 270 317 -179 -18 -147 582 434 -868 583 235
5442 235 250 118 402 -206 -707 187 -714 -259 -617 506 -534 -96 679 -566 309 -57 663 -298 514
5461 514 -945 396 -522 423 195 -927 61 -264 312 279 -188 -3 780 113 62 -265 -261 13 -386 -77
$$ packed form
5320i9K19k09k27N37j060J138k79K51m31j53n8J07L05p3K14n04jO50j27K0n39
5341c19K05l6j11J45k88N66l49M24p71N58M57p73J036j071P36r8m89J04l6K61
5361A51M91q28l46J037q91N96l02l00O91K8J87j14N5m57N46m26k23k73L83l06
5381c01K64K08k57J45n38k9K13J77M52l47N9r03M04n5m78J261p98L35J88n51M37
5402a14J11J70J24L62j022k1O56l43N43j066O91M46l44K41K97o48n43K44l43O99
5422A40m12j93q4K56Q61p55K28M3J88J31j33M7m96J61j29P29j48j302J451l48
5442B35J5j32K84o08n01Q94r01M55l58J123j040M38P75j245Q75l66P20r61Q12
5461E14j459J341r18R45k28j122R88l25N76l3m67J85P83o67n1l27MK74l99L09
$$ plain form
5481 -77 43 164 -50 151 -150 635 -123 -142 407 -388 281 729 440 153 -708 -27 -428 -283 435 354 6
5502 6 -281 300 -554 79 -592 -15 -15 1163 451 -120 -104 -515 -340 -1 29 583 -773 269 -31 398 635
5523 635 -426 821 -244 338 -106 94 -240 -542 -251 -177 -470 -566 -3 -47 896 383 -552 -131 641 -346
5543 -346 54 -591 188 -265 -130 -190 -111 108 141 153 -616 -179 8 -398 -113 -237 23 359 105 75 173 -98
5565 -98 484 -472 250 723 -194 -165 -37 -18 -212 857 -404 -57 -418 -430 -151 202 -12 -338 -246 1162 1051
5586 1051 -615 165 584 515 -227 -304 381 -598 125 40 -92 -151 54 365 369 345 -300 -185 -30 -139 -166 193
5608 193 -484 -648 -159 92 -770 12 407 52 -277 -56 -320 -211 -226 703 447 -333 78 -292 -873 -509
5628 -509 -25 523 -273 540 87 325 -597 497 266 -207 868 -140 402 487 153 -978 428 -53 -3
$$ packed form
5481g7J20J21k14K01l01P85p58j9N49p95O69M48k89k87q61O81m01J45P18q1l48
5502Fk87N81q54O33o71N77%J178p12n71J6m11J75L39L0N54j356J042l00M29K37
5523F35j061J247j065N82m44K00l34l02K91P4k93r6N63m4R43n13r35M21P72r87
5543c46M00o45P79m53J35o0P9K19L3J2p69M37J87m06K85j24K60L36k54l0R8k71
5565i8N82r56P22M73r17K9J28J9j94J069j261L47l61j2K79L53k14l26R2J408j11
5586A051j666P80M19o9p42p7O85r79P23q5j32n9K05L11Mk4o45J15J55j09k7L59
5608A93o77j64M89K51q62P82L95l55l29K21k64J09j5R29k56p80M11l70n81L64
5628e09M84N48p96Q13m53K38r22J094k31m73J075j008N42Q5l34j131J406m81N0
$$ plain form
5647 -3 496 -157 767 -277 -92 -363 671 -154 -193 -299 307 133 454 -687 -340 157 -668 620 -163 -512
5667 -512 -362 387 -462 -373 -328 583 -211 284 575 -839 406 433 0 -114 -320 -326 479 395 394 -188 93 -417
5689 -417 -120 -225 46 314 240 489 -219 -61 -305 -211 960 194 -495 -4 -184 281 -1 -335 214 375
5709 375 -212 -759 -119 -222 283 184 -12 44 -446 -374 225 16 -48 38 -520 566 -280 124 -730 -495 -448 -416
5731 -416 -75 180 -279 -151 -669 33 167 -59 -759 -347 -127 98 -690 -106 191 112 47 283 197 -243 287
5752 287 111 462 52 -280 -67 -498 162 -500 51 -360 -21 -990 304 131 -59 125 301 198 314 283
5772 283 -344 -72 -469 -168 197 516 -285 236 46 -276 139 81 95 455 -851 80 436 503 -153 -60 -667
5793 -667 -61 -560 -275 -227 -492 -1153 -109 746 78 308 -145 -341 -1478 -381 4 875 295 -223 -788
$$ packed form
5647cM99o53R24j044J85k71J034q25l9j06O06j74L21j141L47M97q25J288p83l49
5667e12J50P49q49Q9M5R11p94M95K91j414J245K7m33j14k06oQ05q4jn82K81n10
5689d17K97j05K71K68p4K49p08J58k44R4J171p66o89M91j80M65k82l34N49J61
5709C75n87n47O40j03N05r9j96N6m90P2N99k09o4Q6n58J086q46M04q54K35M7L2
5731d16L41K55m59J28n18P02J34k26p00M12K20K25p88N84K97p9o5K36q6m40N30
5752B87j76L51m10l32K13m31O60o62N51m11L39r69J294j73j90J84J76j03J16l1
5772B83o27K72l97L01L65L19q01N21j90l22M15n8J4L60j306R31L56O7o56R3o07
5793f67O06m99K85M8k65o61J044Q55o68K30m53j96j137J097L85Q71n80n18n65
$$ plain form
5812 -788 92 396 126 -42 629 45 -566 -464 -91 -162 -5 475 139 44 435 -352 -542 813 -633 -177
5832 -177 -104 -232 272 -133 550 -363 164 -356 105 -484 -263 -321 -936 -269 -472 405 168 118 -66 -712 -319
5853 -319 578 328 364 -464 -220 801 -662 241 3 124 34 313 40 357 59 -423 464 798 111 51
5873 51 -385 403 -45 -411 545 -276 -433 -545 1018 579 -138 -244 -468 -717 696 601 565 -26 -481 294
5893 294 384 -595 420 -350 -37 573 279 -351 -567 29 370 -119 -79 190 -80 598 392 112 123 485 -154
5914 -154 379 1253 438 -280 222 -370 -372 -218 146 165 138 -155 -31 500 -34 366 -115 -515 -571 547 -114
5935 -114 -544 534 807 -290 34 112 207 154 -34 622 -8 273 -410 -681 -249 -238 -209 -193 -326 -379 363 56
5957 56 513 385 -503 -628 -544 744 -62 683 346 -1 -244 -423 72 -227 472 -475 436 54 594 -626
$$ packed form
5812g88Q80L04k70j68O71n84o11J02L73p1J57M80l36r5L91p87j90J355j446M56
5832a77P3j28N04m05O83r13N27n20M61n89K21n8o15O67k03Q77k37n0j84o46L93
5853c19Q97k50L6q28K44J021j463R03k38J21r0K79k73L17k98m82Q87L34o87o0
5873E1m36P88m48l66R56q21j57j12J563m39p17j06k24k49J413r5l6n91m55P75
5893B94R0r79J015p70L13O10k94o30k16N96L41m89M0K69k70O78k06k80J1L62o39
5914a54N33Q74q15p18N02n92kJ54L64J9k7k93J24N31n34M00m81m00n6J118o61
5935a14m30J078K73j097L24P8R5n3j88O56o30K81o83k71M32J1K9J6j33n3P42l07
5957E6M57j28q88j25Q4J288q06P45l37l47k43j79M95k99O99r47R11l82N40j220
$$ plain form
5977 -626 183 -75 60 347 129 -551 -9 -171 -312 299 312 -216 -144 -288 -31 -288 -234 -201 -377 -404 -246 -432
5999 -432 -150 -463 248 -142 -14 207 -395 2 229 127 185 -239 -423 -142 198 388 -60 -159 -38 395 -10
6020 -10 273 460 -122 212 -78 686 -358 504 284 -165 -630 -535 -241 714 205 34 -184 -219 -236 -14 236
6041 236 -420 -139 -27 125 -169 -487 88 -43 -436 55 -701 647 638 732 -312 -616 -107 467 -235 -260 388
6062 388 44 -575 154 -140 -678 -429 -23 171 -225 -70 293 -473 553 -495 429 -26 14 379 -261 -112
6082 -112 90 426 -212 -80 -293 78 -147 267 782 -62 56 352 -243 -318 -256 310 -269 -540 -419 -286 190
6103 190 76 310 105 -78 397 -630 -1026 248 -554 157 887 287 -1254 161 45 -42 535 -235 -256
6122 -256 63 426 -138 369 185 -148 -723 290 -402 218 234 66 397 -242 347 -51 356 -472 93 430
$$ packed form
5977f26Q09k58J35K87k18o80N42j62j41O11J3n28P2j44K57k57N4L3j76k7J58j86
5999d32K82l13P11l90J28K21o02L97K27j02N8m24j84K81L40J90m48r9J21M33m05
6020a0K83J87n82L34k90P64j044Q62k20m49m65R5K94R55n09j71k18l5j7K22K50
6041B36o56K81J12J52k94l18N75j31l93M91p56J348rR4j044l04N09N74p02k5O48
6062C88l44o19P29k94n38K49M06J94l96J55L63p66J026j048R24m55M0L65o40J49
6082a12K02L36o38J32k13L71k25M14N15q44J18K96n95p5O2N66n79k71J21J33M76
6103A90j14K34k05j83M75j027l96J274q02P11P30o00j541J415j16q7N77p70k1
6122b56L19L63n64N07j84l33n75J013o92O20J6j68L31o39N89l98M07q28N65L37
$$ plain form
6142 430 727 -8 24 192 263 -332 -425 -96 -330 -329 -10 -572 -504 -239 90 -101 100 255 540 -1018 -133 -432
6164 -432 -410 -133 -437 -591 151 -360 612 -404 411 406 58 726 286 -69 200 -405 -517 412 -543 -385 -89
6185 -89 103 -152 428 346 269 122 53 945 592 298 292 -491 51 122 -187 859 -230 158 341 -708 304
6206 304 -623 514 -41 -495 353 72 -680 834 183 102 -188 -77 790 -1147 -191 -236 2 325 69 -258
6226 -258 490 458 -618 -21 525 -118 347 104 -257 -105 -943 302 556 56 352 -462 331 -13 633 187
6246 187 -594 440 113 -373 -138 16 85 -21 -661 495 -383 -14 -252 -164 422 439 -275 -580 -335 -107
6266 -107 28 -144 38 -120 328 -636 -365 290 -106 316 -288 1061 242 53 -245 -248 -111 -178 1084 -223
6286 -223 -391 132 726 -271 -285 111 287 413 -204 -346 162 -1159 -34 432 63 748 235 152 212 -410
$$ packed form
6142D30K97p35L2J68P1n95r3L29k34JL19n62O8K65L29j91K01J55K85j558Q85k99
6164d32K2K77l04j54P42n11R72j016Q15nl48O68m40l55K69o05j12R29r55J58K96
6185h9J92k55N80q2p7j47o9Q92l53k94op83N42P1l09J046j089L88J83j049J012
6206C04r27J137n55m54Q48k81p52J514o51q1k90J11Q67j937R56m5K38L23k56l27
6226b58P48l2j076N97N46o43M65k43l61J52q38J245K54n00K96q14P93l44O46m46
6246A87p81J034l27m86K35J54O9j06o40J156q78L69k38Q8N86J7p14l05K45K28
6266a07J35j72J82j58M48r64K71O55l96M22o04J349q19j89k98lJ37o7J262j307
6286b23j68N23N94r97j4L96J76J26o17j42N08j321J125M66l69O85n13q3O0o22
$$ plain form
6306 -410 10 -508 631 -376 -184 278 45 -356 -276 -256 -929 454 -258 -323 461 -78 823 -321 70 -74
6326 -74 -40 -389 -195 693 606 -600 624 223 -635 -693 -733 -157 -159 -874 125 -367 -106 268 1 90 -130 -370
6348 -370 -180 -633 -149 99 1534 -244 387 445 -393 -543 257 180 -117 171 -209 -694 -162 104 255 -284
6368 -284 346 -110 -415 574 173 54 -302 212 310 406 -378 375 505 -85 -546 -69 623 -395 -557 78
6388 78 -90 268 763 197 619 327 309 -411 74 43 932 -165 45 451 -170 111 464 -462 -31 -239 21
6409 21 -80 89 -308 -450 89 449 630 228 67 96 640 -155 122 -101 -317 -527 471 -192 42 -368 -696
6430 -696 296 -285 341 -172 212 71 -323 -195 -628 -523 -641 370 -63 -84 605 -91 1052 196 99 313
6450 313 277 518 337 469 200 711 -748 110 70 59 -213 -538 66 222 776 165 800 -163 -853 386
$$ packed form
6306d10M20n18J139j007J92M62k33m01Q0K0o73J383p12o5P84n39R01j144L91j44
6326g4L4l49J94Q88q7j206J224m01q58n8m0N76kp15R99m92K61L74k67Q9k20k40
6348c70J90m53M84K48J435j778O31N8q38j50Q00p7k97K88l80m85N32K66J51n39
6368b84O30m56l05R89m01j19l56N14R8R6p84P53J30n90m61M77O92j018j62O35
6388G8j68L58M95n66M22k92j8p20M85l1Q89j097K10M06o21K81L53r26M31k08K60
6409B1j01J69l97j42N39L60J81m02j61K9N44p95K77k23k16k10R98o63K34m10l28
6430f96R92n81O26n13L84j41l94J28m33J05j18J011m33k1O89o96J143q56r7K14
6450C13l6K41j81J32k69N11j459Q58m0j1k72l25O04J56N54o11O35r63o90J239
$$ plain form
6470 386 -344 360 1 -379 352 400 292 -408 283 401 229 775 1 486 -139 445 -311 259 646 -916
6490 -916 -124 99 -195 -194 -106 875 -22 433 37 459 -123 889 930 -149 -519 -327 567 -18 362 -107 419
6511 419 -234 -119 61 125 -769 282 146 -406 419 -185 -109 34 465 161 -621 103 1031 -325 -31 -611
6531 -611 -60 103 -125 4 -60 92 340 -141 -228 548 130 83 -285 190 -211 -62 456 500 441 -16 -66 118
6553 118 -361 -144 567 -440 768 -63 -544 0 292 -259 207 -1 -765 62 4 -425 -156 305 -430 165
6573 165 76 -241 -88 -329 162 318 341 -124 -39 53 -58 -68 324 -342 327 -596 338 109 497 -543 -105
6594 -105 -300 513 417 -622 138 -886 -378 196 406 -618 945 -1181 -350 -619 622 171 648 378
6612 378 13 366 -101 933 266 814 909 115 -464 488 -337 210 229 -821 527 -639 -394 -82 528
$$ packed form
6470C86p30P04l59l80P31M8j08p00O91J18j72N46p74M85o25N84p56N70L87j562
6490i16P92K23k94JQ8R81q97M55l96M22n82J012M1j079l70J92Q94n85L80m69N26
6511D19o53J15J80O4q94J051j36n52Q25o04P6J43M31l04p82P24R28j356K94n80
6531f11N51J63k28J29o4J52K48m81q7P76m18m7l68M75m01J49N18M4n9m57n0J84
6553A18m79K17P11j007J208q31m81N44K92n51M66k08p64Q27n8m29K69M61p35N95
6573A65q9l17J53k41M91J56K3m65Q5R2j11j0L92o66O69r23R34k29L88j040M38
6594a05j95Q13r6j039P60j024N08N74K10j024J563k126Q31k69J241m51M77k70
6612C78l65L53m67J034o67N48R5p94n79R52q25N47J9j050J348j166K45L12O10
$$ plain form
6631 528 55 329 -94 254 -312 -490 460 207 381 588 131 114 -32 -197 -142 -45 -272 351 478 -246 21
6652 21 736 42 -283 295 338 153 401 -69 -497 -145 -28 -200 831 -229 269 522 135 131 133 414 417 -359
6674 -359 -212 191 743 158 205 -183 81 160 -18 93 -540 273 214 199 -1 617 -372 40 -5 383 -13 -322
6696 -322 462 6 155 863 206 249 -188 -957 56 977 313 125 -85 299 -173 -37 -464 133 237 -392
6716 -392 107 438 -458 216 -64 -103 -223 -316 -98 -54 121 473 1195 357 110 137 -495 648 -610 -291 -139
6737 -139 -611 94 -830 166 -576 -590 -692 662 51 -314 -269 104 -138 189 1 -587 435 -220 -763 -172
6757 -172 -254 -202 -234 677 -8 302 334 -309 -66 -259 -379 194 411 -69 -282 -467 923 159 -524 -546 383
6778 383 -324 136 -380 -8 210 -516 155 -428 163 341 85 -481 426 -194 -400 130 631 -364 413 -262
$$ packed form
6631E28m73K74m23L48n66j78R50k53J74K07m57j7j46j65N5R7k27O23J27p24K67
6652B1P15o94l25N78M3j85K48m70m28L52J17j72J031j060M98K53l87mKK81Lp76
6674c59J47M03N52n85M7l88K64P9j78J11o33Q13n9j5k00O18r89M12m5L88l96l09
6696c22P84m56J49P08o57M3m37p69J013R21o64j88k10L84m72J36m27N97J04o29
6716c92M99L31q96O74k80l9j20r3K18M4J75L52P22q38k47K7o32J143j258L19J52
6737a39m72P05r24R96p42j4j02J354o11l65M5L73k42L27j88n88J022o55n43N91
6757a72q2N2l2R11o85L10L2o43K43j93j20N73K17m80k13j85J390p64o83k2R29
6778C83p07M60n16L72K18p26O71n83N91J78k56n66R07o20k06N30N01r95P77o75
$$ plain form
6798 -262 -486 630 -124 719 -142 681 144 -546 138 458 206 -409 -148 -181 -20 155 407 -230 757 -402
6818 -402 274 43 -134 -50 57 953 -361 87 -108 467 662 5 -449 548 -842 39 304 435 -339 -140
6838 -140 346 4 -267 275 -206 112 437 -240 409 -821 -62 52 -805 -327 -377 171 -280 -776 -672 -366
6858 -366 620 -206 187 866 606 128 145 -133 180 -933 -526 -541 289 152 -74 -51 -146 -245 386 -201 176
6879 176 453 48 -288 286 28 149 -151 85 138 318 507 -408 -258 -25 -433 -157 -843 -133 209 -487
6899 -487 -205 -308 -38 -754 -92 221 -219 216 450 324 131 -68 -347 -199 29 771 480 -202 71 -296
6919 -296 343 467 1040 287 256 392 -215 37 5 501 -375 27 600 -193 -728 613 436 484 118 -463 47
6940 47 -596 -84 -482 -484 -436 122 -76 -752 -78 72 109 649 274 388 -20 137 390 -13 233 562 773 38
$$ packed form
6798b62k24J116p54Q43q61Q23n37o90O84L20k52o15K61l3J61J75K52o37R87j159
6818d02O76k31j77Q4J07Q96j314M48j95N75J95o57m54R97j390Q81K65J31p74J99
6838a40M86l42k71N42m81L18L25o77O49j230P59J14q57M78n0N48m51m96J04L06
6858c66R86q26L93O79k60m78J7k78L13j113M07j5Q30j37k26K3r5r9O31n87L77
6879A76K77m05l36N74k58J21l00K36N3J80J89r15J50K33m08K76o86P10L42o96
6899d87K82j03K70p16O62L13m40M35K34j26j93j99k79J48K28P42k91o82K73l67
6919b96O39J24N73p53l1J36o07K52l2M96q76M02N73p93n35J341j77M8l66n81N10
6940D7o43N12l98kM8N58j98o76O74J50L7N40l75J14m08J57K53m03K46L29K11p35
$$ plain form
6962 38 144 -989 566 -171 219 -401 292 -694 -412 524 550 -92 6 431 -695 446 86 -291 -88 227
6982 227 -278 -136 -548 -349 678 48 -778 868 -16 -402 568 -82 -146 543 490 -267 -242 162 -490 301
7002 301 -126 -416 -7 258 379 -49 43 -101 -20 301 768 -515 -108 59 324 497 -333 -442 239 -404
7022 -404 -257 193 -801 -293 655 -106 -675 -625 49 16 -177 -113 -335 81 308 -78 -687 -764 -455 -199 -188 1075
7044 1075 298 606 -35 823 -198 484 773 -343 278 -388 121 -425 -399 -383 -95 -666 -837 213 -696
7063 -696 294 -140 -247 -131 176 403 -610 154 -259 44 131 207 -1228 -81 109 464 571 443 141 -6
7083 -6 166 37 -181 156 -283 252 123 45 -67 -226 159 -276 557 189 114 -333 -49 179 -440 -154 -356
7104 -356 33 -286 675 35 307 -283 258 701 -958 30 -855 324 -787 329 -246 32 -268 -7 116
$$ packed form
6962C8J06j133J555p37L90o20O93r86K82R36K6o42R8M25j126J141l60l77K03L15
6982B27n05J42m12J99J027o30q26J646q84l86R70o50o4O89n3p57K5M04o52P91
7002C01m27k90M09K65J21m28R2j44Q1L21M67j283M07J67K65J73q30j09O81o43
7022d04J47M50r94N08R48p61n69N0O74l3j93O4k22M16K27l86o09p7L09K56J1J263
7044A075p77L08o41Q58j021O82K89j116O21o66N09n46K6J6K88n71j71J050r09
7063f96R90m34j07J16L07K27j013P64m13L03Q7P6j435J147J90L55J07j28l02j47
7083fJ72j29k18L37m39N35j29p8j12j59L85m35Q33l68p5m47K84K28o19K86k02
7104c56L89l19R61o40K72n90N41M43j659R88q85J179j111J116n75K78l00K61J23
$$ plain form
7123 116 441 -811 254 461 -103 -185 234 1331 -269 -247 -180 -129 152 223 296 497 374 643 199 -73 41
7144 41 -998 -85 55 165 183 -621 248 -172 -343 -319 -435 395 -369 193 -216 6 196 752 164 -548 -266
7165 -266 -161 66 642 -224 -224 -573 -184 -110 -66 194 -289 1356 -710 -197 -92 926 488 -274 -294 -75 -417
7186 -417 -718 -622 -479 -439 247 -135 105 381 562 49 195 541 75 -93 -611 244 -420 -568 -740 -762 181
7207 181 -517 269 -109 428 457 -291 23 -394 -13 -560 -49 25 -342 -141 494 -70 74 -34 219 -143 -284
7228 -284 145 1023 190 470 -220 397 23 -6 -344 317 -146 214 -460 46 -163 -467 303 435 -135 735
7248 735 420 12 513 810 158 86 -91 -45 237 324 320 -173 28 140 125 662 -505 -696 -411 -116 755 247
7270 247 701 -335 -221 643 124 -446 532 -32 796 703 206 -542 -255 -179 324 60 682 -300 -313 -312 703
$$ packed form
7123A16L25j252J065K07n64q2M19J097j600K2O7N1K81P1P3K01j23K69m44k72J14
7144D1j039R13J40J10J8q04Q69m20j71K4j16Q30p64N62m09K22J90N56n88p12K82
7165b66J05K27N76q66%l49L89P4M4K60m83J645k066N13J05J018m38p62k0K19l42
7186d17l01R6J43M0O86l82K40K76J81n13J46L46m66j68n18Q55o64j48j72k2R43
7207A81o98P86l78N37K9p48L14m17L81n47N11P4l67K01O35n64J44j08K53l62j41
7228b84M29Q78q33K80o90O17l74k9l38O61m63L60o74N06k09l04P70J32n70Q70
7248G35l15m08N01K97o52p2j77M6K82Q7mm93K01J12j5N37j167j91K85K95Q71n08
7270B47M54j036J14Q64n19n70R78n64Q28r3m97p48K87P6N03k64O22r82j3JJ015
$$ plain form
7291 703 117 105 -255 422 124 17 355 396 583 394 -50 -328 -414 -423 -99 -413 -194 96 -358 -31 165 192
7313 192 432 -759 -9 -58 -557 -87 124 560 -791 456 147 -506 317 -450 226 -358 -847 -466 -62
7332 -62 163 -342 294 -203 -452 -412 -292 -458 -436 -101 1388 -157 291 231 404 -584 -397 413 -813 -15
7352 -15 388 379 -44 -466 -432 -58 235 -328 8 450 -133 -310 -460 -301 116 -257 492 196 -691 130 327
7373 327 593 -910 362 -291 619 -40 -151 180 533 332 -268 -341 -461 -37 300 -226 14 118 94 849
7393 849 -521 -345 -1131 726 277 13 -578 754 337 23 -148 398 531 355 950 22 -221 -417 -126
7412 -126 -31 742 174 -333 414 665 -240 -274 -536 97 277 833 297 293 143 -478 218 -533 -68 -281 157
7433 157 -284 -863 -90 -338 -166 63 120 222 -86 636 98 283 183 -92 -379 -391 -179 71 -241 -234 -716
$$ packed form
7291G03n86j2l60O77k98j07L38M1J87j89m44k78q6rL24l14K19K90m54L27J96K7
7313A92K40j191P50m9m99M70K11M36j351J247l09o53Q23p67O76n84m89L81M04
7332f2K25n05O36m97k49M0J20j66K2L35J489j545M48o0J73r88J87Q10j226P98
7352a5M03rm23m22L4L74K93n63L36M42n83j77j50J59M17l73P49k96q87Q21J97
7373C27K66j503J272o53R10o59j11L31L53k01o00p3j20M24L37n26K40J04k4P55
7393H49j370J76p86J857m49k64n91J332m17l14j71N46J33j76N95r28k43j96K91
7412a26R5P73n68n07P47K51r05l4k62O33J80N56n36mj50o21O96p51M65k13M38
7433A57m41n79P73k48J72K29N7J02l08P22n38J85j00k75k87j2K12K50l12Pm82
$$ plain form
7454 -716 -356 65 -220 177 -112 298 92 -493 -202 126 -233 -276 -81 81 -382 234 266 234 -549 124 -380
7475 -380 80 -250 -259 668 16 -598 -1135 12 -658 -321 -1117 2 -61 444 -113 -119 535 257 155 -336 456
7496 456 114 235 172 -35 126 -728 525 390 -394 1309 -595 47 294 -204 455 398 81 -406 546 -627
7516 -627 -491 -1229 -204 -409 -276 368 227 -351 -772 265 -321 195 669 -292 -78 -417 -35 753 149
7535 149 -24 -307 41 -520 182 -818 -389 147 -117 -259 219 88 -151 -353 757 105 -342 -755 -2
7554 -2 226 -29 -27 95 -271 -523 66 -571 -183 615 -435 47 -296 -182 146 -478 536 254 -398 -229 227
7575 227 -120 -646 -302 114 -365 -36 143 -249 666 -329 -204 -405 64 543 -207 -456 -555 450 -313 679
7595 679 -413 371 885 777 122 216 -237 100 336 -506 -866 -177 -379 -439 -353 272 196 235 -652 286 481
$$ packed form
7454g16L60M21k85L97k89M10k06n85K91L28l59m3J95J62m63O16L2l2p83O73n04
7475c80M60l30rR27o52o14n37J147o70L37p96J119o3N05n57oO54k78j02m91P92
7496D56l42J21o3k07J61q54J253j35p84J703j904O42K47m98O59n7l17m87R52j173
7516f27J36p38J025k05J33O44j41n78m21J037n86N16M74r61K14l39L82P88o04
7535A49j73k83L48n61P02j000M29N36k64j42M78j31k39k02J110o52m47m13P53
7554bK28k55KJ22l66k52N89o37L88P98j050M82l43J14L28o24J014k82o52J69M56
7575B27l47n26L44M16m79L29J79l92R15r95J25k01M69M79p50k49r9J005p63R92
7595F79j092P84N14j08o55R4m53L37K36q42l60O89k02o0Q6O25p6L9q87R38J95
$$ plain form
7616 481 788 188 257 207 175 551 -41 -391 369 198 63 112 -692 354 200 271 -91 397 -253 -29 325
7637 325 317 -124 -299 -338 528 185 -167 572 -298 98 213 466 -123 -218 -108 -86 -1051 -285 -992 591 -35
7658 -35 184 6 334 347 -33 -198 -172 513 319 -524 -58 152 -395 -749 -115 -524 334 79 498 -16 -17 -223
7680 -223 303 -47 -346 -441 462 648 276 -59 401 190 801 -212 285 -23 -49 -117 -396 -2 173 -76 591
7701 591 709 -229 180 -282 244 248 -238 -546 -29 -376 -249 442 108 -138 543 -346 -192 492 -302 -173 315
7722 315 214 591 -74 113 -30 -107 -361 596 794 106 -269 -54 -24 155 -4 208 -364 -310 66 -227 -19
7743 -19 713 690 -430 -126 -555 78 87 647 -564 704 99 -414 147 -220 -510 -758 -33 -383 650 -236
7763 -236 -199 -246 -623 -370 110 -488 -201 479 27 31 -1006 -143 539 223 -292 -324 563 182 89 -123 -336 613
$$ packed form
7616D81L07o00O9n0l2L76n92l50P60j71j35M9q04J046j54P1l62M88o50K24L54
7637C25qm41j75l9Q66l43l52P39q70L96J15K53n89r5J10K2r65P66p07J583o26
7658c5K19j78L28J3l80j65K6O85j94q43M66K10n47l54O34m09Q58k55M19n14jk06
7680b23N26l50k99r5R03J86l72l35M60k11O11j013M97l08k6o8k79L94J75k49O67
7701E91J18r38M09m62N26Mm86l08N17l47J27O91l34k46O81q89J54O84p94J29M88
7722C15j01L77o65J87j43p7k54R57J98o88l75K15L0J79j59K12n72N4L76k93K08
7743a9P32k3j120L04m29O33RN60j211J268o05n13N61l67k90k48P25l50J033q86
7763b36L7m7l77K53M80n98K87O80m52Mj037Q63O82l16n15l2Q87l81r3k12k13R49
$$ plain form
7785 613 -840 -233 -702 -824 -88 -810 383 19 -454 95 381 -637 -261 -203 425 -204 -262 -128 -892 -400
7805 -400 473 -661 30 -613 -363 474 -346 771 -14 532 -302 -542 -142 151 632 441 135 -262 24
7824 24 -1004 522 -638 376 213 341 97 513 -195 -436 580 -592 245 -406 -70 -232 -5 311
7842 311 566 387 -167 204 230 -97 -592 391 -98 -87 -88 -255 666 -480 -29 189 467 -16 -428 -544 -355
7863 -355 -463 210 -122 -841 97 -209 -626 -241 59 89 -231 12 -305 -776 -90 373 -9 -23 -422 187 200
7884 200 -266 -277 578 0 253 133 0 -497 318 -587 67 -342 111 -299 -534 -66 206 -69 -138 87 -132
7905 -132 -87 -250 -92 -722 544 720 -142 -727 -356 192 -534 555 -849 -173 740 -492 -112 -152 -30
7924 -30 -392 103 135 -40 382 -150 359 -183 57 -224 376 -58 -333 647 270 -271 141 -448 492 -641
$$ packed form
7785F13j453O07m69j22P36p22J193l64m73N49K86j018L76N8O28o29n8J34p64M92
7805d00Q73j134O91o43K50Q37q20J117p85N46q34k40M00K93M81j91l06l97K86
7824B4j028J526j160J014j63J28k44M16p08k41J016j172Q37o51L36j62K27L16
7842C11K55j79n54L71K6l27m95R83m89J1jj67R21j146M51K18K78m83m12j16J89
7863c55j08O73l32p19R38l06m17L85L00L0l20K43l17m71O86M63l82j4l99O09J3
7884B00m66j1Q55n78K53j20j33m97Q15r05O54m09M53m10k35M68K72k75o9K25k19
7905a32M5j63J58o30J266J76q62n85L71N48p26J089j404O76R13j232L80m0J22
7924c0l62M95L2j75M22n32N09n42K40k81O00m34k75R80l77n41M12n89R40j133
$$ plain form
7944 -641 330 -77 -337 -339 -461 -40 737 -612 41 -312 -303 669 -226 -376 -708 -188 -221 194 -382 -169 660
7965 660 169 74 362 -46 475 -5 460 244 -465 -762 -297 -270 -46 540 -968 -123 766 -687 294 609
7985 609 -35 -81 -557 -479 -49 -222 -548 382 -410 -141 -152 -503 379 -197 457 596 548 294 -229 -593 213
8006 213 177 206 89 373 -282 -160 -107 280 236 48 916 -33 11 417 -343 -38 -518 144 397 -369 -139 278
8028 278 -151 702 311 -32 -134 248 -274 -158 222 -234 -618 581 242 264 338 13 208 -119 455 11
8048 11 -228 243 543 -132 353 125 -576 166 211 504 658 -476 263 316 -127 738 -511 -503 17 745 -857
8069 -857 -161 344 -556 100 -451 165 -174 -273 -266 1045 10 339 -380 396 -507 386 -348 -249 85 -7 -547
8090 -547 157 -130 381 282 277 244 129 -72 198 432 -10 762 -593 -187 615 -208 -116 -580 -104 60 191
$$ packed form
7944f41R71m07k60kj22M21P77j349O53l53RR72q95j50l32N20l3M15n76K13Q29
7965F60m91r5K88m08N21m80M65k16p09k97M65K7K24N86j508Q45Q89j453R81L15
7985F09o44m6m76P8M30j73l26R30p92K69j1l51Q82n76O54J39m8k54n23l64Q06
8006B13l6K9j17K84o55J22N3L87m4j88Q68r49M4M06p60L05m80O62K53p66K30M17
8028B78m29Q53l91l43j02L82n22J16L80m56l84J199l39K2P4l25J95l27N74m44
8048A1k39M71L00o75M85k28p01P42M5K93J54j134P39N3m43Q65j249QN20P28j602
8069h57O96N05r00O56n51O16l39r9PJ311j035L29p19P76r03Q93p34R9L34r2n40
8090e47P04k87N11r9nl3j15k01K70K34m42P72j355M06Q02q23R2m64M76J64J31
$$ plain form
8111 191 -589 -154 124 -46 102 805 -15 -76 -412 -28 -693 -8 -467 509 467 -157 459 372 -436 -208 97
8132 97 -54 -381 -183 -19 -332 197 -127 312 -478 194 202 234 -228 490 -474 -282 1045 106 673 -466 86
8153 86 -224 -680 -1080 663 152 139 594 -585 647 351 549 250 -612 -704 -336 -365 241 571 75 -1436
8173 -1436 807 88 84 -752 161 13 -380 -775 -251 372 477 -494 196 58 40 186 -181 258
$$ packed form
8111A91p80M35K78j70J48P03q20o1l36L84o65O85m59R76m2o24O16q7q08K28L05
8132I7j51l27J98J64l13N29l24M39p90O72QL2m62P18r64J92J327r39N67j139N52
8153H6l10m56m00J743n11j3M55j179J232k96J98k99q62r2L68k9O06L30m96j511
8173a436K243p19mq36R13j48l93l95N24O23J05r71O90j38j8J46l67M39
8191B58
$$ Imaginary data points
##PAGE= N=2
##DATA TABLE= (X++(I..I)), XYDATA
$$ plain form
0 0 0 0 0 0 0 0 0 0 0 0 0 0 0 -1 64 -64 64 -64 66 -128 128 -130 192 -194 257 -308 326 -387 451 -518 600
31 600 -697 778 -893 1008 -1137 1276 -1426 1596 -1779 1984 -2205 2446 -2711 2997 -3310 3654
47 3654 -4028 4443 -4889 5395 -5935 6542 -7209 7963 -8811 9769 -10866 12136 -13626
60 -13626 15400 -17554 20236 -23684 28281 -34775 44701 -61807 99714 -392430 349580
71 349580 184897 -643321 643017 -64455 -376832 565113 -239262 -267398 491563 -444704
81 -444704 -19038 389466 -476998 212691 302766 -514819 385277 108548 -509537 453817
91 453817 -63670 -438471 519694 -196903 -270667 518545 -290630 -112030 433310 -381390
101 -381390 34804 288490 -407986 178504 155456 -373217 311972 16204 -316696 388989
$$ packed form
0@%%%%%%%%%%%%%jO5j28J28j28J30j94K56k58L22l86M51n65O34p13Q38r69J118
31F00j297J475j671J901k145K413k702L022l375L763m189M651n157N708o307O964
47C654p682Q471r332J0284j1330J2477j3751J5172j6774J8580k0635K3002k5762
60a3626K9026l2954L7790m3920N1965o3056P9476j06508J61521m92144P42010
71C49580j64683q28218J286338p07472l12377R41945q04375k8136P58961r36267
81d44704M25666M08504q66464O89689R0075q17585R00096k76729o18085R63354
91D53817n17487l74801R58165p16597p3764P89212q09175J78600N45340q14700
101c81390M16194K53686o96476N86490k3048n28673O85189k95768l32900P05685
$$ plain form
111 388989 -131452 -245797 421207 -250940 -141809 406265 -322353 -27326 337003 -352236
121 -352236 79984 230748 -335501 177562 107383 -282503 249241 -24736 -214555 280542
131 280542 -141774 -134546 292564 -218993 -41695 281362 -264154 43642 226490 -290887
141 -290887 105175 140864 -280093 161992 58960 -220422 209126 -18095 -146846 216301
151 216301 -103264 -85191 192049 -173768 -11678 168207 -203063 72640 139059 -209729
161 -209729 129406 80879 -212419 152623 13801 -186069 172524 -35095 -119898 179874
171 179874 -76454 -51318 153134 -123812 2682 106221 -154032 59425 71157 -152679
181 -152679 113598 37482 -139838 139102 -8102 -124117 140081 -50635 -89633 133688
$$ packed form
111C88989n20441j14345O67004o72147J09131N48074p28618K95027L64329o89239
121c52236M32220J50764n66249N13063p0179l89886N31744k73977j89819M95097
131B80542m22316P228M27110n11557J77298L23057n45516L07796J82848n17377
141b90887L96062L5689m20957M42085j03032k79382M29548k27221j28751L63147
151B16301l19565J8073K77240l65817J62090J79885l71270K75703O6419l48788
161b09729L39135m8527k93298L65042j38822j99870L58593k07619q4803K99772
171A79874k56328K5136K04452k76946J26494J03539k60253K13457J1732k23836
181a52679K66277p6116j77320K78940j47204j16015K64198j90716l8998K23321
$$ plain form
191 133688 -75035 -38502 118070 -91078 9067 83024 -104281 44235 42139 -104413 76887
202 76887 8598 -89227 100052 -22066 -69626 107293 -50630 -48535 101392 -69542 -20886
213 -20886 87306 -78722 8314 63320 -78843 34344 33110 -70286 53991 3918 -57247
224 -57247 67718 -23738 -40312 72349 -45082 -23459 70577 -56878 -4416 61023 -61709
235 -61709 12030 45017 -60249 24967 23670 -52824 35662 5143 -40153 44148 -12996 -24174
247 -24174 46599 -29408 -11426 43346 -40533 709 37954 -43826 12373 29685 -43460 21030
259 21030 18711 -38925 25831 5605 -31535 28880 -6754 -20178 30895 -16138 -8904 29626
271 29626 -25348 498 24575 -31445 9907 19395 -32860 15793 14675 -30944 20849 7300
$$ packed form
191A33688k08723L6533J56572k09148J00145P3957j87305J48516k096j46552J81300
202G6887o8289r7825J89279j22118m7560J76919j57923K095J49927j70934M8656
213b0886J08192j66028Q7036N5006j42163J13187j234j03396J24277n0073o1165
224e7247J24965r1456j6574J12661j17431K1623R4036j27455N2462O5439j22732
235f1709P3739L2987j05266Q5216j297p6494Q8486l0519m5296Q4301n7144j1178
247b4174P0773p6007J7982N4772q3879M1242L7245q1780N6199J7312p3145O4490
259B1030k319n7636O4756k0226l7140O0415l5634j3424N1073m7033P234L8530
271B9626n4974K5846K4077n6020M1352R488n2255M8653j118m5619N1793j3549
$$ plain form
283 7300 -25810 22620 -2461 -19985 22792 -9465 -10816 21192 -15827 -1433 18746 -20293
295 -20293 6575 14367 -23536 13118 9967 -23533 16937 5233 -21106 18928 -56 -17235
307 -17235 19371 -4858 -11533 17702 -10234 -3791 14598 -14579 2541 11649 -17468 8579 6536
320 6536 -18225 14454 2411 -17711 16677 -725 -15385 18461 -6026 -10850 17151 -8503
332 -8503 -6328 14001 -12347 576 8813 -12075 7409 5405 -14005 10793 1098 -13371 15633
345 15633 -3192 -10864 16502 -6017 -7924 15809 -8421 -5010 12902 -10547 -309 9005 -10902
358 -10902 4025 4005 -10227 8620 195 -9374 11515 -4171 -7851 13786 -7149 -5788 13808
371 13808 -9672 -2611 12498 -10752 725 9610 -10196 3827 5984 -8962 6109 254 -6594
$$ packed form
283G300l3110M8430k5081j7524M2777l2257j351L2008l7019J4394K0179l9039
295b0293K6868P792l7903L6654l151l3500M0470j1704k6339M0034j8984j7179
307a7235L6606k4229o675K9235k7936O443J8389k9177J7120R108k9117K6047k043
320F536k4761L2679j2043k0122L4388j7402j4660L3846k4487m824K8001k5654
332h503K175K0329k6348J2923Q237k0888J9484k004j9410K4798r695j4469K9004
345A5633j8825p672K7366k2519j907K3733k4230L411J7912k3449J0238R314j9907
358a0902J4927k0j4232J8847q425r569K0889j5686l680K1637k0935J361J9596
371A3808k3480P061J5109k3250J1477Q885j9806J4023K157j4946J5071n855o848
$$ plain form
384 -6594 8316 -4078 -4576 10051 -7297 -1150 10489 -10624 1038 9314 -11268 2971 7160
397 7160 -9675 4797 4338 -8774 5690 764 -6525 6305 -2281 -3468 7276 -6471 91 6163
411 6163 -8320 3531 5721 -9277 5214 4109 -9798 6671 2764 -7870 6747 568 -5774
424 -5774 6148 -1562 -2884 5227 -4068 211 2570 -5545 3119 2103 -5627 5875 1177 -6341 6539
439 6539 -968 -7095 7019 -938 -3908 5982 -2983 -2003 3741 -2788 -53 3089 -4521 1055 593
454 593 -4143 4274 -680 -2902 5704 -1806 -3227 5647 -2701 -2959 4349 -3149 -1032 4515 -3408 -507
470 -507 3353 -2736 1125 1440 -2513 2512 -931 -1264 2847 -2919 -888 3452 -2710 -116 3572 -3820
486 -3820 -448 3020 -4308 -347 2590 -2659 1466 1473 -2015 1668 509 -1336 1003 -1126 -120 1305
$$ packed form
384f594J4910j2394m98J4627j7348O147J1639k1113J1662Q276k0582J4239M189
397G160j6835J4472m59j3112J4464m926p289J2830q586j187J0744j3747O562O072
411F163j4483J1851K190j4998J4491j105j3907J6469l907j0634J4617o179o342
424e774J1922p710j322Q111r295M279K359q115Q664j016p730J1502m698p518J2880
439F539p507o127J4114p957k970R890q965R80N744o529K735L142p610N576m62
454E93m736Q417m954k222Q606p510j421Q874q348k58P308p498K117N547p923K901
470e07L860o089L861L15l953N025l443l33M111n766K031M340o162K594L688p392
486c820L372L468p328L961K937n249M125Pl488L683j159j845K339k129J006J425
$$ plain form
502 1305 -3157 261 2798 -3781 1940 1604 -3616 1681 1704 -2755 1580 1291 -2470 1111 395 -1537
518 -1537 719 276 -597 -421 -802 820 566 -1569 1375 122 -2785 1314 -36 -2306 2028 143
534 143 -1727 1719 58 -1037 1640 161 -761 861 -179 74 620 -68 1123 195 -689 1105 -888
551 -888 -1076 1830 -116 -1469 1603 -287 -729 1572 -453 -124 1926 -460 -734 -34 -3 226 -337 -240
569 -240 859 -869 -217 1317 -1607 121 1009 -572 -452 1817 -932 -361 1576 -1128 -574 530 -1309
586 -1309 -515 -109 448 -82 -302 -11 318 -1161 483 297 -1071 779 333 -1015 299 1306 -77
603 -77 425 937 -779 -814 546 438 -159 440 -595 -392 -1096 95 682 -748 234 -34 -513 -149 565
622 565 -466 236 634 -753 -140 302 -580 -303 -115 -49 -263 692 256 -331 -634 -29 202 525 735 -224
$$ packed form
502A305m462L418K537o579N721l36n220N297K3m459M335k89l761L581p16j932
518a537K256m43q73J76l81J622k54k135K944j253k907M099j350k270M334j885
534A43j870L446j661j095K677j479r22J622j040K53N46o88J191r28q84J794j993
551h88j88K906j946j353L072j890m42K301k025L29K050k386k74P00L1K29n63R7
569b40J099j728O52J534k924J728Q88j581J20K269k749N71J937k704N54J104j839
586a309P94M06N57n30k20K91L29j479J644j86j368J850m46j348J314J007j383
603g7N02N12j716l5J360j08n97N99j035K03p04J191N87j430R82k68m79L64P14
622E65j031P02L98j387O13M42q82K77J88O6k14R55m36n87l03O05K31L23K10r59
$$ plain form
642 -224 -47 -257 301 304 297 516 -594 109 225 -149 -792 733 -136 332 223 -20 296 613 753 -333 198
663 198 -31 -570 -104 226 -593 -1081 668 -306 -271 -287 98 -236 319 759 -734 46 95 -160 -821 -58 -202
684 -202 -243 407 455 -554 -320 165 -633 -598 -107 -222 -37 -319 240 -421 -362 571 -452 675 207 -460 127
705 127 384 65 46 753 338 102 463 215 -732 809 737 -588 -365 750 -458 499 -218 -58 -3 130
725 130 491 -559 -593 -432 -212 278 1140 -390 -257 481 420 -111 1345 396 439 -576 401 -256 565 -225
745 -225 542 -110 214 -482 -106 367 263 -214 -52 -392 436 -694 706 160 -216 116 -299 -11 38 -82
765 -82 -535 -227 -74 177 -511 23 -42 37 820 -324 -561 416 -71 -783 70 370 102 -655 409 204 1373
786 1373 127 590 -596 365 266 -158 162 304 -153 -483 308 221 -483 305 258 53 -194 -257 470 -59 547
$$ packed form
642b24J77k10N58LpK19j110P03J16l74o43J525q69M68j09k43L16L17J40j086N31
663A98k29n39M66L30q19m88J749r74L5j6L85l34N55M40j493P80M9k55o61P63j44
684b02m1O50M8j009K34M85p98L5M91j15J85k82N59o61N9R33j023J127m68o67N87
705A27K57l19j9P07m15k36L61k48r47J541p2j325K23J115j208R57p17J60N5J33
725A30L61j050l4J61K20M90Q62j530J33P38o1n31J456r49M3j015R77o57Q21p90
745b25P67o52L24o96L76M73j04m77J62l40Q28j130J400n46l76L32m15K88M9j20
765h2m53L08J53K51o88N34o5P9P83j144k37R77m87p12Q53L00k68p57J064k05J169
786A373j246M63j186R61r9m24L20J42m57l30P91q7p04P88m7k05k47o3P27n29O06
$$ plain form
807 547 -164 -154 -283 -317 -719 314 53 424 146 264 -59 159 -265 92 -201 -195 -346 349 403 -52 -212 612
829 612 104 -288 -96 402 369 -127 276 -165 157 -306 261 -292 233 432 -122 357 889 -90 157 334 -724
850 -724 -130 -340 293 111 436 147 -537 375 -401 -110 -150 239 -561 521 615 338 580 -377 -102 -139 -562
871 -562 23 231 571 444 59 429 -415 -201 -350 -261 200 -895 711 -545 609 521 -98 188 827 -270
891 -270 521 -328 -614 -274 -349 412 -377 798 -416 32 -56 214 780 -144 389 39 118 43 -135 137 -295
912 -295 -391 366 -1313 551 172 27 156 -411 -111 -864 -333 -157 -2 -58 -290 -110 -24 344 522 -95 -164
933 -164 307 406 36 648 531 651 317 -623 -76 -559 -432 -324 -315 -214 288 599 149 -331 346 662 91
954 91 70 471 -10 400 558 -292 529 413 52 348 -209 151 -561 -199 -522 808 103 -152 306 179 780
$$ packed form
807E47p11J0j29l4m02J033k61L71k78J18l23K18m24L57k93Oj51O95N4m55j60Q24
829F12n08l92J92M98l3m96M03m41L22m63N67n53N25J99n54M79N32r79K47J77j058
850g24N94k10O33j82L25k89o84R12p76K91m0L89q00J082R4k77K42r57K75l7m23
871e62N85K08L40j27l85L70q44K14j49Q9M61j095J606j256J154q8o19K86O39j097
891b70P91q49k86L40p5P61p89J175j214M48q8K70N66r24N33l50P9p5j78K72m32
912b95r6P57j679J864l79j45J29n67L00p53N31J76J55n6k32J80Q6L68J78o17o9
933a64M71R9l70O12j17J20l34r40N47m83J27J08RJ01N02L11m50m80O77L16n71
954I1k1M01m81M10J58q50Q21j16l61K96n57L60p12L62l23J330p05k55M58j27O01
$$ plain form
975 780 1 -629 286 666 -291 81 -120 260 -293 167 -50 -408 -105 -387 -433 -403 -150 -280 191 120 534
996 534 -1002 -188 -205 -43 330 -285 46 -453 -94 701 -547 628 -160 149 23 218 -110 601 23 -25
1016 -25 161 -403 -98 33 419 58 -113 -862 76 413 -233 -263 -408 -683 -182 -689 -18 532 -32 -430 -450
1037 -450 -438 -136 343 240 209 -236 -59 442 1005 5 -94 852 569 131 380 -83 78 -563 5 262 -121
1058 -121 -609 685 57 -604 -72 -350 -326 283 -179 -407 143 317 -339 383 146 386 -538 -177 777 448
1078 448 38 659 613 220 460 456 567 -441 628 247 163 -805 -153 365 -366 -107 1134 -110 93 -166
1098 -166 226 -355 220 -536 13 -433 -185 -464 110 248 246 -367 -305 -345 -454 -178 -77 609 23 -317 107
1119 107 78 -97 130 227 223 58 -187 881 380 -234 -315 545 -292 -776 30 368 761 -167 -288 -148 -359
$$ packed form
975G80p79o30R15L80r57L72k01L80n53M60k17l58L03k82m6L0K53j30M71p1M14
996E34j536Q14j7J62L73o15L31m99L59P95j248J175p88L09j26J95l28P11n78m8
1016b5J86n64L05J31L86l61j71p49R38L37o46l0j45k75N01n07O71N50n64l98k0
1037d50J2L02M79j03l1m45J77N01N63j000r9R46k83m38K49m63J61o41N68K57l83
1058a21m88J294o28o61N32k78K4O09m62k28N50J74o56P22k37K40r24L61R54l29
1078D48m10O21m6l93K40mJ11j008J069l81q4r68O52N18p31K59J241j244K03k59
1098a66L92n81N75p56N49m46K48k79N74J38ko13O2m0j09K76J01O86n86l40M24
1119A07k9j75K27R7mj65k45J068n01o14q1Q60q37m84Q06L38L93r28j21J40k11
$$ plain form
1140 -359 -131 173 -361 -465 -167 -120 -391 49 195 -84 -29 351 290 -141 -366 423 211 -358 449 -396 116
1161 116 -417 339 -51 245 357 67 107 -123 -564 -203 278 153 -60 -972 -132 -140 204 684 -652 -196 523
1182 523 -390 -101 60 207 73 -189 -50 -340 512 719 -280 368 865 204 -40 -70 16 -226 336 -411 797
1203 797 429 -116 8 -208 401 -255 445 332 -164 -152 146 -336 -391 448 -380 -269 -177 -122 28 -68 182 -129
1225 -129 112 108 -240 305 46 -343 -625 17 -93 -170 -69 -149 -236 -75 -506 184 75 -540 50 -842 -14 326
1247 326 119 205 -280 695 545 -149 456 583 -303 -621 -181 373 729 -336 -200 11 -115 185 579 -316
1267 -316 -675 637 155 -344 -56 92 796 551 -170 -350 -179 -172 354 229 -365 -373 288 -596 386 -397 -497
1288 -497 421 227 -9 -356 -38 611 312 -14 -471 -408 112 -293 -524 -109 -116 -272 -357 -245 921 -85 23
$$ packed form
1140c59K28L04n34j04K98M7k71M40J46k79N5L80o1m31k25P89k12n69Q07q45N12
1161A16n33P56l90K96J12k90M0k30m41L61M81j25k13r12Q40qL44M80j336M56P19
1182E23r13K89J61J47j34k62J39k90Q52K07r99O48M97o61k44l0Q6k42N62p47J208
1203G97l68n45J24k16O09o56P00j13m96J2K98m82n5Q39q28J11R2N5J50r6K50l11
1225a29K41ml48N45k59l89k82O42j10p7J01q0q7J61m31O90j09o15N90q92Q28L40
1247C26k07Q6m85R75j50o94O05J27q86l18M40N54L56j065J36K11j26L00L94q95
1267c16l59J312m82m99K88J48P04k45p21j80J71PN26j25n94qO61q84R82p83j00
1288d97R18j94k36l47L18O49k99l26m57O3N20m05k31M15pj56q5J12J166j006J08
$$ plain form
1309 23 531 -131 363 -224 -260 -1005 250 -81 -446 -371 111 29 -253 -395 711 364 364 529 -303 -637 548
1330 548 355 307 -230 -187 326 8 508 642 49 570 -29 525 -285 139 -538 -50 -215 371 188 -53 721
1351 721 -517 -617 -352 454 498 445 481 799 -589 -649 -810 340 155 -169 205 608 292 -215 603 21
1371 21 435 -84 294 -398 -699 469 -188 644 -168 282 -138 -509 -119 -183 -125 -341 464 -510 33 387 744
1392 744 71 327 -673 -680 -330 -19 -329 404 68 406 462 -175 261 107 -194 714 -76 -389 415 -243 -381
1413 -381 70 -97 716 -15 -556 -383 168 -823 -73 -24 -163 226 -101 -118 -495 -22 350 553 -73 -230 536
1434 536 -396 304 -154 56 403 192 276 -118 265 -199 210 -633 203 -290 189 -187 -588 475 -338 -819
1454 -819 309 -386 -427 -300 156 -208 162 1109 399 -182 540 850 9 -135 -605 -194 5 489 701 -350
$$ packed form
1309B3N08o62M94n87l6p45J255l31l65P5M82q2k82j42J106l47%J65q32l34J185
1330E48j93m8n37M3N13l18N00J34n93N21n99N54q10M24o77M88j65N86j83k41P74
1351G21j238j00K65Q06M4n3L6L18j388o0j61J150j85l24L74M03l16n07Q18n82
1371B1M14n19L78o92l01J168o57Q32q12M50m20l71L90o4N8k16Q05r74N43L54L57
1392G44o73K56j000pL50L11l10P33l36L38N6o37M36j54l01R08p90l13Q04o58j38
1413c81M51j67Q13p31n41J73N51r91P50M9j39L89l27j7l77M73L72K03o26j57P66
1434E36r32P00m58K10L47k11Q4l94L83m64M09q43Q36m93M79l76m01J063q13m81
1454h19J128o95m1J27M56l64L70R47p10n81P22L10q41j44m70M11J99M84K12j051
$$ plain form
1474 -350 418 674 24 699 -371 247 -223 397 765 358 339 291 -111 -727 482 3 -289 -92 730 691
1494 691 -381 148 -319 -591 471 318 -122 -12 76 -257 -602 357 305 352 113 -338 -897 -13 -890 -31
1514 -31 577 629 -185 -724 429 -568 1098 85 -83 -539 -115 97 -152 -68 530 168 192 61 354 -191
1534 -191 -947 79 228 -338 -314 -89 -469 -339 55 7 178 -269 -84 632 653 -177 232 -304 154 575 76
1555 76 -181 82 -723 -107 -77 201 -482 -48 35 123 -263 14 -207 489 245 -430 -501 447 532 -493 822
1576 822 -110 420 -306 -204 312 -685 -156 52 -287 44 765 -312 -164 -376 340 -592 -705 456 -192
1595 -192 -43 -35 127 840 123 632 11 -105 -305 -562 -489 199 -113 -120 163 490 -202 32 -399 -406 -417 199 -60
1618 -60 39 317 -446 138 222 276 -261 206 137 454 138 98 -32 -689 -78 -738 -53 341 -245 -219 -258 578 23
$$ packed form
1474c50P68K56o50O75j070O18m70O20L68m07j9m8m02o16J209m79k92J97Q22l9
1494F91j072N29m67k72J062j53m40J10Q8l33l45R59n2M7k39m51n59Q84q77Q59
1514c1O08N2q14n39J153r97J666j013j68m56M24K12k49Q4N98l62K4j31K93n45
1534a91p56J026J49n66K4K25l80J30L94m8J71m47J85P16K1q30M09n36M58M21m99
1555G6k57K63q05O16L0K78o83M34Q3Q8l86K77k21O96k44o75p1R48Q5j025J315
1576H22r32N30p26J02N16r97N29K08l39L31P21j077J48k12P16r32j13J161o48
1595a92J49QJ62P13p17N09o21j16k00k57P3O88l12pK83L27o92K34m31pj1O16k59
1618f0R9K78p63N84Q4N4n37M67o9L17l16m0j30o57O11o60O85L94n86K6l9Q36n55
$$ plain form
1641 23 357 -649 228 135 -265 -229 387 690 -187 -114 -264 -523 -592 -424 35 -473 -514 -724 -945 506 256
1662 256 -766 262 720 -327 -559 -401 396 -270 31 -656 44 -769 -353 223 373 366 -748 97 483
1681 483 -280 -414 -153 64 -282 -429 231 -784 -112 622 -592 -490 570 573 196 -53 239 490 37 340
1701 340 80 70 -294 -213 120 -332 844 44 312 -704 -217 -217 -55 363 -180 -33 363 -365 -440 -219 -54
1722 -54 73 -340 493 969 -229 -58 -133 -26 -439 657 804 211 -95 -247 -222 -558 562 -261 -749 426
1742 426 828 32 76 -173 -289 48 -275 142 426 113 -193 400 -239 106 119 -87 -73 -96 428 229 -190
1763 -190 -338 54 -553 281 -465 -617 237 309 -8 315 -99 85 141 165 -234 -404 523 186 -219 484 69
1784 69 -52 479 -22 26 -164 165 527 45 -231 88 132 -18 424 -453 520 495 402 417 -124 -293 -447 -837
$$ packed form
1641B3L34j006Q77r3m00L6O16L03q77P3j50k59o9J68M59n08m1k10k21J451k50
1662B56j022J028M58j047k32J58P97o66L01o87P00q13M16N76J50pj114Q45L86
1681D83p63j34K61K17l46j47O60j015O72P34j214J02J060Ll77k49K92K51m53L03
1701C40k60j0l64Q1L33m52J176q00K68j016M87%J62M18n43J47L96p28p5K21J65
1722e4J27m13Q33M76j198J71p5J07m13J096J47n93l06j52K5l36J120q23m88J175
1742D26M02p96M4k49j16L37l23M17K84l13l06N93o39L45J3k06J4k3N24j99m19
1763a90j48L92o07Q34p46j52Q54P2l17L23m14J84N6K4l99j70R27l37m05P03m15
1784F9j21N31n01M8j90L29L62m82k76L19M4j50M42q77R73k5r3J5n41j69j54l90
$$ plain form
1806 -837 394 -73 -274 -101 399 357 -47 -100 -317 756 60 -370 298 231 -108 -792 177 -446 425 -528
1826 -528 -642 235 -24 333 58 199 578 -618 -745 -331 282 120 157 -213 -528 583 487 -291 26 -186
1846 -186 -429 -2 -114 193 -653 588 512 -14 -74 -136 -309 -506 -182 287 919 163 -701 243 87 -284 11
1867 11 -568 643 67 276 -305 -36 23 452 -161 171 -876 73 -284 356 -69 293 229 260 -626 109 -613
1888 -613 124 585 -102 -131 -487 327 -198 -278 158 71 -133 -510 -249 307 -292 181 293 267 -9 -470 -85
1909 -85 -233 -583 -208 -396 -194 -286 131 -627 633 -440 424 558 343 -369 620 -441 346 -66 -208 6
1929 6 440 -229 391 -162 409 256 -3 564 38 -170 691 344 385 -300 -1085 162 -568 258 -645 -181 -446
1950 -446 940 -13 -246 -507 337 76 -369 568 179 155 -338 -266 471 122 -126 -750 305 -456 -219 -204
$$ packed form
1806h37J231m67k01J73N00m2m04n3k17J073o96m30O68o7l39o84R69o23Q71r53
1826e28j14Q77k59L57k75J41L79j196j27M14O13j62L7l70l15J111r6p78L17k12
1846a86k43M27j12L07q46J241p6n26o0o2j73j97L24M69O32p56q64R44j56l71K95
1867A1n79J211n76K09n81K69N9M29o13L32j047R49l57O40m25L62o4L1q86P35p22
1888f13P37M61o87k9l56Q14n25q0M36q7k04l77K61N56n99M73J12k6k76m61L85
1909h5j48l50L75j88K02r2M17p58J260j073Q64J34k15p12R89j061P87m12j42K14
1929FM34o69O20n53N71j53k59N67n26k08Q61l47M1o85p85J247p30Q26r03M64k65
1950d46J386r53k33k61Q44k61m45R37l89k4m93P2P37l49k48o24J055p61K37J5
$$ plain form
1970 -204 90 -307 97 -514 -87 -738 -117 488 -152 -445 436 -550 -66 299 -230 -596 -283 -305 -324 206 -464
1991 -464 296 87 28 -734 376 -319 785 624 78 295 915 -464 71 -41 -195 429 -306 -159 376
2010 376 100 -205 208 -101 149 -331 -371 -188 -75 -43 -302 335 -442 556 -490 969 397 -33 -47 -144 283
2031 283 -196 520 210 -245 -623 505 134 -155 189 -322 70 161 273 -177 469 -317 -28 -654 -286 -338
2051 -338 54 100 418 184 -150 41 216 -344 45 449 -5 14 -195 -419 -448 35 -283 -26 -297 -399 371
2072 371 -289 550 -125 -474 -289 355 -83 144 -135 349 197 594 -271 152 55 834 562 -487 116 226
2092 226 257 416 288 282 166 -815 561 -221 145 280 146 266 404 20 -576 -536 -164 411 -578 -169 -235
2113 -235 363 516 -563 -229 287 -258 315 513 814 -97 -591 -7 -425 293 -104 452 -279 -627 298 -554
$$ packed form
1970b04K94l97M04o11M27o51O21O05o40k93Q81r86M84L65n29l66L13k2j9N30o70
1991d64P60k09n9p62J110o95J104j61n46K17O20j379N35j12j54O24p35J47N35
2010C76k76l05M13l09K50m80m0J83J13L2k59O37p77R98j046J459n72m30j4r7M27
2031B83m79P16l10m55l78J128l71k89L44n11L92R1J12m50O46p86K89o26L68n2
2051c38L92M6L18k34l34J91J75n60L89M04m54J9k09k24k9M83l18K57k71j02P70
2072C71o60Q39o75l49J85O44m38K27k79M84j52L97q65M23r7P79k72j049O03J10
2092B26L1J59j28oj16r81J376p82L66J35j34J20J38l84n96M0L72N75r89M09o6
2113b35N98J53j079L34N16n45N73J98L01r11m94N84m18P18l97N56p31l48R25q52
$$ plain form
2133 -554 -437 58 105 681 768 -251 456 463 264 149 -84 333 -587 -319 -41 -244 -273 -118 -121 61 -131 96
2155 96 -115 174 -54 -656 543 -142 -146 359 202 748 -259 147 -323 -90 -124 268 -488 -357 -17 -1070
2175 -1070 405 -234 -132 -223 -452 -424 255 111 -194 33 -179 59 191 47 32 240 -838 894 -193
2194 -193 -369 -10 -101 -275 114 133 536 174 -467 119 -950 256 -550 -489 -431 -212 802 -740 294 182
2214 182 -192 -82 265 -828 -432 133 -318 168 -429 539 299 -33 -199 274 286 740 515 402 453 698
2234 698 657 331 15 -207 257 611 -189 352 -286 -353 42 519 269 -685 271 396 -107 -125 114 -571 398
2255 398 -395 -223 678 87 720 723 441 -406 -63 33 914 -51 -131 40 98 -126 -184 457 432 -695 108 -435
2277 -435 299 328 -87 -393 73 -226 97 562 -22 534 296 -64 -2 -514 -45 -209 -1389 333 282 -676
$$ packed form
2133e54J17M95M7N76Q7j019P07Pj99j15k33M17r20K68K78k03k9J55lJ82j92K27
2155I6k11K89k28o02J199o85mN05j57N46j007M06m70K33l4L92p56J31L40j053
2175a070J475o39J02r1k29K8O79j44l05K27k12K38J32j44j5K08j078J732j087
2194a93j76L59r1j74L89J9M03l62o41N86j069J206q06O1N8K19J014j542J034j12
2214A82l74J10L47j093L96N65m51M86n97R68k40l32j66M73J2M54k25j13N1K45
2234F98m1l26l16k22M64L54q00N41o38o7L95M77k50r54R56J25n03j8K39o85R69
2255C98p93J72R01n91O33Lk82q47L43R6Q81r65q0J71N8k24n8O41k5j127Q03n43
2277d35P34K9m15l06M66k99L23M65n84N56k38l60O2n12M69j64j180J722n1r58
$$ plain form
2297 -676 -719 274 994 -32 75 26 -552 -205 814 279 39 -18 -133 -288 600 257 623 380 43 402
2317 402 335 484 34 204 -218 -316 484 -19 -699 -114 -9 267 162 -55 -212 -127 145 -4 150 -635 627
2338 627 36 -558 -349 89 -251 -414 101 821 1131 -197 381 74 -379 131 144 452 273 -437 -237 -185
2358 -185 158 108 -576 536 -16 462 -449 736 -160 745 423 246 529 -666 321 -278 -514 -745 -410
2377 -410 401 -119 -432 527 -167 -504 26 193 789 -130 148 44 -400 184 7 82 -201 362 -91 124
2397 124 -357 -421 -101 92 26 121 75 431 -178 28 -166 -153 14 490 469 -176 -177 258 262 -130 -360 -36 494
2420 494 -34 -669 -482 165 824 -297 210 119 -26 -257 -348 410 231 -657 -60 407 350 256 -155 272 -108
2441 -108 -223 38 215 176 563 -18 501 671 520 511 -119 -58 -113 -70 234 349 525 -89 32 642 28 -126
$$ packed form
2297f76m3R93P20j026J07m9n78L47J019n35k40n7j15j55Q88l43L66k43l37L59
2317D02o7J49m50J70m22r8Q00n03o80N85J05K76j05k17j57Q5K72j49J54p85J262
2338F27n91n94K09M38l40j63N15P20L10j328N78l07m53N10J3L08j79p10K00N2
2358a85L43n0o84J112n52M78r11J185q96R05l22j77K83j195R87n99k36k31L35
2377d10Q11n20l13R59o94l37N30J67N96r19K78j04m44N84j77P5k83N63m53K15
2397A24m81o4L20J93o6R5m6L56o09K06j94J3J67M76k1o45jM35Ml92k30L24N30
2420D94n28o35J87O47O59j121N07r1j45k31r1P58j79q88N97M67n7r4m11M27l80
2441a08j15K61J77l9L87n81N19J70j51ro30O1n5M3L04J15J76o14J21O10o14j54
$$ plain form
2463 -126 272 835 182 344 583 246 -326 95 305 -236 113 254 411 446 -743 1025 126 -26 379 363
2483 363 329 -356 805 252 341 648 151 -351 201 546 -253 -229 -728 486 41 258 -11 379 -437 33
2503 33 -16 493 249 -765 -1024 -427 208 138 -280 273 -33 -430 -27 391 353 159 -300 -89 266 -457 -428
2524 -428 -451 -364 -441 586 -178 412 355 424 -404 -670 -337 -651 -765 -413 -262 -118 -908 440 839 123 399
2545 399 -220 579 -228 52 535 200 514 -8 118 -198 -26 -75 -455 -358 -129 475 116 348 511 -642
2565 -642 62 -399 -260 -392 -410 -336 55 207 -132 45 879 585 -18 -140 362 -325 -154 -353 421 -77 53
2586 53 -376 -1160 -322 -36 531 949 358 -187 -626 -1219 683 -709 720 -190 634 68 399 91 -435
2605 -435 390 1021 -51 -525 -738 -60 -504 439 71 -782 381 -150 228 877 -134 -232 231 521 255
$$ packed form
2463a26L98N63o53J62K39l37n72M21K10n41L49J41J57L5j189J768q99j52M05j6
2483C63l4o85J161n53Q9L07m97n02N52L45p99K4m99J214m45K17k69L90q16M70
2503C3m9N09k44j014k59N97O35p0m18N53l06l97M03M18l8j94m59K11L55p23K9
2524d28k3Q7p7J027p64N90n7O9q28k66L33l14j14L52J51J44p90J348L99p16K76
2545C99o19P99q07K80M83l35L14n22J26l16J72m9l80R7K29O04l59K32J63j153
2565f42P04m61J39j32j8P4L91J52l39J77Q34k94o03j22N02o87J71j99P74m98J30
2586E3m29p84Q38K86N67M18n91n45m39n93J902j392J429r10Q24n66L31l08n26
2605d35Q25O31j072m74k13O78m44R43l68q53J163n31L78O49j011r8M63K90k66
$$ plain form
2624 255 57 -170 -596 323 -38 656 428 918 474 617 -294 658 152 -472 -387 -203 -583 311 -14 601
2644 601 90 -168 -368 -366 213 -11 -361 51 734 -203 -171 469 -60 37 -414 18 224 -423 -706 485 -414
2665 -414 109 164 -49 -646 121 671 316 -418 -64 201 -51 369 -923 739 -474 -73 -475 -298 378
2684 378 363 101 28 -512 -156 457 492 652 -262 -279 16 -925 680 684 255 403 432 -227 -384 -306 278 -570
2706 -570 -426 -12 101 -279 -481 -468 131 -181 -104 -232 -523 231 -920 155 291 245 -670 400 -196 112
2726 112 233 391 540 -744 301 229 -124 -55 103 -220 234 389 102 -123 369 -271 777 362 -438 56
2746 56 -291 -23 -902 586 -117 -529 254 -240 -408 -241 -45 217 180 -107 220 268 -614 207 -486 -130 -115
2767 -115 -1006 -76 -321 111 -92 444 -15 848 483 -233 738 112 -325 244 -228 246 85 -449 732 202
$$ packed form
2624B55j98k27m26R19l61O94k28M90m44J43r11R52n06o24Q5J84l80Q94l25O15
2644F01n11k58k00KN79k24l50M12O83r37L2O40n29R7m51M32K06o47k83J191q99
2665d14N23N5k13n97P67N50l55p34L54K65k52M20j292J662j213M01m02J77O76
2684C78j5k62p3n40L56O13L5J60r14j7K95r41J605Mm29J48K9o59j57P8N84q48
2706e70J44M14J13l80k02J3N99l12P7j28k91P54j151J075J36m6r15J070n96L08
2726A12J21J58J49j284J045p2l53O9J58l23M54J55k87k25M92o40J048m15q00M94
2746E6l47K68q79J488p03m12P83m94j68J67J96K62l7k87L27M8q82Q21o93L56J5
2767a15q91R30k45M32k03N36m59Q63l65p16R71o26m37N69m72M74j61n34J181n30
$$ plain form
2787 202 -83 405 -480 234 -420 497 354 563 -254 132 328 748 -80 376 296 -5 -142 -17 -46 -79 146
2808 146 -596 -68 880 696 -338 615 -372 180 -20 457 742 69 298 -496 458 -264 353 -498 72 441
2828 441 -179 228 -324 -1081 -332 100 57 -219 95 62 -222 187 166 -161 -82 -665 233 354 -257 319 -256
2849 -256 46 -736 441 -321 375 -408 618 -468 -209 -73 175 128 -52 -172 -203 243 916 338 -502 -679
2869 -679 -266 33 -266 169 -498 110 -138 542 485 129 -136 138 -456 -60 68 158 -153 -448 -343 -563 -485
2890 -485 126 -603 -647 -427 -199 -685 180 319 435 -50 -71 -199 -141 -340 575 278 -21 279 113 104 647 547
2912 547 21 183 -227 20 -796 -215 1069 -38 133 -573 -676 246 148 55 -70 -3 352 -661 -703 391
2932 391 -175 221 -353 445 52 -185 103 -103 -292 603 -321 -677 -259 261 263 319 -34 -362 -202 291 -391
$$ packed form
2787B02k85M88q85P14o54R17j43K09q17L86J96M20q28M56q0l01j37J25k9l3K25
2808A46p42N28R48j84j034R53r87N52k00M77K85o73K29p94R54p22O17q51N70L69
2828D41o20M07n52p57P49M32m3k76L14l3k84M09k1l27P9n83Q98J21o11N76n75
2849b56L02p82J177p62O96p83J026j086K59J36K48m7j80j20l1M46O73n78q40j77
2869f79M13K99k99M35o67O08k48O80n7l56k65K74n94L96J28R0l11k95J05k20P8
2890d85O11p29m4K20K28m86Q65J39J16m85k1j28N8j99R15k97k99L00j66rN43j00
2912E47n26J62m10K47q16N81J284j107J71p06j03R22r8r3j25O7L55j013m2J094
2932C91n66L96n74P98l93k37K88k06j89Q95r24l56M18N20KN6l53l28J60M93o82
$$ plain form
2953 -391 146 -583 172 418 43 -441 -187 -115 -111 456 426 -190 -216 -1107 204 191 498 573 -75 114 -443 177
2975 177 -418 404 463 182 -253 572 -95 -883 -171 -118 -810 -572 -120 -40 -52 637 518 221 218 -361 -619 -288
2997 -288 -21 -50 -291 349 -182 -350 -287 -124 672 137 -509 -180 -615 366 -209 -515 -721 740 -27 -248
3017 -248 328 11 356 135 351 -240 -253 226 -148 280 -61 -247 -439 -218 -612 -581 -918 -191 187 321 -384
3038 -384 27 -136 -57 -87 -685 61 -320 70 -173 -48 -318 -178 -36 16 -837 26 -536 -25 -768 384 403
3059 403 -512 -107 -536 -648 339 -285 -625 -87 62 489 -65 -803 -352 -353 -195 -235 -677 -204 -240 506 -567
3080 -567 934 601 -586 2 -501 371 101 -422 488 -183 -438 -190 -50 -109 406 547 -174 348 -344 -445
3100 -445 30 -799 60 56 1274 463 93 -118 -418 -211 578 -114 239 -162 167 -122 943 447 -261 332
$$ packed form
2953c91N37p29P55K46l75m84K54P2MN67l0o16k6q91J311j3L07P5o48J89n57O20
2975A77n95Q22N9k81m35Q25o67p88P12N3o92K38M52Q0j2O89j19k97ln79k58L31
2997b88K67k9k41O40n31j68O3J63P96n35o46L29m35R81n75l06k06J461p67k21
3017b48N76l17L45k21K16n91j3M79l74M28l41j86j92K21l94L1l37P27L78J34p05
3038c84M11j63P9l0n98P46l81L90k43J25k70J40J42N2q53Q63n62N11p43J152J9
3059D03r15M05m29j12R87o24l40N38J49M27n54p38M51jJ58m0m42M73l6P46j073
3080e67J501l33j187N88n03Q72k70n23R10o71k55K48J40n9N15J41p21N22o92j01
3100d45M75q29Q59mJ218q11l70k11l00K07P89o92L53m01L29k89J065m96p08N93
$$ plain form
3120 332 436 471 -160 -384 -374 -330 250 -361 -319 -31 -350 -242 -109 272 -659 85 -98 447 -43 408 -460
3141 -460 361 203 380 370 -371 -330 -207 -238 -491 -203 263 -130 -1172 197 1 -468 -404 638 -321 665
3161 665 -268 7 -169 1086 -131 309 -11 -10 -20 -475 54 -558 621 -12 107 -342 -418 503 -506 101
3181 101 362 -282 -6 54 366 -462 -45 100 -319 255 -298 257 122 362 -619 322 -33 133 279 121
3201 121 -175 -23 -554 -89 737 -600 251 -134 -65 215 -200 -339 294 536 64 -208 152 247 495 702
3221 702 -100 -15 434 -23 170 -293 -12 134 355 -67 825 -410 381 140 355 492 -88 -733 197 -51
3241 -51 102 620 -614 -514 23 -108 334 -554 -75 -233 -408 528 -444 -80 -356 196 -174 -160 408 -22
3261 -22 286 -71 -527 39 -364 -583 121 -97 125 166 -833 306 -65 234 108 100 -157 884 -373 -305 -388
$$ packed form
3120C32J04L5o31k24J0M4N80o11M2K88l19J08J33L81r31P44j83N45m90M51q68
3141d60Q21j58J77j0p41M1J23l1k53K88M66l93j042J369j96m69O4J042r59R86
3161F65r33K75j76J255j217M40l20Jj0m55N29o12J179o33J19m49p6R21j009O07
3181A01K61o44K76O0L12q28M17J45m19N74n53N55j35K40r81R41l55J66J46j58
3201A21k96J52n31M65Q26j337Q51l85O9K80m15j39O33K42m72k72L60R5K48K07
3221G02q02Q5M49m57J93m63K81J46K21m22Q92j235P91k41K15J37n80o45R30k48
3241e1J53N18j234J00N37j31M42q88M79j58j75R36r72L64k76N52l70J4N68m30
3261b2L08l57m56N66m03k19P04k18K22M1r99J139l71K99j26qk57J041j257O8q3
$$ plain form
3282 -388 -184 -65 -116 199 103 521 -494 186 -528 -460 -129 -105 -110 -195 -7 335 91 -628 606 0 -211 232
3304 232 -355 -199 -339 -445 123 -4 168 -279 -666 -401 126 265 -159 199 92 197 389 171 229 233 -15
3325 -15 318 -55 354 1015 283 -120 374 -5 565 696 -69 24 -236 499 192 -281 66 158 556 -886 -524
3346 -524 -168 -716 257 643 -14 -43 345 -162 36 -462 -992 271 210 -537 -403 -458 202 -316 537 -117 670
3367 670 641 95 -1518 -256 -277 -551 289 598 256 -509 -119 -1196 472 163 -79 226 -638 -196 396
3386 396 -38 -296 767 531 -470 242 -119 -575 -393 -269 -211 96 455 -88 302 -399 -398 421 587 -90
3406 -90 -63 9 572 -171 947 764 -765 -264 914 112 684 -677 -437 -222 -717 -130 -40 119 -69 55
3426 55 683 415 -115 -16 2 109 44 160 -348 -697 -42 -90 -14 -413 -113 347 -312 12 -6 72 253 -523 600
$$ packed form
3282c88K04J19n1L15r6M18j015O80p14O8L31K4nq5J88L42k44p19J234o06k11M43
3304B32n87J56j40j06N68j27J72m47l87K65N27J39m24L58j07J05J92k18N8Mk48
3325a5L33l73M09O61p32m03M94l79N70J31p65R3k60P35l07m73L47R2L98j442L62
3346e24L56n48R73L86o57k9L88n07J98m98n30J263o1p47J34n5O60n18Q53o54P87
3367F70k9n46j613J262k1k74Q40L09l42p65L90j077J668l09k42L05q64M42N92
3386C96m34k58J063k36j001P12l61m56J82J24N8L07L59n43L90p01JQ19J66o77
3406i0K7P2N63p43J118j83j529N01J178q02N72j361K40K15m95N87R0J59j88J24
3426E5O28k68n30R9J8J07o5J16n08l49O55m8P6l99L00M60o59L24j8P8J81p76J123
$$ plain form
3449 600 -356 -224 -872 829 56 185 192 -69 -12 -232 -249 -32 420 -629 -430 -256 321 183 193 331 529
3470 529 -242 271 559 -426 -446 184 -521 -314 -31 -154 -352 175 -17 -67 -675 -172 182 26 35 -254 90
3491 90 615 -144 -511 -103 647 139 658 -217 343 1088 190 685 -129 124 92 222 611 121 3 -455 240
3512 240 406 -435 210 -120 -444 -14 145 -83 543 332 223 426 367 -152 417 407 445 411 334 597 403 -548
3534 -548 -443 -9 -846 511 6 -51 26 -391 11 -559 192 964 503 -563 420 162 505 -63 340 -47
3554 -47 -466 8 -306 834 -382 144 -228 -101 319 376 310 258 36 434 572 145 62 -125 564 257 220
3575 220 -40 17 -84 249 557 72 761 -2031 -235 161 357 445 -318 -267 -237 -146 436 -225 188 32 435
3596 435 -479 960 266 182 -554 65 -186 335 -208 26 189 -251 -154 -197 -484 -946 -461 474 -110 361 374
$$ packed form
3449F00r56J32o48J701p73J29Pk61N7k20j7K17M52j049J99J74N77j38J0J38J98
3470E29p71N13K88r85k0O30p05K07K83j23j98N27j92n0o08N03L54j56Rk89L44
3491I0N25p59l67M08P50n08N19q75N60P45q98M95q14K53l2J30L89m90j18m58O95
3512B40J66q41O45l30l24M30J59k28O26k11j09K03n9n19N69j0L8l4p7K63j94r51
3534e48J05M34q37J357n05n7P7m17M02n70P51P72m61j066R83k58L43n68M03l87
3554d7m19M74l14J140j216N26l72J27M20N7o6n2k22L98J38m27q3j87O89l07l7
3575B20k60N7j01L33L08m85O89k792J796L96J96Q8p63N1L0R1N82o61M13j56M03
3596D35r14J439o94q4p36O19k51N21n43K34J63m40R7m3k87m62M85R35n84M71J3
$$ plain form
3617 374 -583 285 128 -441 72 329 -145 121 78 -432 -256 -223 478 -399 -401 286 181 -206 507 125 -168
3638 -168 -95 -345 -446 -216 260 913 270 -186 267 185 -185 34 -138 -432 -604 116 96 199 -530 930 53
3659 53 661 -85 55 -398 -183 -378 -362 731 287 400 -620 -313 593 -251 -746 -283 190 -38 -393 -254
3679 -254 -98 257 376 18 -578 -95 412 -765 -553 -245 311 74 206 -439 -538 -311 423 476 125 -709
3699 -709 -326 123 -259 384 -167 210 558 -74 654 304 -147 -574 245 495 -581 -438 522 -157 -101 352
3719 352 415 679 -606 43 202 117 -111 618 -418 64 -13 630 315 294 38 -495 43 59 32 -456 -324
3740 -324 -54 -378 -8 -770 -291 188 -417 19 2 -18 175 -25 366 63 -166 270 42 2 408 295 432
3761 432 685 531 -220 -274 1029 20 -318 101 -203 -430 -75 -167 -236 -743 112 -33 544 207 236 126 23
$$ packed form
3617C74r57Q68j57n69N13K57m74K66m3n10J76L3P01q77kO87j05l87P13l82k93
3638a68P3k50j01K30M76O53o43m56M53q2l70K19j72k94j72P20k0J03p29J460q77
3659E3O08p46J40m53K15j95J6J093m44J13j020L07R06q44m95M63M73k28l55J39
3679b54J56L55J19l58n96M83N07j177K12L08N56k37J32o45r9K27P34N3l51q34
3699g09L83M49l82O43n51L77L48o32P28l50m51m27Q19K50j076J43R60o79N6M53
3719C52O3K64j285O49J59q5k28P29j036M82p7O43l15k1k56n33N38J6k7m88J32
3740c24K70l24L70p62M79M79o05M36j7k0J93k00L91l03k29M36k28m0M06j13J37
3761D32K53j54p51n4J303j009l38M19l04k27L55r2o9n07Q55j45N77l37K9j10j03
$$ plain form
3782 23 487 -68 24 -145 -375 -430 -415 394 70 -36 266 -292 -881 -302 -286 367 245 -160 -129 -670 287 463
3804 463 452 -666 557 -158 -851 850 -782 -834 132 -365 304 186 -191 -360 563 -669 336 143 -235
3823 -235 -13 -19 -351 256 -223 228 -364 -117 258 598 653 767 -22 -200 237 19 1052 -405 479 74
3843 74 95 -382 -238 -77 396 -95 127 201 285 756 -121 259 -299 -586 343 678 38 322 148 -696 -17
3864 -17 376 636 -334 -21 401 -291 452 528 58 377 449 327 326 488 -113 162 40 178 -476 -207 478 459
3886 459 -31 247 -13 -397 427 -210 371 -818 83 -672 -340 -665 -370 -359 706 984 -158 -388 152
3905 152 -300 96 549 780 375 274 257 -625 -363 -183 393 -148 -124 -395 -89 98 -255 -555 -82 465 -65
3926 -65 560 87 988 -156 328 -69 -94 293 706 196 624 62 481 -33 -332 253 -420 190 -421 -558
$$ packed form
3782B3M64n55R2j69k30n5J5Q09l24j06L02n58n89N79J6O53j22m05L1n41R57J76
3804D63j1j118J223p15o93J701j632n2R66m97O69j18l77j69R23j232J005j93l78
3823b35K22ol32O07m79M51n92K47L75L40N5J14p89j78M37k18J033j457Q84m05
3843G4K1m77J44J61M73m91K22P4Q4M71q77L80n58k87R29L35o40K84j74q44O79
3864a7L93K60r70L13M22o92P43P6m70L19P2j22jJ62o01K75j22J38o54K69O85j9
3886D59m90K78k60l84Q24o37N81j189R01p55L32l25K95J1J065K78j142k30N40
3905A52m52L96M53K31m05j01j7q82K62J80N76n41K4k71L06J87l53l00M73N47n30
3926f5O25m73R01j144M84l97k5L87M13n10M28n62M19n14k99N85o73O10o11j37
$$ plain form
3946 -558 -207 203 263 -263 388 -11 632 -137 302 434 296 235 128 -117 -368 -361 -433 662 47 47 -355 -171
3968 -171 249 -602 172 14 -103 1 -135 141 -82 -330 710 -75 -206 -404 -513 -357 206 -472 -63 438
3988 438 -183 317 -106 -142 -630 -75 -427 -378 265 328 -46 197 407 284 64 -819 635 276 -3 -230 -398
4009 -398 528 -149 96 37 308 -30 246 360 -380 -130 150 -141 533 563 -233 -1369 -70 -575 147 343
4029 343 -382 -434 -183 276 599 424 -273 -38 82 -400 546 -352 297 -14 587 377 -96 -257 338 -375
4049 -375 141 44 41 -7 269 67 -273 924 226 14 285 -287 103 -728 -311 -908 -391 -345 29 319 446
4070 446 228 -946 164 152 91 122 44 -407 49 -332 88 165 207 -215 631 -262 -363 1184 419 122 70
4091 70 227 33 -1078 -246 -374 286 -446 172 -301 -122 686 516 -487 101 460 436 121 -458 352 -310
$$ packed form
3946e58L51M10O0n26O51l99O43p69M39J32j38o1j07k45k51Pp2J095o15%m02J84
3968a71M20q51P74j58j17J04j36K76k23k48J040p85j31j98j09J56N63o78M09N01
3988D38o21N00m23l6m88N55l52M9O43O3l74K43K10j23k20q83J454l59k79k27j68
4009c98R26o77K45n9K71l38K76J14p40K50K80k91O74L0p96j136J299n05P22J96
4029C43p25n2K51M59L23j75o97K35J20m82R46q98O49l11O01k10m73j61N95p13
4049c75N16r7lm8K76k02l40J197o98k12K71n72L90q31M17n97N17M6L74K90J27
4070D46k18j174J110j2o1L1p8m51M56l81M20P7M2m22Q46q93j01J547p65k97n2
4091G0J57j94j111Q32j28O60p32O18m73J79Q08j70j003N88L59k4l15n79Q10o62
$$ plain form
4111 -310 -163 288 -263 -521 364 -45 267 -14 -571 463 584 -395 -261 135 248 12 823 296 565 311
4131 311 -283 -146 -60 30 -325 7 -603 121 154 19 136 443 119 -155 -620 159 -253 44 167 263 -827
4152 -827 497 -380 -351 -511 -176 -4 -392 -40 -287 -229 -599 -244 -348 -261 464 198 809 476 259 96 41
4173 41 10 -191 316 -109 206 -626 -167 704 454 -374 -492 -71 -517 678 -236 32 630 472 -397 -810
4193 -810 728 -227 329 294 49 -215 314 105 85 377 257 26 191 -490 -322 -467 710 -524 -386 430
4213 430 -345 -151 39 70 195 -15 -95 -60 -54 -83 184 204 -332 -744 -490 132 -304 975 194 -223 -162 263
4235 263 -87 -667 -81 -122 -435 -36 55 -38 679 547 504 -214 -9 498 -667 -306 -170 5 69 -503 114
4256 114 -348 557 256 222 -714 -390 -361 -104 315 508 182 -148 120 -394 -673 199 568 -162 395 -198 -295
$$ packed form
4111c10J47M51n51k58Q85m09L12k81n57J034J21r79J34L96J13k36Q11n27K69k54
4131C11n94J37Q6R0l55L32o10P24L3j35J17L07l24k74m65P79m12K97J23R6j090
4152h27J324q77K9j60L35J72l88L52k47N8l70L55j04Q7P25k66O11l33k17j63n5
4173D1l1k01N07m25L15q32M59Q71k50q28j18M21m46J195r14K68N98j58q69m13
4193h10J538r55N56l5k45k64N29k09k0K92j20k31J65o81J68j45J177j234J38Q16
4213D30p75J94J90L1J25k10q0L5Ok9K67K0n36m12K54O22m36J279p81m17O1M25
4235B63l50n80N86m1l13L99R1r3P17j32m3p18K05N07j165L61J36J75O4n72O17
4256A14m62R05l01l4r36L24K9K57M19J93l26l30K68n14k79Q72L69p30N57n93r7
$$ plain form
4277 -295 -20 62 -338 128 -189 114 -250 -380 -196 264 382 897 777 178 -32 894 407 232 -734 -431
4297 -431 455 44 30 -212 -160 -349 591 301 -114 -603 79 -166 -27 68 1075 34 -271 496 -156 -23
4317 -23 -338 34 -209 237 338 157 -378 48 -164 -368 171 820 204 -352 -125 -248 -343 -132 -91 -183 148
4338 148 -215 -239 -741 543 134 731 -396 78 206 311 458 -29 -812 354 658 -956 559 -51 871
4357 871 -692 -312 742 -384 56 723 345 -25 -152 88 59 674 281 7 321 -326 174 -114 46
4376 46 -1008 341 -584 615 -194 116 11 417 -480 88 -317 -94 -139 194 -264 -80 -168 11 -73 376
4396 376 -10 -166 -52 -635 72 44 -364 -90 167 353 163 -525 347 498 -643 254 280 403 -245 -507
4416 -507 561 -356 -133 -19 -424 303 281 -263 159 419 -282 114 -15 139 -37 -213 58 -81 582 -101
$$ packed form
4277b95K75Q2m00M66l17L03l64j30J84M60J18N15j20n99k10R26m87j75r66L03
4297d31Q86m11j4k42N2j89R40k90m15m89O82k45J39R5J007j041l05P67o52J33
4317b3l15L72k43M46J01j81n35M26k12k04N39O49o16n56K27j23r5K11M1r2L31
4338A48l63k4n02J284m09N97j127M74J28J05J47m87p83J166L04j614J515o10R22
4357H71j563L80J054j126M40O67l78l70j27K40k9O15l93k74L14o47N00k88J60
4376D6j054J349r25J199q09L10j05M06q97N68m05K23m5L33m58J84q8J79q4M49
4396C76l86j56J14n83P07k8m08K74K57J86j90o88Q72J51j141Q97K6J23o48k62
4416e07J068r17K23J14m05P27k2n44M22K60p01L96j29J54j76j76K71j39O63o83
$$ plain form
4436 -101 -164 -734 160 -904 -464 158 467 14 408 320 575 -256 -488 -228 -189 -534 340 187 155 382 145
4457 145 -192 -307 -397 -403 -132 -281 801 -52 526 -196 -489 -64 -630 459 -206 -398 -271 417 453 106 150
4478 150 104 453 -521 -10 117 -543 -427 294 -334 -818 -273 348 -560 733 -73 -379 653 -146 -14 -519
4498 -519 -297 932 -854 -463 -774 588 -368 -67 182 -169 504 243 -311 86 -34 499 453 -279 -18
4517 -18 -123 -138 -430 70 422 396 -460 -409 3 -66 98 -241 591 -522 114 -283 456 -253 -100 -38 -449 445
4539 445 -553 715 403 163 -436 288 499 -145 -440 -1195 -706 523 -315 722 256 -256 106 64 -33 331
4559 331 -171 -284 -155 -534 150 -123 -138 -501 -18 -697 -272 -45 -246 -166 -581 431 136 -368 409 -373
4579 -373 -376 162 152 168 -453 365 -311 -238 663 -726 370 -757 370 642 606 76 182 386 283 718 523
$$ packed form
4436a01o3n70Q94j064M40O22L09m53L94q8K55q31k32K60L9l45Q74j53l2K27k37
4457A45l37j15r0oK71j49J082q53N78p22k93M25n66J089o65j92J27O88L6l47M4
4478A50m6L49r74N11J27o60J16P21o28m84N45O21r08J293q06l06J032p99J32n05
4498e19K22J229j786L91l11J362r56L01K49l51O73k61n54L97j20N33m6p32K61
4517a8j05j5k92N00L52k6q56N1M12o9J64l39Q32j113O36l97P39p09J53O2m11Q94
4539D45r98J268l12k40n99P24K11o44k95p55M89J229q38J037m66n12L62m2r7L64
4559C31n02j13J29l79O84k73j5l63M83o79M25K27k01Q0m15J012k95n04P77p82
4579c73lN38j0J6o21Q18o76P3R01j389J096j127J127K72l6n30J06K04j03M35j95
$$ plain form
4600 523 -438 92 -101 121 -307 -432 -161 110 -821 -599 488 428 -600 394 -144 -822 -3 -202 -698 -38
4620 -38 423 -251 -250 300 -46 -130 683 760 63 313 -213 -376 195 179 -121 1 -144 -62 91 546 -273 464
4642 464 697 -426 121 -425 -239 -430 56 694 555 533 767 795 -344 309 183 471 523 546 -262 398 154
4663 154 38 -593 203 468 -412 -277 -138 138 429 -535 -196 551 632 73 912 333 451 -408 -514 -30
4683 -30 -204 -649 -352 151 -252 -136 476 181 235 -262 313 -256 269 451 779 96 477 -1012 222 -297
4703 -297 -141 313 265 -402 181 -662 -100 -384 -18 39 85 -518 227 318 -574 -127 226 -747 -69 -96 -153 -42
4725 -42 285 1115 320 744 181 549 134 -117 264 13 -148 130 -728 -226 -409 -419 -433 -357 141 -373 -311 170
4747 170 -1 -238 -94 -205 431 725 -699 -256 -200 622 -233 6 482 -25 235 181 17 -526 -624 221 423
$$ packed form
4600E23r61N30j93K22m28j25K71K71r31K22J087o0j028R94n38o78Q19j99m96O60
4620c8M61o74JN50l46q4Q13P7o97K50n26j63N71j6l00J22j45Q2J53M55q19P37
4642D64K33j123N47n46J86j91M86O38j39k2K34K8j139O53j26K88N2K3q08O60k44
4663A54j16o31P96K65q80J35J39K76K91r64L39P47Q1n59Q39n79J18q59j06M84
4683c0j74m45K97N03m03J16O12k95N4m97N75n69N25J82L28o83L81j489J234n19
4703b97J56M54m8o67N83q43N62k84L66N7M6o03P45R1q92M47L53r73O78k7n7J11
4725d2L27Q30p95M24n63L68m15k51L81k51j61K78q58N02j83j0j4P6M98n14O2M81
4747A70j71k37J44j11O36K94j424M43N6Q22q55K39M76n07K60n4j64n43r8Q45K02
$$ plain form
4768 423 -236 -716 -219 -929 -338 -477 -279 712 -141 -32 152 550 -230 283 1083 -124 -451 360 -131 -658
4788 -658 366 942 -26 -257 -675 -67 170 -455 334 152 -358 74 -550 -124 223 -109 71 -198 667 437
4808 437 124 138 344 -172 514 -329 339 946 73 131 -111 -710 143 1039 -372 194 -720 216 621 -47
4828 -47 555 -133 572 755 -454 19 -626 -117 -366 -10 156 -185 118 -98 -133 318 296 472 138 -349 254
4849 254 484 330 566 3 541 -260 210 571 -685 -759 719 421 -342 358 26 317 411 279 -796 -133
4869 -133 -118 275 -74 -1053 -106 386 -192 19 -54 -1 -276 70 -328 -444 -375 -281 -143 127 438 -168 533 -259
4891 -259 3 191 440 -137 -184 573 330 713 -353 -214 -200 75 132 787 -18 999 199 180 595 -784
4911 -784 502 545 -58 164 -12 640 764 10 -107 -154 191 -126 -342 -59 76 -204 -177 661 -107 182 649
$$ packed form
4768D23o59m80M97p10N91j39J98R91q53J09J84L98p80N13Q00j207l27Q11m91n27
4788f58J024N76r68k31m18O08K37o25P89j82n10M32o24M26L47l32J80k69Q65k30
4808D37l13J4K06n16O86q43O68O07q73N8k42n99Q53Q96j411N66r14R36M05o68
4828d7O02o88P05J83j209M73o45N09k49L56J66l41L03k16l5M51k2J76l34m87O03
4849B54K30j54K36n63N38q01M70L61j256p4J478k98p63P00l32K91R4j32j075O63
4869a33J5L93l49r79R47M92n78K11p3N3k75L46l98j16O9R4J38K70L11o06P01p92
4891b59K62J88K49n77m7P57k43L83j066J39J4K75N7O55q05J017q00j9M15j379
4911g84J286M3o03K22j76O52J24p54j17m7L45l17k16K83J35k80K7Q38p68K89M67
$$ plain form
4932 649 -1050 853 -299 -170 328 196 -22 -611 145 253 -165 -1048 -609 -529 -531 -365 -40 444 193 -139
4952 -139 -95 -532 468 -183 -74 172 -173 -63 37 -109 282 -916 -441 51 -582 24 368 -312 -64 109
4972 109 450 323 295 234 -593 215 -306 121 401 78 -154 430 -27 738 -214 13 835 -34 -702 327
4992 327 -492 -217 140 321 -184 -423 341 121 15 362 -186 -463 -236 -94 -1 561 -145 223 -12 -95 -523
5013 -523 -339 -28 298 -73 612 691 -721 -151 513 272 34 -266 266 866 -64 0 29 -48 209 26 -572
5034 -572 -528 -779 -722 -146 -54 -509 34 820 3 136 555 453 -69 -397 -384 -306 294 978 889 -89 436 671
5056 671 172 -729 -125 199 -489 -223 10 214 -233 -623 113 465 -493 33 646 402 -263 -582 -212 402
5076 402 456 727 -858 -362 39 -96 804 32 189 265 618 278 -340 -133 968 902 407 746 720 63 245
$$ packed form
4932F49j699J903j152J29M98j32k18n89P56J08m18q83M39Q0kJ66L25M84k51l32
4952a39M4m37J000o51J09K46l45J10J00j46L91j198M75M92o33O06L44o80K48J73
4972A09L41j27k8o1q27Q08n21M27K80l23k32N84m57P65r52K27Q22q69o68J029
4992C27q19K75L57J81n05k39P64k20j06L47n48k77K27J42R3N62p06L68k35q3m28
5013e23J84L11L26l71O85P9j412N70O64k41k38l00N32O00r30O4K9p7K57j83n98
5034e72M4k51N7N76R2m55N43P86q17J33M19j02n22l28J3P8O00O84q9r78N25K35
5056F71m99r01O04L24o88K66K33K04m47l90P36L52r58N26O13k44o65l19L70O14
5076D02N4K71j585M96M01j35R00p72J57P6L53l40o18K07J101o6m95L39k6o57J82
$$ plain form
5097 245 -462 89 -797 -121 -41 524 -297 -301 -301 311 180 -132 -638 139 -399 101 550 -845 989 -98 -128
5118 -128 76 -50 -244 421 16 -149 -3 -56 36 -231 -71 315 -480 546 -96 -604 -473 262 -165 -86 -316
5139 -316 217 558 -636 98 -152 95 -38 630 -2 -132 168 343 -736 -105 15 -529 -377 -63 -818
5158 -818 -370 -917 -94 318 -199 -323 213 -106 -97 -149 -11 278 10 -88 221 -200 210 483 -270 393 114
5179 114 -2 264 267 152 83 -96 -89 467 -253 757 -60 656 366 -347 415 102 -100 62 120 74 -1016 -648
5201 -648 432 326 73 -86 447 -373 66 -752 -105 538 340 102 -458 160 28 0 222 272 -348 -484
5221 -484 204 324 185 419 434 255 273 -462 40 -118 -413 -197 804 132 -421 370 71 -399 206 428
5241 428 269 -382 120 -163 124 496 -524 -130 134 -211 83 50 138 82 161 487 -307 -256 531 814 -344
$$ packed form
5097B45p07N51q86O76Q0N65q21m%O12j31l12n06P77n38N00M49j395J834j087l0
5118a28K04j26j94O65m05j65J46n3R2k67J60L86p95J026o42n08J31P35m27P9k30
5139c16N33L41j194P34k50K47j33O68o32j30L00J75j079O31J20n44J52L14p55
5158h18M48n47Q23M12n17j24N36l19Rn2J38K89k68r8L09m21M10K73p53O63k79
5179A14j16K66Lj15o9j79PN56p20J010q17P16k90p13P62l13k02J62N8m6j090L68
5201f48J080j06k53j59N33q20M39q18O47O43j98k38n60O18j32k8K22N0o20j36
5221d84O88J20j39K34J5j79J8p35N02j58k95K16J001o72n53P91k99m70O05K22
5241D28j59o51N02k83K87L72j020L94K64l45K94l3Q8n6P9L26p94N1P87K83j158
$$ plain form
5262 -344 -295 -466 534 466 -170 -271 169 -191 -294 479 -232 185 296 289 411 -58 -838 -380 -1 396 119
5283 119 245 -176 -25 -140 245 -34 -712 -17 820 -424 -176 -73 87 -595 -256 -74 576 -339 -292 381
5303 381 185 278 707 -129 -125 -531 589 -168 -864 89 -502 257 -142 220 -109 -276 -188 208 -383 -122 115
5324 115 41 -358 305 789 49 -335 296 315 102 81 -265 84 -182 399 -259 417 397 850 244 146 -329 -17
5346 -17 91 944 -455 -430 -409 289 -788 -276 102 -158 -32 -757 439 316 228 719 -87 -118 614 -618
5366 -618 -868 99 -510 82 551 -62 233 -892 -416 -89 314 127 721 54 -103 -361 -98 169 39 380
5386 380 982 491 -704 -474 244 -215 267 529 -543 -100 -583 802 -631 666 606 -390 65 180 -152
5405 -152 -331 -317 -8 -339 -455 -146 -10 431 282 -167 424 -35 -239 -169 87 179 -432 371 -69 78 -534
$$ packed form
5262c44M9j71J000o8o36j01M40l60j03P73p11M17J11pJ22m69p80M58L79L97k77
5283A19J26m21J51j15L85k79o78O95Q37j244K48J03J60o82L39J82O50r15M7O73
5303C81j96R3M29q36Mm06J120p57o96R53n91P59l99L62l29j67Q8L96n91K61K37
5324A15p4l99O63M84p40l84O31J9k13k1l46L49k66N81o58O76k0M53o06r8m75L12
5346a7J08Q53j399K5K1O98j077N12L78k60J26p25J196j23q8M91q06l1P32j232
5366f18k50R67o09N92M69o13K95j125M76L27M03j87N94o67j57k58K63K67j30L41
5386C80O02m91j195K30P18m59M82K62j072M43m83J385j433J297o0r96M55J15l32
5405a52j79J4L09l31j16L09J36M41j49m49N91m59k04P0K56R2o11Q03m40J47o12
$$ plain form
5426 -534 -368 337 -584 217 465 153 149 516 -560 -105 -423 -73 -32 -39 -12 -558 806 252 47 -365 -91
5447 -91 -308 -179 161 550 259 294 49 694 172 158 -147 453 -158 241 474 -74 256 170 80 649 119 409
5469 409 -202 -679 -2 -167 -709 129 107 -206 -236 -441 110 70 537 -422 -338 -139 234 -307 -192 993 -141
5490 -141 -187 354 -431 -10 262 -81 1303 774 450 424 -551 144 726 127 -264 -38 410 -473 105 753
5510 753 -572 323 -432 558 -293 -291 409 -185 -16 -351 374 -491 -397 64 -72 -56 -115 59 30 428 16 95
5532 95 -54 -419 620 -1021 -515 151 377 -41 -107 342 -550 223 -742 -311 358 -668 431 -45 22 62
5552 62 473 174 275 317 298 -322 -137 352 -352 -167 -525 52 132 829 376 -441 142 -221 225 -162 94
5573 94 18 555 -454 -129 -511 -37 -443 -557 108 314 -402 -149 74 -595 -572 392 -227 -108 223 -338 516
$$ packed form
5426e34J66P05r21Q01K48l12mL67j076M55l18L50M1pK7n46J364n54k05m12K74
5447i1k17J29L40L89k91L5k45O45n22j4l05O00o11L99K33n48L30q6r0N69n30K90
5469D09o11m77O77j65n42Q38k2l13l0k05N51m0M67r59Q4J99L73n41J15J185j134
5490a41m6N41p85M21K72l43J384n29l24k6r75O95N82n99l91K26M48q83N78O48
5510G53j325Q95p55R90q51KP00n94J69l35P25q65R4M61j36J6n9J74k9L98m12P9
5532I5j49l65J039j641N06O66K26m18o6M49q92P73r65M31O69j026J099m76O7M0
5552F2M11k99J01M2j9o20J85M89p04J85l58N77Q0O97m53q17N83l63M46l87K56
5573I4p6N37j009L25l82M74m06j14O65K06p16K53K23o69K3R64o19J19L31n61Q54
$$ plain form
5594 516 487 416 -789 127 235 -71 428 -552 -3 322 91 -122 -398 -335 -351 -309 306 5 -765 -668 -1042 465
5616 465 -45 -286 58 -324 603 -201 -15 -193 -111 204 -455 -181 -319 -936 214 27 -393 287 574 354
5636 354 429 278 99 -650 -519 -333 -429 -82 109 367 -378 41 173 -80 -63 44 368 377 -160 -848 544
5657 544 -439 -687 1108 -141 -94 -62 -580 -7 -4 616 -70 -980 -645 -249 -282 -423 -68 390 -87 44 530
5678 530 -382 273 -569 -133 350 122 58 26 91 654 255 42 478 288 -184 -337 128 -349 -618 409 308
$$ packed form
5594E16k9p1j205R16J08l06M99r80N49L25k31k13k76O3j6M2O15l01p70R7l74J507
5616D65n10k41L44l82R27q04J86j78Q2L15o59K74j38o17J150j87m20O80K87k20
5636C54P5j51j79p49J31J86r6L47J91K58p45M19J32k53J7J07L24Rn37o88J392
5657E44r83k48J795j249M7L2n18N73LO20o86r10L35L96l3j41L55M58m77J31M86
5678E30r12O55q42M36M83k28o4l2O5N63l99k13M36j90m72j53M65m77k69J027j01
$$ [...]
8191B76
##END NTUPLES=NMR FID
##END=
