##TITLE=1H_IPACAT-34-3
 CDCl3
 64 sc, 
 23.11.2023
##JCAMPDX= 6.0         $$ Bruker NMR JCAMP-DX V2.0
##DATA TYPE= NMR FID
##DATA CLASS= NTUPLES
##ORIGIN= UXNMR, Bruker Analytische Messtechnik GmbH
##OWNER= root
$$ XWIN-NMR		Version 3.5
$$ Thu Nov 23 15:54:13 2023 Russian Standard Time (UT+4h)  she@DPX200
##.OBSERVE FREQUENCY= 200.1313
##.OBSERVE NUCLEUS= ^1H
##.DELAY= (6, 6)
##.ACQUISITION MODE= SIMULTANEOUS
##.ACQUISITION SCHEME= undefined
##.AVERAGES= 32
##.DIGITISER RES= 18
##SPECTROMETER/DATA SYSTEM= spect
##.PULSE SEQUENCE= zg30
##.SOLVENT NAME= CDCl3
##.SHIFT REFERENCE= (INTERNAL, CDCl3, 0, 15.7039)
##AUDIT TRAIL= $$ (NUMBER, WHEN, WHO, WHERE, WHAT)
$$ ##TITLE= Audit trail, XWIN-NMR		Version 3.5
$$ ##JCAMPDX= 5.01
$$ ##ORIGIN= Bruker BioSpin GmbH
$$ ##OWNER= she
$$ F:/spectra/data/she/nmr/H-F/1/audita.txt
$$ ##AUDIT TRAIL=  $$ (NUMBER, WHEN, WHO, WHERE, WHAT)
(   1,<2023-11-23 15:49:14.57 +0400>,<she>,<DPX200>,
      <created by zg, POWCHK disabled, PULCHK disabled
       configuration hash MD5:
       00 E9 B6 7A A2 85 ED C7 34 08 36 98 17 FE 4E 26
       data hash MD5: 16K
       11 A3 8C 7F 2C 4E 30 A5 26 A7 BD 16 24 B9 AE 3A>)
(   2,<2023-11-23 15:54:13.73 +0400>,<she>,<DPX200>,
      <Unknown data manipulation detected
       data hash MD5: 16K
       DC DC E6 CF 5D BF F9 C6 DA 76 11 D2 A0 83 C0 06>)
$$ ##END=
$$ 
$$ hash MD5
$$ 19 04 42 AE 8E 7F 3B F9 02 BE 0F 1B CE 96 F0 C7
##$RELAX= 
##$RELAX= 
##$RELAX= 
##$RELAX= 
##$RELAX= 
##$RELAX= 
$$ Bruker specific parameters
$$ --------------------------
##$DU= <F:/spectra>
##$EXPNO= 1
##$NAME= <H-F>
##$PROCNO= 1
##$TYPE= <nmr>
##$USER= <she>
##$AMP= (0..31)
100 100 100 100 100 100 100 100 100 100 100 100 100 100 100 100 100 100 
100 100 100 100 100 100 100 100 100 100 100 100 100 100 
##$AQSEQ= 0
##$AQ_mod= 1
##$AUNM= <au_zg>
##$AUTOPOS= <>
##$BF1= 200.13
##$BF2= 200.13
##$BF3= 200.13
##$BF4= 200.13
##$BF5= 200.13
##$BF6= 200.13
##$BF7= 200.13
##$BF8= 200.13
##$BYTORDA= 1
##$CFDGTYP= 0
##$CFRGTYP= 5
##$CHEMSTR= <none>
##$CNST= (0..31)
1 1 145 1 1 1 1 1 1 1 1 1 1 1 1 1 1 1 1 1 1 1 1 1 1 1 1 1 1 1 1 1 
##$CPDPRG= <>
##$CPDPRG1= <>
##$CPDPRG2= <>
##$CPDPRG3= <>
##$CPDPRG4= <mlev>
##$CPDPRG5= <mlev>
##$CPDPRG6= <mlev>
##$CPDPRG7= <mlev>
##$CPDPRG8= <mlev>
##$CPDPRGB= <>
##$CPDPRGT= <>
##$D= (0..31)
0 1.2 0 0 0 0 0 0 0 0.06 0 0.03 0 0 0 0 0.0002 0 0 0 0 0 0 0 0 0 0 0 0 
0 0 0 
##$DATE= 1700740154
##$DBL= (0..7)
120 120 120 120 120 120 120 120 
##$DBP= (0..7)
150 150 150 150 150 150 150 150 
##$DBP07= 0
##$DBPNAM0= <>
##$DBPNAM1= <>
##$DBPNAM2= <>
##$DBPNAM3= <>
##$DBPNAM4= <>
##$DBPNAM5= <>
##$DBPNAM6= <>
##$DBPNAM7= <>
##$DBPOAL= (0..7)
0.5 0.5 0.5 0.5 0.5 0.5 0.5 0.5 
##$DBPOFFS= (0..7)
0 0 0 0 0 0 0 0 
##$DE= 6
##$DECBNUC= <off>
##$DECIM= 32
##$DECNUC= <off>
##$DECSTAT= 4
##$DIGMOD= 1
##$DIGTYP= 9
##$DL= (0..7)
0 120 120 120 120 120 120 120 
##$DP= (0..7)
150 150 150 150 150 150 150 150 
##$DP07= 0
##$DPNAME0= <>
##$DPNAME1= <>
##$DPNAME2= <>
##$DPNAME3= <>
##$DPNAME4= <>
##$DPNAME5= <>
$$ [...]
##$SUBNAM2= <"">
##$SUBNAM3= <"">
##$SUBNAM4= <"">
##$SUBNAM5= <"">
##$SUBNAM6= <"">
##$SUBNAM7= <"">
##$SUBNAM8= <"">
##$SUBNAM9= <"">
##$SW= 18.0517328524113
##$SWIBOX= (0..15)
0 0 2 0 0 0 0 0 0 0 0 0 0 0 0 0 
##$SW_h= 3612.71676300578
##$TD= 16384
##$TD0= 1
##$TE= 0
##$TE2= 300
##$TE3= 300
##$TEG= 300
##$TL= (0..7)
0 120 120 120 120 120 120 120 
##$TP= (0..7)
150 150 150 150 150 150 150 150 
##$TP07= 0
##$TPNAME0= <>
##$TPNAME1= <>
##$TPNAME2= <>
##$TPNAME3= <>
##$TPNAME4= <>
##$TPNAME5= <>
##$TPNAME6= <>
##$TPNAME7= <>
##$TPOAL= (0..7)
0.5 0.5 0.5 0.5 0.5 0.5 0.5 0.5 
##$TPOFFS= (0..7)
0 0 0 0 0 0 0 0 
##$TUNHIN= 0
##$TUNHOUT= 0
##$TUNXOUT= 0
##$USERA1= <user>
##$USERA2= <user>
##$USERA3= <user>
##$USERA4= <user>
##$USERA5= <user>
##$V9= 5
##$VALIST= <valist>
##$VCLIST= <CCCCCCCCCCCCCCC>
##$VD= 0
##$VDLIST= <DDDDDDDDDDDDDDD>
##$VPLIST= <PPPPPPPPPPPPPPP>
##$VTLIST= <TTTTTTTTTTTTTTT>
##$WBST= 1024
##$WBSW= 4
##$XGAIN= (0..3)
0 0 0 0 
##$XL= 0
##$YL= 0
##$YMAX_a= 76284
##$YMIN_a= -75466
##$ZGOPTNS= <>
##$ZL1= 120
##$ZL2= 120
##$ZL3= 120
##$ZL4= 120
##$ABSF1= 10
##$ABSF2= 0
##$ABSG= 5
##$ABSL= 3
##$ALPHA= 0
##$AQORDER= 0
##$ASSFAC= 0
##$ASSFACI= 0
##$ASSFACX= 0
##$ASSWID= 0
##$AUNMP= <proc_1d>
##$AZFE= 0.1
##$AZFW= 0.1
##$BCFW= 1
##$BC_mod= 2
##$BYTORDP= 1
##$COROFFS= 0
##$CY= 11.3945322036743
##$DATMOD= 1
##$DC= 2
##$DFILT= <>
##$DTYPP= 0
##$F1P= 15.7292609196834
##$F2P= 12.9074282941183
##$FCOR= 0.5
##$FTSIZE= 0
##$FT_mod= 4
##$GAMMA= 1
##$GB= 0.15
##$INTBC= 1
##$INTSCL= 1
##$ISEN= 128
##$LB= 0.24
##$LEV0= 0
##$LPBIN= 0
##$MAXI= 10000
##$MC2= 0
##$MEAN= 0
##$ME_mod= 0
##$MI= 1.114404
##$NCOEF= 0
##$NC_proc= 0
##$NLEV= 6
##$NOISF1= 3.799351
##$NOISF2= 2.8
##$NSP= 1
##$NTH_PI= 0
##$NZP= 0
##$OFFSET= 15.70392
##$PC= 1
##$PHC0= -24253.58
##$PHC1= 34.65269
##$PH_mod= 1
##$PKNL= yes
##$PPARMOD= 0
##$PSCAL= 0
##$PSIGN= 0
##$REVERSE= no
##$SF= 200.130013532006
##$SI= 16384
##$SIGF1= 3
##$SIGF2= 2
##$SINO= 400
##$SIOLD= 16384
##$SREGLST= <1H.CDCl3>
##$SSB= 0
##$STSI= 0
##$STSR= 0
##$SW_p= 3612.71676300578
##$SYMM= 0
##$S_DEV= 0
##$TDeff= 0
##$TDoff= 0
##$TI= <>
##$TILT= no
##$TM1= 0
##$TM2= 0
##$TOPLEV= 0
##$USERP1= <user>
##$USERP2= <user>
##$USERP3= <user>
##$USERP4= <user>
##$USERP5= <user>
##$WDW= 1
##$XDIM= 8192
##$YMAX_p= 0
##$YMIN_p= 0
$$ End of Bruker specific parameters
$$ ---------------------------------
##NTUPLES= NMR FID
##VAR_NAME=  TIME,          FID/REAL,        FID/IMAG
##SYMBOL=    X,             R,               I
##VAR_TYPE=  INDEPENDENT,   DEPENDENT,       DEPENDENT
##VAR_FORM=  AFFN,          ASDF,            ASDF
##VAR_DIM=   8192,          8192,            8192
##UNITS=     SECONDS,       ARBITRARY UNITS, ARBITRARY UNITS
##FACTOR=    0.0002768,     1,               1
##FIRST=     0,             0,               0
##LAST=      2.2672688,     0,               0
##MIN=       0,             -319211,         0
##MAX=       2.2672688,     320679,          0
$$ Real data points
##PAGE= N=1
##DATA TABLE= (X++(R..R)), XYDATA
$$ [...]
2292d49J50k03O78m80J22j24M43l87J3l42M82M69K4m2N0k86n0M0j72M15o4k15
2314G2l17J28M60o96Q87m68j65M35k66K42n16j80L28k28PN23k82K40j10n02N83
2335A75L27k53k4l50m9k32J083j003P6J30K16R4K37j054O11K4l65M90L37r2m39
2356f1RM70n78M2j99N70l96p8M03n15K48J44jj30N5K92o40N20o08J68O68n51K21
2379E3J62M15p20M23l40J5L58o40J78M44k10L28n23Q9q9M07k34J90k76l5L51o85
2401c39P2K41k50J90L0K14j09k1o7j65J78L51l47l22N0j43N77J12l24M86k84n62
2423d32K00K93K2J3J72N0p52M89l34N03k39R5K77Q6j72J44k12j14K59o70K96l
2445b9K57J19k1n58R3O1L9l64O38k32k36M93m7l97P56j073J51K06N51p06J28L94
$$ y = [-449, -299, -502, 176, -304, -182, -306, 137, -250, -237, -579, -97, 372, 396, 354, 404, 118, 68, 108, -64, 351, 287, 72, -245, -117, 343, -353, 534, 66, -99, 336, 70, 312, -204, -384, -56, -284, -277, 246, -36, 204, 94, -408, 175, 502, 249, 225, -125, -174, -406, 677, -326, -250, -120, 96, 190, 427, -627, -16, 8, -357, 133, 470, 378, -61, -52, 418, -160, -118, -317, 253, -143, -221, 182, -333, -85, 59, 58, -72, -17, 275, -365, 155, -453, -285, 383, -168, 53, 215, 630, -90, 333, -7, 8, 366, -274, -96, 348, 138, 466, -57, 32, -57, 350, 116, 306, 30, -5, 346, -339, -267, -26, -276, -86, -56, 158, 49, 28, -39, -204, -26, 325, -22, -344, -294, -437, 140, 252, -72, 414, 130, -432, -232, 61, 83, 96, 268, 318, -434, 55, -279, 224, -15, 80, 357, 443, 271, 415, 203, 89, 348, -322, -26, -29, 228, 347, 326, -232, -139, -78, -39, -403, 235, 3, -233, 260, 213, -184, 572, -501, -350, -144, 407, -299, -171, 223]
2467B23k3j26l34N08p72R27m26J71m01r7N96m89K18M91m45j19Q3L8q1M47n43L56
2489B02m1L81o17J84n76L79L08j81l34N59p22L53K61n78K25m30M63K12K8O02n33
2510A45m89J88q5K15k54o5L01M07n23L43m94K68l96N26j68M16q44L35J34L17o02
2531c25J97k2l65R40p5k69l5k09P66o62Q4m17R6j3L78J23M53q73k19N14j88l40
2553d61k25R36m01J76l89N05j85l29M54o15R6J37O70m94q0K32m19L42M19l68L81
2574C82p39M01L62m0p05L48j85j94L29J33K5j56L54n5L47l85j49k80J91M45kK13
2596F40l39K71p93K32j05O81m60q0L41j41l04j46L25O2j42j2O31k39m12k36j65
2617c91N98m15K11K33l32J59J00k89P33n80j8L43m37k36k0K18K81l42J7k52P42
$$ y = [223, 200, 74, -260, 248, -524, 403, -23, 148, -253, -350, 246, -243, -25, 466, 21, -98, -15, 23, -58, 389, -154, 202, 161, 542, -75, 109, -467, -88, 220, 39, -295, 264, -458, -105, 156, -422, -197, -627, -164, 48, 76, 678, 145, -344, -156, -241, -26, -280, -345, -44, 363, -160, 183, -311, -43, -439, 87, -81, 335, -509, -174, -40, 277, -325, -128, -150, -515, 425, 350, 81, 46, -163, 603, -59, 25, -392, -296, -309, 69, 192, 645, -228, -447, 67, -121, -461, -686, 250, -151, 25, -364, 141, -44, -373, 81, -534, -438, -301, 369, -125, -205, 27, -392, -50, 369, 1, 382, -357, 44, 406, 366, -339, 9, -176, -370, -41, 92, 117, -39, 315, 260, 607, 222, 73, -207, -16, 429, 427, 640, 301, 572, -221, 11, -94, 587, 127, 47, 388, 247, -57, -203, 122, 184, 42, 30, 661, 422, 10, -226, -391, 207, -208, 3, 236, -96, 63, 163, -126, 607, 27, 9, 352, -85, -321, -341, -123, 158, -184, -167, -419, 323]
2638C23j48j57j02qO63l47p2o9M61n63r2M55j92J03p31O57q7j62L36l58k24m2
2660c56R21l46J88j84k04l89Q42j54n8o89M02k35L02l78J98m68K54J95L85m23
2680a97L19o5j5J2k68l3O51o66N62m5j70l6K42J51o6j07j88p6J44k19J98j85J79
2703A22k01Or3L3N18o88K5K26L41k52L05k98K02k75l54J43M28k88L15m58L43l11
2725b11Q3O3K99l82j53M39P5l91J88L7J05k00j09J02J9k6j29L12K42l28o83O90
2747D2O74o84j1k26L52j73l6O9k66L43J08R3m81K42L23j84n15L31N1l50k39N49
2769A2J19O2k49j06o1J20P5N52o65K35N25j065L23l81M3j09J143o55M65o17J21
2790a13N23k36k32K51o8l54l38M21M8RL6L4O13n10j82j87N27N5j71K41r3l88m2
$$ y = [323, 175, 18, -84, -92, 571, 224, 152, 83, 544, -19, -111, 344, 152, 255, -476, 181, 94, -68, 268, -90, -314, -356, 565, 219, 407, 223, 19, -370, 472, 318, 260, -429, -27, -262, 40, -338, -140, -608, -354, -159, 226, -197, 122, 57, 42, 54, -214, -247, 404, -262, 300, 255, 85, 49, 291, 442, 376, 269, 81, 5, 149, -70, 128, -57, 122, -79, -73, -166, -133, 385, -303, -278, -52, 289, 37, 342, 44, 246, -29, -383, -240, 188, -100, 215, -243, 100, -211, -128, -65, 234, -148, -301, 138, 213, -178, 10, 47, 152, -48, -157, -55, -36, -62, -191, 121, 363, 35, -648, 42, 716, 32, 21, -205, 147, -26, -62, 7, -259, 84, 192, 285, -196, 46, 369, 185, -330, 1, 52, -298, -537, 12, 131, 193, -56, -162, -223, -103, -28, 524, -141, 94, 619, -446, -123, -504, -461, -570, 573, -82, 383, -234, -113, 410, 174, -58, 193, 125, -229, -567, -146, -98, -89, -53, -19, 594, 84, -98, -285, 242, 297, 126, 367, 274, -114, -156]
2813a56K38j17K45m18N9N8K31J6K6n44K29o2K21j05O0R1J07M83k59K98p98M6M82
2836D31o49L27J76j014J029k76o0M9p64J224p06k69M70K00J14m49O5N09n66J91
2856C2J82l45M75l02K85j140R00L7o96P25K50j70K9J7J15Jq07K75j4J23k62J48
2878a42o4J36K78k74k2q8M33l95O78m91k05j30q2M30l11K52j1J12l53PQ4K25k48
2901a81J0k78M04J73m35n1p6N54q6J53r2m36q2L80O0m18P00J42l00j18j24M54
2923C53l44K52q09O28K9O3L89o15j24M88j42k15L38j69N21o37j33N65m93L73m43
2944a25L96k23l6m38P79q11L58J81k58J37k12K67J35o40M74k86K09K58j80l25
2964c40N25j49K06k7j33o3K0O5l37j6L62m9k16M04j68l34k32K61Q19m30j7kj39
$$ y = [-156, 82, -35, 210, -208, -149, -91, 140, 156, 182, -362, -133, -195, 26, -79, -19, 72, 179, 662, 403, 701, -97, -51, 431, -218, 109, 285, -729, 300, 24, -36, 13, -751, 473, -233, -502, -32, 168, 282, -167, -102, 407, -159, 32, 214, -131, 344, 42, 327, -813, 87, 124, -572, 153, 403, 233, 262, 279, 394, 395, -412, -137, -151, -28, -290, -142, -206, -70, 208, -66, -88, -176, 257, -138, 540, 49, -156, -286, -368, 62, -249, 3, -8, 104, -249, -242, -158, 67, -181, -171, -449, -45, 128, -307, -358, -434, 120, 34, 187, 95, -341, -423, -43, 17, -401, 299, 441, 141, 23, -101, 353, 9, 261, -548, 80, 109, 172, 561, -54, -178, 310, 168, -47, 291, 122, 643, 6, -127, 438, -55, 318, -125, 271, 48, 12, -426, 353, -458, -100, 81, -177, -40, -252, 15, 150, -490, -16, -302, -93, 165, -15, -340, 185, 36, 242, 215, 82, 19, 39, 104, -233, -249, 113, 64, -152, 252, 84, -250, -482, -221, 598, 168, 151, 149, 10]
2987A0l3K73p0k02J39J31m6kl61M53k97l6M70l18l47m24R28n99N38M26q41P10
3009E02p5m31k51N2L82m45m77N30J93k93O58l90j69L03L80j031R47k2QJ5j38l20
3031g2K67n27J03QJ11J30k02j14j52j29R44n25J72K34p31L22k98O77n41K38K14
3052A29L0k23J07J60m99L33k11m55J092r60M24k70K68K78L3l39j93P92o82Q4J37
3073C5k1k79R8j4K92j57m7K6K07P3q9J1q5k33j61L26K25L39m48k63K73j80K41
3096A69P2j40j00q4J30J28j42m61O69q57Q92m55Q3P4j84K31r9M0R6N2l71L19m4
3119A8N05m12P9Jl31L76r9j4M62o82L6l54M77p23K82P53m77j32J60j35Q1K09q7
3142gk15l1J87J4L28m45l10K0M10k88Q29l35J95n93L18L72n01L88l14n95O09J22
$$ y = [10, -23, 250, 180, -22, 117, 248, 202, 200, -161, 292, -5, -41, 429, 111, -236, -660, 268, -331, 207, 633, -208, 502, 427, -4, -255, -203, 179, -266, -743, -213, -20, -313, 345, -45, -214, 89, 469, -562, 385, 363, 371, 386, 248, -72, 195, -332, -229, -221, -110, 20, -182, -296, -448, -577, 367, -158, 14, 248, -483, -161, -459, 218, -323, -85, 129, 159, -64, 43, 203, -296, 37, -174, -629, 463, -497, -73, -343, -75, 203, 236, -103, -296, 496, -186, -102, 35, 14, -265, -167, -181, 111, -46, -93, -67, 140, 213, 124, 135, 50, -183, -344, -18, 207, 546, 98, -165, 108, -72, 169, 241, 101, 1, -83, 47, 175, 33, -428, 241, -616, 276, -179, -96, -22, -206, 25, -74, -34, 62, 114, -257, 62, 18, 523, 111, 190, 191, -140, 236, 137, 123, 585, -97, -61, -415, 62, -661, -379, 374, -103, -235, -75, -210, -129, 80, -7, -222, -253, -66, -52, 276, -169, -479, -459, -49, -337, 492, 157, 352, -241, 77, 449, -52, 336, 22, -573, 36, 158]
3164A58N6k18L25m51Q9R6M6K85k21l2J45m32K59ll91L00J69J04l70J63J38k87
3186g2J4L4O91k87l84j69j60L73l81O4P68n92j82m9Q17k80k69K87K37P4q83M20
3208G1l10n6k2L83J0J92k43K9k8q7l70M12M99M0r33M65j42J46Np04K98N19j4M95
3232F55k59o04J61l4j02M67o64L05O60o9m57l30N29m60l4m2L53k23j61R8L81k5
3254A45L10Mp17O82r71L40O06m51J3L76m90L01J22k08m32L40J98K3M9k62k69K7
3276b64L41O0K51l14j33l0K83L50l59m43j18L78m55K99j48Q14l79N7m52K93J57
3297A88j16m61R0O54o76K36L9L4L28l7l08O0K5k95P49j042K12L70m3l11J73N35
3319D04n08K23J62l42L21m84k6L34M49O8m6j54j025O60k81L78K36J17q61K71Q
$$ y = [158, 214, -4, 321, -130, -41, 55, 101, 386, 165, 133, 278, -154, 105, 102, -289, 11, 180, 284, -86, 77, 215, -72, -58, -24, 667, 380, -4, -173, -333, 40, -341, -277, 491, -101, -283, -332, 485, 205, -64, 223, 460, 534, -349, 71, -239, -295, -317, 66, 76, 268, 25, 54, 26, -61, -431, -19, 480, 520, -413, 52, -90, 56, 61, -643, -345, 174, 160, 655, 396, -208, -47, -81, -183, 284, -380, -75, 585, 516, 59, -271, 258, -202, -236, -278, 75, -148, -309, -211, 170, 145, 455, 459, -258, 424, -547, -207, 399, -52, -39, 337, -153, 148, 270, 62, -370, -30, 168, 191, 240, -22, -291, -264, 77, 137, 388, 74, -59, -89, 194, 544, 185, -258, -376, 2, -453, -154, -302, 512, 133, 190, -262, 31, 188, 72, -389, -299, 355, -321, -85, -46, -12, 316, 279, -29, 31, 56, -239, 510, -532, -320, 50, 7, -304, -131, 404, -104, 119, 281, -61, 260, -224, -250, 84, 533, 601, 555, 401, -624, 36, -245, 133, 369, 486, -375, -104, -96]
3340i6j85J14L59J44m5l93k66K25P74n90L4o0j66j11L20l4n23N25j7k82K39J90
3362A56q05P70k67k05K80J13K7J91l61l1k35N33j24L90r35L79j18j0O67o08M99
3383C06p04j36MO62j23o1L89m48Q0O22q90P66k77o54J61N84k54k07L34J64p08
3404c90L31k37M71M30n5q50L31j9N72m07o17M58m96J328m31q11N5R0M25m06R12
3425F84p11L05L1j54j89r8M66l08k04%k09N15m16N04r10J19P47J88l95N28k29
3446B64p99O75J81J27j065Q35k80K58L48m64m28O05k10o35R81p67M77l57J39N42
3466D27p37k9K64L3J76l5m2n0k48J37M0j06N42o47M08j35M1j10M14M0n61j88M43
3489G7M03p28J44J66j63n7O05l84L29r05K07N88N55l94j02l05m99N25k96p8K77
$$ y = [-96, -281, -167, 192, 336, 291, -102, -368, -143, 631, 41, 75, 15, -151, -262, 58, 24, -499, 26, 9, -273, -34, 156, -649, 121, -146, -351, -71, 42, 69, 260, -101, -132, -367, 166, 42, 432, -503, -124, -242, -252, 415, -193, 306, -398, -534, -530, 132, 9, -52, 337, -111, -31, 591, -299, 467, 190, -464, -303, 281, 27, -180, 154, 318, -390, -59, -296, 175, 605, 550, -300, 31, 12, 584, 177, -440, 18, -478, 850, 419, -392, -337, -247, 178, -228, 684, -27, 278, 309, 155, -34, -132, 334, 26, -178, -178, -387, 128, -288, 216, -694, -575, 172, 360, -35, 493, 264, -535, 140, 321, 448, -617, 218, -62, 196, 544, 80, -348, 257, 47, -588, 393, -374, 103, -254, -115, 427, -310, -339, -75, -42, 134, 99, 57, 7, -241, -104, -64, -170, 372, -275, 133, -2, 39, -71, 343, 383, -178, -366, 77, 480, -248, -104, 62, -101, -158, 447, 63, 392, -513, -306, 282, 837, 443, 341, 36, -463, 62, -234, -312, -35]
3510c5M2K36J22k06j19o9k0Pl62J74K48J11k45o19J299n25p51K29J94L91K18m11
3532i1Q3L05n35o07P80m43N48j5r2r7M56k4l48N80q50N62j60m21K80N72p56R12
3554F39l94j04R5O5n11K17K68k99J81K25p7j60o42O93J38k58K06k48J59K33n08
3575h2L90j09n14L58n6k08M57L6m06O0L16Q9o28P41r77Q36l24k43O44n84m4n8
3597c06L78J96J21j06nl5n79O69k95m09O37l42K53n49L37K06M4O4m04R5M00L49
3619G19o24k51J58P9m64J5O65m77K41J94k81R6o00K14k37N80J93j70j9k27M17
3640B21k36K22o65L71L00n21N10n48l4M48M17j78l90k90R19m62q2k3l52k7N20
3661A20r5L41L2J04n44L24m56k9J98k96L6K40n77O43J61k28j16M91m62M83l38
$$ y = [-35, 7, 243, 365, 159, 40, -29, -49, -42, -404, -230, 18, 129, -116, -735, 564, 39, -712, -483, -289, 102, 320, -91, -8, 297, -238, -845, -65, -508, 40, 25, -67, -164, 292, 268, -80, 500, -350, 212, 52, -369, -89, 483, -273, 639, 245, 141, 236, 301, -210, 7, 275, -24, 157, 382, 305, 145, -497, 196, 334, 76, 282, 34, 193, 426, -82, 308, 199, -315, 43, -13, -221, 236, 272, -134, -74, 242, 331, -297, 444, -533, 303, -21, -264, 380, -204, -248, -306, 72, 268, 389, 283, 278, 243, -336, 333, 38, -371, 266, -76, 177, -372, -35, 171, 215, 279, -125, -30, 370, 719, 95, -156, 2, 81, -383, -368, 297, -180, 61, 255, -26, 70, -530, -316, -553, 27, 220, 50, 31, -196, 221, -15, 207, -458, -87, 213, -308, 202, -346, -380, 68, 485, 307, -83, -373, 546, 84, 2, -21, -373, -400, 120, 25, 366, 398, 502, -42, 282, -174, -203, -5, -301, -265, -25, -602, 41, 202, -26, -142, 349, -113, 370, 32]
3682C2J67r6l16L68l75L18n0Q5m14j52L04Q40k65o10K27J71L85n35K79o06O82
3703D39L2l86O29q44JJ40k8j14Q5O4J37m38J33K07K46l39M51l35j10p5j15M09
3725A89mk26K7J7k47O46l29J14j41Q5m33J04P76p43j33K75K80k06j82Q0l6J59
3747G2k04p3J78j17L66k77K54o94L04M56j88k55j91O03P3j4j52j0j18M16l88j74
3769a33l58K77L6N88p95N77j77L04o8k39l36M91p1k83J08k1M42q06J086o93m35
3790e06O42M0o53K65q5P4O92k27J3j2j37l41M76o65L89O22n46J24m53K77J20k72
3812a63k44J38M25P2l16k85J061m04k94L45K88m06o24J92P8k30K5R32o42M91l93
3833D6j39k43O74l45J59j04l26M25M5L54q57L09K07J45p77M33L20k12k91j66K65
$$ y = [32, 199, 103, -213, 155, -220, 98, 48, 133, -281, -433, -129, 711, 446, -164, 63, 234, 619, 84, 363, -243, 439, 471, 85, 714, -130, -129, 11, -17, -131, -46, 18, 155, -283, -150, 57, 303, -36, 415, 80, -30, -105, -220, 189, 185, -41, -14, 3, -244, 402, 73, 187, 46, 131, -302, -198, 578, -165, -298, -23, 257, 51, -131, -51, -87, 72, -132, -205, -27, -144, 222, -55, 199, -495, -191, 265, 77, -178, -369, 234, 307, 293, 141, 131, 13, 429, 41, -133, -491, -214, -178, 410, -385, 192, 15, 319, 251, 12, -324, 167, 96, -187, -79, -100, 342, -464, 622, -71, -506, 136, 176, -477, -212, -297, -223, 469, 242, 255, 243, 106, -235, 241, -424, -35, 587, 41, 165, -288, -11, 109, -163, -407, -269, 156, 228, -88, -373, 688, 284, -10, 335, 623, 217, -407, -215, -137, -367, -342, 590, -52, 439, 46, -93, -336, 338, -7, 152, 48, -278, 147, 192, 546, -311, -2, 205, 350, -427, 6, 326, 114, -177, -343, -78]
3854g8M32K14l03m10k63O38q48K33M04J91K37j50l42J15M85n49J95k4m56O48k23
3875A46Q4n67O20n18J21J33j03L90j62k50L30r58Q74j30k6J98K9n56P55n61J57
3896Fm27O79M14q51j00K01j09q0O4L76k54M48n68J16O2l16K84m97J38K19O52M4
3918E01l30J58k32j29M29j58j19Q4n20J96K74m61K35j65M90j88N22n50ll82k13
3939e61J254j83l93M32q34J99K81l43L62j017J161p22P31m68N03j10k44o2k16
3958b30p1J60J35R9K5l46L89p87J028l48J00r3j04k57q0K57M67N2J7m94R34q32
3980B1K97m92K32j37L11k10m81M87j79l5j03j15L84L82k54l58L32j29K99k76l4
4001e8j45K17Q3o01O19m38k86J086k84J24L76n57o70O08l72N78o98J099o31L5
$$ y = [-78, 354, 568, 265, -145, -408, 230, -618, -385, 19, 210, 447, 297, -45, 70, 555, 6, 201, 177, -279, 369, 146, 230, -337, 283, -235, -114, 19, -84, 306, 144, -106, 224, -734, 140, 10, -16, 182, 211, -345, 410, -151, 6, -421, 258, 672, -179, -279, -78, -187, -267, -203, 173, -81, 367, -201, -85, -23, -339, -55, -552, -414, -195, 457, 501, 171, 329, 97, -32, 397, 239, 120, 204, -316, -120, 154, -307, -72, -237, 253, 65, 587, 37, 34, -348, -561, 693, 510, 117, 549, -285, -86, 195, -148, 214, -803, 358, -364, 367, -101, 402, 292, 48, -14, -230, -301, -141, -6, 93, 118, -228, 161, -626, 402, 54, 154, 61, -43, -300, -380, -123, 344, 396, 413, -81, 853, 21, 318, -174, 58, -79, 232, 22, -459, 28, -151, -186, -289, -404, -20, 362, 108, -250, 82, -47, 252, -24, -58, -203, 14, 97, -504, 115, -323, -609, 477, 193, 317, 693, 136, -534, 74, -298, 280, -418, 681, 50, 85]
4021H5J53o9k72N05n54j70J19M78l77O1qM13n55L75j70k33N96N7l49K86n78M7
4043a60J56j46o9L1L47k90J09k08L18m25R8K88k91m2K12j9Q41o34K97P7o35p1
4065b16J95K63l46J68L90k60m54M78j055M34N72N40o01K60l07l82M03k36J78k49
4085b25L80j82M12n02j30L14o28P57l60k1M26J79m33j82N13o78K10N15o53N63
4105B75j26R5k58j20L1L74k02m13J48K17M74k08K41p66P8J85l37J46J50K04l21
4126a33j33M33j79K51m65K3M60k34p5J01K83k94K03k34N03o29N0L8o07Q85L02
4147E49l33m50k42Q63j65r4J77l44q5J40J51k13J89M1r07R78n88M84n1n87M90
4168CK58m89l90O02PJ56k07K99l12K50l89N16k48L56j36jQ5j70Nm96N68Kl53n3
$$ y = [85, 238, 169, -103, 402, -152, -322, -203, 275, -102, -41, -49, 364, -191, 184, 14, -219, 377, 434, 85, 371, -207, -160, -4, -150, -219, -188, 159, -131, -22, -230, 88, -337, -239, 49, -242, -284, -72, -91, 750, 116, 413, 490, -145, -216, -21, 242, -104, 64, 454, 194, -260, 218, -837, -403, 169, 709, 108, 368, 61, -321, 82, -154, 24, -225, 155, -27, 385, -117, -247, 67, -561, 196, -164, -185, 241, 420, -13, -195, 318, -360, -150, 365, -288, 275, 149, 244, -14, -134, -103, 271, 69, -344, -196, 21, 495, 287, 528, -238, -160, 25, -312, -166, -16, 188, -133, -266, 167, -12, 239, -226, -203, 257, 23, -52, 49, 332, 38, 241, 7, 510, -119, -69, -31, -638, 247, 549, 216, -234, -476, 387, 222, 128, 305, -39, -124, 16, 167, -46, 143, 184, -723, 255, -333, 151, 100, -487, 3, 261, -228, -618, -16, -9, 147, -60, 239, -73, 177, -212, 304, 56, 412, 276, 275, 360, 190, 195, -301, 267, 269, -84, -137]
4192a37K91J70L03m97j34l31L71K95J53k47k77K55n03L09P0k29L88J03n59J13
4212i3K59K37K47q12M7P00n26K96l81k22K51L42k22k26J15J60l76m6k64R09R0
4233D85o90J55m68M11M4M4M64k01n61L11O0L76n97L97M3m3j84p36Q39j54j2J28
4255A11l51M86L5l14L32k72j30n4M47k38N2q0k92L41q6J20P1l8N3m62M01j51k
4278b1M17m97K76k31J54j58l35N8J35n84Q01o3j22M0J4R7n42Q88j56l42J04K88
4300B21k98L83p7r4m25L39k18k58K13j23N07M40l79j59k57J1J74m8P2k76K01L74
4322C23j80k28P2Q6J35jK16j99m69K27m94M29m33J99L45K78K1r4m32l1N23j88
4344A05q3m11J51k1L10p0J25j12L48K53q71O09J90o49J03o1L60K31k58k33M34
$$ y = [-137, 154, 324, 627, 130, -4, -335, 36, 331, 484, 237, -40, 215, -288, 21, 91, -138, 250, 353, -206, -93, 166, 403, 650, -162, -115, 585, 59, 355, -26, -248, 3, 345, 123, -103, 12, 172, -204, -250, -514, 395, 485, -205, -50, -518, -107, -63, -19, 445, 244, -317, -6, 54, 430, -167, 230, 273, 230, 46, -690, 149, -5, -17, 111, -240, 246, 281, -33, 299, 27, -103, -157, 290, 52, 104, 24, -268, 73, -13, 107, 178, 140, 193, -269, 132, -19, -21, 396, -101, 175, -56, 98, -60, -395, -337, -202, -786, 15, -48, -170, -130, -116, -19, -561, 327, 171, -171, -67, 221, -77, 306, 229, 135, -290, 49, -169, -427, -214, -337, 170, 610, 231, 72, -185, -174, 0, -48, 24, -252, -51, 323, 143, -85, -13, 73, 208, 207, 423, 224, -245, -18, -512, -83, -516, -317, 28, 306, 327, 233, -199, -230, 293, 105, 22, -389, -238, -259, 51, -19, 106, -6, 342, 595, -276, 333, 523, -126, -23, -84, 276, 507, 249, 16, 450]
4365D50k71L0N1m57M4M16l56K99m08L92p2J14m61M16j41k22L04m82N78o55M40
4386Ij40K86j76J2n9M11k50n92JP41n3k95n9J79j08n6J85M8k81L37k64P33n30
4409G9k13l18k57Q71j37J80K06j03j66n60P32l14j1j85K32j00L05l58L58O6l58
4430e1l6L71m08p3O9L04K16p43Q74k61K66n46K63l69M29k30N46m65o46Q7J42N37
4452B76M5k10K22N1J80k95l19J98K34k21k33l3R18q25O9k84M65l73k45P33m55
4473a02j59J22r5J11K57n6n38M83J97K8k89O1R9n93N81j91K5L84J61p3o79M92
4495B26l30m3k7M1r6K46q18P97j01L00r0Mj81j94j45L33M97k00k55k08J29K04
4517H9K4k88L05k93L65L80r80L72n76K71L83m18O43k11m2l3M89q23L89L28p33
$$ y = [450, 179, 209, 260, -197, -153, 263, -93, 206, -202, 190, 118, 232, -229, 187, 46, -176, 128, -354, 224, -431, 9, -131, 155, -21, -9, -68, 343, 93, -499, -498, 243, 190, -105, -164, 15, -93, -149, 36, 84, -197, 140, -124, 609, 79, -134, -452, -709, 162, 25, 205, 411, 308, 142, -418, 314, 0, -11, -196, 36, -64, 241, -117, 241, 307, -51, -87, 284, -124, -197, -128, 176, 392, -351, 523, 262, 528, -18, 245, -124, 305, 75, 621, 156, -490, -403, -261, 276, 321, 111, 333, 384, 564, 269, -50, 148, 382, 161, -72, -105, 813, -12, 57, -227, 238, -135, -380, 353, -102, -261, -139, -234, -123, 134, 78, -460, 23, 220, 248, -41, 20, 119, -474, 107, -84, -59, 325, 486, 413, -266, 226, -104, -147, -174, -133, -229, 17, -801, -4, -105, 195, 105, 109, -72, -266, -411, -78, 419, 219, -36, -244, -115, 89, 113, -175, 130, -163, 202, 582, -398, -26, -602, -331, 52, -366, 277, 66, 24, -9, 480, -343, 46, 374, -359]
4538c59K80j32k9J79j09m2L56K55n7n54K40J33P0m39N75k18mj68N8K20l74k43
4560c62L07L57m47M53p73L90k9l89K05O21p55K51M20k29j17n02O12j79L57m9j24
4581A8M59l81p8k89M11j44J42J85q7J5P1o64J41L86j3n48N54j60p9l35L72P75
4603G51p42k75K56K26n83L33l70N08N55m18K9k62J75k12J6J15n57M65l12O49j83
4624A64J72k95l65M07J43m44P91m01j31mJ05l05l59J4O10k31k55K26K88k43K26
4645A13m88K15K18l88O79k07J01p7J98j28k56J70k29L30l77K71N9n64L44m75J21
4666c70O5J54J51j31K27J61p33M01M46j36l25j7N1k85L91j56J99J24m62L00q99
4687h44K76N07K56j14l49J10m13M23K47K5K6j15M24q97N87k41j54K14j34K47l22
$$ y = [-359, -79, -211, -240, -61, -170, -212, 144, 399, 342, -212, 28, 161, 231, -208, 367, 149, 145, -23, 35, 255, -119, -362, -55, 302, -145, 308, -465, -75, -104, -493, -288, 333, -422, -171, 249, 20, -97, -599, 13, -166, 191, 142, 18, 477, 96, 18, -271, 140, -4, 138, 323, 236, 251, 322, -342, -201, 185, 172, -376, 178, 18, -61, -396, -24, 751, 9, -266, -10, 216, -367, -34, -404, 104, 659, 241, 270, 8, 183, -29, -13, 102, -455, 10, -302, 347, 164, 336, 41, -324, 83, 226, -218, 573, 172, 41, 37, 142, -163, -522, -508, 102, -129, -384, -158, 130, -113, 113, -375, -160, 58, -330, 349, 142, 243, 166, 364, 236, -20, 150, -79, 251, -126, 145, 204, -360, -16, -491, -370, -305, -151, 0, -131, 96, 257, -476, -75, 371, 235, -90, -107, -56, -341, 50, -106, 93, 217, -245, 55, -844, -568, -61, 195, 81, -268, -158, -571, -148, 99, 124, 150, 35, 459, -438, 149, -92, -246, -32, -166, 81, -241]
4708b41k41J078n46k50Q07j061J060o89J78j43L79j40k88J75m7j29J9K87l15L80
4728B73j95K83r5m22K95n20O70N3q8n11L45L45k65l47J39j42o5L94M9m11K46j45
4750a14O63j92p2m98L5K67n7J52K51k79l42K84M82n43L06Q8p53N55L57q44K10
4771d4m72J40K33q8R6j30O69j66m87J81P79p2j166M61K39n44O82m28j02P26j95
4792C12r96J075m23K30m08K98l92Q07p07k12L39N80m42n4L45n7p71P36M30m26
4812B64o66P91r6l33R7j07M79m21j0K9j00M29o66M3j9L24k98J90J58j68K9J43
4834I2l39P0J85j24O59l53N9n34O18p33kK36J89n3j5j6M73q23N8L62L99m38j47
4857a77K36J48m97L72K41m90m95N94O08q40N1Q51m32m15J15J28j59K08K04j88
$$ y = [-241, -482, 596, 50, -200, 607, -454, 606, -83, 95, -48, 331, 191, -97, 78, 31, -98, -79, 208, -107, 273, 78, 361, 266, -156, 139, -381, 289, 342, 254, -257, 88, 433, 168, -179, -40, -182, -247, 147, 196, -215, 31, -114, 549, 357, 285, -213, -178, 89, 32, 184, 435, 156, -186, 98, 580, 37, 343, 431, -322, 233, 590, -254, -44, -516, -376, -143, -231, -135, -265, 404, 238, -249, -68, 711, 639, -527, -66, 173, -371, 311, -117, -219, 507, 312, -684, 391, -32, 198, -210, 88, -304, 503, -204, -416, -77, 503, 61, 7, 352, 295, -476, 260, 690, 264, -402, 389, 293, -40, 57, -50, 429, 8, -2, 27, -73, 356, -310, -267, -286, 38, -260, -70, 88, -80, -51, 92, -247, -177, 8, -116, 543, 190, 249, -285, 333, -400, -402, -166, 23, -30, -45, -61, 412, -411, -353, 9, 408, -30, -177, 59, 207, -290, 82, 323, -167, -662, -68, 540, -300, -249, 602, 170, -245, -130, -2, -161, 47, 251, 63]
4877F3K25n09M16j85m42K99N78o12L2k58Q85r1l72N33m78R1l2J37o81N93R3J1
4899B96o68J76K20N3J37n17o6P92j47l73L31L2l94l53M38K32M91j86l49l66K78
4920E7J42m27M68n07O50j66o90P70j43J45p5r4K57m74J71n71P15m08K89l42J62
4941g1K69k43K15r4K73n89K61j2M64l16O2p8k44L70n41j36M75L26n29L03L8L31
4963E34j39l06n9L23j97k8J04k18j27L92m84j15P2K66k53P68p15J77k37l7N50
4984B71j01k53P2J70L94k66o00L24j9J18l06J12j61M51p23Q26o79N14j60K03K28
5005D15j039N00J74M8n98n5L83k21J09J99M55k04l11J84j18L20m15j67M66L6J67
5026C28k1o18O24l38K34N4l71R7L38j36o29O08K23j53p01N12J51m99L27J54k55
$$ y = [63, 288, -221, 195, 10, -432, -133, 445, -167, -135, -393, 492, 401, 29, 562, 84, 175, 143, 280, -401, 192, 285, 296, -372, -196, 24, 77, 214, -303, -369, 423, 276, -97, 234, 266, -128, -481, -43, 189, 680, 494, 145, -221, 57, 199, -228, 240, -267, 383, 217, -473, 297, 154, 299, 224, 130, 387, -87, 84, -487, 228, -180, 109, -233, -71, 198, -45, 170, 76, 349, -240, 21, 9, 473, 157, 219, 141, -103, 267, -274, -410, 65, 391, -138, 165, 203, 534, 395, 89, 30, 353, 156, 128, 232, 14, -113, 279, -205, -320, -248, 18, -235, 533, -182, -5, -242, -279, 271, 170, -83, -11, 159, 553, 287, -313, 11, -8, 110, -196, -84, -245, 206, -517, 309, -370, 144, -16, 187, 415, -624, -124, 50, 98, -500, -555, -172, -393, -284, -85, 370, 166, -145, 39, -79, 241, -174, -341, 125, 161, 328, 307, -311, 313, -25, 209, 263, -108, -11, 327, 191, -438, 170, 393, 240, -461, 51, 202, -297, 30, 184, -71]
5047g1K72J03J48r03L97P7m39L44o7O08o76N93j07l33K32l29J02m50P09k48k16
5068b54K41j87N56k39pm32J94M00l30J63l7k61K74j88k48L55o63P55K48n44L26
5089A22J84p33M76P15l38k72k72L60o78O41r4j86j20J90Pk38q0K69N73k66k20
5110D0l10P49m8n85k18L28J69k4j34J89k64J4k06k75R25r08Q1Q21J8o78L0L54
5132F8J76m97J97k34M9N63n28k6O34m75K57k83K18l01K78L3k65K91l20M52n39
5153b52J69K81k50j03M47J35k97l75q7m06N87j7L24r3k6j60J27N0L75o78M20k69
5175i8J1J74j30k69QK01L30n27M92k54L30l49M2J16K15n27m97K62K17L55n81Q59
5197C80l09R4k90J28o6R9K02j54L05p21Q4l45L45O41l52k7J42k52k30j3K72O60
$$ y = [-71, 201, 304, 452, -451, -54, 23, -416, -72, -139, 469, -207, 386, 279, -54, 178, -151, -49, -499, 210, -38, -254, -13, -200, 356, 117, 110, -322, -128, 272, -58, 105, 68, -193, 81, -107, -355, 0, -663, 92, 340, -204, 122, 306, -427, 49, 764, 426, 154, -118, 242, -436, 205, 111, -75, -195, -5, 2, -236, -316, -47, 526, 260, 40, -270, 479, 431, -154, -372, -44, 125, 101, -33, 156, -108, -94, -300, -575, 350, -558, -477, 344, 362, -316, -286, 68, 244, -253, -56, -290, -241, 322, -206, -232, 402, -73, 184, -99, 119, -182, 96, 129, -136, 155, -165, 287, -252, -83, 198, -52, -155, 292, 427, 130, -245, -332, -738, -151, -168, 156, 63, 37, -123, 4, 54, 429, -249, 171, -98, -87, 87, -43, -312, -304, -103, 227, -300, 192, -62, 268, -81, -39, 77, 292, -235, -732, -470, -253, 102, -479, 380, 71, 165, -125, 3, -63, 36, 238, 84, 389, -332, -248, -593, -248, 393, 41, 14, 156, -96, -326, -339, -67, 593]
5219E93n99O00j154O18Q7K60n0j11j90O91j118N93k28j04M18J20m10n3L36R5j70
5240B24k54M27j10k02l70J69L65j21j66L69o14M48k26M02n84M52p62M75L23o00
5260c55P04l75K75rk97L61j62o8P8j01j57J90j55q7l49O66l19K87l27K32K45m77
5282b00J91L87k18k23L36m64l57K22M70k88L23Q4J62r16L13K94j91J70l5j28J78
5303A10m65K16L9j80N2L63M8K71l77L8p1L62K2q42q5K23J67k08M48n12M40m09
5325c50K97K78m49P2j21R0R7Q5j2Jl80L14M19j52L5n25L84j34K28J61l57L59l89
5348d9M40p56J42N50m95O32o79M34J31m27n4M21j96J17n98J53O10q43N70k21K57
5369A39Q0m34N11m8J08j71J10K8m10l39L68j51P6L04l16K44l40n3j92N08K91m47
$$ y = [593, -6, 594, -560, 58, 145, 405, 355, 244, 54, 745, -373, 220, -8, -112, 306, 426, 16, -37, 299, 394, 224, -30, 397, 287, 85, -285, -116, 249, 128, -38, 331, -283, 165, -61, 341, -243, 209, -553, -78, 245, -355, 349, -26, 249, 240, -57, 304, 142, 74, 152, 51, -106, 84, -71, -158, -507, 159, -160, 127, -200, 32, 277, -200, -9, 378, 160, -63, 273, -191, -548, -326, 144, -144, 179, 263, 425, -491, -178, 116, -75, 95, 60, -68, 110, -355, -139, -100, -280, -228, 135, 183, 454, 77, 115, 44, 406, 428, -414, -499, -276, -109, -317, 131, -381, 59, -350, -53, 225, -224, -152, -273, -183, -86, -1, -13, -12, -392, -78, 341, 189, 224, -301, 83, -51, 177, 338, -19, 340, -49, 391, -365, -223, 327, -168, 464, -215, 219, 350, -77, -131, 290, 94, 211, -387, -234, 376, -467, 103, -118, 139, 219, -215, 296, 248, 356, 185, 295, 323, -87, -426, -58, -209, -133, 171, -145, 99, -241, -294, -486, 22, 313, -134]
5391a34J35n18K34L88m17N42o91K01J7k68J07N98l3l2N05p57kK76l85P75r12N79
5413B08j47L52n0L70n32j87k97L5K11M0j42N0J39M20q35M77m51M81L46n48q9O2
5435h7l5Q1M91n14l41M09j1M09l35K56n76l9o6M3M55k76kK30o2M27r02L94J24
5458G3R3m71L94p62Q22n45N32L48j431N44K46K77M34p35J99K06n50m4K96l10K17
5479a67j39L60k03J5K51Q6j96L29n54O7P43o76M7K66j78l0m93N54l79m0M47j06
5501DQ1j5M72r61M72j5q7J9P64l58n10M45k71k4J50O9L87j138N07QJ63J06l98
5524a30L56l43P96o35O5j06l53N51m33K08m42M23j37N76k44k94j91O65o78M56
5544A10l02lN16k16k36L18j65j10J52m75n0N15m8l6l19J46N03l33J23j94j03M06
$$ y = [-134, 1, -517, -283, 105, -312, 230, -461, -260, -243, -511, -404, 194, 161, 129, 634, -123, -125, 151, -234, 541, -371, 208, 61, 413, 363, 733, 201, 14, -283, -248, -37, 3, -139, -89, 50, 470, -365, 112, -339, 142, 488, -60, -149, -87, -122, -41, 450, -64, -405, 4, -7, 402, 67, 323, -253, -292, -358, -315, 140, -136, -138, 92, 30, 457, -445, -51, 73, 166, -305, 89, -673, 149, -396, 136, 484, -947, -403, -157, 120, 554, -181, 18, 224, -326, -370, -74, -384, -167, -306, 54, -149, -134, 117, 203, 7, 336, -218, -151, 592, -84, -37, 229, 51, 21, -472, 82, -297, -337, 110, 4, 85, 70, 542, -419, 53, 38, -49, -30, 734, 376, -134, 311, 40, 16, 166, 235, 622, -516, -9, -1, 162, 268, -130, 226, -117, 679, 44, 109, 3, -350, 201, -232, -24, -466, -43, -180, 396, 152, -142, -333, 332, -346, 110, -192, -195, 321, 105, -131, 187, 22, -88, 64, -411, -461, 54, 6, -30, -349, -203, 300, -33, 90, -104, -207, 199]
5566A99o62M64N38n96k20Q39o42L09J38p90L42n1P2K89N4m90K42j3P08O8j105
5587c07O60j98K57o73K8N10o97N00R3j9l55L79K18k18n8k8k50M77l71k05M22l71
5609b06N8M0mK8q8K13k61J97j29j65O23p12M88M5k25K67m46k25J35L58J64k53
5631i8L81K07l49n50O70k32k60O69k28M0Rj55o37P39m31L86K12q57O67k37J82
5652A28m86Q14n84M2j49L23j50N84q43LL66k30M81m99j8K86l7J2K3K98k37l78
5674b51K49L84n85N92j59k32l12R9J40K38J52n27K44j14N6k7N8l55M06J47On27
5696c18J6K21J09M14k20m21J41l09L65m0k66j13M34k98m3M15r0M27l09m7k4m07
5718c63J90k4k21M70Pm41P33l27j20l80L36Lj99J69K35j42K81k26j48J44n5j35
$$ y = [199, -463, 1, 539, -57, -277, 562, -80, 229, 367, -423, -81, -132, -60, 229, 283, -207, 35, 22, 730, 798, -307, 353, 155, 412, -261, -233, 277, -420, 80, 173, 154, -201, 178, 396, 178, 120, 92, -158, 319, -52, -257, 165, -206, -148, -108, -112, -84, -172, 41, -220, -23, -152, -317, 306, -406, 82, 127, -98, 169, -277, -502, -367, -9, 155, -98, 283, 490, 141, -409, 261, 29, -231, 438, 210, 250, 259, 104, -533, 206, -225, 161, 373, -484, 183, -54, 128, -358, 456, -128, -86, -235, 88, -62, 522, -321, -318, 48, -182, 299, -200, -218, 68, 31, 43, 66, 364, 127, -251, -2, 382, -203, 389, 230, -2, -314, -215, -75, 163, 315, -212, 32, -82, -26, -53, 5, -350, 56, 203, 209, -318, -302, -81, 28, 442, 222, -199, -58, -367, -2, -42, -308, -421, 13, -285, -328, 87, -3, 424, 115, 68, 44, -363, -173, -197, -418, 52, 59, -382, 351, 24, -96, -476, -140, -137, -336, -167, 68, -74, 207, -19, -167, -23, -78, -213]
5740b13L42m18L03l95L37K72m18K38M10l09m81N89K36k72l04O9k23J29O77l65
5760B04K3m62j7n61N79J59J96L3k48j94M9K23j9K19k33M27j52n54P3L16l25J46
5782a18J23k57J54K04o48J94N51J08k61L6o44Q18p03O64j6l33n57O66N78q75L45
5803B9q2k05m71O26j05P84l15l66m73N40J95j69j06L37j9m87o6j70K03n0N73l23
5825a20k93M13J08j72N05r00N27K88q11N23j81L21r40P34j33M07o99N03N3p66
5845f33N51k58N41l95L45k23m45O0P72J59op93K93M92o47Q17q62J50l1J64l28
5866b77N15k91n48J223l33o46M31k94N10l17k14Q32r15L24k04N05J58r22O99J0
5886B46o35O33j86K96k79k80J89j1O7j95k44L16M92j42m50rK92L19n75o4N06k18
$$ y = [-213, 129, -289, 14, -381, -44, 228, -190, 48, 458, 149, -332, 257, 493, 221, -83, -14, -237, -108, 569, 204, 227, -235, -252, -813, -234, -75, 121, 154, -94, -288, -239, -16, -35, 184, -49, 378, 226, -328, -255, 61, -264, -118, 5, -252, -98, 106, -542, -348, 203, 311, 50, 86, -558, 260, -443, 221, 205, -128, -685, -19, 559, -316, 29, -53, -258, -729, -103, -208, 576, 261, -105, -578, -38, 157, -12, -118, 219, 200, -287, -353, -523, -320, -370, 203, -120, -413, 0, 108, -64, 441, -459, 68, 356, -455, 68, -113, 208, -732, 2, -131, 276, -423, 80, 133, -633, -82, -340, 201, -194, 151, -72, -517, -457, 315, 474, 468, -325, -32, 460, -187, 630, -232, -82, -113, 51, -277, 238, -53, -601, 622, 289, -357, 74, -220, 290, -27, -241, 591, -324, 0, -204, 301, 459, -463, 236, 246, -389, 244, 58, 354, 75, -205, -16, -27, 40, -155, -399, -83, 409, 267, -183, -192, 100, 419, -156, -220, 286, 68]
5908F8L0J65r6J05j30j40K97N23n57o69N58k66k49N06j06J21l51J30N5L84q28
5929d50N92n91N31q4K02j61l32M73J24k43j92L48r1j43O2L37k94p8j97j67Q9P
5951b58J10J26P2l38O52l80J51J18l24j1l44P80o57N99J32l66l52O9q7K42M42
5972C76l61L25j65J49q27P79o09Q32m68J08N1l15R4m13O09k17j59j00J76L00l08
5993a43J98j54Ml20M76l85L2Q5O50o14P8j9k77N38j86R7O2l38M0j83M50K94n45
6016a60k33j2Q44n08K90J76n08M98l95m2k55P88k59l15l04P98o70Q87j13m24P9
6037A62p82R71o1k38k73J86j07J64k66j50L73k02m7M64o72Q29k43K13l64k54O5
6058b32K99j32j64L57k14m20N03r7k95K68L54j5o14M36K67n70O29j141O94L33
$$ y = [68, 98, 263, 167, 272, 142, 2, 299, 822, 265, -404, 154, -112, -361, 145, 39, 160, -191, -61, -6, 378, -450, 142, -449, 82, -2, 200, 39, -293, 180, 304, 61, -131, 217, 126, -17, 45, 382, 88, 10, -187, -354, -265, -258, -148, -22, 50, -288, 364, -16, 135, 253, -71, -82, -426, 354, -303, 296, 428, 62, -290, -221, -308, -66, 376, 15, 340, 175, 324, -503, 276, -333, 499, 31, 139, 190, -125, -31, -444, 165, -52, -211, -311, -135, 165, -143, 55, -99, -95, -415, 61, -324, -292, -207, 443, -171, -93, -112, -389, 149, -37, 60, 122, -216, -176, -359, 91, 385, -160, -393, -405, 439, -69, 221, 397, -111, 387, -8, -50, -305, 483, 224, -91, -395, 403, -267, 620, 507, 83, 162, -620, 351, 290, 52, -221, -35, -142, 22, -244, -394, -21, -223, -270, 194, -478, 351, 108, 321, -43, -297, -232, 67, -65, -229, 128, -86, -506, -3, -100, -395, -127, 227, 212, -402, 34, 301, -269, 360, -781, -87, 246]
6078B46k86O51o89M9j83K45j54L10m34P36p59Q7K16r7K33k46j2j02J16K42k09
6099d0j74j17K56j04N87k10L78l17p5l32m33M52m02Q45o6j23j051J035q5L96l57
6120F3m9J32k91L67k23K65K99o61m71O67l09J86J04lJ88o20K21J02j12N05k22
6141A38m2J50m39J92m11M93o09P78k00k64J12K39j64l3r0L61n45O30j53K84j188
6162g61P57m61j7M72n71J51O20k55J97m34K62K64l86L11K9n43R7K3j01L87m40
6183c99j70M62mJ36M08k13l7J87m54Q85n08R1l2p64L06R1l18R09o85L09l72j1
6205a83K84o83Q58P2n64M13Q1j181J305m77Q6R8l08P43j257R91n54L8N39r3j91
6226A7K22j03j004R21p6J68l22L17Jm39m58J229k28K05j80q74O08N1L86n50o46
$$ y = [246, -40, 611, -78, -29, -212, 33, -121, 189, -245, 491, -268, -181, 35, -62, 171, -75, -87, -189, -73, 169, -40, -214, -331, -75, -179, 408, 198, 576, 259, 184, -148, -581, -129, -531, 314, 248, 125, -926, 109, 24, 420, 63, 14, 146, -145, 222, -1, 264, 563, -98, -569, 98, -211, -25, 79, 76, 264, -356, -135, -33, -145, 360, 138, 96, 246, -193, -1, -412, 81, -528, 250, 50, -214, -102, 137, -27, -60, -150, 211, -334, 296, 143, 427, -761, -4, -465, -482, -10, -581, -430, 190, -65, 132, -302, -40, 224, -162, 149, 178, -365, -268, -245, -346, 41, -399, -569, -107, -111, 25, 433, 220, 183, 370, -84, 801, 293, 384, 352, -412, -106, -15, -333, 576, -109, 200, -172, -183, 101, -582, 276, 348, -216, 197, 278, -903, 402, -75, 11, 109, -199, 544, -713, 278, -276, -238, 301, 208, 17, 239, 136, -868, 53, -23, 145, -177, 140, 141, -298, -756, 473, 245, 450, 270, -604, 4, 55, 441, -109, -755]
6247g55J128m45R6o6R8L56l82k56P3J3K46l17k54J005l88k84l84N24K85qq7o8
6269A30L10j55p25K95L12k99M11o69J065n31q1j23j9m2J17K62l74J31R2K52l88
6290b9r5M2j53O27n84k80P50j139R12n0M57J37p16J92J38o72M58l20N29l04o6
6311a66M04q2n10J40j30m55R93J15o36N67m89O75l85R8j2m21M05J14j31L08q73
6332d71O94P6m74j60J66K44l16j74K91j16M82Kj51L66o53q9M94m71P1K39N65p79
6354a64K63j41j50j02M46N8r0j11j45j60L3L07K39m97N05m82k97O37K11l86j22
6375a48M06Q8j63n31O47p4m33j0K22N21p14r5O47n78J57R4L8J32j16p1m04L89
6397Dq3N40n66J37K17n16M59K16q07K26m9L2N22l18n20M82L20j71L07m72P0o0
$$ y = [-755, 373, -72, 24, -42, 56, 412, 30, -226, -153, -140, 106, -211, -465, 540, 152, -132, -516, 8, 293, 285, 198, 130, 440, 285, -440, -145, 167, -132, 279, -390, 675, 144, 63, -60, -79, -121, -4, 258, -116, 15, 107, 359, -29, -124, -82, -235, 392, -192, -472, 278, -861, 51, 1, 458, 595, -121, 71, 209, -463, -5, -325, 204, -100, -166, 238, 156, -354, -214, -344, -799, 194, 309, -327, 240, -249, 426, 41, 139, 127, -294, 111, 225, 94, 402, -471, 223, 299, -175, -335, -169, 75, -241, -415, -124, -240, 242, 244, 93, 459, -194, -283, 211, -260, -189, 50, 615, -164, 99, -42, -192, -294, 152, 210, 120, 9, -136, -296, -263, 44, 283, -214, 291, -191, -488, 149, 360, -26, -148, 258, 346, 183, -348, 299, 225, -208, -218, 4, 525, -189, -284, 363, -215, -58, 36, 74, 206, 90, 19, -385, 4, -79, 461, -105, 32, 249, -267, 192, 408, -399, -173, -222, -190, 332, 14, -506, -24, 296, 125, 432, -40, 30, -30]
6419c0L06q7K66p27l3J40K87J8L6k39j47N06n51L89q5j66L84P6j097P05j12l0
6441a91O18n88J15P75q24N82n93L47J39l08J89K91n04j89O47q25M81j1p7j9k00
6462a45l5L95J60m30N74o06l33P12m04L99l31L22J7l5R8n12L52L46j25J11m34
6483I6q8j10O16o50K83Q1k65r1R5o5J90K3K18m99L52l41N44l63O41K16r12m4l22
6506c95P85k92R4l22M18o01K83j12q0J22L34L1l88M67q01N49P1j89L80l67K81
6527B68j30n44J82JK63k12K6j8j8N14J75m86J75K79m50J45o27N90k43J53K03K52
6549D98m62k91K79n5k78L59J85o40P27k81k53J55j0k18O13o33l18R27l29m5qj09
6571a87k37J46J50K22p9j81N40m28k7R6q5N0J91k50K96k13J60p02L92K47J54n08
$$ y = [-30, 276, 189, 455, -272, -305, -165, 122, 140, 176, -63, -210, 296, -255, 134, 49, -117, 267, 343, -754, -49, -161, -191, 427, -161, -46, 729, -95, 487, -106, 241, 380, 72, 261, 552, 48, -141, 506, -319, 162, 151, 74, 55, -145, -180, 215, 375, -55, 519, -87, -420, 292, -112, 287, -44, 278, 295, 260, 358, -154, 198, 544, 419, 530, 96, 8, -102, 514, -136, 147, 228, -37, -128, -33, -98, 92, 115, 333, -166, 186, -155, 389, 26, 667, 883, -29, -73, -395, 390, 98, 192, -130, 288, -313, -30, -142, -222, -100, 234, 265, -123, 344, -457, 92, 163, -26, 354, -13, 268, 138, -406, -224, -223, 40, -172, -146, -164, -182, 332, 507, 21, 196, 475, 25, 170, -457, 133, -110, 43, 246, 498, 36, -255, 24, -31, -309, 50, 235, -405, 322, 41, -212, -57, -67, -285, 328, -305, -623, 304, -25, -70, -78, -187, -424, -278, -128, 94, 15, -166, 374, -54, -81, 15, -70, -20, 171, -79, 217, 4, 164, -538, -146, 101, 255, -253]
6593b53K01j02N35N7j227Q92q12P67l3J91l42O13j206N38j41O91m06K07N7n29
6613c02O54l14P48l38oo3j29k97L03j79K25l41m07J079j136K48L39M09l19K24
6633C98o30L36k97l16N04k01M9L22j19o6l50j61Q33o85K01O36k15n51j9Q85o24
6654g0J8K55m05N70l41l97k3N75j33l48N57k13J59o8n5K56p6k60K69p03K54M05
6676B26N05m47j87j77n5L69n89M18j87L94O8l02K17J76o14J16m2M31k76m72P28
6697C00m25l6N26m62K45k49m28M33P95p63K17j42J05l17r6l46O29Q8m28M15K74
6718C35o98O68o45M45L1m77N37j2m57M94J73J39p72N61n95L87l16J41l80J36K96
6739il22N42m59J78j65O12q63M64k99K43pK80q5l15P59p30k05K33l6J70o71J094
$$ y = [-253, -52, -154, 381, 438, -789, 103, -709, 58, 25, 216, -126, 487, -719, -181, -322, 369, -37, 170, 227, -302, 352, 38, 786, 448, 442, 379, 250, -47, 256, 77, 302, -39, -446, 633, -503, -255, 84, 493, 174, 398, -232, 104, -193, -509, -5, -206, -157, 165, 46, -20, -370, -531, 302, -383, -182, 454, 239, -312, -331, 554, -70, -52, 203, -202, 368, 27, -370, -393, 182, 49, -299, 258, 45, 204, 136, 81, 337, 261, 1, 270, -433, -179, 226, 731, 284, 97, -80, -135, 234, -355, 63, -124, 270, 338, 36, 253, 429, -185, -69, -111, 320, 44, -428, 300, -125, -161, 365, -97, 148, -101, -529, -96, 699, -64, 153, 11, 116, -201, -297, -643, -14, 74, -354, 61, 335, -363, 305, -340, 105, 136, -341, 196, 184, -273, 221, 394, 533, -239, 322, -273, 114, -202, -61, -441, -305, -9, -331, 211, -248, -70, -235, 377, -486, -22, -321, -78, -85, 195, 110, -205, 554, -176, -381, -148, -184, -14, -685, 409]
6761D09q12N79k71k68J37J54j85O97n91J87j60n5P48p11q9j56P54n50K43m10P28
6782C78l66l49L71k22L66j32jk10M94l63m2N04r0o30N82l41n15P83m29Q91j108
6803d29O65k01o73O37L74%o52K14k07n1M45J85k75K89m51M49k96k44K34K59Q1
6824C53n46K90l57P11L9o48n1N98j128J073j19k55o2J23K84o7n33P29n00l32R03
6845E05l63j32m12L18j14l19J25k4M97M2m07K50k93R51n92o2P50q6l26r6k69J34
6867G7l05m0r1N89%m90O7l02M65P2j71L06Q1Km66L64k96K54n26P06m13K99J63
6890C45o67J61L89k90k03k23N42j01k05L35j17j64m06O55N7R2k25J81j6M09n19
6911C0j80L2K31K62J02m35q0k48M34Q1L99o47K01k68k44O13p44P35n26M22L16
$$ y = [409, -403, 176, -95, -363, -226, -72, -257, 440, -151, 36, -124, -179, 569, -142, -231, -387, 367, -183, 60, -350, 378, 12, -337, 34, -188, 178, 46, 45, -165, 329, -34, -76, 428, 338, -292, 290, -51, -566, 217, -212, 679, -429, 236, 35, -638, -1, 373, 373, -279, -65, -272, -323, 122, 307, 32, 321, -130, 319, 23, -221, 13, 272, 353, -193, 97, -260, 451, 490, -158, -209, 389, -739, 334, 215, -40, -102, 21, 305, 238, -295, 434, -66, -398, 505, 142, 10, -402, -84, -198, -517, -392, -416, 81, 123, -284, -34, -327, 624, 32, -30, 720, 634, 308, 212, -57, 77, -228, -268, -359, 230, 230, -260, -193, -495, -30, 42, -129, 177, 258, 260, -206, 158, -138, 116, -410, 296, -117, 182, 345, -322, -161, 228, -62, -265, -488, 54, -47, -252, 83, -34, -198, -604, 51, 108, 200, -25, 156, 140, 549, 30, -150, -118, 113, 375, 477, 42, -38, -286, 148, 229, 628, -19, 182, -86, -330, 283, -461, 274, -252, 170, 486]
6932D86p37JM34m0L28o21r6N95n53j11n43O61k24O21m6j16j50J36k1N86o96L81
6954B75p08Q23k09k64M75j67L83r63J69m33J043m40M64q41J50K26j97K49O6k80
6974a79K91M76q35M81J47l04R1j94p2q0j5p4O63k64n39Q04m54q7Q70l87l11L0
6996E8k42K85K3l50J66K54l11J5J66M44o00j90M00J70o12R27J01q16j43M59J62
7017C66j08l78j47K53j89L17j53kj55M87j07l59k53N24M7m38N76l35kM42o39j29
7039c82K93j00p0K17Q20p04N97k98J70p32N09j47l97j65Q2R0q2K55l73K46j33
7060c04j93M33m03N38j81K52l54kM07k48k18L86L67o67N47r06M26J18N31m63K07
7081B73j15l39L85n14J56J2K72l5K23l03l96J59K66k15L96k52l1o2J94L5k03N2
$$ y = [486, -251, -250, 184, 144, 472, -149, -245, 350, -203, -314, -857, -196, -420, 201, 155, 39, -111, 25, 4, 590, -106, 275, -433, 390, 181, -83, 392, 225, 608, -355, -186, -619, 424, -16, 448, -393, -243, -17, -214, 35, 101, -179, 112, 588, -247, 234, 381, 77, 168, -26, -98, -178, -193, -267, 396, 132, -407, 397, -57, -144, 726, 339, 28, 58, -184, 101, 124, -226, -60, 194, -117, -102, 64, 508, -92, -282, 118, 288, -324, 603, 704, -112, -255, 204, 366, 258, -120, -267, -14, -203, 114, -39, -41, -196, 291, 184, -175, -428, 96, 143, -295, 281, -54, -56, 386, -253, -382, -89, -189, -259, -42, 778, 74, 671, 373, 543, -189, 320, 173, -224, -389, -307, -217, -299, -44, -417, -171, -304, -497, -64, -467, 71, -110, 142, -212, -214, 193, -55, -273, 113, 480, -187, 360, -546, -120, -2, 529, 66, 273, 158, -181, 204, -310, -154, -142, 130, 95, 318, 15, -381, -222, 44, -171, 225, -27, -58, -120, 74, 109, -94, -42]
7103d2m08O16j52J79o14M72J12q6K68r51P09m38O54n88M27j27K38k30k91k2Q18
7124E44j211O09O58q24K00m0J073j140m14K3L11J67K38j84K06k3K72m12k21J93
7144B5j046Q14J72m9M60n84L12k45pQ5j31N37n71M80m76K13J50L99l75l31q5j32
7166c85L42L94k52k81j42L42K22k81q7r7Q03p81J8Q9O88l88n83mM94k22l03M4
7188c70L45j8L26m75J74L07K09m55k94N11k52M14r02N27m38%k48K00N05n32N34
7209F8p0K42j17j14k60k7N07m94K94K2K3k78N15n50J74Q9K53l32J03k17J045q95
7231a9K42k95M40l69n08L15L51j98J55l09L74k21l70M54L05n62L96P8n9J05j55
7252A50p7J37m33K5K08K04L4m28K23K93N5P7q72j03M25J22M95l06J14k43K94n7
$$ y = [-42, -450, 166, 14, 193, -421, 51, 163, 77, 345, -606, 103, -335, 319, -269, 158, 31, 269, 39, -252, -274, 544, -667, -58, 600, -224, -24, -64, 1009, -131, -545, -522, -211, -44, 194, 10, 216, 193, 465, 53, -168, 25, -1021, -207, -35, -84, 376, -208, 104, -141, -148, -63, -194, 343, -228, 252, -224, -11, 139, 538, 163, -168, -253, -385, -43, 351, 99, -182, -324, 18, 240, -41, -128, -225, 578, -203, -185, -96, 592, 204, -379, -383, 111, -111, -414, -370, -25, -43, 283, -192, -18, 289, 498, 43, -251, 260, 8, 422, -480, 47, -391, -391, -639, -439, 66, -466, 68, -2, 240, 123, 9, -251, -278, 229, -265, 29, 51, 74, -204, 311, -239, -65, 24, 277, -55, 48, -169, 876, -19, 223, -72, 368, -1, -509, -194, 157, -41, 114, -195, 179, -42, -412, 42, 347, -215, 181, 259, 200, 305, 150, 73, 210, -223, -198, 10, 214, 248, -180, 43, 336, 391, 468, -404, -507, -82, 40, 535, 229, 343, 100, 394, 337]
7274C37n27m6M53J56j60K21k70m36J21J61j11j14M16m71Q1n2O81n21P2O5k26L72
7296B02K50p13N66J7L2m62k1J01q6K07n00L56L67l31J06K09k01j26j29p3n6J75
7318a10K3l6K10n95P76k76j45K27o70O10l56j18KK11O22n33M81m92J45m71J74
7339c21K29k8N27on57L85K0j8k36j94K83m54J34O95k12j79n12J62O88m27k88N82
7361B73L98n93l71L29j91M18m61O63m27m7O5p4L24n44L46m37O02j60l42N46j7
7382C00q4j013N96J2J08j95q4R57o10J67M15o22q1k71R26o55J16k36L49l9L5L1
7404A22J60k36j47M52o80L83l43L27J06K40n63l8M87K14o06J96k60J43J93K85
7424D35j08j06l29j1L34n33L58j84J39l04j73N06q4k21O4M37l1n36N69j04K81
$$ y = [337, -190, -236, 217, 373, 213, 434, 164, -272, -151, 10, -101, -215, 201, -270, -189, -241, 440, -81, -9, 56, -170, 202, 452, -261, 305, 322, 354, -108, -129, -28, -114, 93, -407, -51, 316, -15, 91, 300, 99, -27, -156, -229, -285, -110, -87, -123, 87, -508, 268, -8, -153, 74, -596, 14, -342, -460, -458, -247, 375, -158, 323, -169, -24, -495, -321, -92, -120, 407, 401, -156, 229, 249, 231, -5, -199, 84, -370, -236, 459, 247, 68, -444, -282, 406, -21, -309, 273, 671, 78, -293, 36, -155, 263, -198, 465, 38, -9, 56, -18, 306, -238, 108, -329, 273, 113, -229, 317, 300, 216, -797, -201, -189, -81, -276, -360, 597, -13, 154, 569, -53, -134, -405, 521, -134, -18, -254, 95, 56, 91, 122, 282, 46, -101, 351, -329, 54, -289, 38, 144, 384, -179, -217, 270, 484, -122, 74, -186, -43, 150, 435, 327, 221, -108, -119, 215, -318, 40, -144, -5, -309, -482, 24, -60, -281, -217, 220, 189, -347, 222, 118, 399]
7445C99l75j56J03k16L73O2M2k70qj75N18m17O54j91p6l21k15J92K58k09l55P89
7467D06n49l9L46j82L55q71N36k6L83o94n0R16k39m63m97Q94o46j0n34Q70K95
7488B01k50l9j42M15L40n75K3K96k43J5L33p46M55l83P01j14n16J081j496Q49
7508B05j13m97P69k50k4n50L94j63J10n88L29J74l7K81J75m41k89M49l1L34J90
7529D27n97L01k57r6R09o14o3%k48k25O91o53L13R4q1L8L46k56q4Q3L21O3p34
7552c22J95K89n1nj24L80k51n38J8K17k82O37k51N22p09M6N83o46K20J47l17M58
7574B16l53J37m69M57J52l72J50K11n14P58n41n2L96J61l02o3J59l26P03p51Q41
7595E98q38N78R8k41p8o7k50l1J50l05R9K43j46m2K64J06k21L22n65M02K83K74
$$ y = [399, 24, -132, -29, -245, 128, 190, 232, -38, -46, -221, 297, -120, 534, 343, 267, -54, -269, -77, 181, -28, -383, 406, -143, -182, 164, -18, 337, -534, 2, -24, 359, -335, -385, 531, 292, -171, -668, 226, -420, -430, -964, -94, 201, -49, -88, -230, 185, 525, -50, -27, 269, 26, 41, 374, -372, 83, -300, 401, 287, -229, 852, -644, 205, 92, -405, 364, 114, 90, -460, -66, -229, -119, -707, -378, -204, -241, 40, 215, -226, -515, -66, -97, 237, 427, -170, 131, -126, -222, 687, 73, 10, 10, -238, -463, 228, -425, -112, -18, -99, -61, 285, 29, -55, 28, 349, 412, -322, -127, 162, 111, 106, -18, 362, 111, -427, -409, -192, -474, 163, -88, 434, -275, -229, 354, -292, -72, 75, -242, 216, -137, 0, -469, -12, 140, -232, -82, 129, -385, 373, -168, -220, 176, 337, 35, -28, 131, -195, 508, -243, 598, -240, 338, 436, 195, 117, 50, -200, -231, -81, -386, -287, -44, -190, -232, 32, 138, -83, 239, -326, 76, 359, 633]
7617F33n04J91j64K44k81J63l58O33p98R7M98j128J096j29l01q4M84l67J65K40
7637C30L0n15L12q8K03m22m74P27k1O8J35n1k51j02k33M79p15L02k84M75M80l19
7659F6j40L1M61o34k54O35R3o5k51L02l87j43j31J82J11K51L44j33l26K09m88
7680b67L75l67m1j14K33N13m50K12J01N9L6n03J71P2Q6n0k31L7J1j40N24J62p12
7703b83J95LM43n1m75k78M47j86J8K20j91O7L21p36K73L09q7L54l24J22O3j40
7725H4j57J57p4k28O47m27J18p55M52N35p4j88N4j57L67k96k36N93k63K37p14
7746c25j02Q9M12J37J68n88M94j14n64K96K60n41J45K72m75R07o24K04l27j10
7766c86P7O08k98N5L7q5j12m95N74K20N9m71L93P9j91K31l7q24J175r46K94j45
$$ y = [633, 129, 320, 156, 400, 119, 282, -76, 557, -241, -144, 354, -774, 322, 193, -108, -192, 292, -75, 90, 330, 360, -155, 157, 69, 272, -150, -624, 103, 82, 150, 285, 234, -17, -119, -352, 127, -588, -286, -570, -95, 385, 66, -74, -43, 418, -216, -470, 165, 258, 193, -58, 244, -143, -286, -417, -235, -124, 127, 471, 338, 12, 221, -267, 108, -259, -300, -414, -181, 332, -118, 94, 195, 254, 290, -213, -42, 30, 116, 66, -165, -128, -117, -257, 267, 429, -283, -88, -85, 358, 307, -168, -446, 1, -185, -167, 53, -138, -71, 250, -486, -213, 96, 9, 363, 39, 161, 224, 84, -73, 84, 10, -218, 429, 2, 120, -635, -183, 352, 278, 90, 144, -13, 354, 58, -178, 415, 152, 389, -325, -427, -338, 74, 211, 379, -209, 285, 171, -393, -97, 163, -378, -233, 39, -436, 471, -153, 51, -276, -386, -309, 299, 1, 56, 93, 8, -104, -599, -25, 195, 254, -217, 176, 255, 64, 295, 258, -566, 609, -337, -43, -188]
7788a88pL32m18Q82m34m98M08L19o92L20j33J32k41L48k45m09R7J171p98L9l13
7809c28K6N38o01Q47m32L53m91j28K98l8J33N4m15n2K07j077J362n36P23l26K28
7830C45j02j79j15k04Q51j032L24J14M5n02L98pM75r5m64M23j75Kr80Q88k58O74
7852D26k45j28O57j297Q19k27L22r7r2n89M81k25L56J35q20P40k06k67J92m25
7872d90L32P5k71K45J9J62M5O3L8p68M30J10J98l44N08l22r2M50K8o27K81l91
7894c21M15j72lN4k73L38k0p6L0j07M44n35L25O2l53Q19m47n76J17J08K55l40
7916b56P85j047K96Q66j170L80M0K3k57N20l22J14K74k7Q3m51K79j65K85k98j80
7937b28Q20p23k95P45m48K10l07N08m20j16L7k26P9O99p58N27n59k8R00n11K03
$$ y = [-188, -195, 137, -281, 601, 167, -331, 77, 396, -296, 24, -109, 23, -218, 130, -115, -524, -427, 744, -54, -15, -328, -302, 236, -365, 482, 50, 403, -88, -216, 82, 44, 177, 231, -184, -236, -29, -1106, 256, -280, 443, 117, 345, 243, 64, -51, -255, 596, -436, -112, 2, 47, -455, -57, -64, 411, 316, -148, 275, 100, 102, -878, 10, -248, 426, 181, 53, 710, -587, 232, 5, 327, 230, 138, -451, 30, -195, 161, 296, -524, 216, 10, -257, -65, -490, -158, -83, -354, -109, -90, 72, 117, 180, 218, -550, -120, -10, 188, -156, 352, 30, -62, 388, 416, -211, 70, -321, 94, -78, -81, -27, -300, 38, 18, -58, -28, -135, 309, -226, 99, 161, -192, 627, 180, -396, -279, -171, 84, -256, 529, -518, -222, 644, -526, -146, -106, -83, -340, 180, -142, -28, 246, 219, 302, -149, 130, -35, 250, -48, -228, 592, -131, -426, 319, -129, 81, -226, 282, -138, -254, -217, -443, -364, 335, -423, 104, -455, -483, 417, -94, 109]
7958A09j02k2J45M8o42L03N78k97j92M09m50L74L80k81n00m23p8M06K10o27O66
7979A4l90R7O61o47M60J63k14l7m96J01M55k41j28M05l10m1J72j93M16k08j02
8000f3L03l74P7K21o58O29j71J82J08l07l69K19o5N4J92J74K1m8p0Q0k07j18j23
8023c13K93K06k44k05K51k06O55o05L25J02k54l01N9L20m37k50R55l11K9J08k72
8044i5M37l96N26m53k93J30K85k83K39j23k47L62K47o0M61j091N42k81J95m8n10
8065d56m3P66L49j053N92m13N0L73n07P3l3J26j04J080p68j63K2M80l78j2m18
8086d37J81N08k91k61M79J43J34n09L3j76M99k39j72L00m06M98j112J026K85m01
8106H2q2j73k56N88L8q96N24M55j77R0M53p35M1J8J7k06L65k82L83J64n06P16
$$ y = [109, 7, -15, 130, 178, -464, -161, 417, 120, -72, 337, -113, 261, 641, 360, -140, -563, -641, -235, -25, -652, 14, -376, -279, 382, -265, 195, 358, 144, 107, -389, -288, 167, -74, -202, 203, -107, -148, 24, -169, 247, 39, -63, 240, -134, -57, 164, -494, 135, -36, 146, 254, -53, -422, -203, -268, -214, -22, 152, 173, 125, 55, 135, -72, -190, -313, -20, 186, -58, -263, -12, -218, 437, -168, 157, 259, 5, -296, -237, 83, -354, -604, 351, 40, 69, 177, -95, 342, -54, 472, 19, -274, -144, 141, -142, 97, -26, -273, 89, 336, 276, 737, -354, 188, -93, 102, 54, -456, -499, 267, 616, -437, 155, -258, -208, 165, -342, -269, -302, -176, -280, 800, 32, -131, -109, 371, -7, -19, -437, -256, 252, -39, -300, 179, 322, 456, -53, -20, -196, 303, 64, -108, 192, -214, 284, -828, 198, 483, 82, 0, -173, -429, 159, 197, -699, -175, 280, 103, 193, 646, -89, -48, -30, -13, -219, 146, -136, 247, 411, -95, 621]
8128F21M2o05m6l73K95K47n30R6M10k21J39L45p25O51l06J46m00N80n98j6P13
8149D65j59K07r28M35m24J96m78J208n70l4M18o50L54J15L56k70n63j1J61M7K16
8170I1O93o15j046J491m39l14j53M82J95o22J70p8M89k22k58J71q3PJ74j88p7
$$ y = [621, 663, 58, 12, -361, -66, 181, -349, -253, 157, -64, 75, 420, -305, 346, 40, 186, -214, 366, -232, -248, 465, 306, 513, -415, 20, -404, -208, -686, 522, -48, -82, 336, -314, 40, 155, 511, 241, -322, -333, -172, -125, 91, 784, 169, -877, 614, 175, -139, -292, 190, 385, -237, -67, -145, 344, 122, -136, 35, -48, -41, 133, -55, -132]
8191a32
$$ Imaginary data points
##PAGE= N=2
##DATA TABLE= (X++(I..I)), XYDATA
0@%%%%%%%%%%%%%jL3o4O4o4O6r8J28j30J62j94K27k77L13l60M22m88N60o44P36
33C91q36R46j068J202j347J507j684J878k089K320k573K849l147L476l834M226
49B217m657N134n655O224o860P571q374R276j0296J1475j2854J4482j6441J8856
63A0098k1914K5925l1459L9653n3147Q0621k46428L69476q1500m10536O39890
74C20679l49800j56877M67231l96629k0803L78695m61113K02691K08970m25389
84b32345L31604N5523m04203M33510j24168l10090M65717k40900j93798M68395
94B49245l37846m9330L91827l86812O9838K78226l94903J84729J42297l42783
104a95512K68859J2429k66197L20420j18345j78019L35939k28684p7162L24188
$$ y = [0, 0, 0, 0, 0, 0, 0, 0, 0, 0, 0, 0, 0, 0, -1, 32, -32, 32, -32, 34, -64, 64, -66, 96, -98, 129, -148, 165, -195, 227, -261, 299, -345, 391, -445, 501, -567, 635, -712, 795, -889, 989, -1100, 1220, -1353, 1496, -1651, 1825, -2009, 2217, -2440, 2694, -2961, 3263, -3597, 3974, -4400, 4876, -5420, 6055, -6799, 7683, -8758, 10098, -11816, 14109, -17350, 22303, -30844, 49777, -196651, 172825, 91325, -319211, 320679, -29121, -185998, 281233, -115396, -136199, 242496, -218617, -15926, 193044, -232345, 99259, 154782, -249421, 184089, 59921, -250169, 215548, -25352, -219150, 249245, -88601, -137931, 253896, -132916, -63078, 215148, -179755, 4974, 147271, -195512, 73347, 85776, -180421, 139999, 21654, -156365, 179574, -49110, -126272, 197916]
114A97916l06034K8812K74889l40220J17968J94234l29694J86155R7137k80016
124a58853K30336n576k04263K46367j02882j15561K36696j77169k5287K11742
134A35550k24816N5321J69290k48790J19986J07697k45009J66394M1914k09824
144a32287J96402k2620j51431J99950q2351q6505J77073j30444k0731J42239j57625
155f8330M6999J02776j67200J04469N3521j64113J39131K028j47074J57974m1263
166A8918j10978J64083p5066o2269J45552j02428j3878J09687j18976L2386O7795
177E4826j17908P4935K9020j07302J05134j1056r0801J17599m6272o7885J17355
188E7645o9614l6661J06973q3071k995Q3345q8861K5793N1679q5704M9533J9626
$$ y = [197916, -108118, -79306, 195583, -144637, -26669, 167565, -162129, 24026, 121163, -158853, 71483, 65907, -138356, 108011, 5129, -110432, 126264, -50905, -76192, 135550, -89266, -33945, 135345, -113445, 6541, 114238, -130771, 35623, 77537, -132287, 64115, 41495, -109936, 90014, 7663, -78842, 98231, -32213, -52944, 89295, -68330, -21331, 81445, -85755, 18714, 72235, -91878, 47253, 49281, -97793, 60181, 18918, -92060, 72023, -3043, -65312, 80240, -22188, -36066, 73621, -45355, -12969, 54826, -63082, 11853, 40873, -66429, 38705, 27649, -63152, 54447, 8175, -59710, 57645, -11969, -48630, 58343, -24728, -27723, 55622, -33239, -7446, 44233, -41471, 8062, 27688]
200B7688p2811O8327r493n4402P7113l5987l4679P6754n5059j4663O9839o5822
212b3195O399N7027o9399K4006L8014o3894L7375J5623n2103M5191m381l7330
224b6667M9502k3670k0603M8493l7758m787M3561m5288Q714L5004m7631J9750
236a380K3682m4864K7246J0226l6985L1076m60k7526L2882j2592j4705K9801k1639
249e238l843K5232k6877O035J9930k8358J2785J3950k8623J8422P364k5281K0491
262E989O24k0159K1694n919j2875K0074j0423o405J7851j4652o61J4515j7362
275g709O361R897j8170J0284P730j8187J3313K479j5895J4866j708j2819J5896
288F338n676q139J4208q132l161J2134j0860J046R220j2294N530N798j2659Q190
$$ y = [27688, -45123, 23204, 13711, -40691, 36422, 435, -34244, 42510, -12549, -27212, 42627, -23195, -16796, 40231, -29168, -5162, 32852, -31042, 6333, 21956, -30147, 15044, 10663, -26667, 22835, -835, -21438, 27055, -10703, -15490, 28071, -17217, -8503, 26501, -21130, -1380, 22302, -22562, 4684, 14910, -22075, 9001, 8541, -18985, 13897, 1305, -13400, 16401, -5238, -9081, 16151, -10726, -4691, 15239, -13119, -334, 13616, -15007, 3415, 10779, -14502, 5989, 6613, -13546, 8148, 2229, -10646, 9428, -995, -7400, 10451, -4201, -4862, 9653, -7709, -1348, 8549, -9621, 663, 8393, -9794, 3519, 5998, -9897, 4969, 3261, -9558, 6338, 662, -7477, 6731, -1401, -4562, 7572, -3288, -2242, 6978, -5316, 214, 6012, -6647, 1543]
302A543L704j2468J0675j6j0789J2077k458q909J2122n695m432J0164p524j684
316c690R780r601K124O368r992N458L936j0423Q570J220j0162J0742l047p286
330f003J0805m647n365J0344o757j846P584o278J192N377q276M007L628q408P226
345B583J48p285Q056j945o137Q818l852m626Q694n472k325P743o519L24M870o084
361c009K865L378o839M941M66n710O720j841m761P701m361l112Q054o221k69O173
377D175o492P91N611p017K801K394m998L996O8m235N327j974k915N561m370j083
393b360N900n520M85M815n454J731L279n323K381K423n352M181L74m607M999k481
409e29j070L687l168M03L321m804J683K837n228L255K234n275L545J400m789L625
$$ y = [1543, 5247, -7221, 3454, 3438, -7351, 4726, 2268, -6641, 5481, -214, -4646, 5518, -2006, -3690, 6090, -3511, -1387, 4981, -5011, 447, 4383, -6040, 2530, 3750, -6412, 4330, 1283, -6003, 4802, 155, -5210, 5134, -1623, -3469, 4115, -2163, -971, 4406, -3870, 137, 3765, -4643, 2583, 2731, -4554, 3502, 1557, -4580, 4238, 386, -4240, 4454, -1018, -3343, 4400, -2119, -1795, 3075, -3009, -144, 3234, -3605, 1336, 1802, -3908, 2812, 971, -3790, 3911, -450, -3562, 4492, -1729, -1998, 4175, -2317, -1526, 4085, -2932, -131, 2263, -2735, 1261, 1329, -2906, 2421, 447, -2468, 3093, -1277, -2360, 3540, -1980, -1495, 3320, -2134, -403, 2876, -2447, -66, 2357, -2995, 1186, 1560, -3047, 1952, -529, -1599, 2088, -1080, -677, 2644, -2160, -477, 2360, -2868, 387, 2621, -2654, 891, 2291, -2498, 1127]
425A127j4l082L584j893j192K633j810o0K248k651J168J292k868K131M02l616
441b601L716O1l052L535j458k063K983j126j025K497k355K85J966k750J781N76
457I70j719J756n79j521K193p01k109K734j100r98K601j877j006K661j546k6J324
474A057j883J046K34r62N37m12j64J198m41n71J359j722P6J479k500Q86J884j889
492g88Q12O58r58K48N20r79K91K31m27J97r59J085J082k182J192M26j473J531
510E07L58j437P60K39j257J118Kp37Q01L92q65k37P63n68R5m1J69k18n66P34j33
531a21n26J178o73j99Q13q85L05P13o01k96P97m03n16M97Q1k16N04j80j97m71
551c96K67L37p9o41N11m52M63P02r26N10O21q56l40j55K79j24K47k90O64m27q3
$$ y = [1127, 1113, -1969, 1615, -278, -1470, 1163, -647, -707, 1541, -1110, 58, 1350, -1518, 613, 1015, -2601, 1115, 1176, -1876, 1659, 201, -1862, 1121, -5, -1030, 1467, -888, -603, 1363, -1387, 394, 970, -749, 1007, 428, -1093, 1100, 399, -1710, 1024, -76, -1074, 1527, -350, -1356, 1305, -241, -267, 1057, -826, 220, 454, -508, 29, -383, -547, 651, 210, -361, 998, -724, -648, 831, -1669, -783, 1101, -788, 24, 682, -276, -28, 492, -487, -196, 35, -392, -195, -1154, -69, 1013, -1169, 23, 449, -1024, 507, 865, -572, 188, 427, -830, 288, 290, -447, 354, 746, -119, -356, 407, -161, -66, -107, 62, -156, -722, 12, -121, -647, 531, -142, -341, 472, -413, -108, 605, 4, -292, 505, 102, -414, 83, 164, -52, 452, 272, 75, -396, -129, 208, 129, -512, -1, -453, 10, 712, -214, 296, 917, 61, -279, -434, -155, -279, -32, -322, 342, -85, -168]
572a68J59n58P92l43l27L00O27q16K62J61q09O65J71p19O57m79P49q16N76m54
592c70K88k78O79j31j79K8j83Q5L81j04m56N53O4r54L57K15N5k88L88k08m59k09
614g26M05Q42n80Kq2K70m53K87O4l50K76r2j33J19j37Pq3L55J16P4p3j24m38M54
638@P0N18o08L77l91l47O47J58k66L15j74l48L26l76l58Q78l94J08L4k63P82q04
660a16J92J03l13m8N70m02L56m61m49O88k33J55m16M28o2L61k69l44K76Q2k54
681a56j40L96r1k7J77L36m84n43P76n58j19L92j06R2k32R4J6k19P75p66P37l95
703d5j29K41J7j85J80M36j61j64J61j01p31O18L96p00j45N65k53K67n08K20J64
724A43n15O25m19K1o0J50j25O28p04J%p3L02O92m35L14n25J62k85N60q40N83j46
$$ y = [-168, -9, -567, 225, -118, -445, -145, 482, -334, -72, 89, -720, -55, 116, -603, 54, -425, 324, -492, 84, -370, -82, -360, 319, 188, 9, 37, -146, -61, 320, 216, -240, 313, 377, -577, -220, -5, 50, -238, 150, -58, -517, -726, -321, 521, -59, -57, -139, 131, -322, -35, 29, -321, -45, -137, -270, -151, -288, -281, -364, -9, 107, 181, 108, -16, -454, 0, 70, 588, -20, 357, -34, -381, 266, 424, 158, 473, 299, -49, 277, -99, -457, 421, 27, 135, 169, -94, 688, -116, 76, 179, -134, -182, 388, -14, 342, -119, -568, 120, -113, 42, -374, 54, -8, 353, 84, -260, 16, 98, -156, -296, 100, 9, -18, 159, 495, 11, -532, 244, -314, -433, -41, -147, -55, -287, -193, -177, -396, 379, -387, 350, -45, -174, 67, 84, -101, 79, 515, 354, 190, 351, 250, -481, 137, 533, -167, -312, 253, 0, 267, -241, -21, 143, -372, 253, -166, -145, -205, -55, -180, 448, -256, -255, -255, -328, -26, 666, 231, 545, 20, 182, -103, 457, -383, 200, 54]
747E4J2k78L77K29L2k54j86m45P52o41N76l69j25M11l49K09J92l49l92N34j34
768a44K08m09L56j5J20K24p47M17K2Q9k68J02L75K33q78K85L30N06r67K89m58
789c30K82N4m02K70K63j33m8m2K02k89N53l88j21k98N06M3jL4j54M6m17J32P1
812a67M18j28J09k29K39n50M25p37O18k76J13k12K76J61j19l5O19k39n33N40j30
833A63qJ80l27j02r9ML01j65K56J88o29M58P1j71Mq2m46k44O06L77l81J98L83
856E35o45K79l96K73j12K60l12J88L42k18J36o34J07J40j89L55j20L26j75j50
876a0L15m71K20m53M5L35n23P99q96O42R8l39N89K33n19l9k57j79k0K69J57m3
898d7L38l67K61j7P6J21n15M69q8l8J8m52Q0J89K91l06m12L24J77j88qk25P2J18
$$ y = [54, 66, -212, 165, 394, 426, 172, -14, -459, 293, -348, 228, -141, -266, 145, -204, 5, 197, -152, -544, -10, -144, 64, -345, 11, -4, 116, 340, -407, 10, 32, 121, -147, -45, 330, 563, -315, -30, 300, 806, -161, 128, -330, -48, 6, -396, -126, 137, 4, -44, -86, 116, -173, 380, -8, -129, -427, 79, 122, 121, 155, 1, 47, -370, -238, -167, 251, 123, 232, 3, 242, -308, 117, -620, -2, -278, -165, -377, -101, 60, -59, -94, 525, 286, -247, 293, 163, 155, 335, 8, -94, -193, -189, 112, -53, 203, 391, -238, 220, 291, 120, 124, 42, -404, -648, -42, 335, -46, 152, 535, -110, 169, -227, 46, -66, 194, -118, 70, 412, 194, 330, -304, -197, -57, -246, 109, -11, 315, 140, -10, 305, -166, 54, -399, -354, -19, -542, 257, -639, 3, 101, -238, 351, 584, 65, 26, -231, -410, -430, -161, -4, -47, 291, -76, 185, 168, 244, 365, -150, 319, 231, 193, 211, -241, -161, 28, 319, 13, -399, -75, 102, -86, -94, -319, -247, -129]
922a29q2P2L13j27l51M72q9J00o1m5j78J94L50j69l3j19K12k18o77M68J0m41K39
945b89k28N00J26J67l65K54j50K17L1j24M6k22J49p5j41O11j84j85n8k52M79r28
967f21N31l24P27l9l10L21l93N31k98p33N25J08Q7L4l70L66k84N23l01j58K1p6
989a33J07J3Lj00J85K95J71j108K42J56L49M4n76N12o29N30J98n76N29k24O6k48
1011a94j0L5N33l80J52Q9q30O31L09k37Om29q8K82L19k72K53l64n25O75k00J75
1033g0M44o20J21m42mM29J58J25j54j7K49M7n8k74J87M21l37j87L35n98L7l73
1055e81O84j29j97J18O31o92k19N70j31m13Q45p13J72K93Q3o84O23J73o63r8L35
1076GK80J61k92J03J61j84k1o1O38p45N18m32r1k00L71k8o67N35M66o51L61k30
$$ y = [-129, -211, -139, 174, 47, -304, 168, 79, 179, 118, 73, -105, 89, 439, 270, 237, 118, 330, 112, -565, -97, -87, -528, -289, -517, -17, 109, 276, -89, 165, 15, 232, 263, 139, 185, -37, 112, 37, -104, 507, 323, 138, 80, -172, 307, -621, -90, -414, 313, 274, -36, 285, -108, 423, 125, -608, -83, 25, 112, 146, -224, 142, -142, 381, 80, -78, -57, -133, -26, -13, -10, -110, 75, 370, 541, -567, -325, -169, 180, 224, -352, 160, -469, 61, 259, -317, 212, -12, 54, -194, -204, -169, 364, -16, 136, 225, -605, 26, 335, 98, 104, -325, -413, -131, 188, -84, 169, -195, -720, -45, -245, -70, 374, -246, -125, -567, -571, -142, 16, 141, -13, -30, 219, 266, 208, -66, 121, 542, 205, 18, 353, -245, -208, -581, 103, -26, -223, -105, 526, -166, -385, 185, 54, -359, 486, -227, -55, 238, 321, -363, 260, 433, -230, -328, 7, 287, 448, 156, 259, 420, 236, 215, 154, 792, 47, 565, 133, 42, -158, 213, 185, -482, 53, 519, -132, 229, -1]
1098aJ51l06K97k53K68p97O48l62O74J18m00l39N8j99K28J78L60n0n73j07L75
1119c2p0J41Q5M2j25j80J16K73J46m13m30Q14q33k6N89J49J28l14j58K3l93L28
1141a40L74m43j17N78k50k87J73K03K75j55N53n84j71j76L26j42j3L70m09R7l60
1162b98M87k67M6J33m68K94p8k59P73j38l24R3m73L58j19L51o6o80N55L30o76
1183d26P90m23J96m4l71K49q6K16N81p32J15N02l69l22m48P90k01K03j71K82m3
1204B88k30r9K7N17l96J15k7n85N33j3k34j11N78m04L6M5k73O34k87j3k45K88
1226A44j50r4m2J49m92K53M51j53l90L12j85K66r2j01k35K95k54N68q32N96K17
1247B31k26K74o01O83k97j24L57L10q59O0L10j46M70m47k74J66l57M79j78j16
$$ y = [-1, 150, -156, 141, -112, 156, -641, 7, -355, 319, 437, 37, -302, -244, -443, -215, -37, 323, 273, -300, -407, -32, -102, 39, 124, 166, 41, -139, -23, 250, 396, -17, -447, 367, -466, -492, 97, 246, 374, 60, -98, -75, -468, -140, 234, -209, -326, 252, 2, -285, -112, 91, 366, 211, 764, 180, 9, -167, 159, 17, 4, 374, -35, 62, -298, 189, -78, -32, 101, -367, -73, -151, -410, 363, 225, -99, -6, -479, -121, -240, 111, 45, -635, -80, 250, -426, 364, -59, 137, 93, -278, -29, -115, 101, 682, -50, 65, 567, 198, -124, -572, 218, 17, 220, 49, 331, 288, 58, -41, -14, 503, 107, 222, 195, -390, 143, 130, -104, -215, 363, -41, -5, 40, -233, 401, 114, 101, -144, 144, -6, -100, -142, 7, -485, -232, 219, 66, -324, -12, -197, 69, -23, -124, -359, -64, -318, 250, -582, 14, 231, 5, 279, -322, 361, 64, -60, 297, 607, -252, -192, 118, -28, 442, -5, -279, -113, -470, 9, -169, -285]
1267b85j13O20J8q57O27P5K37J48o54j18L71j88J18J3j47r2L58l44O28l79n41
1288e05P91J98l74l35M44k81N11n67K41l42L66q90L34K98K62l32j99M29O03o01
1308E1J75J76p44P56p13M94n19K28K8j71J01L7n8J15m06R88k40k12M6o17L26J44
1330a5K02K29r92N98j33K92R7L61n18J77q1L12q12N78n63K62N7p2R1J25K07j001
1352e99M47K76M0J15j86j6M27q78K20m55P50J93%k94P10q95j31L51Q6J59m95R1
1374h4L43o13Q84q03J30K60l57K07Lj34o6J63l51N88l19J19N5J37k72J09j72l69
1396e42K41J97M7n1M06k61L04o4l42l14M03K53j7m47J04J81n4N16m43M17o71m80
1418f17M58M74q38L96L56k80k94K28K72m63M02L29l13k17j90M10n48M40o13O90
$$ y = [-285, -398, 222, 240, -617, 10, 85, 322, 470, -184, -302, 69, -119, -1, 12, -135, -227, 131, -213, 415, 36, -505, 286, 484, 110, -225, 219, -62, 449, -118, 123, -219, 147, -743, -409, -111, 151, -181, -380, 49, 652, 51, 226, 402, -342, 414, -299, 195, -324, -96, -68, -239, -138, -101, -159, -44, -450, 538, 298, 86, 132, -485, -159, -15, 187, 416, -576, 22, -111, 181, 278, 639, 121, 298, 217, 529, -283, 295, -268, -6, 51, -21, 70, 195, 402, -599, -152, 124, 164, 279, 93, 77, 504, -374, -154, -609, 141, 334, 334, 40, 750, -145, -276, 75, 161, 320, -175, -84, 259, -354, 530, -273, -143, 117, -240, -33, -30, -164, -230, -67, -418, 170, -149, -30, 25, 162, -110, -1, -173, -542, -301, -104, -57, -108, 298, 37, 341, 277, -65, -379, 24, 277, 260, -187, -83, 98, 44, 560, 117, 534, -137, -617, -159, 315, -523, -127, 229, -51, -345, -117, 155, -308, 94, 423, 110, -107, -297, 113, -435, 5, -608, 82]
1438H2O37m99J28m33k1q8L05K0m8j43L70n51l87O55j79r6M43n64j02n3M11j18
1460b31M74r0J38m23L32K20j02k39n49M82Q2L50l38l01J54O40p30L52r7k55j82
1481c13M83L97p81J81k70L43j38K98r1m28K27J55J74o87K47N3m45R53J21n05J47
1502A21j81K49n49N97L5k50R3J2m68J96p25O48O39k68m65k6P35n45P54m71l99
1523b68k93P09K97r03K56P47m61j76p7P65n29n77P66l68k07o5N80m57K9L01J79
1544B48k6n53L90L13k33M2k08l17M09K85l81k22K12j32K77k37O16n40j7K11j48
1565a1k51L96l13L84j90J53l90K63L65o30N66j65j47k50Q1K24n45L05P8l78L00
1586a55N14k06K8j69j18j82M73m2R0m30K66J53k31L93j81j55l22J88n4Q0K8K17
$$ y = [82, 719, 220, 348, -85, -106, -194, 111, 131, 83, -60, 310, -241, -628, 27, -152, -248, 195, -369, -471, -524, -113, -231, 243, 153, 291, -132, 200, 420, 318, 79, -470, 12, 94, 444, 106, -195, -41, 599, -131, 221, 124, -131, -313, 170, 567, -214, -33, -303, 40, -98, 200, 109, -319, -92, 63, 237, -450, -203, -150, -595, 358, 479, -26, 121, -60, 189, -360, 237, 272, 22, 115, 127, -341, -145, -870, -222, 417, 149, -316, -342, 393, -152, 602, 131, -268, -561, 148, 445, -458, -202, 545, 84, -92, -169, 596, 67, -510, 256, -112, -319, -384, 196, -261, -232, 69, 248, 222, -331, 59, 372, 139, 181, -27, -344, 65, 350, -31, -253, -41, -173, 104, -133, 483, -57, -74, 137, -11, -262, 134, -179, 205, 15, 168, -222, 41, 406, -224, 342, 177, 30, -220, -139, 85, -460, -155, -77, -455, -155, 359, 153, 181, 12, -106, -288, 185, 143, 233, -197, 69, 222, -9, 384, 203, 48, -274, -86, -140, -60, -32, 185]
1608A85k60oL27O3m05l89k7R3N04l23K45K97m82N12m16J52l0Pj1J14j86O5j24
1631i5m47N27j89M09P5m72J9k10N05L5J81o85K35J20j4j03K65N48j017K94J76
1652A57k99n8J25K45p44J25P4j23P96k83n90N64N57p18m30P77l8j87q4l62N11
1673A5n61N24N68J6l8j012M49L41o79M06J46l8j69p6j06m85O66L26o23J40M30
1694B40L60r37J30M38R6k97L11m86j77J77k90L47k38P15O7j36o43J64q9K74j71
1715a45K2P1L43l40k69M79m09M46p27R51j15o3l44m4l45j85J017R3k04N9k89j70
1737a68r8M33l24m84R43j58m7j96J56l40k2l38Q22r4j59N2M04n90L97J7m74M70
1759B02j49qk15J86k27Rn23Q06n30M34p6L61l77K47k84K4J37J10m52P3M06r8p7
$$ y = [185, -75, -81, 246, 309, -96, -485, -512, -419, 85, -238, 7, 304, -178, 334, -82, 70, 40, 47, 36, 150, -36, 29, -95, -542, -15, -204, 205, 280, -192, -173, -383, 122, 157, 338, -347, -112, 8, -6, -109, 156, 704, -313, -19, 157, -142, -200, -75, 170, -574, -449, -375, -498, 298, 15, -575, -11, 546, -172, -602, 175, 137, -50, -134, -496, 15, -546, -22, 546, 562, 524, -488, -39, 302, -377, 29, 175, 137, -32, -108, -214, -699, -33, 293, -330, -190, 240, 600, -337, -207, 231, 327, 30, 341, -145, -322, -145, -435, -88, -326, 389, 456, 320, -323, -159, -248, 26, -145, -123, -52, 291, -49, -318, 161, -248, 198, -529, 422, 307, 244, -100, -144, -489, -674, 343, 436, 232, 291, 2, -168, -266, 167, -157, -641, 302, 144, 97, -99, 57, -283, -305, -643, 179, 85, -74, -22, 382, -208, 189, 206, -268, 202, 53, 45, -170, 16, -211, -202, -725, 81, -449, -15, -91, 270, -107, 140, -144, -120, 17, 127, -325, -252, 154, 56, -21]
1782b1P1r0k95O10n67J12K9K38Q7l29lJ24l27J09O38o33R17m75j50P6k68K43m75
1805c79j81P23k64j51L13P50m18k12n25M38J82j96j12L21k88j01l73J44M28j46
1825d7q06O50M35N8J03m10J41N7o53M82o3o4k6N2L43o68Q33m2n43Q8N8n01N94
1848G1k36J58n69R17j51J00n75LJ55p3k48O77J31m13J93M75n39k95L63p76P69
1869A37o6nj35J94j29K24nRm58M01l96O92o27K91n1k10m42M20l00K40N15l79%
1892h0J38Q9o58K36N21l22K59m12L21J78n43K22M43j18l38k53L67J54m41L01k60
1913a96L43l43K91k17M47m35P92l65k75o41R76m94K97o8j50j11K59m3M18o53K12
1934D4J03p6M10k44q1J88m58M82m27l60R03q54N96p74M87J1L61j94k42j63L73
$$ y = [-21, 50, -40, -335, 275, -292, -180, -151, 87, 174, -155, -158, -34, -361, -252, 386, -247, 670, 195, 45, 121, -147, 96, -379, -560, 163, -101, -252, 61, 811, 393, 181, -344, 94, 276, 80, -32, 289, 1, -100, -473, -329, 99, -47, -853, -203, 232, 290, 393, -17, 124, 181, -472, 10, -53, -117, -143, -91, 252, -416, 417, 375, -168, -80, -22, -523, 71, -165, -7, -576, 341, 190, 290, -285, -282, -127, -200, -448, 229, 360, -53, 140, 615, 76, -219, 144, -632, 137, 71, 66, -69, 125, -4, 220, 215, 224, -234, 167, -229, 463, -164, 127, 76, -134, -576, -156, -456, -216, 299, -80, -80, 58, 147, -511, -275, 246, -76, 183, -229, 92, 270, -273, -51, 392, 274, -64, -317, 50, 204, -237, 64, -196, 147, -196, 95, -122, 325, -110, 682, 317, 42, -599, 377, -117, 180, 112, -38, -149, 110, 67, 485, -168, 44, 147, 71, 481, 237, 156, 344, -114, 368, -59, -419, 484, -370, 226, -548, -61, -50, 311, 117, -125, -288, 85]
1955H5k23l03Q05%l90l47P0O72n94K73m31M61k94Q7p1M13k16j12J4L8k58L17L38
1978C34j28n17O14n50J44M34j80p32N86n20L17J80k85N47m41k17K24M14m84O68
1998D08k68j51K11K9o63Q15r6m49K72j33L01l2q4k09L85j60N8m57Q2M15n07K84
2020E1k19O55r23O56m34O17l24j80L13n52K02k6N41l6j50p07N95Kj60R7k09K90
2042I9q3p4l59N61J1qOk26L08o29N00K09k91K85k72M24l82J65n3Q9l56m98L10
2065b64J95k72L53N17k69r19O28j10N9K74l84K08%j58j24L14M11R5J0o96N45n45
2087a32M10j98j00m0M58n26M34k04R7J0l13N94o09J70j57N07k83l8k60l72L38
2108b14R7K74j010Q43l84Q30Q1p41K89K79n14L75K51M0l53n51P57p43L59J15L87
$$ y = [85, -138, -441, 364, 364, -26, -373, -303, 369, -225, 48, -383, 78, -216, -129, -200, 213, -3, -115, -101, -63, -321, -4, 334, 206, -311, 303, -247, -103, 331, 151, -581, 5, -515, -198, -18, -303, 244, -197, -414, -190, 224, -260, 408, 140, -11, 200, 229, -434, 381, 285, -164, 108, -25, 276, 244, 160, -49, 336, 176, 234, -223, -141, 274, -233, 51, -168, 487, -436, 220, -214, 403, 79, -101, 212, -340, -138, -164, 377, 341, 191, -516, 79, 81, -79, 18, -191, 99, 16, -58, -417, 144, 155, 147, 153, -73, 235, -394, 106, 315, 24, 309, 37, 461, 79, 244, 191, 280, -76, -574, -264, -69, -341, 12, 529, 260, -659, -31, -141, -82, 192, -192, 16, 16, -142, -266, 48, 459, 554, 564, -132, 413, -132, 278, 80, -20, -60, 398, -128, 306, 102, 199, 209, -104, 490, -119, 51, -106, 401, 118, 80, -180, -552, -214, -117, 157, -853, -10, -394, 436, 517, -224, 65, 344, -170, 205, 456, 496, 143, -408, 349, -394, -35, 80, 467]
2129D67n82l37P75n07k22M55k47N32k04l95K33Q09m78m50J59J26l57j99N51j29
2149@n44N52O7j81J62l23J23L26n35K80N57m65j67L55n8L00n04K37k92j9K05M6
2171A22l89K51o7q03J304n92j96K90j64j51K42J08j19L1k59K53M32k8n8J30p13
2192c76O15k93l79K63j22L25j01k46P76n17k22N19n76J20k12j43L08L32L37p99
2212c91N99k70k32L6L96n02J77K07n23N77m77O90l92J53n6L7K70j46J95J16q1
2233C83l16L10k22O1o79M83L26m98L77l69k62O72m9k05j75O2N68l91qj72j33K46
2255Ij42k5N68n56N36M38p74P0l06p4N82n64k7N26L2j81r1Q8K28p13J01J05L55
2278A85K26r30N93pj92K31J37m3J66j39m37j81J28K55k96m45O01K9j71n3K76M86
$$ y = [467, -115, -452, 323, -184, -406, 49, -198, 334, 130, -265, -32, 777, 299, -151, 8, 134, -223, -422, 129, 0, -544, 8, 75, -106, 56, -267, -144, 182, -353, -73, 484, 19, -148, 207, 149, 449, -55, 182, -110, -129, 76, 122, -267, -16, -83, -886, 418, -174, -370, -80, -244, -395, -153, -45, -164, -133, -392, -139, 293, 265, 207, 337, -376, 239, -54, -433, -170, -292, 33, -68, -314, 462, -55, -277, 242, -334, -214, -426, -569, -261, 71, 408, -391, 208, -62, -294, -258, 138, -364, -187, 20, -503, 74, -403, 287, -105, 48, -8, 29, 299, 153, 348, 464, 383, 67, 377, 155, 216, -463, 20, 346, -152, 225, -144, -406, 266, 217, 12, -163, -101, 467, 76, 68, -104, -237, 9, -133, -158, 410, -146, 390, 828, 54, 124, -182, -256, 326, -238, -265, 261, 293, 112, 21, 109, 337, -376, -275, -170, 185, 411, -519, 74, 67, -125, 106, 243, 200, 366, 227, -210, -391, -263, -8, -304, -749, -148, -119, -290, -343, -67, 419]
2300D19l16j4j33j67J08M96l34N3l1k18k29P99m11q1K69j5L03l17k12J17J17o35
2322d32K34M23m78k63M87j9K15J07qm21J85K03n65L92l55Q55o84k6J12J26L6k98
2344a74J62M01L52r54O72n52k67L81J34L78o54j67J33K59O1l34m68R67o10O98
2364D18o23L99l08L82j85K66o2q51J090p56J34l42R4O52n43N35Q9n03P8K01j45
2385B0k4l21K27J23m16O93j41j79K97j81l33L40n30M64j39O4K00k78O0J88j28
2406Fm1l79M20j39L17l5m00J97K00m35l4K58J63Q7j89k76l8M25M9l75N97n10N32
2429D00n19J37j46L05n94K43J71M23o75j33M19K72k18j73L82k4j78k14M49K77
2449F04k07j90k03L19k83j88J94Q8J29l09r2N77k53l42L5j05J35K27K01k82m57
$$ y = [419, 103, 89, -44, -211, -103, 393, 59, 112, 81, -137, -366, 433, 22, -59, 210, 195, 498, 181, -31, 86, 203, -432, -198, 225, -253, -516, -29, -48, 167, 274, 266, -155, 30, 233, -332, 60, -295, 560, -124, -150, -38, 88, 124, -174, -12, 389, 741, -213, 459, -93, -360, 21, 155, 533, -121, -288, -155, 104, 165, -169, -637, 330, -280, 418, -205, 194, -114, 268, 83, 349, 287, -564, 526, -230, -96, -438, -344, 308, -235, 300, 389, -114, -36, 165, 20, -4, -325, -98, 25, -391, 302, 161, -18, 279, 98, -235, 105, -425, 39, -100, -36, 164, -114, -54, 134, 6, -35, -414, 6, -133, 184, 149, -251, -54, 146, -289, -323, -65, 98, 185, -4, -280, -318, 107, 156, -219, 378, -132, 400, -119, 18, -128, 177, -417, -174, -3, 420, -255, -388, 31, 303, 85, -88, 294, 270, 92, -122, 327, 604, 397, 207, 4, 323, 40, -148, 46, 134, 263, -46, -138, 439, 186, -156, -121, -226, -91, 136, 337, 55, -402]
2470d02O35p1l40J45Q5J99Mr03J326q81K08Q1k0n8n89R86j98m34P44j35o14N13
2492B81qn47k08K07O57M3m96p2N17n17L56n88O37m65L40r10O78M98m56K8K50K0
2514B45o35J20N73N0k11m49M83r8n50M19nk05P4P61n82K9J05K93m53k07k38P8
2536d03k2L25J40p2p7L41K60o26l01K05P56o09L49J2j11J3k56L82n68K17j8k16
2558b79k9K10J60M25m1m37o33J006l32l52k20N68rJ19J30j55m7N03k87j54l09
2579a63M77k15j89l69N02j8Q0l54p23J265L3l02K84m07j41j24n85J364o92J13
2599a64J74L28k40K16Po99M82L12o80O6j94J9J29J46L25j77M72l71j01L95l86
2620E9OL75j59j83j81J56k23K85K38j00K3L22n53M48j000P70J04p02J46O0k92
$$ y = [-402, 233, 162, -178, -33, 52, 251, 255, -648, 678, -203, 5, 86, 66, 8, -581, 405, 207, -227, 517, 382, -232, 281, 273, -274, -482, -275, 382, 425, -71, -143, 374, -143, 213, -375, 262, -203, 137, -773, -95, 403, -53, -25, 225, 245, -390, -270, 303, 353, 142, -307, 176, 78, -472, -53, -58, -263, -189, 572, -10, 19, 124, 417, -36, -243, -481, -403, -425, -100, 40, -32, -109, 232, 492, -134, -435, -230, 526, -83, 266, 278, 167, 180, -76, 306, -262, -45, -63, -279, -308, -98, 62, 487, 446, 9, -624, 382, 50, -302, -522, 46, 37, 156, 286, 131, 84, 587, 300, 146, -163, 314, 99, -90, -459, 43, 25, 105, -249, -972, 293, 326, 24, 308, -99, -240, -364, -949, 415, -277, -164, 10, 338, 98, 314, 321, -378, 104, 416, -264, -198, -392, -373, -244, -98, 227, 50, 522, 151, 50, 445, 59, 65, 440, 281, 98, -83, 73, -150, 135, 373, 273, 296, 618, 65, 513, -487, 283, 387, -315, -169, -109, -401]
2641d01M56n36P42R7m48n49K14M91k88J6L52M01p23K60K77l55J82l03N3L99n39
2662b02j91P38o57O18m13j46M8K89O03k57o44K78L83o32K05p02R98l73J27l60
2682b90J40L22L77k81m01n1J73L27n73O42m04l34N94o76O33q9L20j42O0l08Rj81
2704a33M03m28j7J57k64M06l39K53j76K58l35j64p9P89j004P83J57K44j201R03
2724B13n8O6j76L61N9p62N79k6l87L16M55m57M0k75J08M07J7n62K32J60j46m18
2746b54L25L90r15N45L3l82L10k46m33M16K05O5k7n32O77m7m20O98m25P1r1m83
2768e20M21K13j52p1P28o91O36j79m85M05l60J26J47m99Q86l47l56O62M7n11J33
2789B33m83K26j59N11q2J35l38p1L68M40j195M56J01j79k27K08j01Q9J0k03J97
$$ y = [-401, 55, -481, 261, 358, -90, -639, -425, 66, -222, -206, 146, 547, -176, 84, 361, 6, 188, -115, -62, 337, -202, -393, 345, -312, 306, -107, -253, -205, 84, 687, 430, -214, 64, 447, -185, 20, -682, 316, -57, 70, -290, -150, 172, 549, 268, -133, -184, -11, 316, -257, 385, -19, -353, 241, -435, 198, 109, 429, 287, 347, 39, 48, -133, 270, -158, -175, -18, -282, 124, -215, 38, -138, 120, -215, -379, -458, 331, -673, 110, 267, 511, -690, 213, 155, 221, 45, 406, 465, -297, 282, 256, -131, 185, 640, 183, 223, -52, 56, 463, 480, -82, 150, 310, 164, -254, 71, 461, -454, 91, 124, -258, 52, -194, -627, -211, -6, 59, 32, -500, 177, 130, -290, 408, -17, 54, -37, -520, -99, 114, -38, -109, 619, -72, 564, 385, -100, 305, -55, 71, 218, -281, 605, 258, -98, 564, 611, 100, 233, -250, -24, -183, 328, 246, 381, 43, -28, 340, 780, -415, 41, 142, -37, -264, -56, -157, -68, -58, -261, -64]
2810f4M35j66l49L65k89K57q1K12P7k80j97J19L3J9N09p42Q4L85m62M50n15J5
2832a85L83l02J72j52K59M4k17K16J23o14q1j57R46k79q59J041j97j28m34P33
2852C12l57M62p58M43m29n5M84j24J07K2j46l37M06K76k40o35L15j42K98L6o1
2873a23k61M68n5L68j13o9m80K56oj95K68o3J27k67L5m48j06N35Mj04J48Q8k94
2896b87J22r4L84L1Po88N75k12K14N80p33J59K5K52k56M65o84O94q42K39j98Q7
2918a60J083o13j01q87N56K10J81l80L94k83J84p31l8N91j48N38o25L44n7k17
2938a59N71j69m22M88o24j10O55J3J49j66j35l29J74N39p50L60n42O11m4k05m3
2959a38l00K54L7P43o16l00n3k35K07M24K74J81m04k9j82K73l01L04j67K82n91
$$ y = [-64, 371, 205, -144, 221, -68, 189, 108, 320, 397, 117, -80, 39, 72, 91, 600, -142, -58, 327, -135, 315, -200, -185, 198, -104, 68, -84, 175, 219, 2, 218, 341, -273, -354, -511, 435, 156, -703, 338, 141, 13, -421, 312, -45, 417, -341, 102, -327, -382, 102, -22, 85, 107, -39, -376, 30, 306, 66, -569, -254, -396, -98, -62, -123, -384, 84, 29, 397, 284, 215, -265, -9, -15, -210, 58, -5, 122, -145, -110, -558, -664, -129, -125, -229, -81, 7, -287, -165, -259, 125, 156, 163, -525, 50, -162, 52, 632, -101, 58, 83, 335, 79, 544, -140, 554, -288, -49, -247, -160, 923, 310, 209, -678, -122, 88, 269, -111, 283, 0, 184, -547, -585, 6, -142, 396, -229, 115, 58, -159, 412, 243, -179, 309, -315, -425, 230, 243, 392, 226, 91, -238, -64, 475, -275, 85, -457, 154, 110, -95, -138, -438, -184, -147, 596, -20, -320, -373, -608, -401, 23, 297, 478, 74, 45, -137, 136, -165, 139, -28, 254, -337]
2980c37P39l88n23M97k11m24J39Q33l74k3K74L06o74P9j31l99L04M94l08P0O5
3001HP1m22N17o15Q52j92l78J66m18R67m93j15k52O10m53j07L07N4J89m27K58
3022A27k86k99P52k78K5l35L07j51l4l66N20n33N68j15N27n46K82p5j69L58l96
3043a17J40l23J92l06L57l7j7j51K25o95N20K31rk87O45k07n16j62R1M6O23j4
3065B29o84R9L98L50l84l51j62L84L47k81J41j91pN32k1Q1j44p93N47l46N06j37
3087A13r1L25m63l40M92k1q4M37O8o20L09l79l2j5k53O89k43J027r08K53q4m36
3109b56J81N12m43j96M99l09K3L70r0n88N76K33k30j28p7p13J71O82n70K88k66
3130c31mL10L54l70L15m85N1L70l59K78k18K00L7m7k09J62l71j78M36k18J82P3
$$ y = [-337, 402, 14, -509, -12, -223, -647, -508, 325, -49, -72, 202, 508, -166, -87, -218, -617, -313, 181, -127, -57, 8, 79, -343, 174, -441, 411, 219, -159, 7, -411, 556, 63, -52, -304, 306, -147, -254, 53, 107, 296, -131, 127, -159, -458, 294, 16, 41, -294, 13, -138, -172, -538, -18, -551, 17, -98, 429, -117, 165, 90, -79, 279, -117, 23, -300, -108, -414, -57, -94, -111, -262, -37, -732, -212, 19, 10, -277, 368, 161, -355, -517, -426, -380, 243, 229, -455, -356, 42, 392, 8, -343, -505, -121, 226, -55, 86, -105, -112, 420, 399, 480, 336, -457, 90, -256, 250, 113, 22, 347, -116, -456, 36, 15, -69, 368, 436, -184, 125, -254, -286, -301, -554, 135, -108, 919, 11, 264, 180, -256, -75, 437, -6, -202, 297, -12, 11, 381, 291, -297, 279, 512, 282, 154, 77, -636, -465, 217, -353, -65, -331, -335, -25, 329, -41, 274, -211, -160, 210, -149, 129, -89, 111, 148, 101, -108, 54, -317, -495, -59, -277, -95, -22]
3152b2J66m47L45J74o27j46P02l07M28l55P9k1K57l02L74l86j74L35l60M8L5N20
3174C16m66M14m80r8K72l43N01K80m21q3L55L1n97J80K22n18O41l05L93l21Ln43
3196e67P40j35M01j53r9p27K61l82P09L04p03N21k1j67j38K23m39P87J47m23k89
3217a50L25l03M55Jm86k14P43m33K91o3j61k1K96k47L64q62P44k94J23P5k88j88
3239b93Q41p70L0N03p22K20K90k33q3k09M65j42LN42n96q0K26m0L78m24N18n92
3261a68K70k68J91N1k65k9P06m16j1l4n02N98M9N4j04O4K85j62p67L77p6j02N35
3284B76n19K84K62L61p74O12q21M86q1K17n8o29N00j67N2k50O34k22KK24n91K30
3306B8j06j39K49j15l98O07n43j59J056k34J86m12q9r4M18l15R9l33O2M16o9j5
$$ y = [-22, 144, -303, 42, 216, -411, -557, 145, -162, 266, -89, -10, -31, 226, -76, 298, -88, -262, 73, -287, -239, -204, 316, -150, 264, -216, -314, -42, -385, 116, 396, -25, -108, 247, 278, -319, -139, 83, -435, 206, -99, 294, -27, -24, -567, 173, 38, 439, 286, 187, -540, -279, -661, 48, 352, -351, 170, 149, -18, -156, 67, -372, 415, 562, 139, -150, 175, -128, 327, 328, -158, -372, 371, -62, 229, 166, 5, -16, 280, 33, 397, -465, 279, -15, 108, 183, -105, -293, 548, -222, -192, 311, -411, -191, 99, -134, -217, -426, 39, -103, -100, 442, -154, -234, -8, -48, 330, -94, 424, -168, 102, -166, 25, 76, -189, -218, 488, 72, 61, 27, -475, 123, 172, 226, 122, 186, 471, 309, -458, -81, -157, -259, 276, -243, 41, 303, 664, -110, 502, -319, 167, 86, 303, 245, -384, 116, -51, 1, -249, 385, 163, 165, 389, -202, 28, -78, -217, 32, -83, -481, 126, -417, -576, 480, 246, 432, 20, -69, -163, 255, -60, 39, -294, -232, 184, 115, 100]
3328A00O77m87q16N81k99N77J68n48j91P9N68M9n80O5L5P93j483L08P26r08N94
3349HM59o36o1O46r23P44r7p78R37m3p74O01j16J81k0q2N01j52L9n15n62N58j94
3372b79k37P71N5Q1m47n2m21P38k02k31J65nP5K54j57N9M23k51m64N20m31n02
3394e38K04K35m0j07P03l54r5j14K58J06l1n19N29j36L14o07P39on76r3O96m98
3416G0J85p68P98k74n85M57L9J02Q5k4N84o47l06K84j38J1j34M45k38k13M74P9
3438B86K5m24PJ95l53M61j31N6L77q70P56k97j46m90J143m73K43j67k19j92k44
3459d57K57J21L87m77l0j24N65k08l22M10L63o73N43k1o30k02Q12n44K67N5l16
3480b24L96J96l49J74m60M3K68n62M71J28j94O07m28k0k96L34k47N9J71R6N54
$$ y = [100, 777, 290, -526, 55, -244, 333, 501, -47, -238, -159, 409, 458, -122, -57, -22, 771, -712, -404, 322, -586, 8, 467, -169, -230, 416, -507, 237, 140, -638, 299, 256, -518, 83, -33, 148, 128, 46, 547, 395, 434, -81, -643, -85, -279, -516, 255, 310, 391, -56, -108, -529, 209, 7, -224, -59, -64, 11, 265, 108, 167, 590, 339, -125, 395, -36, -538, -334, -99, -139, -246, 457, 103, 8, -106, 152, 258, 227, -292, 237, 101, 415, -192, 547, 541, -35, -128, 568, 70, 255, -513, 285, 11, -574, -117, -78, 24, 109, 85, 669, 22, -284, 0, -138, -127, -261, 184, -54, -267, 207, 286, 311, -113, -106, 89, -264, 197, 66, 122, 499, -371, 385, 88, -58, -548, 595, 122, 365, 198, -21, -213, -457, -200, -79, 308, -169, -199, -323, 242, 34, -288, 122, 485, -188, 355, 334, -296, -498, 314, -230, 37, 92, -224, 172, 368, 19, 193, -267, -224, 44, -518, -47, 81, -113, 494, 66, 46, -250, 84, -163, -104, 67, 163, 717]
3501G17q72L81j17jK72j33M59q27K21n34L48R0m0M13l41k62L37Nj89P23n60M11
3523E01k40m4k9K80k48R8K3l19M9J3n52J66P6K91J83n48M69J86o64K59n23N95
3545B2M94j99l38M9OJ59j85J25k8k95L91k44N20q18M87k54J90K34j80K22j62j46
3567E0M17km68O6l88L74J92n54M59k7p5L90Ok92L96j566P72L46PN2k16P3q5P5
3591BN46q99O23j77J58l14M83l1K09p70K94k1L5k84K69l9l32j45O81j48p98J40
3613e18Q11Jr8J96q73O29k86M8J75J42o13K90j34L01O7l57J75l9l00L32K04n54
3635d01N73r3q2j80j98K21L50K09L67m63n65M42o9k43J27M0k17l50M23N26l30
3656H7l4N60k50K38l94k58K3j69M21L0j54k2R1n12K12L22l33n36O97m9j5j97k7
$$ y = [717, -155, 226, 109, 108, 380, 247, 706, -121, 100, -434, -86, 4, -36, 377, 36, -226, 111, 116, -73, 650, 90, 501, 261, 217, 188, 468, 220, 318, 341, 22, 71, 84, -468, -302, -226, 65, 248, -300, 169, 355, -309, -50, -573, 22, 516, 317, -21, 28, 34, 193, 8, 133, 105, -190, 201, -43, 477, -341, 146, -108, 82, 316, 136, 358, 196, 50, 467, 465, -3, 63, -325, 49, 241, -313, 146, 119, 44, 434, 440, 148, 544, -1022, -250, 96, 103, 155, -61, 12, -73, 2, 548, -351, 272, 95, 253, -61, 422, 391, 600, -170, 124, 103, 138, -146, 123, 84, -248, -393, 288, 140, -658, -518, 293, 294, 196, 392, -481, 148, -138, -90, 85, 227, -386, -96, -230, 71, 138, -219, -44, -83, -383, -51, 153, -401, 172, 79, -3, -183, -381, -160, 190, 399, 766, 303, -262, 180, 111, -132, -5, 35, -182, -532, -109, 417, 87, 53, 613, 363, 601, 207, -51, -28, -197, 224, 254, 100, 78, 169, -343, -131, 191, -142, -678, 19, -30, -45, -242, -269]
3679b69J65N08n80J13j81K72L17p36Q8K34K52m52O07k61p5l16K75N49n8j185Q87
3700A54K8n23P45o24L84J50o00P99o1p27k4M15j18k94J12P28n44k5r1J07J020
3721A011j132J69J68J4o58P83o90M82j49L76o10L91K96n61P5L2j51K6k82N81m22
3742b51O42p10J74O71n80L38n36nQ50n70l3P1k83P35p06n9L87J45J08L5j37k96
3764a0P5K48l85Jk33M10k66k55L77L24m32L8j3K98j13l8R2K5l0j85O8p5j12k39
3788d30L74J93R0k17J79l87Q8j11n7N96k78m96N84j52r9K53J97n65M28m04j32
3809c46J181r59p7M98p25L02M02k09j27O07j104P14%J6k36n0K6m2p1L50l02oN37
3832C79l0j29J04m88M3N30p44O50m60R0J72ro11L48j8N65o71J30M26k68L38j17
$$ y = [-269, -104, 404, -176, -63, -244, 28, 345, -391, -303, -69, 183, -269, 338, 77, 2, -314, -39, 510, 452, -733, 154, 182, -341, 404, -220, 164, 314, -286, 513, 452, -275, -299, 116, -2, -296, -184, 544, 0, -25, -116, -9, 1011, -121, 48, 216, 230, -428, 355, -335, 147, -2, 374, -236, 155, 451, -110, -35, -3, -154, -128, -410, 171, -251, 391, -319, -145, 526, -54, 284, -252, -257, 593, 23, -10, 61, -222, 513, -193, -252, 135, 280, 388, 423, 286, -10, 65, 313, -72, -71, -304, 106, -160, -415, -38, 286, -146, -108, -121, 177, 64, 26, 118, 143, 113, -72, -4, -79, -191, -430, -56, 137, 227, 10, 189, -198, -110, -221, -278, 318, 40, -456, 128, -24, -123, 130, 327, -238, 190, -214, -346, 835, -124, -201, 297, -428, -126, 276, 67, -60, 547, -557, 157, 157, 173, -63, -113, -87, -129, -200, 150, -152, -158, 379, 349, 220, 324, -164, -121, 409, -335, 315, -145, -55, 117, 108, -503, -155, -173, 392, -279, -149, 277, 9, 347, 230]
3854B30m3j37p3L51L9j88N72p90m31L48N63m46P0Nq9j79K94K62n22M91j71J09
3876B65J09j08j58l1j39N39o12p5L14o4O2K11o29m58J116l74O30j072M81j88M9
3897a32l14K91J30N98j14o96n5P47r48M34M40j49Kj30J85n67L9r7N15j38o91O52
3919Bk17M60j62l84L72K21m82L92m4O27j058K07Q24n75L34j16n60N04n51P23n52
3940c5k29N06n01N86o26J37O9K55k4n19M66o07R36o2J70j90q98P81j76l8j38J24
3962a3k6O0j70m0m02P37j39k44K00J94p27J87L24J25k61K33N63o09k79p9r1J04
3984c53M52l86J42K27l44K05j32K73k99J51k07J3K85L21o98O33j75l65L66n18
4004d09O24k71k37K70n58Q10p48K65K52K0k29M36j51j73O5k1rL79J17p30J3M00
$$ y = [230, 187, 50, -23, 328, 367, 179, 751, -39, -470, -122, 441, -5, 65, 70, -19, -198, 96, 358, -164, 327, 156, 265, 374, 266, 108, 77, -62, 477, -135, -210, 104, 40, 102, 313, -316, -774, 342, -32, 598, -474, 7, -181, -132, -446, -155, -25, 573, 459, -237, -292, 455, -493, -59, 381, 232, 234, 104, 289, -278, -239, -336, 179, 41, -650, 2, -215, 245, 83, -301, 71, 292, -190, 202, 158, 785, -273, -66, 758, 183, 517, 401, -159, 345, -206, 517, -35, -264, 242, -259, 327, -299, -162, -93, 162, 138, -381, 85, -522, 414, 352, 522, 332, -566, 215, 39, 1, -137, -13, -39, 21, -149, -189, -591, 146, 7, -237, -37, 157, -570, -383, -59, 66, -195, 38, 601, -8, -287, -366, -457, -353, 99, -287, -145, 82, -262, -57, -189, 84, -215, -64, -271, -258, 27, 348, -350, 283, 108, -257, 109, -409, 215, -56, -293, -23, -581, 229, -519, -254, -2, 18, -211, 225, 74, -99, -34, -55, -64, 315, 432, -298, -285, 115]
4026A15j22O1mk39J57J0R4O22n58n21O58n23k53R09o73M33j79M70l48j34k03K83
4048E5L5R9k58O3k74K47P6m57P12j52Q6j57k60J45k86L6L94n97J76N05j8M17m17
4071A70q48N75K27P8j13j24J4j81K55l0L04l95l73J004p91P8Q51m45N4l47P6J01
4093A40m28Q9J49Q1l99P49q66P93J18l05m17R7N16m09p0R1L98n97pL87m07k37
4115e34O46m60M65on09O80J34r35L41M36j16r9L60k46M51k78m46j07J77m4k08
4136b98O0J18N69n48m8O38l16j20j71L51k38R9M8j49n8m16P64o38K14J61j26J01
4158cq4k56L76k01JlL3P5L49N8qq5N0k00n44M27j69N3j25O09o81L54J73M57q36
4183a80PK32j85O53o08P1P39k87m62m21O84n58N02q6j83L37o6j70M47n11N06n47
$$ y = [115, -7, 54, 50, -189, -32, -22, 72, 694, 136, -385, 273, -250, -503, 406, -267, 166, -13, 457, 109, -25, -228, 55, 90, 189, -69, -6, -280, -33, 43, -414, 298, 146, 232, 75, -185, -40, -326, -290, 104, -493, -317, 188, 170, 587, 170, -678, -103, 124, 202, 89, -35, -21, -202, 53, 23, 327, -68, -441, 563, -228, -150, 701, 256, 310, -37, 39, 140, -288, -199, -50, 31, -368, 381, -485, 308, 426, 121, -296, -199, 317, -92, -162, -71, 327, -270, -277, 110, -297, -534, 112, -348, 117, 111, -398, 282, 416, -519, -178, 258, 142, 43, 403, 157, 608, 330, -116, -223, -46, -90, -298, -238, -120, 449, -99, -147, 491, 175, 55, -116, 235, -3, 96, 144, -5, -63, -479, 285, -353, -139, 22, -104, -3, -87, -343, 33, -168, -167, -170, -137, -62, 287, 345, 337, 252, 302, 102, -442, -15, -184, -131, -256, 353, -328, 26, 199, 656, -180, -173, 59, -126, 527, -81, -10, 729, 442, -20, -441, 243, -315, 187, 101, -82, 255, 189, 19, 466, -45, 461, -86]
4205h6K57n02P4K70L44n17J90J23n67M02L51n35Q7K8N08n57L93n58J88K12l53
4226b48Q6l28M12R5O57o26q1k82M58k12n76O92Rm41K63NK58M31j03j94n48R8M29
4249B54n29K4L62l07N42q12N71LL65l84n2l75J92k26L70M10j24n5k15Pn3K40j46
4272F2N39r74O37r68O71L34j45l5M3j3k91j49P1K61K93k61L55j25k02K60j59l44
4294a40L29n03Q8MO25q0l84K35k39L13j99l63j0K94N9j3k25N87j80j97j1K37l40
4317a13n9O9K72L31k86n19J62M48j58m59L33M90k71j35k46O4k11P06j30N1m40
4338a01K90m16l1M45J41m13m44L07J54M06K26m82j71j3O7l27M99j68O04j107Q47
4359C13l08m29P28J07q5o35L76l31J7L21K36J9k87M4L30r83M97l09L76k32N73
$$ y = [-86, 171, -331, -257, 13, 357, -160, 30, 153, -414, -12, 339, -196, -109, -81, 427, -130, 263, -295, -107, 105, -248, -162, -490, -78, 17, 674, 48, -33, -315, 143, -69, -645, 47, 56, -385, -122, -117, 141, 572, 469, 275, -273, -175, 254, -275, -251, 111, -196, 346, -466, 105, 108, 473, 89, 37, -338, -146, -372, -2, 408, 284, 229, 14, 21, -32, 208, 62, 601, -373, 264, -704, -33, 301, 156, 121, 164, 151, -140, -289, -218, 43, 336, 75, 430, 305, 103, 363, 204, -140, 189, -314, -226, -222, 403, 323, -61, 174, -65, 248, 49, -314, -324, -30, 29, 16, -209, 378, 198, 1, -10, 227, -113, -172, -103, 169, 500, 214, -305, -143, 305, 147, -312, 21, 511, 240, 105, -141, -77, -288, 418, 288, 339, -101, 189, -227, -258, 187, 328, -85, -529, -222, -68, 338, 564, 82, -89, -102, -35, -362, 137, -31, 573, -534, 313, 5, -424, 304, 411, 326, -309, 67, -264, -247, 74, 310, 329, 42, 86, 416, -567, -70, -379, -3, -235, 338]
4380C38m56J7J94M47q77M70K75q12O49j12n5P1m64K47k32P20l5o63K67l15L48
4401B2L07k26l37K78R3K6o83O07J23k48Q6k86K59j17L9P23o40mM4j19N43k64m03
4424a77j78O11n56L32k55L33k14j21K73O7L72m25j06l77N60n75L10j8L84l55L10
4445A95M8j90j25o3m9L65m45N80k56l0O00n74j61j91O8l02L69J29L49l90L50j09
4467A68k71R9j60L84k94j19Q1K48K42n89J47J14M32o17K08j07k74o6N85m66m22
4488f77O17L06k41O51o73l54Q66r04J49L09j83M97p29q5j8P72m04K14j5Q1Qj1
4510A76k47M8j23O33o08J06L0N2Q9n92O92J14l14l65J29o5L10j5k50L25m81L32
4532b4j50O79q02R6M48m15J73k98Q65n13k9J03j21K30m01m86q5J62J085q66Q45
$$ y = [338, -118, -101, 93, 540, -337, 133, 408, -404, 245, 133, 78, 149, -315, -68, -300, 420, 385, -278, -11, -326, 22, 329, 103, -234, 44, 137, 163, -520, 87, 210, -38, 48, -238, 21, -96, -57, 666, 26, 22, 66, -53, 490, 226, -177, -355, 256, -300, 32, -223, 110, -104, -225, 48, 115, 487, 62, -44, -421, 139, -436, -126, -144, 240, -115, 195, 243, 53, -72, -135, -184, 181, -264, 316, 60, 30, 630, 56, -105, -296, -228, -530, -161, -32, 317, -73, 277, 168, -103, -4, -164, 220, -74, -193, -112, 136, 378, -211, -64, 50, 482, -135, 73, -34, -308, -374, 211, -255, -677, -60, 246, 5, 656, -17, -371, 495, -409, -260, 49, -134, 363, -366, -451, -469, 303, -101, 113, 98, 179, 187, 176, -71, -23, -146, 487, -121, -15, 15, 67, 156, -436, 256, 370, 56, -309, -180, -245, 65, 50, -200, 125, -356, -24, -174, 505, -297, -201, 247, -168, 5, -293, 572, 59, 30, 133, 12, 242, -159, -645, -730, -568, 517, -349, 496]
4553D96k9m16L10k77k22L30j93j4r5k90K42J07l29J84J14k24M68m70J99k59K18
4574a50N26O4p48M29j3m19N31l8k18r6L73j88J00L42j143Q83o72K89P68j63o78
4595b21L58J15j59O73m11m06K34o80O49j62k38J03J91m32K04K10M24p52N17k61
4615d4n91P28j46m33M41N53k82m79N65k25k67K61K01m80K02j92k33N91j75J12
4635A07m70j6J62L37j38o57J042j27l95M17o70L21l49M51L72J31L00o51O0l39
4655a12Q10n23k4O5J65n95O10l83l17k81M08O91o80K18k76K78J55l88m4Q35k89
4676C23n02L74Q9L1m93k85K46k1k32L93K18k86k23Q83m26J03m95M38l92J77J35
4697E5r3Q8R5n15N67q7l58K49K83j90J50n78J12L26j67L5J28mj15j71k92K51J17
$$ y = [496, 467, 51, 361, 84, -138, 192, -1, -15, -110, -400, -158, -51, -380, -196, -82, -306, 162, -308, -109, -368, -150, 376, 440, -308, 121, 108, -311, 220, 182, -36, -132, 241, 53, 153, 495, -648, 235, -437, -148, 620, 457, -221, 137, 252, 93, 766, 355, -51, 183, -497, 152, -10, -248, -145, 46, -386, -182, 28, 452, -300, 217, -44, -635, 93, -53, -486, -45, 508, 226, -253, 312, 87, -180, 81, 282, -198, 4, -188, -421, 170, -5, 107, -363, -379, -217, 120, -18, -675, 367, 240, -155, 262, -408, -87, -436, 15, 387, 518, 818, 167, 227, -112, 698, 175, 151, 216, 381, -214, 396, 13, -304, -585, -177, 514, -166, 52, -224, 54, 209, -179, -223, 612, 323, -179, 195, 284, 315, -178, -463, -217, -238, -470, -77, 141, -145, -368, 515, 89, 192, -303, 135, -257, -80, 55, -38, 50, 145, -370, 197, 110, -248, 1, 284, 94, 244, -334, -222, 104, -63, -28, 100, 96, -19, -190, -482, -231, -114]
4720a14j49J01K6J8m3N04L07o45R7k60O74k82K13n22K27k21P8n15M35K7m19J28
4742c35K07o3l5K27M03j38p97O92j17N8J69o95M56l9N03r56M30K12J43l13k29
4763b17J40m52K22M35j5q5l57O13m62L41l85J12M47l37J05K22j59l15L98L57q14
4784b06j20O33k84J5K63M2l53l17k32P11L9k08N00n49l72M65k34K17K04K03n82
4805a65L10K60m56M53j84p7l09L85r8j33N27n94O4M7o18N59O42q83L31n35O98
4826B24L57p01N84m84M48J27p10j85L67R5k34J35O4l46J39l6j33M66j44J36j23
4847D6j56L73k05J5M21m90M3l23M39K70n89k44O99J95p54L48M7J84J75l36p88
4868f30P69k87J31J75r53P23M97o44M02R3n11J35L90l52j4k73P7L28J72J69p84
$$ y = [-114, -263, -162, -136, -118, -161, 343, 650, 5, 102, -158, 516, 234, 447, -75, 152, -69, 9, -506, -71, -44, -463, -335, -128, -191, -226, 1, 404, 266, -531, 161, 44, 102, 271, -424, 32, -7, 496, -460, -30, 182, 325, 12, -217, -77, -529, -307, 128, 113, 28, -329, 284, -178, 163, -222, -110, 337, 0, 105, 327, 168, -147, 251, 608, -206, -326, 307, 23, 38, 301, 343, -10, -327, -559, 152, 191, -17, 483, -66, -438, 27, -207, 10, 214, 417, -165, 145, 405, -51, 402, 218, 141, -168, 217, 119, -14, 513, -81, -17, 30, -588, -29, 613, -270, 61, -474, 224, 581, -120, 464, -20, 428, 555, -155, -340, 27, 122, -112, 23, 87, -259, -120, -156, -289, 177, 33, 169, 46, -110, 263, 58, 73, 494, 4, 47, -276, 163, 433, -156, -400, 299, 494, -260, 88, 135, 319, 494, 158, -630, 139, -148, -17, 158, -795, -72, 425, -219, 183, 276, -235, -100, 290, -62, -76, -349, -272, 56, 228, 397, -387]
4889c87M69l47J71M27q5p73l49R30R2J65l58j64j23O0L94L84m60M15l07k7L87
4910E14p98R76m60o7k72K07J27j5l53K71Q1k95K43pl22j24M11j23M90m55j58L20
4932A91n12L49k26J8L46k25K24p69O74M94m03n15R7l10L34k10O52j9M5R9m47J92
4954G9mk56J17J66j82K9P6M4P8n51M44L61n60K23J00l18j91M6M67K42l07j67k64
4977c28P12M8n17K33L6k94O4p1K50m33K42K81j83n21M71o81N66J00K39k75n46
4998f07Q19l39K79L7m92K2K00Q3K47j3m16L05l00J25k13J25K43J22m89M63L17
5019E18q72M07K38j83j59L3M67J27o53K74j30r1p1J85l40j08o6M24j27L75k85
5040c7K6K52k8l29N29k32n02M41n2p7k92Q08q7o03N92j95J22m46K98j68l11m3
$$ y = [-387, 82, -265, -94, 333, 248, -525, -874, 56, 148, 313, -45, -209, -332, -272, 122, 506, 46, 461, 154, 127, 514, -284, 692, 232, 165, -107, 100, 227, 212, -141, 130, 211, -84, 159, 152, -170, -294, 117, -6, 484, 29, -129, 191, -321, 28, -198, -180, 166, -59, 165, -604, 70, 564, 161, -354, -257, -567, -233, -443, 209, 190, 235, 334, -113, 79, 75, -181, -64, 102, -80, -51, 25, 69, 147, -404, 40, 401, -159, 64, 164, -154, -345, -299, 168, 410, 103, -64, -328, 384, 432, -85, 148, 184, -110, -46, -117, 133, -300, -58, 223, 40, -481, -10, -691, -125, -25, 214, -61, -607, 212, -127, 152, 189, -303, -281, -81, 2, 249, 236, -180, 125, -175, -50, -263, -138, 105, 227, -262, 201, 518, -354, 53, 291, 108, -51, -18, 449, 576, -77, 197, 67, -24, -95, 90, -250, -358, -424, 0, -127, 248, -37, -11, 241, 213, -116, 413, 181, -321, 120, 68, -9, -301, 507, 420, -183, 409, 214, 336, -110, 188, 20, -291, -334]
5062c34M17k13J19q0K73K70p82N47R1pk05k42j3M43J2j07l68j96N07R8L80r19
5084c09P04j71K65k81j39k13P90J00m98Q6l58M69j41k8j46p09O86j82L25p01K14
5105b37K78J75l11J38k99lm31N73L45o17P91q0l78M81m80p4k8K19N8k97L28m6
5127A05m21J69J23j06M35p68R3J42K22m8L6K06J27J08p66K12m4P01o53P48m01
5148B20m25N04k8n25m1k6J28j49L82m96L85o29O11N57p68M33j03q3K70r7k97J42
5170c5J13k58L20k87K7J72l77L9J93o3L7J66L00m96j15K10L78k00L37k30J8l03
5192e4k66L99L39k94r3J02k59n06J17M47K18P6J23k62K4j28l1K00l19P67o85J6
5214f9M3j43O8m5O45p09K65n17O35k5J85l05k34O41n81L96k07o23M68L95j58q81
$$ y = [-334, 83, -130, -11, -91, 182, 452, -330, 217, 308, 301, 96, -146, -159, 284, 296, 189, -179, -375, 132, 230, 610, -309, 395, 224, 489, 208, 69, -144, 646, 746, 248, 334, -24, 445, 304, 276, 130, -579, 107, -75, 250, -451, -237, 41, 216, -95, 43, -256, -259, -690, -117, 228, -389, 402, 322, -56, 425, -55, -129, -157, 62, 120, -177, 151, 105, -316, -147, -24, -130, 305, -463, -370, -228, -6, -54, -18, 188, 315, 423, -343, -131, -175, 526, -127, 621, 220, -205, 299, 271, -254, -295, -321, -193, -342, 40, -456, -71, -700, -89, 468, -300, 133, 30, -53, 217, 120, -177, -35, 78, -180, 140, -147, -120, 52, -325, -286, -93, -156, -119, 47, 347, -149, -264, -54, 324, 124, 461, 231, 249, -54, -320, 79, 418, 124, 31, 133, -126, -632, -515, -68, 150, 226, 349, 87, 111, -17, -48, 152, -167, 600, -85, -69, -26, -169, -101, -146, 499, -210, 55, -462, 173, 148, 333, 28, -206, 435, -146, 250, 43, -580, -112, 283, 125, -756]
5236g56J208m16k58J51K58k29L3K48j99n1J25m29J53K67K0J80K1j64l02O03n14
5257e1lO6J53L28n80j95R1N85k42l33K18j08l11J88L73n14M15n6p8O13j028L6
5279d33K00N63p6o5l73L32n0p7L13o90J14M8Q26p41k38O54o4p18P0M69J96m17
5301a57j09N70l53L91j25k28J86r93R63p85M80jK43J95n84N06l60L96n63L60q7
5322e5J16N1Pj23J97L89o69l05K56M36k41n71M94k9K05N00j059O61J51Q0m86o7
5344f2N8j02M8M51k82n50M10r0r0O1K63N9mo06N39k58J73L85j85p0J25l02j62
5367a91P13p48J89r7J25M36j054J03L97L75m78Q04o68K04j89K81k51J1J53N53
5387F68p08l46L10J93j5Q3Jl15Q2J6K66o43N76K08p04N28J24n44o5P6K87o4m35
$$ y = [-756, 452, 36, -222, -71, 187, -42, -9, 239, 40, -11, 114, -315, -162, 105, 125, 305, 326, 162, -140, 463, -51, -54, 12, 165, 493, -87, -282, -191, 394, 152, -181, 37, -71, -382, -194, 179, -335, 80, 24, -54, 559, -469, -433, -233, 330, 254, 189, -184, 148, 98, 21, 334, -356, -242, -194, 632, -109, -347, 307, 243, -475, -405, 64, 260, -157, -266, 304, -49, 342, 217, -11, 175, -818, 145, -640, -160, -161, 82, 277, -307, 199, -161, 235, -328, 32, -55, 61, 112, 119, -4, 193, 582, -87, -392, -136, 300, 59, -512, -18, -47, 158, 658, -401, 260, 411, 491, 5, -62, -4, -106, -58, 393, 111, -439, -29, -119, -209, -148, 115, 174, 170, -436, 103, -155, 18, 403, 218, 148, 273, -29, -191, 522, -226, -37, -134, -9, 427, -627, -524, -127, 248, -230, 574, -94, 110, -79, 202, -49, -38, 115, 668, -40, -386, -76, 117, 102, 185, 186, -129, -47, -31, 235, -408, 168, 376, -328, 200, 324, -220, -285, -209, 78, 14, -421]
5410d21L74K37Jk20Q8m9j99J11k9J31M5k54R9j54L62p30M03M21m91M76Q7j02m03
5433b17M30k47M8k13J96Nl2q1j93P29m40k17J37R4Mm17M39J32j07NK75n7k51K00
5457B22k34L17k17K41P3k81k83K10K2J81k88j2m03J01K95j62l28N35rj92k08K74
5479a46L86M1m36K01l17M51j08m31J27Q68q44K0N69l98J71K33l38N11l87L48m90
5500C1j44J40N19l74m01L63M40q99K37N29o03N27l03P71p88p8N12o61O6l7M07
5521B54k13M0k92L45k99j13M35k76O50o51K58j88K37J84q66L24J12J45M7r7n4
5542a8k85N39m88j53M66l23L67L3j16j27J63k30L20Jk40k62R4M62l78l0k05N68
5564A58Q9j15l77M0K16K05L5k10K75k23l17l27P23m01k8L64o06M88L45n11j25
$$ y = [-421, -47, 190, 191, -29, 59, 10, -189, -78, -107, 24, 69, -185, -86, -240, 122, -608, -205, 216, -275, 201, 288, 186, -217, 213, -34, 14, -199, -3, 2, -30, -111, -304, 425, -15, -232, -95, -1, 3, -414, 25, 157, 50, 55, 330, 273, 22, 222, -12, 305, 88, 329, 402, 121, -162, 48, 70, 251, -37, -49, -452, -351, -56, -218, -546, -11, -20, -212, -420, -146, 240, 281, -155, 46, -271, 180, 72, -359, -232, 636, -208, -188, 381, -17, 154, 387, 49, 560, 173, 521, 31, -113, 27, 546, 172, -229, 134, 574, -325, -88, 441, -162, 365, 62, 833, 45, -33, 479, -182, -116, -153, 254, 41, 81, -211, 134, -165, -278, 157, -119, 531, -120, 138, -50, 187, 371, -495, -171, -59, 86, 133, 36, -18, -303, 236, -252, -405, 61, -262, 105, 138, 22, -105, 58, -172, 148, 149, -91, -353, -259, 203, -175, -205, -410, 158, 247, 132, -245, -205, 11, 216, 251, 41, 316, 93, -224, -551, 172, -229, -257, 107, -499, -11, 334, -177, -302]
5585c02L36l94j93N75K72k50J46m29L35Q2j40l84M60j32l03M55m23M34J09k14
5605D0J91l91r8q4O5K0L93k96l07j10N65K19k20k49K18K81K7l57o4J30J86o61
5627e02L31k22M1L18K45m38N22l25N09l04j26O4l92o3J55P0O4j35K84k48K85N7
5649A90l76K47k10O71k01l45k22M34j10j57L16k79M7mj88J63r8L92n33k45K77
5670b31o1m4j00K32O24m24K64j84l15R3k13N67K36l80k65J74J64N3M00o53O16
5691E53n83j74J72J7J09l00K64J31n21J10L57m82M79m9L50o93L71L47o17l4K88
5712I5N30k27j004K50J76L83P8K57j47n31N43m67K26K97l23j80N28n13K61K78
5732E10n22k72M40m64K68k11N36k77k2m13N91L7J8K3l73L48l93K31O76m02m08
$$ y = [-302, 34, -360, -553, 22, 294, 44, 190, -239, 96, 178, 38, -346, 114, -18, -321, 134, -289, 145, 254, 40, 231, -160, -258, -342, -277, -257, 136, -160, -467, -577, -12, 207, -13, -262, -44, 237, 264, -93, -157, -27, 159, -502, -171, -393, -352, -34, 211, -227, 295, -30, 479, 175, 49, 113, -279, -342, -187, -117, -53, -188, 96, -152, 133, 190, -186, 61, -149, 522, 321, -24, -246, 188, 78, -79, 237, -42, 5, 1, -187, -24, -122, 270, -263, -508, -231, -292, -336, -436, -204, 420, -4, 260, 76, -239, -146, -359, 208, 444, 64, -201, -27, 137, 190, 590, -63, 553, -30, -204, -32, -15, 94, -206, 58, 189, -332, -222, 135, -347, 132, 83, 433, -260, 111, 458, -159, -193, 95, 625, 398, -606, -356, -180, 203, 281, 538, 391, -140, 403, -64, 162, 459, 136, -44, 484, -29, 232, 510, -12, -284, 156, -308, -40, -251, 285, 8, -14, -427, 164, 201, 219, 242, -131, 217, -176, 55, 731, 329, -79]
5753g9L67k60k34K93O0l06N50l74o4j45j00K81N14n05J61l89J67N93p59J94o90
5774g25Q18K45o14N4P79p18r6J16J41K0k53L93l57K99n65N61O08p21K12m0k04
5795d7l37M51J88K64j55o06K00O7j55J35M2J1l55J44J84j12K66m29J94j10K71
5816A11n47J59M39q5l25q1N92k83R9m12K21N10J91l95n67J93L3L04n6L64l18Q4
5838B31l73J47l95P93p10L23K76m39M22k18M0m78O27k84K42o77N85l68M82l69
5858a43K10k52N88j99l40J00K19j53J86l14N75l02l81O50o42Q3J29K00K8l30J41
5879E3k42M67n56l02Q59J5L6pj38j17K00Qq1J19O7k65M8J71k40Q5j54J00L76n28
5903b6r0K09r4l41O10k48N54j401P44k59M12l63J65m0J96P29o01k90l50M54J84
$$ y = [-79, 288, 28, -206, 87, 147, -159, 391, 17, -47, -192, -292, -11, 503, -2, 159, -230, -63, 530, -229, -35, -725, 93, 338, -276, -222, 557, -161, -257, -141, 0, 20, -233, 160, -197, 102, -463, 98, 706, -15, 197, 157, -47, -384, 67, 255, 519, 364, -242, -42, 25, -130, 5, 47, 58, -297, -153, 31, -81, 185, -244, -50, -160, 111, -436, -277, 162, 77, -248, -329, 263, -20, 79, -333, -112, 398, 589, 194, -373, -180, -147, 157, 101, 465, 147, 231, -142, 5, -390, 403, -307, 16, 292, -147, 275, 57, 97, -381, 246, -38, 204, -473, 112, -256, 226, -143, 67, -185, 403, 204, -136, -36, 183, 30, 216, -98, 477, 175, -206, 444, -198, -115, 14, 214, 242, -88, 53, -189, 278, -278, -580, 279, 294, 330, 323, 185, 68, 268, 276, 195, 314, 381, 116, 164, 335, 95, 180, 26, 126, 502, -26, -116, 93, -1, -342, 268, 20, 574, -827, -83, -342, 70, -293, -128, -168, 28, 757, 156, -134, -484, -30, 154]
5924A54l80j90L10O36q18N54n00K96k8J89J97r18O06K27n64K87J65K6m60l3j58
$$ y = [154, -226, -416, -106, 530, -288, 266, -234, 62, 34, 223, 420, -498, 108, 335, -229, 58, 223, 249, -211, -244, -402]
$$ [...]
8191A33
##END NTUPLES=NMR FID
##END=
