##TITLE=1H_IPACAT-34-3
 CDCl3
 8 sc, 
 23.11.2023
##JCAMPDX= 6.0         $$ Bruker NMR JCAMP-DX V2.0
##DATA TYPE= NMR FID
##DATA CLASS= NTUPLES
##ORIGIN= UXNMR, Bruker Analytische Messtechnik GmbH
##OWNER= root
$$ XWIN-NMR		Version 3.5
$$ Thu Nov 23 15:51:04 2023 Russian Standard Time (UT+4h)  she@DPX200
##.OBSERVE FREQUENCY= 200.1313
##.OBSERVE NUCLEUS= ^1H
##.DELAY= (6, 6)
##.ACQUISITION MODE= SIMULTANEOUS
##.ACQUISITION SCHEME= undefined
##.AVERAGES= 8
##.DIGITISER RES= 18
##SPECTROMETER/DATA SYSTEM= spect
##.PULSE SEQUENCE= zg30
##.SOLVENT NAME= CDCl3
##.SHIFT REFERENCE= (INTERNAL, CDCl3, 0, 15.7039)
##AUDIT TRAIL= $$ (NUMBER, WHEN, WHO, WHERE, WHAT)
$$ ##TITLE= Audit trail, XWIN-NMR		Version 3.5
$$ ##JCAMPDX= 5.01
$$ ##ORIGIN= Bruker BioSpin GmbH
$$ ##OWNER= she
$$ F:/spectra/data/she/nmr/H-F/1/audita.txt
$$ ##AUDIT TRAIL=  $$ (NUMBER, WHEN, WHO, WHERE, WHAT)
(   1,<2023-11-23 15:49:14.57 +0400>,<she>,<DPX200>,
      <created by zg, POWCHK disabled, PULCHK disabled
       configuration hash MD5:
       00 E9 B6 7A A2 85 ED C7 34 08 36 98 17 FE 4E 26
       data hash MD5: 16K
       11 A3 8C 7F 2C 4E 30 A5 26 A7 BD 16 24 B9 AE 3A>)
$$ ##END=
$$ 
$$ hash MD5
$$ 59 09 BC 88 84 95 06 03 62 B3 BF F2 39 E6 3B 24
##$RELAX= 
##$RELAX= 
##$RELAX= 
##$RELAX= 
##$RELAX= 
##$RELAX= 
$$ Bruker specific parameters
$$ --------------------------
##$DU= <F:/spectra>
##$EXPNO= 1
##$NAME= <H-F>
##$PROCNO= 1
##$TYPE= <nmr>
##$USER= <she>
##$AMP= (0..31)
100 100 100 100 100 100 100 100 100 100 100 100 100 100 100 100 100 100 
100 100 100 100 100 100 100 100 100 100 100 100 100 100 
##$AQSEQ= 0
##$AQ_mod= 1
##$AUNM= <au_zg>
##$AUTOPOS= <>
##$BF1= 200.13
##$BF2= 200.13
##$BF3= 200.13
##$BF4= 200.13
##$BF5= 200.13
##$BF6= 200.13
##$BF7= 200.13
##$BF8= 200.13
##$BYTORDA= 1
##$CFDGTYP= 0
##$CFRGTYP= 5
##$CHEMSTR= <none>
##$CNST= (0..31)
1 1 145 1 1 1 1 1 1 1 1 1 1 1 1 1 1 1 1 1 1 1 1 1 1 1 1 1 1 1 1 1 
##$CPDPRG= <>
##$CPDPRG1= <>
##$CPDPRG2= <>
##$CPDPRG3= <>
##$CPDPRG4= <mlev>
##$CPDPRG5= <mlev>
##$CPDPRG6= <mlev>
##$CPDPRG7= <mlev>
##$CPDPRG8= <mlev>
##$CPDPRGB= <>
##$CPDPRGT= <>
##$D= (0..31)
0 1.2 0 0 0 0 0 0 0 0.06 0 0.03 0 0 0 0 0.0002 0 0 0 0 0 0 0 0 0 0 0 0 
0 0 0 
##$DATE= 1700740154
##$DBL= (0..7)
120 120 120 120 120 120 120 120 
##$DBP= (0..7)
150 150 150 150 150 150 150 150 
##$DBP07= 0
##$DBPNAM0= <>
##$DBPNAM1= <>
##$DBPNAM2= <>
##$DBPNAM3= <>
##$DBPNAM4= <>
##$DBPNAM5= <>
##$DBPNAM6= <>
##$DBPNAM7= <>
##$DBPOAL= (0..7)
0.5 0.5 0.5 0.5 0.5 0.5 0.5 0.5 
##$DBPOFFS= (0..7)
0 0 0 0 0 0 0 0 
##$DE= 6
##$DECBNUC= <off>
##$DECIM= 32
##$DECNUC= <off>
##$DECSTAT= 4
##$DIGMOD= 1
##$DIGTYP= 9
##$DL= (0..7)
0 120 120 120 120 120 120 120 
##$DP= (0..7)
150 150 150 150 150 150 150 150 
##$DP07= 0
##$DPNAME0= <>
##$DPNAME1= <>
##$DPNAME2= <>
##$DPNAME3= <>
##$DPNAME4= <>
##$DPNAME5= <>
##$DPNAME6= <>
##$DPNAME7= <>
##$DPOAL= (0..7)
0.5 0.5 0.5 0.5 0.5 0.5 0.5 0.5 
##$DPOFFS= (0..7)
0 0 0 0 0 0 0 0 
##$DQDMODE= 0
##$DR= 18
##$DS= 0
##$DSLIST= <SSSSSSSSSSSSSSS>
$$ [...]
##$SUBNAM2= <"">
##$SUBNAM3= <"">
##$SUBNAM4= <"">
##$SUBNAM5= <"">
##$SUBNAM6= <"">
##$SUBNAM7= <"">
##$SUBNAM8= <"">
##$SUBNAM9= <"">
##$SW= 18.0517328524113
##$SWIBOX= (0..15)
0 0 2 0 0 0 0 0 0 0 0 0 0 0 0 0 
##$SW_h= 3612.71676300578
##$TD= 16384
##$TD0= 1
##$TE= 0
##$TE2= 300
##$TE3= 300
##$TEG= 300
##$TL= (0..7)
0 120 120 120 120 120 120 120 
##$TP= (0..7)
150 150 150 150 150 150 150 150 
##$TP07= 0
##$TPNAME0= <>
##$TPNAME1= <>
##$TPNAME2= <>
##$TPNAME3= <>
##$TPNAME4= <>
##$TPNAME5= <>
##$TPNAME6= <>
##$TPNAME7= <>
##$TPOAL= (0..7)
0.5 0.5 0.5 0.5 0.5 0.5 0.5 0.5 
##$TPOFFS= (0..7)
0 0 0 0 0 0 0 0 
##$TUNHIN= 0
##$TUNHOUT= 0
##$TUNXOUT= 0
##$USERA1= <user>
##$USERA2= <user>
##$USERA3= <user>
##$USERA4= <user>
##$USERA5= <user>
##$V9= 5
##$VALIST= <valist>
##$VCLIST= <CCCCCCCCCCCCCCC>
##$VD= 0
##$VDLIST= <DDDDDDDDDDDDDDD>
##$VPLIST= <PPPPPPPPPPPPPPP>
##$VTLIST= <TTTTTTTTTTTTTTT>
##$WBST= 1024
##$WBSW= 4
##$XGAIN= (0..3)
0 0 0 0 
##$XL= 0
##$YL= 0
##$YMAX_a= 76284
##$YMIN_a= -75466
##$ZGOPTNS= <>
##$ZL1= 120
##$ZL2= 120
##$ZL3= 120
##$ZL4= 120
##$ABSF1= 10
##$ABSF2= 0
##$ABSG= 5
##$ABSL= 3
##$ALPHA= 0
##$AQORDER= 0
##$ASSFAC= 0
##$ASSFACI= 0
##$ASSFACX= 0
##$ASSWID= 0
##$AUNMP= <proc_1d>
##$AZFE= 0.1
##$AZFW= 0.1
##$BCFW= 1
##$BC_mod= 2
##$BYTORDP= 1
##$COROFFS= 0
##$CY= 11.3945322036743
##$DATMOD= 1
##$DC= 2
##$DFILT= <>
##$DTYPP= 0
##$F1P= 15.7292609196834
##$F2P= 12.9074282941183
##$FCOR= 0.5
##$FTSIZE= 0
##$FT_mod= 4
##$GAMMA= 1
##$GB= 0.15
##$INTBC= 1
##$INTSCL= 1
##$ISEN= 128
##$LB= 0.24
##$LEV0= 0
##$LPBIN= 0
##$MAXI= 10000
##$MC2= 0
##$MEAN= 0
##$ME_mod= 0
##$MI= 1.114404
##$NCOEF= 0
##$NC_proc= 0
##$NLEV= 6
##$NOISF1= 3.799351
##$NOISF2= 2.8
##$NSP= 1
##$NTH_PI= 0
##$NZP= 0
##$OFFSET= 15.70392
##$PC= 1
##$PHC0= -24253.58
##$PHC1= 34.65269
##$PH_mod= 1
##$PKNL= yes
##$PPARMOD= 0
##$PSCAL= 0
##$PSIGN= 0
##$REVERSE= no
##$SF= 200.130013532006
##$SI= 16384
##$SIGF1= 3
##$SIGF2= 2
##$SINO= 400
##$SIOLD= 16384
##$SREGLST= <1H.CDCl3>
##$SSB= 0
##$STSI= 0
##$STSR= 0
##$SW_p= 3612.71676300578
##$SYMM= 0
##$S_DEV= 0
##$TDeff= 0
##$TDoff= 0
##$TI= <>
##$TILT= no
##$TM1= 0
##$TM2= 0
##$TOPLEV= 0
##$USERP1= <user>
##$USERP2= <user>
##$USERP3= <user>
##$USERP4= <user>
##$USERP5= <user>
##$WDW= 1
##$XDIM= 8192
##$YMAX_p= 0
##$YMIN_p= 0
$$ End of Bruker specific parameters
$$ ---------------------------------
##NTUPLES= NMR FID
##VAR_NAME=  TIME,          FID/REAL,        FID/IMAG
##SYMBOL=    X,             R,               I
##VAR_TYPE=  INDEPENDENT,   DEPENDENT,       DEPENDENT
##VAR_FORM=  AFFN,          ASDF,            ASDF
##VAR_DIM=   8192,          8192,            8192
##UNITS=     SECONDS,       ARBITRARY UNITS, ARBITRARY UNITS
##FACTOR=    0.0002768,     1,               1
##FIRST=     0,             0,               0
##LAST=      2.2672688,     0,               0
##MIN=       0,             -75466,          0
##MAX=       2.2672688,     76284,           0
$$ Real data points
##PAGE= N=1
##DATA TABLE= (X++(R..R)), XYDATA
0@%%%%%%%%%%%%%%%%%%JrJ6j6J6j6J6j7K5l2L2l5M3m8N5o3O9p7Q7r6J05j19J33
$$ 0 0 0 0 0 0 0 0 0 0 0 0 0 0 0 0 0 0 0 1 -8 8 -8 8 -8 8 -9 16 -16 16 -19 24 -24 31 -32 37 -40 47 -49 56 -63 70
41G0j45J58j76J96k15K35k60K86l13L45l81M19m62N13n72O40p16Q05r14J049j218
$$ 70 -75 83 -93 103 -112 123 -137 149 -164 181 -200 219 -243 270 -302 338 -378 427 -487 562 -656
62f56J439j736K157k795L842n825J0692m0170l2849J38105j12387k922J14942
$$ -656 783 -953 1204 -1591 2251 -3574 7118 -33052 -65901 72204 -40183 -43105 71837
75G1837j14652L4091P4829j15117O1028K7915j01613Q6267r453p5036J05663m4628
$$ 71837 -42815 -8724 66105 -49012 12016 39931 -61682 24585 15132 -59904 45759 1131
87A131m5446J05936p5910j9163R5005r6960J1123P8486j02170M0877N5476r6600
$$ 1131 -44315 61621 -14289 -33452 61553 -35407 -24284 54202 -47968 -7091 48385 -48215
99d8215O1043K4463q3672P0711o663o1292P4236l0772l4840P3436n2104p763O4542
$$ -48215 12828 37291 -46381 24330 17667 -43625 30611 -161 -35001 38435 -13669 -21432 43110
112D3110o9922J6833N0986p8669L9129L3499p6997N4340J4077o7621O1973n896
$$ 43110 -26812 -9979 41007 -37662 1467 34966 -42031 12309 26386 -41235 20738 14842
124A4842n1049O2545k3316l0503N7226l7516r277M6540m7620R802L4471n2100
$$ 14842 -36207 26338 3022 -27481 29745 -7771 -17048 29492 -18128 -8326 26145 -25955
136b5955K7328K0871n0697M0595N708m6601M7501r744l7313M9471k1145k4101
$$ -25955 1373 22244 -28453 12142 17850 -28751 18750 9006 -28307 21164 19 -24082
148b4082M7257k8585r597L9586l4543L088K7658l7033J5065J5677l5036K6597
$$ -24082 23175 -5410 -15007 24579 -9964 -6876 20782 -16251 -1186 14491 -20545 6052
160F052M018k9923L4338p897k4717L6792j8856j7871L6486k5103p706L3132k8066
$$ 6052 10070 -19853 14485 6588 -18129 18663 -193 -18064 18422 -6681 -14387 18745 -9321
173i321K517K5072k9171J0068J4554k7674J6903M809k2913K2513l597j6928K5839
$$ -9321 -6804 18268 -10903 -835 13719 -13955 2948 7757 -15156 7357 3760 -13168 12671
186A2671j1914j1252K4898j8621m510K2304k2136K695J9027k2953Q496J3079k2101
$$ 12671 757 -10495 14403 -4218 -8728 13576 -8560 -5865 13162 -9791 -1295 11784 -10317
199a0317J2448O103j8681J4860n24j3790J6663o330p838J6472j1721k989J5641
$$ -10317 2131 8234 -10447 4413 3889 -9901 6762 432 -7406 9066 -2655 -5644 9997
212I997j5661K325J2994j7426O779R268j7090J0200N312j5021J1677Q22j1915
$$ 9997 -5664 -3339 9655 -7771 -992 8276 -8814 1386 6698 -8323 3354 4176 -7739
225g739J2370l079q020J2363o964l275J0683r644N29Q925j1122M260O504j1648
$$ -7739 4631 1552 -6468 5895 -1069 -4344 6339 -3305 -2776 6149 -4973 -713 5791 -5857
239e857P008L571j1030Q806O67r144R466j548p290R416l917l744P730n291j435
$$ -5857 1151 4722 -6308 2498 3165 -5979 3487 1939 -5351 4065 148 -3596 4134 -1157 -2592
254b592O594o832J564N245p724M381K795p306N585R63o929O933j320n705P360
$$ -2592 4002 -2830 -1266 3979 -3745 636 3431 -3875 1710 2673 -4256 2677 1357 -4348 3012
269C012k853l856P239l912j898N996n252O5M216n544K596K585n208L685J187m972
$$ 3012 159 -3697 3542 -370 -2268 3728 -1524 -1459 2757 -2787 -191 2394 -2814 871 2058 -2914
285b914M831r44m013N846k551l297N797l069k195N585l893p81M142m053P31L062
$$ -2914 1917 973 -3040 2806 255 -3042 2755 -314 -2509 3076 -817 -1598 2544 -1509 -778 2284
301B284m192K006J511l568K790Q0l039L872j598k098L926k260j420M097l459n33
$$ 2284 -1908 98 1609 -1959 831 911 -2128 1744 146 -1952 1974 -286 -1706 2391 -1068 -1601
317a601L602l320N89K871l555J270J888l173K097M73k945K861k10k332K742j518
$$ -1601 2001 -1319 -730 2141 -1414 -144 1744 -1429 668 1141 -1804 1057 847 -1485 1257 -261
333b61q88K948k237m57K700k748L74K284k806O78J844l026J912N78k543K179q4
$$ -261 -1149 1799 -438 -895 1805 -943 -569 1715 -1091 -413 1431 -1595 317 895 -1648 531 447
350D47j887K031n04j145K014j200n38K186k102J35J850k552J118J611k988J682
$$ 447 -1440 591 87 -1058 956 -244 -782 1404 -698 -563 1287 -1265 -147 1464 -1524 158
366A58Q55k276J568L32j521J570m44r73J619q13m85J201j271L42R70j431N86R11
$$ 158 1013 -1263 305 637 -884 686 242 -731 888 75 -410 791 -480 -138 832 -599 -13 898
384H98j868Q54Q65j705J485L9j458J590n16q89J220m35p95J087o02q7R09j065
$$ 898 -970 -116 749 -956 529 568 -890 700 184 -705 515 80 -715 372 -230 -317 592 -473
402d73j08J095j178J041kj172J356k90j043J171m01n20J197n68o82J482j010n66
$$ -473 -581 514 -664 377 375 -797 559 269 -774 397 -4 -524 673 105 -577 905 -105 -671
420f71J385j025L0Q04o42L2L57r43R15P7o44Q84p66l93J395r89l63J145p05J1
$$ -671 714 -311 -281 523 -119 -87 270 -673 242 319 -325 559 -207 -600 795 -194 -557 588 -117 -106
440a06P39j108J19Q20q61L12M30n27P3K03k91J94J81k95M54o04j49P07k58j68
$$ -106 633 -475 -356 464 -397 -85 345 -182 -109 94 -197 -3 178 -117 337 -267 -416 291 33 -135
460a35N03n76K76N4o13M48L83o23L01P9n63P17j17o97R26l94k48L27l33L21J87
$$ -135 368 -208 68 122 -491 -43 340 -283 18 97 -466 251 134 -563 363 -31 -279 48 -285 36 223
481B23n50K6N45m45K97J23m47L40M9n41L41Q6k37L40j82j15L52l70K19J12j34
$$ 223 -327 -301 244 -201 96 219 -228 112 161 -380 -39 47 -190 150 -32 -147 205 -165 54 166 32
502C2j62J78j12J05R5l18J73j21m6P6J29k59J56J09k14L30k21k3K29j14r8j9k92
$$ 32 -130 48 -64 41 136 -182 -9 -130 -176 -100 29 -230 -74 35 -179 151 -70 -93 136 22 -76 -95 -387
525c87K63K73k71M77j69l96L21o1j25L72l90j17L78J18o18L12P8k33K86l19j86
$$ -387 -124 149 -122 355 186 -210 111 50 -75 297 -93 -210 168 286 -332 -20 58 -175 111 -208 -394
546c94L75N9j27J47j3k20K10j35M53k27l02N52m70RK06k60Q1jK6N5P3j0j4J82
$$ -394 -19 40 -87 60 47 -173 37 -98 355 128 -174 378 -92 -83 123 -137 -56 -57 -31 24 97 87 73 255
570B55j70j08j62L29q8j38J63o7k55J26L61m01N40k12k71K57j70j99K48r2o2L60
$$ 255 85 -23 -185 144 56 -82 81 14 -241 -115 246 -155 385 173 -98 159 -11 -210 38 -54 -116 244
592B44k70mp8J88j13O4R2k84P0P5r9K2K86l18K11m9o5j67P0J76Q3k60K0L05q4
$$ 244 -26 -30 -108 80 -33 31 123 -161 -91 -16 -115 -93 193 -125 86 37 -28 -195 -125 51 134 -126 -106 199 115
617A15J48l04Oj29M27j83k51K09P0J56n84M41J30l62L7p9J91Q2Pk71K40r5J8j92
$$ 115 263 -41 -35 -164 263 80 -171 38 108 264 -320 121 251 -111 -74 -153 38 120 127 -144 96 1 19 -173
641a73L90j84J14o2K5M7o9j58Q6K71j41o0k09K6QM6j19K90K46o03K10L64m60J09
$$ -173 217 33 147 85 110 157 88 -70 16 287 146 86 -123 -97 -89 -43 -162 128 374 -229 -19 345 -115 -6
665fj3J15N9m67m3K46M8p8J77l52N39l27J46P3p6j06o5K49j0K4k56J80M4j83J79
$$ -6 -19 96 155 -312 -355 -109 -61 -139 38 -314 225 -102 44 117 41 -65 -130 119 109 133 -123 57 101 -82 97
690I7j73L7Ok10J52J17J31k31r2J60j04K42j50J26l91K99k9j80K98k52L32k53
$$ 97 -76 -39 -33 -243 -91 26 157 -74 -166 -6 -110 132 -18 108 -283 16 -13 -193 105 -147 185 -68
712f8O7J02J48k11r9j43K22j35r6L96k19L2k9j31K47r1r4N8k23L68m0K67j77l6
$$ -68 -1 101 249 38 -61 -204 18 -117 -213 183 -36 -4 -33 -164 83 -8 -102 -44 -267 101 61 328 151 115
736A15R6j04J79j51mj3j27L30n0q4k77L17k82K12j45K07j74J47l89J45J17k57
$$ 115 211 107 286 135 131 118 -9 321 271 187 -90 227 -55 157 12 219 45 192 -197 -52 65 -192
758a92R0J96J9k80M95j34k25j75J34K05K05n90L78l7j38K32J80l80QJ18r5j41
$$ -192 -102 94 113 -167 328 194 -31 -206 -72 133 338 -252 126 89 -49 183 363 -17 -9 109 14 -127
780a27L27m5l94J24L73l22Q2n4n5K77j97P3k50L66k68m8Q8K26k35m7J06k63M16
$$ -127 200 155 -239 -115 258 -64 18 -36 -91 186 -11 62 -188 178 -90 -138 -50 176 -59 -106 0 -263 153
803A53j7j29j98K8K98j25r3L9k40M56j12k0J34l5Jl94L44j46K60r8j27K11l46
$$ 153 136 7 -191 -163 135 10 -83 -44 -284 172 60 40 174 139 140 -254 90 -56 204 106 -21 190 -156
826a56K29j20J3N2o0p7L61l07J8K3K22m29j28K78rm5K45l81K04K4j94L45l2j85
$$ -156 73 -47 -34 18 -42 -119 242 -65 -47 -24 198 -231 -359 -81 -90 -135 110 -271 -67 -43 -237 108 76 -109
850a09j86J93m15M51J03j98j3J57k04K57k08Q6O8K05q5m25N06j81j29J0K36p7
$$ -109 -295 -102 -517 -66 37 -161 -174 -17 -221 36 -172 -86 -18 187 102 -323 183 2 -127 -117 119 42
872D2J16j44J21qk22L16j32k76M6K42k95K47J46j64j45m5L08n4J48l58j30L20
$$ 42 158 14 135 127 -95 221 89 -187 -141 101 -194 53 199 35 -110 -155 153 99 247 -111 -241 79
894G9j83J64Kj75N5O6l0J11r8k7j66M08j06R4l67K16j37J92n7k17L43Mq8J57l95
$$ 79 -104 60 62 -113 -58 8 -22 89 -9 -36 -202 206 100 194 -173 43 -94 98 41 -176 167 171 83 240 -155
919a55O9M61l41J18j16j13J19L2L4K2r6j42K06m8k32K31k1J72nj67k86M06n17
$$ -155 -86 375 34 152 36 -77 42 74 108 130 34 -108 98 50 -182 49 28 200 195 28 -258 148 -369
942c69K76j63K65k3l05L59k21J89J15k86K64q2j5J17j5j30J14j23n4K13p7n9j
$$ -369 -93 -256 9 -14 -319 40 -181 8 123 -163 101 19 4 121 106 -24 90 -33 -87 126 49 -10 -11
965a1n2k73K77J42J16j90P8j35Q4r2R9k94M6J13j10L08k39J79l26L30p7k9j3K80
$$ -11 -63 -336 -59 83 199 9 87 -48 36 -56 43 -251 -205 -92 -202 106 -133 46 -280 50 -27 -56 -69 211
989B11k0j54m6L8m4L2Jk03L17l68J37KK73k49J18j8j17l4K52r1J8j30j32K6J76
$$ 211 191 37 -9 29 -15 17 18 -185 132 -236 -99 -97 176 -73 45 27 -90 -124 128 37 55 -75 -207 -181 -5
1014eL7pol34L03k28L21q1m2k44N96k16k65J00O5j35O2k2j4K68k50O9K3J14k05
$$ -5 32 25 19 -315 -12 -240 81 0 -42 -286 310 94 -171 -71 -6 -141 -79 -101 -115 153 -97 -28 -5 109 -96
1039i6k8P4P3j49P0K48k40l4J39k8j13L3k27L52R9k48R2O1j33J06j35K20M1j20
$$ -96 -124 -50 23 -126 -56 192 -48 -82 57 29 -84 -51 -278 74 173 -75 17 78 -55 51 -84 136 177 57
1063E7%P2j24l5K22k72L7J05J5K4m9N8l4n7oP0L24k55k88R7J61j47l4j33J61q4
$$ 57 57 129 5 -30 192 -80 -43 62 77 101 52 110 76 19 13 83 407 152 -136 -39 122 -25 -59 -192 -31 -115
1089a15m8J76M5k12k3N8J04K1j47L26m07Q3qL8K0J90j58J90q2j20j05J60K41j22
$$ -115 -163 13 58 -154 -177 -119 -15 6 -141 185 -222 -139 -147 -109 -89 101 -57 133 51 -69 -174 -14 227 105
1113A05j08r0j10O16k31J6o0n2j9r0prJ13J87k75N2K8N4k74L39k32R8m2j27L0
$$ 105 -3 -93 -203 413 182 198 138 86 67 -23 -30 -39 74 261 -14 38 66 120 -154 185 -47 51 9 -118 -88
1138h8Q9p3m6M29k79j89P4j90N26j76RJ27q5p2K3J3j75J86l32J89J01P5k65K47
$$ -88 1 -72 -118 311 32 -157 -83 -273 253 77 86 213 128 56 79 92 -83 103 -229 -40 61 136 -129 118
1162A18k29J76j31K05k3q4J0k02l3N30j79l25q6L21P9j94J53k15P2J35J13l29
$$ 118 -111 65 -66 139 116 32 42 -160 -193 337 158 -167 -253 68 147 -47 106 -109 -37 98 211 -118
1184a18mnNJ80j12J01k46N8J33l7P3K4P8r0r7L41k86J64j62J31k21m7K19l89K25
$$ -118 -122 -127 -122 58 -54 47 -199 -141 -8 -45 28 52 130 40 -57 284 -2 162 0 131 -90 -137 82 -307 -82
1209h2O9j25J49J8Q7K68n56J01O1J43j83l9M10j82N7l04L59j41k96L78j48J42
$$ -82 -13 -138 11 29 116 384 -172 -71 -10 133 -50 -89 321 139 196 -108 251 110 -186 192 44 186
1231A86j44J99k90r3J26j7M2JM1OM9J34l36q2l9M07o1j60j40K81j98K09m5l08
$$ 186 42 241 -49 -142 -16 -33 9 10 51 57 106 240 -96 -178 -217 190 129 -31 -171 110 -88 121 76 -232
1255b32L02k97K83%ok23J50j13L71q5l12K94k92M60l29kJ09l07L30k43M17n53
$$ -232 70 -227 56 56 50 -173 -23 -136 235 150 -162 132 -160 300 -29 -31 78 -229 101 -142 275 -278
1277b78J0kK66j3k43O0K06j04j32J02Q5p0P2J06L8j79K06k58J42N4Plj36L4j38
$$ -278 -268 -270 -4 -17 -260 -200 6 -98 -230 -128 -43 -113 -41 65 103 -76 130 -128 14 68 75 72 -64 -30 -168
1302a68J6j13L01Qo2q8M45l77K0J74j1k8j10m2j2k5J21k9j9k39J70J09j47M15
$$ -168 -152 -265 36 44 -18 -106 339 -38 -18 156 145 117 7 -35 -47 -72 49 20 1 -238 -68 41 -106 309
1326C09o1m58L77j95N3L17l47J10J54k80j76K37r2J92k44J23J47j42N5J60k79
$$ 309 248 -210 167 -28 25 342 -5 105 259 -21 -197 40 -52 140 -104 19 166 24 79 239 -40
1347d0N8k2O8j29J77j81L5k8L0J89m15K17r3j3L07l30L01m2N6l65M22j33N4l49
$$ -40 18 -4 64 -65 112 -69 -34 -62 -32 157 -258 -41 -134 -147 160 -170 131 89 145 -220 202 69 123 -226
1371b26L11j38J18j08p6J49l7J47o4k04q4L12Qj23K14j75j95O0j40L37n0P7l3
$$ -226 85 -53 65 -43 -119 30 -7 140 76 -128 -212 100 108 -15 199 24 -171 -111 -251 86 36 113 80
1394H0qk80L36o2K04l40K47j66N0M8l32J61L55l01p0J9L11l62K05j59l8K2K2p4
$$ 80 72 -208 128 66 270 -70 177 11 61 109 -223 -62 293 -8 -78 -59 252 -110 95 -64 -102 -80 -58 -132
1418a32K58k3l02K39q6K20k25Q4J01k77P1L5K61k95m8J42J6j38K99k94Q1R9J58
$$ -132 126 103 -199 40 -46 174 -51 33 134 -143 -72 -37 224 -71 -119 23 39 -99 200 -94 -13 86 244
1441B44j75k13O8P6J10k28R7mK04oj77O9M0j13L1j69J29r7RO0J6j00K74K22m55
$$ 244 69 -144 -76 0 110 -118 -21 -25 179 173 -4 65 105 -8 23 -146 -17 -114 -105 -45 -29 -129 145 367 -88
1466h8J44P9k4r9O6k04O5R9m9r8R6J25o8p1p8jp5L7J34KJ28l0j26O2j97J3K38
$$ -88 56 135 111 12 78 -126 -61 38 -11 -109 -13 112 44 -27 -105 -106 -181 -144 -10 -8 120 90 -36 26 -171 -158 80
1493H0j27K59l35L31j52o3P9L3k29n2N66k41m6j66P6R5j71J84k85L6J18J0k6Q1
$$ 80 -47 212 -123 208 56 -7 72 105 -124 -176 390 149 103 -63 13 108 -63 121 -164 -128 -10 0 -26 55
1517E5q8n1j65J01J59n5O1r8K9O7k50J26P8k4J82j21q1j6O7QK44k75J65j7j66
$$ 55 -33 -84 -249 -148 11 -44 17 -81 -52 15 -235 -109 -31 -55 127 6 -75 -91 -24 -16 228 -47 118 101 -65
1542f5J51J08l28J74K02k94P2J62k95L57k04r3j77P8N3J25J52N4l39J05j69K22
$$ -65 86 194 -134 40 242 -52 20 182 -113 244 40 -53 -230 -152 -99 26 178 232 -107 -2 -171 51
1564E1L15l37l5K05n2J5J44m18M46k1k47L0J01j34l07L58k1j25N9p3J17n0K9j72
$$ 51 366 29 -6 199 147 162 306 -112 334 313 66 96 197 63 -244 114 93 -32 27 -46 71 21 50 -122
1588a22J65p6J45j75j56J85N8M3J8k58J46m1K89j42q3k1k73J64P9J33k28J00k70
$$ -122 43 -33 112 -63 -219 -34 24 67 85 -173 -27 -68 221 79 -4 -25 -298 -134 -55 78 -150 -50 -320
1611c20J52J41l8j39L04r4L5j44R4l5P5o7J1J49j63J70j29J15k20K5j34L04P1
$$ -320 -168 -27 -65 -204 100 6 41 -103 -9 -44 31 -36 -25 124 -39 131 2 117 -103 -78 -212 92 163
1634A63j20j38P8m8j3J34M1l12J01J05k1j02L18l38J48j63q9L7J50K59o7l33J02
$$ 163 43 -95 -17 -65 -78 56 97 -215 -114 -9 -30 -132 186 -152 -4 -167 -256 -219 -69 190 123 -210 -108
1657a08K64l36K49n2r2n9N0J58ol5O3o6p7J03j17J74k20J03R6Jl9L18j42k51n3
$$ -108 156 -180 69 17 -75 -134 -84 74 68 33 96 30 -47 56 -61 113 -107 -4 92 93 54 372 230 -21 -74
1682g4J78k54K1J53o4J23j88J94m1Rj01N1p4N09k87j14R7j54j82J49q2K4L08j48
$$ -74 104 -150 -129 24 -40 83 -105 89 48 57 -44 7 -67 442 155 41 138 -16 -198 -49 -131 -107 201 53
1706E3j53K22M1j78k23L30L5j70N60n68k0J90o4j42L38j83k37j7J48k1j51J01
$$ 53 -100 122 163 -15 -238 92 127 -43 517 -51 -71 119 55 -87 251 68 -169 -186 -38 -59 -210 -109
1728a09J38k05J29J3n5j02N1J45j86J73L56l71pR6k59o7K73M4Kk6j25m0L27j12
$$ -109 29 -176 -47 -34 -89 -191 -140 5 -181 -8 348 -23 -30 66 -193 -260 13 57 59 33 -92 -132 195 83
1752H3l7j19J70l8j5k74K21k29L13qj02k32R1M53l61J98m1J73l43K13j17O7j27
$$ 83 46 -73 97 59 44 -230 -9 -238 75 67 -35 -267 -176 277 -84 114 73 246 -97 116 -1 66 -61
1775f1k1n9K16j38o0J76k88K36j63K26j89K63l55K02j07m6K45j08J61j32m4o4
$$ -61 -82 -141 75 -63 -123 53 -235 1 -162 64 -125 138 -217 -15 -122 -168 77 -31 130 -2 -46 -110
1797a10L1J69n5q1J01N7J89p6j75q4j20N6Qk38N35p2j38k9P5r0J15j82j56M46
$$ -110 -79 90 35 -46 55 112 301 225 50 -34 -154 -98 -90 -328 207 135 -3 -32 43 -47 68 -114 -270 176
1821A76k57p5k5K09j18R1j58J32j23L52l04Q0q8J71q8J77j44m4K51k62k5J16n6
$$ 176 -81 -156 -181 28 -90 1 -157 -25 -148 204 -100 -20 -108 63 -25 152 8 -36 215 -47 -72 44 -12
1844a2p1J89k20K42Jp9r8L21n02M03j69mln2M9J0J82O3l00J74k13J8l1K73l3l76
$$ -12 -83 106 -114 128 129 50 -48 273 -229 174 5 1 -2 -54 -5 5 187 250 -50 124 -89 -71 -102 171 138 -238
1870b38K48j79K81j51l3J72m49M11J67j94Q7k78J77O2k09K5J00j11R6K2k72L5
$$ -238 10 -169 112 -39 -72 100 -349 62 229 35 122 -156 21 83 -126 -101 -1 -112 -16 6 -266 -231
1892b31N4M43l90K05j18R5L20m30r3L70q5j32P7K1k7j39k5J30J36k51K36l00K04
$$ -231 -177 266 -124 81 -37 58 378 -52 -145 225 140 8 85 106 79 -60 -85 45 181 -70 166 -134 70
1915G0o9J49k01p2nK28k37J29K6NJ38k52j31M9J79nmO5k70M12j19N3K32l82P7
$$ 70 1 150 -51 -123 -128 100 -137 -8 18 23 161 -91 -222 -173 6 1 -3 62 -208 204 85 138 370 -12 65
1940F5k32K69j45j07K07N5l16P8J46k5M6j6j4O2j51K23j80q1J41m6J89m6k0l82
$$ 65 -167 102 -43 -150 57 112 -204 -126 20 -5 41 25 11 73 -78 145 -35 -116 25 -21 168 122 102 -280
1964b80N07j75K2k5o6J20J45m1l41j25K28l5J75n5R7j69qM1j12N3j07K31j34J66
$$ -280 227 52 74 49 -17 103 248 207 -134 -259 -31 -66 109 54 151 -18 -26 15 -97 -44 -151 80 -54 112
1988A12p6J52j58p2r4j94L75j05K2R4K23l13j91K23p2J10j17M7j09K96l90K26
$$ 112 36 188 30 -42 -136 -330 45 -60 -38 56 279 -34 -225 -2 -74 36 -81 -34 -143 153 -237 -11
2010a1L0k70K51J7j59J74O8o5N0j23J12j15N8q9q7Q4M5O8j83r5M21k49JK08O6
$$ -11 19 -251 0 17 -142 32 100 35 85 -38 74 -41 17 -72 -159 -75 -30 38 -145 -240 181 -68 -67 141 207
2035B07l20J28M7j72J6L02k63o3R1K76j68l7j83L15M1j45n3k01O4m1J09J14j66
$$ 207 -113 15 62 -110 -94 208 -55 -118 -27 249 81 44 -139 176 217 72 19 -182 -118 -159 -50 64 -102
2058a02L96j67O9j78K3P7j51K42j99K8k20J7k8K27N0j11K22l00J24j26p6K82j97
$$ -102 294 127 196 18 41 118 -33 209 10 38 -182 -165 -193 34 84 -27 195 -105 19 -107 -183 99 -98
2081i8l0K49j66n1k0k2M0J33r3j67L08l98L81j93J52k15L47q4j43K69m09K60k21
$$ -98 -128 121 -45 -96 -116 -138 -98 35 -58 -225 83 -315 66 -127 25 -190 157 73 -70 199 -210 50 -171
2104a71J75j33m40N93R8l27L06j02J32l12N3J91o8J3o7QJ20j60n4L13Ql3j06l
$$ -171 4 -129 -569 24 122 -205 101 -1 131 -181 -128 63 -5 8 -59 -51 69 -91 -145 168 176 143 37 34
2128C4O7N5O3k46K3k79N71m50J04P7j14J70O1j77j33K40k13M6J46k4k7L14k80
$$ 34 101 156 219 -27 -4 -283 288 -162 -58 19 -95 75 136 -41 -174 66 -147 -101 45 21 -6 308 28
2151B8m1QJ90k08M4J16j16op3L5J25j44no3N4k3p7ML54l84K88k54K66k13J61o2
$$ 28 -13 -5 185 -23 21 137 21 15 -58 -23 102 -42 -47 -110 -56 -79 -156 -152 202 -182 106 -148 118 -95 66 4
2177DQ2K9R0k62j65K65j76J31J59n6k11r0K66n7K11r7k45J52j85J62K0J65k84
$$ 4 86 115 205 -57 -222 43 -133 -2 157 101 -110 -200 66 9 220 123 -122 30 -155 7 27 192 -92
2200i2j07K29j30K90l27k0r2J94R3p2K76j86l60M20j88J4q8J52j79K83j62l0K14
$$ -92 -199 30 -100 190 -137 -157 -249 -55 38 -34 242 56 -304 116 -72 -58 -146 6 -173 110 -52 -82 132
2223A32m97N35k62K06r2j65qJ73p0J92q5k29J84n5k0Q9k12P5k8L77l20J35j62
$$ 132 -365 170 -92 114 22 -143 -151 22 -48 144 59 -170 14 -41 -61 28 -184 -109 -137 240 -80 55 -107
2246a07m2j0L04k54O2J66Q7k49P5J35r5k9Lj51R8m9J91k36J14J35j85J64r8l23
$$ -107 -149 -159 145 -109 -47 119 206 -43 32 167 72 43 46 -105 -7 -56 135 -101 13 148 -37 127 29 -294
2270b94M85L4k81J36j00K54m9k33Q8J04j54R2j75K80k57M1Q8kJ8l8K10m97J42
$$ -294 191 225 -56 80 -20 234 185 -48 40 144 -10 82 -93 187 -70 -29 59 57 75 37 247 -250 -108
2293a08R5JL1l20K8K80j0j78K30j11J28J02k5j03j21m8M99m20J50j19K51j35m7
$$ -108 -13 -12 19 -301 -273 7 -3 -181 49 -62 66 168 143 40 -81 -129 370 -50 100 -19 232 97 50
2316E0J65l86M60k93j25K35j18J29j5j43K6J85l32K95m0o9q4k43M86p3J4l5l3
$$ 50 215 -171 289 -4 -129 106 -12 117 102 -41 -15 170 -162 133 93 24 -60 -303 183 110 124 89 56
2339E6j79K5M88m56R6k29K27N0J09j33Nq0l1J82K7k4j40J22p5k2m4j5K7l0L1n3
$$ 56 -123 -98 390 -66 30 -199 28 78 187 54 59 -21 -52 130 157 133 -7 115 40 18 -26 -41 -14 -44 -13 -66
2365f6j46L06o4L12l33J21J1l89J73j56R0R7Q8J78l00K49q0P2j39pL7l20K36O3
$$ -66 -212 94 30 342 9 130 141 -248 -75 -231 -141 -44 44 222 -78 171 91 163 24 17 54 -266 -30 33
2389C3K9n4K1j35j1J72j32R6n0J01J12q7j98L36k49j69L45jn4j9k9j82P0J89k61
$$ 33 62 8 29 -106 -117 55 -77 19 -31 70 182 95 -103 233 -16 -185 160 159 105 86 57 -125 -55 134 -127
2414a27K56l65lL75J75l05J81j65j26J14j8J01n7K9P5k16K40k68j18K01K1K16
$$ -127 129 -236 -239 136 311 6 187 22 -104 10 -8 93 36 65 140 -76 164 -104 -222 -21 0 216
2436B16k26Q7m7k6J77M3l41m6J33K0j23K33j06nJ29j71r3J09j34K40J52j43J94
$$ 216 -10 77 30 4 181 224 -117 -163 -30 -10 -133 100 -6 -11 118 -53 -146 -37 -171 69 221 78 272
2459B72k07k75j08L19J23k36K68m3L6k75k9M71k99K80m65K59j86j71J42J3K02
$$ 272 65 -210 -318 1 124 -112 156 113 149 -126 -155 316 17 297 -168 91 -95 -266 -124 -111 91
2480I1l2J53k85K08j62m9K0n5M3N2J53p8k7l12K65k9jM4J02k32q8K52k38J2j5
$$ 91 59 212 -73 135 -27 -76 -56 -111 -68 -16 137 59 32 -280 -15 -44 -45 -1 101 -131 -219 33 -205 -193 -208
2505b08J93NP8K81l77k35J16L44l03J27K1l7j46O8K36l07J1J43J1j10L36k27j04
$$ -208 -15 -10 68 349 -28 -263 -147 197 -106 21 42 5 -141 -73 163 -144 -133 10 21 -89 247 20 -84
2528h4M1J06j61K18J61k38j11J75nJ05r7n4M3L4l03J57K24j77j4J97m14J33q4
$$ -84 -43 63 -98 120 281 43 -68 107 102 207 110 56 99 133 -170 -13 211 34 20 217 -197 -64 -148
2551a48K28l38K13O2n5J16j19J10N6k63J69l8k23P1L80l22m3L24l05j23L59r6
$$ -148 80 -258 -45 17 -38 78 -41 69 125 -138 31 -7 -230 -159 221 -101 -144 180 -125 -248 111 15
2573A5K62k70j59L99j38k26L05k91r1P3J96j27P7O2j03J97k86K97k09P8R6Q1p
$$ 15 277 7 -152 247 109 -117 188 -103 -194 -121 75 -52 25 87 -16 181 -105 192 -17 61 157 238 231
2596B31Llk28KJ8p8R8j28J31o8J21k49Q3q9J89J6J73P5m62J0O8Q4QK56m01J86
$$ 231 234 231 3 5 23 -55 43 -85 46 -22 99 -150 -67 -156 33 49 222 297 -165 -155 -87 -3 5 261 -140 46
2622D6Q4k22K86j06J1n2j20k0oM0J5J19q7J27l32L94j02J6Lk14L08k43J6L1K46
$$ 46 130 -92 194 88 99 47 -73 -93 -99 -59 -44 75 -12 115 -217 177 75 91 94 -120 188 -55 -39 -8 238
2647B38n9l48L51J2j77JM2j25l8K07q0R2QJ63n03M06l96L61r4j45K6RJ73j57K00
$$ 238 179 -169 182 194 17 18 60 -65 -103 104 24 116 124 287 -216 190 -206 155 61 -84 -58 -49 124 -33 167
2672A67j41r5J57k35K10Q5o5jo8pL1r4K28j40M7q9J15j79K20k19K77o4j38P4n1
$$ 167 26 -69 88 -147 63 148 83 82 14 7 38 -56 172 32 79 -10 105 -74 146 -73 204 140 2 76 25
2697B5K24j08k13J48p4MN1R6j85O1Rj96L7P3J53Q0r9p9J01j54j02Q0K98j60L8
$$ 25 249 141 -72 76 2 6 57 153 -32 29 38 -158 -121 -48 105 185 86 7 108 -46 -148 -68 230 70 108
2722A08j51K7q0k1qK73k3j96R1J54J3k91M8J17p4m0j07J03J2k22K99o5N0k1J4
$$ 108 -43 -16 -96 -117 -125 148 125 -71 20 174 187 -104 -56 61 -13 -53 -160 -57 -45 -267 32 -33 17 -4 10
2747A0J41ll20J09K04k37M7K9o9J33n0M01n15Q8J02k36L08o1O1l9p7J22j42Q8
$$ 10 151 148 -172 -63 141 -96 -49 -20 -89 44 -6 395 -120 -32 70 -166 142 81 142 103 26 148 6 94
2771I4o4K74l19L43k88m2l3lKj66K41l96L37j25J59o9J42o8r2K50j17k07L13j60
$$ 94 30 304 -15 328 40 -2 -35 -38 -36 -202 39 -357 -20 -145 14 -55 87 19 -73 177 60 -147 166 6
2795FJ56k88R4Rk67P6L70K9l10J15j48L71k62l8L06j16l9j10J48p4j2P4J28j20
$$ 6 162 -126 -32 -23 -290 -214 156 185 -125 -10 -158 213 -49 -87 219 103 64 -46 102 28 16 90 218 98
2819I8j36m5M1L0N5k01J48j1n6J47k80M05j99J89n22K59Q5pK06l64k39P73k28
$$ 98 -38 -83 -42 -12 43 -158 -10 -21 -77 70 -210 195 -4 185 -337 -78 7 0 206 -158 -397 376 148
2842A48m34L57l70P68n21j61N69l03M7j87j58L74p3J58k42j88K67p3j8k43M62
$$ 148 -286 71 -299 469 -52 -213 356 53 100 -87 -245 129 56 214 -28 -216 51 -22 -40 -283 179
2863A79j02j08qJ37j66j0K47j39O5k34J76j1M3m12L25N0j53J82k74L23k63J88
$$ 179 77 -31 -39 98 -68 -78 169 30 95 -139 37 26 69 -343 -18 32 -121 61 -213 110 -153 35
2885C5j47P3J45j83P9r6J56j50L86j64N8k90k8Q4RM3j57P7J35j03J02j71k17m
$$ 35 -112 -39 106 -77 2 -94 62 -88 298 134 192 -98 -126 -42 -33 10 -147 -70 65 -38 64 -107 -324 -328
2909c28M12K15l85j10J41J12j20nj03J96k8j66R4o5r8L17l74K03K04p3J32j22
$$ -328 84 299 -86 -196 -55 57 -63 -68 -171 25 -3 -169 -75 -140 -238 79 -295 -92 112 39 171 49
2931D9l5j14J71O9j26m7K05l42N1L50j46m2J47k7j95Q5l80M77j09o5r2N3L12k85
$$ 49 14 -100 71 140 14 -33 172 -170 -119 231 85 43 190 163 -32 53 -327 150 41 -24 -116 -63 249 -36
2955c6p3J95k77O0J98J25j2k80j7Q9J61K15j50j87J98k32J61k58K3J93J30j01
$$ -36 -109 86 -191 -131 67 192 180 -100 -117 -28 133 348 198 11 209 -23 138 -120 -97 96 226 125
2977A25K2k68J4k3J59o5M9Q2%o6q2J48pl93L32J27j79J75l19K42m4m3J15r4j26
$$ 125 147 -121 -107 -130 29 -36 13 95 95 29 -53 95 88 -305 27 154 -25 150 -169 73 29 -14 101 7 -119
3002a19j12K97l6K38j32j56JK02j40N6l66J20P5k47L53j26N0J6O0j26P8J27j79
$$ -119 -231 66 30 268 136 -20 -19 183 43 99 -267 -147 -72 -319 34 -92 -42 -26 34 -92 -14 113 -66
3025f6J99j25J72j95N9k3N6l2k88L87k45J11j55K75j5j92M3j68Q8J62J00l97J48
$$ -66 133 8 180 -15 44 21 77 45 -243 144 -101 10 -145 130 115 -77 -34 -202 -114 48 148 -249 -101
3048a01K49k97l9L72k79K49l30M0L00o9k93N4N9M1R8j88J94j27L4J1P0K1Jj99
$$ -101 148 -149 -188 184 -95 154 -176 -136 164 95 -198 -144 -85 -44 54 -134 60 -67 -33 -22 48 69 70 -129
3072a29J03J27l1j26q8J64K8M1k31L25Rj55R4k11j7j65J92Q3J40k24J20l8j58
$$ -129 -26 101 70 -56 -144 20 48 89 -142 183 192 37 131 -80 -97 -262 -70 13 153 -71 49 11 -147
3095a47K38l5J07l89LL62j23J88k09K08m00K20l5J11j72L2K16k73n1K65j43l4
$$ -147 91 56 163 -226 -223 139 16 204 -5 203 -197 23 -12 99 -73 -41 175 -98 -149 116 -27 -61
3117f1l6R0J08k83q3J28P2O9J18k19Q0o7M6lO7k66K0K08J62r0J22j18q8j35K49
$$ -61 -97 -7 101 -182 -265 -137 -65 4 122 -97 -17 -84 -38 -41 26 -240 -220 -12 150 60 182 64 -24 -159 90
3142I0p4j31J76j15L5p9K7PL1o3K94n8k49j66K72P4m2N1m3r1M8p5Q9o4L4k28M43
$$ 90 16 -115 61 -54 -19 -98 -71 -64 -33 -96 198 140 -109 -275 -3 71 29 80 37 -54 -6 -81 8 -56 -22 -250 193
3169A93l74K7L23l58K15j86J28P7k15J9K76M0j48j81J61J19k74L02k55L65k48
$$ 193 -181 -154 169 -189 26 -160 -32 45 -170 -151 125 165 17 -164 -3 116 -158 144 -111 254 6
3190FP3k09k8K00l07J69K49l66L69l70J71L28l18R0J59j8m03K87j67j30K23k26
$$ 6 79 -130 -158 42 -265 -96 153 -213 156 -214 -43 285 -33 57 216 198 -205 82 -85 -215 8 -218
3212b18M05%k14O2l4P4r6J80R5m0k94k7k1K15j07n56N07R2j44L46j33j55K41l51
$$ -218 187 187 -27 35 1 75 -21 159 254 214 -80 -107 -128 87 -20 -576 -69 23 -121 225 92 -63 178 -173
3236a73K70O4l48J50K69p4k11J61N0k94j04M6K42q8J05q0J76l11R5K53j35P1l07
$$ -173 97 161 -187 -37 232 158 -53 108 158 -136 -240 -194 48 -40 65 -15 161 -150 -55 198 63 134 -173
3259a73j7J52J91n2j0j31j60K47J10k18N7K6J67j20j84N1N4J00N8q9O7k38J66
$$ -173 -190 -38 153 101 91 -40 -200 47 157 -61 -4 22 189 69 -115 -64 -10 90 148 59 126 -112 54
3282E4K4J49k99J6q7M32l51k6p8M24j74O1j27j10n7JJ67j92K23j05j53L9K84p1
$$ 54 78 227 -72 -56 -143 289 -62 -88 -166 258 84 145 18 -92 -149 -148 19 -173 50 -55 -208 -169 115 44
3306D4o9K03p8J6k41K73k94p1K79L6l37K89K00j27Q8k28K06p6k01J33j09K04p8
$$ 44 -25 178 100 116 -125 148 -146 -217 62 98 -239 50 250 123 211 -17 189 113 -88 45 -64 140 62
3329F2J28r4k03J36O7N8l4Q1l29P3Q5K2j68J48o0LQ0k90J27J99k19M7r8K77j95
$$ 62 190 96 -107 29 96 154 120 201 -128 -55 30 52 -116 32 -28 -25 55 -235 -108 91 -128 -81 -179 98 -97
3354i7R7J88m50K51M8O3j95J62k21M1j25L64q4M1j36o7k3J79k02K85j72K72j15
$$ -97 0 188 -262 -11 37 100 -95 67 -154 -113 -238 126 42 83 -53 -120 -143 36 -166 119 -53 219 104
3377A04o0N3o7J99m65J57j96J7k5N52m59J76L0kJ19N4m16K23q1r9r7N24q1l09
$$ 104 44 97 30 229 -236 -79 -275 -258 -283 269 -190 -14 16 14 133 187 -229 -6 -87 -186 -283 241 160 -149
3401a49J66m2k19L95k89K26J19k03lMJ50k05J64k13M6p8N38j86m58K34J6J00l19
$$ -149 17 -25 -244 151 -138 88 207 4 1 5 155 -50 114 -99 -53 -131 407 221 -237 -3 13 113 -206
3424b06M13j07j06J50j72k7L2P8r5j36L11j91K96k98L05l75q1K82P7j76J11J51
$$ -206 207 100 -6 144 -28 -55 -23 55 -40 -176 135 -56 240 -58 247 -128 -209 73 150 -26 85 236
3446B36m79L54J51l51R0J40j57J43K41n44K0K74o0j67J02k54K53R0j09K24l01
$$ 236 -243 111 262 -89 1 141 -16 127 368 -176 -156 118 58 -109 -7 -261 -8 82 -27 197 -104
3467a04J2l9r3J83J83j60J29j51K25o3k65M40m76K52j99J5L78j88N7o7j42K33
$$ -104 -92 -131 -224 -41 142 -18 111 -40 185 122 -143 297 -179 73 -126 -111 267 79 136 69 -73 160
3489A60m5k93L06k68J55k2J87j96K11n29L83M9P4k51J17J57k87L4J79l32K84P2
$$ 160 115 -178 128 -140 15 -7 180 -16 195 -334 49 98 172 -79 38 195 -92 -58 121 -211 73 145
3511A45j21j7k1P4L1m0k48K4J60j53K39n6k02O44o20k91K28K24J44k0j61K93j43
$$ 145 24 7 -14 60 91 51 -197 -173 -13 -166 73 17 -185 459 -161 -452 -224 0 144 124 -37 256 113
3534A13l28J18Nk76M04l05K46K03k10O8n5J38j78K52j6l52p0M88m83L74q5j04
$$ 113 -215 -97 -92 -368 36 -269 -23 180 -30 38 -17 121 -57 195 179 -173 -243 245 -238 136 51 -53
3556e3J93j53q7J90J54l85K78n5J25l34R8j84M91l50J51j6O0l8j52J12O4j03r4
$$ -53 140 -13 -100 90 244 -141 137 82 207 -127 -29 -213 278 -72 79 63 123 85 -67 45 109 6 -88
3579h8K03j92K39j60M3Rj16K08j34J20k80L83k24k16K66m37L34J51k93M06j66
$$ -88 115 -77 162 2 45 54 -62 146 12 132 -148 235 11 -205 61 -376 -42 109 -184 222 56
3600E6p0O0k19L40j94k24J23L54l23J07j72l9p2L71j2m8J16j18j43K03n12M65
$$ 56 -14 46 -173 167 -27 -251 -128 226 -97 10 -162 -201 -273 98 86 38 154 36 -107 96 -416 49
3622D9J53k41j60L67j60nJj23Q1p7j03l3J17J80o4j41J49J76j0j19k32J50J00
$$ 49 202 -39 -199 168 8 3 4 -119 -38 -115 -218 -251 -134 46 -18 -159 -10 166 156 37 -195 -45 55
3645E5j57L06o15K66Q9J66J50k3k65J23K0n3j09j82p8L87k60K65M8m9k59K19J16
$$ 55 -102 204 -411 -145 -56 110 260 237 -28 95 115 62 -47 -229 -307 80 -180 85 133 84 -175 44 160
3668A60l73J67o2J79j54mj15K98L5k32L12j87J12p4j93L5M4lj28L76l93K68j06
$$ 160 -213 -46 -108 71 -83 -87 -202 96 131 -101 211 24 136 62 -131 -96 -52 -55 -183 193 -200 68 -38
3691c8j99L38n2J47l78P1L88j59rq%j46r3J32j06K03O0j36N5o9o8j20J11n2J39
$$ -38 -237 101 49 196 -182 -111 277 118 109 101 101 -45 -138 -6 -112 91 151 15 70 1 -67 -187 -76 -128 11
3716A1P8j19l9J86k45J62j99Q7J62R5r2j15K33j69J40j98R8j55K2j84J41J19l22
$$ 11 89 -30 -69 117 -128 34 -165 -78 84 179 87 -28 205 36 176 -22 76 -79 -57 -241 -100 19 -303
3739c03K07m0K20j89j36L54k25L1J3K28k05p6K48k09M8o2L0M7K00j76k13O7L4
$$ -303 -96 -136 84 -105 -241 113 -112 -81 -68 160 -45 -121 127 -82 -34 -96 -66 -19 181 5 -208 -141 -107
3762a07K60j6Nk43J66j27M8j97J80M8m5j20L32j36J09j39K7or9L49l76K62j41
$$ -107 153 137 142 -101 65 -62 -14 -211 -31 17 -28 -148 184 48 157 18 45 39 -60 289 -87 175 34
3785C4K82m99N51l36Q4k07J52o5o7J36pNj40K68k06J95l08K90j59q9J49Q4k46
$$ 34 316 -183 368 32 116 -91 61 -4 -71 65 58 63 -77 191 -15 180 -128 162 3 -86 63 147 -99
3808i9K22qk28n3J15q9Q4K71l25RK60k83O2K70J15k17k77n8M01k66P2l2%J23l49
$$ -99 123 115 -113 -166 -51 -140 -56 215 -110 -101 159 -124 -62 208 323 106 -171 -229 172 -94 -22 -54 -54 69 -280
3833b80N22l65J41Kk45J80q1K61J32k97K36k29J33n3j79P2L55l68O0J37j60M6
$$ -280 242 -123 18 20 -225 -45 -126 135 267 -30 206 -23 110 57 -122 -50 305 -63 -3 134 -26 20
3855B0J19p8j08p9J49q1J18J22o0r7K41j25j61J57j62K33j36j07K8J41q5l6K4
$$ 20 139 61 -47 -126 23 -58 60 182 122 25 266 141 -20 137 -25 208 72 -35 -7 134 49 13 37
3878C7j66K29m2n0ml4J09K8j28jl4J7J03p2k57L91j50p4J1K71P9m89L5J26j22
$$ 37 -129 100 58 8 4 -30 79 107 -21 -22 -56 -39 64 -8 -265 126 -24 -98 -87 184 263 -226 -191 -65 -187
3903a87n4J72k4J11R7k18J46r5k21J94l8J33k7R1mj69J16j07j59J10J84J4m0j64
$$ -187 -241 -69 -93 18 115 -103 43 -52 -273 -79 -117 16 -11 80 76 -93 23 -84 -243 -133 51 65 25 -139
3927a39K19J1j64j70J36J89K6K67k02j85k1M9P1j2m9L87n51K3J25j09K48l60K98
$$ -139 80 91 -73 -243 -107 82 108 375 173 -12 -33 16 87 75 26 413 -138 -115 10 -99 149 -211 87
3950H7j19J40nK33r8l46J27j37J55j21J2o5O1r6J78j9N8Q8m4lr4p4j65K52K77
$$ 87 -32 108 103 336 238 -108 19 -118 37 -84 -72 -137 -76 -172 6 -13 45 133 89 86 -8 -82 -247 5 282
3975B82j51j1j69L38m57K71j17j59k7J63l9J49j30J2RJ79m21R8J62M1J07p4J8
$$ 282 131 120 -49 289 -168 103 -14 -173 -200 -37 -76 73 -57 -45 -36 143 -278 -180 -18 23 130 56 74
3998G4J51k04Jp7J04k3r3P0j75l1O29m30j09M55m42k89J78J81N5r4K48j57R3k7
$$ 74 225 21 22 -55 49 26 -67 3 -172 -203 426 -4 -113 342 -100 -389 -211 -30 25 -69 179 22 115 88
4022H8p5jj14J05n9m5j7m9K91j21J5r8J01M4j83K66j72Q5J21k24J40l0j49J97
$$ 88 13 12 -102 3 -56 -101 -118 -167 124 3 18 -80 21 65 -118 148 -24 61 182 -42 98 68 -81 116
4046A16j97K19k16L5O3k7J3j64J15q1l25K98J0L34p7R2k51qj17J62l1J02J5O8
$$ 116 -81 138 -78 -43 20 -7 6 -158 -43 -124 -449 -151 -141 193 116 208 -43 -51 -168 -6 -37 65 80 148
4070A48k95K35j19k8L4K29J21l48O8j59J64L8q4R6k73K23J29oj17K03l77j06M50
$$ 148 -147 88 -31 -59 -25 204 325 -23 45 -114 50 88 4 100 -173 50 179 173 56 259 -118 -224 226
4093B26n18K27J58J60j18p2j00k44J24L32j19Q5n5k8K9q0K03j93L2j72J17l1Q9
$$ 226 -292 -65 93 253 135 63 -37 -281 -157 175 56 141 86 58 87 7 210 17 49 -123 -6 -37 52
4116E2J32j2k45J02J64o6j60P9p2n5M3J08j8j58%R2J14k59J74M4j8Q8l94J42M20
$$ 52 184 172 -73 29 193 127 -33 46 -26 -81 -38 70 52 -106 -106 -14 100 -159 15 59 41 129 -265 -123 297
4141B97l65OR9l37O91k43l86J44l49Q88j98k63J72j76K5k1n3N5m8K32m22L22j20
$$ 297 -68 -62 37 -300 391 148 -238 -94 -443 445 247 -16 156 -20 5 -16 -69 -14 -62 170 -252 70 -50
4164e0J6J48j20l68K41j9r2L14l1m8m2N0j09J35j74M86k91Q1J51j88n7p2K05j39
$$ -50 -34 114 -6 -374 -133 -152 -244 70 39 -9 -51 -1 -110 25 -149 337 46 127 278 90 33 -39 166 27
4188B7o3M3P2j52J68j52K79j39j50J51j22J90r6lq1Q7O5k58k9J03J93j59N6k6
$$ 27 -36 7 79 -73 95 -57 222 83 -67 84 -38 152 56 53 -28 59 124 -134 -163 -60 133 -26 30 4
4212DMQ3N6r5q4K30j33Q0j59J05k51K70M7k78J35J42j46O6p4L22k07j85j47R2
$$ 4 8 91 147 52 -32 198 65 145 -14 91 -160 110 157 -121 14 156 10 76 2 324 117 -68 -215 -123
4236a23J06j29J11K98l22m00L77J88J63j80J44j73k25K55l43L66Q7q9l54P5L01
$$ -123 -17 -146 -35 263 -59 -459 -82 106 269 89 233 60 -165 90 -253 113 200 111 -243 -168 133
4257A33k44n9M0J72o4L5Q9j07k6M3K4M9l10J68K71j23N7j47n2K20k85L04j85J3
$$ 133 -111 -170 -130 42 -22 13 102 -5 -31 12 36 85 -225 -57 214 91 148 1 -51 169 -116 188 3 16
4281A6R9j33k08L8L4L4P3j32J64j02m8K9L5k06K30K3n9l5K60K5J2p8J11k06l6
$$ 16 115 -18 -226 -188 -154 -120 -47 -179 -15 -117 -165 -136 -101 -307 -77 -54 -113 -148 112 137 149 71 182 -24 -60
4306f0O0p3K5J1L7Nm3K71l63K21k07K22k19L3L9K40l20K30n7o2k12K27l5k23K16
$$ -60 0 -73 -48 -37 0 5 -38 233 -130 91 -116 106 -113 -80 -41 199 -121 109 52 -10 -222 5 -30 -253 -37
4331c7j68J66Nk06J13j6J72j4Q4l2QK86m77J74j53R9j35J29k61L11o3m1L35k86
$$ -37 -205 -39 -34 -240 -127 -143 29 15 99 67 75 361 -116 58 -95 4 -131 -2 -263 48 -15 -56 279 -7
4355go7J45p2k03M15k74J31j32R5J99j47q2j98J03r2L89q7J6r7j25J68J0j88m5
$$ -7 -74 71 -1 -204 211 -63 68 -64 31 230 83 1 -197 -94 -186 203 116 132 35 -90 78 88 -100 -145
4379a45K55k42K43j70J7k53K72J8j33L0O8J27mo6j18pJ72O6j0m29M07r4j82J21
$$ -145 110 -132 111 -59 -42 -295 -23 -5 -138 -108 -40 87 83 17 -101 -108 64 130 120 -309 98 4 -178 -57
4403e7K5J00K13k51j1m7r3P4j11J87Q1Kj26J09j73RK12r8k71K2L0J72n3m3K77
$$ -57 -32 68 281 30 19 -28 -121 -47 -158 29 110 112 -14 95 -78 -69 143 45 -226 -204 -174 -2 -55 -98 179
4428A79k24q9j9O8Rk85K19L99r0k62K7mL19j72P0m6Pj02Rj15n3n5L36pQ9l41J26
$$ 179 -45 -134 -153 -85 -76 -361 -142 257 167 -95 -68 -72 247 75 145 99 106 4 13 -102 -155 -210 126 119 208 -133 -7
4455gK19J43l44J09Q8mk34n9L22m8j52kk38L01k38P8J43k8q8L71l59p3K08j33
$$ -7 212 355 11 120 208 204 -30 -89 233 185 33 31 -207 94 -144 -66 77 49 -39 332 -27 -100 108 -25
4479b5k68L32J44k94J93M6m3l47L03j8K20q0j28J2K7o0N4l4j70R1J21r5l24N03
$$ -25 -293 39 183 -111 82 128 85 -262 41 23 243 163 35 47 74 14 68 34 -136 -45 76 -19 -343 160
4503A60M1q3k34K80l70J34K13r5Q9n2j56O2k12J45J66M5n4k11K69J04m33Q4K37
$$ 160 201 118 -116 164 -206 -72 141 46 135 83 -73 -11 -223 -78 88 133 79 -132 137 241 -192 -108 129
4526A29j57MQ6J5k19J08J03J1k91J27K68l39L21j78p1O6j51K82n9O8j98J31J49
$$ 129 -28 -24 62 77 -142 -34 69 80 -211 -84 184 -155 166 -12 -83 -17 -168 114 55 123 -75 56 205
4549B05j25nK07k10R5j28J1j48K59j44O9j88J54M6r7j94K80j18j9j84O26n59K30
$$ 205 80 75 282 72 167 39 50 -98 161 17 86 -102 52 98 1 -193 87 -31 -50 -234 392 -167 63
4572F3j18K38m0k23M4j15L13J8k96K54k08L2K32j66k84L72jjr2J94j47m6j69J01
$$ 63 -55 183 143 -80 -36 -151 162 180 -116 138 -70 -38 194 28 -256 116 115 114 22 216 69 23 -146 -45
4596d5J13l0p7L0n3J50J65k91r9J85p1q5o1R3n9K55M3j60K0%j21Q4j16J07P2m3
$$ -45 68 38 -39 -9 -62 88 253 -38 -137 48 -23 -108 -169 -76 -135 120 163 3 23 23 -98 -14 -130 -23 49 6
4622Fj4O2M1l43J48K62k25J07K28k77j11O2R4p5M2N3l8Qk04J87J94l69L32l58
$$ 6 -8 54 95 -248 -100 162 -63 44 272 -5 -116 -54 40 -35 7 60 22 30 -174 13 207 -162 170 -188
4646a88L40l47K4Q1J91Lj76K79r2M9N2k74m7J33K36j97j59Nn2K35o5j48L3Q9l7
$$ -188 152 -195 -171 -90 101 104 -72 207 115 164 216 -58 -105 28 264 67 -92 -87 -139 96 31 -117 -84 5 -32
4671c2J11l69J94K38k16J26l25J76J6J38j70P6L37l54k0k40P9K85J22k98K28n5
$$ -32 79 -290 -96 142 -74 52 -273 -97 -81 57 -113 -37 300 -54 -74 -314 -235 50 172 -126 102 47
4693D7l68L41J06k4j10l14O30l16m7J40j80L8j18J36Q9l02K43P3j17K31k15M27
$$ 47 -321 20 126 102 -8 -322 308 -8 -55 85 -95 -57 -175 -39 50 -252 -9 64 -53 178 -37 390
4715C90j64j30n1J29K8k06j6M4k6N5l61J78J66m2J54m9k28K05k35L58k02J02l57
$$ 390 226 96 45 174 202 -4 -20 24 -2 53 -308 -130 36 -6 148 99 -129 76 -159 199 -3 99 -258
4738b58L41L7o0kj12L78m05R9q4L1J44j85K27q7N7k5k44K44j52PJ46j50k71K46
$$ -258 83 120 60 58 -54 324 -81 18 -66 -35 109 -76 151 64 121 96 -148 96 -56 -49 97 -53 -324 -78
4762g8J51M7Lj65l4kP6j11mJ54q8J01l6k08J90J74p7k36J85L67k04k23J06J08
$$ -78 73 120 123 -42 -76 -78 -2 -113 -117 37 -51 50 14 -194 -4 170 93 -143 42 409 205 -18 88 196
4786A96m90N02k70k08L93j54k08K00L5O4j3J56MM0n38K29R6J48m13M14j57J34
$$ 196 -294 208 -62 -270 123 -31 -239 -39 -4 60 47 203 207 247 -291 -62 34 182 -231 183 26 160
4808A60k04n8J43J43k09R4mK4J64k22J74k86J86n7j2M3J46j60m8Kr5N7J92l24
$$ 160 -44 -102 41 184 -25 69 65 89 253 31 205 -81 105 48 36 79 225 65 17 19 -76 -19 173 -151
4832a51Q7J36o6o1K55j22r1J78P0l36M6J46m59L99jj66J69j39L24l26%J27Ln3
$$ -151 -64 72 6 -55 200 78 -13 165 235 -101 -55 91 -368 31 30 -136 33 -106 218 -108 -108 19 22 -31
4856c1J17k7p5j19K02k49R1R6o1J25j32J2L94l35j47J07m4j32K57m8j21J60m7
$$ -31 86 59 -16 -135 67 -182 -91 5 -56 69 -63 -51 343 8 -139 -32 -76 -208 49 1 -120 40 -7
4879gKN2j79J44O3M9m2p6l0n2q0L41l02L27k26K14k68K52j90q0l7j05M19j32K83
$$ -7 -5 47 -132 12 75 124 82 6 -24 -76 -156 185 -117 210 -16 198 -70 182 -8 -88 -125 -230 189 57 340
4904C40m42J1J22Rj29J30J26k34j12O7l7L61p2j77L3q1K62k67Rj87M52k17q3N3
$$ 340 -102 -91 31 40 -89 41 167 -67 -179 -112 -149 212 140 -37 -4 -85 177 -90 -81 -268 184 -33 -116 -63
4928f3m7L05N5j08j95o7K57k22K24l26M36k72J52N0k01N3k6J88j89k11P2R2J15
$$ -63 -110 195 250 142 -53 -120 137 -85 139 -187 249 -23 129 179 -22 31 5 193 4 -207 -135 -43 72
4951G2Jk0k38J36k1p4K25J84k56j38L14k18J47k33Q9K50m04M01j44j15L3J31l05
$$ 72 73 53 -185 -49 -70 -144 81 265 9 -129 185 -33 114 -119 -30 220 -184 217 73 -42 -9 122 -183
4974a83K0J9L78j8j24j45k32L25l10M24k11j43L18j17M06k81j86m7J52L8j73J
$$ -183 -163 -144 234 216 92 -53 -285 40 -270 154 -57 -200 118 1 407 126 -60 -107 45 83 -90 -89
4996h9p8J46oN9j74K40P5k2kj77n2K9O1j17j9MJ7K84k89P3J15j32K6j42K62k23
$$ -89 -167 -21 -27 32 -142 98 173 151 149 -28 -80 -51 10 -107 -126 -122 -105 179 -110 -37 78 -54 -28 -170 92 -131
5022a31j50L68j97Q6M8j99K67o0p1L05k99K6J39L0m03K50Q7p2k97L17J07j19K3
$$ -131 -281 87 -110 -24 24 -175 92 32 -39 266 -33 -7 132 162 -241 9 96 24 -273 44 151 32 55
5045E5m2J3j11K43j4k04Q9k51j00L22J07o0M7k41J55P7q6R5o3k89L02K8k74K77
$$ 55 13 26 -85 158 144 -60 29 -222 -322 0 107 47 94 -147 8 85 -1 94 31 -258 44 72 -202 75
5069G5m7j7O3j78j09K85l9J9M7j66k0K23p0j45Mk29M47r8j06l8O3R1mJ33j31m1
$$ 75 28 11 74 -104 -213 72 33 52 99 -67 -87 136 66 -79 -75 -304 143 45 -61 -99 -36 55 51 184 53 12
5095A2j61L40j65j30K3q7L1J45q7j0O1R7Q7k33K53k96J16l0j93L2K38j63K00k67
$$ 12 -149 191 26 -104 -81 -168 -137 8 -79 -89 -28 69 156 -77 176 -120 -4 -34 -227 -195 43 -120 80 -187
5119a87K31k12N2r7K39J70k28oK03r3N7j92l0J71l88M45j15r3M27l29j57L09j23
$$ -187 44 -168 -116 -213 26 196 -32 -38 165 72 129 -63 -93 78 -310 135 20 -73 354 25 -132 177 54
5142E4K0p0qk97L22j08K66j57j01Q9j30J48m4n6k4J66L20m38q4o3l7K46O2K1M7
$$ 54 74 4 -4 -301 21 -87 179 22 -79 10 -120 28 -16 -72 -96 70 390 -48 -132 -195 -232 14 76 97 144
5167A44j30Q0j5o5N9j07j3k9J2K10j57N6l09K27Q8J63j04o6Q8j95j21j21K09n0
$$ 144 14 94 79 14 73 -34 -47 -76 -64 146 -11 45 -264 -37 51 214 110 44 132 -63 -184 -305 -96 -146
5191a46J4j90L84K01j37Q4j99N9pj16k0R0K46l67N9q9J30mJ26j90n9J24n3J29
$$ -146 -132 -322 62 263 126 210 11 70 63 -53 -73 17 263 -104 -45 -134 -4 -8 118 -72 -131 -7 -60 69
5215F9j4n9j14L30nk30j36J99r0K64M8j88J9R2k59J85k30j1R1M3mj0J40N5k11
$$ 69 55 -4 -118 212 207 -23 -159 40 -50 214 262 74 93 185 -74 111 -119 -130 -39 4 0 -10 130 185 -26
5240b6N6J11j08m7q4J76l0K15l69K09K9l14L27k08q4J34k30K72lk29L03k57J14
$$ -26 30 141 33 -14 -98 78 48 263 -106 103 132 -182 145 -63 -147 -13 -243 29 26 -203 100 -157 -43
5263d3K99l08p1K60j94K51j81J3O7j19p4j55L04j35J18j7J19j40J5n7J9k9l8K42
$$ -43 256 -52 -123 137 -57 194 13 26 93 -26 -100 -255 49 -86 32 15 134 -6 9 -48 -29 -58 -96 146
5287A46pl20J75J04qp9L9J2k38j10M01j41L51j06j48l7j53j00K04k21J37L63p1
$$ 146 139 -181 -6 98 90 11 50 62 -176 -286 115 -26 325 219 71 34 -119 -219 -15 -236 -99 264 193
5310A93k38j23K16Q1R3k69LO4k66K01J71r1m9j48r5N06k45j57K57l7R3%n3j68
$$ 193 -45 -168 48 129 222 -47 -44 20 -246 -45 126 35 -14 -162 -257 249 4 -153 104 67 160 160 107 -61
5334f1J43j59n8K76j67J88k72r5Q3K74r2K23l15O6o3J16k33J01q1M12k84N5L7
$$ -61 82 -77 -135 141 -26 162 -110 -205 -122 152 60 283 -32 34 -29 87 -146 -45 -126 286 2 57 94
5357I4k83J00K60r0j29l7J66R7k65O7j7q1J35O0l3r7j05p7M43k25r6J49r5R7j77
$$ 94 -189 -89 171 81 -48 -85 81 178 -87 -20 -37 -118 17 77 44 -53 -158 -235 208 -17 -113 36 -59 38 -139
5382a39K27J9k9p3J09l92K44J9N5O9k46j59K68j14K79K5j62n2N0m8M0P5n9J76
$$ -139 88 107 78 5 114 -278 -34 -15 40 109 -137 -296 -28 -142 137 162 0 -52 -2 -50 -10 65 6 182
5406A82l53J82J98l07L26k23M1j4K9m3J71k20K8j33q3J83K08k36L51l28J93k43
$$ 182 -171 11 209 -98 228 5 46 32 61 18 189 -31 -3 -136 -219 -36 172 -64 287 -41 152 -91
5428i1r1J98m8l2N9m7J01p0j66L01j78j32P8j4J34J90N5l71k06K73j2J77J63k41
$$ -91 -182 16 -32 -64 -5 -52 49 -21 -187 114 -64 -196 -118 -132 2 192 247 -124 -330 -57 -69 108 271 30
5452C0j50J64lk87K10K9j25P4K63l60K53l73M47J16n63K05q2J49K51j55M2j26
$$ 30 -120 44 41 -246 -36 -7 -132 -58 205 -155 98 -275 172 288 -275 -70 -152 -3 248 93 135 9
5474Ij37J48j4j12j9R8J37l72K33MjMK21j12j24J60l41K57k49N8K00j68N6o7J64
$$ 9 -128 20 6 -106 -125 -27 110 -262 -29 -25 -26 -22 199 87 -37 123 -218 39 -210 -152 48 -120 -64 -131 33
5499C3PM7j32L5L91m25J90l07K15O5J59k93J15j56K08j10j89K14J11k52P8k4o6
$$ 33 40 87 -45 -10 381 -44 146 -161 54 119 278 -15 100 -56 152 42 -147 67 178 -74 4 -20 -86
5522h6J76j14K73l27J59j3j21j30K13l6PM8j31j00N6J03J70q7j70K42k11J94k30
$$ -86 90 -24 249 -78 81 68 -53 -183 30 -6 1 49 -82 -182 -126 -23 147 60 -110 132 -79 115 -115
5545a15l8J94o9o1L51j56j85J90lk40K25J12j42j63J43R5k19J04n9n8J18j46p9
$$ -115 -153 41 -28 -89 262 106 -79 111 108 -132 93 205 63 -100 43 138 -81 23 -36 -94 24 -122 -201
5568b01L10j13J90j58L2R9k2m07K89l29P5L01k21L7K53k13L05j72j97L36k73K41
$$ -201 109 -4 186 28 60 159 137 -270 19 -310 -235 66 -155 -118 135 -78 227 55 -142 194 -79 162
5590A62l26K42mm16K62J28q8l0M10p4l28N5j88L1K19k5N6N8m12L57J07m29K02
$$ 162 -164 78 74 -342 -80 48 -40 -70 340 266 -62 -7 -195 -164 55 30 86 144 -268 89 196 -233 -31
5613c1j37L14k38J60r0r9K38j46K88j11j78j5l05k5J76J66q9Q5J04k3K1j97K31
$$ -31 -168 146 -92 68 -22 -121 117 -29 259 148 -30 -45 -350 -375 -199 -33 -122 -37 67 44 65 -132 99
5636I9j21j18K78k87M3o0L33j06L2O8k7j05k63L54n7R1j27kP7q7l91L81l6J32
$$ 99 -22 -140 138 -149 -106 -166 167 61 93 161 134 29 -234 120 63 154 27 25 102 15 -376 5 -31 101
5660A01k9j84K93k00JL7K41j48j99J48M7L6k41K70j5P3l23J60j47m5j81M25j44
$$ 101 72 -112 181 -19 -18 19 260 112 -87 61 108 144 -97 173 158 231 -92 68 -79 -124 -305 120 -24
5683b4q6L00k11m6Q0J1k1N7j73J90N3j94k37J63k2K33j29O7r2q8O2L19k50l2j40
$$ -24 -110 190 -21 -67 13 24 3 60 -113 77 130 -64 -301 -138 -160 73 -56 11 -81 -169 -107 212 -38 -70 -210
5708b10L61k35l6K6M21k44j26J52k24LN3j53K28J01j37j15J33J6O9j16k49J33
$$ -210 151 -84 -120 -94 327 83 -43 109 -115 -112 -59 -212 16 117 -20 -135 -2 14 83 -33 -282 -149
5730a49O6J53k24J37K41ol59K89j40KM0L1O2m35K19K40j23J7M1k01J25J96o0j12
$$ -149 -83 70 -154 -17 224 218 -141 148 8 10 50 81 143 -292 -73 167 44 61 102 -99 26 222 162 50
5754E0k2K4J9j56P8N7R1q6q3o2r2M30k90j91Q2p4K75R0r7K12k21J3o8k80L74m3
$$ 50 28 52 71 -85 -7 50 141 55 -28 -90 -182 248 -42 -233 -151 -225 50 140 43 255 34 47 -21 -301 73 30
5780C0K8j40J52p5P6k24O9mN7n1M66m51lL76m55K00op5m39L03J84j51K53j85J15
$$ 30 58 -82 70 -5 71 -153 -84 -88 -31 -82 384 -67 -70 306 -149 51 45 -30 -469 -166 18 -133 120 -65 50
5805E0k01j67J76M37j29l21Q9J16j64K67k38P9J70k90M8j00J25m2J60k9Lk7j43
$$ 50 -151 -318 -142 295 166 -155 -66 50 -114 153 -85 -6 164 -126 -78 -178 -53 -95 65 36 39 12 -131
5828a31L21j1m11J34L38k21N0m7K0m7j19K9K10j83J94j12k23J2K74N2j60r6M4
$$ -131 190 179 -232 -98 240 19 69 22 42 -5 -124 -95 115 -68 126 14 -209 -197 77 129 -31 -127 -83
5851h3o1r8K70j09M00n02K4L40l06L76k67J23N2j60O2Qj13n8J18J62k49O4L5k9
$$ -83 -144 -242 28 -81 319 -183 -159 181 -125 251 -16 107 159 -1 61 69 -44 -102 16 178 -71 -7 28 -1
5875aL3J36L8l01L0J96j19J89k33M3K10J6m17J79J17k76n4J58J81p9k33o1J87
$$ -1 32 168 206 -95 -65 131 12 201 -32 11 221 237 -180 -1 116 -160 -214 -56 125 46 -187 -248 -61
5898f1J19j20Qm4n0j9n3K14J68o3q7M0j3K01j77k9J2M30n87k88N69l82N9Nq2K46
$$ -61 58 -62 -54 -98 -148 -167 -220 -6 162 99 12 52 39 240 63 34 46 476 -111 -399 170 -212 -153 -148 -230 16
5924A6k54L60l14K88J75p8k34K59j88j85m0ok3L02j68j9K07N4k13J16j31p3K28
$$ 16 -238 122 -192 96 271 193 -41 218 30 -155 -195 -201 -224 78 -90 -109 98 152 -61 55 -76 -149 79
5947G9k05j74Q6L82l16J57J81l08J30k11K06p1P8kl19K46J5J34K0R7l70O8k0M9
$$ 79 -126 -300 -214 168 -148 9 190 -118 12 -199 7 -64 14 12 -307 -61 -46 88 108 205 -165 -97 -117 -68
5971f8O1N4j6J83k45J91j0j61N9q6J18r0Lj8r4o0J4j17L27l75K89l8N6k17J06
$$ -68 -7 47 31 214 -31 160 150 -11 48 -38 80 -10 -7 -25 -119 -179 -165 -282 45 -330 -41 -79 -23 -240 -134
5996a34j45M36n24J29K23J08j4k22m1l4Q4K23j14L9l01n2N1K52N4k37K16oJ12
$$ -134 -279 157 -367 -238 -15 93 79 -143 -184 -218 -134 89 -25 14 -287 -339 -288 -36 18 -219 -3 -9 103
6019A03j14R7k79M1M24k18M2j02J00r4j38j13N79m26K89J1j14M1k13K18k53M9
$$ 103 -11 86 -193 -152 272 54 96 -6 94 0 -138 -251 328 -98 191 202 88 129 -84 134 -119 -70
6041g0j41Q7J98l9l3j60m6j00J34L05k01J72j82K24J25l52q4j3J99r7J02k37j21
$$ -70 -211 -124 74 35 2 -158 -204 -304 -170 135 -66 106 -76 148 273 -79 -163 -176 23 -74 28 -209 -330
6064c30M70l69K00j26N13j58j41J31j65P6j55o6K16j23P6K07l24q9K42lj98J29
$$ -330 140 -229 -29 -155 358 200 59 190 25 101 -54 -120 96 -27 49 256 -68 -157 85 82 -116 13
6086A3k12M04j28o3RJ37j71j34K11j59J37q6R3j35N8j18N1Q5J62j0p9R5j99j27
$$ 13 -199 205 77 14 23 160 -11 -145 66 -93 44 -42 51 -84 -26 -144 -93 -8 154 144 65 160 -39 -166
6110a66Q6r3L90k54l7j14L04j04K20l03P3J00j86K8k3L58j08j46j77J83n7j34
$$ -166 -80 -173 217 -37 -74 -188 116 12 232 -71 2 102 -84 -56 -79 279 171 25 -152 31 -26 -160
6132a60J23J57j69J26j93P2J64m9p1N5m7l12O44m29K44k02P8P1l41J37P2q2M8
$$ -160 -37 120 -49 77 -116 -44 120 71 0 55 8 -304 340 -89 155 -47 31 102 -239 -102 -30 -112 -64
6155f4k2K29j9n6j04K88l46M4l73K87J6N0k80N39j61m0op2J61k96L4K80j56o0
$$ -64 -86 143 124 68 -36 252 -94 -50 -423 -136 -120 -70 -350 189 28 -12 -18 -90 71 -225 -191 89 -67 -127
6179a27j67Q8L00l11J97k2k5o5L23l52K34J02j73K08j86J34K3k21n1J60j33L42
$$ -127 -294 -206 94 -217 -20 -42 -67 -132 191 -161 73 175 2 210 24 158 181 -40 -91 69 -64 278
6201B78k29K3k76J33J47k54L87q1r3O8Q0j46Po2J25k13p6L18j67L1j42M3L23k14
$$ 278 49 72 -204 -71 76 -178 209 128 35 103 183 37 44 -18 107 -106 -182 136 -31 0 -142 -99 224 10
6225A0j23K27Pm36L37J30P7j31r3J38j1m19L14m8P5r6L7J20OK7k10l5J60K4l6
$$ 10 -113 114 121 -315 22 152 229 98 5 143 132 -287 27 -21 54 -42 -5 115 121 148 -62 -97 63 87 51
6250E1q3mM0K72m82J08L9J12n9j49J26K6M7k20K57J78k52j65J79l9K21l96J13
$$ 51 -32 -36 4 276 -206 -98 -59 53 -6 -155 -29 -3 44 -176 81 259 7 -158 21 -18 203 -193 -80
6273h0L7J41p2j57L01l6p6j76J18O8k09J66p7Rm6K66j87j44J78M6k39K09l5Q9
$$ -80 -43 98 26 -131 170 134 58 -118 0 68 -141 25 -52 -43 -89 177 -10 -154 24 70 -169 40 5 94
6297I4j17J7K19J4P5l18Mj00n1J91p7K64j47l14M77j46q9K8q6j05P0L44k91K54
$$ 94 -23 -6 213 227 302 -16 -12 -112 -163 28 -49 215 68 -246 231 85 -4 24 -62 -167 -97 247 -44 210
6321B10k51K76l47K30l4j70J42j77J35J0j63K62k16P9j7On%kj39L2Q0O7J88J57
$$ 210 -41 235 -112 118 84 -86 56 -121 14 24 -139 123 -93 -14 -31 -25 -30 -30 -32 -171 -139 -59 8 196 353
6346C53l05j83J17l21L27J1K80k83m6j49M37k15M5n2p3q9J60J74k99J21J08j74
$$ 353 48 -135 -18 -339 -12 -1 279 -4 -50 -199 238 23 68 16 -57 -146 14 188 -111 10 118 -56
6368e6J15j49j74K29J60k08L2K81k08K46k54K8k53R1J03J19J75k92L2J73j94o
$$ -56 59 -90 -264 -35 125 -83 -51 230 22 268 14 42 -211 -120 -17 102 277 -15 17 190 -4 -10
6390a0q4j2L79j01M1k80J4K6J18l55K57P7j91K91K93m62o4K15j48J18j77q0K66
$$ -10 -94 -106 273 172 213 -67 -53 -27 91 -264 -7 70 -121 170 463 1 -63 152 4 122 -55 -135 131
6413A31j08J54J04k46N2qj56k8K91k49J22J3j5k5J02l10O9K37Jj24m0o8K48j28
$$ 131 23 177 281 35 87 79 -77 -105 186 -63 59 72 57 32 134 -176 -107 130 131 7 -33 -101 147 19
6437A9m52L32p9K96K3k48L2M66l86L00m27K59J49k94j80J22L7j24M37n06K96j36
$$ 19 -433 -101 -180 116 139 -109 -77 389 3 303 -124 135 284 -10 -190 -68 -31 -155 282 -224 72 -64
6459f4R9J2j3j20R1k4o6K18k75k7K65k16J64m3n8K99j79n0k03J82K60j97J57k82
$$ -64 35 47 34 -86 5 -19 -85 133 -142 -169 96 -120 44 1 -57 242 63 13 -190 -8 252 55 212 -70
6483g0r5L52K21m82J36n1l34L18RkJ34k40N11m86J04j42K11k51M09Q0k23j85k47
$$ -70 -165 187 408 -74 62 11 -323 -5 4 2 136 -104 407 -79 25 -117 94 -157 252 332 109 -76 -323
6506c23M01o4N3n1J17j57Q9j19j8J35r0R1j07r3j1J19nJ51Rk11J77j12Q3l04J63
$$ -323 78 14 67 16 133 -24 65 -54 -72 63 -27 64 -43 -136 -147 -28 -33 118 127 -84 93 -19 64 -240 -77
6531g7K16k48J53J78k90J17J23k25P7K21j59kk33L14j73J36Q4j23K3k06J88j3
$$ -77 139 -109 44 222 -68 49 172 -53 24 245 86 84 -149 165 -8 128 212 89 112 -94 94 81
6553H1j42K88o6j34O0j54L7j06K3K6J9j65J47J70L7j30j17j5J40o2n1K03j6r3
$$ 81 -61 227 161 27 87 -67 -30 -136 -113 -87 -68 -233 -86 84 121 -9 -126 -141 -1 -63 -114 89 73 -20
6577b0j06K19j09Ol9R0l8k7O7k02R3j27J40M9L34k54R3k96J69K82m07J3j0l1n
$$ -20 -126 93 -16 -10 -49 41 3 -24 43 -159 -66 -193 -53 -4 330 76 169 -127 42 324 -83 -70 -80 -111 -116
6602a16J40o0K60n02J48l06N91p8j28J89k99L69j55k6R7J34p7j05n8N9k45K10
$$ -116 24 -36 224 -278 -130 -436 155 77 -51 138 -161 208 53 27 124 258 181 76 18 77 -168 42
6624D2J02j88L04l20L7N0J02O0j5j10N9k88K9J67o8k73L95J14l03Jq7J00r2N8
$$ 42 144 -44 260 -60 -23 27 129 189 174 64 123 -165 -136 31 -37 -310 85 199 -104 -103 -190 -90 -182 -124
6648a24K40qQ1k46J73q7j09R9q8K14k6m44M06m2j88Q9K63l46L10l36J47J2K53
$$ -124 116 108 189 -57 116 29 -80 19 -69 145 119 -325 81 39 -149 -60 203 -143 167 -169 -22 -10 243
6671B43j22%l39K03J04N7k00r7qp7L86j55j42J86m3K15r2m3J04k67L5J9m9J39
$$ 243 121 121 -218 -15 89 146 -54 -151 -159 -236 150 -5 -147 39 -4 211 119 76 180 -87 -52 -33 -82 57
6695E7j74L49O3m59L22j01j09J27k18J87K81m25K69k56Q5j2o1k35M62j69j83M62
$$ 57 -117 232 295 -164 158 57 -52 75 -143 44 325 -100 169 -87 -2 -14 -75 -310 152 -17 -200 262
6717B62l37j07JJ53K7o4n7J62l5jJ59P0k34j63L70l75M61j83j36k53j03L18j31
$$ 262 -75 -182 -181 -28 -1 -65 -122 40 5 4 163 233 -1 -164 206 -169 292 109 -27 -280 -383 -65 -196
6740a96M67k98j70J21R3j41J84j30J45k0MJ17j62R6q2j56J46o1q4k19M82r3j23
$$ -196 271 -27 -197 -76 17 -124 60 -70 75 55 59 176 14 110 28 -128 18 -43 -127 -346 136 43 -80
6763h0K01k70Q3L47l99J42k1j6J11l1K51o04K99j86K49Ok08K5J88J5J4q2j41j36
$$ -80 121 -149 -66 281 -118 24 3 -13 98 67 318 -286 13 -173 76 82 -126 -101 87 102 116 34 -107 -243
6787b43J80L8J20k78K25k48K21K78k90N0o2o8R7k32L11j41n4J8j97L48J99k80
$$ -243 -63 -25 95 -183 42 -206 15 293 3 53 -9 -77 20 -212 99 -42 -96 -78 -275 73 272 -8
6809ho6J62j12J35o5j4j84K62l14J43j14pK1J31K72k29L3K4KJ08k31l0K32k07
$$ -8 -74 88 -24 111 46 32 -152 110 -204 -61 -175 -182 -161 -30 242 13 46 70 72 180 -51 -81 151 -56
6833e6o3L46j56j92J55m7j48K07K1j27j46O34m52P1q0k5k13L5K07J08L6k34k1
$$ -56 -119 227 71 -121 34 -13 -161 46 67 -60 -206 428 -24 47 -33 -58 -271 -236 -29 79 115 -119 -140
6856a40J27j22M49j41j35N2k3j63L49j27M8k43j95J46K84J53k81J16m59L53j66
$$ -140 -13 -135 314 173 38 90 67 -96 253 126 174 -69 -264 -118 166 319 38 154 -305 48 -118
6877a18n2L18J46l96R7K39k32p9J36j13J69O5k77J67k40M08l90K09J1r4j45R0
$$ -118 -170 148 294 -102 -5 234 2 -77 59 -54 115 180 -97 70 -170 238 -152 57 68 -26 -171 -81
6899h1K7K59k33j72P8L29o0p9Om7j4K7k2R8n3kk03L25j91k64K22j8J76l7O4j86
$$ -81 -54 205 -28 -200 -122 207 147 68 74 27 13 40 18 116 63 61 -142 183 -8 -272 -50 -68 108 71 135 -51
6925e1m4J89k28K02r9PL36k95j75R5J99k9k22L22k41O5J4k10J99j65M26k67nM2
$$ -51 -95 94 -134 68 -31 -24 312 17 -158 -63 136 107 -115 207 -34 31 45 -165 34 -131 295 28 23 65
6949F5k54J98K30l03J56j90K99j45j97L19j2j37m62L24l3K74k39K01q2j31p3J46
$$ 65 -189 9 239 -64 92 -98 201 56 -141 178 166 29 -433 -109 -142 132 -107 94 12 -119 -192 -46
6971d6J7Q5oQ3P0m42L26j41l5J18o0L01m31J31P2J05O4j89J72k7k51J16J03j67
$$ -46 -29 56 50 133 203 -239 87 -54 -89 29 -31 270 -161 -30 42 147 211 22 194 167 -84 32 135 -32
6995c2r4Q5J08J38l43Q9J76q0R7k15L87k63k82M08r4j66L18P6l61k19M10L3N3
$$ -32 -126 -41 67 205 -138 -49 127 47 144 -71 316 53 -229 179 85 -81 237 313 -48 -267 143 176 229
7018B29k79Q3r9Kp2R0k94M34l1l2j46j84L15q3O2L81l53k13M29l71k7J21n9J44
$$ 229 -50 33 -66 -64 -136 -46 -340 94 63 31 -115 -299 16 -67 -5 376 23 -190 239 -132 -159 -38 -97 47
7042D7K11o3l14K04n7J28j58j13L64l19j52R0K21j88O6J97l08J72j90J87j53R3
$$ 47 258 195 -119 85 28 156 -2 -115 249 -70 -222 -132 89 -99 -33 164 -144 28 -162 25 -128 -35
7064c5Ok8M7p0O0l9m7oJ21j09J64j96j61Q8L12j59K19j22j43Q7Jq1K43kk00J96
$$ -35 -29 -57 -10 -80 -20 -59 -106 -112 9 -100 64 -132 -293 -205 107 -52 167 45 -98 -11 -10 -91 152 150 -50 146
7090A46l49L17l2p1k07K94j25k13K18M5p3j99K67L5r8J79l75R3L15j73Q8n5m8
$$ 146 -203 114 82 11 -196 98 -27 -240 -22 23 -50 -249 18 53 -45 134 -241 -148 167 -6 82 27 -21
7113b1M8l5K44l71K78j54J76k38rK8K4k41K85O1k15K48j00R6K5l00L1j1J14l5
$$ -21 27 -8 236 -135 143 -11 165 -73 -82 -54 -30 -271 14 75 -140 108 8 104 129 -171 -140 -151 -37 -72
7137g2J92j15J22k12J52o6L6p5Q9j2J51o0m4p3j54qL45j21l8j93K31l07M11j55
$$ -72 120 5 127 -85 67 1 37 -38 51 39 190 130 86 13 -141 -149 196 75 37 -156 75 -232 179 24
7161B4l6J91j93j83J25K99p9j08J03m30K56%k8q9J64L24n11L8J80J59m07Q1q0
$$ 24 -12 179 -14 -197 -72 227 148 40 143 -287 -31 -31 -59 -148 16 340 -171 -133 47 206 -201 -120 -200
7184b00K85r4j61J41k9j16K61r8K88j02J36l55l2J13o5J29l22K06j15j35q1N61
$$ -200 85 -9 -170 -29 -58 -174 87 -11 277 175 311 -44 -76 37 -28 101 -221 -15 -130 -265 -346 215
7206B15Q7n52K63k1NO3j84K93j75L9J7j34j32K58j72m4R5j40L28O7k42K36j27
$$ 215 302 -250 13 -8 -3 60 -124 169 -6 33 50 -84 -216 42 -130 -174 -79 -219 109 176 -66 170 43
7229D3K12k6k17o8O4k7r9J77O6j53l0j95L57M6j57J42Ol10K1J88J16r1j14m0J78
$$ 43 255 229 12 -56 8 -19 -118 59 125 -28 -58 -253 104 150 -7 135 141 -169 -148 40 156 65 -49 -89 89
7254H9j68R6k8j10L32j70Q6Q8o4Q0k13j59O1K13j7k30L87m37R8P0N0k10M70k28
$$ 89 -79 17 -11 -121 211 41 127 215 151 231 18 -141 -80 133 116 -114 273 -164 -66 4 54 -156 314 86
7278H6k83Q0j0J92j9l9j04o2KL42l92J49K02L6j83p7J00J94q9m31M29k06J71k03
$$ 86 -197 -117 -127 65 46 7 -97 -159 -157 185 -207 -58 144 180 -3 -80 20 214 125 -306 123 -83 88 -115
7302a15N1LJ74j58o6kK82l53K12J53p3k48K8j06M7lK08R4k09N6N6K6P7j20k04
$$ -115 -64 -61 113 -45 -111 -113 169 -184 28 181 108 -140 -112 -218 -171 -174 34 128 -81 -25 31 57 134 14 -190
7327a90K42P8l22nJ51K11j39j05J33P2l28J0J63J30J63k26j85M9Q7r2J56j5Oj5
$$ -190 52 130 -192 -197 -46 165 26 -79 54 126 -202 -192 -29 101 264 38 -147 -98 -11 -103 53 38 44 29
7351B9O4K4k39o1o3L17J44r0k26K05k94K17J28k1j36N9p4J59j49J88o8J40j30
$$ 29 93 117 -122 -183 -246 71 215 125 -101 104 -190 27 155 134 -2 57 -17 142 -7 181 113 253 123
7374A23l69J18j22L32j37J55k06J71l7l64J5K84P8k4L5K19l48K08j44K2Q5l20
$$ 123 -246 -128 -250 82 -55 100 -106 65 28 -336 -321 -37 41 17 52 271 -77 131 -13 9 94 -226
7396b26L86j00j38J00P6p6pJ56k37J83j67J46l59L6L29K4L1l9j58J31J22j72N8
$$ -226 160 60 -78 22 98 22 15 171 -66 117 -50 96 -263 -227 102 126 157 118 -40 91 213 41 99
7419I9j52J33j6j81K2J65j08k06M0K87j40R4j37K62j56j32K04J45j31j70J53p7
$$ 99 -53 80 64 -117 -95 70 -38 -244 -204 83 -57 37 -100 162 6 -126 78 223 92 -78 75 -2
7441bj07J52J60j67p7r3J62l05K58M7J26k24J24r5J99k11K23j06q8J39M3o1j44
$$ -2 -109 43 203 36 -41 -134 28 -277 -19 28 154 -70 54 -41 158 -53 170 64 -24 115 158 97 -47
7464d7N0j07M30j26j91m7J49K3k98j7K92J26l87q4L52k11P0n8K37j86j36k17J93
$$ -47 3 -104 326 200 9 -38 111 134 -164 -181 111 237 -150 -234 118 -93 -23 -81 156 -30 -166 -383 -190
7487a90L46k3l34j7M64k16J9j96K29n2j78K54j87o2K13l5J24j4J40l35K55j86
$$ -190 156 133 -201 -218 246 30 49 -147 82 30 -148 106 -81 -143 70 35 159 145 285 -50 205 19
7509A9j96L47j53N1k52K61j38l9K11r8r6K19j80K17k92j89P7pK51J04L8l6m02
$$ 19 -177 170 17 68 -184 77 -61 -100 111 13 -83 136 -44 173 -119 -308 -231 -238 13 117 155 119 -283
7532b83J31L48m8l74K38K04l74mK40J90j94k50Q2K06j54k0K0K45q0k28L0J21J19
$$ -283 -152 196 148 -226 12 216 -158 -162 78 268 74 -176 -94 112 -42 -62 -42 203 123 -105 -75 46 165
7555A65j73Q5P2j49J71k26n0q1L29q7R5j85L9K45l97J34K23k21n1O9L7j97J06
$$ 165 -8 77 149 0 171 -55 -105 -186 143 56 151 -34 5 250 -147 -13 210 -11 -62 7 44 -153 -47
7578d7J30q9j40k9j41N60l32P8q2J98J8k98K98l86L99k41N34l60M4p3N2q7j95
$$ -47 83 -6 -146 -175 -316 244 -88 -10 -92 106 124 -174 124 -262 137 -104 430 70 114 41 93 6 -189
7601a89J40q1n3R2j3Q6l8k95J31J99J0J87l22L63J17L6m25P0J4K13r5k5j47J81
$$ -189 -49 -130 -183 -91 -104 -18 -56 -351 -220 -21 -11 176 -146 217 334 370 -55 15 29 242 147 122 -25 156
7625A56j56j4j9L7J5J38j31q8K04j12j12Q4ON1j9P4K2l04J6M1L26l27K91k02J54
$$ 156 0 -14 -33 4 19 157 26 -62 142 30 -82 2 8 59 40 114 136 -168 -152 -111 215 -112 179 -23 131
7650A31k14J75Q8j92m1q5J0J23m6JJ17K4l5j56K84Kj15OP8R5k98j15J21j23K54
$$ 131 -83 92 180 -12 -53 -138 -128 -5 -51 -50 67 91 56 -100 184 186 71 77 155 250 -48 -163 -42 -165 89
7675H9rL5l66K78k64J39P5o9N4O3K96l37j33J96Q6k62J35n4J72J25o07K74o8J65
$$ 89 80 115 -251 27 -237 -98 -23 -92 -38 25 321 -16 -149 47 133 -129 6 -48 124 249 -358 -84 -152 13
7699A3l9J40K54m50Q4k30K68K08k38j46K22M8j95K6q1K41jk78K88M9k44J4K7K33
$$ 13 -26 114 368 -82 2 -228 40 248 10 -136 86 134 -61 -35 -116 125 124 -154 134 183 -61 -47 -20 213
7723B13m8j37j91J22j56K34J47j54L2j31Q6n6K37k27J17j75RK25m11M48j15k49
$$ 213 165 28 -163 -41 -197 37 184 30 62 -69 17 -39 198 -29 88 -87 -78 147 -264 184 69 -180
7745a80L8O1j16J92J50Q6n9j59Q9j99j07P9j62K39J31j85M28k45P1r1j95J77o5
$$ -180 -142 -81 -197 -5 145 231 172 13 102 -97 -204 -125 -287 -48 83 -102 326 81 152 61 -134 43 -22
7768b2N3j7k01K48k60Q4L66j24k5l51L06O0m9Q7k29j46M37k51j03j03R5n6K57
$$ -22 31 14 -187 61 -199 -115 251 127 102 -249 57 117 68 155 -74 -220 217 -34 -137 -240 -145 -201 56
7791E6R0o8j62NN0M1K33l93M0J89L3j81K5j97L54k63K35k12j38J5J69K15j53L73
$$ 56 146 78 -84 -79 -29 12 245 -148 -108 81 114 -67 -42 -239 115 -148 87 -125 -263 -248 -79 136 -17 356
7815C56k56o0m1j37J65J64j05j50O7l69L74k20J09K9K16O9j06j1k39K97k73J62
$$ 356 100 40 -1 -138 27 191 86 -64 3 -366 8 -212 -103 -74 142 211 105 94 -145 152 -121 41
7837D1r7P6j93M18k53J16j05J6M1J22k00m10M50J03p7M2K4Q9m65K06M6K68l05
$$ 41 -56 20 -173 245 -8 108 3 19 60 182 -18 -428 22 125 48 90 114 203 -262 -56 -10 258 -47
7860d7J00m7m7K07K3k24j00K88%k20M8P2k9l93J88M5J18L0K9n4p0ml4J09rj37
$$ -47 53 6 -41 166 189 -35 -135 153 153 -67 -19 53 24 -369 -181 -136 -18 12 41 -13 -83 -87 -121 -12 -21 -158
7886a58J40K08n14L93J98m12N7JO6M0J67j52k31J42N3J46k89K53L2j12O1k23K22
$$ -158 -18 190 -324 69 267 -145 -88 -87 -21 19 186 34 -197 -55 -2 144 -145 108 140 28 89 -134 88
7909H8Lq5j79K7R6K70k77J0r4J57J76j74k02K34M0k20L05k71j6J40p6k0K49j78
$$ 88 91 6 -173 -146 -50 220 -57 -47 -141 16 192 18 -184 50 90 -130 175 -96 -112 28 -48 -68 181 3
7933CJ48J60j90l18J25Q9q9L1j03K45p7J27j66M2r6l1J11J51k11M7j62m7L13j77
$$ 3 151 311 121 -197 -72 17 -72 -41 -144 101 24 151 -15 27 -69 -100 11 162 -49 -2 -164 -211 102 -75
7957g5J21J69j60j65k0J60j53L10l04J65Q1K6j11P3J70l26j6k60J37Q6k18N26
$$ -75 46 215 55 -110 -130 30 -123 187 -117 48 129 155 44 117 287 -39 -55 -315 -178 -92 -310 216
7979B16m30K58K64n65J98J17K02l0l66K05j29J26j1n9K57m28K23o8k9K10j14R9
$$ 216 -214 44 308 -257 -59 58 260 230 -136 69 -60 66 55 -4 253 -175 48 -20 -49 161 47 146
8001A46j92o3K05j98K54k05o8Qk0m1K78j82M8r8K89J3j25Pj36O4j58j6o7K37j4
$$ 146 -46 -109 96 -102 152 -53 -121 -113 -133 -174 104 -78 -30 -128 161 174 49 56 -80 -16 -174 -190 -257 -20 -34
8026c4Q9KJ75k7Km20J40J51r6j70K41l36l8K70L3j18L80l18K47j86K7j16Q9M3
$$ -34 55 57 232 205 207 -213 -73 78 -18 -188 53 -283 -321 -51 -18 -136 244 -74 173 -13 14 -102 -13 30
8050C0Q8k36K21r8J16j56K04%J03j62k89K35LJ13l96n0L50L4j98P9m7Q8On3r2
$$ 30 118 -118 103 5 121 -35 169 169 272 110 -179 56 59 172 -224 -274 76 110 -88 -9 -56 32 38 -15 -107
8075a07o8K70k68M23j38Q3Q9l31K43m12K69K4j57J82j99o0M28p6k41q8J23R1j11
$$ -107 -175 95 -173 250 112 195 284 -47 196 -216 53 77 -80 102 -97 -157 271 195 -46 -134 -11 80 -31
8098c1o3j32J49r1j92J95K82Mk59K2j9J95J14n08L30J13J37j6j63n9NJ05p1k05
$$ -31 -94 -226 -77 -168 -360 -165 117 121 -138 -116 -135 60 174 -334 -4 109 246 230 67 8 13 118 47 -158
8122a58j1L0K66P3j68J97J84n09l8J17k26L70j19j28J83j11J25R6k42L07j59K22
$$ -158 -169 -139 127 200 32 229 413 -96 -134 -17 -243 127 8 -120 63 -48 77 173 -69 238 79 301
8144C01l32K44l13K93k46J18K26m58R1J12pJ6J48j74K36k36oJ33m3J85l43J32
$$ 301 -31 213 -100 193 -53 65 291 -167 -76 36 29 45 193 19 255 19 13 146 103 288 -55 77
8166G7o3O7j64j9K70j64k39K47J89n08J79L19J17m94j7J63O0K62l92J4L2j4J06
$$ 77 14 81 -83 -102 168 4 -235 12 201 -307 -128 191 308 -186 -203 -40 20 282 -110 -96 -64 -78 28
8189B8j21J4
$$ 28 -93 -79
8191g9
$$ Imaginary data points
##PAGE= N=2
##DATA TABLE= (X++(I..I)), XYDATA
0@%%%%%%%%%%%%%%Qj6J6j6J6k4L2l2M0m8N6o5P3q8J04j20J36j53J76k00K26k58
$$ 0 0 0 0 0 0 0 0 0 0 0 0 0 0 0 8 -8 8 -8 8 -16 16 -16 24 -24 32 -33 40 -48 56 -64 72 -81 95 -105 121 -137
36a37K90l24L63m06M53n03N59o22O86p58Q38r22J017j121J236j363J500j653J824
$$ -137 153 -171 192 -214 239 -264 295 -327 359 -399 439 -483 534 -587 649 -714 786 -867 957
55I57k017K235k483K768l098L490l963M545n284O253p591R575j2850J9553o0457
$$ 957 -1060 1175 -1308 1460 -1638 1852 -2111 2434 -2850 3403 -4188 5387 -7463 12090 -48367
70d8367Q6740j5921r7918J51750p8991m0464J10371r1190j1467R1270j06399M0947
$$ -48367 38373 22452 -75466 76284 -2707 -43171 67200 -23990 -35457 55813 -50586 -9639
82i639N5640r7749P0708K2036r5901R4387k0748p7225J03690m7255n2328J09157
$$ -9639 46001 -51748 18960 40996 -54905 39482 18734 -58491 45199 -2056 -54384 54773
94E4773p0460k0261R5675q4388M830P3215r1093L1038M5119q2226N1682J8481
$$ 54773 -15687 -35948 59727 -24661 -19831 53384 -37709 -6671 38448 -43778 7904 26385
106B6385o7840O6296j1240n0641P2709l8166l0380P4567n8781p340O8855p1524
$$ 26385 -41455 24841 13601 -37040 35669 -2497 -32877 41690 -17091 -24431 44424 -27100
118b7100J3695N4965p4606L0441L6396o9082M3283J6139n7818N1452o232m0981
$$ -27100 -13405 41560 -33046 -2605 33791 -35291 7992 24131 -33687 17765 11533 -29448
130b9448N2895k4827k2391N0954l8172m104M5471m8252J1874L4802n3786K5363
$$ -29448 23447 -1380 -23771 27183 -10989 -15093 30378 -17874 -6000 28802 -24984 379
142C79K2316n2380L6901R177m4087M2795l657l4105M2191j6635k2284L8115k5522
$$ 379 22695 -29685 7216 16393 -27694 15101 11444 -22661 19530 2895 -19389 18726 -6796
155f796p232L2816l1217P580K4217l4942J8579J3702l6812K6944L817l3739L4205
$$ -6796 -14028 18788 -12429 -4849 19368 -15574 3005 16707 -20105 6839 10656 -23083 11122
168A1122m468k6438L5794j2737j8338L2759k0378q597K6304k4023K118K0113k4745
$$ 11122 6654 -19784 16010 3273 -15065 17694 -2684 -11281 15023 -9000 -6882 13231 -11514
181a1514J1672J1967k4402J8158K780k2707K2675n102j8182K5581j0973j2028
$$ -11514 158 12125 -12277 5881 8661 -14046 8629 3527 -14655 10926 -47 -12075
193a2075K5516j5838n869K1992j9146l51J7116j9666O013J1126j7962J1308M154
$$ -12075 13441 -2397 -8266 13726 -5420 -5771 11345 -8321 -2308 8818 -9144 2164 6318
206F318j5107J4057j986j2178J6323p827p754J7389j1990l451J6222j4465P30
$$ 6318 -8789 5268 3282 -8896 7427 -400 -8154 9235 -2755 -6206 10016 -4449 -3719
219c719J3045j5499M323R626j4584P582M888j2499R845K57r965J1248l774o208
$$ -3719 9326 -6173 -1850 7776 -6808 774 5662 -6837 3008 3265 -6700 4548 774 -5434
233e434J1199p281k683J0690r749Q42Q840j1159L235P138j1162N723M696j0102
$$ -5434 5765 -1516 -4199 6491 -3258 -2416 6424 -4735 -1500 5638 -5524 199 4895 -5207
247e207P093J340q076P324j293n451P518l741k704P249n890k88O532p341K004
$$ -5207 1886 3226 -4850 2474 1181 -4270 3248 -493 -3197 4052 -1838 -2126 4406 -2935 -931
262i31N326q348L846L571p870N317J701o844O239l2n660O290j983l484N514l325
$$ -931 4395 -3953 -107 3464 -4406 911 2612 -4232 2007 1975 -3685 2605 622 -2862 2652 -673
278f73j680N748m863M45L874n190K253K658n837M106J179n258M777J6m612N203
$$ -673 -2353 3395 -1468 -1023 2851 -2339 -86 2572 -3265 841 2020 -3238 1539 1555 -3057 2146
294B146j327l284M623j854k290M076k700n58L392l810J174K241l749K401J184
$$ 2146 819 -2465 2158 304 -1986 2090 -610 -1168 2224 -1586 -412 1829 -1920 481 1665
309A665l743L156l2l359L727p41l070M508j926k103L759k317j038L462k928M72
$$ 1665 -2078 1078 1046 -2313 1414 673 -2397 2111 185 -1918 1841 -476 -1514 1948 -980 -508
325e08K042k980J536R94k531K021J80k431K790o53k168K840j093j448K942k034
$$ -508 1534 -1446 90 1084 -1447 574 754 -1677 1113 460 -1708 1132 39 -1409 1533 -501
341e01o16L054k510J75J860k462P04J596k064J025P87k205J512L42j802K158j210
$$ -501 -1117 1937 -573 -398 1462 -1000 -296 1300 -764 261 1048 -1157 355 697 -1105 1053 -157
358a57p99J983j486m15K259j991l38K201j973L56J692k153R25Q77j867J231j9
$$ -157 -956 1027 -459 -874 1385 -606 -944 1257 -716 -360 1332 -821 104 981 -886 345 326
375C26j298J699p18o81J743j273l13J398j330O9J323j353M12R82j842R54Q14j717
$$ 326 -972 727 9 -672 1071 -202 -515 883 -447 -378 945 -408 4 986 -856 98 912 -805
393h05J135K49j530J221O3j046J204l48o79J060r78J27J085j485Q60K46j026R30
$$ -805 330 579 -951 270 333 -713 491 143 -536 524 -454 -327 758 -727 133 379 -647 283
411B83K12j091Q01k2q51J082Qj095J235m03p24J105p05n1P95p36j0M24p64M85
$$ 283 495 -596 205 183 -668 414 422 -673 562 159 -565 540 -165 -216 579 -157 -167 257 -507 -22
431b2L26r34Q85O9j043J076l22o87J086o58l00R65m60m23R75q48o3N07k73J90
$$ -22 304 -630 255 324 -719 357 35 -652 434 -224 -524 441 -19 -442 533 -315 -378 129 -144 46
451D6J26n49P98m50k51P07l73k02L07L2q78J148o74l25J123q23O7O53q80N32K25
$$ 46 172 -377 421 -29 -280 427 54 -148 159 191 -687 461 -213 -538 585 -238 -171 482 -398 134 359
472C59m96K31J47n20N08k21m81N85k12j00P81o10r4L11j99j27K24m56L95L31p61
$$ 359 -137 94 241 -279 229 8 -473 112 -100 -200 581 -29 -123 188 -11 -138 86 -370 25 356 -405
493d05M17K54l76n7L83l92M08j51k27J0K8L19j22j77J51n6k60L95l4o66N84M3
$$ -405 12 266 -110 -167 216 -176 232 81 -146 -136 -108 211 89 -88 63 7 -253 142 108 -558 26 69
515F9k58J4J90QJ92j22k28L36n98J98J72q9Q0r1nJ20j32O3q4L56k92N5K52j11
$$ 69 -189 -175 15 23 215 93 -135 201 -397 -199 -27 -116 -36 -127 -132 -12 -144 -81 -165 191 -101 -46 206 95
539I5o9L5k77Np3K60J67j11P2O0k38%J43q7J10j37k67L92J5j06J6j53K96j08j84
$$ 95 26 61 -216 -211 -284 -24 143 32 104 164 -74 -74 69 -18 92 -45 -312 80 95 -11 5 -148 148 40 -144
564a44k9K13k65K96j12J89j18k2j47J53j84j08K86r5M8L67m55L08k39K64l09k0
$$ -144 -173 40 -225 71 -41 148 30 8 -139 14 -170 -278 8 -87 -39 328 -127 181 -58 206 -103 -123
586a23J00k81M03r4j9L6k31j61M06O7r5kj00K42k77K5J52J18j37k05K61J28m0
$$ -123 -23 -304 99 5 -14 22 -209 -370 36 103 8 6 -94 148 -129 -104 48 166 29 -176 85 213 173
609A73k40J76k45j05J96p5L19k50K14jm08J60J63k26j74M81j55j55k0j55J91j25
$$ 173 -67 109 -136 -241 -45 -120 199 -51 163 162 -246 -86 77 -149 -323 158 3 -152 -172 -327 -136 -261
631b61L53r7k09L71r9k67J80p0K07J38j80n3k96L51k01J60J5J7j59J79J57o79
$$ -261 92 -5 -214 157 58 -209 -29 -99 108 246 66 13 -283 68 -133 27 42 59 -100 79 236 -443
653d43M92j49Q6Q6j05qo8J66j20p1J99K6k46J80j23j98J37R9K20l16P3J37ok0
$$ -443 49 -100 -14 72 -33 -41 -109 57 -63 -134 65 91 -155 25 -98 -296 -159 -60 160 -156 -83 54 48 28
677B8L3J48j50k86J34R1P1j96R3J06p7j50K26j14q1L03j43Rk3l23O2J55L63j85
$$ 28 61 209 59 -227 -93 -2 69 -127 -34 72 -5 -155 71 -43 -124 179 36 45 22 -301 -239 -84 279 94
701I4m8Q6j59L3rK0j4r8M41k42o3M5m80K99K59k25Ln6J43K0j59j8L21j76Q7l16
$$ 94 46 132 -27 6 -3 17 3 -95 346 104 41 86 -394 -95 164 -61 -58 -114 29 49 -110 -128 193 17 104 -212
727b12J8K41j46j63L48lk87J9J40j45K79r5lJ02m6m1K78l04j99J91j49o5K93P7
$$ -212 -194 47 -99 -262 86 83 -204 -185 -45 -190 89 -6 -9 93 47 6 284 -20 -219 -28 -177 -242 51 128
751A28j00j75q4m0Q5l6R7K32j65o0Q7m4J63j28j28R4n1K72l74K98r7l8M5L9l1
$$ 128 28 -147 -231 -271 -186 -222 -125 107 -58 -118 -31 -75 88 -40 -168 -74 -125 147 -227 71 -26 -64 -19 20 -11
776a1m6J6p6j4K16J65m73J34L86o7l03q1j1L83p1k46JJ72J34l31J2K47k07L77
$$ -11 -57 -41 -117 -131 85 250 -223 -89 297 230 -73 -154 -165 218 147 -99 -98 74 208 -123 -111 136 -71 306
800C06l46M4r6K57j00m7m3J2J01l29oJ17K7J04J30k27K01j50J21j79R4nL58l81
$$ 306 -40 4 -92 165 65 18 -25 -13 88 -241 -247 -130 -103 1 131 -96 105 -45 76 -103 -9 -14 344 -37
824c7j21K8j7K16J0J0j47K3lK01L6k41Nj91L05J4j21Q3m8k5J89l5J16k84Q7k67
$$ -37 -158 -130 -147 69 79 89 -58 -35 -38 163 199 -42 -37 -228 77 91 -30 53 5 -20 169 134 250 -34 53 -214
850b14P9N7K77k53m6K8Q1m0j78K93L3j47j22K44j2J16K2k86R5O7k7m2r1L8J60
$$ -214 -135 -78 199 -54 -100 -72 9 -31 -209 84 117 -30 -152 92 80 196 218 -68 27 94 67 25 -66 -28 132
875A32k24Q6n0J42k50j28K45k34R8k42N19j37j37L87k08K67j73l36J13M7Q9j50
$$ 132 -92 -6 -56 86 -164 -292 -47 -281 -183 -425 94 -43 -180 207 -1 266 93 -243 -130 -83 6 -144
897a44J37p1J21L9j29M4K13k86M6J52J9o4k24R0n2P5K05k82K64p1k36J96M9m6
$$ -144 -7 -78 43 82 -47 -3 210 -76 -30 122 141 77 -147 -57 -109 -34 171 -111 153 82 -154 42 91 45
921D5p2p9jK13L1j46L69k99q0KK09m58L10J1K31k21n8K00l00R3j35K9o5P6N4O5
$$ 45 -27 -106 -107 106 137 -9 360 61 -19 -17 192 -266 44 55 286 65 7 207 -93 0 -135 -106 -171 -95 -41 24
947B4j24O3o2j11R7N0lN4J27o1n1r0K5j2K21kr0j61l5r8L03p2j80L28k40O4n4
$$ 24 -100 -37 -99 -210 -113 -63 -66 -12 115 54 3 -87 -62 -74 147 145 55 -106 -141 -239 64 -8 -188 140 -100 -36 -90
974i0J08M4l17K81L9j86J87k60J78p6K91j64l3k07J87k29K58j09PK54k79K61l13
$$ -90 18 62 -255 26 65 -121 66 -194 -16 -92 199 35 2 -205 -18 -247 11 -98 -91 163 -116 145 -168
997a68M1k9K87o9L1o1j97M58k28k22K36q2L0k39K55l39L71j4o2J37m49K85K18
$$ -168 -127 -156 131 62 93 32 -165 293 65 -157 79 -3 27 -212 43 -296 75 61 -1 136 -313 -28 190
1020A90k67P7J29k94L26k45L8j06j62J32R5o2K27N9k70K67m25J70J22J25m8j95
$$ 190 -77 0 129 -165 161 -84 -46 -152 -314 -182 -87 -149 78 137 -133 134 -291 -121 1 126 78 -117
1042a17J25j19K62j4r0n9j7K09p0k6r7k08P5R1p1k4K22kj29K20j59l3J07qmo8
$$ -117 8 -111 151 137 47 -12 -29 180 110 84 -13 -221 -146 -55 -126 -150 72 70 -59 161 2 -31 76 68 64 -4
1068dJ06J05k85K57k3j43j87J41K19j29j19L48j99j8K1Q8R7j42O5j63j76J78J51
$$ -4 102 207 -78 179 156 13 -174 -33 186 57 -62 286 87 69 90 178 275 133 198 35 -141 37 188
1091A88n7j59J2O7m5p4M7M0lRK1R9l37K88o1j78L99k81lj7o9J98k79K75j55k08
$$ 188 131 -28 -16 51 6 -68 -21 19 16 25 46 145 -192 96 35 -143 256 -25 -28 -45 -114 84 -195 80 -75 -283
1117b83K23J04K04r1k26m4K94k81J00K22p8j66j34K93j45N5j62N9J60n1O5k50
$$ -283 -60 44 248 157 -69 -113 181 -100 0 222 144 -22 -156 137 -8 47 -115 -56 104 53 118 -132
1139a32k3L95J31k56j38L69l57R8n0k05K60J25m9Mm88K99O2K9J71n1j60K46m85
$$ -132 -155 240 371 115 -23 346 -11 87 37 -168 92 217 168 172 -316 -17 45 74 245 194 34 280 -205
1162b05M40j78j29O0k24K62J47j71R3k19LJ90k64O9Q3j87J02N5J8R7o4K51k10
$$ -205 235 57 -72 -12 -236 26 173 2 95 -124 -121 69 -195 -126 -43 -230 -128 -73 -55 42 -22 229 19
1185A9k2j7j47j58J12J69J42J56j61J11k90M1k01J79J8K60j68KP1j29j9K18N2
$$ 19 -3 -20 -167 -325 -213 -44 98 254 93 204 -86 -45 -246 -67 -49 211 43 45 116 -13 -32 186 238
1208B38j07k52Q0mJ65jm17N2K70j72R7J60l59L83M6J4l08J62r5J7Q2j35r1J32
$$ 238 131 -121 -41 -45 120 119 -298 -246 24 -148 -51 109 -250 133 179 193 -115 47 -48 -31 51 -84 -175 -43
1232d3j3j7RM0QP7J6l0j15rj30K30q4P0r6K18J0l16M12k74mJ75J41m07K54j75
$$ -43 -56 -73 -64 -24 -16 61 77 47 -68 -77 -207 23 -61 9 -87 131 141 -175 237 -37 -41 134 275 -132 122 -53
1258e3PQ0N5j71J61l98L16j53K18k47K02K5%l3j8LJ98k88J00J44m9j7L7J0k70
$$ -53 -46 34 89 -82 79 -319 -3 -156 62 -185 17 42 42 9 -9 -6 192 -96 4 148 99 82 119 129 -141
1283a41K53Kj4m0O3k41J49K0o4J42j97J30m5q6J4N9j09p3J94O4j04o1J26J98l62
$$ -141 112 114 100 60 123 -118 31 51 -13 129 -68 62 17 -69 -55 4 -105 -178 16 80 -24 -85 41 239 -123
1308a23J67m3k82L89N5k28j34K99m3p5l8j84J61J32J22J03k84M4mj08K5J21r8
$$ -123 44 1 -281 108 163 -65 -199 100 57 -18 -56 -240 -79 53 175 278 -6 38 34 -74 -49 72 -26
1331b6K55n82J81O5Q5J21J87j17j94K19k52J3J49l25L6J85R0l04L30j59P1P0P8
$$ -26 229 -353 -172 -107 -22 99 286 169 -25 194 -58 -45 104 -221 -185 0 90 -214 116 -43 28 98 176
1354A76n5K7K5j22L3l24J29J96R5j23K16j38ro7j27K52l93M63l34M9J78k84L37
$$ 176 121 148 173 51 84 -240 -111 85 180 57 273 135 126 59 -68 184 -209 254 -80 -31 147 -137 200
1377B00l13K52p6P1j04m26K23M7J33m3M7O3m0m6J49o8J16m02j14K1M42j47JJ21
$$ 200 -113 139 63 134 30 -396 -173 -126 7 -36 11 74 34 -12 137 69 185 -217 -331 -310 132 -15 -14 107
1401A07R4j85J37p9N9j53M4QJ5J07k38J97n7J33R9l04K01n4J04m17L25r0l7j10
$$ 107 201 16 153 74 133 -20 24 32 47 154 -84 113 56 189 288 -16 185 131 235 -182 143 53 16 -94
1425i4K88j24j49j64J44J00n6p1mj06M28l93K78P2j3Q7k35m7l31M36j25J39l4
$$ -94 194 70 -79 -243 -99 1 -55 -126 -130 -236 192 -201 77 149 136 223 -12 -59 -390 46 -79 60 26
1448B6P7k45m8L15k62J51J83k24n5Kj22M10m9l1k92O5J35k8j5K74m05J82%K80
$$ 26 103 -142 -190 125 -137 14 197 -27 -82 -80 -202 208 159 128 -164 -99 36 8 -7 267 -138 44 44 324
1472C24m93K81j70K68p4N2k83J67k22J55J8k67L25j99J97r1P2j9J8mj64J89r1
$$ 324 -169 112 -58 210 136 188 -95 72 -150 5 23 -244 81 -118 79 -12 60 41 59 55 -109 80 -11
1495a1j83K21l44O73m28k26L78k07K31n6J02j33q5J67Nm68K55Q7k99O38k22l53
$$ -11 -194 27 -317 356 -72 -298 80 -127 104 48 150 17 -68 99 104 -364 -109 -22 -321 317 95 -258
1517b58J51J05j60L73j69P6k63J90k2j22m8J30M2N4Q9J32l51p9K34p5pj43P5K09
$$ -258 -107 -2 -162 211 42 118 -145 45 23 -99 -147 -17 25 79 168 300 -51 -130 104 29 22 -121 -46 163
1541A63J16l17J85j92l6N6K18J5k50Q3J21M5k93oJ80K8k04K94j01k6J5j24J35
$$ 163 279 -38 147 -45 -81 -25 193 208 -42 41 162 207 -86 -92 88 116 -88 206 105 79 94 -30 105
1564A05p7K3pk05K60j29J86k83L66l22l43L59J42j38m8N1J22p9m2M7j03K73j52
$$ 105 28 51 44 -161 99 -30 156 -127 239 -83 -426 -67 75 -63 -111 -60 62 -17 -59 -12 -115 158 6
1587FK8m6j12K03J39M7k80R4l23K26j28P1K83Q6m76J46k7j23M44l79K75k93p5
$$ 6 34 -12 -124 79 218 265 -15 79 -244 -18 -146 -75 208 294 -182 -36 -63 -186 258 -121 154 -139 -214
1610b14J08J73j47p3J08J9Q3l0j47Q2ok8K04o7k38K77k19J96M4p8k29J62J5k16
$$ -214 -106 67 -80 -153 -45 -26 57 27 -120 -38 -44 -72 132 65 -173 104 -115 81 125 47 -182 -20 -5 -221
1634b21L27J23l14q7J04L77j81j08j76L50j24n6j78K81K4k57K00R0j36M0j61p
$$ -221 106 229 -85 -172 -68 309 128 20 -156 194 70 14 -164 117 141 -116 84 174 38 78 -83 -90
1656i0j7K7l9k8K52j6j7r0K24k40l8J16r7j98L37l4j06J43j37K06L0J20o58K99
$$ -90 -107 -80 -119 -147 105 89 72 -18 206 -34 -72 44 -53 -251 86 52 -54 89 -48 158 188 308 -350 -51
1680e1N0k04L42j3j02M3j1o7j23L2J52m5k36J04L11l32J02P8J64k80P8k1j13o0
$$ -51 -1 -205 137 124 22 65 54 -13 -136 -104 48 3 -233 -129 182 -150 -48 30 194 -86 -8 -29 -142 -202
1704b02J05L9k5K22O7L9k22j07j01L65r0o5j37K73l4l28J3K60J96o04M48N1l44
$$ -202 -97 -58 -83 139 206 245 23 -84 -185 180 90 25 -112 161 127 -201 -188 72 268 -336 112 163 -181
1727a81J69j07J55m40N50J15k11L4k42J2K14K1p0j06K98j35j25J04j00J79j09
$$ -181 -12 -119 36 -404 146 261 50 84 -158 -146 68 89 19 -87 211 76 -49 55 -45 134 25
1748B5l10N00n1j90q5J59j77J89k9j94P2J88k9k38J44k64L38q0j94J57j84K62
$$ 25 -285 215 164 -26 -111 48 -129 60 31 -163 -91 97 68 -170 -26 -290 48 -32 -226 -69 -253 9
1770IP8j32Q1k2M8j15J66k67L2Q4K6m8M1n4p1R6m0j4J85J1J39k36j43J08M2N1
$$ 9 87 -45 36 14 62 -53 113 -154 -122 -38 -12 -60 -19 -73 -144 -48 -88 -102 83 94 233 -3 -146 -38 4 55
1796E5L0j51M21k44m23M08j71K9K3j36O3J07J0M1K83k16j40m61L81L8O7j05J45
$$ 55 85 -66 355 111 -312 96 -75 -46 -23 -159 -96 11 21 62 345 129 -11 -472 -91 -53 14 -91 54
1819E4R1j69k11J76J92k42j35P6K06J14j44Q5j50L00l90K45k29J62j63K40J6l84
$$ 54 145 -24 -235 -59 133 -109 -244 -168 38 152 8 93 -57 243 -147 98 -131 31 -132 108 124 -260
1841b60L52o8j75K02N8o9p1K38j94l84O92l67L24n12K82N9Pk38K04n1j06l2K77
$$ -260 92 24 -151 51 109 40 -31 207 13 -371 321 -46 278 -234 48 107 114 -124 80 29 -77 -109 168
1864A68o8j82K73l42M91l18k13RJ43q5J17R0J18k41j45K01J06P7J29m77k17L00
$$ 168 100 -82 191 -151 340 22 -191 -182 -39 -124 -7 83 201 -40 -185 16 122 199 328 -149 -366 -66
1886f6J8o9J65J00q4n4P8k94J27K6J59j3k68k2J81J51p0L7j01J43l0n4O3%j22
$$ -66 -48 -117 48 148 64 10 88 -206 -79 -53 106 93 -175 -197 -16 135 65 102 1 144 114 60 123 123 1
1911Aq0j47K29M3j22j35N11k16J77j43M6l94K92j44K09Q7rm30L58l5mk65L62j94
$$ 1 -79 -226 3 46 -76 -211 300 84 261 118 164 -230 62 -82 127 214 205 -225 133 98 94 -171 191 -3
1935cl2K94k37J53k7j41j52K33m28M94p5J59m16K96n4J48j94q1R6J2p6lN1l8J30
$$ -3 -35 259 22 175 148 7 -145 88 -340 154 79 238 -178 118 64 212 18 -63 33 45 -31 -34 17 -21 109
1960A09l26Q6J76j44J40j93L09k6j01K0M9r0j23J16N9j57k20M84M0l86L24j85
$$ 109 -217 -131 45 -99 41 -152 157 131 30 50 99 9 -114 2 61 -96 -316 168 208 -178 146 -39
1982c9M9K3k5k44L34k90J35J59p5O3N5l44n1L71j29Q5j12J17Q5q5l42M67j85j68
$$ -39 10 33 8 -236 98 -192 -57 102 27 90 145 -199 -250 121 -8 77 -35 82 167 82 -260 207 22 -146
2006a46L99k41J70m7Q4k41m2J36j81J04J3j0k7J69k18J33k38J88k73N09k88j63
$$ -146 253 12 182 135 219 -22 -64 72 -109 -5 8 -2 -29 140 -78 55 -183 5 -268 241 -47 -210
2028b10Q1L0K3K1o0O4J74l43L22k24L2J07q6J59Rk20R4O5N1l7j66j75M87k77M2
$$ -210 -129 -99 -76 -55 -115 -51 123 -220 102 -122 -90 17 -69 90 99 -121 -27 38 89 52 -114 -289 198 -79 -37
2053c7N8o8J52j63J48K4j39O8k34J48k36L79j3j52j20M51j05l10J13l2m2M2O7
$$ -37 21 -47 105 -58 90 114 -25 43 -191 -43 -279 100 87 -65 -185 266 161 -149 -36 -68 -110 -68 -1
2076ap5L1l7NJ26k5N25l31j89J60k11J71j15j93K39R7j0j01k3k43L11j10K1j9
$$ -1 -76 -45 -82 -77 49 24 549 218 29 189 -22 149 34 -159 80 177 167 66 43 -200 111 1 22 3
2100CJ56l28K54j19n5J44j3j50r1K14j90K75N2r6K8J8Pl11J07j04M88J9k10l25
$$ 3 159 -169 85 -34 -89 55 42 -108 -199 15 -175 100 152 56 84 102 109 -202 -95 -199 289 308 98 -227
2124b27K1J37j13M39k15j42k8K32N9m14K86K1O5j78q8L33l3j85K3r8P9n8J45M9
$$ -227 -206 -69 -182 257 42 -100 -128 104 163 -251 35 56 121 -57 -145 188 155 -30 -7 -105 -26 -84 61 110
2148A10j67j44J87Kj88J59m1rJ81l61k8M98j28k5P7k45J91j72K35Q5j04o8j58
$$ 110 -57 -201 -14 -12 -200 -41 -82 -91 90 -271 -299 199 71 46 123 -122 69 -103 132 217 113 45 -113
2171a13j34L74j57j55L82l15K57o0m0j38K6J77j49Q6j73P0J14O2j21Nj66N72n08
$$ -113 -247 127 -30 -185 197 -118 139 79 39 -99 -73 104 -45 41 -132 -62 52 114 -7 -2 -168 404 -104
2194a04K66j96P5K81m68M8K53k04nN9Qj8j48j45J62J91k7k74M10j49k56l7L60
$$ -104 162 -34 41 322 -146 -98 155 -49 -54 5 13 -5 -153 -298 -136 55 28 -246 164 15 -241 -278 82
2217H2o1k38oJ90J9k01M33l49M0L05J8l25L75l38L12k11J36nj69n8k27L26N5p0
$$ 82 21 -217 -223 -33 -14 -215 218 -131 -91 214 232 -93 282 -56 256 45 181 176 7 -51 -278 48 103 33
2241C3l9k5j26J45L7j2J29k92J13K20k03r2Q1K29k42l6K87m14L31j8k14J77j27
$$ 33 -6 -31 -157 -12 25 13 142 -150 -37 183 -20 -112 -31 198 -44 -80 207 -207 124 106 -108 69 -58
2264e8K45J45l09P8K7p4o1r3K0j34L64l42K79R4J4k60O5j05J19P9L8r0Q2L6k09
$$ -58 187 332 23 101 128 54 -7 -100 -80 -214 150 -192 87 181 195 -65 0 -105 14 93 131 41 123 159 -50
2289e0r5M1K63n3k49J17K3j41L13k83M23m34J12m9K22o2q8o0j0J22KKN9M5j90
$$ -50 -145 -104 159 106 -143 -26 -3 -144 169 -114 309 -125 -13 -62 160 98 10 -50 -60 62 64 66 125 170 -20
2314b0J27p2K20j31j89o1K00l27K77P6l60K19j26K24j52J49j55J33J10J11l30
$$ -20 107 35 255 124 -65 -126 74 -253 24 100 -260 -41 -167 57 -95 54 -101 32 142 253 -77
2335g7L80l34J41m27L12J0J34p9j69R3J59M2j64K17j81k45L01j23o3oj16L43k22
$$ -77 303 -31 110 -317 -5 5 139 60 -109 -16 143 185 21 238 57 -188 113 -10 -73 -79 -195 148 -74
2358g4J7j33J7J69j92L52k04K93l19P5m7l1J68j73J59j65r8J83m7L17k63J57m6
$$ -74 -57 -190 -173 -4 -196 156 -48 245 -74 1 -46 -77 91 -82 77 -88 -186 -3 -50 267 4 161 115
2381A15q8o1K57m92L99k49O7k1J3J59J15j87R5Q5k67K35l0k64L2J64j35J98q8
$$ 115 27 -34 223 -269 130 -119 -52 -73 -60 99 214 27 122 207 -60 175 145 -119 -87 77 -58 140 52
2404E2q6m4J8m7J61j73K5K7k4J4Q1J34%m37M35n2j2j83J18P6jj89Q0R4J52l50
$$ 52 -34 -78 -60 -107 54 -119 -94 -67 -91 -77 4 138 138 -299 136 84 72 -111 7 83 82 -107 -27 67 219 -131
2430a31K17J8o9q4q0L65o5j49j19L85k41j25J3K29l2j40R2o7K29l18q2K19O3k32
$$ -131 86 104 35 -49 -129 236 171 22 -97 288 47 -78 -65 164 132 -8 84 17 246 -72 -154 65 128 -104
2454a04m8j16L27O1j7J24j14n7j09Q7j48m4K79P0k26l7J0n0ol4R1K85m02j97M82
$$ -104 -152 -268 59 120 103 227 113 56 -53 34 -114 -158 121 191 -35 -72 -62 -112 -118 -152 -61 224 -178 -375 107
2479A07l89L01K47k37M6j93L67o3k38K9j3qJ5n7J48l06L5J40J76o3q4K16k22J44
$$ 107 -282 19 266 29 75 -118 249 186 -52 -23 -36 -44 -29 -86 62 -244 -209 -69 107 44 -40 176 -46 98
2503I8k85K73k46J22k83K73L3j1k1J62j73k86K21N11j00r3j80J11k85O7O0Lj42
$$ 98 -187 86 -160 -38 -321 -48 -15 -26 -47 115 -58 -344 -123 388 288 195 15 126 -159 -92 -32 -29 -171
2526a71M7J08k25M94k44O2Ol08K95j48N2j21M40k11m45O34k98j15k7L31k01K9
$$ -171 -124 -16 -241 253 9 71 77 -231 64 -84 -32 -153 287 76 -369 265 -33 -148 -175 156 -45 -16
2548a6J57l26L29L6j38O3j38J1N2j94K05j08L4k5K78L5l87K50o0j33l7L9R3M3
$$ -16 141 -185 144 180 42 105 -33 -22 30 -164 41 -67 -33 -58 220 255 -132 118 58 -75 -112 -73 20 63
2572F3k46J72L8K89j10m4k39J10n5Pk54K72pN5K2k88K93P4j55J12k90Q8K13j81
$$ 63 -183 -11 27 316 206 162 -77 33 -22 -15 -269 3 -4 51 73 -215 78 152 -3 109 -181 -93 120 -61
2596f1N5j26j16M12k20J06J12J92m07J01o1q8J02k25J76M0l7M1lN8j28J79k9m4
$$ -61 -6 -132 -248 164 -56 50 162 354 -53 48 -13 -101 1 -224 -48 -8 -45 -4 -7 51 -77 102 73 29
2620B9J72j02r9Pm9K00l67L40Op2n5J39Q2l30r1L59j3j70O7l7l03J98R7o9J28
$$ 29 201 99 0 7 -42 158 -209 131 137 65 10 149 231 -99 -190 169 156 -14 53 16 -287 -89 8 -61 67
2645F7r3Mj60L20l76J47K53L2m09K39pK0j03J5j53L96k53R9K16j24j54p6J7P8
$$ 67 -26 -22 -182 138 -238 -91 162 194 -215 24 17 37 -66 -51 -204 192 -61 38 254 130 -24 -100 -83 -5
2669er7K64O0m40L34N1o2j74j99J33m4J6n7M75k47J94J40m10n2K36J2j71J24p1
$$ -5 -102 162 222 -218 116 167 105 -69 -268 -135 -179 -163 -220 255 8 202 342 -68 -120 116 128 -43 81 10
2693A0k19K89j03L76k88o1Q3j43Q3j56n0K94p1J1K2j28O4K6m2J13L3m15L35j71
$$ 10 -209 80 -23 353 65 4 87 -56 27 -129 -179 115 44 55 77 -51 13 39 -3 110 143 -272 63 -108
2717a08P0k18J74L32j82l73O04q8k75n2M35l00j39K58n6m1jJ59l88M04k80n8K41
$$ -108 -38 -256 -82 250 68 -305 299 211 -64 -116 319 19 -120 138 82 41 40 199 -189 215 -65 -123 118
2740A18K06l15j66J49R2m61M56k49M0j1oR1N7P8L5k05J13N2N8j80J99k38j04J99
$$ 118 324 9 -157 -8 84 -377 79 -170 -130 -141 -147 -56 1 79 114 -91 22 74 132 -48 151 -87 -191 8
2764Hj18q4K86p2k13K11JnLR5N8L1k27J07J3k70L89k47R7Nk18L82K4l31L20k78
$$ 8 -110 -194 92 20 -193 18 19 14 17 112 170 201 -26 81 94 -176 213 -34 63 68 -150 232 256 -75 245 -33
2790c3Q9j17K58k0m9n5Q5K31j44m50J55J60j43j71ML37j67O6j04K4J45Pl44L61
$$ -33 56 -61 197 177 128 73 158 389 245 -205 -50 110 -33 -204 -200 137 -30 36 -68 -44 101 108 -236 125
2814A25L1o7q2n5L25j38j41j07R3j32K96j14o4K22k41N2j86J86j00K4J59k96K75
$$ 125 156 89 7 -48 277 139 -2 -109 -16 -148 148 34 -30 192 -49 3 -183 3 -97 -73 86 -210 65
2837F5N8j07l0K11k44J69j55J69j25k82O24l96J2k45L51j86J87j99J47o6k94L89
$$ 65 123 16 -14 197 -47 122 -33 136 11 -271 353 -43 -31 -276 75 -111 76 -123 24 -42 -336 53
2859E3O0l16K87J7j34N3J93q5l46J68p0J03K8k06K89q3k56M66J2j52j21n6K17
$$ 53 113 -203 84 101 -33 20 213 128 -218 -50 -120 -17 11 -195 94 11 -245 221 233 81 -40 -96 121
2882A21k73J41J17O1m22K16j71J66M2n6K2L10k25K8J26k40Q0K4j9QJ37k7r0K67
$$ 121 -152 -11 106 167 -255 -39 -210 -44 -2 -58 -36 274 49 77 203 -37 43 67 48 56 193 166 76 343
2906C43m86Q3K06Q8j55Lk35K94l15P6lK85J5k60P4L8l8J57m2k45J85j62L96m57
$$ 343 -143 -60 146 234 79 82 -153 141 -174 -98 -101 184 199 -61 13 51 13 170 128 -117 68 -94 302 -155
2930a55M6j87L02K26m59J47J8qJ80q8r3O8Q5j74J70l29L4J80J47k81J43K60k19
$$ -155 -109 -296 6 232 -227 -80 -62 -70 110 22 -71 -3 82 -92 78 -251 -217 -37 110 -171 -28 232 13
2953A3r3J15p5L23o23K64K26k23Q0N6mO2j99k3L8p1R7J01J33k23K69j7k59k2k34
$$ 13 -80 35 -40 283 -340 -76 150 -73 7 63 59 121 -78 -101 -63 -134 -37 64 197 -26 243 226 -33 -55 -289
2978b89M93k30J41J20m22O4J89j23k70M77l24L11K04Ln19K20n7j38j17P8J67P1
$$ -289 204 -26 115 235 -187 -123 66 -57 -327 150 -174 137 341 344 -175 45 -12 -150 -267 -189 -22 49
3000D9K5P3l20J65p5J39j79q8L82m71J96K20j39k7K91l79P1K09k9o5K50j67j09
$$ 49 74 147 -173 -8 -83 56 -123 -211 171 -300 -104 116 -23 -50 241 -138 -67 142 113 48 298 131 22
3023B2k90L04j59J05j75K23l06L24k18K63j52K64m01K70q0J73k58j1R2J87Q8m58
$$ 22 -268 36 -123 -18 -193 30 -276 48 -170 93 -59 205 -196 74 -6 167 -91 -102 -10 177 265 -193
3045a93K05K2j80K27k07p5K77m12K74J1k8j26N73l19j49M0j18k5L40j90j5K9l3
$$ -193 12 34 -146 81 -126 -201 76 -336 -62 -51 -79 -205 368 49 -100 -60 -178 -203 137 -53 -68 -39 -72
3068g2J83j1j60P8J12q0Q5K0j85m4L30j56j45Q2k44M31m80K91J97k95k9K00k23
$$ -72 111 100 -60 18 130 50 135 155 -30 -74 256 100 -45 37 -207 224 -256 35 232 -63 -92 108 -115
3091a15J78j96r8L30n4o3k0l9J13j94J41J63l77P29n74L93k52r6O6J58K3j43J15
$$ -115 63 -133 -231 99 45 -18 -38 -77 36 -158 -17 146 -231 498 -76 317 65 -31 35 193 216 73 188
3114A88k42q7K26J3K8Lj28J14J23j41l45K60Q6k72J72k20L71o3p7n2J2p2K1m8
$$ 188 -54 -141 85 98 126 129 1 115 238 97 -248 12 98 -174 -2 -222 149 86 9 -43 -31 -103 -82 -130
3138a30L16p5j03J99k33R4j06J01j95n6Q3Q1k03K34N5j19L20l45m9K8o1M1J38
$$ -130 186 111 8 207 -26 68 -38 63 -132 -188 -105 -24 -227 7 62 -57 263 -82 -131 -103 -164 -123 15
3161A5j37J47j09K30k63J13k95J69K11j1jp4o2L39n5q5k68J37j29K53J23k47K1
$$ 15 -122 25 -84 146 -117 -4 -299 -130 81 70 69 -5 -67 272 217 132 -136 1 -128 125 248 1 22
3184B2N3N5L7n25M51j87L35m4l22J40o0o2J91k38K29q6J10n0n6l09K12M76l32
$$ 22 75 130 167 -358 93 -94 241 197 -125 15 -45 -107 84 -154 75 -11 99 49 -7 -316 -104 372 40
3207D0K07j07l64K00pk74M65j51P8j71k6pJ6J87m8M8J73k46P8J02l05P6P6j43
$$ 40 247 140 -224 -24 -31 -305 160 9 87 -84 -110 -117 -101 86 38 86 259 13 91 193 -112 -36 40 -103
3231a03L30j59J33j30j10J96j34j07J24p2oM7lJ03j54m6K37j43M8j51P3K43jk53
$$ -103 227 68 201 71 -39 157 23 -84 40 -32 -38 9 6 109 -45 -91 146 3 51 -100 -27 216 215 -38
3255c8p8J16K42k01J41j05p7kJ08P6l7J19n3j04j14j06P9k1J88M9j07J22m5j05
$$ -38 -116 0 242 41 182 77 0 -2 106 182 145 264 211 107 -7 -113 -34 -55 133 182 75 197 152 47
3279D7j53K85j02j89J82j25l4K13K57n56L27k78L13j33l7J02j21N7q3j51R7J91
$$ 47 -106 179 77 -112 70 -55 -89 124 381 -175 152 -126 187 54 17 119 -2 55 -28 -179 -82 109
3301A09q6k6K58k71O7j60J23K11j15k81R0j6j22M03M6j19k75R4L2J76l72J77N0
$$ 109 23 -3 255 -16 51 -109 14 225 110 -171 -81 -97 -219 184 230 111 -164 -70 -38 138 -234 -57 -7
3324go6J81J9m5Q2k7m16M00j03o8p0j07J96j25K97J01m38k1L45M4k53K09l5j22
$$ -7 -73 108 127 82 164 137 -279 121 18 -50 -120 -227 -31 -156 141 242 -196 -217 128 172 -81 128 93 -29
3348b9L5n1K59j70K93m20n4L50n52N60j16j92j9O4L11k61J07j26J43k02P5j59
$$ -29 6 -45 214 44 337 -83 -137 213 -339 221 105 -87 -106 -42 269 8 115 -11 132 -70 5 -154
3370a54J05K0K9L6l7J03k26L6lK71l46N1M5l4L73l44K5O9N2R6k97L28k18q9j96
$$ -154 -49 -29 0 36 -1 102 -124 -88 -91 180 -166 -115 -70 -104 269 -75 -50 19 71 167 -130 198 -20 -109 -305
3395c05L64J8k75K58M1j77r0O7R2J62m05M04k01J5J3l2J13j7k37K84j30J69l90
$$ -305 59 77 -198 60 101 -76 -166 -99 -7 155 -250 154 -47 -32 -19 -51 62 45 -192 92 -38 131 -259
3418b59M07m0k11Q9j78O4J34k7J26k3k10K68j92j36Q3K14l3k75K26J84%m36L40
$$ -259 148 108 -103 -14 -192 -128 6 -21 105 82 -128 140 -52 -188 -105 109 76 -199 27 211 211 -225 115
3441A15j37j5r6nK77k00j08K99j87R0l38L44n5M0K05l81K53p2k39K21j4M6r7j0
$$ 115 -22 -37 -133 -138 139 -61 -169 130 -57 33 -305 39 -16 24 229 -152 101 29 -210 11 -3 43 -54 -64
3465f4O7J24j07j82K52j31J91j1l50J72l3J97J3k02j33K92k8m0J72m1k99K98m46
$$ -64 3 127 20 -162 90 -41 150 139 -211 -39 -72 125 138 -64 -197 95 67 27 199 158 -141 157 -289
3488b89M96j18j96L17k30j58L04k60J41J0j66M84k46k38J57R6j33P7J53k83p7
$$ -289 207 89 -107 210 -20 -178 126 -134 7 17 -149 335 89 -149 8 104 -29 48 201 -82 -159
3509a59J12j87K76k02N3P1Kr9K72J1j67J53k50K35n3q7K12j0k66K60k5k76K14
$$ -159 -47 -234 42 -160 -107 -36 -34 -133 139 150 -17 136 -114 121 68 -19 193 183 -83 177 152 -124 90
3532I0J38l34k6J89O4j95J31m2J97m41L10Q6k27K49rk0j25J06j34p1j03J76k64
$$ 90 228 -106 -132 57 121 -74 57 15 212 -229 81 167 -60 189 180 160 35 141 7 -64 -167 9 -255
3555b55K64k71L37k22L4m3J18M7m6Q4q1Q8N4J2J25l77p8K93q7Q2k06L74k17Pk7
$$ -255 9 -262 75 -147 -113 -156 -38 9 -37 47 -34 54 108 120 245 -132 -210 83 -4 78 -128 246 29 36 9
3580IK04K08r65L60J01L46q8j00rK0k0M9j43M2p6m4K33n5M5L2j46j68P3J99j08
$$ 9 213 421 -544 -184 -83 263 175 75 66 86 66 115 -28 14 -62 -106 127 72 117 149 3 -165 -92 107 -1
3605aJ94r6n1j05J38j79l40J04M83l4j75K31l29J87p6K65r7k2l4n1o5l9K36l81
$$ -1 193 97 46 -59 79 -100 -440 -336 147 113 -62 169 -160 27 -49 216 119 97 63 12 -53 -92 144 -237
3629b37K06j35NK43j70J44K73l09J83k38o2J38j37J05K71k23j85K1K59j68kK4
$$ -237 -31 -166 -161 82 -88 56 329 20 203 -35 -97 41 -96 9 280 57 -128 -107 152 -16 -18 6
3651Fj13O4r8J24j91K64J05j58R5j46j11l3L50N0k32J33k01K46l31O4j07K34j92
$$ 6 -107 -43 -141 -17 -208 56 161 3 98 -48 -159 -192 158 208 -24 109 -92 154 -177 -113 -220 14 -178
3674a78K22j09J68j03K5K15k34M1m4j07n4K72j06m7R4p0j75K84q2N2j46j7L00
$$ -178 44 -65 103 0 25 240 6 47 3 -104 -158 114 8 -39 55 -15 -190 94 12 64 -82 -99 201
3697B01n1l27J85J90m01L96l43L28j96j61K35J1j24r3J64m3j5qQ4j94o2J59J83
$$ 201 150 -177 8 198 -203 193 -150 178 -18 -179 56 67 -57 -150 14 -29 -44 -52 32 -162 -224 -65 118
3720A18K3j26O0n6O6o6K03m67J52M1J01L9j45J00l05L63n2J6l7l01L21k83L82
$$ 118 141 15 75 19 85 19 222 -245 -93 -52 49 88 -57 43 -262 101 49 65 28 -273 48 -235 147
3743A47k36K98q9o2J37j95j56K98j24l9j35K39J13k84l6K14n1o0J92k76J41L3
$$ 147 -89 209 120 58 195 0 -156 142 18 -21 -156 83 196 -88 -124 90 39 -21 171 -105 36 69
3765F9o8k2J10k22L45m41K52j5J53l12J76j06J11L0k13K33MK45n50L07j23RN4
$$ 69 1 -21 89 -133 212 -229 23 8 161 -151 25 -81 30 60 -153 80 84 329 -221 86 -37 -28 26
3788B6p1J0P8J81m10L50m5j47j49K72m9L9K1j91J23j95R1P9M7p3l23M49M1k82
$$ 26 -45 -35 43 224 -186 164 119 -28 -177 95 46 85 106 -85 38 -157 -66 13 60 -13 -336 113 154 -128
3812a28K42n23M57o6P8p6Nj79K71j87NR8q7L0K0q9J89k82K06J80j60J32qk21O5
$$ -128 114 -409 48 -18 60 -16 -11 -190 81 -106 -101 -3 -90 -60 -40 -129 60 -222 -16 164 4 136 128 -93 -28
3837b8K66j52km8R4k22J00l6q0j74L74j97J71R3k61Q3o2J46j75L9L51k25J12J66
$$ -28 238 86 84 36 130 -92 8 -28 -108 -282 92 -105 66 159 -102 -19 -81 65 -110 -71 280 55 167 333
3861C33m55P7J66O9k17O7j57K25J40k88O9j03K49j50J40K42k81r5K45n22L17m4
$$ 333 -122 -45 121 190 -27 40 -117 108 248 -40 29 -74 175 25 165 407 126 31 276 -246 71 27
3883B7q3J04j62R0K6p1q3J90k52M74l05r5P3R1l9K4j88O15m14j44j56J05j7k1
$$ 27 -56 48 -114 -24 2 -69 -152 38 -214 260 -45 -140 -67 24 -15 9 -179 436 22 -122 -278 -173 -190 -211
3907b11L72k88J51L27j15j63k94L4J53J39k18K04l28K42k07J09L05P3j67J4l61
$$ -211 161 -127 24 351 236 73 -221 -187 -34 105 -113 91 -237 5 -202 -93 212 285 118 132 -229
3928b29L87j78J57j34R4J27j18j79K81k38K09j43r0Q8j69J63j96J01O7n0J14j69
$$ -229 158 -20 137 3 97 224 106 -73 208 -30 179 36 -54 34 -135 28 -168 -67 0 -50 64 -105
3950a05P3j16J49J87l25K34l26K65j74K36l29K29J8rl8J1j16K25N4k80L40q2r2
$$ -105 -32 -148 1 188 -137 97 -229 36 -138 98 -231 -2 16 7 -31 -20 -136 89 143 -137 203 121 29
3973B9L5j29M4K5kK3j84N3m2J70k94J88q5Q7P4J83l95K3L07p9L9J8k00R9O8l7
$$ 29 64 -65 -21 4 2 25 -159 -106 -148 22 -272 -84 -169 -82 -8 175 -220 -197 110 31 70 88 -112 -13 55 18
3999A8M4m7j82L18n2M3j81Lk3k00J07j42L75j82j02J23K16J05l08J90j94K71m1
$$ 18 62 15 -167 151 99 142 -39 -36 -59 -259 -152 -294 81 -101 -203 -80 136 241 -67 123 -71 200 159
4022A59P1l19Q9J47k06J71J9R8l56J71J57m1j82j87J42J02j74K88j29l0oJ38j24
$$ 159 230 -89 0 147 -59 112 131 229 -127 44 201 160 -22 -209 -67 35 -139 149 20 -10 -16 122 -2
4045bq2K8J30R5J6j82j37J26j00J26j08J42L9j12K43k07K09k74j41N3K18l23L60
$$ -2 -84 -56 74 169 185 3 -134 -8 -108 18 -90 52 91 -21 222 15 224 -50 -191 -138 80 -243 117
4068A17j73K25k34j21K00J42o0M6j63j43Q9QJ09j4o4J8J83j90R4J25lk63Q8Q8
$$ 117 -56 169 -65 -186 14 156 96 142 -21 -164 -75 -67 42 28 -36 -18 165 -25 69 194 191 -72 16 104
4092A04j84j51P1J74K9m0k9j56L16l89L72q3k51J96j12l9J41j9J53k23mn6j17
$$ 104 -80 -231 -160 14 43 3 -26 -182 134 -255 117 34 -217 -21 -133 -172 -31 -50 103 -120 -124 -180 -297
4115b97N19m43K16k3k23K26M9J9o2Mj39P2L11l97L91j33k21kqn8J62Pl7J31k45
$$ -297 222 -221 -5 -28 -251 -25 24 43 -19 -15 -154 -82 229 -168 223 90 -131 -133 -141 -199 -37 -30 -67 64 -181
4140a81J41j1J80R4k04j14J54k8N8J45j6n33M00j15K02r3k6j04Mo8MJ77k14j71
$$ -181 -40 -51 129 223 19 -95 59 31 89 234 218 -315 85 -30 172 79 53 -51 -47 -115 -111 66 -148 -319
4164c19L88q3J73K1r0R0o8m2q1J13p1j86J45Jq5J79j19Q9j54k11J47L71P7k38
$$ -319 69 -14 159 180 90 180 112 70 -11 102 31 -155 -10 -9 -94 85 -34 55 -99 -310 -163 208 285 47
4188D7J5J28Q2l39qj79K02J67j39R5N9j77M2O1K1n3j10J68k15J04L1Q3N7k70L21
$$ 47 62 190 272 -67 -75 -254 -52 115 -24 71 130 -47 -5 56 77 24 -86 82 -133 -29 2 85 142 -128 193
4213A93n61K78K54j45J41q2O2m81M96k02O2l2k54K60k2KM6K81l62J13l14J37K87
$$ 193 -368 -90 164 19 160 78 140 -341 155 -47 15 -17 -271 -11 -33 -31 15 296 -66 47 -267 -130 157
4236A57m59L70p5j37K15j79PK91J05l31n3O7R9j86Q8L15m47J26r4K88R8j24l2
$$ 157 -302 68 -7 -144 71 -108 -101 190 295 -36 -89 -22 77 -109 -21 294 -153 -27 -121 167 265 141 109
4259A09k34M1J65o7J17J28j02l43L26j16j03Q5j64K15o9nn1P4M6L40l60L62m91
$$ 109 -125 -84 81 14 131 259 157 -186 140 24 -79 6 -158 57 -12 -17 -68 6 52 392 32 394 -97
4282i7l6K90j77L8J53K1Kj95j76L38Kj17j6M8j59JJ83o3j32J31O5j36J64n16L32
$$ -97 -133 157 -20 18 171 192 194 -1 -177 161 163 46 30 78 -81 -80 103 40 -92 39 104 -32 132 -384 -52
4307e2j08k2L48n25L93k42K69n1J71k95qJ51L4Mj62r9J91J81j21j92J77J53j89
$$ -52 -160 -182 166 -359 34 -208 61 10 181 -114 -122 29 63 67 -95 -194 -3 178 57 -135 42 195 6
4330FN0j39j69L76J35k35Mk28J76q5K2J65L2k8r9j20K62k94M2K57k53K70j94m7
$$ 6 56 -83 -252 124 259 24 28 -200 -24 -109 -87 78 110 82 -17 -137 125 -169 -127 130 -123 147 -47 -94
4354i4J08k1J58k90J79j93j2K97J13j7j91p9r7J84J40j12l3Q5j54L14k41j89j0
$$ -94 14 -7 151 -139 40 -153 -165 132 245 228 37 -42 -139 45 185 73 40 125 -29 285 44 -145 -155
4377a55K33J5m6j70P6J4L29n12M54M8l22Rj56K01k7j1J42l58L54M7l00J84j29
$$ -155 78 93 47 -123 -47 -33 296 -216 238 286 -36 -27 -183 18 -9 -20 122 -236 118 165 -135 49 -80
4400h0O8J86m1j94P6J93k53j1L2L6K25j30r7N4j10J31K76j85o5R1L2k81j45K09
$$ -80 -12 174 133 -61 15 208 -45 -56 -24 12 237 107 10 64 -46 85 361 176 111 202 234 -47 -192 17
4424A7j05M34l38J38L4j72K43l85K32j57K40o1n7k68L86j73j23J44j22P4j6J77
$$ 17 -88 346 8 146 180 8 251 -134 98 -59 181 120 63 -205 181 8 -115 29 -93 -19 -35 142
4446A42j96Oj22j2J19j10K63m5J93k04Nj35j11K69j47P8o9Q8k01K86j85K20K6
$$ 142 -54 -48 -170 -182 -63 -173 90 45 238 34 39 -96 -207 62 -85 -7 -76 12 -189 97 -88 132 158
4469A58k87K45j10j58j33J88L17k09m2o6N0j36J25K0q0j55O8L35l48K94k0M3M2
$$ 158 -129 116 6 -152 -285 -97 220 11 -31 -97 -47 -183 -58 -38 -118 -273 -205 130 -218 76 56 99 141
4492A41k58o4L47l29N0J86JJ84l01j55j2L82k19J37j88Q3J11N6o4j17R7l6r1J60
$$ 141 -117 -181 166 -163 -113 73 74 258 -43 -198 -210 172 -47 90 -98 -15 96 152 88 -29 68 32 -59 101
$$ [...]
8191A15
##END NTUPLES=NMR FID
##END=
