##TITLE=1H_IPACAT-33
 CDCl3
 64 sc, 
 2.10.2023
##JCAMPDX= 6.0         $$ Bruker NMR JCAMP-DX V2.0
##DATA TYPE= NMR FID
##DATA CLASS= NTUPLES
##ORIGIN= UXNMR, Bruker Analytische Messtechnik GmbH
##OWNER= root
$$ XWIN-NMR		Version 3.5
$$ Mon Oct  2 13:52:57 2023 Russian Standard Time (UT+4h)  she@DPX200
##.OBSERVE FREQUENCY= 200.13135
##.OBSERVE NUCLEUS= ^1H
##.DELAY= (6, 6)
##.ACQUISITION MODE= SIMULTANEOUS
##.ACQUISITION SCHEME= undefined
##.AVERAGES= 62
##.DIGITISER RES= 18
##SPECTROMETER/DATA SYSTEM= spect
##.PULSE SEQUENCE= zg30
##.SOLVENT NAME= CDCl3
##.SHIFT REFERENCE= (INTERNAL, CDCl3, 0, 15.7039)
##AUDIT TRAIL= $$ (NUMBER, WHEN, WHO, WHERE, WHAT)
$$ ##TITLE= Audit trail, XWIN-NMR		Version 3.5
$$ ##JCAMPDX= 5.01
$$ ##ORIGIN= Bruker BioSpin GmbH
$$ ##OWNER= she
$$ F:/spectra/data/she/nmr/H-F/1/audita.txt
$$ ##AUDIT TRAIL=  $$ (NUMBER, WHEN, WHO, WHERE, WHAT)
(   1,<2023-10-02 13:52:00.39 +0400>,<she>,<DPX200>,
      <continue with go, POWCHK disabled, PULCHK disabled
       configuration hash MD5:
       00 E9 B6 7A A2 85 ED C7 34 08 36 98 17 FE 4E 26
       data hash MD5: 16K
       AD F3 10 D5 50 92 26 50 E4 6D 95 CA 48 9A 2D 0A>)
$$ ##END=
$$ 
$$ hash MD5
$$ E8 62 36 4F 37 84 22 D6 84 7A 3F BC E9 92 9E 9D
##$RELAX= 
##$RELAX= 
##$RELAX= 
##$RELAX= 
##$RELAX= 
##$RELAX= 
$$ Bruker specific parameters
$$ --------------------------
##$DU= <F:/spectra>
##$EXPNO= 1
##$NAME= <H-F>
##$PROCNO= 1
##$TYPE= <nmr>
##$USER= <she>
##$AMP= (0..31)
100 100 100 100 100 100 100 100 100 100 100 100 100 100 100 100 100 100 
100 100 100 100 100 100 100 100 100 100 100 100 100 100 
##$AQSEQ= 0
##$AQ_mod= 1
##$AUNM= <au_zg>
##$AUTOPOS= <>
##$BF1= 200.13
##$BF2= 200.13
##$BF3= 200.13
##$BF4= 200.13
##$BF5= 200.13
##$BF6= 200.13
##$BF7= 200.13
##$BF8= 200.13
##$BYTORDA= 1
##$CFDGTYP= 0
##$CFRGTYP= 5
##$CHEMSTR= <none>
##$CNST= (0..31)
1 1 145 1 1 1 1 1 1 1 1 1 1 1 1 1 1 1 1 1 1 1 1 1 1 1 1 1 1 1 1 1 
##$CPDPRG= <>
##$CPDPRG1= <>
##$CPDPRG2= <>
##$CPDPRG3= <>
##$CPDPRG4= <mlev>
##$CPDPRG5= <mlev>
##$CPDPRG6= <mlev>
##$CPDPRG7= <mlev>
##$CPDPRG8= <mlev>
##$CPDPRGB= <>
##$CPDPRGT= <>
##$D= (0..31)
0 1.2 0 0 0 0 0 0 0 0.06 0 0.03 0 0 0 0 0.0002 0 0 0 0 0 0 0 0 0 0 0 0 
0 0 0 
##$DATE= 1696240090
##$DBL= (0..7)
120 120 120 120 120 120 120 120 
##$DBP= (0..7)
150 150 150 150 150 150 150 150 
##$DBP07= 0
##$DBPNAM0= <>
##$DBPNAM1= <>
##$DBPNAM2= <>
##$DBPNAM3= <>
##$DBPNAM4= <>
##$DBPNAM5= <>
##$DBPNAM6= <>
##$DBPNAM7= <>
##$DBPOAL= (0..7)
0.5 0.5 0.5 0.5 0.5 0.5 0.5 0.5 
##$DBPOFFS= (0..7)
0 0 0 0 0 0 0 0 
##$DE= 6
##$DECBNUC= <off>
##$DECIM= 32
##$DECNUC= <off>
##$DECSTAT= 4
##$DIGMOD= 1
##$DIGTYP= 9
##$DL= (0..7)
0 120 120 120 120 120 120 120 
##$DP= (0..7)
150 150 150 150 150 150 150 150 
##$DP07= 0
##$DPNAME0= <>
##$DPNAME1= <>
##$DPNAME2= <>
##$DPNAME3= <>
##$DPNAME4= <>
##$DPNAME5= <>
##$DPNAME6= <>
##$DPNAME7= <>
##$DPOAL= (0..7)
0.5 0.5 0.5 0.5 0.5 0.5 0.5 0.5 
##$DPOFFS= (0..7)
0 0 0 0 0 0 0 0 
##$DQDMODE= 0
##$DR= 18
##$DS= 0
##$DSLIST= <SSSSSSSSSSSSSSS>
$$ [...]
##$SUBNAM2= <"">
##$SUBNAM3= <"">
##$SUBNAM4= <"">
##$SUBNAM5= <"">
##$SUBNAM6= <"">
##$SUBNAM7= <"">
##$SUBNAM8= <"">
##$SUBNAM9= <"">
##$SW= 18.05172834244
##$SWIBOX= (0..15)
0 0 2 0 0 0 0 0 0 0 0 0 0 0 0 0 
##$SW_h= 3612.71676300578
##$TD= 16384
##$TD0= 1
##$TE= 0
##$TE2= 300
##$TE3= 300
##$TEG= 300
##$TL= (0..7)
0 120 120 120 120 120 120 120 
##$TP= (0..7)
150 150 150 150 150 150 150 150 
##$TP07= 0
##$TPNAME0= <>
##$TPNAME1= <>
##$TPNAME2= <>
##$TPNAME3= <>
##$TPNAME4= <>
##$TPNAME5= <>
##$TPNAME6= <>
##$TPNAME7= <>
##$TPOAL= (0..7)
0.5 0.5 0.5 0.5 0.5 0.5 0.5 0.5 
##$TPOFFS= (0..7)
0 0 0 0 0 0 0 0 
##$TUNHIN= 0
##$TUNHOUT= 0
##$TUNXOUT= 0
##$USERA1= <user>
##$USERA2= <user>
##$USERA3= <user>
##$USERA4= <user>
##$USERA5= <user>
##$V9= 5
##$VALIST= <valist>
##$VCLIST= <CCCCCCCCCCCCCCC>
##$VD= 0
##$VDLIST= <DDDDDDDDDDDDDDD>
##$VPLIST= <PPPPPPPPPPPPPPP>
##$VTLIST= <TTTTTTTTTTTTTTT>
##$WBST= 1024
##$WBSW= 4
##$XGAIN= (0..3)
0 0 0 0 
##$XL= 0
##$YL= 0
##$YMAX_a= 45043
##$YMIN_a= -129939
##$ZGOPTNS= <>
##$ZL1= 120
##$ZL2= 120
##$ZL3= 120
##$ZL4= 120
##$ABSF1= 10
##$ABSF2= 0
##$ABSG= 5
##$ABSL= 3
##$ALPHA= 0
##$AQORDER= 0
##$ASSFAC= 0
##$ASSFACI= 0
##$ASSFACX= 0
##$ASSWID= 0
##$AUNMP= <proc_1d>
##$AZFE= 0.1
##$AZFW= 0.1
##$BCFW= 1
##$BC_mod= 2
##$BYTORDP= 1
##$COROFFS= 0
##$CY= 11.3945322036743
##$DATMOD= 1
##$DC= 2
##$DFILT= <>
##$DTYPP= 0
##$F1P= 15.7292609196834
##$F2P= 12.9074282941183
##$FCOR= 0.5
##$FTSIZE= 0
##$FT_mod= 4
##$GAMMA= 1
##$GB= 0.15
##$INTBC= 1
##$INTSCL= 1
##$ISEN= 128
##$LB= 0.24
##$LEV0= 0
##$LPBIN= 0
##$MAXI= 10000
##$MC2= 0
##$MEAN= 0
##$ME_mod= 0
##$MI= 1.114404
##$NCOEF= 0
##$NC_proc= 0
##$NLEV= 6
##$NOISF1= 3.799351
##$NOISF2= 2.8
##$NSP= 1
##$NTH_PI= 0
##$NZP= 0
##$OFFSET= 15.70392
##$PC= 1
##$PHC0= -21708.1
##$PHC1= 9.652711
##$PH_mod= 1
##$PKNL= yes
##$PPARMOD= 0
##$PSCAL= 0
##$PSIGN= 0
##$REVERSE= no
##$SF= 200.130013532006
##$SI= 16384
##$SIGF1= 3
##$SIGF2= 2
##$SINO= 400
##$SIOLD= 16384
##$SREGLST= <1H.CDCl3>
##$SSB= 0
##$STSI= 0
##$STSR= 0
##$SW_p= 3612.71676300578
##$SYMM= 0
##$S_DEV= 0
##$TDeff= 0
##$TDoff= 0
##$TI= <>
##$TILT= no
##$TM1= 0
##$TM2= 0
##$TOPLEV= 0
##$USERP1= <user>
##$USERP2= <user>
##$USERP3= <user>
##$USERP4= <user>
##$USERP5= <user>
##$WDW= 1
##$XDIM= 8192
##$YMAX_p= 0
##$YMIN_p= 0
$$ End of Bruker specific parameters
$$ ---------------------------------
##NTUPLES= NMR FID
##VAR_NAME=  TIME,          FID/REAL,        FID/IMAG
##SYMBOL=    X,             R,               I
##VAR_TYPE=  INDEPENDENT,   DEPENDENT,       DEPENDENT
##VAR_FORM=  AFFN,          ASDF,            ASDF
##VAR_DIM=   8192,          8192,            8192
##UNITS=     SECONDS,       ARBITRARY UNITS, ARBITRARY UNITS
##FACTOR=    0.0002768,     1,               1
##FIRST=     0,             0,               0
##LAST=      2.2672688,     0,               0
##MIN=       0,             -129939,         0
##MAX=       2.2672688,     45043,           0
$$ Real data points
##PAGE= N=1
##DATA TABLE= (X++(R..R)), XYDATA
$$ [...]
2632A001J0L93j32j118Q31m38p35j31N0k84r53N05m40L30q88J507m77M49jp3M46
2653a48p36L87Q33P81J15n7l14J41P01j272N65Q88o87k59J34n13l49l49K22r19
2673h36J82k1m92n11l8J95j4R48n90O83J04L95r83N03J323l78M24j02K92O12j042
2694F54Q06m96J37k11p0n85J6K59k68j22J28j097l28L99n96m19j21J693j167q9
2714a477R25O20j57j70m50M30M81J36N92l28Q90j75p89Q84m21Q0j71n06K10l03
2734C01k78K1l37m76N2j08J99J16m18M73q12j22N90L09M37l84J10LR67k79R17
2755A281o42j59Q70L68k01L59j131L93q74J97k74j96N16l19o82l24M70j077M40
2774i85p9m71j7N09O89m15L81k33j19J166J5O63l47N82m22k3L86K79n67L19l9
$$ y = [1001, 1011, 1404, 1272, 154, 985, 547, -188, -319, -269, -553, -1506, -1001, -1441, -1111, -1999, -492, -969, -520, -521, -594, -148, -884, -497, 336, 1117, 1232, 1175, 861, 1002, 1703, 431, 996, 1884, 1197, 938, 1072, 559, 210, -139, 83, -836, -654, -675, -1167, -1678, -1716, -1521, -1535, -587, -1177, -494, -390, 5, -978, -475, 848, 470, 894, 792, 1084, 1696, 654, 1460, 964, 1101, 890, 820, 235, 251, 510, 242, 120, 248, -849, -1177, -778, -1374, -1793, -1914, -221, -1388, -1477, -552, 68, -89, -259, -709, -279, 202, 338, 930, 602, 1492, 1317, 528, 1412, 991, 1071, 900, 394, 604, 301, 23, 44, -293, -769, -717, -825, -626, -510, -928, -455, -1267, -1389, -799, -490, -53, -437, -327, -324, 643, 364, 1281, 639, 480, 1350, 1718, 1517, 1876, 745, 1138, 264, 461, 187, -9, 507, 188, -494, -818, -348, -1425, -985, -1064, -1535, -1552, -1043, -354, -769, -388, -621, -740, 426, 441, 1104, 757, 1339, 917, 894, 1280, 1559, 992, 1311, 1272]
2795A272n17m12L79l80o85l85O2n09P84l71o4J63n85q28O79L66O41o11M98N97
2815I4j50N37M3l4l98R84k23j86O24Q30p67M31q85p0k88j83o85N54j96p70L79
2836c59j33q2p27oO76j114J141j90m4L25Q12n79o87J093k59L89J191j1n72P9R13
2857A856j267K98n03J015j127n63M05k47L48l29j94K02m99q02P96l30p14K01k31
2876a685J045K96m85N76M98l21Q35L17l17m42K01N35K18m00K2r92O53l01j50Q90
2896I93m88j71j256kj4k26k1J473j213l53j67J006J15k99O38m45M64O26k91n2
2916C17J047n38J71J11L01r08j34J58L74k7j609J829j635L25m62J11M12r16R1
2935i82P34j055j74N49L84l80J18R12Q0q23N12L33M82Ol71J62N28m47P71l55o87
$$ y = [1272, 755, 343, 722, 342, -343, -728, -666, -1175, -391, -762, -826, -663, -1248, -2076, -1397, -1031, -390, -1001, -503, 94, -56, 481, 524, 490, 92, 1076, 853, 667, 1291, 2121, 1354, 1785, 900, 830, 542, 359, -326, 228, 32, -738, -359, -492, -574, -1301, -1307, -631, -1745, -604, -794, -838, -513, 299, -280, -967, 126, -133, 256, 1447, 1436, 864, 943, 1856, 589, 887, 384, 1399, 272, -291, 114, -133, 215, -114, -308, -106, -605, -1407, -611, -941, -1655, -1454, -1685, -640, -344, -829, -253, 245, -76, 759, 1076, 759, 317, 518, 1053, 1271, 871, 893, -99, 554, 253, 103, 993, 505, 334, -922, -924, -938, -1164, -1185, 288, -925, -1278, -1445, -439, -324, -623, 15, -430, 34, 660, 369, 317, 1364, 826, 997, 1108, 1409, 501, 367, 525, 899, 872, -737, 1092, -543, -218, -680, -569, -157, -1073, -982, -248, -1303, -1477, -928, -544, -924, -806, 106, 186, -637, -125, 208, 690, 696, 325, 487, 1015, 568, 1339, 984, 297]
2956B97Q06k81j61l33j05q71L72L87q25j43L44o23M03p16l75J011P24J83l52M38
2976A80k12k94L79J253j086n6L47J164q17j82J9K14j75J00j59l64n80M08L06j607
2996a162J51P01q48J19r9K16l22j62l09J099N43n51O3J315l05M74r08O33L86k9
3016A005k89J6j2N18q10N82n86M13l57J8l07j278L25P54p64k46P5p33J367o27
3036i36J91k44J80j00Q69N40L2l63N30r7J34N71o0K61q97K50r3L86j09r63k69
3057a87R81k1n81m98r84L40l38R01p86N3K52J42M89k68R3k15M88o96K85Q26M09
3078F85J130j627Q56j1o01N19o7O40j147Q9j98j66r68r7O66l97m01r5k3L61K40
3099f12L1k00O41n78M06M23n34kJ124m06K45n93R42K6q8L35q96M33k03K65Q8n60
$$ y = [297, 1103, 822, 661, 328, 223, -648, -276, 111, -714, -857, -513, -1136, -733, -1449, -1824, -813, -89, 94, -258, 180, -32, -326, 53, 1306, 220, 164, 511, 1675, 858, 676, 695, 909, 734, 834, 675, 311, -269, 139, 445, -1162, -1011, -310, -1158, -1039, -1138, -922, -1244, -1406, -1715, -616, -73, -624, -561, 754, 449, 923, 15, 648, 1034, 1005, 716, 732, 720, 1238, 428, 1010, 424, 837, 480, 498, 191, -1087, -762, -8, -772, -1018, -943, -1676, -309, -936, -745, -989, -809, -909, -40, 500, 532, 169, 699, 602, 736, 1307, 1247, 1508, 611, 861, 768, 1154, 1045, 82, -187, 794, 773, 192, -306, -1290, -950, -1288, -387, -1173, -1120, -868, -726, -237, -505, -412, -627, -139, -835, -550, 276, 685, 1815, 188, 1044, 1033, 432, 951, 884, 1524, 377, 466, 268, 102, -866, -963, -297, -694, -1095, -1190, -1213, -852, -612, -581, -781, -140, -718, -312, 111, -423, -425, 699, 293, 538, -55, 887, 913, 825, 1160, 264, 697, 494, 759, 847, 287]
3121B87K25n58m37J48p4m17R0M7O67q15k71M36l37J34O55m4k0n44P82J50P97j50
3143G51k58O22o95N06j95o53L35J76%L21o12N52j181j09l04m30K14O62J6k13m82
3164i77Q8m42O53M56L72m70K98k72O54P5o94O11J52O24p93Q79k4o57n37Q87m42
3185D41j46j64k35k21m7M98r99j04J27K96k8N59j066M01L36n19J202m28O54q95
3205c38Q49R9N0J98l24P30j106J477r17N15m40j155J008n48n9J14j479M7Q43j343
3225a779Q92L99l9m00o35Q74M73mL75k93%m42J053k90K49k6R4J76K25n64l12M47
3247D73L87r86O46m59n90J79N25j84j627M89J092r87N19q5q15J332q12P55o65
3266h13K85K35N23n91P33O65m27j12j53Q05m30J28J75r3j48l38j44L01j161J94
$$ y = [287, 512, -46, -483, -335, -409, -826, -736, -689, -22, -837, -1108, -672, -1009, -875, -220, -264, -284, -828, -46, 104, 901, 751, 493, 1115, 420, 926, 731, 78, 413, 589, 589, 910, 298, 850, -331, -440, -744, -1174, -960, -298, -282, -495, -977, -889, -1331, -678, -222, 150, -320, -22, -294, 360, 435, -259, 352, 504, 1128, 335, 1214, 1190, 533, -4, 883, 441, 295, 131, -104, -325, -372, 126, -873, -977, -850, -554, -582, -23, -1089, -688, -352, -871, 331, -97, 557, -338, 511, 610, 660, 858, 534, 1264, 158, 1635, 718, 1233, 793, -362, 646, 98, 39, 153, -1326, -1279, -436, -1779, -887, -488, -527, -927, -1562, -688, -215, -219, 156, -137, -137, -579, 474, 184, 433, 407, 501, 677, 902, 338, 26, 473, 860, -126, 520, 61, -529, -350, 175, -9, -1636, -1147, -55, -1042, -523, -608, -1423, -91, -903, -148, -813, -528, -293, 230, -361, 372, 1037, 610, 498, 345, 1150, 720, 848, 1023, 930, 782, 444, 300, 601, -560, -366]
3286c66k73o24M32K38J79k53l36N10o91O90Q7N72j38l2k35P51o31K00j63J026
3306I43l66L21q5k22L90r3k70o24K13k70J97n26k96P60q8m61L4n99j68L45K44
3327f21j72K64P45n37M7K61K46L50N01m81L3L86M05p74l68o4J073o25j59j02j53
3348B55k1j313J525q96r9j97O2j2M6k7K76O27j129Q55n58L40l05P59L17L79k21
3369F63R4k83J35N90k73p10N40J32o82m4L1J56n81j21rL50q07k99%Q24K1o38R55
3392D4j062K23P51n17M51K02K19o04O33k30M86R29j516O54K33n51o6K84k95N82
3412H50j23r80K23M17q40L7j61l63L15O77j302P42K72l23L22r7K45O78m62K13
3432C40K41k02n0j50M14n91J549j020k07k2m37N66J73q95L55o43K99J97l58q66
$$ y = [-366, -639, -1263, -831, -593, -414, -667, -1003, -493, -1184, -494, -407, 165, 27, -5, -240, 511, -120, 80, -83, 943, 577, 898, 813, 591, 981, 888, 618, -6, 207, -63, 134, -392, -688, 72, -16, -477, -443, -1042, -1210, -865, -621, -793, -529, 216, -321, -274, -13, 233, 583, 1084, 603, 636, 1022, 1427, 653, 285, 221, 1294, 669, 510, 408, 255, 234, -1079, 446, -450, -549, -746, -684, -696, -650, -677, -401, 226, -903, -48, -606, -266, -571, 188, 505, 884, 663, 757, 474, 609, 1199, 926, 216, 756, 888, 206, 162, 193, 349, -232, -353, -362, -12, -819, -1118, -1118, -294, -273, -911, 44, -1018, -795, -44, -561, -110, 92, 311, -293, 340, 110, 596, 1525, 9, 663, 896, 345, 279, 563, 268, 850, 727, -253, -30, 387, -453, -416, -577, -940, -625, 52, -1250, -508, -236, -559, -237, -334, -89, 589, 127, 340, 581, 379, 329, 179, 593, 2, 1551, 531, 324, 302, -135, 431, 604, -291, 64, -579, -280, -83, -441, -1307]
3452a307N99Q2l27O90L4l10K18L41m33O8L50K17L17k87L37K7n79R28l14l0l26
3473B95J36k63L67j52n84O2l29P8R4l73j30N4J03P27o27M03p14M72n41M90n1M59
3495b4J26M90J02n09R04j139J435r41J33K77o0o04K1J27K21O1n24m68N20m32q0
3516c64j80O1l03k91M04J42K11l18N32J46m10P72K44M18m22l78K83M97q65n08
3536c29J112m48M61k24l23M81j140R3K18K78l47m76N20q61J39N79p01K05J61N62
3556d0m51R29o25N4K83K17M16k09j10l67J19M63K33p32L72M01j580J180l40k34
3576b1J57m96L78k39n14n9QL55o4K72J05k03J97j64l20L67N24n03J031J50j054
3597i3N06R8M0p1o23M91J88m89J6K5j5J36l32m47Q58n75l58j36J54j59K07K86
$$ y = [-1307, -708, -626, -953, -263, -229, -539, -321, 20, -413, -345, 5, 222, 539, 252, 589, 616, 37, 965, 651, 621, 295, 431, 168, 535, 383, -201, -139, -468, -390, -296, -669, -799, -745, -642, 85, -542, -139, -853, -381, -922, -432, -483, -24, 102, 592, 694, 185, 1089, -50, 1385, 444, 577, 854, 794, 190, 211, 338, 559, 620, 96, -372, 148, -284, -364, -544, -483, -786, -1077, -673, -531, -320, -638, -106, 40, -370, 402, 646, 1064, 642, 264, 547, 1044, 179, -329, 783, 335, 796, 572, 249, 730, -410, -317, -99, 179, -168, -644, -124, -985, -846, -267, -968, -763, -602, -40, -491, 438, -187, -133, 150, 367, 783, 574, 464, 97, 216, 679, 912, 180, 552, 953, -627, 553, 213, -21, 136, -360, 18, -221, -735, -794, -786, -431, -495, -223, -118, -321, -124, -288, -608, -241, 283, -220, 811, 961, -93, 413, 511, 551, 480, -143, 348, 536, 47, 63, 88, 73, 209, -123, -570, 288, -287, -645, -781, -627, -786, -579, -293]
3619b93l47J99p58J190N02L21q09M29M55n30K71m03k28R46j029N82K37j37m10
3638A88K38o80o4J52o84L41R8L18j29q38J367j109K76P08n03pK21k2J49K38q1
3659A77Q50j007K97l18J254r89k82J053l29n74kJ30k20L76p48L65l35n76M30l92
3679h40M33m42O63k23m13J55N27l99L22k56K73J05J085m61n51j5O66k9l44L05
3699E61q66K04L42N9l97q8N8N88r07M55o7r06J18M15L64q19K18R34j485J055O73
3720E09j212J183p59K59L74L06j23p06N00l24R90p30M28k12L56l59p05O3M0J55
3740C3Q4q77Q7L90L42l09K3l0J60l82J99N84J88n25N5O2K53M96k7j34r44O09K57
3763E94m62q8k11L31K05l99K00l01Q5k15j10N35j181J027po57j4k20R00j141J27
$$ y = [-293, -640, -441, -1199, -9, 493, 814, 5, 434, 889, 359, 630, 227, -1, 945, -84, 498, 735, 598, 188, 426, -254, -318, -166, -850, -509, -411, -93, -222, -1060, 307, -802, -526, 182, -321, -328, -107, -129, 20, 258, 177, 1027, 20, 317, -1, 1253, 264, -18, 1035, 706, 132, 130, 260, 40, 416, -332, 33, -302, -878, -448, -840, -407, -849, -186, -409, -822, -667, -140, -539, -217, -473, -200, -95, 990, 529, -22, -37, 629, 600, 256, 561, -305, -101, 241, 300, -97, -185, -127, 461, -446, 9, -58, -964, -846, -431, -67, -886, -668, 266, -1219, -164, 509, -703, 480, -279, -20, 354, 660, 537, -169, 331, 7, 997, 267, 695, 483, 839, 480, -225, -162, -122, 33, 117, -760, -673, -283, 59, -250, -227, -257, -97, -479, -280, 304, 492, -33, 22, 84, 337, 833, 806, 672, -272, 337, 594, 132, 44, -167, 164, 369, -30, 170, -131, -46, -261, -371, 164, -1017, 10, 3, -654, -668, -888, 12, -1129, -1002]
3784a002R81k77o5M75J017l40n21P21l88m32n42P49M80l41q90L17L94n80j79o66
3804a089J064m65j70N39j41k02K15j13L1m70K76l10J662m72K6m90O42o59M51L6
3824C61N30j0n17P63j382P6m2P25R5r51J65Q00j415P21l17j53K12q0L60J69m54
3845c44j70N06n8N37p61NO95K43m38P02p89K12J50M84m14R8k35m45K49q06M33
3866a46k42L32J59n0j81p08N62m88nJ164j246Q88q7J4J49j61M94J90k42m85L24
3887B35kj08N4N18l08l09N26n10J23J86j210P01R3n71N9O66o27o19J036m61j47
3908f75R36m12j37L32k56R4l31L88k11J003No28N20r83J287m58K31r92J09L69
3928A91l02m13Q8P9J130r13p14L40j11m4j58O30L76j032k8P84k26L73l41N61k97
$$ y = [-1002, -21, -298, -363, 112, 1129, 789, 268, 989, 601, 169, -373, 376, 856, 515, -375, -58, 336, -244, -423, -1089, -25, -490, -660, -121, -262, -464, -249, -362, -331, -801, -525, -835, 827, 355, 381, -109, 533, -126, 325, 361, 891, 881, 364, 1127, -255, -179, -221, 504, 599, -352, -187, 613, -802, -81, -398, -551, -339, -419, -59, 110, -344, -514, -8, -66, 471, -290, -285, 410, 653, 215, 917, 128, 340, 490, 974, 560, 658, 423, -22, 227, -579, -146, -388, -56, 103, 53, -128, -836, -274, -762, -767, 397, -849, 39, -48, -34, 115, -46, 448, 638, 396, -89, 235, 233, 125, 179, 697, 389, 80, 606, 96, 219, 405, -805, -104, -11, -582, -523, 143, -484, -1103, -67, -528, -675, 261, -151, -288, 44, -212, -118, -449, -61, -272, 731, 736, 108, 628, -355, 932, 474, 705, -287, -178, 191, -111, -524, -436, -357, 773, -140, -854, -514, -625, -669, -827, -197, 179, -853, -881, -97, -323, 50, -291, 270, -27]
3949b7m58P06L47l58J31J91k1n38Q66o87J90J02o59P0J09K64o9q8r28R74n00O54
3971B71m60L46n21M79k58k74J70K13o36N81K12J81K72m45M17l63j30K80L75O17
3991A327j133o5J40m27K4L7k01j00L28J88Q3o00P56j221O21L64rJ65j22J9l61
4012a87Q84j87p26O02k74M6k05K65j86J39n21O66o74L87N7N2o21k63N32J46m45
4033e13k62L00o9N11L86n91L24R5j74M0N99r41R98l49j09r8n59P34j43N35j77
4054E37L80m28n14m60O55L71m93K05j184P15j65P00m65l0J26K32p63J28M79l64
4074c38J15J91P00j292J067L83j107K39M66J09L0p50K72l36J308q28M90n11j82
4093B6J01m16M63o86R1k53L91m63R8Q99j073j28J064o21R18K1k70k1m07P80n79
$$ y = [-27, -485, 221, 568, 210, 341, 532, 511, -27, 839, 152, 342, 444, -215, -145, -36, 228, 159, 71, -857, 117, -383, 271, -189, 157, -364, 115, -143, -417, -247, -34, -670, -89, 123, 304, 576, 131, 548, 185, 55, 335, 710, 1327, 194, 129, 269, -158, -134, -97, -298, -398, -70, 118, 201, -399, 357, -864, -243, 121, 112, 277, 155, 174, -187, 697, 510, -216, 386, 112, 158, -47, 218, 32, 171, -350, 316, -358, 29, 86, 138, -483, -746, -214, -68, -513, -775, -475, -544, -33, 353, -238, 86, 181, 7, 47, 646, -295, 703, 354, 245, 147, -412, 322, 179, 714, 537, 917, 489, -25, -485, 170, 541, 48, 253, -931, -216, -381, 319, -146, -176, -50, 182, -581, -453, 26, -338, -223, -32, 668, -624, 443, 826, -281, -42, 424, 533, 563, -187, 85, -251, 1057, 229, 719, 208, 26, 127, -289, 174, -512, -421, -674, -283, -746, -648, 251, -822, -950, 114, -507, 411, 432, 162, 141, -266, 514, -65]
4114f5L2p8J80K32o12K48j75L86l46K97l72M22n07J09j97k07K95j36o19J022L58
4135B67o77K95L49J17l48O60q58L82q0N41m66O89j133M74P70o91N57j91j162K75
4155b30p9M51l18k51j53Q08K13r76n09R32l41K93j94o17J07J518q90M93J21n63
4175a85M72O7l77O83m63J3J094j073K11o29n20J387q83l64M65l68L65K0R2n72
4195e65Q55n08K01n05N10m86L44l7J32M7L54o3m77J276r79N9O41j13o6o04M02
4216D18J82l66l94N0o19P18l39j51J58K65k2k59M72m99k78M56N93k98m50N80j93
4237B4n23n9P99M64p84N23mo07K90L26l79l10J04j35K33j86q48P19Q19n99O70
4258E37j037M48o79L0J015j030K91J17O42J74m37k33L81J95k09K84k05K34l18
$$ y = [-65, -33, -111, 69, 301, -311, -63, -238, 148, -198, 99, -273, 149, -358, -249, -446, -653, -358, -494, -1113, -91, 267, -410, -115, 234, 351, 3, 663, -195, 187, 107, 648, 182, 871, -262, 212, 982, 291, 848, 657, -505, -230, -309, 142, -176, -427, -580, 228, 441, -535, -1044, -112, -453, -160, -354, -971, -864, 654, -236, 257, 378, -185, 287, 354, -23, 660, 197, 210, 1304, 231, 442, -187, -707, 680, -203, -567, -102, -470, -105, -85, 7, -565, 290, -218, -17, -522, -12, -498, -154, -191, -59, -12, 342, 279, -198, 1078, 99, 158, 799, 686, 620, 16, 418, 600, 234, -160, -110, -729, -11, -350, -501, -343, -78, -100, -359, 113, -386, -664, -208, 385, 87, -363, 217, 24, -499, -558, 241, 705, -79, 444, 440, -167, 123, 449, 70, -240, -136, -271, -38, -224, -1072, -353, 466, -133, 537, -500, -52, -731, -701, 314, -716, -425, -308, 334, 508, 71, -162, 219, 414, 205, 489, 284, 518, 200]
4277B00j75o04R89J11k22q4l42O63l04j023J001p97N13o03L93l62n2L24J04P30
4297D60k96p94N39J56k19mL26L29K07k13k19J47J48q72R81l65k53N17p01R9k01
4318b28j06O34q67O16m00k3L63J08n08qJ86l63Q66q06M51K19K14L30j371L70L74
4339E1k99L63L28L23q96L33p60J095o19l94J49J98k52Q46R2p79p51M4J424n84
4359h8m50oM91j68M2k50j16J94Q16k07M14m63J26q80L59J50n95M32M31M12n65
4380G9m73L57Q4j52M93j68k23j153J553n42R3k68J50q7K43p56Q87L18j94n15K13
4401f1K90n22O14M83n43o79R09K01o68K58j14m30l48N5Q4L80J66j10o2L06n84
4422c75O32k53k98J14l86J082m47k70j48J098j59M3m69r1M4k20L14j65N90q29
$$ y = [200, 25, -579, 410, 521, 299, 215, -127, 536, 232, -791, 210, -587, -74, -677, -284, -646, -698, -374, -270, 460, 164, -630, -91, 65, -154, -158, 168, 497, 704, 491, 272, 419, 567, -305, 676, 311, 58, 575, -126, -27, -228, -334, 300, -567, 49, -351, -374, -11, 97, -411, -419, -233, -596, 270, -536, -85, 134, 348, 678, -693, -323, 51, -248, 115, 443, 766, -130, 203, -557, 538, -81, -475, -326, -128, -380, 466, 558, -221, -972, -928, 496, -88, -538, -544, -53, -221, -179, -429, -545, -351, 465, 258, 672, 209, 335, -545, -186, -36, -631, -199, 232, 644, 79, -394, -37, 47, -105, 388, 220, -3, -1156, 397, -145, -52, -320, -170, -257, -14, -770, 117, 435, 241, -274, -61, 229, -293, 321, 804, 261, -418, 491, 692, 24, 282, 168, -262, -610, -555, -471, -91, 75, -35, -97, 209, -375, 257, 4, -294, -180, -566, 516, 69, -201, -349, 749, 590, 633, 164, 73, 117, -103, 211, 46, 636, -193]
4442a93O15K64n64K84o68L20J33n87m6K77M52J78m88m27O5l67J130o12K48J45
4462A59n97K51O34r1J30n26JM58l89J94L62m12L82l68l74O57m59K23j282R43l38
4483d42N94l35L65m99R6Jj57M56l66P81l24n83O1R86O2J11j278R84o8l37M93p47
4505a46N44o88Q10j013k04J601r85J08l89J36N5l20P39r22J42O4Q08J7o8j79N67
4526F77j049K96jn67J005k76L13K18k64k95L82k3m74m74%o4P21L37Q7k96l88j40
4548b75p16Q25k69Q09k15l23L27p59P30m54J42L12o11N09J12p29J111l06J2l96
4568a64L45o18p0P76n71L22j106O77Q8J96Q22j374L56O5M78p62J11L65l8N6J13
4589F7m50J87M01r83P43J41M33o8k07J33q03N01l47M76L2r99R47m66l09L74J45
$$ y = [-193, 422, 686, 122, 406, -262, 58, 191, -396, -442, -165, 287, 465, -23, -450, -385, -752, 378, -234, 14, 159, -438, -187, 447, 356, 486, -40, -39, 419, 30, 224, 586, 174, 556, 188, -186, 471, 12, 235, -1047, -104, -442, 152, -183, 182, -317, -221, -220, -377, 79, -287, 494, 170, -413, -352, 634, 696, 807, -471, 513, 445, 108, 601, -146, 398, -290, 520, -493, -697, 904, -81, 27, -362, -226, -171, -491, 248, -674, -532, -468, 340, 357, 289, 110, 677, -372, -76, -77, -644, 361, 85, 398, 616, 352, 57, 439, 416, -58, -532, -532, -596, 125, 462, 549, 253, -135, -275, -991, -166, -435, 374, 159, -164, 163, -596, 134, -320, -178, 134, -477, 32, 144, -585, 526, 220, 232, -164, 181, -437, -507, 269, -302, 20, -1086, -409, -321, -125, 697, -677, -321, -256, 222, -540, -429, -64, -102, -46, 67, -383, -196, 205, -778, -35, 106, 539, 471, 264, 397, -406, 95, -252, 224, 256, -743, 204, -262, -571, -197, -52]
4610e2m23J77L46k75J74j47k61O54o5k61N11o51o40J646m84J03o64P64k5L24o99
4631E2k98O81J01o17K2j86r6K52L96k73k10M11k27j37l11O10m79L93m41J80p34
4652i11R48RM84j64k47J10p59M81n0j5J14p20J288j70o84N08P1o03k56l36M95
4673d07RR67j174k92N84N08j57l09J32o27m7N48O88o64M32N1p24N38J07j8l69
4694b24j65J10P54m43M1m37O91p7l21K03k18m0Q47p19o62K17k56M6P04j38l75
4715d62L80K47k00M68o46R0N1M31l54J16J100j271N86l52K97Mm5m90l92L13j69
4736b98l23O60K11k26N94l67j67o56M7L90l9j67l45L4K16L05j49M00N94j83l98
4757A33q4j4J001o06n63K04O62l23M7j096L79j66J003n51m18M60O18j193N40J0
$$ y = [-52, -475, -298, 48, -227, -53, -200, -461, 193, 128, -133, 378, -273, -913, 733, 249, 352, -312, 452, 427, 751, 52, -246, 435, 536, -81, -59, -245, -341, -89, 307, 34, -176, 235, 8, -129, -440, 170, -309, 84, -357, -177, -911, 37, 46, 530, 366, 119, 229, -530, -49, -99, -114, 0, -720, 568, 398, -286, 222, 293, -310, -566, -902, -407, -398, 569, -605, -897, -313, 195, 38, -271, -139, -766, -813, -265, 423, -241, 191, 242, -482, 56, 163, 145, -224, -389, -279, 475, 32, 73, -364, 327, 250, -71, 132, -86, -126, 721, 2, -660, -443, -699, -653, 51, -87, -462, -82, 165, -35, 433, -213, -123, -72, 359, 5, 121, 1221, -50, 536, 184, 481, 485, 440, -50, -442, -129, -298, -621, 39, 250, 24, 618, 251, 84, -572, -525, -135, -174, -341, -686, -652, -436, -131, -280, 120, 714, 531, 133, 49, 35, 1036, 430, -133, 71, 733, 410, 457, -639, -260, -426, 577, 26, -392, 68, 686, -507, 33, 43]
4777D3m51J79k26O93j36K6L59l14mm64N41k14J74M77j015q2M22M95m09k48R76
4798H22l0j226L28m30J72j3Q96j061K77k03L24M48n6q50L16l81L41P56J06m89
4818D7J38J99j64j91J01J29o28J306j007j88N67l11p8q3M25m36O4l18N52m37l08
4839f21L54K16m92K64m4O94k7j43l7P07r0m98k26L9M07l62m2N02J36m20M16n31
4861B02K95n1o87L79o04m61R58l59k11Q99m88j38K87o62Q08j49L65m10m31P23
4881B65k53K83o37M62L59j094J01J87K82L86k63p8l57L84M15k72l96N60j288j1
4901i65J079n06L31j33O2j64k46J117l46j27p05n7J544p12J37l72Q36n05j7k38
4921A3N21o48K97p13l0M79l85K51L5m45N67N26l97m35K98r64N56M82J4n42N7O01
$$ y = [43, -408, -229, -455, 238, 102, 128, 487, 173, 169, -295, 246, 32, 206, 683, -332, -414, 8, 503, 94, -154, 822, 792, -434, -106, -536, -364, -377, 519, -542, -265, -468, -144, 304, 248, -602, -286, -667, -326, 430, 536, 47, 185, 384, 220, 29, 130, 259, -369, 937, -70, -258, 309, -2, -80, -163, 262, -174, -110, -428, 124, -313, -621, -267, -51, -543, -279, -323, 371, 344, 201, 164, 871, 781, 283, 57, 96, 503, 141, 99, 601, 737, 317, 733, 202, 497, 446, -241, 138, -466, -927, 31, -328, -539, 360, -128, -266, 21, -641, 167, 18, 383, -27, -458, 265, 12, 295, -342, 120, 479, -615, -514, -327, -45, 341, 78, 0, -357, 27, 442, 170, -226, 334, -954, -965, 114, -392, -61, -194, -132, -296, -542, 575, 229, 102, -603, -660, 884, 172, 309, -63, 773, 268, 251, 13, 534, -114, 183, -530, -560, -81, -466, -215, -180, -625, -58, 468, 71, -364, -66, -1030, -474, 8, 22, -520, -463, 138]
4943A38L05k86j75L24k4K46L1q57P16m26q43J507p94l42K17k29N85o2L67Q3p49
4964b68m02L0N0N15k07K48k88L9j57O54m53O78n05L77k61m38K57J86L25j01l69
4985i0P38R4m8r49k47L05J7O85m41O59q59l7K39N0k05l08R36o67K06M87n97J39
5007A07L44n98m13P81m0j18o8r4j82N36Qk69k81K40R34p84L6n86J01M80l38M12
5029B08N7j64n52N87j45j52m41K32J375q51J17n18J9J73K84L85m56Q54j650O23
5049a5O18k74r24J060n47L09n51k62K81J127m76o90k51N71J30K23k59Np8M97J52
5070F46n23j34j41K91j65N7j68O27m03M18k60J36L48l97M13J88p40k81K34j95
5090d9j76j01M35n57n0l05L98N84l60M91l16n78J073j9j103N21P0m27M24o13J75
$$ y = [138, 443, 157, -18, 306, 282, 528, 559, -298, 418, -8, -851, 656, -138, -480, -263, -492, 93, 31, 398, 481, -268, -670, -640, -590, -75, -282, -34, -322, -283, -440, 214, -239, 439, -66, 311, 50, -388, -131, 55, 380, 279, -90, 648, 742, 694, -255, -502, -197, -180, 505, 64, 723, -136, -173, 66, 116, -89, -397, 539, -128, 78, 565, -32, 107, 451, -147, -560, 221, 181, 63, -5, -99, -281, 255, 263, -6, -287, -47, 887, 103, 139, -447, -346, 134, -204, 208, 265, 101, -451, 136, -9, -161, -602, -370, 1005, 154, 271, -247, -228, -55, 229, 614, 158, 1012, -638, -15, 603, 329, -595, 465, -82, 227, -324, -586, -305, 822, 346, -344, -595, -24, 106, 329, 70, 75, -3, 494, 646, 123, -11, -152, 139, -26, 31, -137, 490, 87, 505, 245, 381, 729, 332, 745, 933, 193, -88, 146, -49, -225, -326, 109, -448, -498, -803, -405, 179, -181, 310, -6, -584, 489, 470, -633, -112, -42, -469, -45, -658, -483]
5111d83M67N70m64M55J64n37n49Q67n43j90k47p6O01k72J34M32m26rj85q7P88
5132D10n55m00O99r08L44k75O03M83o56J0n09J228j55j97N01l45m23n06J18O03
5152G0J50J88r09M45L21n71o92N46J16J64j50O70j090P33p68L07K43K07J2N21
5172E13l45j04m9L90m94l11R05j133R30L6O18j291P04K42r27pJ12k87K86L69m68
5193c11J56j49O6n9Q79m22M10n20o94J104o15L70n70P12k34l9K44k21l5J55pJ75
5215C95n40L51o5Q2k8o85J01j95M59l08J011o46j89l14N8J108p23K96J33j76l92
5236b67J245p51p77N39M69p39O34K11n67K48L36j092R58P6q60N72p27O14m73O77
5256C26o76O64o49Q51o25K83o84R06j98Q2k33m65M74n4L50N9L0m01j53k58N66
$$ y = [-483, -16, 554, 90, 545, 709, 172, -377, 490, -53, -243, -490, -566, 35, -237, -103, 329, -97, -106, -291, -378, 410, -145, -545, 154, -754, -410, -685, -82, 401, -255, -245, -754, 474, 319, 122, 623, 278, -145, -651, -533, 70, 220, 408, -501, -56, 265, -306, -998, -452, -336, -172, -322, 348, -742, -9, -777, -470, -227, -20, -8, 513, 168, 64, 15, 405, -89, -400, 505, -628, 302, 338, 956, -335, 369, 611, -316, -323, -211, -498, -212, 157, -311, -155, -304, -238, -297, 582, 160, 570, 50, -644, 460, -155, 215, -355, 357, 123, 84, 328, 107, 72, 227, 220, 395, -145, 206, 141, 223, 195, -490, -389, -584, -125, -433, 578, -68, -257, -571, -513, 595, -128, 168, 301, 125, -267, 978, 227, -550, -11, 458, -281, 353, 564, -3, 245, 581, -511, 447, 523, -337, 235, -492, 122, -351, 326, -350, 314, -335, 516, -109, 174, -510, 396, 198, 280, 47, -418, 56, 2, 352, 411, 441, 40, -113, -371, 195]
5277A95n45M57L90k33L0n7n34K99K35r5l59N2k15J123p83J57l11M58M3n04J94
5298cO86O0q80j74L56j53Q22m30j07j184J326L20n78o86P57k9m3P1p7o79L63K36
5320b6n17L39q93J005l91K66l35J045j094K01J036n10R28j406K93l6N92L15q34
5339b2P38j205m9j4J149q33M35m55O45r5p35Q9k53l8O62l0J47j330P72J131m66
5360B43P0l73j38O29o53m53J277p00P46j020R68l75K11j61o00J66rR68p96N17
5380E17j155O98m31M90j03k19N01n19J5j75O15J83p55J91J83k3k63J19R9L29q35
5401e38R04m79J40K87o71P37J47k91k16J24j47Q8L71p20J53M57m7k62L80o21J93
5422a1L6j59P64m79n2J30j065M74O05J50m19L45k93k61O3J84n91J252j05r84k71
$$ y = [195, -350, 107, 497, 264, 294, 237, -297, 2, 237, 142, -217, -165, -380, 743, -40, 117, -194, 264, 307, -197, -3, 683, 743, -137, -311, 45, -108, 714, 284, 177, -1007, 319, 639, 61, -625, 132, 103, 60, 131, 54, -625, -262, -26, -543, -204, -1097, -92, -483, -217, -552, 493, -601, -400, 636, 126, 1054, -352, -59, -95, 497, 812, -22, 716, -489, -538, -552, 597, -236, 199, -256, 389, 294, -441, -352, -605, -643, 19, -11, 136, -1194, -422, 709, 243, 313, -60, -198, 431, -222, -675, 602, -98, 648, -372, 596, 221, 432, 271, -329, -163, -172, 796, 0, 517, -638, 60, -371, 119, 16, -203, 298, -221, -206, -381, 234, 417, -338, -147, 36, 13, -250, -131, -32, 297, -538, 366, -113, 27, 314, -357, 380, 527, 236, 20, 144, -3, 85, 456, -264, -111, 346, 299, 37, 417, -204, -11, 25, -134, 630, 151, 99, 229, -836, -362, 243, 393, -26, 319, 26, -235, -172, 12, -579, 673, 568, -416, -687]
5443f87P67m21K52L19m50k86N16J5k81L24M7m4k18k32O41L04m73l63j36J096j054
5464c64P76m98k01Q75j069L40N65J25m94J98l3l88n0j91K13K94j81L65l21j02
5484a41J24J87n2j083Q01J16l87n3J057j132N26J3M32l1j356J183o5M60l24K80
5504E55m94k64N03r75P56j30L54J5q50N61k34J83J22m75n05P19L78j55Q23p25
5524A62k22p0P47o68Qj17M76k57M42p41N51m64J07R7M11J99j160N53m88O72p16
5545d78L56J97n98P7N65o52M46l88J47J43O60r70N48M60p78pJ071j052j53J192
5565G86m89p53O61J42o29P84n36j97K65k26L35p71O51M88q28K83j49O86lo08k57
5586c65j96J30l13K68Q37K47m37n37l29J400m11K39m85k08N14M3M29j016l57N93
$$ y = [-687, 80, -341, -89, 230, -220, -506, 10, 25, -256, 68, 115, 71, -147, -379, 262, 566, 93, -270, -406, 690, -364, 412, -86, -287, 588, -481, -141, 424, 549, 55, 253, 220, -168, -218, -409, -196, 98, -83, 282, -39, -141, -17, 170, 118, -965, -164, -48, -435, -488, 569, -563, -37, -24, 408, 377, -979, 204, 139, 599, 275, 555, 61, -203, 300, -675, 81, -49, 305, 320, -530, 31, -203, -20, 102, -373, -878, -159, 219, 64, 887, 162, -60, -130, 617, -51, -43, -160, 316, 59, 501, -240, 311, -153, -46, 51, 462, 661, -499, 54, -434, 238, -478, -122, 75, -523, -446, 119, -533, -87, -475, -328, -185, 475, -495, 53, 513, -265, -272, 799, -253, -406, 786, 297, -456, 205, 347, -282, 502, -34, -231, 34, -192, 143, -628, 23, 511, -317, -34, -183, 503, 500, -108, -365, -561, -431, -744, -476, 361, 608, 171, -366, -695, 705, 294, 533, 48, -160, 354, 397, 826, -190, -547, 46]
5606D6l36j65J046j052P70j19l92P25o98k09O19k58J34m63O59O8Q9K63o90K80
5626C17l70J03j02k10P5N8N61J53l94k83j32J60j5m13J294j740L89J018j363J411
5646E17k19n93K01j59j67J104m81O55j055P80q78M23J59Q3l60k09j8K02n59R6
5666d78Q37o78k11Q93k71j95P8J64n27J290j288J82N08r61J021m62P53j054K38
5685a61K50Lo5O5l60K27J55m8K09L14m40m02l9l17O41r6J78o13R59n05p1o96L89
5708d23KL16P9j63l48L61N18o14R97o26k67j62L25l83L31P84p57M83k3j87n7m19
5730b33Q8O02p61O89o18L3j13N57n57J21N11o93M51p03L43M2M30n29M97J89p93
5751d47O20J93l48O80m49l16k47O85q62K21L5M47K02n92N43n07N8J26k27n03R22
$$ y = [46, -290, -455, 591, -461, 309, 190, -202, 523, -175, -384, 235, -23, 111, -352, 307, 375, 464, 727, 37, 317, -53, 50, -52, -262, -187, -129, 432, 585, 191, -92, -224, -64, -79, -492, 802, -938, -549, 469, -894, 517, 298, -295, -94, -253, -420, 684, 203, 858, -197, 583, -295, 128, 287, 370, 10, -199, -217, -15, -574, -478, 359, -319, -530, 363, 92, -103, -25, 139, -388, 902, -386, -204, 304, -657, 364, -98, 655, -399, -161, 89, 92, 27, 92, -268, -41, 114, 66, 275, 589, 149, -253, -292, -609, 32, -64, 114, -499, 460, -45, -116, -812, -423, -421, -105, -26, -189, -537, -176, 342, -272, 725, 99, -168, -330, -5, -388, -57, 727, -30, 453, 430, 243, 186, -233, -145, 457, -304, 385, -233, -200, -313, 244, -313, -192, 319, -374, 77, -626, -283, -241, 189, -340, 157, 346, -447, 173, 366, 18, 698, 249, -67, -314, 371, -491, -270, -235, 212, 414, -178, 365, -142, -84, 42, -185, -688, 234]
5772B34m17K04j5N24n09n6K14k42K13K54o20j71Q3Q80m14J7K52j052M19O32q32
5793d02J306k02j240K3k7n2N68N6n15j3N97P0k33l19J42k16J30N31k29L48n39
5814b16N37N0n17l76P24j32LN58n09J0J14P39j095K86l94l02M40M48m02M8n09
5835d95K94M29r06R89n50R09j088L37O72r46J23n95J108kr00M43N10l16M47Lo21
5856a55O85r18k41N74K54n92M64m44J42m42P77n6q71O02n6K42L71l17m29Q48n52
5877a14K84n8L99j024J002k58l99K95Q5j4Q82j646N84M61j53q34L82K08p80K64
5897d34L08k44J208q87k68k3j86M1J91j89Q00j77l01M37p53M58j95N36l7j92k74
5918a81M92M45p03l0J149j129P58j081O18l10o13K25Q55R1p72m47P88J8j95m93
$$ y = [234, -183, 21, 6, 530, 21, -35, 179, -63, 150, 404, -216, -387, -304, 576, 162, 179, 431, -621, -202, 430, -402, 904, 702, -538, -515, -542, -594, -26, 30, -485, -498, 99, 169, -64, -383, -241, -457, -327, 204, -25, 323, -216, 321, 371, -146, -522, 202, 70, 73, 631, 122, 132, 246, 985, -110, 176, -218, -520, -80, 368, -34, 14, -495, -201, 228, -678, 311, -239, 670, -418, -81, 591, -355, -232, -827, 281, 279, -621, -178, 332, 16, 463, 466, -155, 530, -388, -629, -55, 199, -393, 71, -373, -231, -673, 104, 48, -823, -221, -277, -35, 336, 19, -410, 438, -114, 170, 112, 511, -513, 489, 231, -168, 127, 212, 198, 1080, -566, 18, 479, 326, -508, -126, 82, -698, -434, -126, -370, 838, -49, -317, -340, -526, -485, -294, -483, 317, 140, -161, 276, -477, -19, -214, 322, 285, 93, -181, 311, 756, 53, 23, 1172, 43, 801, -280, 338, 28, -585, -360, 495, 586, -186, -633, 155, 173, -22, -515]
5938e15K15l45O07N4P1K7M07m67j23O13p20L88KJ51k02N13k88l00l50J020o15
5959A43j77o83K07L15J24M49m14L66l04k3P09j136l04P93M82j10o44L50J82K14
5979E39q44L84n5j06R60m56k78n58N48o47P7R38k57L70k16q99P96j204O10O40
5999C42m47J74M62l94l64N4J05N59n93q2j57M10j19M70k96m51J81M74j86o27J003
6020E18r1k00M27r58P2J10m22M65l42N24J129q34r65N74j90k92K03m24j76J73
6040f99P46j51k1N5N88k93K51o7j71mq70O13n5o5O7L60o17O08l77l25j05O85q62
6063g09K05Q26j141K39L75J93m20R64r00k61P63j257J633k68n72J030n00l96Q13
6082F17k89R0j81l8n07j55M28p96O20O8M7j94L84o7M10m46L00l43J34o92O23L25
$$ y = [-515, -300, -645, -38, 16, 87, 114, 521, 54, -69, 544, -176, 212, 214, 365, 163, 676, 388, 88, -262, 758, 143, -34, -717, -510, -195, -71, 378, -36, 330, 26, 3, 712, -424, -728, 65, 547, 437, -207, 143, 325, 539, -305, 79, 24, -82, 878, 422, 144, -414, 134, -513, -436, 502, 245, 615, 399, -500, 296, -908, -298, 342, -105, 69, 531, 137, -227, -173, -68, 491, -102, -184, -341, 69, -50, 420, 124, -327, -146, 328, 142, -485, 518, 427, 227, 654, -304, -232, -122, -544, -79, -421, 103, 1232, 398, -567, 7, -183, -475, -272, -696, -872, -699, 47, -104, -125, -70, 518, 225, 476, 409, 238, 234, -636, -23, -78, -143, -76, 284, -333, 275, -102, -427, -532, 153, -709, -504, 322, -819, -580, -205, -12, -432, 532, -368, -629, 134, -1123, 510, 242, -330, 700, 200, -196, 617, 328, 418, 237, 199, -308, -463, -35, -831, -211, -143, -96, -290, 94, 27, 437, -9, 291, -52, 82, -610, 13, 338]
6104C38q41N10L13l06l86m1r1P98m17M5O76k0l21R7n64O95r18N68k39J74k05l59
6126d94lL89J17J04J47j172O75J6l45k1O49L29o74O05Q6ml9J85l67p8K35n41M69
6149B68m35N26J60q57J57l71J65J69M17j93l9j51M5k8L61n44R39r07M3K30m14
6170d59P12l74J36L79o96q7R37j50k81j13m1J74J07n51q5J79R01q72J20L36l25
6191e3m59J016j153L30O34q53k76R50l58M77M77p93k6J03L66J24n93K69j3Mq6
6212H7k16m1k01N84p30M58L07M49P0m98m09L60l10l60o2N45L54k98k21L55j94
6233B9k87M32p7Q89n65k29J72M12n43l93Q63p4k56j16n00M43j37r40R43l51J07
6254a78J0K14K58m02R3q34O15P11q33l87Q03n53K64q2O31j77j82Oo67J076J55
$$ y = [338, -503, 7, 320, 14, -372, -413, -504, 294, -123, -78, 598, 578, 257, 354, -210, 485, -433, 135, -104, 70, -135, -494, -497, -108, 9, 113, 260, -912, -237, -221, -566, -587, 62, 391, -283, 322, 408, 404, 365, 550, 183, 105, 340, -201, 268, -167, 359, 519, -338, -181, -552, -387, -218, 199, 6, -33, -184, -139, -167, 194, -350, 589, -318, -275, -45, -459, 253, -121, 15, 394, -302, -389, 548, 398, 117, 4, -37, 137, 244, -307, -392, -213, 688, -184, -64, 272, -53, -512, 504, -649, -319, 315, -538, -814, 136, -222, 255, 732, -61, -87, 16, 382, 506, -87, 182, 169, 173, 87, -129, -170, -371, 213, -517, -59, 248, 697, 767, 269, -140, 220, -90, -450, -512, 33, 387, 89, -132, 223, 29, -258, 174, 97, 986, 421, 192, 364, 776, 233, -160, 703, 629, 373, 257, -243, 200, 63, -877, 66, -285, -178, -168, 46, 304, -98, -5, -839, -224, 487, -346, -733, 70, -483, -219, -301, 330, 153, -29, -23, -690, 386, 541]
6275E41J3n40J80j7p75l2O75n83J43m2J48p4m20L90K7J41p15R96Ln1K55k10j91
6298a38J16J49n36R50k17o51k06L93J06n4l36J162k31k47m09p4O46l14k01m84
6318e76J96K00q7N02R4k99K30q52O73l44J39l07M78n80J40L28n03N37P88q73q9
6339b05K13m81R11j18m88N53p18J95J52J83r26R98m59p38L9J072r1L01o65Q12
6359E40o23K33k04j32K20P29j531Q32k7L8r2o2K30J2j31K01n44J33M02l36q0o1
6381b53M5q39O43O63pn43k13P38q50N83o2l30o1N67m20J56M33n53J253r01m7P03
6403G05n97O35j43r30J73J73j59L79l99q7o34J13L36k39N44l7L4n94Q50k82K60
6424A01j013N95M09j19J14j84M24k66J41O85m47o25K15p8M57k51r04R16k8k02
$$ y = [541, 554, 14, 194, 177, -598, -630, 45, -538, -395, -437, -289, -363, -783, -393, -366, -225, -940, 56, 59, 8, 263, 53, -138, -22, 127, -409, 541, 324, -327, -533, -140, -34, -88, -424, 738, 507, 260, -149, -223, 423, 109, -92, -576, -380, -180, -267, 235, 329, 30, 260, -592, 81, -263, -124, -431, 47, -533, -393, -65, -568, -31, 757, -116, -205, 8, -473, 438, 320, -168, 385, -333, -138, 14, 197, -729, 269, -190, -928, -889, 183, 92, 393, -272, 540, -83, 150, -54, -186, 34, 763, -768, 64, 37, 75, -17, -79, 151, 163, 32, 233, -311, -178, 224, -112, -192, -253, -208, -1047, -404, 259, 252, -291, -504, 234, -616, -33, -95, -425, -486, 81, -339, -183, 250, -303, 950, 49, 2, 705, 108, 743, 600, -330, -157, 16, -143, 236, -163, -250, -884, -771, -435, -674, -130, -167, -133, -727, 123, -159, 101, -912, -317, 92, -27, 87, -97, 327, 61, 202, 887, 440, -185, 30, -48, 409, 158, -746, 170, 142, -60]
6444f0m90K17O7M72l96N58j150M45P03k92k29r8m30J025m36N31l59L69j249M72
6464c30L46p7L84q89Q07M9K70K9O1j041N34J05L25m44j72L87o31mM61l96o35M16
6486d45Q29O0O66j106k87j13O28k60o0P89J21n95l46J75k37O20m54J73k56q0k36
6507d14Q03p36J75n30R51n21J29O16r74P27J19m77J73k32k90O87n24lJ90m0O14
6528D43j12k50K06k01O80j212M35m8m09M34m55J6N05K55q28Q76k62l14R2J44l29
6549c34M25j8q6Q36j281O69l7J36k98K79n4j91l69J495p90jj97M5k54k75K30j18
6571a88j00K43R35r12j24j60p7J23N33l78o5J56L83k18J14O2M5k86N01l98K20
6592D09o05l95L00M94k4k47j60P42p13K0l50N3N68l45J25J85K28o01j17O07J6
$$ y = [-60, -550, -333, -266, 206, -190, 368, -782, -337, 366, 74, -155, -253, -683, 342, -94, 437, 78, 447, -802, -330, 16, -61, 323, -566, 241, 290, 560, 589, 650, -391, 143, 248, 573, 129, -43, 344, -287, -291, 170, -226, -861, -445, 384, 444, 1110, 4, -283, -396, 232, -28, -88, 701, 822, 227, -119, 56, -181, 439, -15, 158, -98, -178, -414, 389, -347, -172, -702, 249, -272, -143, 473, -501, 226, 345, -132, 41, -191, -481, 206, -318, -321, -131, -171, 443, 331, 81, 287, 86, 766, -446, -11, -59, -468, -34, -489, -473, 32, 287, -541, 335, 73, -241, -149, -5, -334, 91, 73, -13, 823, -458, 211, 174, 310, 12, 291, 237, 46, -323, 1172, 382, 381, 184, 229, -25, -300, -70, -188, -288, -45, 890, -22, -146, -306, -383, -260, 273, -105, -170, -14, 369, 151, 265, 327, 372, 86, 587, 189, 409, -196, -591, -291, 203, 179, -68, -228, 514, -199, -179, -529, -476, 92, -253, -128, 57, 285, -316, -433, 174, 190]
6613A90p10R66n84L61P54n15l8l70N5r27J421J55j182N45k1J56L30K19j046M74
6633B33N4m80M32l78n73N88o78J136L4l13r85Q38K07l71j88O50l33L17j89K55
6653B56n66J74Q19q15P00m81M70q32l0K54J07J28j25j04L71M57k85p47P33r92
6673e08j38K75L01k31k13O16K55l83j262J92J323k43J14O57p89L84J33k8J28m02
6693A81O04o41k99Q8K03N25p22Q0m95n3L98K57j76j53o14O71M10K25m16J70o58
6714d15J28K41o17K48P05O08k56j75n32L96l32J2J03K53l91L90k27j99K14o56
6734e02k56J039J75m53q7J08q34N70J36Q7j30L1L04l92M58l82L68k97j02K58m83
6755c84M88L20L6k55J25l92O85n82L10p6l83m65P76l16k8n9M57m80J91J0l32J347
$$ y = [190, -520, 446, -138, 223, 977, 462, 424, 54, 109, -818, 603, 758, -424, 121, 100, 256, 586, 805, -241, 233, 287, -193, 239, -139, -712, -124, -802, 334, 368, 55, -930, -92, 115, -256, -444, 206, -127, 190, 1, 256, -310, -136, 683, -132, 568, 87, 557, -275, -305, -51, 56, 184, 59, -45, 326, 783, 498, -249, 484, -508, -646, -371, -70, -301, -514, 102, 357, -26, -1288, -1096, 227, -16, 98, 755, -34, 350, 483, 455, 583, 181, 785, 144, -155, -67, 136, 661, -61, 19, -476, -529, -131, 126, -50, -203, -817, -146, 264, 489, 73, 243, -415, -287, -46, -663, -415, 290, 898, 642, 467, -65, 331, -1, 11, 114, 367, -24, 366, 139, -60, 154, -502, -758, 281, 456, 3, -84, 24, -810, -240, -104, -17, -147, -116, 188, -204, 254, -128, 240, -57, -159, 99, -384, 104, 424, 460, 205, 330, -62, 623, 41, 351, 275, -108, -573, 203, -113, -141, -200, 257, -223, -32, -22, -354, 993]
6777I93j361J178m61J66o16K12KP3P7m88R25n07n95L57N09l90N91r25O51K31p15
6798i3P15q11n2N16q05N6L90O22l94m38L75K21l55m9j41K36j98o3M4M27j51q39
6820g87J183j8j215P23JK8M85q15J089j087Q63L49j230P05q25J97L94o95P55j69
6840f9K04r48M04j59K37j79J86N80p38J123l32o31J76N65o67K55M61j031R25n57
6860a95P90p09l9K43k42n12K05K48n80M42M64m88M55o3N96r39k76L69O4q6J4j28
6882c67J22R51p88K87J143j009J93l93J13j45l46J52M56j131N34k82Q34q8l87
6901a51j02n72O78K38j56o22O69L80l87p4o4M52L9N38j329J104Jl85M4P88j027
6922F2r85N22JL25L26l71J68K69j019K78J2J67M36n48O40m90n1p85J934k07o38
$$ y = [993, -368, 810, 349, 515, -101, 111, 113, 186, 263, -225, 700, 193, -402, -45, 464, 74, 665, -260, 391, 622, -93, 622, -189, -241, 275, -530, -474, -84, 538, 144, -294, 81, 302, -53, -102, -243, -7, -205, -268, -224, 203, 52, -787, 396, 378, -837, -114, -113, -85, 400, -415, 674, -413, 450, 799, -431, 274, -551, -354, 40, -655, 100, -69, 135, -813, -409, -568, -331, -510, -324, 256, -482, 641, 309, -322, -146, 419, -248, 7, 468, -563, 362, -195, 595, -114, -153, 90, -152, -664, -459, -211, -791, -349, 115, -373, 82, 19, 615, -324, -600, -231, -167, -253, -239, -367, -245, 706, -82, 205, 1348, 339, 532, 139, 252, 107, -239, -87, 369, -762, -228, -510, 324, 236, -151, -253, -825, -147, 91, -65, -687, -18, 362, -25, -99, -163, 289, 328, 866, -463, 641, 642, 257, 301, 1089, 62, -923, -401, -400, -75, 251, -120, 48, 317, -702, -424, -412, -245, 191, -357, 283, -207, -258, -1043, 891, 684, 46]
6943D6qk41k22N69o71Q30NJ15o5J37k55k90j35L28K63p14R18p03k29J36K87o01
6965e00K11M78o71M82P15o88K1l19j96K25oK64K50J23j006J128l0l94o29P38j96
6986@k88Q72j79r85O26j075K67P62o1j62N05o04L45L62K1n42n78J53K59KP3q78
7008a105J043K40m1p6j33l33O59K23p97Q9P2L3J9k3n51K15M46m8j31M46j29n85
7030d67Q70n28j45M72n40K54L32q98P95j74l75J036p90P2j44J188j651O42M76
7049D25r5o18k16K29k51MN47M97q06K7Ql13L18Q05p05K39m06K53O5l78M99J53
7071B81m82O94k05J02j2k51n90J144q85N18n96L35j12M06k65Q9N85j248N99k46
7091a39J34L16j103J069m6J84o55J51M44p89K46l67R13o59O11K23k01n31l17P25
$$ y = [46, 38, -203, -425, 144, -527, 303, 308, 423, 358, 495, 240, -50, -185, 143, 406, -308, 610, -93, -322, -186, 101, -500, -289, 189, -482, 0, 715, 27, 48, -271, -467, -242, -248, 16, 266, 389, -617, 511, 481, 87, -542, 196, 0, -288, 584, 405, -580, 46, -1029, -762, 0, -61, -223, 282, -322, 23, 385, 406, -136, -714, -561, -302, -300, -227, -1105, -62, 178, 137, 61, -72, -405, 254, 477, -320, -231, -159, -126, -107, -130, -681, -466, -20, -68, -199, 247, 118, -467, 403, -125, -270, 202, -338, -84, 248, -650, 145, -29, -404, 632, -158, -86, -230, 958, -693, -51, 425, 330, -288, -504, -275, -526, -522, 25, 522, -284, -257, -249, -562, -244, 561, -144, 95, -311, -58, 7, -371, 128, 281, -201, 493, 288, 390, 378, 127, -463, 681, -204, 314, -282, 53, -59, 347, 82, 171, 756, -492, 107, -139, -5, 311, -792, 277, 231, 415, -240, -89, 355, -434, -188, -555, 358, -301, 310, 533, 332, -199, -516, 209]
7111B09o86K60L38l0M71l76o57K46N93p30J30N68k42m46M03J65k61p23N91P6m27
7132e28P12J4q96O89l1J68M85l92o61K19K09J65j06j33P39p92j72R5L40j60J95
7153A59j41l24K38q44P87L53k92L20N1j54L75q23k9P8P32j88o05M65K67l18K14
7174C21r12J329n97l9m43N69l6j79l19M06J62k85J23p8j89m24P31j10j81N74q96
7195d73Q98p46O67o48k36Q59K1M11m61j90K38K42p91R0M26L15q64j38P17rl26
7216Bm64P18L23o05k94o9Q9N02p11K09l55O69L89m87k7O5j18K50L94p37J83J03
7238B9k57J13L1q0K57m31Q73j031M36n13N3J026q28N27p64Q62l16k27P56q43j45
7259d72J146l40m02J50j1L0o11R55p10P3J81K94l45k89J049q86p72P06K05m6P3
$$ y = [209, -477, -217, 121, 91, 562, 186, -471, -225, 368, -362, -232, 336, 94, -352, 51, 216, -45, -768, -177, -101, -528, 184, 198, -698, -9, -40, 128, 613, 221, -440, -221, -12, 153, 47, -86, 653, -139, -311, -216, 124, -36, 159, 18, -306, -68, -912, -125, 228, -64, 256, 307, 153, 528, -295, -324, -246, 486, 298, -307, 158, 425, 107, 321, -591, 738, 141, 102, -341, 228, 192, 13, -306, 100, 262, -23, 100, 22, -167, -591, 140, 30, -151, 423, -473, 425, -321, 346, -302, -538, 321, 342, 753, 292, 102, 340, 582, -209, -119, 307, 622, -242, -380, 337, 328, 2, -462, 256, 579, -26, -320, -389, -300, 202, -509, -300, -655, 14, 403, -84, -111, -46, -164, 86, 480, -257, -74, 29, -228, -115, -84, -164, 93, -338, 535, -496, -60, -573, -520, 506, -322, 205, -559, 303, -13, -240, 516, -327, -472, 674, 334, -68, 82, 71, 101, -510, 445, -265, -192, -11, 283, -62, -351, 698, -188, -960, -254, -49, -95, -22]
7280b2N98p31L77n18J59J29K18q85K68K48J94k85k4l15R67M3kk7Q5o05J29N17
7302E18j096N18L41Q4j77j96M78m19j09N40m99k4l51J16N1K78m5J68p79r7Q80
7323A80j92m9K19K52j00o22N16O7n11j25j02N02P73n21M14q45R81m96j26l90P8
7344i7J00m3J83k43M00m87l37Pl05J294q15L52N38o11O9n7N26l11J0o66P62OM09
7367F84k78l33R5L46o00J86K27N0o14K65K91k67N2j027J18Q29K39Qq66J40P07
7388B52q36N18M43j369J078m04O10k07%o21O39q53J132l3l16N7n30J038n36K35
7408B97k12J6N13l15n91O86j059Q06r05N05N3K54N30r19M18O4L25k5p72N13j68
7429A4n18O2O13K24J49K27n36J28j016P45N5Q37r14J15j026P0P94M94k27m59j63
$$ y = [-22, 576, -155, 222, -296, -137, -8, 210, -675, -407, -159, 35, -250, -274, -589, 378, 421, 419, 392, 477, -128, 1, 518, -578, -60, 281, 365, 188, -8, 470, 51, -58, 482, -17, -41, -392, -276, -225, 53, 8, 176, -603, -700, 180, -12, -61, 158, 410, 310, -312, 204, 271, -240, -365, -467, 35, 808, 287, 701, -144, 837, 341, 215, -175, -97, 3, -40, 143, -100, 300, -187, -524, -517, -822, 472, -343, 9, 547, -64, 5, -52, 474, 163, 173, -493, 269, 275, 684, 406, 73, 168, 514, -86, 100, 327, 377, -237, 28, 319, 52, 104, -923, -805, 24, 263, 271, -595, -455, 252, -584, -66, 377, -992, 86, -318, 292, 85, 85, -536, 103, -750, 382, 349, 33, 90, -440, 598, 62, 297, 85, 101, 614, 299, -292, 394, -665, 141, -764, -259, -206, 48, 578, -341, 77, 141, 466, 441, -331, 182, 14, -504, -442, 171, 395, 544, 771, 235, 363, -653, 92, 147, 984, 70, 185, -841, -771, 23, 517, 290, -169, -332]
7450c32K59J84m21k84J20N93o61J22R79j213Q80m31r1L97n81Q53k54k60r4J1L69
7471A45m21K69M19p22Q39n00j66l34J31K95q86J130o55Q53o74l25L46M94o47R8
7491c11M25nq35L46K48P92M3k92J11o48J54j26l07N05l82M01R8m50K51L82n98
7512a98K12J01j014O08n87Q91J71p46M63K78j587J705l06j40k48L63N56m63L78
7531D37k07O4m25K04O1k48j62N19o9K22l1n20r7R1j03Rj38O40J05l46p33M61O14
7554C48j81k04l44L47p9K56Q20q43l31M72m21J452p52r42O04k38J24J88J66j426
7574i84J320K03l71l97N72p26J77j54L85m24k25P92k17r6K04K57j289L12O68O49
7594F56l68N1q6q3m94O65q32K16O4M63k83j26J9l49K59J31j65J33j10K6M27J54
$$ y = [-332, -73, 111, -310, -594, -474, 119, -542, -420, 559, -654, 226, -205, -296, 101, -480, 373, 119, -141, -235, -224, 145, -276, -7, 412, -310, 529, 29, -137, -471, -340, -45, -931, 199, -456, 397, -277, -602, -256, 238, -409, -311, 114, 109, -726, -380, -132, 660, 703, 411, 522, -126, 28, -98, -405, 100, -282, 119, 217, -233, 18, 400, -198, 14, 115, -899, -291, -878, 13, 184, -562, -99, 179, -1408, 297, -9, -149, -397, -34, 522, 59, 437, 230, 294, -131, 73, 134, -114, -276, 243, 174, 396, 365, -155, -252, -161, -264, -255, -393, 247, 352, 6, -727, -266, 348, 167, -37, -381, -34, -113, 143, 963, 120, -211, 261, -160, 1292, 540, -402, 202, -36, 88, 276, 442, -984, 336, 539, 168, -229, 343, -383, -206, -360, 25, -399, -624, 168, -49, -145, 59, 316, -973, -661, 7, 656, 288, 339, 253, 170, -324, 341, -491, -275, -211, 252, -31, -157, -138, -487, -228, -97, -262, -129, -239, -213, 214, 368]
7616C68M0o6k29o79P97M52q3j230M57O30n84l56R06q48Q50Q5n12k7Q52l53n59
7637h9J00j84n31J32J69M8P21j06p95M93q64N02L63O8j024J208p61k00L59J32
7657b59N12K04o47N45J02L19n15k94j71m0o0P07%n22k40M11L85l46o62K57n1M23
7679E8l79K90m75R54k4r49J142o8p26M17n06K94J016j052K9K57p81Q0R23m81J86
7700B05J19n17L84J8j86n57m00L41M02J66L25q05j17K41N70O4j25k02L9j62M42
7721B45K76p28j16M42K89j068Q08J30KJ12m93m5N90k22j03K89r39O71n05M02o5
7742b8M06m00j94K95n93Q70p46J46j42M82q42K31L36k52Q6Q71q26K25m4O90j20
7763D51m09j11J41R6m25O27o10l16l06O01l29N05k44R78m01L7m07K16k69K75K48
$$ y = [368, 408, 342, 113, -566, 231, 683, 600, -630, -173, 457, -127, -483, 423, -425, 425, 510, -2, -29, 823, 470, -89, 11, -173, -704, -572, -403, -355, 366, 260, -535, -42, -906, -404, -41, 27, -997, 211, -550, -750, -391, -259, 253, 457, -190, 355, 457, 776, 261, -33, -204, -244, -304, 403, 403, -119, -359, 52, 437, 91, -571, -314, -365, 58, -321, -31, -506, 448, 424, -525, 617, 549, -177, 240, -266, 28, 1044, -8, 21, 278, -503, -423, 500, 19, 205, 324, -193, 191, 209, 23, -534, -934, -593, -191, -25, 300, -505, -622, -381, 189, 253, 128, -74, -35, -197, 245, 521, -207, -323, 119, 408, -660, 148, 278, 280, 392, -101, -146, 444, 222, 119, 408, -531, 140, -365, 37, -28, 378, -22, -216, 79, -514, 356, -390, -244, -386, 96, -746, -515, -179, -431, -345, 526, -300, -75, -119, 571, 451, 42, -69, 72, 168, -257, 370, -240, -556, -862, -261, -590, -85, -329, 649, 248, 285, -122, 94, -175, 100, 348]
7784C48m88M43p58j86M03kJ07K85k26N91K88j002M47m05O70j086K93l62N25P6
7804c9M88j343N69L97m03L12j22O20p03q1M42r8j94o17Q96J27J40k26L4P58j097
7825a40P3k79N69j31j033J622q45n51M33Q08l5k91m09J71k66M20k54m52N79n10
7845e21O17K03K27k61n61R61o79l09N46n23p9K88k53N79o12o4j57K29P61j90n9
7866A43m52O07J48j001N14O35p04m4P95r90K00J646j765P36j02n39n74O21j7J10
7886c3M17q3J01j61R8o92L19N29j88j71J56l85m17J69J84p4k20Q05j23l63J8j14
7908b28M03J55l92L14j33q5N5k85j33M20k34L57M01o02O55l98j72n51p1O77k20
7929f7m29L44n0N39m51m62Q13k60n5J13n08J062p74l17P23l62O56j177M41L02
$$ y = [348, -140, 303, -455, -641, -238, -240, -133, 152, -74, 517, 805, -197, 250, -155, 515, -571, -278, -640, -115, -39, 449, -894, -325, 72, -331, -19, -141, 479, -224, -305, 137, 39, -155, -772, 124, 251, 391, 165, 199, 957, -140, -67, -346, 223, 92, -941, 681, -164, -715, -282, 526, 491, 200, -209, -38, -304, 116, -138, -590, -11, -521, 96, 299, 526, 265, -296, 665, -14, -323, 223, -300, -379, -91, -344, 235, -377, -441, -598, -369, 392, 202, 143, -309, 298, 446, -555, -41, 594, -110, -154, 641, -349, -149, 1497, -268, 468, 366, -173, -747, -126, -143, -33, 384, 301, 402, 241, 339, -353, -34, 495, 307, 136, 292, -93, -510, -341, -157, -231, -451, 354, 231, -132, -114, -228, 175, 330, -62, 252, 119, 34, 89, -196, -329, 91, -143, 214, 615, 13, 668, 270, 98, -453, -524, 153, -67, -496, -152, -202, 337, -114, -576, 237, -23, -78, 35, -473, 589, -185, -502, 221, -141, 515, -662, -221, 81]
7949H1K91q17R50k6O68j094K01l90m41P58r4j65J03N6J43k00K18m24J64o93M15
7970b96K33n81K29J82P27m03L46m17J04L33r4k78N4k22L33r8j64n15Q26K65j037
7991d73J90L99j66p6q1p46J236p66K13j6k11L83J74o31P85N33j518O51L80J5o50
8012c75P65L66o3j014O12n38q8N41L01j24n32K68j46O27o52o83K89R89j207O85
8032B1j32K30k1m06J77n85Q90p25J60J111q84p1Q56r88l3mJ33K85k39l88N76N04
8054D67r08N35l76K39j68J10K41l7m14P84j79o25L74k12l3L45j69K23mk77O13
8075E29r15j92O52J78k6o88R70L75q67J31l96k0l81O59J02N7M4m66l4R01o36N97
8097E74q19K22L9n76N51L89p05M8N24o03M81P17j528J677k205J675j23K30l21
$$ y = [81, 372, -445, 505, 479, 1147, 53, 254, -136, -577, 181, 87, -78, 25, 81, 224, 24, 242, -182, -18, -711, -296, -63, -644, -415, -233, 494, 91, 437, 20, 124, 457, 363, 85, 139, -83, 250, 152, -12, -527, 299, 564, -473, -283, 116, -50, -126, -207, -953, 283, -483, -270, -286, -497, -114, 60, -571, 214, 747, -771, -120, 260, 275, -375, 390, 756, 693, -321, 291, -247, -335, 206, 507, 383, -149, 119, -27, 600, -52, -735, -446, 543, -664, 21, -111, 119, 98, -308, -131, -716, 174, -551, -391, 720, -164, -235, 621, -367, -400, -404, -271, 14, -225, -613, -37, 467, -441, 94, -282, -43, -211, -101, 140, 103, -311, 473, 294, -331, 43, -169, -202, 143, -26, 197, 193, -84, 529, -386, -578, 74, 252, 226, -462, 508, 883, 16, 147, -249, -269, -650, 9, 111, 168, 212, -254, -288, 613, -23, 574, -245, -23, 16, -560, -9, 380, -325, -277, 247, -356, 125, 842, -686, 991, -1214, 461, 338, 568, 247]
8116B47k05J72m66m70M77l51J28J227p14k95N66p97Q79m73P85p47M42m56J31k31
8136a51J336j4j150j34J92n8L60k12L19m14K94o19L08K41j74j08P6o00k72M22
8156c58Q38j336J039K2m75L22k09k95L86j95m62Q15Q0j330J121l97l42O36r2m1
8176b73P18o8p96N49p08O95m63J07K68L15N56q00m9J45k20
$$ y = [247, 42, 214, -252, -722, -245, -596, -468, 759, 45, -250, 316, -481, 398, -75, 710, -37, 405, -51, 80, -151, 1185, 1171, 21, -113, 79, 21, 381, 169, 488, 74, 368, -251, 57, 298, 124, 16, 92, -508, -780, -358, 480, -856, 183, 205, -270, 52, -157, -452, -66, -261, -723, 92, 172, -1158, -37, -434, -776, -140, -232, -273, 445, 377, -419, 130, -578, 117, -346, -239, 29, 344, 900, 100, 51, 196, -24]
8191b4
$$ Imaginary data points
##PAGE= N=2
##DATA TABLE= (X++(I..I)), XYDATA
0@%%%%%%%%%%%%%%%%%%%%%jK6q7J24j24J24j24J25j40J95k42K49k65L19l68L98
37B09m54N09n62O30p00P73q61R57j051J159j280J413j556J710j888K080k289K531
55A330k799L106l456L850m317M875n552O392p469Q921j0966J4096j9613L2319
69B0717j50656P5795R1198q0523M535L7506L023l8737L3440K5376j0529k3957
81a2812K0922K0685Q63k2682Q413K0289p875k6070J8209J7135l0620k2313L1858
94A6002N583l9906m597K8993j5420k8705J9035J8765k7420q363K2692M697j3420
107b2064O951J1262J116J22K853Q666R649o470o042J8333M866k1495N130K1324
121C4201j8004j7747J9549J977k7226L44J8033j4862j6946J0182L067j4319j791
$$ y = [0, 0, 0, 0, 0, 0, 0, 0, 0, 0, 0, 0, 0, 0, 0, 0, 0, 0, 0, 0, 0, 0, -1, 25, -62, 62, -62, 62, -62, 63, -77, 118, -124, 125, -140, 179, -189, 209, -245, 264, -298, 332, -368, 405, -456, 501, -550, 609, -671, 742, -814, 896, -992, 1088, -1201, 1330, -1469, 1637, -1819, 2031, -2286, 2589, -2963, 3429, -4040, 4881, -6085, 8011, -11602, 20717, -129939, -54144, 37054, -43469, -38934, -1428, 1595, -37142, -3702, 21674, 11145, -12812, 8110, 28795, 29658, 6976, 15389, 35678, 27803, 1733, 19942, 37077, 6457, -15856, 16002, 21585, -18321, -22918, 6075, -9345, -38050, -19015, -250, -27670, -36033, -13341, -8644, -22064, -15113, -3851, -2735, -2613, 240, 8906, 18555, 12085, 6043, 24376, 29242, 7747, 12877, 34201, 16197, -1550, 17999, 19976, -7250, -6906, 11127, -3735, -20681, -10499, -7432, -21751, -23542]
134b3542R198l9o116J268N564O469j179k227J0825J0646r649k205J9894K709j7102
149D514Q308J9287j6486j3686J9433M002k3418q47J5166j1255j6141N812M374
162i37j0045n874J934J521j022o721q68J4592k15j3591J0982J6481j0799n924
176a0486K2365N286j6818N051J7701o027r734J0155L080j0310j740M172k671n019
190E005m351k980N02j972r115j071O871o209q691J0049M144j2265L410J4561m491
205f603o555J3073N055p852N627J0607l830j471P544l74k712L271j409n239K501
220A1633k159o925J814q89r417j351N205q584o386Q693k001r721O047Q264q543
235a4320j256J1603J413n844P642P018k921J026P721q40L95J815j189K32K494
$$ y = [-23542, -14344, -14383, -20499, -19231, -13667, -7198, -8377, -10604, 221, 10867, 1218, -987, 18907, 21616, 4514, 12822, 32109, 15623, 1937, 21370, 25372, 1954, 1107, 16273, 5018, -11123, -5311, -937, -10982, -16856, -14922, -13401, -14423, -21144, -22012, -7420, -7635, -21226, -10244, 6237, -4562, -10486, 11879, 17165, 347, 5398, 23099, 17072, 7338, 17493, 20573, 10263, 8523, 12695, 10024, 5005, 654, -2326, -1824, -3796, -12911, -13982, -7111, -13320, -22011, -11962, -7818, -20083, -16673, -2112, -6603, -13158, -85, 4970, -2882, 2745, 13352, 9522, 8051, 15595, 15221, 12509, 15780, 14371, 9132, 11633, 9474, 2549, 4363, 3474, -5943, -7294, -2089, -10673, -17059, -8366, -10367, -20088, -14041, -5777, -14320, -15576, -3973, -2560, -8404, -762, 6256, 3335, 4361, 12082, 11242, 11637, 13452, 12263, 12495, 14989]
250A4989l702n325P016l604j2226K510N907j1595o505R544k649j1426K767P941
264f358o926m100P529Q73p72L322J787J940N910P50j115P224L323o589K880Q993
280A8671o380n224O500J056r833j38M683p007o645K949j832n623P1L99m704Q08
296a2249J934l959J562N850j969L3P835L08l296O503O458m880L127O617k778k361
312H735N615k194m311L104J333r055k2L537p594m591M552l709o768K377J441n604
328a3154Q0L852k435N07M678q41j28P020P01j577N848N811n722K019Q171l033
344A1797l728M124K640p334p68L179m931l684k21k875k391l03l642l834L897j44
360h218o470K726O374n642j532Q895J349m468N126N724j991J204M990P33P0L328
$$ y = [14989, 11287, 5962, 12978, 9374, -2852, -342, 5565, -6030, -12535, -2991, -5640, -17066, -14299, -6358, -13284, -17384, -9855, -8982, -9754, -6432, -4645, -2705, 3205, 3955, 2840, 10064, 13387, 6798, 9678, 18671, 12291, 7067, 13567, 14623, 4790, 4652, 9335, 2328, -4317, -1368, -3200, -8823, -8752, -8353, -13057, -12249, -10315, -14274, -12712, -6862, -8831, -8798, -963, -655, -3951, 2552, 9010, 4130, 7257, 13874, 11096, 8735, 14350, 12156, 7845, 10949, 12282, 3227, 3205, 6742, -852, -5443, -891, -4600, -11368, -8991, -7550, -13154, -13074, -9222, -11657, -11150, -6472, -7313, -7441, -421, 280, -1297, 4551, 10362, 4640, 6659, 14830, 11797, 8069, 12193, 14833, 7499, 6731, 9910, 4979, 1295, 1074, -1801, -4192, -4495, -8137, -11971, -8074, -8218, -14688, -11962, -5588, -11230, -12762, -3867, -2518, -6986, -1860, 3864, 1873, 3077, 8067, 8800, 8870, 12198]
376A2198j474j758M109k691m067J916L21p066k559M854m788q155L981P96o500
391a0883r9K593k503j542M760o38K37M061K59M3N372L236l947L609O983l170k552
408E819O490J530o945K121L022n915j525J327l659l254k97k956l628K188j164
423f846o045K972L165n512j039Q074q31l503O089M619l280K100N073K38J394K022
439H690M3J1L114j409l190K915j87o699n2L882o165o023L519q45n976j356L383
456f345l810j346K445K13j86K086M86L2O149N32k660N146N597l823N91P040r95
473A1152n070L007L840n503j400K042k345l924N13k878l273J043k901l995K768
488f924N52n572J267N030k865k802O261K960l875K674O264o63l50M766P85q02
$$ y = [12198, 10724, 8966, 13075, 10384, 6317, 8233, 8554, 1488, -1071, 3783, -1005, -9160, -5179, -4383, -10883, -10982, -8389, -10892, -12434, -7674, -8312, -8075, -4014, -3755, -3712, 1660, 4896, 949, 4558, 11541, 8371, 5819, 12309, 13839, 6894, 9015, 12037, 6122, 4597, 5924, 2265, -989, -1286, -4242, -7870, -5682, -6846, -12891, -9919, -6754, -12266, -13305, -5231, -6062, -9565, -3476, 1143, -2137, -37, 5036, 5274, 6668, 8690, 8733, 8744, 11858, 10449, 7259, 10174, 9987, 3288, 3236, 7118, 953, -5070, -1551, -2396, -8372, -9728, -6345, -10155, -11501, -9056, -8843, -9029, -6943, -6457, -6425, -276, 256, -2404, 2742, 8339, 4516, 5107, 12147, 11152, 6082, 9089, 12929, 7426, 6026, 8068, 5723, 1799, 2312, -566, -3839, -2796, -5697, -9692, -6924, -6372, -11944, -10677, -5647, -8512, -11314, -5053, -2093, -5968, -3294, 2970, 2307, 1957, 6723, 7508, 6706]
504F706L023j16k212K551M56n489P36K851n662l930L520l024n196J111O22m866
520h919j298K180j090o95K083p07J000L724O10n95L984L143k578K967M845o86
536G968j974K755J795k902l0K185l066k297N54k042l665l00j418l878P80L19n130
553a0346o06M148k297j403L711J563k569L700L229j12J020L312J07Q72L126R61
569H416j528K812Q9m171J793J974n311j571R93k126m059Q45k92m189j302J295
585f332k270p82J028j35j205M811J35j710M344K827k198J631N769p66j509M413
601H051N71j531J268J293k823j365N27k423j200k41k748l505J476p62m914K7K535
618e764l034j185L354n24k199K776L835m9M38K656Q77J340L247k35K00K935J48
$$ y = [6706, 9729, 9613, 7401, 9952, 10408, 4919, 5655, 8506, 2844, -1086, 2434, -590, -5786, -4675, -4053, -8919, -10217, -8037, -9127, -9822, -7739, -8446, -7446, -3722, -3112, -3707, 277, 3420, 842, 3809, 8654, 7968, 5994, 8749, 10544, 7642, 7612, 9797, 6731, 4434, 4988, 2946, -719, -1019, -2437, -6315, -5535, -5216, -10346, -10952, -6804, -9101, -10504, -6793, -5230, -7799, -4099, -870, -982, 38, 3350, 3457, 4329, 7455, 8416, 6888, 9700, 9789, 5618, 7411, 9385, 4074, 2503, 3496, 1370, -2689, -1844, -2136, -6325, -7627, -6332, -8602, -9384, -8356, -8491, -9696, -4885, -4750, -6460, -2116, 711, -1487, 144, 5913, 5147, 3638, 8051, 8622, 7091, 8359, 9652, 6829, 5464, 5991, 3568, 2368, 2127, -621, -4126, -2650, -3412, -8326, -8299, -5764, -8798, -9983, -6629, -7153, -9352, -6576, -2741, -2790, -2352, 304, 1181, 2521, 5768, 5533, 5733, 8668, 8816]
635H816l059K175K099m683j425K127j530n092O66K29l924k081J703k922q47P18
651g030j572j67L299j143j293L734J823j318K363N456j109j554M849R91j514Q70
667F685K099j117n91L95k482n27l11k691k783J501j212m849O37J304m105k267
683a0314M735q57k889K339K829p23K27L256r8J562L766o22j11M406r34j078K644
700H138J941m887N82K212k746l637J132l82l348j812K64j915j287m59m31j191
716g826J042j83j243K899J702j500R46M265l11L34L759J473j384K103J440q18
732F698n07J101r17p52q3k717j369J140j318m505Q06P91m653j596L943k524l122
749i584K720R93j143J816J077P77J371K534K8J628K484K27j069L080J006j679
$$ y = [8816, 5757, 7932, 10031, 5348, 3923, 6050, 4520, -572, 94, 323, -3601, -5682, -3979, -6901, -7748, -7030, -8602, -8769, -5470, -6613, -7906, -4172, -2349, -3667, -1304, 4152, 3043, 1489, 6338, 7329, 5815, 6685, 8784, 7667, 7076, 7471, 4989, 4462, 4151, 1460, -1323, 178, -1034, -5883, -5246, -3942, -8047, -10314, -5579, -6436, -9325, -6986, -4157, -4880, -4653, -1397, -1495, 67, 3833, 3211, 3100, 7506, 6572, 5494, 8138, 10079, 5192, 5774, 7986, 5240, 1603, 2735, 2353, -995, -2807, -2543, -4458, -5745, -6204, -6635, -7826, -6784, -6967, -8210, -5311, -3609, -5109, -4163, 102, -209, 125, 3884, 5357, 3973, 6076, 7516, 6698, 6191, 7292, 6375, 5623, 5540, 2823, 1454, 2594, 1276, -3229, -2423, -1632, -6285, -7881, -3938, -6462, -9584, -6864, -5871, -7014, -5198, -4121, -3344, -1973, 561, 589, 2217, 4701, 4928, 3859, 6939, 7945, 6266]
765F266L1K112k453k829J912n63l474j505J53j540j770j73k000k34M91j379p38
782g693J705P40k330K465M481k159m0M661J170j270K455K467m65l12J477o31Q7
799F808N54k082j270R9k077l372J658o02m450l70J799k122k671J480J767k322
815g173L67J850J119M34J431O83J212K752n51O74L378L10k586K544K428l067k105
832C700K887j447k595K72P8l602j055j98k208j81n16k431M10K080j833o26K524
849d741J295j079Q35L625J88r53L602K049j176J208J717N58n96O10j821M66J22
866E909k803k334K326k531k815m85J735k985k799K039l34k361N68J845k96Q60
882d461J086J066P86K210o00J209L820j615K65J960J835k319n66K688j716k599
$$ y = [6266, 6297, 8409, 5956, 3127, 5039, 4476, 1002, -503, -350, -1890, -3660, -3833, -5833, -6067, -5576, -6955, -7693, -5988, -5248, -7578, -5113, -632, -2791, -2831, 1830, 3000, 1730, 4185, 6652, 6187, 5875, 7352, 6721, 6808, 7362, 5280, 4010, 4109, 2032, -1340, 318, -284, -4734, -5104, -3305, -5427, -8098, -6618, -4851, -7173, -6806, -4956, -3837, -3403, -1972, -1289, -77, 2675, 2124, 2798, 6176, 6486, 3900, 6444, 8872, 5805, 3700, 6587, 5140, 2545, 2817, 2895, -707, -1762, -1960, -4168, -4349, -4865, -7296, -6886, -4806, -6639, -7265, -4741, -3446, -4525, -3690, -65, 123, -830, 2772, 4821, 3645, 4853, 6570, 7128, 6532, 7142, 5321, 5787, 5909, 3106, 772, 3098, 567, -2248, -2733, -998, -3983, -6782, -4743, -5077, -7438, -6870, -5025, -5321, -4461, -3375, -2309, -1523, 687, 87, 1296, 5116, 3501, 3766, 5726, 7561, 5242, 4676, 7364, 5648, 3049]
898C049O26J322l659j084K3k243j202M5k159p53O50j22j722K091R18j642R06M094
916h62m69r07L030J877j042Q89L208j218R18J454j059q11J257k457k71M57n12
933C482l704Q93M40m277j707J386m00l245J314P32j566J393P40K07J410J415K49
950a238J12L333k33J25J764J663q13L04J934r27j352P30k28k675m22O0k395p84
968a042q87j266p50j06j460j348K607p43j118N49K601l37K51J933J285O4R21J842
986B996r4J216L74J18Q52Q41j775j171J872q59l433Q79K13k269j456L32j708j578
1004d650n58M3m76R3O80m40J117J155K89N41L072r01K87K512K081j631M40K069
1022E723j08j994K076J00j601j285K57j548m96k15k245j063p5j826k541K372j94
$$ y = [3049, 3675, 4997, 1338, 254, 277, -1966, -3168, -3123, -5282, -6035, -5385, -5507, -7229, -5138, -4220, -5862, -4956, -862, -1331, -2238, 792, 2669, 1627, 2516, 5724, 4506, 5424, 6878, 5819, 5008, 6265, 3808, 3537, 3994, 3482, -222, 671, 1111, -3166, -4873, -3487, -3887, -7132, -5818, -5086, -6652, -5259, -4519, -4312, -2902, -1487, -1238, -1126, 2207, 1974, 2099, 3863, 5526, 4713, 5017, 6951, 6024, 4672, 5402, 5174, 2499, 2077, 2137, -258, -1042, -1929, -3195, -3945, -4051, -5511, -6859, -4252, -4995, -6113, -5564, -2963, -3300, -3049, -1116, 169, 233, 1154, 2996, 2902, 4118, 4492, 4610, 5462, 6303, 4528, 3357, 5229, 4370, 937, 1816, 2029, -240, -1696, -1364, -3072, -4650, -5208, -5165, -5641, -5548, -4868, -5308, -4191, -3036, -2747, -2206, 866, -35, 252, 2764, 4845, 3214, 3654, 5723, 5615, 3621, 5697, 5797, 4196, 2911, 3168, 1620, 1124, 909, -1336, -2399, -2474, -4300, -6841, -4469, -4663]
1039d663k339J799K369j549L46J963L70o9K204Q63J026J313O2J84N71R37n27K7
1057D887J911k861j393K40N40k606j333J187j689k329J81j80j385k13o37o4J651
1074d093l98o06K126J793p73M08L183J501j848Q82L277j116r95J752M75q41n32
1091D195j55j791O26j583j142p57ok440n40R98j914j460R44J003j002k05K185
1108c044l76l49J621J558J190O50J887j030J926R43j189P71J541j095j703J248
1124D549j033k246m39O22j687k200M62n48j424J15k02l86M1K37j419J925R29j9
1142b723j59K345J125r49J834J915q33J63K836p07r30L34j78j24L12j670o19r14
1160A058q16k169p89J673j567k444R93M53j379l46J698J69o20O93J814O2L67P92
$$ y = [-4663, -7002, -5203, -2834, -4383, -4037, -2074, -1704, -1773, 431, 1294, 2320, 3633, 3695, 3879, 4450, 5387, 4860, 4887, 6798, 3937, 2544, 2784, 3324, 718, -615, 572, -1117, -3446, -3265, -3445, -4830, -5043, -5680, -5744, -4093, -4491, -5097, -2971, -1178, -1951, -1543, 1640, 3141, 1293, 2175, 5452, 4336, 3341, 5093, 5568, 4727, 4195, 4040, 2249, 2875, 1292, 150, -607, -613, -3053, -3593, -2595, -4509, -5969, -5025, -4022, -5024, -5229, -3044, -3420, -3769, -2148, -590, 600, 1250, 3137, 2107, 4033, 4976, 3787, 4558, 6099, 5004, 3301, 4549, 3516, 1270, 831, 1453, -234, -2434, -1972, -2520, -3944, -3829, -4031, -4417, -4376, -4139, -5558, -3633, -2704, -2723, -2882, -537, 588, -361, 1473, 3388, 2555, 2718, 5554, 4847, 3917, 4251, 4073, 3949, 4261, 2591, 1972, 1058, 242, -1927, -2716, -1043, -2610, -5054, -4061, -3608, -4987, -5333, -3635, -3466, -4086, -3393, -1579, -1517, -1150, -358]
1178c58R40J801P13M03J073N25m96j283J672j037j880L51M00k285r89j110L13
1195a247j040m15j231m03K34o90r14J588J035j874J374K422m9o46K434J155N6
1212A789n66K676L73l22O32N79q88q86K78n97k54j605j445r7k35j492j640J121
1230b579r64j565K61J704q68p61J202J190m2J126L73J218J620m83P21K196M34
1247D783j137K50J636j098j493Q84J42j246j971N98m95k651n18M7j00m60j257
1264d086n61K56O91r61P16J823r0p66K448J812r91Q87K120n99J49R15pm56J283
1283D583o06n79k13p08j755J10N31k448j231N67q58j237L94M71j881k22J579N9
1301c444k5Q40J334N66K40N58J585J6J521l20Q26J080k51j306O69R28k151m41
$$ y = [-358, 582, 2383, 3096, 3499, 4572, 5097, 4601, 3318, 4990, 3953, 2073, 2424, 2824, 539, -450, -1560, -1247, -2287, -2702, -3933, -4336, -4102, -4792, -5706, -4118, -3083, -4957, -3583, -1161, -1210, -1856, 578, 1733, 1789, 1223, 3899, 4272, 3950, 4582, 5161, 4273, 3387, 3665, 3068, 2814, 1209, -236, -333, -568, -2060, -3700, -2579, -3543, -5108, -4847, -3143, -4011, -4772, -3570, -2380, -2422, -1296, -923, 295, 1915, 1432, 2153, 4349, 4783, 3646, 3896, 5532, 4434, 2941, 3825, 3967, 2721, 750, 1348, 853, -1798, -2316, -2269, -2369, -2829, -4086, -4647, -4391, -3700, -4661, -3945, -2122, -2212, -2978, -530, 1282, 291, 1178, 3298, 2699, 2848, 3763, 3756, 3300, 4583, 3977, 3398, 3185, 2477, 722, 832, 1363, -1085, -2316, -1749, -2607, -3844, -3450, -2979, -4860, -5082, -3503, -3444, -3469, -2629, -1295, -729, -489, 69, 1654, 1670, 3191, 2871, 3697, 4777, 4526, 3220, 3889, 4817, 2666, 2225]
1319B225L28j451r03J13j840n39q94k64q02J055p39j340K74J718P9n68J077J439
1337a032L90L53J971M97n60J293Q11j16N24j21L12m16m16q19j22o51j345j161
1355f08O74j421j545m16j66p44n52J495o56L04J57M22Q72M51J466m36J721Q47
1373A865o8Q36J644k74j003M59J060j649J97K64j468p47J82r30j520o38m6o14
1391b450L80q27j596N03J269j584P94J027P83o10J407J204K68p10K798m59K97
1408B494P14k41L45J266j113m68K25m64j139j208p6m45j797K49Nj099j295P08
1426c339q62L26n6K01R40K51O46M23J424K58O39J422L62l37L21Q42R33j489m04
1445B501J130o0j209n26p78l9j144j237m9m58n00j280L60L37j173l06J436M11
$$ y = [2225, 2553, 1102, 199, 312, -1528, -2067, -2961, -3225, -4027, -2972, -3711, -5051, -4777, -3059, -2980, -3548, -2471, -1032, -642, -289, 1682, 2179, 1619, 2912, 3723, 3607, 4131, 4010, 4322, 3906, 3490, 2671, 2549, 1898, 553, -608, 66, -1355, -2900, -3316, -3482, -4226, -4778, -3283, -3939, -3635, -3478, -3056, -2184, -1733, -267, -703, 1018, 1865, 1797, 2633, 4277, 4003, 3000, 3459, 4519, 2870, 3067, 3331, 1863, 1116, 1298, 368, -1152, -1790, -1836, -2450, -2070, -2897, -4493, -3990, -2721, -4305, -3511, -2484, -1701, -2311, -904, 300, 568, -142, 2656, 2197, 2494, 3208, 2967, 3312, 4578, 3465, 2997, 3222, 2758, 1619, 411, 335, -110, -1907, -1658, -1653, -2752, -4047, -3339, -4201, -3875, -3931, -3730, -2790, -2539, -1893, -1470, -46, 212, 851, 2273, 2635, 2298, 2619, 3461, 4394, 2905, 2501, 3631, 3571, 2362, 1836, 1058, 1019, -125, -1362, -1411, -1869, -2369, -3649, -3289, -2952, -4125, -4431, -2995, -2584]
1463b584K97R49J032J3m53J680M82N52N89N06m2N71p76k70J596m17j911m28N10
1482A896j495j038m63Q69k291p77M39J60j199O6J01M25L41j51J149J399j26M30
1500b65J119L81J27K07J970K55j096qJ714r63n56r10K46m38j121j452m1N47j368
1519a652j367L81J72j794j5J227m44l58M59K110o82O42N99J351L24L37J272M0
1537B602R81j77o45R07k98n40k10O19j819j667Q13J5j608r46j08o09q40M50Q8
1556b992j27m49L51P0K182m20l86R97J672L30p27K362q87N32P69M82j41n69l19
1575B730J35n26j08q29o65o09j023n99j44j4j793j77J646j264n47O99P33K07J
1594b147J200O85n16J288J047P40O96q6J64M28M88j269O37J45j296j472J142m02
$$ y = [-2584, -2287, -1338, -306, -293, -746, 934, 1416, 1968, 2557, 3063, 3021, 3592, 2816, 2546, 4142, 3725, 1814, 1386, 1896, 401, -637, -1100, -231, -2522, -3299, -2860, -2700, -3899, -3833, -3732, -3307, -2966, -3117, -1968, -569, -695, -265, 854, 1235, 1362, 1569, 3539, 3794, 2698, 2690, 4404, 3441, 2885, 1975, 2221, 1783, 662, -790, -831, -284, -1652, -3019, -2638, -2466, -4260, -4275, -3048, -3492, -3850, -3391, -1281, -1963, -1321, -722, 629, 953, 1290, 2562, 2602, 3583, 3406, 2761, 3668, 3370, 2830, 2620, 3239, 1420, -247, 566, 581, -1027, -1973, -2081, -2690, -3530, -3080, -2992, -3119, -3568, -3217, -3147, -965, -1385, -1771, -774, 898, 1228, 501, 2863, 1976, 2508, 3277, 3759, 3618, 3049, 2730, 2865, 2339, 2231, 1402, 737, 128, -895, -1494, -1638, -1652, -3445, -3622, -1976, -3240, -3787, -3088, -2355, -2148, -2147, -947, -262, -778, 510, 1557, 2297, 2993, 2907, 3071, 3499, 3987, 2718, 3355, 3500, 2204, 732, 1874, 1472]
1612A472k176L87p41p03r56k55O67j299O92r7j8Q59l0o58J382Q09k76J332J356
1631A747M92j163J687R13o89l14J101m84o13j149N96Q7j447n73m21l65r61j184
1649b740L51N64j545L10M42n65M5O39R88M44Q1N42K72J000J044K00K17P60N50
1668C599j596J456O8j202o71M08l52r82k44m21j207n93M59r77r60O1K03m48R80
1687b419n10r9J434K13J83O31R95K43k20J532R86p92J8J048n28j94km41L57q57
1707A578n57o68l97k95j207m93N84o61r21N83j36j179J816l6L21J10L21O47O59
1726F9M58N81Q41J25k2M46M80J103k107K87J164m49j040l22q12j60j062L28j713
1745a805n58J81k63K53n98J46o76J042L76k63R41J847o46q6M67Q77M57J76N69
$$ y = [1472, -704, -317, -1058, -1761, -2717, -2972, -2305, -3604, -2912, -3009, -3027, -2168, -2198, -2856, -1474, -665, -941, 391, 1747, 2239, 1076, 2763, 3676, 2987, 2673, 3774, 3290, 2677, 1528, 2124, 2211, 764, 191, -230, -595, -1556, -2740, -2389, -1825, -3370, -3060, -2618, -3183, -3138, -2499, -1511, -1067, -986, -444, -172, 828, 1872, 2072, 2289, 3049, 3599, 2003, 3459, 3527, 2325, 1654, 2062, 1710, 728, 484, 63, -1144, -1737, -1278, -2255, -3215, -3154, -2951, -3399, -2419, -2929, -3028, -1594, -1381, -1198, -567, 428, 671, 451, 1983, 2969, 2177, 2195, 3243, 2715, 2521, 2519, 2078, 2435, 1578, 1021, 353, -44, -339, -1546, -2039, -1455, -2116, -3037, -2454, -2590, -3769, -1953, -1989, -1668, -1558, -1237, -590, 69, 527, 1108, 1949, 2074, 2052, 2498, 2978, 4081, 1974, 2261, 3425, 2976, 1936, 1614, 802, 642, -420, -92, -1805, -2363, -2182, -2445, -2192, -2790, -2644, -3320, -2278, -1902, -2165, -1224, 623, -23, -109, 358, 1235, 1692, 1868, 2437]
1764B437L92l08L93l8r65P02j282K56q43n17o39L32n82j463p51Q66K89j494K41
1783b974K65R43q40J407L54N56M99p08J449J118p04M60O91n91j72J039O67j127
1801B332l39J4m68m93j037M07p39q02k68r11M26j163l56P01R07j1p92O52J126
1820h14n29k67J995M49o69J310R01L86k85K54k72O19o06n18m77N64o04j211l88
1839a62M05j739O7J63m23j414J93Q23r5l36L86N04K68N83nP17j98J312o84J606
1859A971J134k122J305Kj90k28L94j24r54l73O56o93k003N16n47l68p5j090P34
1878b055L85q97j214J409Q86J88o0P97J107j083J429P84p93P12R00J41j88k17
1896B231m7M50N27j611p34K36K7j221N3l50j619j93M3k86o74J064q78L84N04k96
$$ y = [2437, 2829, 2521, 2914, 2876, 1911, 2613, 1331, 1587, 744, 227, -412, -80, -662, -2125, -2876, -2010, -1721, -3215, -2974, -2709, -1766, -2606, -1199, -845, -289, 210, -498, 951, 2069, 1365, 1825, 2516, 1925, 1753, 2792, 3459, 2332, 1993, 2007, 1539, 1046, 9, 416, -323, -1125, -1393, -2304, -1878, -3041, -3397, -2696, -1789, -1800, -2592, -1940, -814, -1343, -1610, 385, 834, 165, 1475, 2376, 2762, 2477, 2731, 2459, 3078, 2472, 1954, 1477, 2041, 1437, 226, -162, 243, -1496, -1429, -1266, -1689, -3103, -2910, -2087, -2182, -2518, -2132, -1628, -1360, -777, -782, -65, -263, 1049, 365, 1971, 3105, 983, 2288, 2290, 2100, 1872, 2266, 2142, 1188, 815, 1471, 778, -1225, -709, -1256, -1624, -1699, -2789, -2055, -1670, -2567, -3781, -2372, -1486, -1298, -1358, -561, 546, -537, 892, 1676, 883, 1595, 2495, 2636, 2448, 2231, 2184, 2634, 3161, 1550, 816, 1052, 1079, -142, -89, -439, -2058, -2251, -2208, -2494, -3168, -2104, -2982, -2598, -2094, -2390]
1916b390J723k19Q13K35N07R26N43k20l51J124r3j296J921j503P2k23J165k029
1934G05m26J09r15j46o89m81j84M6k91r90J40J391n23K0J804L49j214R99J736
1953A440p4N55r84O34L70k02R09Q3L86j606p0O78n99j364n37R79j069n34o03Q18
1973g90j193m38M58k17k80K73J28J184k48J192K18P41J26n35j43K051j155J65
1991A537R58k12o28r28J786k92j172J80j029l84p45q13O15q64p54Ol0k66L16N41
2011b178R45j348J431K98M24M43n19J512O06n9j18N69K20R9j80k54l58j337K30
2030D26N00m96q66j41o64L02k163J374q97J25k78M79N95m31k58j26J557R55n21
2049e28J477p25J254l37k01J238J89l09L17K4j118J33r3k52K27q95j205j05K10
$$ y = [-2390, -667, -886, -73, 162, 669, 1595, 2138, 1918, 1567, 2691, 2598, 1302, 3223, 1720, 1792, 1569, 2734, 705, 279, 388, -527, -673, -1362, -1843, -2027, -1981, -2272, -3262, -3122, -1731, -2254, -2234, -430, -81, -1295, -296, 1440, 1366, 1921, 937, 1571, 1941, 1739, 2648, 2731, 3117, 1511, 1441, 2119, 1520, 156, -381, 598, -471, -1005, -1608, -790, -1983, -2421, -1963, -2180, -2460, -2187, -2059, -875, -1123, 69, 287, 1028, 1154, 619, 476, 2527, 1372, 1537, 2495, 2283, 1655, 727, 2513, 2221, 1049, 1229, 200, -184, -929, -1742, -1127, -1991, -2745, -2739, -2769, -3035, -2719, -2178, -1233, -2581, -1150, -852, -428, 15, -504, 1008, 1614, 1555, 1437, 2006, 2226, 2325, 2145, 1891, 1533, 196, 426, 926, 430, -436, -577, -1241, -939, -3102, -1728, -2625, -2500, -2778, -2299, -1704, -2135, -2393, -2519, -962, -7, -528, 949, 224, 1478, 1141, 940, 2178, 2367, 2058, 2375, 2399, 1281, 1414, 1321, 1069, 1296, 401, -804, -909, -699]
2068f99n43r50J301l43j883J444l23l79J65J371k28n38N61O43R81L51N14P14o39
2087A520P35n5j11L16r70K34j48n84j070j36K00k218J784j607Q31m82p69Q79n56
2106b207J902r41j00o8Q77p92M24J131J20K38r3Q61L96j23O26j05m89J044Kj070
2126A633j747J029q74j112J29Q45q46k29J91j159J2K21r72R7M92J365L21n7O9
2145e92l94J403R55r99N04j426J841Q56M01j010n75N88N90q07m30j30l95o66l63
2164f49j4j90j064k36Q79j20p46o33J242N55q18J84P37P59k51J259M93K04M84
2183B075m83q2r4J64j57o22J63j055J263o16k36p16o71N62n25q33j87O25p36L86
2203a775M65jJ91j83L97K05K74m01J027J054l27O95n7J54LK44R9m02k40l28O42
$$ y = [-699, -1242, -2192, -891, -1234, -3117, -1673, -1996, -2375, -2210, -839, -1067, -1605, -1044, -401, 580, 931, 1445, 2159, 1520, 2255, 2200, 2089, 2405, 1435, 1669, 1521, 937, -133, -269, -69, -2287, -503, -2110, -1279, -1761, -2530, -1651, -2207, -305, -1246, -1346, -1414, -537, -1329, -905, 226, 346, 584, 491, 1352, 1748, 1625, 2251, 2146, 1657, 2701, 2703, 1633, -114, 915, 41, -1071, -942, -97, -943, -1172, -981, -2140, -2128, -1907, -2879, -2782, -2290, -925, -604, -661, -592, -986, 417, 1372, 373, 877, -549, 1292, 2148, 2549, 1539, 964, 1552, 2142, 1335, 905, 775, 380, -286, -649, -663, -853, -1917, -2153, -1274, -1394, -2140, -2773, -1531, -976, -1794, -1610, -873, -114, -365, 894, 1387, 1591, 2075, 1592, 1510, 1416, 1580, 1423, 801, 964, -91, 1172, 556, 320, -396, -1067, -505, -1030, -1863, -2050, -1425, -2161, -1775, -1310, -1311, -1120, -1303, -906, -701, -427, -828, 199, 1253, 926, 1621, 1564, 1718, 1721, 1965, 2064, 1662, 1422, 1094, 1736]
2224A736o50o43q84L51m47p31M9r9j51r37K2J211J07r94O07J242k17L87n61R84
2244C82M62m28J088K77l26K19O28o65m96o1M45j97r53o46J34M6o74q21K57j33
2264a462j071Q63j37L13k27L08L95K13j049J513L12J82O47K44N84l77K09N34o63
2283A331P66l44k68K39q57J31K46q40j102K41k20M53r14p07m87J274j82j234O99
2302a775R51M86L5k40J132k46m03P94J025l08L21M3K65M26j193o95L66N46n33
2321I97m27m47k36l62J13K7q18j176J272j73n60Q80o0r68O40N52N75K15k1K04
2341B27J061J59O4p46J324J2n80P69J06j046o14M29n19l60m48p88k7P07j615L16
2361a569Q5o24q9J76O81L18m37R11r3m27R1J532J72Jj83Q44N30mPk6Q0p53N09
$$ y = [1736, 1086, 443, -441, -90, -537, -1268, -1219, -1318, -1469, -2406, -2384, -1173, -1066, -2060, -1453, -211, -428, -41, -602, 382, 844, 416, 1504, 1781, 1455, 1674, 2302, 1637, 1141, 1080, 1525, 1328, 375, -271, -137, -91, -765, -1586, -1329, -1462, -2533, -1670, -1807, -1494, -1721, -1413, -1018, -805, -1854, -341, -29, 153, 800, 1044, 1628, 1251, 1460, 1994, 1331, 2097, 1753, 1485, 1724, 867, 998, 1244, 404, -698, -457, -677, -224, -1138, -1845, -2332, -1058, -1240, -2474, -1775, -824, -338, -303, -543, 589, 343, -60, 734, 1759, 1451, 1772, 1815, 2080, 2506, 1313, 618, 984, 1530, 997, 570, 123, -113, -475, -362, -335, -1153, -2329, -1057, -1230, -1790, -910, -970, -1938, -1298, -746, -171, 44, 23, 227, 1288, 1447, 1511, 765, 2089, 2101, 1521, 2290, 2396, 1350, 736, 1165, 646, 286, -162, -950, -977, -270, -1885, -1569, -1484, -2108, -2197, -2021, -1340, -1022, -1459, -548, -641, -1068, -977, 555, 727, 728, 545, 1389, 1919, 1915, 1922, 1896, 1976, 1223, 1732]
2384A732q72p2k39r37L62m79j42j155O57p50K25O87p67o2p7N57J407J97j182P60
2404a50O30p1K86L61M24l68n18J107m82O43n33L11l92p52p0j41m01p11o0N85j205
2425a507J249j659j88R32m72l5J183J62j017Q81M97l57L76N58l42P76K06O1N04
2444A808O0n37j11M89m28j001R79j174K22j65r92L04k8q44k39K41P12l63O37n66
2464i96J123o31m16O67j489J941O42O88l02k19N81O74j079J99P85r45n08M22l56
2483G81k9j415M99j6m67o63K72k53J72J62o58j78Q55r46R61L9j99K17Q11l13N12
2504A44M52M61n33J655K1n55o72q0J0j75M82L7j279p22J39p90q9O91L76m34j047
2525a908k11J93R97p50O74p02R69N27P43j75Q90L38p23q1L16j3N65p21j2j06L67
$$ y = [1732, 860, 788, 549, -388, -26, -505, -647, -1802, -1145, -1895, -1670, -983, -1750, -1812, -1889, -1332, 75, 272, -910, -150, 480, 409, 695, 1056, 1480, 1112, 594, 1701, 1219, 1862, 1329, 1640, 1248, 496, 426, 285, -116, -827, -887, -302, -1507, -258, -1917, -2105, -1173, -1645, -1680, -497, -335, -1352, -471, 26, -331, 45, 603, 261, 1037, 1243, 1304, 1808, 1868, 1331, 1220, 1709, 1281, 280, 1259, 85, 307, 142, -850, -546, -574, -1418, -1657, -1416, -704, -1067, -430, -996, 127, -504, -920, -253, -1742, 199, 841, 1529, 1227, 1008, 1589, 2263, 1184, 1383, 2168, 1223, 715, 1137, 781, 752, -663, -164, -180, -647, -1310, -1038, -1291, -1119, -957, -1615, -1793, -938, -1884, -923, -884, -1083, -866, -55, -368, 144, 596, 1057, 524, 2179, 2200, 1645, 973, 893, 903, 728, 1210, 1247, -32, -754, -615, -1405, -1494, -803, -427, -861, -1908, -2119, -1926, -929, -1679, -1005, -1707, -738, -211, 532, 357, 1247, 1585, 862, 781, 1097, 1084, 1649, 928, 916, 810, 1177]
2546A177j51n68j175M34l1n87J07j5Kj068L68P64k68q66O62L34J39J36K59J042
2566F95M57r17J003k08k1M62o26Q30j10r60R28q50N06j533R71l48l83n48M54p81
2586i79q20O27p51N11Q9q92O85J414j306Q9N42M52M88L63Q1K89r3l12J214m21
2606A270N0j89K51m29j11n0o41R1k88n68m10M53j016l04R41o27K24J66N01o39
2626a325N4R48K19p0k54M26N71R70j177K16Q38j94n36J010J52j133j84M36K5q59
2646A33k75q08J6K09j14k53L21l07j00J78j00q57O25P79M10m70L87R90j6p47J052
2667A053k30M32n7N78J40n80J36l99j77j94L2l93j148J00k6q0m85L93n63k2L38
2688a152m29O34K88J61j013N90Q32O15l19L70k53M25O31m19L60m15j19L07j45
$$ y = [1177, 1026, 458, -717, -283, -314, -901, -794, -809, -807, -1875, -1507, -743, -1011, -1877, -1215, -881, -742, -606, -347, 695, 1152, 235, 1238, 1030, 1009, 1471, 845, 1675, 1565, 605, 1533, 683, 1189, -344, 627, 279, -104, -652, -198, -979, -1799, -1172, -1923, -1412, -1323, -2215, -1530, -116, -1422, -1333, -791, -339, 149, 512, 593, 882, 789, 477, 1691, 1270, 1320, 1131, 1382, 953, 842, 792, 151, 242, -46, -614, -1024, -571, -1587, -1891, -950, -1577, -1353, -1187, -686, -1325, -1271, -323, -104, -174, -428, -2, 569, 1539, 362, 578, 1416, 1222, 686, 1696, 1848, 715, 531, 967, 992, 133, -142, -950, -934, -725, -839, -1092, -771, -1078, -1178, -1000, -1100, -1957, -1332, -553, -143, -613, -226, 764, 748, 1, 1053, 823, 1255, 1198, 1776, 1916, 1336, 1472, 1073, 896, 702, 734, 341, -807, -707, -733, -813, -1298, -905, -1468, -1490, -1152, -1581, -947, -659, -498, -1511, -921, -89, 526, 207, 577, 324, 749, 1380, 961, 1321, 906, 787, 1094, 949]
2707I49k17J55o7q40l6r79N75l3k60n90l36P39M83q73O3O29l54p1N6Q01K84j36
2729e8Q11j07L66M02l55L67j05K66m90o72R57m63r08M23n72o36J40J21j243n0
2749a806J180o73k57K60j10P00k6L6R00N45r81P45q5j68R37m83j18O61o90M31
2769I98j22K66m02L64l30o70l66OM39j067j11k48J035j664L30j83O28O38o18L02
2789g75O27k61N22L66P5K06L33J48m62O50j25P6j039P19l44N56p82q40J47l01
2809e04J57J01m07J40l11n81n10O62P32j19k26J1K35N25J83k90J393J83o33R35
2829A676l92l54J3M11l67l5j68m79k77K64k21Q0k50o35qj6p3K25j48n35O97k48
2851h40m67P90k33L92R6J68k06J018K10K1J23m55J119n75p2O6l68L92p41r3J17
$$ y = [949, 732, 887, 820, -20, -56, -1035, -460, -493, -753, -1343, -1679, -940, -457, -1330, -1267, -638, -992, -1063, -1007, -206, 78, -58, 753, 646, 1012, 1414, 1059, 1426, 1321, 1587, 1097, 425, 1382, 919, 11, 434, -138, -774, -634, -513, -1756, -1806, -626, -1299, -1556, -1296, -1406, -706, -732, -696, 204, 749, -232, 513, 428, 260, 1197, 714, 596, 1257, 567, 998, 876, 1142, 740, 1104, 774, 104, -262, -256, 183, -884, -995, -1243, -208, -1872, -1542, -1725, -1097, -459, -1077, -775, -148, -409, 113, 479, 554, 760, 1093, 1241, 779, 1429, 1304, 1380, 341, 1060, 716, 1272, 490, -350, -203, -504, -347, -246, -653, -513, -824, -1405, -1915, -1253, -521, -640, -866, -855, -620, -95, 88, -202, 1191, 1374, 741, 1676, 1284, 930, 943, 1354, 987, 952, 784, 305, 28, 292, 71, 151, -99, -734, -742, -758, -831, -606, -754, -1289, -592, -840, -1307, -517, -750, -358, -262, -94, -300, 718, 928, 949, 1072, 617, 1736, 1161, 1089, 1155, 787, 1179, 438, 345, 462]
2872D62J2j181N6k01R3n9Km23P01o64K24M98l74N34m0K28J2J63J007j11L60r14
2894C85K69N17j19L75K53n24n17L00m65p6o48P6L67j363O17n05k27J30K52p86
2914a689J276p45O90K08L47j46M22n96L21N42j64N51p73N43K59P5K47n88o06M91
2934F65J86m88k54K82o16k38m73J84j34l0l38P04l33N59n52J67l37L26K43Q64
2954C87k68Q22n37L13M47o05L38Q51n72j90p29m9O82j108M83m5j41q49O78q27
2974i19N68n8p80p9J107p71L9M80l28J49M27P04j30k65J10qL04L22J3J26j6o37
2996C58O42j28m77J91k31Q51j255m63j04M6j26k74L70j046J296n70Q5J14M18m84
3016g87P50m67N29M42Q31j054K35k0M76o2m2m18O89n54l60j89R9M55j025K25l88
$$ y = [462, 474, -707, -651, -852, -759, -818, -816, -1239, -538, -1202, -978, -480, -854, -320, -360, -132, -120, 43, 1050, 939, 1299, 385, 654, 1171, 1052, 1427, 1680, 1156, 639, 939, 474, 398, -250, -174, 193, -1170, -553, -1058, -1285, -1155, -903, -1689, -413, -1158, -468, -260, 87, -59, 363, -233, 88, 630, 466, 1017, 244, 787, 1046, 1121, 1368, 780, 174, 665, 851, 363, 109, 391, -225, -463, -936, -752, -886, -916, -1254, -550, -883, -324, -876, -709, -1046, -720, -477, 387, 119, 941, 404, 717, 1164, 559, 897, 1748, 1176, 986, 257, 208, 890, -218, 265, 220, 79, -770, -92, -919, -351, -409, -1189, -1268, -161, -932, -893, -413, -741, -592, -165, 539, 409, 144, 254, 246, 550, 872, 885, 1011, 995, 358, 1000, 872, 395, 586, 355, 1206, -49, -512, -616, -570, -696, -970, -600, -1646, -350, -920, -835, -721, -303, -787, -37, -504, 25, 467, 1298, 244, 479, 459, 935, 873, 831, 413, 1102, 548, 188, -1, 98, 553, -472, -247, -635]
3037f35J52m30N44p44L09n24O26j90O15r03R65Rj12J63M24j00J048L5n71J90k77
3058E94M68n05L90K32o13n34M22n1j002O02k74l57q8L28J35r39k31R57n8n4m28
3079a006J100k22p8Q5N07j83N36j69N15j71R0r83J069K9p55K6J05n66K97J71j265
3100h68Q00q95k75J032o78k10J90L72q56O25j42K92M30r48J390o1m23R38J63m28
3120D48l9P27q46m7K30L60n99K93l32o32L15J32m59oj30j97l26R42p59J054j387
3141a258j92P12Q16j057L58Q40L08k40j22o3M15N59J21j13o31O59p8n76K90l51
3161C97n04l2L04o90q20J248r06N48m07l57Q1o1Q09pn52L81N99K58j08p9J01j30
3183G3R54o00j41J122j073N62l2J42k59n81R20j176L23j46K17m91o84N11p26J22
$$ y = [-635, -483, -913, -369, -1113, -804, -1328, -702, -892, -277, -1180, -215, -206, -318, -155, 269, 169, 1217, 1252, 681, 871, 594, 1062, 557, 947, 1179, 566, 32, 454, 403, -599, 3, -271, -628, -716, -388, -253, -1192, -1423, -466, -524, -578, -1006, 94, -128, -206, -121, 386, 203, 739, 570, 1085, 914, 1004, 21, 1090, 1119, 364, 390, 495, -71, 226, 397, -868, -68, -963, -1238, -206, -884, -1094, -904, -532, -1388, -763, -905, -613, -183, -1131, 259, 198, -225, 713, 876, 448, 409, 1136, 290, 243, 473, 833, 234, 527, 195, -437, -122, 10, -449, -455, -585, -782, -1108, -166, -925, 129, -1258, -1450, -738, 78, -979, -621, 219, 527, 287, 165, 102, 517, 1076, 1197, 1084, 453, 1112, 1034, 458, 748, 397, -107, -139, 165, -525, -1345, -97, -1003, -455, -862, -1219, -1138, -1199, -390, -397, -949, -568, 31, 289, 181, 102, 203, 73, 1027, 427, 286, 1408, 335, 897, 865, 1007, 748, 167, 1087, -89, 234, 88, 305, -186, -870, -359, -1085, -963]
3203i63o45R68MN47o68K04rL27K52J85K38j68L48m14O72n35K74k24P48k99r14
3224g2J026r76p2m27Q4J28M47p41o12M04r9J69q58J029k15M18J19k50N57k23L46
3245A82M19k85K25R4K87p50P02j71L31j002r2Q53j12j010Q58q58M77J1q15P49
3265I3n53l64J22P88r34J73m98L86L21M60L61j84J68j53M26n6M22j40J73n33l3
3286D45L17j53J85o00M13j077M00j59l50p4o8R10j188K4K05K58j24K04K29k06
3306d09l13J102r88R87o19N82K65N4j97j00J196j198R73q44l61M9M65N1l33l17
3326D5k57k18j38j02l39n7N42m81J94N45K32l10R2j88m70J454l4k74K13MQ29k96
3348I86J48l14o52L71M61q61O8M02o82r39M66M20n61p21O89p7k69m2J22O7J023
$$ y = [-963, -1608, -640, -636, -89, -757, -553, -562, -235, 17, 202, 440, 272, 620, 206, 878, 343, 617, 393, 1141, 842, -72, 954, -22, -94, -521, -437, -309, 138, -603, -1215, -811, -910, -741, -1599, -570, -785, -367, -248, -498, 59, -164, 182, 601, 316, 541, 635, 922, 172, 874, 703, 1034, 32, -60, 793, 681, -329, 529, -329, 148, 159, -656, 93, -460, -824, -702, 86, -848, -675, -1173, -787, -466, -6, 355, 171, 339, 186, 612, 556, 978, 838, 1011, 478, 445, 762, 609, 794, 194, 607, -470, -70, -229, -579, -653, -721, 189, -999, -975, -770, -512, -636, -432, -203, -409, -722, 380, -608, 379, -240, 342, 607, 661, 464, 364, 1560, 362, 1335, 491, 130, 179, 644, 695, 362, 45, -212, -430, -568, -670, -1009, -1066, -524, -1005, -811, -266, -34, -344, -252, -440, -910, 544, 510, 236, 449, 453, 1282, 986, 1134, 820, 168, 539, 1000, 139, 207, 609, -73, -1012, -546, -126, -687, -1408, -719, -796, -1065, -1107, -985, -918, 105]
3369A05m88L84o4k44P69n2l08O20k33k43N10J03r44Q22j86K23k39l36j80n92K58
3390c15L62k15N2l20M40p49p7j16J44L08n0j14N42p62M71O53O4k27O79k00k58
3411C12n0L38M85p77J48l5L62q8n45j5l20P27r34n2l37M97p34P16m3k63oJ67m47
3434h94M72K13R2J29l42N18j34j98P91p6l39M35m01M23j0M09j25o17n35q8q0J63
3456a94m01K95J66n16j09jK25K58M29j91J78K83l03l45k71J034O15p50l83M60
3476D79l40Q03m4k60j84L75l39l53J46M3k31J24j109O59o40Q46n62q4K84l47K11
3497e23k81K93r6L98M87k08P70n6K49l9n03J63j68O85l76j01o15P46l97j342Q81
3518c3M49r13N87n75N66n03m39K32M54l55o9L4n24N15K63q2N11L78l0K71p59P09
$$ y = [105, -383, 1, -63, -307, 462, 410, 102, 722, 489, 246, 756, 859, -85, 737, 551, 774, 535, 199, 19, -573, -315, 47, -168, -116, -436, 4, -745, -822, -938, -794, -486, -536, -650, -108, -870, -399, 254, 318, 91, 770, 570, 312, 262, 600, 1085, 308, 456, 421, 783, 695, 150, 135, -185, 542, -392, -444, -781, -284, -1018, -302, -345, -608, -614, -447, -894, -422, -209, -117, 12, -330, 188, 54, -144, 647, 571, 232, 667, 266, 689, 679, 1088, 963, 346, -189, -277, -357, -194, -595, -300, -134, -650, -759, -760, -535, -277, 152, -39, 139, 422, 119, -226, -497, 537, 1152, 402, 19, 479, 139, 942, 898, 638, 454, 829, 490, 137, 283, 326, 95, 219, -890, -231, -871, -25, -587, -671, -387, -734, -523, -804, -511, -607, -209, 278, 70, 840, 784, 1033, 994, 491, 654, 486, 1171, 795, 694, 79, 825, 428, -914, -33, 416, -497, 90, -485, 81, -422, -861, -629, -175, -530, -599, -565, -1089, -574, -311, -393, 118, 496, 466, 737, -22, 687]
3540F87L18j226P43l7o30N83l71L62o81R8L09O4j168P60J31j63p27P54m88M8m41
3561a075M34J62N8M72k97Q6k39J189l62P8Q36p75K54n75M84j038N25M00m34j65
3581A8j73N71p20N60j038L97J220j056l86M76m10l79J03K94O07q99N05k07j46
3600f63J287q66O97J74l09o3J17J9L97M14n46l52J52n2Q2j329K61M23K55p66m00
3621a068R40r5K22n79o88P16Q53p87r2j74J051J51l77L50n71M68L69p21K88J21
3641C77R3K15k36p61Q52M9j057K30J48m53j51O97n63K72m58K69L25n3N45l96J84
3662A28p4M93j74J4q56P65jj21O13l99L57n4N5k26m19L77lq99Q04j1j129O50j4
3685a24m07pj09m97Q68o21M66r7Q41r51O53P20n71J88o08L13N99l96m43M39L09
$$ y = [687, 1005, -221, 522, 485, -145, 438, 67, 429, -252, -154, 155, 219, -949, -189, -58, -221, -948, -194, -682, -634, -1075, -641, -479, -421, 51, -246, -160, -399, 790, 428, 506, 1342, 567, 821, 246, 730, -308, 217, 617, 183, 18, -155, 416, -304, 256, -782, -385, 835, -221, -607, -131, -541, -920, -817, -523, 84, -815, -310, -517, -663, 624, -242, 455, 629, 320, 257, 374, 393, 790, 1204, 658, 306, 458, 406, 488, -841, -580, -157, 98, -668, -1068, -128, -223, -1, -580, -1268, -552, 301, -486, -578, -752, 299, 450, 73, 423, -148, 320, 689, -32, 256, 377, 470, 685, 449, -312, 540, 589, -468, -238, -90, -543, -694, 3, -560, -288, -746, -477, -152, -205, 340, -56, 128, 54, 547, 373, 387, -469, 296, 295, 174, 787, 388, 745, 691, 746, 520, 101, 478, 475, -424, 380, 369, -760, -110, -124, -531, -538, -647, -1144, -276, -897, -431, -528, 313, -638, 15, 735, 164, 352, -256, 57, 656, 260, -183, 256, 565]
3706E65l8m67O65J29j401N64k15L16J64p68N27n39o4KN42l79L49m04j50O99m61
3727c64J048p41N78K1l74L83M73j334L19M47L94p90K88J4l81L07o94K81m30K44
3747c11Q0j88K15J89j51K88o18Q3N67m0p93k08J681j150Q02r05J085m46K44j89
3767B35K52o85M61M78QN20q66l03n07J61P35l68j45k35j51M52J10j029L5M07n36
3788i71O46R9k18N95K31o59M68L62J36j97j1J31q6l96Q27j135M98j28k60O00L4
3809E66p53N7p45R44l44p0Q3m69J12K52j26k96R08m48O94n59L06m5o9K50o85M64
3831B7L69k38L16o8p85O0J468p59n02N80J88r23Q3m13M47m79L07M80p67l02J023
3852A12n05j43P3j34L87J058r24n08R25j25R1o6l18O54l21k79R9K74m34j79Q16
$$ y = [565, 527, 60, 725, 854, -547, 17, -198, 118, 282, -486, 41, -498, -562, -560, -18, -397, -48, -452, -602, 97, -364, 684, -57, 521, 542, 168, 551, 1024, -310, 9, 456, 850, 60, 348, 362, -19, 288, -406, -125, -555, -311, -231, -419, -204, -15, -166, 122, -496, -413, 154, 114, -679, -887, 794, -356, 446, -459, 626, 180, 424, 235, 487, -198, 263, 741, 749, 1269, 403, 100, -407, -246, 489, 121, -24, -259, -410, 42, 152, -877, -842, -435, -971, -325, -226, -444, 151, 382, -277, 191, 553, 689, 492, 481, 612, 526, 130, 957, -178, 320, 192, -68, 532, 566, -187, -130, -875, 69, -275, -345, -262, -731, -619, -367, -493, -789, 119, -329, 365, -194, 112, 67, -2, 248, -437, 27, 396, 158, 474, 406, -379, -319, 1149, 390, -112, 468, 656, -267, -184, -597, -150, -629, -322, 158, -609, -911, 112, -393, -536, -463, -597, -210, 848, -76, -584, 341, 216, 307, 241, -77, 577, 256, -23, 76, 350, -84, -263, 553]
3873E53j73l83L1Q2j30o1m75P08m79n77P07k93K62J83l24P9P74o09m01P06K23
3894D03j50o2O66L00l71k54k53lJ03m87L66M34j455J90J010q50l68k28J050l22
3914b81l67R02q25N09n52l15J83L66P64j318J566j12j075N74M99J61lq47K73J73
3934B75l75R1k42N31q52O93j83l98J86J36Rq4o8m71R64l08r64Q77J60K75p99N66
3956A9M75r32Q36K91J29j058M87O99o87k70P5j24M55m83k68j96K40k01P82l68
3976i9m87J28k21L83m07N22R33j507M90L50J62K93m19L48M52o3p01L81j04l86
3996D8K96L41l19n92P68k35k40K32k09m3r55J389o50p04j02L63N70l38R18o69
4016a31QL03k16k11J536j208J5K44n31Q13l62j7p5Q36n55j49k70L61k36m92k08
$$ y = [553, 380, -3, 28, 110, -20, -81, -556, 152, -327, -904, -197, -490, -228, -45, -369, -290, 484, -125, -526, 180, 403, 253, 191, 857, 1157, 786, 532, 279, 276, 379, -108, 258, 692, -763, -573, 437, -413, -781, -1009, 41, -281, -648, 254, -571, -62, -614, -929, -746, -380, 384, -934, 632, 520, -555, 19, 518, 679, 676, -171, 102, 275, -100, -9, -251, 280, -572, 121, -62, -460, -274, -138, -129, -213, -281, -752, 212, -96, -1060, -183, -23, 252, -547, 19, 494, -438, 398, 689, 818, -240, 247, 946, 259, -11, 64, -60, 395, -88, -356, -552, -312, -513, 269, -99, -586, -458, -679, -296, -703, -181, 752, -755, -265, 85, 247, 540, 121, 469, 921, 858, 157, 538, 434, 48, 344, 685, 366, -226, 542, 307, 67, 299, 90, 47, -908, 481, -169, -873, -975, -612, -42, -380, 538, -131, -123, 180, -36, -247, 1289, 81, 96, 340, -191, 622, 260, 243, 168, 1004, 449, 300, 30, 391, 155, -337, -545]
4037e45J75j3K01P3n44M1Q47n28n30M94l37K11j05N17k38L08l41J92M39K50o54
4058h7Q22k12n79M79o83O92n70K15l49O27q74O46J22l15j76k42M51n53r3J248
4078E69p22k05J24k6N84o55L17M6J08J54k11j63K6L20K43n39L25m24J17K83j27
4099A44l2q28O08j28m68J071n5r67J12K03L1J94O51o67n63K32L43L63j00K47k18
4120A73J38k6O8J85j5j68k55o40J190m04m62M02J26J21j304L67M33M36n8o16J29
4141a80q5n78R75J55m99Q9O34o86K62j62O09m54J204j017L81r7j02q2r1l69O13
4162E20p80N14j82j89k74n1O9l10R15r10O76k2j83J34j31q3P06k82m2o16Q12n58
4184b67O61m69K96M70o6k79L56n72l99K17R2K39J92l98n41K84J52m76m0M78n32
$$ y = [-545, -370, -383, -182, -109, -653, -612, 235, -293, -823, -329, -666, -455, -560, -43, -281, 27, -314, -122, 317, 567, -87, 735, 523, -56, 423, -260, 432, -138, 77, -272, 355, -519, 127, 249, -66, -242, -484, -33, -586, -679, 569, -153, -358, -234, -260, 324, -331, -14, 32, 140, 294, 83, -80, -54, 266, 509, -30, 295, -129, -12, 271, 144, 112, -716, -108, -236, -704, 367, 312, -655, -543, -340, -309, -115, 536, -131, -694, -462, -119, 244, 144, 391, 173, 311, 285, 353, 538, 523, 355, 100, -540, 650, 246, -216, 186, 312, 433, -871, -504, -71, 365, 307, -309, -180, -265, -843, 132, 287, -212, -123, 511, -175, 87, -75, 534, 80, 1284, 267, 648, 551, 449, 367, 276, -93, 520, -260, 254, 72, -117, -391, -442, -373, -683, 232, -678, -2, -24, -207, -73, -204, -287, 419, 137, 95, -521, 291, -267, 394, -75, 221, 691, 625, 346, 702, 130, -269, -52, 40, 279, 471, 73, -468, -184, -32, -508, -548, -70, -602]
4205f02J100l45k64K77k11K58l57k1J74K30o79N00K61O5p54N51N41p74L77N5m26
4226d4K71p8k78M22j30j53r50O47j7j83O2l34n1N71m61j16Q18J03N11j258Q11
4247A63k01J51O95n00n42K74K46k09N16k47K16l79L5o40M57p23O73K08m16P01
4267D78o40Oj30O89j107O70k66O38p4j53l07J97L19q6m3K44k06P38p69o73N67
4288I2L34k89K43k8r97J063l68j55m16K12n0m95k10O16J12N21p42Q68l73n8l37
4309d57P50k53P70n68J86o35Q01P4j176R81j063M98L25p56Q43l14K18m21M48n07
4329b56J60L11j53N32j129L56l21R36n16n6K85j88J86K6p63J031K2r08Q34k51
4349A38L05j108L29J250o77N20j01o98L35j82l2k32m91J09Q40m1m97l46K57m71
$$ y = [-602, 498, 153, -111, 166, -45, 213, -144, -165, 9, 239, -440, 60, 321, 386, -368, 183, 724, -50, 327, 382, -44, 227, 149, -129, 293, 163, 10, -940, -293, -310, -493, -431, -765, -816, -245, -706, -822, -4, 99, 610, -648, 163, -38, 113, 808, 308, -234, 40, 286, 77, 593, 346, 562, 183, 218, -422, 35, -688, -15, 193, -223, 478, -162, -156, -286, 403, -704, -34, -300, 338, 264, 111, -196, 1, 320, 234, 191, 435, 229, 967, 198, -475, 92, 426, 137, 380, 352, -645, 418, 50, -105, -521, -309, -359, -854, -1064, -448, -336, 185, -557, 311, -62, -120, -457, 293, 40, 810, 242, 428, -207, 594, 668, -508, 473, -590, -92, 233, -523, 320, 6, 224, -197, 251, -256, -96, 215, 62, 594, -535, -179, -500, 436, -80, -136, 149, -39, 147, 173, -590, 441, 463, -445, 389, 138, 443, -665, -336, 914, 237, 757, 656, -42, 293, 111, 79, -153, -644, -535, 305, 264, -233, -579, -322, -793]
4369g93L56J07j08O15p66R59m52L01j68N78n15O09l91o99J221P7j580P53j91k74
4389c61J02R30j387L47P66k02q0q1l67K50J28l91M6m8j12P24Pn54O37n8P16o80
4411C32k55J93K21K99m37K19N4m50j47n6K4l20m8J56k77j35P73O2m65k26j5L13
4433a85n44O20P84o61o40M59q5K11N88m48O29l92j21j50m72N78L38k41m06k38
4453c76L70j16K6k96K49J69m34l26L41m07J43Q76l48j41J41m62J057J17l01l30
4473d8k32O46p9l60R7q7M80k98J57N85o28j64k44n87Q08q37l53J465q52L61l08
4494d78O19n40N90j101J215J22o50M11K0m43L31q92J064l08P51n73k74P21n35
4513E0m37O16m9L57l70o2J41q52Q37o88J70m33Q71J28o3o97P21n49k69M61K10
$$ y = [-793, -437, -330, -438, 177, -589, 370, -82, 219, 51, 629, 114, 723, 332, -367, 854, 931, -649, 104, -87, -361, -259, 671, -716, -369, 397, 195, 115, 34, -333, -83, 45, -346, -300, -348, -460, 264, 271, -283, 354, 296, 1012, 332, 77, 270, 491, 790, 353, 572, 626, 176, 29, -27, -3, -323, -371, -215, -492, -627, 146, 208, -257, -483, -498, -185, -729, -109, 675, 14, -626, -167, -252, -41, 547, 99, 728, 336, 215, 65, -407, 171, 509, 268, -138, -376, -6, -122, -96, -392, -143, 26, -408, -734, -393, -800, -657, 219, -129, -270, -129, -591, 466, 583, 282, -48, -280, 366, 287, -73, 24, -63, 417, 119, 276, 861, 233, 69, -175, -762, 46, -791, -1144, 321, -531, -170, -478, 141, -399, 191, -910, 305, 427, -223, 188, 208, -235, 96, -796, 268, -40, 711, 138, -136, 585, 50, -387, 229, 180, 537, 167, 105, 246, -606, 231, -457, -287, -720, 151, 279, 216, -481, 240, -309, -578, -117, 93]
4534I3k01m4L76j5l81O83k03O28K17j638Q81j86n63N68k06K32J21l17J01J2L37
4555D95k27j039P76j43J34K78l9o83L24n39K13J104o16j25j96K62N62l62l2n27
4575c80M09M69k62n51r0O72r81J84K10r2K70L16n47L45L50l46j06l79J112j087
4595d84Q7P36o64L75L74m39j96N75j07J55n25N28p93K62KK40O2j67N66p53k43
4616d09Q21l88q5L25l82JQ4j77r0l13P04m55M33K60j044P25J58k67m5O10P85o99
4638E52n13J65J39k49L42r2J35o11L43K79n13m52q80O85K55J35J83q21P35j63
4658c46O96k38k57L75j73o92o0QR67R8q53L34L13K15l39ML53m30M65n88Q99l45
4680D06n59K7M92j103K97j70M87N7o65J663j350M61l5L69j50m73o5N40m35P86
$$ y = [93, -108, -152, 224, 209, -172, 511, 308, 936, 1153, -485, 396, 210, -353, 215, 9, 241, 362, 45, 146, 158, 495, 268, -771, 5, -138, -4, 274, 235, -448, -124, -663, -450, 654, 38, -87, -283, -21, 541, 179, 147, -380, 29, 498, 236, -315, -405, 267, -714, -530, -320, -412, -142, 174, -373, -28, 322, -24, -130, -509, 603, -484, -397, 339, -325, 50, 424, -15, -211, 364, 257, 412, -113, 415, -378, -116, -114, 126, 188, 21, 587, -166, -409, 412, 24, -61, 264, -118, -117, -33, -210, -300, -613, 91, -364, 69, 329, -715, 10, 168, -99, -144, 466, 1251, 552, 39, 204, 343, 94, 436, 344, 479, -132, 211, 490, -23, -475, -1355, -670, -415, -280, -97, -918, -183, -346, 350, 112, -145, 230, 57, -635, -695, -687, 280, 378, -475, -141, 172, 387, 48, 52, 405, -25, 440, -148, 751, 406, -153, -126, 366, -737, -440, -610, -123, -66, -731, 932, -418, 43, 8, 377, 227, -246, -311, 229, -206, 580]
4700E80o52q8l87N18O12n32K38m59L30kN1l97l16O18l17L36k91J88N8j1K32m90
4722a81n12P27q5kp33M54m41R34M36l22l98J67k26M55L10r16Q64m81L29j50l95
4743a66k60O47J4p18M16N86o07n43P88k1J33J92j093N61J70k93k17Q2P42M17m82
4764C48j20jl02j83P14q31J93p43Q63K33j11k00j35J17n66R20M60m28j70l01R68
4785G25o57q4n2l30R3N71j42K88M34p53o10R36O8k25O41o11l09N83K42j245K53
4806a84K26j4L70l94n20O56K92l01p18M84l21K21m46J192o24l70K35M96l66J64
4826G8J07k16R62n30k33n10N47o47O67p36L53K09N83p05L14p34L16L8l18J31j20
4847d44k09L5O19l76J58N3J66j13Q9M0Q9j74J3M8P6n5n28R27J64o3q2j115M94
$$ y = [580, -72, -160, -547, -29, 583, 51, 289, -170, 160, 158, 209, -188, -504, 114, -203, 133, -158, 30, 88, 77, 309, -181, -693, 34, -51, -53, -786, -332, -773, 161, 597, 275, -123, 44, -182, 273, 583, -333, 531, 50, 379, 229, -166, -426, 221, 235, -483, -67, 519, -88, -631, 157, 136, 269, 461, -632, -71, 99, -194, -411, -329, 413, 830, 348, 228, 227, -75, -258, 456, -375, -182, -925, -62, 171, 60, -140, -275, -158, -724, 196, 656, 228, 58, -243, 725, 68, -16, -68, -398, -305, 266, 124, 412, 846, 93, -517, 419, 487, 262, 903, 292, -17, 566, 808, -437, -184, 42, 28, 398, 4, -516, 140, 432, 131, -587, -103, -424, -203, -649, 543, -81, -451, -216, 280, -86, 78, 185, -31, 931, 401, 168, -342, 205, -442, 225, -511, -158, 51, 634, -71, 243, -491, -175, -137, -455, -324, -444, -653, -618, 1, -375, -217, -164, 2, -111, -22, 18, 107, -67, -54, -6, 70, 15, -513, 414, 578, 515, 433, -682, -188]
4870a88Q7K58m74p6K89M30j637J196N60p68R3j58O64j2Qn29K04N37n49K32N2m3
4892A76K68j10j20rM00j252J134O1m16j00m30N58l04M36o36L84j16j06k22P53
4912C49p18m74M78N88m60L12j25o17n8K5J047J79m80L91j85r4n70J72R08m98j75
4933eN12k49K38o19L93J27n10r6L54o48J14l56M83J15L45j86mm27K14L4j2L12
4955A29l28L63J70q70O92J85m33K01p2j98N60l02m69M95m98j20L50m84P56q6p4
4976c3L43p39M12K98l45n95J085r51L56j53M10q11L60P12L07l16L38j015K6M58
4996A47L33j40l3l76K07o04R36n5n58n63N36J07L4l68j01N95j37j37J03M59l39
5017D6j55P37k18q69P39ml7k92l48O57j76k62L12L02p64O61j34o40P58k78M08
$$ y = [-188, -101, 157, -317, -393, -104, 326, -1311, -115, 445, -323, -230, -388, 276, 264, 272, -257, -53, 484, -65, 167, 219, 176, 444, 334, 214, 205, 605, -647, 487, 548, 132, 32, -398, 160, -144, 292, -344, 40, -76, -182, -404, 349, -369, -843, -365, 223, -237, 75, -50, -667, -725, -700, 347, 526, 46, 437, 252, 158, -412, -240, 668, 170, -5, 507, 258, 496, -123, 270, 397, -113, -209, 145, -503, -389, -745, -262, -147, 198, 12, 8, -419, -205, -171, -183, 129, -199, 164, 334, -536, 156, 341, -92, 109, 37, -161, 399, 97, -372, 123, -375, -495, -145, -629, 127, 41, -33, 310, -429, -17, 281, -64, -659, 426, -525, -169, -322, 88, -723, -363, 349, 656, 340, 678, -337, -311, 147, 480, 340, 307, -69, 138, -466, 470, 415, -143, -706, -170, -63, -29, -397, -498, 97, -40, -177, -74, 385, 46, -109, 628, 410, -459, 280, 276, 239, -53, -401, 256, 80, -182, 130, 432, -332, 329, 195, -445, 313, 35, 443]
5038D43p24k39P4N81p8j16K40q75L73N81m6L6J67P85j156m80N64P12k29k68q45
5059e00R55j43m40N05n01O96r18L02Q85l83o25J85K12J01k07r89Q18m04P11R1
5079C51m13p19O91M48r9K16m98O27m40L41m95K79k83L06J16j51l99o16l6O39n7
5100a92q1J67K61m50K8L25m3K16m20K61j435J391K11L99j430P46R81r20R8Q4K15
5121D12l32o50M88J80L01k49k84L81m83j95%j12k26J098j221K84M11K82n74K2
5141d67M19n45L93K77l75P98j030R20p72J273r6j148J218q77J24N13j020K60M81
5160C46o94P15j060J065K5l35k26j27N8J84m87R4L12k32R22r76j23P61l10N66
5180D78n1n12j96L52L64l62l69P12j96j052N92L09o52K42J73M72q07j72N31O24
$$ y = [443, -281, -520, -446, 135, 57, -59, 181, -694, -321, 260, 214, 250, 417, 1202, 46, -434, 130, 842, 613, 345, -500, 455, 312, -128, 377, -124, 572, -346, -44, 841, 458, -167, 18, 230, 331, 124, -865, -47, -451, 260, 351, -62, -781, -90, 358, 259, 475, -23, 604, 164, 505, 10, 289, 6, 312, 428, 277, -122, -738, -774, -135, -192, -273, -106, 155, -295, -267, 58, 15, 231, -189, 72, -1363, 28, 239, 638, -792, -46, 935, 15, 113, 197, 412, 80, -570, -82, 98, 399, 150, -134, 247, -236, -431, -431, -543, -769, 329, -892, -608, -197, 85, -489, -467, -48, -593, -200, 77, -298, 500, -530, 390, -382, 891, 795, -353, 865, -12, 112, 625, -395, -135, 346, -348, 367, -693, 372, 397, 62, -164, -291, -233, -49, -536, -442, -130, -362, 560, -416, -539, 222, -88, 478, 427, -85, -281, 71, 435, 73, -296, 416, 220, -832, -240, 69, -583, -341, -168, 304, -503, -675, -144, 480]
5200D80j264N34K06K33q1l72K72P2n58Q65K23n98j54l00Q28P3o66N07K7O12p44
5221A95N6j33mj1m11L15l55Q6P84o25J020q99p0o17P81J48p44NM8O96r69P57l11
5244b58M43n7n0p76J357l78k04k84J42M81m69L79j94J79j88m10K96j3J26m27P32
5265D27q77J85q3L5M56M59p47L31P5n37R08j428J398l30p48K19K04L98l84k66
5285c05R3J38K98n8k31L4j75K52l83k62P89j03r8p42J89N65k82k49k7J199j470
5306h28O78M30p24O97k50K8N81m03m95j61K46p26J347M37p12K0N09l42p2o34n11
5327h85Q08l14J65n04R49K8m35N02m30jL99n13J192j518N2N78m74O90m99K45O42
5348F77p79M61J67j298L20L53J71j25J30l21K52M0Q4o9n22P89p00Q39q93L90k08
$$ y = [480, -784, -250, -44, 189, 108, -264, 8, 80, -478, 387, 610, 12, -142, -442, 386, 459, -207, 300, 327, 939, 195, 251, 118, 114, 103, -308, 7, -348, -262, 522, -103, 917, 18, -52, -669, 112, 260, -484, -479, -431, 265, -704, 53, -258, 185, 128, 78, -698, 659, 281, 77, -207, -65, 416, -53, 326, 132, 311, 123, -287, 9, -4, 122, -305, 427, -450, -265, -348, -313, 143, 602, -145, 186, 261, -276, 632, -796, 602, 272, -476, -257, -53, 345, -39, -305, -212, -74, 224, 166, -65, -31, -206, 46, -337, -599, 190, 87, -11, -753, -564, 1, -281, -530, -557, 642, -828, -150, 280, -444, 253, 3, 31, 612, 209, -286, -447, -201, -927, 420, 857, 145, 165, 674, 332, 260, -374, -885, -77, -391, -226, -730, 219, 247, -188, 314, -116, -117, 282, -231, 961, -557, -505, 73, -401, 289, -210, 35, 677, -102, 359, 526, -772, -452, -99, 72, -53, 77, -244, 8, 48, 132, 63, -459, 330, -370, 469, -424, -34, -242]
5369b42P5p9K67K24l41K54l44J345j419K09J43M21m85L84M57j138L9J67M63j007
5389f07O14K05K36l44l46J7K51J58p14O47J56m06K07K37k92L26L33m31k90L11
5409B68j88J41O96j443K36P87p07j2J59O20o60L6p6L36j35n31N5PR2k13k06M74
5431b64M74j27m38L98j09M77j60k35m4J417j541M06l90L68n37M67n61J18K90J21
5451A30k23L22P7l27N6o30K28K34P5n06Q53l25n4J02MP5J93M80j10o88R4l05O35
5474C90K95r87M4M99l00K10j44Q50q70N02k14J83o80M57K35l06K48r71K7M00N4
5495g8j61K29l56J60J14J00p26Q55L69j119Q61j23J94q70R13j245J098n67L93
$$ y = [-242, -167, -246, 21, 245, -96, 158, -186, 1159, -260, -51, 92, 513, 28, 412, 869, -269, -230, -63, 400, -607, 7, 212, 448, 104, -242, -225, 26, 184, -530, 117, 273, -133, 74, 311, 19, 345, 678, 247, -43, 268, 80, 221, 917, -526, -290, 497, -210, -222, -63, 557, -103, -67, -143, 193, 58, -473, -418, -411, -319, -532, -738, -264, 210, 83, -355, 43, -66, 411, 251, 16, -28, 1389, -152, 254, -136, 232, -305, 162, -399, -281, 9, 130, -93, 229, 306, -21, 35, -595, -367, -133, -58, -564, 289, -36, -90, 12, 16, 91, 284, 764, 654, -34, 60, -245, 390, 685, -302, -258, 241, -59, 151, 7, 857, -13, 489, 275, 458, -222, 235, 470, 164, 412, -559, -532, -132, -78, -239, -10, -366, -206, -92, 8, -718, 137, 506, -613, 248, 125, 319, -551, 362, -883, 215, -352, 41]
$$ [...]
8191D59
##END NTUPLES=NMR FID
##END=
