##TITLE=1H_IPACAT-33-6
 CDCl3
 8 sc, 
 6.10.2023
##JCAMPDX= 6.0         $$ Bruker NMR JCAMP-DX V2.0
##DATA TYPE= NMR FID
##DATA CLASS= NTUPLES
##ORIGIN= UXNMR, Bruker Analytische Messtechnik GmbH
##OWNER= root
$$ XWIN-NMR		Version 3.5
$$ Fri Oct  6 14:28:02 2023 Russian Standard Time (UT+4h)  she@DPX200
##.OBSERVE FREQUENCY= 200.13135
##.OBSERVE NUCLEUS= ^1H
##.DELAY= (6, 6)
##.ACQUISITION MODE= SIMULTANEOUS
##.ACQUISITION SCHEME= undefined
##.AVERAGES= 8
##.DIGITISER RES= 18
##SPECTROMETER/DATA SYSTEM= spect
##.PULSE SEQUENCE= zg30
##.SOLVENT NAME= CH3CN+D2O
##.SHIFT REFERENCE= (INTERNAL, CH3CN+D2O, 0, 15.7039)
##AUDIT TRAIL= $$ (NUMBER, WHEN, WHO, WHERE, WHAT)
$$ ##TITLE= Audit trail, XWIN-NMR		Version 3.5
$$ ##JCAMPDX= 5.01
$$ ##ORIGIN= Bruker BioSpin GmbH
$$ ##OWNER= she
$$ F:/spectra/data/she/nmr/H-F/1/audita.txt
$$ ##AUDIT TRAIL=  $$ (NUMBER, WHEN, WHO, WHERE, WHAT)
(   1,<2023-10-06 14:24:30.68 +0400>,<she>,<DPX200>,
      <created by zg, POWCHK disabled, PULCHK disabled
       configuration hash MD5:
       00 E9 B6 7A A2 85 ED C7 34 08 36 98 17 FE 4E 26
       data hash MD5: 16K
       CA C9 4D 4E 97 E8 BC 10 D6 D9 B4 18 E7 F9 9E D5>)
$$ ##END=
$$ 
$$ hash MD5
$$ 5A 8A AD A8 CB 4C 98 69 A4 04 86 17 C3 19 59 CD
##$RELAX= 
##$RELAX= 
##$RELAX= 
##$RELAX= 
##$RELAX= 
##$RELAX= 
$$ Bruker specific parameters
$$ --------------------------
##$DU= <F:/spectra>
##$EXPNO= 1
##$NAME= <H-F>
##$PROCNO= 1
##$TYPE= <nmr>
##$USER= <she>
##$AMP= (0..31)
100 100 100 100 100 100 100 100 100 100 100 100 100 100 100 100 100 100 
100 100 100 100 100 100 100 100 100 100 100 100 100 100 
##$AQSEQ= 0
##$AQ_mod= 1
##$AUNM= <au_zg>
##$AUTOPOS= <>
##$BF1= 200.13
##$BF2= 200.13
##$BF3= 200.13
##$BF4= 200.13
##$BF5= 200.13
##$BF6= 200.13
##$BF7= 200.13
##$BF8= 200.13
##$BYTORDA= 1
##$CFDGTYP= 0
##$CFRGTYP= 5
##$CHEMSTR= <none>
##$CNST= (0..31)
1 1 145 1 1 1 1 1 1 1 1 1 1 1 1 1 1 1 1 1 1 1 1 1 1 1 1 1 1 1 1 1 
##$CPDPRG= <>
##$CPDPRG1= <>
##$CPDPRG2= <>
##$CPDPRG3= <>
##$CPDPRG4= <mlev>
##$CPDPRG5= <mlev>
##$CPDPRG6= <mlev>
##$CPDPRG7= <mlev>
##$CPDPRG8= <mlev>
##$CPDPRGB= <>
##$CPDPRGT= <>
##$D= (0..31)
0 1.2 0 0 0 0 0 0 0 0.06 0 0.03 0 0 0 0 0.0002 0 0 0 0 0 0 0 0 0 0 0 0 
0 0 0 
##$DATE= 1696587870
##$DBL= (0..7)
120 120 120 120 120 120 120 120 
##$DBP= (0..7)
150 150 150 150 150 150 150 150 
##$DBP07= 0
##$DBPNAM0= <>
##$DBPNAM1= <>
##$DBPNAM2= <>
##$DBPNAM3= <>
##$DBPNAM4= <>
##$DBPNAM5= <>
##$DBPNAM6= <>
##$DBPNAM7= <>
##$DBPOAL= (0..7)
0.5 0.5 0.5 0.5 0.5 0.5 0.5 0.5 
##$DBPOFFS= (0..7)
0 0 0 0 0 0 0 0 
##$DE= 6
##$DECBNUC= <off>
##$DECIM= 32
##$DECNUC= <off>
##$DECSTAT= 4
##$DIGMOD= 1
##$DIGTYP= 9
##$DL= (0..7)
0 120 120 120 120 120 120 120 
##$DP= (0..7)
150 150 150 150 150 150 150 150 
##$DP07= 0
##$DPNAME0= <>
##$DPNAME1= <>
##$DPNAME2= <>
##$DPNAME3= <>
##$DPNAME4= <>
##$DPNAME5= <>
##$DPNAME6= <>
##$DPNAME7= <>
##$DPOAL= (0..7)
0.5 0.5 0.5 0.5 0.5 0.5 0.5 0.5 
##$DPOFFS= (0..7)
0 0 0 0 0 0 0 0 
##$DQDMODE= 0
##$DR= 18
##$DS= 0
$$ [...]
##$SUBNAM2= <"">
##$SUBNAM3= <"">
##$SUBNAM4= <"">
##$SUBNAM5= <"">
##$SUBNAM6= <"">
##$SUBNAM7= <"">
##$SUBNAM8= <"">
##$SUBNAM9= <"">
##$SW= 18.05172834244
##$SWIBOX= (0..15)
0 0 2 0 0 0 0 0 0 0 0 0 0 0 0 0 
##$SW_h= 3612.71676300578
##$TD= 16384
##$TD0= 1
##$TE= 0
##$TE2= 300
##$TE3= 300
##$TEG= 300
##$TL= (0..7)
0 120 120 120 120 120 120 120 
##$TP= (0..7)
150 150 150 150 150 150 150 150 
##$TP07= 0
##$TPNAME0= <>
##$TPNAME1= <>
##$TPNAME2= <>
##$TPNAME3= <>
##$TPNAME4= <>
##$TPNAME5= <>
##$TPNAME6= <>
##$TPNAME7= <>
##$TPOAL= (0..7)
0.5 0.5 0.5 0.5 0.5 0.5 0.5 0.5 
##$TPOFFS= (0..7)
0 0 0 0 0 0 0 0 
##$TUNHIN= 0
##$TUNHOUT= 0
##$TUNXOUT= 0
##$USERA1= <user>
##$USERA2= <user>
##$USERA3= <user>
##$USERA4= <user>
##$USERA5= <user>
##$V9= 5
##$VALIST= <valist>
##$VCLIST= <CCCCCCCCCCCCCCC>
##$VD= 0
##$VDLIST= <DDDDDDDDDDDDDDD>
##$VPLIST= <PPPPPPPPPPPPPPP>
##$VTLIST= <TTTTTTTTTTTTTTT>
##$WBST= 1024
##$WBSW= 4
##$XGAIN= (0..3)
0 0 0 0 
##$XL= 0
##$YL= 0
##$YMAX_a= 112133
##$YMIN_a= -126878
##$ZGOPTNS= <>
##$ZL1= 120
##$ZL2= 120
##$ZL3= 120
##$ZL4= 120
##$ABSF1= 10
##$ABSF2= 0
##$ABSG= 5
##$ABSL= 3
##$ALPHA= 0
##$AQORDER= 0
##$ASSFAC= 0
##$ASSFACI= 0
##$ASSFACX= 0
##$ASSWID= 0
##$AUNMP= <proc_1d>
##$AZFE= 0.1
##$AZFW= 0.1
##$BCFW= 1
##$BC_mod= 2
##$BYTORDP= 1
##$COROFFS= 0
##$CY= 11.3945322036743
##$DATMOD= 1
##$DC= 2
##$DFILT= <>
##$DTYPP= 0
##$F1P= 15.7292609196834
##$F2P= 12.9074282941183
##$FCOR= 0.5
##$FTSIZE= 0
##$FT_mod= 4
##$GAMMA= 1
##$GB= 0.15
##$INTBC= 1
##$INTSCL= 1
##$ISEN= 128
##$LB= 0.24
##$LEV0= 0
##$LPBIN= 0
##$MAXI= 10000
##$MC2= 0
##$MEAN= 0
##$ME_mod= 0
##$MI= 1.114404
##$NCOEF= 0
##$NC_proc= 0
##$NLEV= 6
##$NOISF1= 3.799351
##$NOISF2= 2.8
##$NSP= 1
##$NTH_PI= 0
##$NZP= 0
##$OFFSET= 15.70392
##$PC= 1
##$PHC0= -22427.99
##$PHC1= 3.852712
##$PH_mod= 1
##$PKNL= yes
##$PPARMOD= 0
##$PSCAL= 0
##$PSIGN= 0
##$REVERSE= no
##$SF= 200.130013532006
##$SI= 16384
##$SIGF1= 3
##$SIGF2= 2
##$SINO= 400
##$SIOLD= 16384
##$SREGLST= <1H.CDCl3>
##$SSB= 0
##$STSI= 0
##$STSR= 0
##$SW_p= 3612.71676300578
##$SYMM= 0
##$S_DEV= 0
##$TDeff= 0
##$TDoff= 0
##$TI= <>
##$TILT= no
##$TM1= 0
##$TM2= 0
##$TOPLEV= 0
##$USERP1= <user>
##$USERP2= <user>
##$USERP3= <user>
##$USERP4= <user>
##$USERP5= <user>
##$WDW= 1
##$XDIM= 8192
##$YMAX_p= 0
##$YMIN_p= 0
$$ End of Bruker specific parameters
$$ ---------------------------------
##NTUPLES= NMR FID
##VAR_NAME=  TIME,          FID/REAL,        FID/IMAG
##SYMBOL=    X,             R,               I
##VAR_TYPE=  INDEPENDENT,   DEPENDENT,       DEPENDENT
##VAR_FORM=  AFFN,          ASDF,            ASDF
##VAR_DIM=   8192,          8192,            8192
##UNITS=     SECONDS,       ARBITRARY UNITS, ARBITRARY UNITS
##FACTOR=    0.0002768,     1,               1
##FIRST=     0,             0,               0
##LAST=      2.2672688,     0,               0
##MIN=       0,             -126878,         0
##MAX=       2.2672688,     112133,          0
$$ Real data points
##PAGE= N=1
##DATA TABLE= (X++(R..R)), XYDATA
0 0 0 0 0 0 0 0 0 0 0 0 0 0 0 0 0 0 0 0 0 0 0 -8 8 -8 8 -8 8 -8 15 -16 16 -19 23 -24 27 -31 35 -39 43 -48 54 -61
42 -61 66 -74 82 -90 99 -110 120 -133 147 -162 177 -197 216 -239 267 -298 336 -375 429 -493 575
63 575 -682 835 -1063 1437 -2183 4257 -23545 -90447 -104457 -81914 -20058 46440 95595 102925
77 102925 70921 10203 -50969 -91347 -93656 -59290 -878 55469 88316 83625 44691 -11943
89 -11943 -60526 -82361 -68512 -26894 24412 62292 72709 52413 12153 -30831 -58097 -60506
101 -60506 -37693 -987 34054 53439 50769 27844 -5584 -35284 -49344 -42587 -17990 13382
113 13382 38002 45345 33228 7441 -19337 -35554 -34886 -19290 2843 22342 31007 26679 12709
126 12709 -4330 -17021 -20781 -15187 -3094 9421 17298 17445 10432 -35 -8888 -12518 -9827 -2750
140 -2750 5190 10142 9999 5061 -1897 -7169 -8442 -5261 -214 4209 5546 3564 24 -3179 -4785
155 -4785 -4220 -3234 -1817 -1182 -654 -496 -543 -469 -453 -54 499 552 -338 -2263 -4111 -4740 -2870 1645 7215
174 7215 10833 9780 3759 -4937 -12166 -14314 -9568 639 12107 19246 18769 9852 -3517 -16125
188 -16125 -22068 -18473 -6419 9416 22566 27045 19931 4156 -15075 -29229 -31795 -20289 730
201 730 22317 35063 32089 14629 -10449 -31710 -40454 -31935 -9902 16339 35645 39902 27230
214 27230 2325 -24807 -42677 -43583 -26402 2204 30520 46754 42990 21044 -10395 -37921 -49834
227 -49834 -40466 -13895 18742 43503 50336 36438 7883 -23916 -45376 -47648 -30037 142 30487
240 30487 48579 46871 25829 -5529 -34540 -48696 -42112 -17798 13656 39044 47851 36533 10391
253 10391 -19216 -40099 -43767 -29147 -3177 23390 39280 38769 21862 -3727 -27104 -38794 -34283
266 -34283 -15694 8375 28478 35571 27599 7972 -14232 -29446 -32062 -21096 -1770 17362 28090
279 28090 26706 14052 -3786 -19147 -25498 -21006 -7906 7783 19630 22430 15868 2713 -10706
292 -10706 -18733 -18304 -10155 2248 12807 17681 14396 5247 -5604 -13247 -14560 -9351 -365 8229
306 8229 12824 11413 5524 -2361 -8500 -10586 -8022 -2130 4297 8779 9337 5783 340 -5407 -8762
321 -8762 -8191 -4324 1158 5768 7613 6021 2291 -1934 -5124 -5986 -4532 -1700 1287 3504 4319 3919
337 3919 2258 -369 -2711 -4344 -4822 -3535 -983 1811 4431 5298 4669 2694 -539 -3831 -6277 -6885
353 -6885 -5119 -919 4279 8891 9957 7123 843 -6521 -11814 -12473 -7654 776 9570 14839 14449 8187
369 8187 -2143 -12049 -17864 -16940 -8619 3632 15027 20988 18678 7983 -6423 -19179 -23980 -18897
383 -18897 -5689 10223 22522 25734 18055 2896 -14172 -25622 -26730 -16699 326 17893 28227
396 28227 27155 14960 -4061 -21425 -30461 -26511 -11695 8329 25101 31301 24198 7158 -12890
409 -12890 -27433 -30546 -20957 -2685 16542 28829 29045 17138 -1595 -19869 -29693 -27094 -13500
422 -13500 5710 22105 29301 23620 8602 -9742 -23823 -27463 -19796 -3914 12847 24353 24769
435 24769 15274 -413 -15249 -23081 -21350 -10653 4110 16727 21793 17777 6459 -7126 -16995
448 -16995 -19192 -12947 -1134 10728 17530 16689 8310 -3026 -12557 -16205 -12439 -3265 6768 13458
462 13458 13987 8178 -933 -9510 -13953 -12170 -5365 3444 10757 13092 9524 1798 -6882 -12671 -12799
477 -12799 -7708 802 8297 11801 9918 3541 -3916 -9567 -11038 -7421 -984 5229 9463 9837 6000
492 6000 410 -5429 -8656 -8010 -3766 2238 7103 9196 7371 2605 -2819 -6420 -6840 -4515 -439 3371
508 3371 5800 5949 4104 1004 -2362 -4555 -5234 -4236 -2096 846 3255 4275 3624 1878 -696 -3254
524 -3254 -4979 -5461 -4866 -2474 371 3519 5651 5946 4135 17 -4816 -8149 -8390 -5448 111 6179
540 6179 10398 10354 6261 -345 -7147 -11437 -10937 -6202 1736 9779 14499 13911 7761 -1686 -10473 -15010
556 -15010 -13377 -5434 5243 14091 17636 13622 3933 -7722 -16343 -18139 -12600 -2020 9905 17623
570 17623 17943 10683 -1089 -13033 -19734 -18810 -10043 2635 14126 19910 16827 6668 -6871 -17758
584 -17758 -21449 -16256 -4383 8543 18067 19716 13163 1419 -10770 -18273 -18099 -10214 1893 13097
598 13097 19137 17074 8154 -3629 -13398 -17236 -13329 -3528 7293 15236 16712 11016 1213 -8681
612 -8681 -14152 -13144 -6331 3014 11046 13627 10565 2983 -5571 -11417 -12177 -7681 -273 7050 10835
627 10835 9672 3768 -4315 -9933 -11752 -8454 -1462 5661 9961 9167 4090 -2632 -8038 -10041 -7325
642 -7325 -1751 4405 8682 9061 5412 -278 -6114 -9222 -8184 -3374 2912 8036 9755 7284 1794
657 1794 -4292 -8286 -8301 -4677 1459 6677 9028 8148 3540 -2012 -6649 -8492 -6816 -2261 2836 6976
673 6976 8016 5838 1091 -3769 -7164 -7430 -4831 -490 3705 5916 5530 3086 -496 -3707 -5220 -4893
689 -4893 -2940 -415 2159 3656 3810 2680 892 -1052 -2557 -3051 -2769 -1678 -29 1272 2676 3575
705 3575 3017 2130 -19 -2200 -3897 -4549 -3347 -431 2990 5559 6145 4636 565 -3709 -6781 -7648
721 -7648 -5210 -382 5103 8657 9035 5549 -406 -6483 -10227 -9937 -5637 1091 7678 11513 10361 4930
737 4930 -2695 -9495 -12662 -10453 -4152 4294 10966 13022 9796 2273 -6039 -12189 -12979 -8458 -345
752 -345 7743 12725 12443 7021 -1120 -8671 -12789 -11301 -5167 3110 10064 12785 9913 3104 -4831 -10557
768 -10557 -11651 -7770 -829 6247 10666 10100 5408 -1110 -7401 -9889 -8574 -3291 3157 7941 9138
783 9138 6482 938 -4843 -8176 -7934 -3946 1386 6069 7773 5835 1237 -3670 -6994 -6709 -3508 1261
799 1261 5336 6991 5446 1513 -3270 -6303 -6726 -3908 817 5024 7283 5947 1959 -3188 -6849
814 -6849 -7370 -4656 428 5256 7709 7108 3386 -2217 -6452 -8164 -6332 -1928 3567 7645 8175 5536
830 5536 397 -5015 -8226 -7916 -4284 1320 6040 8388 6928 2752 -2495 -6695 -7943 -5980 -1763
845 -1763 3233 6779 7199 5043 664 -3601 -6173 -6241 -3526 375 3830 5482 4847 2346 -808 -3437
861 -3437 -4375 -3452 -1451 1160 2788 3008 2411 881 -760 -1730 -1875 -1543 -690 103 414 724 816 853 1160
880 1160 1068 413 -508 -1554 -2073 -1987 -1093 533 2331 3449 3311 1604 -1026 -3394 -4712 -4470 -2010 1381
898 1381 4704 6027 5011 1846 -2482 -5698 -6910 -5153 -1178 3333 6799 7517 5186 700 -4239
913 -4239 -7698 -7831 -4690 237 5341 8207 7875 3971 -1300 -6101 -8137 -6874 -2600 2607 6634 7844
929 7844 5816 1384 -3574 -7045 -7587 -4725 -254 4488 7290 6910 3438 -1018 -5315 -6834 -5573 -1707
945 -1707 2530 5415 5836 3554 102 -3340 -5337 -4733 -2267 1056 4029 4751 3632 971 -2122 -4000
961 -4000 -3931 -1785 995 3438 4145 2590 71 -2641 -3692 -3038 -823 1944 3726 4000 2399 -448
977 -448 -3131 -4466 -3902 -1396 2033 4512 5133 3592 165 -3537 -5699 -5626 -2902 1179 4754 6200
993 6200 5223 1789 -2607 -5805 -6844 -4665 -991 3256 6020 6405 4108 -170 -4303 -6577 -6004 -3145
1009 -3145 1015 4965 6516 5449 2149 -2049 -5212 -6071 -4236 -760 2778 5385 5597 3687 500
1024 500 -2720 -4616 -4501 -2319 694 3082 4274 3488 1220 -1133 -3014 -3596 -2488 -855 1176 2331
1040 2331 2242 1034 -344 -1274 -1640 -1111 -302 341 571 213 -559 -899 -518 -73 573 1144 961 71 -1068
1059 -1068 -1962 -2198 -1135 405 2313 3428 3339 1976 -620 -3099 -4328 -3478 -933 2090 4599 5112
1075 5112 3689 764 -2501 -4727 -5018 -3270 126 3442 5279 5373 2903 -683 -4177 -5859 -5628 -2728
1091 -2728 1301 4495 5606 4479 1148 -2625 -5151 -5653 -3977 -701 2594 4486 4689 3043 -100
1106 -100 -2960 -4404 -4126 -2224 735 3381 4322 3725 1473 -1258 -2930 -3257 -2080 -24 1855 2924
1122 2924 2583 1430 -187 -1208 -1613 -1249 -132 1102 1610 1365 518 -436 -1209 -1115 -450 396 1217 1141 307
1141 307 -1052 -1959 -2240 -1473 58 1597 2674 2186 694 -1508 -3077 -3505 -2567 -451 1932 3674 3693
1158 3693 2098 -373 -3170 -4537 -4049 -1816 1487 4104 5223 4226 1475 -2020 -4358 -5077 -3258 -254
1174 -254 3140 5329 5159 2989 -256 -3419 -5017 -4390 -1925 1371 4142 4920 3609 972 -2042 -4108
1190 -4108 -4427 -2945 -351 2084 3663 3470 1594 -717 -2805 -3559 -3055 -1103 902 2415 2589 1552
1206 1552 19 -1655 -2201 -2082 -961 397 1383 1386 866 5 -821 -1098 -744 119 1142 1576 1144 154 -856
1225 -856 -1680 -1305 -478 981 2266 2447 1589 -137 -1822 -2728 -2514 -974 1111 2683 3550 2722 797
1242 797 -1656 -3690 -4014 -2714 -193 2433 4154 4135 2007 -683 -3528 -4713 -4059 -1805 1181 3735
1258 3735 4806 3630 1001 -1971 -4426 -4791 -3496 -740 2535 4425 4502 2806 -107 -2901 -4394 -3929
1274 -3929 -2038 711 3007 4140 3412 1373 -750 -2871 -3359 -2572 -827 979 2673 3186 2041 458
1290 458 -1222 -1994 -1978 -1103 26 935 1401 1210 668 78 -393 -721 -469 -338 -177 3 -127 -135 -28 304
1310 304 848 709 646 155 -683 -1542 -1418 -1114 133 1413 2002 2112 916 -461 -1915 -2398 -2282 -1134
1328 -1134 907 2481 2873 2455 742 -1169 -2863 -3271 -2482 -467 1806 3165 3358 2208 282 -1930
1344 -1930 -3331 -3397 -1682 426 2415 3356 2904 1425 -723 -2395 -3247 -2584 -854 1316 2682 2973 2018
1361 2018 312 -1400 -2614 -2226 -1294 284 1557 2065 1686 743 -703 -1750 -1900 -1202 -131 1063 1370
1378 1370 1208 388 -692 -1321 -1285 -465 308 1091 1168 542 -229 -1334 -1197 -1121 138 839 1721 1955 1030 -516
1398 -516 -1877 -2418 -1969 -465 1153 2569 2666 1783 -36 -1869 -2989 -2887 -1522 395 2403 3473 3140
1415 3140 1304 -905 -2972 -3854 -3008 -826 1372 3210 3718 2688 499 -2012 -3618 -3725 -2157 56
1431 56 2325 3761 3494 2093 -358 -2518 -3658 -3424 -1687 661 2655 3620 3327 1280 -859 -2711
1447 -2711 -3468 -2822 -1109 1045 2654 3085 2239 712 -1220 -2335 -2782 -2147 -722 908 2072 2333 1613
1464 1613 415 -962 -1837 -2059 -1543 -379 409 1408 1480 1087 573 -171 -1038 -1085 -990 -685 -36 567 1067 1076
1484 1076 829 268 -34 -844 -904 -937 -471 155 749 1232 1197 863 151 -716 -989 -1255 -983 -229 558 1431 1370
1505 1370 993 46 -862 -1678 -1715 -1161 -227 941 1522 1707 987 -112 -1041 -1567 -1666 -1069 83 1038 1575
1524 1575 1520 835 -341 -1230 -1570 -1266 -456 635 1217 1260 1235 282 -525 -810 -830 -217 229 616 806 738 274
1545 274 -276 -584 -612 -179 461 738 933 396 -251 -882 -1045 -635 -57 689 1135 891 245 -673 -1330 -1637
1565 -1637 -1172 -401 645 1515 1704 956 -297 -1464 -2326 -2258 -1056 748 2056 2620 2026 785 -1097
1582 -1097 -2531 -2895 -2047 -232 1578 2972 3244 2224 191 -1939 -3245 -3161 -1688 480 2763 3761
1598 3761 3695 1794 -730 -2963 -3686 -3206 -1404 1280 3147 3823 2853 860 -1711 -3481 -3896 -2684 -702
1615 -702 1716 3382 3508 2223 32 -2199 -3439 -3486 -1955 208 2118 3079 2912 1272 -714 -2198
1631 -2198 -2837 -2542 -1095 781 2261 2639 1948 687 -595 -1693 -2026 -1281 -311 877 1546 1734 1308
1648 1308 411 -551 -1069 -1181 -822 -233 604 854 975 664 215 -314 -696 -485 -607 -301 -293 -28 57 437 335
1669 335 192 -49 -138 -503 -529 -537 -254 -5 378 719 624 478 46 -485 -868 -914 -556 103 686 1066 1160 641
1691 641 96 -565 -1001 -972 -318 279 692 1139 831 301 -334 -693 -918 -651 156 396 792 741 192 -337 -583
1712 -583 -663 -358 70 415 409 258 -348 -626 -699 -371 136 592 833 760 247 -625 -1109 -1259 -710 247 1150 1581
1734 1581 1597 782 -714 -1754 -1980 -1491 -51 1283 2371 2262 1531 -45 -1737 -2576 -2530 -1321 529
1751 529 2278 3078 2774 1021 -1030 -2817 -3400 -2762 -847 1339 3070 3297 2434 377 -1843 -3342 -3658
1768 -3658 -2333 -156 2455 3513 3611 1817 -506 -2784 -3616 -3344 -1583 884 2842 3780 2968 1211
1784 1211 -1074 -2867 -3664 -2691 -767 1552 3011 3256 2269 366 -1682 -2908 -2907 -1659 312 1882 2677
1801 2677 2643 1192 -541 -1837 -2379 -1990 -872 648 1654 2033 1460 482 -630 -1462 -1548 -1054 -187 792
1819 792 1153 1014 695 -117 -534 -815 -891 -408 64 366 615 457 77 -286 -313 -265 -105 76 -27 -156 -193
1840 -193 -95 -203 47 222 491 367 -26 -128 -553 -566 -471 17 545 490 586 585 -83 -564 -671 -617 -229 131 578
1863 578 664 436 9 -164 -473 -409 -347 -65 157 432 273 200 -205 -310 -218 -272 64 50 259 -83 -127 -207 -191
1886 -191 133 276 436 371 2 -460 -636 -656 -319 44 741 993 953 495 -176 -949 -1369 -1130 -383 721 1491
1907 1491 1815 1372 333 -1001 -1718 -1936 -1146 -159 1281 2366 2224 1307 -82 -1520 -2560 -2464 -1250
1924 -1250 382 2071 2822 2384 952 -950 -2412 -2988 -2505 -973 1191 2658 3115 2330 611 -1515
1940 -1515 -2897 -3210 -2082 -140 1941 3021 3028 1618 -449 -2082 -3060 -2733 -1322 448 2335 3093 2433
1957 2433 936 -925 -2302 -2697 -2159 -562 1063 2278 2663 1717 180 -1279 -2256 -2034 -1293 109 1275
1974 1275 1896 1893 1016 -210 -1264 -1749 -1415 -665 384 1121 1395 1100 236 -452 -989 -1008 -697 -105 545 662
1994 662 741 323 -80 -453 -568 -424 -51 311 420 461 192 -40 -269 -289 -160 193 273 319 135 -104 -259 -276
2016 -276 -208 134 354 410 259 296 -2 -361 -475 -267 -25 72 419 550 280 16 -355 -658 -569 -332 -64 178
2038 178 439 382 326 -71 -205 -344 -404 -267 -103 -90 290 442 420 320 28 -71 -415 -387 -350 -149 76 223 651
2061 651 707 591 163 -239 -597 -948 -788 -29 491 1006 1140 845 333 -383 -1197 -1404 -1105 -227 581 1378
2081 1378 1592 1219 246 -1086 -1816 -1797 -1207 67 1200 1945 1941 1200 -334 -1361 -2232 -1989 -1161 269 1665
2100 1665 2275 1989 798 -594 -1833 -2283 -1913 -518 953 2147 2457 1912 516 -822 -2272 -2296 -1481
2117 -1481 -169 1360 2105 2334 1488 -18 -1462 -2249 -2200 -1196 346 1644 2124 1799 757 -471 -1728
2134 -1728 -2032 -1690 -599 711 1592 1701 1016 46 -834 -1670 -1666 -927 160 1034 1343 1272 623 -95 -760 -1240
2154 -1240 -722 -150 492 743 943 662 79 -369 -668 -324 -120 207 624 647 373 255 -251 -593 -320 23
2174 23 133 635 566 230 -43 -324 -562 -533 -99 307 460 383 169 -274 -544 -640 -623 -215 141 483 581 613 145
2197 145 -420 -597 -628 -211 -77 468 657 687 416 -62 -476 -562 -563 -264 51 336 649 577 563 219 -184 -338
2219 -338 -546 -264 -70 124 506 743 664 210 -195 -554 -867 -532 -415 -201 338 727 662 628 29 -574 -879
2240 -879 -994 -879 -287 559 902 1038 693 139 -522 -1242 -1165 -778 -108 686 1367 1553 897 157 -787 -1473
2260 -1473 -1589 -765 67 872 1528 1557 1006 -50 -968 -1712 -1511 -843 283 1340 1859 1691 751 -404 -1386
2279 -1386 -1813 -1592 -562 658 1449 1818 1532 424 -641 -1669 -1797 -1305 -174 1015 1522 1775 936
2296 936 54 -876 -1786 -1481 -809 242 966 1417 1406 565 -429 -1058 -1359 -1071 -388 485 1107 1054 757 210
2316 210 -599 -1036 -1055 -372 7 619 763 797 465 -353 -649 -650 -418 -124 213 520 638 279 -100 -593 -489
2337 -489 -229 22 344 480 222 145 -314 -398 -388 -303 259 401 666 498 187 -198 -562 -639 -486 -63 570 811
2359 811 572 392 -123 -736 -802 -595 -235 256 735 806 724 136 -319 -686 -774 -460 -98 178 723 942 475
2380 475 -148 -202 -712 -698 -554 -17 348 613 769 510 91 -279 -451 -622 -420 -194 193 461 579 428 205
2401 205 -321 -445 -662 -641 -153 108 441 677 596 615 95 -513 -917 -871 -590 -97 329 857 579 641 96 -355
2423 -355 -852 -1113 -606 -122 371 965 1200 736 90 -645 -1063 -1230 -790 -53 745 1096 1321 915 148 -619
2443 -619 -1234 -1112 -782 199 1018 1312 1222 711 -9 -964 -1435 -1047 -486 72 1083 1303 1085 424 -432 -1068
2463 -1068 -1310 -822 -301 470 1048 1128 847 86 -650 -1069 -981 -514 169 677 987 935 418 -116 -744 -885 -619
2484 -619 -269 252 739 776 596 43 -367 -613 -435 -286 199 536 503 503 -52 -219 -283 -260 -225 36 335 313 23
2507 23 44 -225 -558 -364 -241 176 515 450 329 -109 -300 -595 -516 -307 227 744 842 472 144 -358 -523 -748
2529 -748 -480 140 430 877 788 473 -229 -556 -847 -554 -166 253 671 912 444 117 -357 -720 -854 -565
2549 -565 -207 318 605 697 709 144 -415 -758 -762 -514 -57 166 583 603 485 210 -220 -471 -734 -350 -270 239
2571 239 667 673 380 276 -82 -360 -398 -394 -290 84 394 506 621 420 89 -229 -569 -583 -568 78 189 520
2593 520 774 483 271 -255 -640 -657 -584 -135 299 549 973 635 417 -366 -899 -960 -650 -296 327 783 785 591
2615 591 280 -330 -730 -886 -617 14 492 861 853 605 -36 -629 -1031 -692 -417 82 601 761 756 270 -114
2636 -114 -477 -678 -634 -250 178 628 698 407 151 -370 -571 -711 -411 -45 382 527 460 289 -104 -241 -312
2657 -312 -245 -45 3 325 321 177 -141 -292 -260 -232 -132 234 288 408 52 -285 -232 -383 37 210 420 306 342
2680 342 181 -154 -384 -463 -262 7 282 414 696 349 -106 -422 -534 -466 -105 180 603 628 561 98 -394
2701 -394 -661 -720 -407 -87 498 642 676 335 -15 -460 -875 -803 -254 141 588 781 709 197 -15 -560 -740
2722 -740 -553 -181 358 807 754 541 222 -346 -630 -609 -422 -178 169 570 640 466 142 -163 -456 -566 -278
2743 -278 -48 177 473 383 241 180 -201 -272 -504 -429 -174 -71 216 428 232 160 -25 -93 -576 -554 -368 -136
2765 -136 100 215 409 169 307 -198 -419 -460 -244 -211 71 296 488 587 302 -44 -499 -405 -462 -109 175 513
2787 513 445 603 48 -64 -379 -679 -548 -345 245 547 668 588 261 -366 -474 -556 -563 -247 324 494 684 515
2809 515 -15 -298 -567 -495 -247 -99 434 459 447 113 -404 -370 -420 -325 58 174 323 322 363 142 -93 -385 -28
2832 -28 -86 26 234 213 257 -141 -97 -289 -110 48 79 416 127 -133 -133 -444 -307 -231 137 426 357 352 113 -347
2856 -347 -494 -567 -254 118 464 493 427 212 -230 -433 -640 -355 -57 295 620 728 582 -28 -257 -604 -838
2877 -838 -556 47 418 766 627 658 -85 -650 -864 -741 -195 214 634 749 597 247 -227 -666 -576 -485 -161
2898 -161 242 727 685 360 119 -122 -445 -432 -247 -30 239 377 467 314 -92 -162 -396 -199 -198 -28 110 183
2920 183 137 64 19 6 -26 -285 -191 -86 3 89 157 172 313 130 -17 -235 -250 -255 -147 24 169 400 457 153 -84
2945 -84 -47 -373 -472 -439 51 139 438 633 451 164 1 -353 -638 -325 -108 52 440 501 430 -98 -302 -629
2967 -629 -481 -166 40 516 609 611 294 -77 -474 -435 -205 -389 155 401 498 230 120 -131 -377 -373 -75 240
2989 240 183 188 243 32 -81 -168 -222 -89 38 189 175 35 89 -142 -177 -57 39 9 170 -17 88 -332 -246 -350
3013 -350 -204 111 198 334 205 -64 -230 -381 -309 -343 -67 263 421 461 172 -63 -505 -484 -445 -159 108 432
3035 432 750 713 236 -291 -587 -527 -301 262 276 429 742 304 16 -233 -605 -526 -300 186 349 547 225
3056 225 110 -177 -498 -505 -270 -217 105 426 466 280 39 -99 -300 -447 -291 -90 171 323 493 120 91 -32
3078 -32 -233 -328 -82 32 216 130 167 131 -41 91 -75 -112 -125 -160 70 -21 -1 101 87 -68 122 -280 -94 -242
3102 -242 -15 -125 148 218 242 319 127 -13 -203 -273 -286 -211 7 256 328 374 164 -102 -310 -368 -328 -181 28
3125 28 424 418 485 143 -41 -423 -428 -287 -110 358 470 467 351 324 -241 -353 -570 -117 70 145 356 352 282 -128
3149 -128 -78 -221 -337 -305 -68 86 338 292 110 -23 -208 -157 -195 -78 79 103 28 -38 124 -30 -89 -71 -120 52
3173 52 -75 -113 -74 -103 76 50 39 188 -37 -153 -244 -280 -93 -89 -69 202 208 200 95 -64 -266 -262 -360 -53 230 239 310
3200 310 231 -29 -155 -268 -216 -152 12 234 406 444 353 237 -145 -265 -370 -254 190 297 447 430 125 -49
3222 -49 -294 -352 -377 -47 39 69 365 261 97 -23 -303 -370 -399 -35 244 241 493 247 152 -16 -143 -390 -192
3245 -192 -144 69 102 30 59 139 -40 -83 -128 -168 -159 21 127 62 156 104 114 -158 -88 -65 -192 -240 8 23 164 124
3271 124 199 117 16 -44 -116 -226 -108 -34 132 432 193 137 34 -213 -331 -267 -305 -66 145 338 325 279 155
3294 155 -128 -277 -279 -125 -96 213 360 229 231 139 -86 -427 -273 -138 75 131 234 293 153 41 -238 -184 -340
3317 -340 -139 167 205 333 212 87 -130 -234 -271 -220 50 104 -10 202 52 183 90 -232 -88 -71 2 -94 139
3340 139 193 40 82 111 -13 -67 -82 -59 -7 -10 48 55 276 10 176 74 -127 -26 -220 -105 -199 109 -24 121
3364 121 149 88 -47 -51 -158 -230 -15 2 276 199 219 147 -55 -226 -230 -265 -185 151 103 394 101 -79 29 -237 -231
3389 -231 -261 -48 190 195 356 306 -33 -184 -270 -278 -257 -99 15 207 90 127 54 -67 -350 -266 -122 -35 289 237
3413 237 233 72 52 -128 -105 -54 37 45 3 92 154 59 37 -59 44 -230 -63 -170 -20 46 72 6 -30 113 -4 105
3439 105 -320 -275 -146 -157 0 22 -13 131 187 167 -125 -250 -196 -104 -84 90 252 286 111 -109 -246 -282 -76 -131
3463 -131 75 185 254 231 275 -92 -145 -161 -377 -270 124 256 438 293 213 25 -288 -379 -211 -175 29 327 276
3486 276 236 85 -299 -321 -357 -201 -47 76 396 322 162 -98 13 -270 -404 -42 -130 184 268 256 176 56 -10
3509 -10 -6 -244 -152 -106 30 269 -44 128 -141 -4 -55 -99 44 -40 -38 57 160 29 235 -33 -121 82 72 -153
3533 -153 -96 -52 153 -74 -14 160 130 -112 -102 -168 -162 -160 16 -55 206 285 13 116 -388 -230 -294 -57 122 58 184
3558 184 456 -2 -146 -207 -171 -338 -100 116 268 298 83 214 -141 -32 -106 -200 -64 14 202 310 23 164
3580 164 -106 -50 -41 -72 -128 -53 79 35 -12 133 -1 -50 29 -213 -9 -128 5 86 -13 233 50 34 77 -38 -28
3605 -28 -79 -21 83 -49 226 174 4 9 124 -312 -164 -211 -122 60 228 152 223 104 -37 -143 -338 -335 -89 243
3629 243 358 334 253 14 -224 -296 -279 -325 85 118 291 290 273 65 -113 -316 -395 -193 -6 284 352 452 195 -39
3653 -39 -185 -478 -293 -189 71 138 410 61 276 -3 -185 -324 -280 -147 182 248 171 157 19 68 -158 -334
3675 -334 -93 30 189 197 77 193 79 4 -205 -142 -253 68 -86 123 179 56 29 -27 -52 -43 115 -129 -109 54
3699 54 -55 -37 -146 18 -150 -94 -4 -128 124 56 37 184 -56 48 12 -90 -62 -2 -67 -93 -67 43 202 157
3723 157 154 -60 -107 -75 -208 65 62 203 93 95 90 7 -38 -182 -15 51 -55 4 64 120 -3 89 -50 -131 -164 -191 -194
3750 -194 -33 81 28 4 -60 -43 -176 131 -148 -16 24 -31 -1 23 164 35 -63 -5 -167 -81 219 97 33 -69
3774 -69 73 78 161 -78 -92 0 -60 -38 39 12 75 241 145 46 -93 -165 -253 -210 -37 133 317 163 108 49 -315 -326
3800 -326 -149 -47 110 313 207 385 223 -170 -306 -193 -164 -5 150 191 232 97 90 -82 -166 -303 -115 64
3822 64 235 228 278 331 -65 -213 -379 -202 -100 161 86 210 163 240 -136 -290 -191 -270 -66 -128 263 78 272 49
3846 49 -96 -7 -11 -120 -111 211 97 84 37 57 -21 -123 -48 -171 -134 -25 5 110 -24 -92 8 -145 -206 -96 -177
3871 -177 -63 -36 142 214 22 -44 -163 118 -9 -70 -64 41 -166 17 -44 35 -97 38 -185 53 76 -166 11
3894 11 129 119 102 48 142 21 -178 83 23 -22 130 49 -43 44 -32 -45 18 -57 -16 -28 61 131 25 -81 -12 -40 -107
3921 -107 -51 -53 -17 114 150 -83 63 -15 107 -80 -94 -96 10 73 -108 96 -16 115 217 -17 -138 -179 -67 -2
3945 -2 -98 24 -56 107 98 74 28 -130 -311 -226 -146 38 303 157 187 204 126 -146 -302 -193 -277 119 177 213 147 20
3971 20 -71 -114 -252 -270 -33 17 298 231 124 107 -130 -279 -376 -206 -99 13 134 192 200 350 -129 -161 -402 -201
3995 -201 16 110 224 328 258 91 -125 -167 -182 -133 82 2 253 163 103 -78 -145 -390 -155 94 85 352 263 285
4019 285 146 149 -175 -135 -170 -116 58 116 47 106 60 30 -164 -212 -66 -38 -95 88 -33 -47 42 -72 -44 -81 98 29
4045 29 -45 62 -24 32 157 -13 -119 -41 -24 -228 -44 -145 -160 -146 105 -22 24 46 -99 -1 -80 7 -59 15 -75
4070 -75 -21 -47 -14 -30 32 -92 -90 39 -55 -113 21 -63 52 47 76 -40 23 -122 -91 -73 237 74 23 47 2 -125 38
4097 38 -21 -106 57 46 25 147 171 17 -20 -62 -50 -116 164 -30 -9 59 142 93 70 -119 -96 -92 -324 -143 202 55
4123 55 -35 -49 117 -252 -226 -200 -118 74 108 75 172 108 163 -124 -337 -227 -167 46 73 167 159 126 -41 39 64 -295
4149 -295 -100 -86 117 193 187 174 -138 -174 -184 -101 -76 99 235 195 220 69 -84 -281 -299 -262 -170 278 167 102 224
4174 224 16 -135 -111 -338 -11 16 114 265 243 151 -85 -121 -246 -98 -231 40 123 261 168 33 63 -98 -82
4197 -82 12 7 149 101 81 145 10 -158 -154 -41 78 -94 -30 -25 -76 -172 -8 -153 -245 -2 -188 -264 -115 -83 73 183
4223 183 -11 22 70 -35 143 37 -171 -18 -22 140 74 153 5 -6 178 10 -83 -21 92 -61 54 124 99 151
4247 151 195 -158 2 -42 -62 -82 19 74 7 -86 21 5 -1 44 -63 -205 -120 -77 70 3 37 -28 101 -107 -79 -46
4273 -46 -93 10 38 165 175 -42 90 -71 -36 -53 -165 0 200 55 145 25 -58 -251 -225 -287 31 -63 -45 108
4297 108 176 210 -182 -210 -368 -196 -91 54 194 63 166 259 -101 -89 -338 -210 9 -19 103 66 301 39
4319 39 35 -235 -303 -201 -139 -98 26 211 108 72 -23 -151 -206 -413 70 17 -50 159 141 16 -141 -73 -127 -274 -193
4344 -193 101 98 258 38 71 31 59 -279 -195 -25 116 217 117 130 129 -30 0 -199 95 76 86 72 150 227 184
4369 184 -66 -46 -51 -153 -122 27 15 -11 183 16 -170 -53 -126 13 128 0 -100 36 66 -17 -44 93 1 -148
4393 -148 31 12 -45 123 56 26 -17 112 76 192 -15 -204 77 84 83 61 48 38 62 -49 -178 -33 -195 -218 -136
4418 -136 126 106 -13 79 -24 5 -4 -101 -15 -173 9 43 197 -22 90 94 -22 -346 -136 -98 35 28 210 172 188
4443 188 125 46 -100 -146 21 11 204 125 -3 13 14 -48 -78 -23 7 105 111 21 -16 131 -20 -66 -34 -97 -144 -5 330
4470 330 98 69 -46 19 -65 -54 44 -96 -7 -11 141 81 214 -27 -151 -203 -61 -21 -137 146 117 226 163 158 105
4495 105 -103 -196 -70 -130 131 15 23 140 65 -122 -158 -32 -135 -77 82 160 106 120 101 -108 -196 -241 -228 -130 -80
4520 -80 185 -8 88 -23 -165 -56 -73 -90 -11 123 151 99 64 -119 -86 -1 -213 -10 220 40 165 88 70 -43
4544 -43 -207 -89 -97 55 165 -1 80 -119 -173 -46 -2 -176 -18 159 183 206 53 -28 -283 -40 62 -83 -56
4567 -56 66 103 -37 -77 128 163 128 -56 113 124 -14 -60 -157 -98 -140 -31 154 166 -82 -4 -10 92 -37 -131 -131 -105
4593 -105 69 7 8 -35 -229 -90 -34 -71 72 -45 81 47 -114 141 -103 -164 -53 -95 34 -55 124 146 212 36
4617 36 16 -59 -9 -23 -155 -54 64 197 152 -78 1 -93 -46 -64 -171 41 25 -19 149 123 19 -101 -100 -62 -92 -187
4643 -187 183 55 23 126 -144 79 -234 -123 -295 -167 -133 64 76 78 119 -117 -194 -140 -116 -93 39 215 106
4666 106 31 95 -154 -163 -97 -40 -146 29 116 230 37 -21 3 -152 -350 -13 4 -197 173 255 200 -48 -102 -89 -187
4691 -187 -117 11 -54 100 26 244 -90 -49 -67 -101 -25 -4 27 38 -77 13 34 -88 -128 -130 -77 98 -8 62 -75 -4
4717 -4 154 -146 170 -18 48 47 25 50 34 127 0 88 53 7 -18 -142 -24 7 -6 17 90 62 92 -40 -44 29 33 -57
4745 -57 -30 9 106 82 85 49 3 -25 -67 -225 -161 -137 -33 55 24 43 118 -69 -64 -125 -71 -77 -114 -99 56 -1 -9 -86 -127 29
4775 29 -4 46 -61 113 15 50 27 -26 -83 96 -30 50 -179 254 93 60 16 -92 -168 -58 190 -96 105 -61
4799 -61 -23 181 66 -19 -90 -135 -59 -89 -78 9 111 142 92 214 -117 -285 -153 19 24 29 114 101 38 37 -39 -146 -107
4826 -107 -8 -5 128 142 -18 29 -24 -217 -47 -291 -3 20 172 146 129 232 -253 4 -318 -259 1 -40 229 185
4850 185 -36 30 -22 -92 -137 -104 58 18 36 139 -143 83 75 -37 -85 -98 0 67 38 8 16 105 -97 79 -86 -16
4876 -16 96 73 180 -26 -73 58 38 38 37 -90 -108 365 56 34 -50 -80 -45 -65 -71 79 -110 139 -10 -10 -51 94
4902 94 97 142 2 -72 129 -109 -97 -135 90 49 200 -3 81 45 -104 -202 -94 -183 -36 -61 204 -76 -54 -60 -60 -163
4928 -163 -50 -217 107 108 144 246 136 235 -15 -155 -102 -5 -29 43 100 249 96 -162 -70 -64 -46 -83 96 25 59
4953 59 53 9 2 -35 -186 -111 -174 152 -109 157 -31 56 1 -109 -22 -10 -3 114 -5 57 140 40 38 35 -54 25 -255 -56
4981 -56 -95 -8 120 -26 268 -28 -93 -64 -54 -195 22 -116 117 94 82 102 -63 -19 -58 -135 103 28 157 156 41
5006 41 45 19 -59 -117 -14 194 172 58 65 10 -3 -52 15 -122 -122 -23 12 156 102 56 -19 -118 -220 -36 5 -11 3 191
5034 191 121 -1 -90 -130 -22 -236 3 -8 79 46 39 -32 67 66 -27 -110 -126 -12 -90 -53 -40 -28 66 -125 -73 -34 -88 45
5062 45 -147 49 72 -110 -72 3 -75 53 -218 -95 12 -88 22 -146 94 0 -52 4 -76 81 -71 -116 38
5085 38 77 171 133 -2 -118 75 24 -218 -199 31 23 46 87 67 240 26 -52 24 -6 5 36 260 138 67 45 -105
5111 -105 -123 -49 -12 -228 -57 -12 15 9 40 52 -150 71 62 -53 -34 50 24 116 -16 -101 -3 -79 121 -69 -70 108 76
5138 76 99 19 -143 -132 -119 -88 1 -64 82 -21 116 -16 71 -138 -171 25 -108 0 30 87 166 91 -88 -60 -113
5163 -113 -104 -101 -18 -69 115 -128 22 87 13 -77 -155 -43 43 87 61 -16 -99 99 67 -5 11 -15 -65 -37 52 193 81
5190 81 13 -8 -40 -12 -133 1 15 107 32 27 -15 4 16 -53 -39 108 33 15 2 -11 163 -128 -66 -26 -64 -1 -67 13
5218 13 -15 135 29 -60 34 -190 65 -47 -16 15 86 -64 -79 53 -177 -42 -106 1 92 19 25 -157 114 210 -13
5243 -13 101 -98 -35 -59 -50 -108 164 123 -22 7 26 -98 -20 -218 -160 72 -86 -28 -74 127 133 -43 -12 -260 17
5268 17 -76 23 205 -36 -21 6 -137 -206 -100 30 -14 -112 123 12 143 66 -64 -136 -21 31 -225 156 -53 47
5292 47 -73 -107 102 41 160 -234 -113 5 277 5 88 -8 16 12 -85 78 77 -14 57 199 100 72 92 -86 -19 -19
5318 -19 -36 34 3 131 -13 107 -60 7 1 -166 6 -23 11 -5 126 59 127 220 -18 -101 124 -57 -53 -82 -7 60
5344 60 151 124 -59 -6 4 32 48 226 320 68 -71 114 -58 -203 4 -55 82 121 6 6 -3 -121 112 -81 -140
5369 -140 -163 35 -9 18 -33 36 -60 92 50 -45 -61 18 -34 235 30 72 -59 -16 -151 -205 -29 -138 21 94 35
5394 35 129 -10 -82 -81 25 -60 -106 36 26 43 -83 61 95 -101 -111 -91 -105 -21 -183 -25 -55 78 100 131 58 -74
5420 -74 -152 33 -36 -130 150 159 92 -100 -135 -104 -52 46 145 43 -110 -2 66 7 -48 11 62 -37 -123 95 57 168 11
5447 11 23 188 102 -44 -57 -11 78 -38 224 77 7 -8 135 -62 -202 78 62 81 86 28 32 79 -44 65 -75
5472 -75 -144 61 -90 -77 222 136 -49 -94 -62 -127 -79 107 -31 -91 79 56 46 -79 -69 -31 58 -151 -54 -110 75
5497 75 134 8 -19 3 71 -141 -84 -136 -163 253 19 27 8 -150 -46 -171 -61 -186 -26 92 2 165 217 -70
5521 -70 16 -84 -64 -96 -49 41 59 6 101 -45 -173 -152 -152 -14 1 11 161 -33 -66 -87 -55 -82 -5 50 -73 47 31
5548 31 -75 105 109 -118 -36 27 195 16 57 243 -4 16 101 86 147 -120 -24 -36 53 -45 -53 -6 -57 -57 -216 36 237
5575 237 -55 -106 -68 -28 139 -35 -49 3 -182 91 -26 65 62 -114 212 157 -110 -69 -86 -96 -157 70 14 135 -14
5600 -14 127 128 -54 -59 -20 -100 -34 112 33 96 51 -15 -140 -30 -20 -210 -126 -130 -31 -30 119 -24 -127 147 -23 153
5626 153 -165 -189 -54 58 90 25 63 -53 -89 11 13 -115 129 58 193 -19 -101 -193 -124 20 -220 -80 -18 -52
5650 -52 178 38 -66 -102 109 51 48 -31 -72 -170 -11 36 70 47 -23 -21 -82 -43 -42 -128 -8 -38 -1 98 135 17 -120 8
5678 8 -241 -40 -11 41 15 7 185 35 -10 -68 -134 10 -16 135 -13 0 40 124 -134 -81 -96 -62 152 13 21 -19 20
5705 20 -113 -171 -48 133 37 39 26 90 21 -12 77 -61 -107 -68 92 57 98 45 -13 218 -59 -228 50 -41 13 19 65
5732 65 79 12 -92 -52 3 56 -53 -88 -121 -56 102 109 100 20 102 128 -2 -119 85 53 66 22 77 -60 52 -166 19
5759 19 60 106 3 94 60 97 160 2 -65 41 -113 -109 -62 120 -16 40 130 -28 -124 -103 -18 -180 15 28 0 130
5785 130 -47 28 20 -169 -129 -108 -123 -24 109 68 181 -51 -62 -148 -235 -188 47 -27 -179 192 91 180 -20 -90 -52
5810 -52 52 24 17 169 -19 -109 223 -11 -29 -25 30 -41 211 105 12 261 143 -4 15 -123 -51 -5 20 32 -83
5835 -83 106 32 182 -83 -108 -35 -66 -70 -168 257 78 94 124 114 72 -107 -73 -16 117 16 132 160 116 -11 -9 -142
5861 -142 -39 -1 -34 88 -18 117 39 41 96 -97 -58 -201 1 -187 60 212 -110 -47 -81 91 172 67 50 60
5885 60 78 142 -7 103 -19 -118 7 -66 -71 74 46 -39 1 156 -49 230 -24 -84 33 -31 -2 2 23 188 -7
5910 -7 -81 -78 -29 -8 -98 21 -83 18 96 13 80 31 -49 -118 -102 -55 19 121 21 -42 86 33 139 -237 -88 61
5936 61 -48 -15 137 -132 285 -50 -223 7 67 -96 143 113 42 -60 -40 77 -39 -37 -84 159 51 28 87 57
5960 57 -37 -104 -71 -39 -110 -32 193 -62 168 184 54 46 -105 -36 18 -32 10 76 162 -47 -90 -69 -20 24 98 -126 139
5987 139 80 74 -10 104 86 -62 -36 13 -110 -62 -26 -61 43 108 -45 253 -68 -2 -97 44 54 -28 168 7 185
6012 185 49 39 -98 71 -12 -13 -90 114 86 51 234 16 -27 -64 -11 123 -30 77 186 43 -3 -89 -116 -136 17
6037 17 -25 -63 48 57 -19 55 -3 47 -163 -43 -76 -1 -12 94 65 94 65 -102 -57 15 59 -7 104 106 35 53 34 -206
6065 -206 -73 -82 -66 -67 -12 51 46 -230 130 -115 -180 -72 -187 135 -115 129 -8 2 133 -131 -128 0 -41 -146 34
6090 34 56 -13 -46 -1 -9 64 -56 -172 -105 -35 21 -48 -49 147 -22 154 0 -6 -145 165 184 75 153 85 -85 61
6116 61 -77 -89 85 -70 -63 194 25 27 -3 -49 8 -70 41 -259 2 61 110 9 -149 40 -3 -18 -159 -74 11
6141 11 25 101 -66 -31 7 -136 -22 -150 -77 -27 84 33 90 26 -69 -7 -87 -27 -172 -58 37 72 187 -33 22 -19
6167 -19 -50 -27 89 -170 -27 73 125 36 51 -43 24 -20 -151 -58 -31 95 109 17 37 -86 -64 61 -86 -90 -73 202
6193 202 52 13 -52 158 -29 -95 -221 -40 -53 33 48 29 86 98 -120 -51 -32 193 70 -43 46 112 140 142 15
6218 15 26 33 -63 -116 -160 -38 75 131 1 41 -75 -1 23 -36 -34 88 -100 144 -71 54 21 80 -28 77 37 -8
6244 -8 179 -72 241 211 121 171 -66 118 48 13 83 -124 -87 72 -61 103 -93 4 89 -69 2 -64 242 42
6268 42 -19 42 -14 -48 -17 -232 -58 -45 -57 50 78 73 -55 -112 -149 -31 -67 -29 -110 72 81 129 58 -115 -25 -9 -65 -102
6296 -102 -169 121 71 50 17 -50 -209 -184 -4 -102 -22 -10 153 44 186 -88 26 -11 42 114 -26 72 100 -131 -75
6321 -75 -120 0 -45 -107 -134 -157 119 154 121 41 -104 -92 35 13 69 -190 54 -101 87 89 138 177 -112 -17 -59 37
6347 37 126 -35 -16 147 83 -82 -47 -207 -129 53 3 52 -11 84 -114 -32 -40 65 -99 61 46 -30 65 160 130 -65
6373 -65 -95 105 51 -129 -3 167 92 30 -19 39 -75 -26 -127 -5 110 -31 -21 100 -37 51 216 9 166
6396 166 -100 106 -62 146 128 -32 164 -147 -66 3 -56 122 -43 -30 29 103 22 -9 -46 -121 -17 -63 -1 -70 -42
6421 -42 74 63 -58 32 -127 -61 -39 189 -44 25 90 -51 3 -5 -99 -12 80 44 -39 97 28 66 -113 -84 -86 43 80
6448 80 -22 29 67 124 139 -48 -218 119 8 -87 162 149 58 -25 -1 -5 -90 -14 -122 37 -176 70 63 4 201 162
6474 162 19 5 -50 -35 -66 -166 162 117 138 19 -30 -66 -20 2 85 59 -144 179 63 36 -49 -160 31 -85 72
6499 72 85 -91 1 21 -8 28 -79 66 -138 -41 -61 53 134 -68 -123 81 -94 -35 -114 -123 -142 -87 -282 -46 60
6524 60 7 6 -92 -111 27 -9 32 50 32 85 -26 75 -6 -11 -31 165 -29 64 11 -27 59 -56 -93 -113 88 89 -24 -126
6552 -126 78 67 -31 -22 -29 -131 -28 -29 -27 -110 55 -128 29 6 -36 -10 42 -182 97 17 -19 133 53 181 156 -25
6578 -25 -144 -129 -16 71 -28 12 59 -76 50 -84 43 -135 -161 -137 -40 -6 208 109 -173 119 6 58 -190 -116
6602 -116 -39 -93 -112 98 10 70 92 3 -82 -10 -31 15 -9 55 55 108 44 3 119 -74 36 4 51 -53 -71 139 62
6629 62 -73 11 -5 94 -68 -124 58 -19 142 105 231 -131 -92 122 -82 -51 125 307 -112 6 122 77 -148
6652 -148 -72 -89 84 89 -15 -76 0 -28 108 -75 -179 -139 54 165 48 160 -180 51 -42 -195 -87 -96 26 -146
6676 -146 -143 -25 -18 -22 -67 34 46 194 19 106 46 136 40 -11 -66 -89 11 -92 157 69 -89 -131 -9 -21 71 53 -7
6703 -7 -122 16 -138 -2 46 47 96 -115 -62 -31 -24 9 47 -164 -94 33 35 45 -10 -189 -95 -150 -53 -7 113 87 319
6730 319 29 210 43 -91 -36 13 -54 -109 61 94 57 166 -37 -74 -5 19 4 -93 23 121 -46 49 39 148 12
6755 12 -105 26 110 -95 -48 84 210 130 -70 -112 -15 -40 -42 -14 -113 75 -94 64 93 -45 -86 -124 -119 152 -106
6780 -106 -46 97 76 -68 86 -99 108 29 51 141 -76 289 116 -55 31 -106 -13 -26 4 81 33 67 17 -103
6804 -103 -21 -49 -185 -51 14 -63 162 139 -120 -70 24 2 -142 -5 46 0 111 21 -79 -31 43 -68 55 -128
6828 -128 -3 -17 89 105 -24 -79 -166 -67 -24 -36 44 65 40 -55 -63 100 -153 41 -163 -19 -13 -3 94 72 117 -54
6854 -54 -57 44 -37 12 -12 82 -69 -29 -87 185 -34 -27 -52 95 -134 -13 12 -8 -36 -7 147 -84 18 -43 34 -120
6880 -120 10 -136 250 2 -20 129 53 -68 -19 7 -41 -27 -77 -82 13 92 199 19 91 -32 66 -134 -44 104 0
6905 0 19 20 63 29 0 -46 -31 89 -72 -46 123 -70 -6 37 -64 4 -167 67 52 59 118 -137 -94 -128 -56 12 -51 19
6933 19 -14 15 -15 -100 -4 105 -166 64 45 -258 75 157 39 19 51 -124 -30 -118 -75 -32 27 106 81 65 -34 1 5
6960 5 -63 79 -34 -192 88 146 207 -59 72 -1 -123 -95 24 -30 196 70 63 -30 -109 -65 -45 -70 -42 12 -25 105
6986 105 23 -131 -61 -83 139 121 24 -8 -75 -27 -34 -118 56 48 -106 32 -118 175 -4 238 16 -32 -13 -84 158
7011 158 76 103 -68 50 -44 -4 121 -17 -60 -125 8 -148 49 -70 22 59 78 -80 -7 47 -55 39 0 7 -26
7036 -26 31 56 164 15 -62 -35 11 3 -25 11 78 133 -43 41 50 -112 20 155 -1 70 23 -107 137 -187 -31 71
7062 71 22 62 29 -35 -73 -16 60 34 3 -55 -45 78 -173 72 -9 -38 108 -15 8 -11 -88 -142 -54 84 146 149 -32
7089 -32 -56 120 156 97 -73 -47 70 -87 13 -15 42 2 -63 80 -141 23 -201 78 45 -44 152 -26 -25 110
7113 110 7 58 -13 -73 258 79 32 -41 -107 -44 -42 -77 -115 -99 -63 -90 -92 -143 -80 8 31 71 146 -140 52 -7 59 -59
7141 -59 -72 0 70 25 -168 167 56 85 35 -23 137 -75 -112 -7 -164 -10 11 5 7 -124 143 14 -38 -59 -37 131
7167 131 33 46 -41 -68 -52 75 -19 -19 14 64 194 270 -19 -160 -21 44 2 -39 -46 88 -26 112 6 92 28 13
7193 13 -3 -17 41 21 -97 -204 -129 -42 -202 -159 9 31 -80 15 149 -164 108 -45 41 -36 -40 31 -174 89 -38
7218 -38 -42 10 78 115 -49 -136 162 -21 108 48 25 118 -216 80 -1 100 -29 115 -79 122 134 42 -96 30
7242 30 17 26 131 -39 116 -108 97 -19 -7 174 -50 -168 -54 95 64 39 11 -148 -19 7 -39 -89 129 58
7266 58 -2 -73 56 46 105 -68 223 223 -88 37 -23 0 -1 23 -149 7 -61 32 129 -4 69 73 -156 -29 49 -102
7292 -102 3 79 41 -75 -71 -105 -70 -72 -56 39 112 -29 79 -45 92 116 -120 75 136 81 6 16 97 124 114 -40
7318 -40 -50 -72 -37 21 -233 45 24 111 21 162 -24 -6 -67 -1 13 42 -53 146 110 36 -85 -235 -53 43 9 89
7344 89 86 -93 -34 -38 30 -53 -102 20 110 200 17 -4 -31 32 -71 84 -245 -80 112 151 16 -136 24 -103 -41
7369 -41 22 -109 -52 -66 1 -55 28 62 171 -51 -99 102 85 132 -160 -64 -140 -39 -84 -14 51 8 -9 -21 -107 -30 42
7396 42 30 121 27 158 146 -3 -71 21 -22 85 56 81 15 99 164 -175 -130 13 -63 -79 91 40 -19 34 -52 46 -61
7423 -61 -31 -47 83 5 41 52 5 0 215 -102 6 118 106 -82 -12 -7 -69 39 72 28 -4 -82 130 113 -97 34
7449 34 -12 57 -144 -71 30 -19 33 -64 23 18 97 64 -38 100 34 76 -92 -89 -70 -33 117 -201 -39 -154 -102 17
7475 17 48 13 -38 63 -136 104 116 -102 -25 -35 52 -39 6 113 62 27 185 68 -9 -155 7 -3 -22 110 14
7500 14 4 36 -56 -1 -43 59 -48 36 -168 19 69 -58 16 -58 -209 71 -16 -95 -37 17 98 71 -99 19 1 78
7526 78 110 58 -161 -132 -10 -61 -178 11 10 90 20 89 -43 -4 -46 89 13 -87 -130 -136 74 -90 7 49 81 35 -159
7553 -159 125 42 58 -102 -57 79 60 23 7 31 -34 -2 -83 19 8 -169 -215 -87 16 -87 -56 -28 83 15 -1
7578 -1 28 46 -19 52 223 -79 -59 -112 -82 -83 -89 -28 -33 -15 113 -44 -62 151 -105 195 6 -128 -114 -118 113 6 73
7605 73 -20 20 13 -19 140 -23 -29 6 142 39 20 -54 -67 58 6 -19 65 73 -65 10 -71 134 74 -25 90 67 174
7632 174 -42 -60 -7 31 -68 -144 -84 110 141 -28 86 147 17 32 31 53 -85 -132 8 127 41 32 -39 88 79 -70
7658 -70 116 -24 -133 -1 63 207 6 -124 -57 46 92 -76 -26 27 27 119 128 264 28 -61 16 47 128 -89 146
7683 146 178 92 -22 82 -89 16 14 -122 31 -73 65 79 -10 -38 -22 -46 -103 -129 31 -44 103 -144 -14 144
7707 144 -67 -24 -97 -14 -153 -119 -25 6 125 -32 28 64 -116 19 69 -194 -78 170 160 151 -16 -23 78 -159 45
7732 45 36 -4 271 46 -44 44 47 87 -192 -35 -95 -34 104 35 -36 -61 -56 -1 -23 9 43 -15 97 50 6 176 23 0
7760 0 4 33 -165 2 113 -12 162 112 -42 -1 169 37 98 -83 -200 87 127 2 -19 13 -59 -140 -96 9 65
7785 65 133 89 123 -26 130 -84 -63 2 18 -43 -36 185 19 79 50 66 117 -22 -48 -105 2 -13 -151 87 -153 -36
7811 -36 69 -161 -14 81 -78 127 25 23 51 -4 17 -263 -68 -131 -95 71 214 36 131 8 -36 -56 -78 -16 3
7836 3 123 24 -5 126 95 -157 23 12 13 19 74 -99 267 96 4 -190 -70 -89 22 -89 36 105 -37 64 -54
7861 -54 64 -133 -122 -159 106 -40 3 127 221 12 114 5 -90 -40 -46 -12 151 103 61 110 -71 -60 -33 98 8
7886 8 26 7 33 -25 -195 71 -142 54 -28 -86 -49 -105 -10 -42 -44 -29 56 132 -135 5 143 17 -15 5 32 -180 27
7913 27 1 -76 -134 27 101 -98 12 1 127 -85 8 55 -133 -183 -81 -86 46 67 -100 163 -105 -72 55 8 -67
7938 -67 -12 71 79 -95 -14 -90 119 -20 37 -126 120 41 236 -23 0 -17 -59 -29 -41 -77 -58 11 -84 11 39 144 8
7965 8 76 -71 -23 56 -45 5 65 -44 0 32 -116 15 40 58 -56 -160 13 -12 100 -16 -126 -64 -10 -65 -43
7990 -43 99 173 0 -62 79 85 20 85 -41 -54 155 -23 90 14 10 -27 -32 56 -30 -38 137 70 6 -42 2 109 -12
8017 -12 -178 3 63 158 15 194 -66 -53 -74 -202 46 25 109 50 -85 -37 61 65 -112 -8 -26 97 95 -42 133
8042 133 104 14 -160 -62 -176 -49 -146 -217 -19 -93 -242 -30 75 -2 40 5 52 -103 -13 -95 13 80 -92 -116 -123
8067 -123 87 -83 -89 36 139 43 7 21 -64 -38 11 -93 -119 117 -118 46 -29 -30 125 -22 -89 96 -109 -39 -163
8092 -163 -48 -88 -60 -74 -97 -87 7 -44 86 40 85 -15 117 -125 -13 60 -113 27 44 51 -148 -39 -48 202 -150
8117 -150 -15 94 -52 -25 49 12 -20 3 141 51 78 -57 -2 42 -32 -73 16 228 -58 -2 106 -35 102 29 -14
8142 -14 -70 14 8 56 -42 137 120 79 104 -100 25 118 -42 212 39 -121 0 -49 105 9 -97 -45 93 200 -80
8167 -80 -9 119 -56 46 -221 24 107 -3 -44 -76 -182 -182 30 1 -2 -70 -71 -93 21 -68 -54 61 -143 -118
8191a18
$$ Imaginary data points
##PAGE= N=2
##DATA TABLE= (X++(I..I)), XYDATA
0 0 0 0 0 0 0 0 0 0 0 0 0 0 0 0 8 -8 8 -8 8 -16 16 -16 24 -24 32 -33 40 -48 55 -64 72 -81 89 -105 113 -129
36 -129 145 -163 183 -205 226 -254 280 -310 343 -379 418 -463 508 -561 617 -679 751 -826 915
55 915 -1012 1125 -1252 1402 -1579 1789 -2049 2378 -2806 3396 -4260 5652 -8285 15066 -75399
70 -75399 -126878 -15936 53365 112133 101848 60024 -14849 -71787 -104770 -87970 -42236 23143
82 23143 72306 94496 73583 25963 -33987 -75053 -85661 -57206 -7209 45510 76109 76181 44276
95 44276 -2048 -44655 -64082 -55692 -23301 17121 49894 61265 48626 17549 -17843 -44322
107 -44322 -50333 -35987 -6437 24617 45023 45195 26598 -2995 -29789 -42622 -36695 -16145 8864
120 8864 27363 32123 22012 3573 -15050 -26291 -26352 -16884 -2082 10944 17642 15278 5916 -5292
134 -5292 -13749 -15745 -10779 -1805 6952 11585 10641 4868 -2428 -7380 -7844 -3741 2309 7241 8635 6291
150 6291 1864 -2110 -3526 -2184 -188 2325 3449 3406 2997 2177 1635 1401 1247 1104 773 203 -795 -1942
168 -1942 -2535 -1099 2077 5367 7151 5291 -100 -7280 -12770 -12986 -7373 2547 11854 16387 13440 3372
184 3372 -9110 -19033 -21379 -14625 -1465 13387 22829 23113 13139 -3109 -19590 -28988 -26273 -11684
198 -11684 8983 27470 34854 27311 7475 -16679 -34076 -36759 -23170 1178 25574 39862 37214
211 37214 19144 -7265 -31240 -42565 -36322 -14252 14334 37969 46617 35947 9533 -21621
223 -21621 -44172 -48180 -31886 -1767 29162 48083 46619 25664 -5893 -35197 -49647 -43916 -19791
236 -19791 12115 38882 49513 39603 13091 -18757 -43109 -49700 -35360 -6714 24436 45093
248 45093 46464 28300 -1503 -30080 -45347 -41505 -20820 7821 32334 42674 35083 13137 -13799
261 -13799 -34162 -40003 -29352 -6636 17924 34575 36071 22408 -215 -21608 -33521 -30922 -15269
274 -15269 5857 23911 31128 24819 8710 -10378 -23987 -26804 -18371 -2243 13760 23283 22784
287 22784 12392 -2106 -15030 -20941 -17465 -6711 6317 16014 18519 12624 1823 -9430 -15642
300 -15642 -14829 -7517 2399 10767 14011 10816 3277 -5263 -10851 -11381 -7120 -128 6484 9906 8844
315 8844 4273 -2115 -7190 -9344 -7444 -2534 3470 7345 8121 5464 662 -3890 -6647 -6446 -3408 160
331 160 3314 4942 4734 2961 640 -1869 -3709 -4340 -3579 -1731 1270 3437 5008 4907 2953 345
347 345 -2755 -5103 -5866 -4928 -2205 1829 5832 8322 7882 4017 -2004 -8195 -11298 -10145 -4155 4189
363 4189 11164 14053 11305 3619 -6158 -14086 -16759 -12670 -3182 8232 17118 19697 13990 1962 -11675
378 -11675 -20970 -22075 -13839 590 15343 24117 22800 11930 -4254 -19336 -26765 -23119 -10002
391 -10002 7627 22503 28430 22685 7486 -11242 -25782 -29859 -21465 -3687 15759 28966 30064
404 30064 18756 -502 -19344 -30052 -28062 -14315 5564 23071 30876 25849 10491 -9049 -24818
417 -24818 -30219 -22980 -5962 13255 26808 29059 19341 1703 -16536 -27317 -26892 -14938 2765
430 2765 18697 26447 22821 9735 -6982 -20468 -25281 -19353 -5941 9383 20160 21900 14477
443 14477 1034 -12186 -20050 -19063 -10204 3018 14023 18938 15322 5317 -6764 -15144 -16636 -10436
457 -10436 -42 9844 15364 13896 6506 -3343 -11151 -13704 -9892 -1948 7204 12904 13285 8034 -781
472 -781 -8980 -13075 -11382 -4879 3770 10557 12386 8655 1202 -6610 -11244 -11143 -6048 824 6994 9897
488 9897 8261 3329 -3054 -7982 -9959 -7812 -2706 3473 7813 8797 5775 146 -5179 -7982 -7300 -3527
504 -3527 1237 5158 7115 5807 2932 -677 -3557 -4966 -4399 -2212 581 3438 5079 5126 3593 895
520 895 -1768 -3783 -4388 -3700 -1832 836 3173 4992 5518 4348 1571 -2287 -5865 -7749 -7104 -3395
536 -3395 1899 7002 9211 7594 2288 -4449 -10037 -12139 -9612 -3308 4550 10846 13148 10322 2731
551 2731 -6093 -12954 -14981 -10747 -1599 8471 15443 15933 9994 -410 -10844 -17112 -16107 -7927 3681
566 3681 14031 19110 16449 7116 -5218 -15305 -19159 -14919 -4207 8307 17723 19963 13844 1671
580 1671 -11188 -19912 -20187 -12202 744 13274 19954 18068 8792 -4322 -15543 -20209 -16792 -6571
594 -6571 5892 15613 18948 13638 3055 -8726 -17012 -17887 -11264 -103 10739 16898 15837 8044
608 8044 -2641 -11700 -15130 -11950 -3426 6591 13560 14494 9297 570 -7698 -12347 -11103 -5146 2929
623 2929 9582 12258 9251 2239 -5623 -10660 -10986 -6344 1064 7856 10580 8545 2464 -4640 -9555
638 -9555 -10313 -6561 -78 5852 8833 7703 3092 -2857 -7843 -9670 -7349 -1858 4439 8604 9178 5702
654 5702 -332 -6020 -9112 -7841 -2974 3220 7895 9249 6823 1531 -3959 -7574 -7922 -4583 480
669 480 5412 8635 8329 4751 -416 -5184 -7511 -6763 -3043 1941 5722 6964 5634 1917 -2358 -5206
685 -5206 -6096 -4633 -1677 1386 3454 3940 3360 1108 -1077 -2995 -3783 -3759 -2359 -854 866 2252 2694
702 2694 2448 1528 156 -1681 -3217 -3871 -3272 -1545 1287 3985 5567 5273 2714 -895 -4693 -6442
718 -6442 -5973 -2624 2122 6620 8882 7514 3172 -2661 -7664 -9804 -7745 -2397 4014 9557 11201
733 11201 8188 1736 -5731 -10999 -12106 -8127 -816 7014 11984 11858 6744 -1196 -9241 -13299 -12030
748 -12030 -5736 2761 10232 13143 10651 3598 -4896 -11283 -13209 -9767 -2043 6098 11757 12612 7991
763 7991 260 -7500 -12030 -11142 -5762 2045 8666 11430 9439 3430 -3744 -8992 -10211 -7163 -1054
778 -1054 5407 9213 9176 4991 -846 -6344 -8910 -7364 -2824 3072 7311 7978 5093 -4 -5135 -7352
794 -7352 -6323 -2496 2450 6064 6837 4490 168 -4313 -6705 -6291 -2587 1902 5909 7141 5135 542
810 542 -4260 -7287 -6771 -3178 1598 6031 7738 5878 1533 -3822 -7378 -7869 -4922 146 5166 8130
826 8130 7523 3664 -1627 -6414 -8513 -6890 -2404 3213 7267 8483 5918 936 -4408 -7842 -7900 -4727
842 -4727 395 5143 7839 7030 3585 -1315 -5476 -7037 -5970 -2266 1822 5101 6018 4511 1099 -2252
858 -2252 -4555 -5057 -3285 -310 2126 3730 3538 2140 105 -1714 -2342 -2352 -1291 -75 681 1174 1295
875 1295 903 459 328 137 -314 -849 -1466 -1603 -1159 -343 1330 2493 3028 2288 593 -1589 -3577 -4160
893 -4160 -3008 -282 2591 5109 5417 3625 162 -3649 -6057 -6099 -3514 672 4817 7089 6607 3212
909 3212 -1428 -5976 -7801 -6912 -2897 2337 6772 8096 6493 1887 -3587 -7511 -8219 -5517 -436 4621
925 4621 7877 7828 4444 -361 -5082 -7661 -6700 -3211 1734 6120 7800 6154 1900 -2849 -6460 -6932
941 -6932 -4645 -233 3842 6220 5723 2877 -1100 -4583 -5742 -4512 -1353 2074 4635 4959 2989 -45
957 -45 -3208 -4577 -4011 -1518 1537 3710 3823 2421 -436 -3016 -3936 -3083 -433 2139 3951 3720 1794
974 1794 -1110 -3481 -4149 -2913 -186 2824 4799 4746 2798 -775 -3925 -5504 -4476 -1509 2637 5482
990 5482 6096 4113 249 -3742 -6318 -5926 -3412 705 4541 6586 5717 2357 -2021 -5610 -6825 -5483
1006 -5483 -1832 2404 5686 6449 4461 396 -3742 -6332 -6091 -3549 569 4226 6080 5285 2464 -1183
1022 -1183 -3910 -5268 -4066 -1132 1831 4210 4609 3314 771 -1817 -3625 -3322 -1784 515 2228
1037 2228 3078 2621 1364 -580 -1649 -1817 -1232 -186 780 985 499 -22 -593 -658 -238 89 671 406 -318
1056 -318 -1314 -1980 -1595 -856 574 1988 2487 2215 313 -1879 -3633 -4134 -2823 -247 2640 4608 4510
1073 4510 2493 -725 -3532 -5079 -4320 -1849 1683 4649 5892 4803 1820 -1759 -4695 -5486 -4040
1088 -4040 -616 2993 5617 5892 3860 344 -3508 -5427 -5238 -2578 891 3989 5192 4373 1724 -1654
1104 -1654 -4009 -5044 -3931 -1353 1685 3611 4062 2603 -128 -2586 -4148 -3881 -2152 201 2281
1119 2281 2952 2434 631 -982 -2071 -2203 -1170 -6 1291 1770 1568 598 -561 -1384 -1054 -219 813
1136 813 1552 1414 680 -357 -1349 -1544 -447 862 2228 2710 1951 116 -1677 -2987 -2936 -1753 468
1153 468 2460 3752 3070 1186 -1502 -3645 -4486 -3415 -815 2071 4309 4508 2705 -287 -3389 -5322
1169 -5322 -4950 -2506 925 3797 5205 4321 1680 -1850 -4633 -5245 -3783 -754 2525 5030 4888 3246
1185 3246 72 -3041 -4410 -4141 -1942 934 3316 4176 3531 1344 -1588 -3197 -3518 -2495 -275 1852
1201 1852 2870 2874 1280 -528 -1872 -2623 -1948 -567 845 1488 1651 992 -413 -1233 -1413 -1029 -127 764
1219 764 1288 843 60 -1174 -1578 -1344 -356 1218 2017 1867 969 -773 -2044 -2410 -1926 -131 1644 2925
1237 2925 3039 1775 -171 -2451 -3775 -3564 -1507 962 3216 4281 3484 1091 -1653 -3975 -4652 -3277
1253 -3277 -627 2411 4191 4362 2628 -192 -3001 -4904 -4436 -2561 737 3329 4654 4190 1751 -1029
1269 -1029 -3749 -4776 -3660 -1260 1766 3588 4335 2886 565 -1837 -3424 -3464 -2335 -7 2124 3246
1285 3246 3020 1537 -212 -2026 -2694 -2210 -775 583 1592 1705 1380 418 -322 -786 -988 -759 -189 81
1303 81 342 317 66 119 221 358 451 186 -278 -992 -1416 -1161 -484 559 1511 1984 1444 307 -899 -2094
1323 -2094 -2293 -1586 -244 1571 2497 2729 1958 -45 -1880 -3021 -2971 -1534 546 2584 3397 3087 1403
1340 1403 -820 -2534 -3319 -2747 -977 1285 2862 3505 2324 457 -1479 -2977 -3344 -2158 -92 1890
1356 1890 2999 3030 1678 -466 -2122 -2848 -2445 -1008 991 2041 2398 1597 305 -1042 -1993 -1832 -1061
1373 -1061 381 1362 1568 1216 214 -878 -1303 -1377 -602 401 1099 1041 508 -287 -1085 -1269 -682 251 1009
1392 1009 1479 1358 449 -893 -1918 -2281 -1328 -24 1541 2608 2334 1107 -521 -2157 -2715 -2369 -856
1409 -856 1244 2865 3265 2201 382 -1668 -3429 -3575 -2111 -34 2350 3728 3501 1868 -348 -2803
1425 -2803 -3993 -3311 -1591 1024 3018 3856 3132 977 -1472 -3098 -3828 -2934 -698 1564 3479 3857
1441 3857 2716 559 -1784 -3117 -3485 -2060 -76 1928 3148 3109 1904 -219 -1783 -2783 -2740 -1516
1457 -1516 157 1754 2546 2421 1247 -240 -1517 -2260 -2028 -1062 120 1232 1594 1604 846 -112 -814 -1369
1475 -1369 -1305 -999 -340 447 836 975 840 579 -31 -552 -1020 -934 -831 -114 384 1068 1404 992 384 -117
1495 -117 -1060 -1452 -1055 -423 374 1113 1640 1363 630 -264 -1036 -1506 -1351 -479 391 1538 1763 1441 594 -239
1515 -239 -1256 -1897 -1513 -615 405 1266 1629 1388 250 -843 -1665 -1548 -1122 -272 921 1488 1310 649
1533 649 -113 -918 -1155 -1010 -305 54 526 1019 580 14 -463 -615 -461 -83 552 714 786 367 -272 -568
1553 -568 -727 -449 170 963 1180 1010 75 -655 -1407 -1170 -621 326 1283 1519 1417 428 -629 -1835 -2111
1572 -2111 -1833 -658 1057 2252 2222 1586 -43 -1770 -3036 -2910 -1661 352 2033 2983 2589 1082 -819
1589 -819 -2581 -3289 -2703 -1043 1352 3081 3711 2840 575 -1701 -3539 -3593 -2396 -42 2323 3928 4003
1606 4003 2382 -145 -2305 -3614 -3412 -1921 847 2709 3828 3351 1405 -747 -2974 -3696 -3131 -1227
1622 -1227 1281 2681 3224 2256 516 -1543 -2792 -3141 -2226 -324 1345 2532 2380 1705 -135 -1431
1638 -1431 -2196 -2057 -1155 152 1267 1883 1764 827 -89 -1015 -1317 -1230 -440 332 963 1330 1156 560 179
1657 179 -322 -498 -588 -236 198 319 278 436 592 530 198 -208 -279 -288 -536 -480 -159 97 537 529 373 24 -495
1680 -495 -781 -987 -1106 -581 91 677 893 796 199 -402 -902 -1070 -881 -302 416 1027 879 692 216 -580
1700 -580 -742 -832 -359 192 677 1027 772 260 -318 -557 -619 -303 347 581 568 362 -80 -317 -516 -271 176
1721 176 492 732 641 -69 -514 -1007 -1006 -303 357 1149 1338 1093 15 -1012 -1803 -1891 -1113 296 1493 2037
1741 2037 1974 654 -754 -2031 -2734 -2218 -780 1127 2505 2986 2054 543 -1699 -3020 -3038 -1832 203
1758 203 2301 3336 3134 1651 -411 -2597 -3525 -3291 -1382 1069 2949 3858 3277 1116 -1416 -3203
1774 -3203 -3774 -2736 -453 1876 3464 3552 2358 270 -2155 -3371 -3747 -2036 236 2307 3385 3087
1790 3087 1607 -523 -2434 -3275 -2512 -1044 905 2437 2849 2164 740 -1154 -2308 -2532 -1679 -124
1806 -124 1430 2108 2120 1319 -1 -1224 -1958 -1547 -796 195 1156 1360 1270 512 -212 -858 -1076 -874 -198 334
1826 334 684 713 517 -29 -286 -421 -472 3 103 99 159 87 1 2 20 133 210 132 -55 -374 -502 -371 -98 131
1850 131 512 585 578 206 -292 -423 -714 -450 -175 277 512 594 311 -130 -412 -532 -511 -302 -41 250 374 235
1872 235 47 -70 -198 -376 -230 80 10 151 101 -205 -147 -28 67 203 351 210 -112 -401 -441 -470 -262 394
1894 394 756 778 627 210 -550 -927 -1245 -842 -6 930 1320 1330 907 -309 -1233 -2043 -1792 -825 564 1610
1914 1610 2174 1863 645 -1062 -2117 -2248 -2030 -803 1023 2485 2638 2024 162 -1704 -2669 -2875 -1797
1931 -1797 -47 2042 2857 2779 1545 -299 -2252 -3068 -2833 -1358 608 2370 3143 2513 1117 -1050 -2593
1948 -2593 -3013 -2254 -495 1321 2820 2818 2176 218 -1531 -2747 -2793 -1572 131 1797 2588 2424 1143
1965 1143 -292 -1731 -2399 -2006 -859 667 1856 2188 1712 591 -724 -1651 -1816 -1416 -380 841 1649
1982 1649 1391 878 63 -829 -1323 -1273 -562 217 721 900 677 326 -230 -616 -771 -441 -80 221 452 483
2002 483 236 -141 -414 -471 -228 -159 371 231 106 -227 -175 -277 -153 -16 374 508 377 218 -70 -235 -337
2023 -337 -469 -124 378 413 590 392 -21 -459 -520 -357 -93 74 359 516 357 140 1 -348 -466 -332 -276
2044 -276 28 -32 406 262 170 -12 -233 -312 -440 -492 -289 -239 218 580 439 556 451 -74 -575 -739 -805 -321
2066 -321 43 760 979 1134 693 -173 -570 -1091 -1090 -656 237 1090 1559 1413 802 -329 -1325 -1694 -1435 -624
2086 -624 494 1497 1784 1620 448 -747 -1996 -2157 -1702 -406 814 1939 2240 1341 173 -1334 -2233
2103 -2233 -2263 -1510 21 1477 2246 2217 1320 -230 -1750 -2522 -2193 -1067 547 1817 2498 2203 1053 -624
2121 -624 -1869 -2408 -1766 -368 998 1841 2278 1661 358 -1009 -1882 -2053 -1264 -11 1155 1726 1629 906
2139 906 -208 -1225 -1790 -1591 -730 473 1188 1496 1152 342 -652 -1145 -1408 -802 -206 489 1014 768 412
2158 412 -360 -726 -965 -708 -83 351 638 721 239 -155 -327 -533 -221 1 355 490 413 212 -114 -323 -354
2179 -354 -302 172 399 612 673 144 -282 -619 -668 -449 -38 271 512 503 172 7 -546 -548 -616 -257 64 451 635
2202 635 532 250 -270 -508 -650 -650 -162 200 610 473 460 349 -154 -481 -386 -495 -247 96 336 601 667 381
2224 381 91 -401 -650 -524 -399 -88 368 586 692 710 220 -205 -573 -847 -860 -272 167 729 1091 930 389
2245 389 -245 -803 -1043 -1172 -529 170 943 1179 1142 622 -109 -1030 -1487 -1302 -619 324 1106 1490 1437 475 -678
2266 -678 -1296 -1577 -1286 -416 676 1491 1670 1281 328 -832 -1741 -1663 -1298 53 1159 1774 1775 1035 22
2285 22 -998 -1763 -1667 -809 310 1235 1802 1447 676 -446 -1418 -1756 -1344 -336 576 1340 1476 1194 119
2304 119 -795 -1296 -1309 -734 152 781 1212 1169 677 -27 -854 -970 -814 -423 49 769 762 543 209 -336 -725
2325 -725 -532 -371 287 510 717 518 115 -317 -547 -413 -248 118 471 393 345 219 -383 -580 -517 -163 299
2346 299 509 480 316 -87 -216 -558 -607 -382 122 550 594 545 198 -378 -762 -750 -543 52 370 856 772 463
2368 463 -93 -592 -748 -661 -169 -34 631 776 708 413 -243 -630 -737 -624 -175 123 630 669 615 290 -99
2389 -99 -682 -774 -592 -262 -16 544 602 726 479 -82 -299 -489 -623 -555 -100 134 578 740 597 143 -154
2410 -154 -654 -831 -768 -314 325 492 1072 683 436 0 -598 -841 -891 -499 45 724 1039 1040 697 -207 -951
2431 -951 -1083 -1103 -515 259 1009 1173 974 383 -438 -903 -1393 -1061 -309 489 1139 1395 1066 377 -410 -1250
2451 -1250 -1420 -831 -162 741 1396 1371 843 41 -628 -1167 -1055 -720 80 771 1237 1192 684 -285 -961 -1251
2471 -1251 -1110 -320 350 772 970 773 68 -394 -983 -886 -587 -93 706 888 748 409 -49 -660 -742 -539
2491 -539 -241 247 556 619 427 -130 -396 -420 -356 -180 129 259 316 331 -210 -470 -72 -223 93 309 412 442
2513 442 85 -271 -607 -736 -280 -64 234 653 624 381 -98 -518 -583 -725 -465 170 606 788 672 239 -341
2534 -341 -756 -784 -517 62 501 810 854 563 201 -554 -674 -663 -328 64 373 929 642 358 -217 -572 -714
2555 -714 -715 -279 269 492 703 601 346 -235 -654 -633 -640 -551 15 422 536 552 321 -113 -454 -326 -523 -474 -93
2578 -93 301 338 508 576 194 -168 -506 -750 -609 -80 77 505 654 689 410 85 -471 -761 -577 -535 -69 410
2600 410 691 785 488 -6 -649 -873 -788 -283 -5 629 889 726 413 -9 -540 -860 -886 -428 83 586 824
2621 824 807 280 -346 -763 -1028 -712 -225 412 775 937 767 167 -345 -829 -848 -484 7 497 727 695 482
2642 482 -15 -376 -714 -800 -295 284 577 594 468 207 -50 -512 -363 -451 -4 336 407 460 323 -47 -307 -465
2664 -465 -233 -31 74 306 248 105 -84 -306 -378 -304 83 344 190 239 -105 -158 -303 -227 24 114 308 652
2686 652 315 -13 -244 -470 -542 -298 109 511 687 765 337 -20 -317 -713 -577 -290 253 614 845 643 106
2707 106 -144 -657 -739 -515 -127 324 755 753 516 84 -523 -529 -766 -301 -139 508 632 561 346 -14 -300 -739
2729 -739 -613 -428 4 359 535 679 173 -206 -229 -724 -562 -333 12 274 455 482 291 77 -312 -507 -268
2750 -268 -251 -80 271 306 423 213 125 -118 -221 -268 -427 -200 61 356 397 402 285 36 -238 -314 -502 -263 117
2773 117 300 470 355 397 119 -311 -573 -441 -431 -95 305 483 529 462 70 -333 -498 -798 -350 -107 242
2794 242 626 561 514 64 -393 -651 -648 -510 -79 528 675 677 211 -248 -388 -626 -479 -264 139 576 592 407
2816 407 79 -84 -540 -406 -343 -19 327 438 285 110 -42 -217 -266 -296 42 217 224 105 -58 -237 -97 -280
2838 -280 -201 57 250 115 -21 -64 -205 -317 -120 -31 269 357 352 194 -287 -269 -489 -335 -123 115 482 573 446
2861 446 85 -300 -589 -449 -195 39 605 597 624 294 -139 -547 -695 -685 -256 277 585 801 630 319 -268
2882 -268 -732 -567 -686 0 497 830 653 421 170 -374 -784 -674 -430 54 360 731 612 393 16 -522
2902 -522 -724 -619 -184 161 415 282 654 225 -118 -293 -321 -215 -189 -60 317 400 268 199 -100 -206 -121 -230
2924 -230 -148 14 -75 135 189 132 184 59 106 -200 -228 -188 -208 122 329 416 444 383 101 -254 -375 -406 -226 118
2948 118 378 483 471 332 -117 -403 -552 -479 -417 37 501 565 470 132 -257 -271 -652 -477 -217 18 557 489
2970 489 389 48 -358 -388 -637 -353 98 235 561 499 282 5 -333 -240 -371 -55 265 305 298 307 158 5 -192
2993 -192 -192 -258 33 103 231 246 -99 -79 -75 -38 4 -2 165 113 109 -159 -226 -50 -14 101 152 220 -63 38 -397 -452 -422
3020 -422 -233 57 298 298 344 48 -178 -403 -450 -363 5 315 430 465 178 -55 -332 -747 -497 -187 23 441
3042 441 670 468 291 -107 -657 -509 -593 -205 176 482 613 603 -97 -260 -592 -471 -291 25 379 416 462
3063 462 318 -70 -292 -368 -395 -441 35 255 164 241 145 -64 -251 -267 -364 -195 -81 72 50 241 54 -15 -75 -206
3087 -206 -254 -129 -111 -93 170 44 92 -35 33 -7 -175 -188 -293 -63 42 23 244 199 181 9 -230 -232 -343 -37
3111 -37 30 242 379 265 312 144 -166 -480 -378 -116 -197 303 405 409 264 -143 -471 -539 -561 -265 24 236 330
3134 330 306 37 72 -283 -356 -258 -166 -78 345 427 387 72 -211 -159 -254 -229 -164 131 301 219 242 -79 -128 -120 -155 -194
3160 -194 1 -28 287 264 -3 112 -1 70 -49 -212 -4 97 -55 10 89 79 141 128 52 -203 -154 -105 -133 -61
3184 -61 -3 99 145 334 109 -231 -111 -327 -216 -233 10 118 209 286 268 -11 -207 -257 -397 -120 126 172 352
3207 352 402 81 -186 -277 -427 -349 -64 43 407 382 294 -40 -92 -260 -352 -253 -298 100 254 422 293 206 -179
3230 -179 -265 -427 -224 -85 63 274 406 71 -112 -120 -268 -332 -166 -51 68 219 336 223 24 -54 -304 -204
3252 -204 -97 -89 12 -27 33 1 45 111 0 -105 -20 -153 0 -34 29 281 132 157 87 -87 -199 -39 -63 -103 137
3277 137 88 184 271 188 -125 -277 -316 -275 -117 170 176 288 249 313 -168 -151 -240 -190 -235 -8 100 354 302 246 -68
3302 -68 -274 -389 -196 -154 37 130 264 195 121 -73 -343 -308 -296 -127 182 314 214 217 -56 -186 -242 -153 -163 60
3326 60 232 147 309 292 -38 -77 -176 -317 -202 -86 11 30 232 131 170 -7 -134 -75 -113 -149 -80 74 32 225
3350 225 79 -56 23 -51 -112 -184 -83 -111 -8 31 288 109 126 31 -212 -31 -253 -177 15 5 452 98 165 -88
3374 -88 -165 -291 -212 -115 62 202 197 248 146 -36 -111 -358 -279 -202 -30 303 281 345 219 116 -366 -338 -315 -171 124
3399 124 244 177 302 345 -49 -118 -275 -323 -30 -58 59 330 329 160 -114 22 -199 -143 -113 100 -26 77 56
3422 56 8 -56 -28 -130 17 -98 -152 91 -116 50 106 86 171 26 -3 -120 -38 -197 -44 68 218 187 254 175
3446 175 -96 -182 -93 -39 39 -3 243 277 297 222 -18 -105 -290 -225 -130 112 361 303 247 52 -232 -349 -412 -309 -17
3471 -17 13 423 386 57 18 -108 -266 -398 -189 203 300 381 333 287 -88 -154 -297 -224 -274 95 160 200 226 263 -171
3496 -171 -230 -235 -299 -72 -13 286 247 228 84 56 -97 -157 -176 -5 79 -50 174 259 97 134 -87 -62 -1 51 14 107
3522 107 98 99 171 208 135 50 -116 91 -99 -137 14 -122 61 -67 67 183 -132 -347 -241 -252 3 230 174 215
3546 215 215 158 -194 -238 -213 -220 -48 176 208 177 184 19 -209 -144 5 -176 -46 30 102 272 37 77 -223 -175 -181 -215
3572 -215 -237 86 126 266 88 -203 -31 -173 -100 -186 -206 51 -10 144 -3 23 -207 -169 7 -88 -46 57 156 17
3596 17 37 -5 -57 -91 1 -42 -86 -114 -145 24 220 144 104 57 -93 -88 48 115 -136 -38 148 348 348 202 -111 -245
3622 -245 -219 -170 -219 78 235 85 184 222 -215 -180 -295 -404 -61 -111 41 270 137 107 -34 -255 -422 -384 -89
3645 -89 83 382 376 232 64 -47 -263 -307 -246 -41 125 416 289 320 214 -181 -158 -458 -413 -73 90 299 314
3668 314 211 142 -141 -129 -246 -229 -21 74 244 147 273 115 -209 -283 -43 -46 165 -17 277 76 191 -32 -70
3691 -70 34 -128 -33 74 130 139 140 39 100 -190 32 -26 -86 -18 -25 -15 144 -59 152 83 -94 -171 -83 -199 -201 -72
3717 -72 -99 55 44 146 81 -4 -25 -91 -80 -13 -38 -7 227 173 -63 -94 -224 -45 92 -77 18 60 100 55 68 -122
3743 -122 -46 -172 -170 -69 -29 72 -35 186 259 -80 -47 -81 -98 -32 -131 45 32 75 -113 -62 -59 40 -195 -125 -190 181
3769 181 -5 46 64 101 162 50 42 -147 -52 -80 -58 195 109 211 337 -36 46 -255 -381 -206 75 44 295 285
3793 285 162 187 13 -223 -312 -298 61 44 255 390 169 -11 -147 -351 -308 -354 131 208 221 267 132 -101 -237
3816 -237 -345 -302 -54 6 253 353 393 147 -44 -330 -400 -301 -30 133 215 283 383 203 -205 -352 -224 -144 -1
3839 -1 -7 81 325 20 81 -151 -187 -140 -108 -12 140 63 202 110 74 -115 -199 -206 -68 -1 -89 191 107 286 -2 -134
3865 -134 -95 -17 13 -71 -130 -10 168 9 111 73 34 98 -15 -54 -57 69 4 39 61 126 -125 128 15 -242 -100
3890 -100 -26 -134 -24 176 22 71 -3 -38 -225 -201 23 -46 -92 -100 231 -88 133 -59 1 -178 -78 -28 85 94
3914 94 164 137 4 -75 -156 -59 35 -234 -67 100 10 20 8 53 -83 -91 -49 16 -96 106 144 26 19 -164 -81 -108 -153
3941 -153 -148 -28 -83 240 214 178 81 -247 -43 -233 -184 -271 -110 91 272 77 89 225 -79 -74 -302 -125 -160 117
3965 117 186 153 168 69 -17 -205 -311 -221 -36 48 144 280 239 -42 -123 -239 -244 -219 -8 92 365 304 94 88 -130
3990 -130 -264 -457 27 101 51 286 210 172 9 -147 -194 -298 -125 85 157 209 117 172 -153 -192 -174 -46 -97 114
4014 114 311 238 156 54 -114 -271 -87 -143 -141 323 116 33 129 174 -6 -105 -155 -87 -11 38 116 85 176 -120 85
4039 85 -157 -139 -97 -38 -66 48 207 14 20 -136 59 130 -64 -50 -226 -48 -72 122 81 -7 -34 -81 -39 -108 -23 -63
4065 -63 -91 -37 -92 88 109 -71 69 -150 63 -19 -162 -73 46 79 102 161 -28 -101 84 -199 -153 -54 70 78 99
4090 99 -174 85 -177 15 -130 -64 -69 -22 -30 64 89 -19 -66 -1 -64 -81 -52 -78 35 137 79 21 195 -47 46 -160
4116 -160 -85 -76 47 205 81 152 95 -64 -74 -125 -146 43 67 73 186 244 -114 -70 -140 -336 -253 -104 -59 108 233
4141 233 136 21 -63 -205 -383 -154 78 170 161 380 322 -49 -207 -202 -420 -98 36 118 526 359 221 61 -82
4164 -82 -127 -262 -109 -24 280 259 103 65 -54 -37 -288 37 -25 -32 50 243 98 -85 -89 -62 -246 -127 90 -51
4188 -51 97 136 87 -57 -325 -40 -58 -260 -155 7 165 191 65 57 -46 -217 -59 -6 -68 -17 146 -47 127
4211 127 77 87 -109 -76 -4 56 24 -113 -53 -39 -28 37 35 -67 -12 150 -13 -60 -91 -19 -28 18 -73 189 232 185 -146
4238 -146 -28 -163 -42 -1 133 -36 16 52 -113 159 -77 -9 105 72 170 167 79 2 74 -190 -10 36 -39 -60 51
4263 51 149 114 120 12 10 -56 -42 -138 -155 -220 174 88 -29 14 41 -12 -179 -144 201 23 100 159 27 171 -89 -200
4289 -200 -271 -71 -161 -53 107 380 294 -37 -83 -221 -112 -93 -22 40 142 30 174 13 -138 -94 -190 -255 84
4312 84 93 176 294 73 81 -112 -151 -197 9 -44 146 278 174 72 -16 -108 -106 -412 -145 36 108 192 138 212 52 -130
4338 -130 -134 88 -166 54 246 264 182 60 113 -42 -245 -175 40 65 111 142 178 23 -132 -131 -164 -179 -106 -112 194 311
4364 311 214 248 10 41 -150 -161 10 -15 4 118 137 -39 15 44 -108 0 -78 134 56 249 -30 -55 -90 15
4388 15 -54 -132 48 7 -7 -134 -142 -6 -100 56 -74 -60 175 10 -32 -80 -135 90 -66 21 45 -214 -61 -51 -35
4413 -35 -61 -47 -36 -43 144 85 137 -86 15 -105 -54 -121 -49 -62 17 163 29 7 -79 28 -48 -125 -61 204 18 91
4439 91 206 71 -95 -98 25 -173 -75 133 12 71 71 80 82 -128 -138 -162 57 -60 172 100 159 -2 72 -147 -233 -92
4465 -92 -186 -68 78 110 75 -16 -168 -63 -106 19 -21 58 70 138 99 62 2 -138 -241 -202 -78 122 -55 156 109
4490 109 34 -10 -170 -37 -187 2 -1 56 289 148 138 38 -78 -201 -143 -69 10 49 197 195 14 36 -182 -56
4514 -56 -130 3 90 113 88 216 11 -44 -180 -7 -178 -90 234 89 31 -44 71 -325 -113 -109 -133 74 -25 156
4538 156 122 88 98 -20 -126 -27 -79 6 -51 294 -47 -83 -41 -80 91 -75 164 -1 140 33 73 -63 -97 -128
4562 -128 38 -40 20 160 -3 -116 -146 100 -24 -106 -160 -50 -24 -44 -94 -90 -122 -118 -49 69 135 102 16 5 -85 -74 -13
4589 -13 -101 89 128 65 151 10 -35 -177 -131 -108 207 -122 148 112 57 -106 -73 -171 -167 -208 -23 42 83 68 125 -109
4615 -109 -137 -86 19 -178 -96 1 33 91 -29 98 51 -178 -222 -178 -18 -54 197 279 210 116 37 100 -128 -27 -24 -34
4641 -34 -11 -30 157 118 -2 18 -112 -138 -30 -55 -32 201 64 -6 -3 41 -230 -194 -156 -134 195 163 155 98 215 -80
4667 -80 -130 -156 -219 -21 -33 10 226 80 -60 -151 -187 -157 57 131 136 217 -65 -39 94 -67 -185 -78 47 108 52
4692 52 14 92 -121 -72 -145 -165 -43 -92 6 149 29 69 -30 -149 0 -94 56 -60 151 63 -36 159 19 89 -10
4717 -10 -63 91 -36 31 -114 18 31 -107 -115 -95 -16 122 -137 -74 -18 -13 76 52 114 33 -70 -59 -92 -46 -75 -7 -14 -157
4745 -157 113 24 100 -3 -88 -106 -57 -85 -68 51 105 12 46 -26 -56 -12 -17 43 69 -49 214 58 186 50 -140 -73
4771 -73 -114 81 -122 10 209 177 29 165 88 -9 -66 -107 46 -50 110 157 282 64 109 68 -37 -125 -140 -31
4795 -31 51 145 -20 108 -7 43 -92 -190 -106 25 23 80 94 57 74 -214 -142 -34 63 -21 123 145 165 101 66 -92
4821 -92 -22 -171 -136 -94 98 -93 225 -25 87 -163 -163 -172 -13 -2 201 123 44 44 -61 -9 -130 -34 -151 -118 -89 101
4847 101 199 244 -18 -53 -43 -15 -7 116 72 145 123 14 -36 10 -98 -179 -74 -19 -7 54 92 67 29 -9 -168 -96 -349
4874 -349 116 13 -2 -149 -22 123 -85 52 150 -2 128 114 160 192 -158 32 -81 -84 -4 -7 -79 -59 113 14
4898 14 69 125 57 69 277 -92 -47 -124 -255 16 -68 -19 71 169 56 34 -160 -120 124 -75 -104 147 -19 131 -45
4923 -45 -52 113 -91 -115 -57 -68 108 77 -4 103 -143 -39 -187 -170 42 133 136 162 233 32 -94 3 -16 65 19 18 48
4950 48 95 68 20 -92 -113 -105 -78 -4 41 84 52 124 -62 17 87 36 -99 -97 87 42 78 117 -36 -120 -45 53 -311 -104
4978 -104 40 49 284 -121 -4 67 9 36 -81 27 65 32 47 42 81 11 -42 -62 -92 -102 -16 -64 81 192 199 -48 24
5005 24 36 18 -119 130 -33 33 121 -74 32 -22 -22 16 -63 86 210 90 17 5 46 -50 -10 -174 -67 83 3
5030 3 212 182 -2 -35 -6 -17 -49 -104 -86 -44 -72 33 28 10 -94 159 -101 -43 38 126 -2 -85 10 8 55 14 95 -131
5058 -131 -21 -56 -196 0 35 184 75 -45 42 -34 109 10 -32 -169 58 62 75 -62 -38 124 -118 -76 -15 9
5082 9 -31 77 134 -15 113 41 25 83 -91 -79 -127 -113 46 46 172 -152 -85 -194 -18 179 99 140 278 163 59
5107 59 -5 -152 -185 -67 25 -156 -81 12 190 -8 61 -121 15 -171 -43 -89 41 132 147 -64 74 -26 30 -220
5131 -220 -49 57 -49 66 -42 65 10 -53 -219 -47 -78 249 -121 -74 24 79 37 -72 32 -21 13 -6 75 156
5155 156 96 -1 33 63 -119 74 -177 -90 -60 -47 -10 129 61 89 13 35 51 -119 -19 -54 26 -11 -44 97 80 36
5181 36 -20 -43 48 33 148 -33 -123 29 -106 37 -121 11 -25 88 52 39 -37 37 -74 68 -158 4 -84 51
5205 51 177 148 65 -47 68 -39 -40 -52 -40 -100 -153 52 65 -23 31 -9 -113 54 -49 68 36 -91 152 -140 27
5230 27 189 -31 37 -54 66 253 150 67 -11 92 49 -42 102 -52 -56 81 41 -89 272 -4 65 110 -232 -169
5254 -169 -100 102 128 21 -57 64 73 80 -62 100 -160 -77 130 157 -4 55 52 -9 1 -37 -43 17 56 216 203 113 172
5281 172 -152 -74 -95 35 -107 -23 117 53 148 130 -52 -90 -149 144 -173 5 20 204 6 34 -48 108 -189 -66
5305 -66 50 -44 145 99 208 -2 166 120 73 -85 -98 -115 -38 -57 -31 -16 46 81 -61 -182 -128 -2 -40 8 107 158
5331 158 72 -49 -39 -9 -167 -271 153 213 19 137 -85 64 -16 67 -48 -169 81 -45 27 53 86 46 -43 -140
5355 -140 -10 -83 -89 5 195 13 110 128 38 -75 -7 -173 -47 -129 57 39 40 20 23 77 -6 97 14 -30 36 222 144
5382 144 247 -175 -117 -4 -219 24 17 9 149 60 -77 -138 29 -25 3 -103 -54 24 112 -41 94 28 119 -32 63
5407 63 -170 -57 27 4 16 212 142 77 185 56 -207 -71 -10 24 167 128 -113 -155 -146 -86 -12 -142 23 106 -147
5432 -147 92 77 5 -107 -37 -114 -166 -32 60 73 29 -118 -36 25 -57 -168 18 7 85 73 58 140 140 -9 -102 -122 -80
5459 -80 -11 -54 250 146 31 28 23 124 -16 -9 -51 92 68 19 -8 25 -83 3 -46 -34 -61 37 -81 -15 25 145 127
5486 127 59 -63 -62 -26 -150 27 289 -131 98 208 150 -4 -71 -255 -100 90 92 31 92 -41 -110 -162 -262 -100
5510 -100 119 -14 79 38 -84 115 97 -175 -39 -7 -42 -31 -158 -13 -18 105 223 77 -32 -48 41 9 59 -45
5534 -45 42 119 8 -153 -208 24 -31 -45 65 96 -45 65 5 123 30 -135 -17 56 16 79 -20 54 111 40 145
5559 145 -77 20 42 45 -76 88 -138 233 13 -37 70 248 38 -186 91 -75 69 14 15 -104 -112 -34 -136 -20
5583 -20 -8 -53 45 -76 70 94 24 79 -86 -211 -4 31 -33 52 25 -16 -51 -3 -159 103 -14 20 -80 310 117
5608 117 13 -131 33 -23 -46 -80 -13 69 34 14 63 -33 -74 -161 0 -44 -121 91 51 53 -3 23 -8 98 44 -23 149
5635 149 9 -88 66 18 -30 -170 -57 -108 -37 -17 -99 92 67 48 -103 -94 116 137 14 -1 -35 0 -80 91 88 9
5661 9 83 46 33 -105 -118 -114 -113 -110 105 118 -18 -17 -76 151 -140 31 15 -77 80 283 45 -97 -217 -86 -186 -66
5687 -66 -2 95 -132 -8 -83 -47 223 13 -135 -18 97 -43 173 170 80 30 -121 -105 -149 34 23 37 90 -120 -81
5712 -81 -7 -1 -148 -99 -22 0 81 -43 -61 17 101 28 -179 12 -17 -13 -48 -16 17 95 220 25 -70 -68 -50 -17 -62 4 -14
5741 -14 30 101 3 67 -89 -91 185 78 59 -48 36 118 -124 120 75 -49 2 32 146 -22 53 -25 -157 25 -136
5766 -136 77 -47 -165 81 1 5 158 43 -41 -108 -135 -62 159 -17 83 90 190 46 -56 -47 -15 -81 16 112 -33
5791 -33 -26 164 -43 -68 -108 -23 -55 134 52 79 50 29 15 61 -28 -99 0 -22 14 -43 86 98 -55 -92 36 -70 -50
5818 -50 25 -96 -25 -52 116 56 -11 45 36 10 103 -172 -4 65 -80 97 -18 41 40 35 -128 -10 55 -125 51 26
5844 26 105 139 76 -48 -6 -55 -66 -87 -75 25 -19 96 -7 -46 -33 -174 58 -8 215 61 -13 92 -100 -138 -99
5869 -99 -27 156 79 -80 12 90 -19 -147 -103 -28 7 -57 190 -40 18 50 -31 -3 74 96 -174 6 80 17 104 54
5895 54 15 -89 -42 -21 15 -33 0 92 24 -128 55 65 -27 13 -6 -38 -183 -101 8 25 -41 105 -40 -47 -33 -8 -67
5922 -67 95 -54 -3 124 171 134 -59 31 -23 -166 -38 -100 131 141 -13 127 145 -44 -154 -70 -14 -116 103 37
5946 37 100 7 -79 6 -78 -120 -48 -87 36 -154 40 66 88 -124 -64 26 -127 89 49 184 -115 11 125 -63 70
5971 70 -142 -107 73 -67 -35 8 70 64 162 -18 10 -17 12 -93 -25 -4 57 102 -61 -112 -41 16 -28 -214 26 53 57
5998 57 163 -31 -8 -25 -54 -136 57 50 -11 6 32 20 -13 -98 56 63 -265 -188 150 141 45 -10 -121 -121 -217 -109 82 -9
6026 -9 0 10 239 -72 141 -114 52 -109 39 -27 -53 57 -65 23 52 -91 -53 25 29 66 -62 -63 118 156 -39 89
6052 89 -93 -14 -35 -61 71 250 56 -11 43 -58 15 -37 -88 -110 -84 48 112 198 -15 3 61 -114 -75 -2 -178 -179
6078 -179 -112 -14 -59 -61 23 2 135 -129 -13 -124 124 63 79 242 15 -19 35 -111 27 -12 -99 121 55 83 -31
6103 -31 -89 -102 -48 20 1 229 139 32 -112 14 -213 -22 -159 -83 79 81 -100 106 113 -7 -122 -65 55 -146
6127 -146 61 43 -67 360 69 -157 -66 -60 1 -49 108 58 -88 -40 53 -61 -21 -24 95 138 -43 10 37 63 169
6152 169 -161 -15 9 -105 -8 2 -47 -84 -142 152 -8 87 -10 -88 109 -120 -5 175 -8 169 -78 77 89
6175 89 22 -124 -97 139 174 254 -5 123 -55 -198 -66 -119 -55 -28 139 -42 44 149 -36 2 -56 -65 -137 -39 141
6200 141 64 158 -49 101 -108 -11 -15 -48 60 -23 93 -62 117 9 19 10 88 -188 -85 2 118 -65 37 60
6224 60 -210 -148 109 -139 -15 -49 -99 -46 -33 63 44 130 -62 85 32 -14 13 79 -76 136 24 -83 -58 16 69
6249 69 -117 -91 6 0 30 152 225 166 -39 75 -80 -122 -147 104 85 -91 54 55 -9 -75 -121 -37 10 -53 -83 -80 40
6276 40 54 26 87 -58 201 -39 -37 71 134 141 107 -24 10 25 -113 83 -29 79 163 41 -42 129 -78 5 -48
6301 -48 29 53 103 123 -8 -66 -105 72 53 -169 61 -181 93 79 -36 253 102 115 -55 -15 -41 -38 43 56 126 201
6327 201 28 10 -66 15 -58 -14 -104 96 -31 -41 41 -68 -84 104 -12 -165 -17 96 -32 -40 17 -92 97 -45
6351 -45 -53 -98 75 -13 96 42 122 153 -75 143 -52 6 17 -70 123 116 -57 63 22 -82 -125 -66 -51 -35 89 201
6377 201 152 -4 -32 -36 22 81 10 166 -56 47 60 35 49 -70 -48 117 -257 -9 62 -21 -31 -54 58 20 57 -47
6403 -47 -9 -107 2 -48 -104 -22 6 22 49 55 -42 -222 -163 -6 -143 -7 128 46 -204 -87 -5 36 50 80 32 -20 105
6430 105 -68 -56 -96 -18 -115 35 -3 17 66 154 15 -22 -13 -44 -181 -229 -139 -6 172 70 -53 -95 -45 -19 -41 -82
6456 -82 -2 -22 13 -7 27 -137 -60 -68 -63 -63 -22 223 20 -12 -15 126 -29 -25 62 -81 -65 -106 122 118 16 -50 -69 -204 -59
6485 -59 -128 -24 98 -12 -3 106 70 -4 34 -122 -50 20 -104 90 269 20 -63 1 -152 -116 -55 -87 -97 -7 118
6510 118 -68 117 -8 -77 54 52 -235 -55 -86 46 53 113 -8 81 39 70 48 -66 20 56 144 14 17 37 54 -91
6536 -91 31 -160 34 58 -58 94 201 -127 49 -13 -79 -33 80 47 -38 -56 -3 58 1 84 -17 -20 -14 69 -26 6
6562 6 -50 128 41 72 -44 -14 21 74 38 103 65 131 -15 -173 -93 -136 -120 48 -70 -16 -56 155 71 -52 -97 -116 -9
6589 -9 -45 -220 -10 -72 -16 36 62 -41 -44 -35 -132 -20 -156 38 -120 32 71 35 61 -143 -51 -130 -26 -55 56 -6
6615 -6 -83 45 -37 -42 -51 -1 19 143 132 246 189 -5 -5 -110 -47 -77 -37 65 -55 -53 0 -43 -5 -248 -109 135 -32
6642 -32 27 -36 121 210 29 -305 40 -103 -92 -38 257 84 82 31 100 -48 -117 32 -15 -71 -29 21 111 125 -62 16
6668 16 -127 -82 -70 -112 -193 -68 7 122 -67 13 -3 2 -147 116 16 -18 -18 19 -13 -59 -16 -11 18 131 -28 -9 125
6695 125 18 76 -102 -86 -137 67 -102 0 -26 -267 125 58 -90 -118 75 86 70 46 -121 167 56 146 3
6718 3 24 -200 84 96 22 13 95 38 270 -36 -11 -35 -76 -39 -101 -3 -26 -10 37 9 126 -1 29 4 -132 -16 23
6745 23 -25 72 51 -52 -59 14 -4 9 137 -73 -23 -14 -68 -63 52 2 0 -94 -92 119 120 -7 31 -67 126 128 5 -126 -1
6774 -1 202 64 -34 161 34 40 8 42 -53 -124 -51 -16 -54 171 129 286 208 -12 -28 -256 -178 63 11 89 86 27 123
6801 123 -167 -25 26 103 -135 126 -37 94 64 -3 -141 -206 -122 -108 66 -1 58 10 -38 39 -42 -125 -143 -199 -79
6826 -79 -40 116 70 113 10 20 53 -88 -41 -74 -34 116 80 -24 -97 -71 101 12 -1 -62 -58 -51 -125 -49 125 30 -70
6853 -70 -105 -131 38 -52 -8 103 23 -24 -60 68 -49 4 -43 46 -47 -9 58 -74 -53 80 -108 -115 20 -85 15 -47
6879 -47 -50 86 -34 22 -67 -36 -78 33 139 12 8 -173 75 76 34 42 -40 77 -37 82 164 42 -4 61 -19 50 28
6906 28 -152 -68 -121 -43 -4 82 30 101 -51 -24 -34 -22 -82 -82 77 -40 32 -89 -144 35 -81 -101 101 -23 -44 85
6932 85 68 -46 -96 -11 -40 -43 -10 -132 -119 82 129 45 116 -9 33 -88 21 -32 -18 99 129 95 136 -135 18 -61
6958 -61 98 -80 32 152 -6 100 9 -82 35 -16 -160 -78 -176 309 12 129 -33 56 -73 86 -133 13
6980 13 -51 -19 44 74 9 -33 57 -55 45 29 118 20 -43 106 54 191 8 -35 69 -94 132 79 -127 29 122
7005 122 129 2 -138 144 -12 -174 30 38 -74 -26 -105 -105 -12 -12 31 -156 49 -29 -111 13 -4 194 -89 -188 22
7030 22 -77 -66 97 138 0 140 -1 54 -44 38 -97 -40 46 49 -107 85 37 -192 59 52 119 5 44 -114 143
7055 143 70 -67 115 -14 -31 31 29 130 9 4 85 124 27 -84 73 1 127 27 54 135 -165 -21 -121 -153 -105
7080 -105 -4 52 -75 -142 73 27 45 64 11 -77 95 18 -115 -53 19 -72 75 18 -28 71 -97 -105 -106 -45 33 4 27
7107 27 -95 17 -114 -151 -130 -73 -72 -30 93 -119 -79 121 35 132 -20 -129 97 165 160 178 5 -12 -39 -39 -47 -101 -40
7134 -40 -49 -27 -13 -116 -208 -211 -85 16 31 21 90 84 -77 -18 60 -135 6 107 -113 47 -29 87 21 8 31 -6 159
7161 159 -61 49 -56 94 -4 32 104 17 104 -112 -54 63 -155 -125 32 143 -139 -106 90 -256 -141 -41 54
7184 54 58 34 97 148 93 -2 1 131 -87 3 -73 47 50 31 145 -12 27 -73 -17 -66 79 -79 -44 63 40 -49 -7
7211 -7 75 44 -53 15 8 -64 -94 -111 55 86 20 133 -161 115 64 -54 -81 -58 55 63 -28 15 -42 34 99 -108 -81 6
7239 6 208 41 -98 14 17 -152 -58 46 2 138 -26 103 -58 -145 22 -28 -169 -333 209 -109 77 120 33
7262 33 142 5 78 -64 13 -17 126 41 -14 5 75 -2 -66 -170 64 5 -23 -108 -66 80 150 72 -88 -76 -6 -55
7288 -55 -160 95 97 150 7 -4 -189 70 81 -180 -11 -36 -76 27 83 9 125 15 -10 82 0 52 82 -27 -103
7313 -103 33 78 -9 53 135 -146 -127 131 88 18 -39 27 17 -78 -15 44 -8 39 35 48 26 190 -80 -101 33 -123 -103
7340 -103 82 75 70 -87 -2 77 38 -43 76 -107 18 34 -66 -84 -125 -101 -85 74 99 16 3 -58 199 106 -3 -52
7366 -52 42 3 56 -107 -54 14 -41 -126 -14 85 -33 2 -124 17 -157 33 -47 11 90 -134 -109 -48 -19 -89 58 -101
7392 -101 -20 202 71 -35 -154 103 104 83 -9 -151 33 2 -95 -65 34 75 -98 -79 -195 -91 104 58 -69 93
7416 93 35 44 -168 -38 -38 -1 11 -55 111 -42 70 -259 -12 -146 -8 -102 -118 168 12 135 -33 22 -53 -87 -20
7441 -20 -39 126 -97 -114 190 5 36 -6 27 32 7 197 86 -89 -7 -164 -6 -98 -72 14 -84 120 -40 -56 154
7466 154 55 -8 -51 -148 -107 -128 -2 -8 -35 87 -15 140 -107 -27 64 -107 -64 -17 86 -47 172 100 -134 -39 -102
7491 -102 -155 -71 143 101 -74 52 122 24 31 -103 20 52 -141 46 89 -36 14 -41 52 108 6 9 -181 -23 30
7516 30 -31 112 75 -80 -3 -105 120 -76 -100 -127 81 78 87 0 84 -171 -61 -52 -16 14 118 -88 -3 221 116 35
7542 35 -126 -92 78 173 -32 200 59 -72 13 134 7 33 80 -49 -55 -37 -48 -60 -13 10 68 -28 -14 -12 -6 202 -17
7569 -17 125 10 -52 2 84 56 -67 -57 54 -66 179 163 12 -103 141 124 19 31 -32 83 131 37 -42 18 8
7594 8 -58 -180 196 237 63 150 119 -5 -83 -47 24 -93 169 93 161 45 17 89 -96 -5 -182 -82 58 50 -17 -31
7620 -31 -62 142 -88 5 108 -16 -121 -53 57 55 177 220 105 -76 -99 3 36 -4 -115 108 -36 -21 94 -64
7644 -64 23 112 33 -4 -41 -30 169 53 -30 63 -58 -14 -98 -40 12 34 126 49 -68 -49 -48 -103 9 43 36 50 55 68 294
7673 294 122 -81 -61 -100 -53 -18 12 -22 2 138 155 -12 78 -8 12 22 95 100 2 128 26 -84 4 -72 44 -41
7699 -41 -38 -78 50 110 -51 -108 -108 -16 47 3 17 -82 23 82 80 160 -123 -61 -78 -61 123 71 63 106 14 -38 -87 65 -39
7728 -39 -21 -23 143 -84 39 115 -51 -60 -54 12 21 8 -4 -123 119 4 34 115 69 -116 30 195 -13 -58 -25 17 -15
7755 -15 1 -26 95 1 -31 -43 -83 54 125 13 -9 -122 -31 -38 -34 -132 -280 67 -43 -142 -102 -59 -50 11 -96 -123 28
7782 28 25 2 54 41 42 174 11 110 -161 79 -26 39 34 -14 -99 -101 55 7 -75 -64 72 -2 16 -56 -54 -72 -130 -102 90
7811 90 82 49 -22 65 -160 97 -81 -107 -107 -148 97 69 48 46 63 -75 186 -177 -107 -70 48 -60 39 -93 -8 35 -8
7838 -8 44 -137 -231 -85 78 -80 95 -63 170 75 137 -5 98 40 -151 -109 43 -12 6 -193 -108 -3 -7 -196
7862 -196 -129 188 -44 -46 -17 37 22 -4 -29 -68 -95 104 63 194 55 9 -136 -72 4 -185 -21 13 -55 48 46 74
7888 74 83 -48 -82 -56 56 -58 -13 -69 -29 -130 48 -72 -136 -52 -190 -14 -70 24 166 -58 -75 -43 -34 -28 107 -194
7914 -194 -131 -123 129 -16 206 68 96 101 -10 61 132 -85 87 165 200 62 -7 -43 11 57 2 -185 -68 89 60
7939 60 -13 86 10 50 -29 18 -29 -8 -147 -10 22 -48 -95 -70 42 1 -42 66 -58 -98 86 -133 -34 67 23 -112
7965 -112 -25 -76 143 112 55 -11 135 57 -5 141 31 27 55 3 41 -140 -174 -124 109 -149 -79 -37 151 68 80 52
7991 52 -128 -118 66 -81 32 138 -41 201 122 24 -44 -45 -101 -13 49 -277 -50 -74 134 157 258 -129 -4 90
8015 90 -64 -75 -173 270 122 -33 181 98 31 -44 -76 55 70 107 -58 13 -24 -55 7 -22 15 -124 40 -40 110
8040 110 -37 -23 21 191 43 -1 83 -100 19 -15 -95 41 64 51 14 52 -84 5 0 45 11 -2 -27 174 49 -74
8066 -74 -89 2 -35 78 -97 18 -42 -78 -80 54 -121 -127 27 -140 86 2 -44 -24 51 -39 -23 61 -10 -79 34 90 100
8093 100 104 -150 -53 -50 -61 -118 18 -65 -88 -168 12 -24 -107 176 -35 -63 101 18 -87 81 0 -146 100 -180 -70
8118 -70 -34 35 -40 -60 -18 -94 232 49 -5 92 -78 65 10 57 5 28 -36 72 67 -67 13 3 -81 -44 81 -2 72
8145 72 135 26 -115 -4 -1 4 -14 -6 107 83 9 -28 114 -42 -67 -29 86 23 169 27 67 -75 -59 -28 66 -57
8171 -57 -83 39 93 -64 73 252 36 54 67 7 -15 4 -5 -2 -41 95 61 -35 56 -69
8191f9
##END NTUPLES=NMR FID
##END=
